##TITLE=coffee_type TORI02
COFFEE_meoh_noesyp64 COFFEE_meoh {C:\Bruker\TOPSPIN} Administrator 10
##JCAMPDX= 6.0         $$ Bruker NMR JCAMP-DX V2.0
##DATA TYPE= NMR SPECTRUM
##DATA CLASS= NTUPLES
##ORIGIN= Bruker BioSpin GmbH
##OWNER= Administrator
$$ 1.72 TOPSPIN		Version 2.1
$$ 2012-05-18 15:45:15.261 -0700  Administrator@X
$$ Compression mode = diff/dup
##.OBSERVE FREQUENCY= 400.13188235
##.OBSERVE NUCLEUS= ^1H
##.ACQUISITION MODE= SIMULTANEOUS (DQD)
##.ACQUISITION SCHEME= undefined
##.AVERAGES= 64
##.DIGITISER RES= 22
##SPECTROMETER/DATA SYSTEM= spect
##.PULSE SEQUENCE= noesygpps1d.comp
##.SOLVENT NAME= COFFEE_meoh
##.SHIFT REFERENCE= INTERNAL, COFFEE_meoh, 1, 14.98061
##AUDIT TRAIL= $$ (NUMBER, WHEN, WHO, WHERE, PROCESS, VERSION, WHAT)
$$ ##TITLE= Audit trail, TOPSPIN		Version 2.1
$$ ##JCAMPDX= 5.01
$$ ##ORIGIN= Bruker BioSpin GmbH
$$ ##OWNER= Administrator
$$ $$ C:\Bruker\TOPSPIN/data/Administrator/nmr/12-COFFEE-2302/112/pdata/1/auditp.txt
$$ ##AUDIT TRAIL=  $$ (NUMBER, WHEN, WHO, WHERE, PROCESS, VERSION, WHAT)
(   1,<2012-02-23 22:46:09.703 -0500>,<Administrator>,<TOPSPIN>,<go>,<TOPSPIN 2.1>,
      <created by zg
	started at 2012-02-23 22:34:39.437 -0500,
	POWCHK enabled, PULCHK disabled,
       configuration hash MD5:
       B0 76 FB 9C 50 81 44 7D 18 B3 26 32 4E 60 AD 96
       data hash MD5: 64K
       07 39 31 34 E3 CD 4F F1 03 47 26 7C 50 4A 33 A4>)
(   2,<2012-02-23 22:46:12.453 -0500>,<Administrator>,<TOPSPIN>,<proc1d>,<TOPSPIN 2.1>,
      <Start of raw data processing
       efp LB = 0.3 FT_mod = 6 PKNL = 1 PHC0 = 0 PHC1 = 0 SI = 128K 
       data hash MD5: 128K
       74 C4 8F 79 9F 6E CA 17 3A 43 93 0A 5E 7F AA B4>)
(   3,<2012-02-23 22:46:13.781 -0500>,<Administrator>,<TOPSPIN>,<proc1d>,<TOPSPIN 2.1>,
      <pk PHC0 = 23.97217 PHC1 = 0 
       data hash MD5: 128K
       EF 26 EB 7D BF 7B BA 0E 2B 40 1A 04 BE 64 D2 79>)
(   4,<2012-02-23 22:46:14.047 -0500>,<Administrator>,<TOPSPIN>,<proc1d>,<TOPSPIN 2.1>,
      <abs ABSG = 1 
       data hash MD5: 128K
       C8 50 42 07 D0 0A FA D5 98 B8 0A B8 03 BA B9 F9>)
(   5,<2012-02-23 22:46:14.125 -0500>,<Administrator>,<TOPSPIN>,<proc1d>,<TOPSPIN 2.1>,
      <abs ABSG = 2 
       data hash MD5: 128K
       EC 80 96 1E 66 51 C7 14 5F 75 09 0B 1A 54 C8 3F>)
(   6,<2012-02-23 22:46:14.187 -0500>,<Administrator>,<TOPSPIN>,<proc1d>,<TOPSPIN 2.1>,
      <abs ABSG = 3 
       data hash MD5: 128K
       07 AB D3 E1 26 FC B8 27 4D 25 1A EE D3 A7 3E 82>)
(   7,<2012-02-23 22:46:14.266 -0500>,<Administrator>,<TOPSPIN>,<proc1d>,<TOPSPIN 2.1>,
      <abs ABSG = 4 
       data hash MD5: 128K
       1F 27 B8 2D 93 E3 7E BA F1 BA 9E 8E 4D DB CF E1>)
(   8,<2012-02-23 22:46:14.422 -0500>,<Administrator>,<TOPSPIN>,<proc1d>,<TOPSPIN 2.1>,
      <abs ABSG = 5 
       data hash MD5: 128K
       52 E3 5C 52 57 C6 93 A5 6D 2B 39 2B D1 D1 4E 7F>)
(   9,<2012-02-23 22:46:14.625 -0500>,<Administrator>,<TOPSPIN>,<audit>,<TOPSPIN 2.1>,
      <user comment:
       ICON-NMR User ID: Administrator
$$ [...]
150 150 150 150 150 150 150 150
##$TP07= 0
##$TPNAME0= <>
##$TPNAME1= <>
##$TPNAME2= <>
##$TPNAME3= <>
##$TPNAME4= <>
##$TPNAME5= <>
##$TPNAME6= <>
##$TPNAME7= <>
##$TPOAL= (0..7)
0.5 0.5 0.5 0.5 0.5 0.5 0.5 0.5
##$TPOFFS= (0..7)
0 0 0 0 0 0 0 0
##$TUNHIN= 0
##$TUNHOUT= 0
##$TUNXOUT= 0
##$USERA1= <user>
##$USERA2= <user>
##$USERA3= <user>
##$USERA4= <user>
##$USERA5= <user>
##$V9= 5
##$VALIST= <valist>
##$VCLIST= <CCCCCCCCCCCCCCC>
##$VD= 0
##$VDLIST= <DDDDDDDDDDDDDDD>
##$VPLIST= <PPPPPPPPPPPPPPP>
##$VTLIST= <TTTTTTTTTTTTTTT>
##$WBST= 1024
##$WBSW= 4
##$XGAIN= (0..3)
0 0 0 0
##$XL= 0
##$YL= 0
##$YMAX_a= 15552499
##$YMIN_a= -7398228
##$ZGOPTNS= <>
##$ZL1= 120
##$ZL2= 120
##$ZL3= 120
##$ZL4= 120
##$ABSF1= 14.98061
##$ABSF2= -5.57192
##$ABSG= 5
##$ABSL= 3
##$ALPHA= 0
##$AQORDER= 0
##$ASSFAC= 0
##$ASSFACI= 0
##$ASSFACX= 0
##$ASSWID= 0
##$AUNMP= <proc_prof1d_extract>
##$AXLEFT= 0
##$AXNAME= <>
##$AXNUC= <1H>
##$AXRIGHT= 0
##$AXTYPE= 0
##$AXUNIT= <>
##$AZFE= 0.1
##$AZFW= 0.1
##$BCFW= 0
##$BC_mod= 0
##$BYTORDP= 0
##$COROFFS= 0
##$CY= 15
##$DATMOD= 1
##$DC= 0
##$DFILT= <>
##$DTYPP= 0
##$F1P= 0
##$F2P= 0
##$FCOR= 0.5
##$FTSIZE= 131072
##$FT_mod= 6
##$GAMMA= 0
##$GB= 0
##$INTBC= 1
##$INTSCL= 1
##$ISEN= 128
##$LB= 0.3
##$LEV0= 0
##$LPBIN= 0
##$MAXI= 10000
##$MC2= 0
##$MEAN= 0
##$ME_mod= 0
##$MI= 0
##$NCOEF= 0
##$NC_proc= -3
##$NLEV= 6
##$NOISF1= 0
##$NOISF2= 0
##$NSP= 0
##$NTH_PI= 0
##$NZP= 0
##$OFFSET= 14.98061
##$PC= 1
##$PHC0= 23.97217
##$PHC1= 0
##$PH_mod= 1
##$PKNL= yes
##$PPARMOD= 0
##$PPDIAG= 0
##$PPIPTYP= 0
##$PPMPNUM= 2147483647
##$PPRESOL= 1
##$PSCAL= 4
##$PSIGN= 0
##$PYNMP= <proc.py>
##$REVERSE= no
##$SF= 400.13
##$SI= 131072
##$SIGF1= 0
##$SIGF2= 0
##$SINO= 400
##$SIOLD= 131072
##$SPECTYP= <>
##$SREGLST= <1H.CDCl3>
##$SSB= 0
##$STSI= 131072
##$STSR= 0
##$SW_p= 8223.68421052632
##$SYMM= 0
##$S_DEV= 0
##$TDeff= 65536
##$TDoff= 0
##$TI= <>
##$TILT= no
##$TM1= 0
##$TM2= 0
##$TOPLEV= 0
##$USERP1= <user>
##$USERP2= <user>
##$USERP3= <user>
##$USERP4= <user>
##$USERP5= <user>
##$WDW= 1
##$XDIM= 131072
##$YMAX_p= 478907090
##$YMIN_p= -333621366
##$CURPLOT= <Network HP LaserJet P1505>
##$CURPRIN= <$Network HP LaserJet P1505>
##$DFORMAT= <normdp>
##$LAYOUT= <+/1D_H.xwp>
##$LFORMAT= <normlp>
##$PFORMAT= <normpl>
##$SURQMSG= 1
$$ End of Bruker specific parameters
$$ ---------------------------------
##NTUPLES= NMR SPECTRUM
##VAR_NAME=  FREQUENCY,     SPECTRUM/REAL,   SPECTRUM/IMAG
##SYMBOL=    X,             R,               I
##VAR_TYPE=  INDEPENDENT,   DEPENDENT,       DEPENDENT
##VAR_FORM=  AFFN,          ASDF,            ASDF
##VAR_DIM=   131072,        131072,          131072
##UNITS=     HZ,            ARBITRARY UNITS, ARBITRARY UNITS
##FACTOR=    0.0627417313425165, 1,          1
##FIRST=     8223.62146879498, 3138,         -103598
##LAST=      0,             7840,            -104204
##MIN=       0,             -333621366,      0
##MAX=       8223.62146879498, 478907090,    0
$$ Real data points
##PAGE= N=1
##DATA TABLE= (X++(R..R)), XYDATA
$$ [...]
62895B026587m7953m3530m0691l9279l8193l6030l2298k7918k4288k2004k0713
62884A653690j9802j8751j7289j5809j5306j6139j7091j6687j5335j4965j6276
62873A470240j7624j7268j5614j4195j3323j2142j0694j0357j1816j3704j4000
62862A319503j2374j0459r822j0234j0227r174q188q616j0103j1029j0727j0246
62850A198304j0546j1001j0377q502o196m202l081l298m391m751l615k629l756
62837A121959o140p054n876m832n314n839m916l763m334o022o490n019l172k507
62823A050681l162m500n712n922m912l584k792k113q81K36K05l81l8J180J871
62808A020176J837K394L828M698M227L411K952K133Q37O40K254L636K588J9j392
$$ y = [2026587, 1978634, 1935104, 1894413, 1855134, 1816941, 1780911, 1748613, 1720695, 1696407, 1674403, 1653690, 1633888, 1615137, 1597848, 1582039, 1566733, 1550594, 1533503, 1516816, 1501481, 1486516, 1470240, 1452616, 1435348, 1419734, 1405539, 1392216, 1380074, 1369380, 1359023, 1347207, 1333503, 1319503, 1307129, 1296670, 1286848, 1276614, 1266387, 1257213, 1249025, 1240409, 1230306, 1219277, 1208550, 1198304, 1187758, 1176757, 1166380, 1157878, 1151682, 1147480, 1144399, 1141101, 1136710, 1131959, 1128344, 1125715, 1121959, 1115819, 1108765, 1102889, 1098057, 1092743, 1086904, 1081988, 1078225, 1073891, 1067869, 1061379, 1056360, 1053188, 1050681, 1047519, 1043019, 1037307, 1031385, 1026473, 1022889, 1020097, 1017984, 1017103, 1017339, 1017544, 1017163, 1017125, 1018305, 1020176, 1022013, 1024407, 1028235, 1032933, 1037160, 1040571, 1043523, 1045656, 1046493, 1047133, 1049387, 1053023, 1055611, 1055630, 1054238]
62793A054238q09M49J378J877J434m85k674l047j517j74j85m94k10k09j161j730
62777A046681m59J586J900k19l024m759n270n067m139k429p71m31j750l716m987
62762A013146n142m726m332m042l769l595l400k752j773j532k609l589k362R75
62748I70498L839M375L646L774N100O587Q048J0177J2549J3544J2761J2098J3529
62735A080525J6787K0118K2574K4499K6277K7892K9704L2490L6254L9783M2080
62724A398983M3819M6743N1667N7558O2614O6001O8468P1578P6280Q2028Q7227
62713B112966R0689R2670R4196R5616R6270R5505R3259Q9297Q2618P2524N9950
62702C075560M6902L4331K1346O856q528k2811l4735m5040n5407o6347p6490q4059
$$ y = [1054238, 1053429, 1053878, 1055256, 1057133, 1058567, 1058082, 1055408, 1052361, 1050844, 1050670, 1050485, 1049991, 1049781, 1049572, 1048411, 1046681, 1046222, 1047808, 1049708, 1049489, 1046465, 1041706, 1036436, 1031369, 1027230, 1024801, 1024030, 1023599, 1021849, 1018133, 1013146, 1008004, 1003278, 998946, 994904, 991135, 987540, 984140, 981388, 979615, 978083, 975474, 971885, 969523, 970498, 974337, 978712, 982358, 986132, 991232, 997819, 1005867, 1016044, 1028593, 1042137, 1054898, 1066996, 1080525, 1097312, 1117430, 1140004, 1164503, 1190780, 1218672, 1248376, 1280866, 1317120, 1356903, 1398983, 1442802, 1489545, 1541212, 1598770, 1661384, 1727385, 1795853, 1867431, 1943711, 2025739, 2112966, 2203655, 2296325, 2390521, 2486137, 2582407, 2677912, 2771171, 2860468, 2943086, 3015610, 3075560, 3122462, 3156793, 3178139, 3184995, 3176467, 3153656, 3118921, 3073881, 3018474, 2952127, 2875637, 2791578]
62690B791578q8733r1725r4039r5294r4646r2400q9909q7861q5357q1129p5302
62679A815183o9485o5094o2035n9198n5918n2468m9056m5116m0190l5168l1668
62668A249787l0041k8884k6853k4130k1526j9077j6498j4282j3059j2144j0036
62657A033257o409k427R99M023O632Q035Q082Q275J0226J3719J7268K0184K3068
62644A144932K6450K9937L2915L5381L7824M0702M4324M8929N4507O0517O5969
62633A622387O9993P2499P4130P5477P6549P7199P7571P7418P5248O9220N9223
62622B426914M7238L5242K3524J1551l88j1366k1227l0834m0839n0826n9753o6852
62610B262384p2119p6100p9142q0792q0322p7969p5086p2606p0003o6350o1935
$$ y = [2791578, 2702845, 2611120, 2517081, 2421787, 2327141, 2234741, 2144832, 2056971, 1971614, 1890485, 1815183, 1745698, 1680604, 1618569, 1559371, 1503453, 1450985, 1401929, 1356813, 1316623, 1281455, 1249787, 1219746, 1190862, 1164009, 1139879, 1118353, 1099276, 1082778, 1068496, 1055437, 1043293, 1033257, 1026848, 1024421, 1025420, 1029443, 1036075, 1044110, 1052192, 1060467, 1070693, 1084412, 1101680, 1121864, 1144932, 1171382, 1201319, 1234234, 1269615, 1307439, 1348141, 1392465, 1441394, 1495901, 1556418, 1622387, 1692380, 1764879, 1839009, 1914486, 1991035, 2068234, 2145805, 2223223, 2298471, 2367691, 2426914, 2474152, 2509394, 2532918, 2544469, 2544081, 2532715, 2511488, 2480654, 2439815, 2388989, 2329236, 2262384, 2190265, 2114165, 2035023, 1954231, 1873909, 1795940, 1720854, 1648248, 1578245, 1511895, 1449960]
62599A449960n8078n5540n3769n1606m8243m3771l9302l6300l5034l3986l1523
62588I62808k8008k5293k4257k3844k2805k1341k0382j9857j8625j6040j2952
62577G29404j0923j0651j1414j1994j1803j0862r068o400l788k765l630m741m569
62564F26796l710l782m779n052l879k444j778j011J260M661P176P382N824M249
62550F30913M020N278P334R569J1853J4075J5662J6220J6380J7202J8691J9823
62538G87020K0342K1555K4677K9077L3005L5612L7512L9687M2589M6139M9759
62527A166974N2423N3324N2575N0851M8433M5175M1250L7115L2690K7233K0287
62516A628330J2148L274n970j4704k1593k6290l0134l4417l8416m0346m0114l9650
$$ y = [1449960, 1391882, 1336342, 1282573, 1230967, 1182724, 1138953, 1099651, 1063351, 1028317, 994331, 962808, 934800, 909507, 885250, 861406, 838601, 817260, 796878, 777021, 758396, 742356, 729404, 718481, 707830, 696416, 684422, 672619, 661757, 652689, 646289, 642501, 639736, 636106, 631365, 626796, 623086, 619304, 614525, 609473, 605594, 603150, 601372, 600361, 601621, 606282, 613458, 620840, 626664, 630913, 634933, 640211, 647545, 657114, 668967, 683042, 698704, 714924, 731304, 748506, 767197, 787020, 807362, 828917, 853594, 882671, 915676, 951288, 988800, 1028487, 1071076, 1117215, 1166974, 1219397, 1272721, 1325296, 1376147, 1424580, 1469755, 1511005, 1548120, 1580810, 1608043, 1628330, 1640478, 1643752, 1637782, 1623078, 1601485, 1575195, 1545061, 1510644, 1472228, 1431882, 1391768, 1352118]
62504A352118m0205m0688l9623l7486l5765l4466l2408k9744k8190k8269k8083
62493I77191k6032k3320k2188k2604k2604k1412k0288j9951j9143j6729j3738
62482G49182j1891j1059r651p234n174m457m256l383k137j651j825j179J096L875
62468F90256N543O069O821Q538J0392J1319J1591J2496J4733J7650J9964K0973
62456H36345K1135K1690K3609K6779L0286L3496L6474L9260M1369M2514M3256
62445A196213M4216M4913M4213M1915L9065L6471L3531K8990K2439J4707O931
62434A553604l24p008j3015j7985k1901k5527k9660l3833l6385l6318l4521l2754
62422A264373l1812l1288l0530k9073k6563k3298k0510j9138j8463j7049j4872
$$ y = [1352118, 1311913, 1271225, 1231602, 1194116, 1158351, 1123885, 1091477, 1061733, 1033543, 1005274, 977191, 951159, 927839, 905651, 883047, 860443, 839031, 818743, 798792, 779649, 762920, 749182, 737291, 726232, 716581, 709347, 704173, 699716, 695460, 692077, 689940, 688289, 686464, 685285, 686381, 690256, 695799, 701868, 708689, 717227, 727619, 738938, 750529, 763025, 777758, 795408, 815372, 836345, 857480, 879170, 902779, 929558, 959844, 993340, 1029814, 1069074, 1110443, 1152957, 1196213, 1240429, 1285342, 1329555, 1371470, 1410535, 1447006, 1480537, 1509527, 1531966, 1546673, 1553604, 1553280, 1546272, 1533257, 1515272, 1493371, 1467844, 1438184, 1404351, 1367966, 1331648, 1297127, 1264373, 1232561, 1201273, 1170743, 1141670, 1115107, 1091809, 1071299, 1052161, 1033698, 1016649, 1001777]
62411A001777j3182j2280j0931q501o094m706l561j500R53K357K623L115M535
62398I54605O034O628O552O769P749R108J0159J0570J0559J0451J0018Q617O163
62385A063982L519J438n21l265o635r398j0914j2018j3805j6088j7695j8043j7827
62372I42730j7935j8272j8054j7047j5853j4852j3583j1634r582q202p142n379
62360G85195k952j067k32O48K684N467P823R294J0049J0109R731J0013J1804J4137
62346H72703J5004J3768J1770J0342R392Q307P234O610O129N066L345J480l35
62333I70815k318m259n306m929l673k506j734r85j9R63J845K858M203N873Q135
62318I68963J1530J5906J9998K2770K4868K7841L2072L6490M0308M3927M7788
$$ y = [1001777, 988595, 976315, 965384, 956883, 950789, 946083, 942522, 941022, 941975, 944332, 946955, 950070, 954605, 960639, 967267, 973819, 980588, 988337, 997445, 1007604, 1018174, 1028733, 1039184, 1049202, 1057819, 1063982, 1067501, 1068939, 1068418, 1065153, 1058518, 1049120, 1038206, 1026188, 1012383, 996295, 978600, 960557, 942730, 924795, 906523, 888469, 871422, 855569, 840717, 827134, 815500, 805918, 797716, 790574, 785195, 782243, 781176, 780944, 781592, 784276, 789743, 797566, 806860, 816909, 827018, 836749, 846762, 858566, 872703, 887707, 901475, 913245, 923587, 932979, 941286, 948520, 955130, 961259, 966325, 969670, 971150, 970815, 968497, 964238, 958932, 954003, 950330, 947824, 946090, 945105, 945086, 946049, 947894, 950752, 954955, 960828, 968963, 980493, 996399, 1016397, 1039167, 1064035, 1091876, 1123948, 1160438, 1200746, 1244673, 1292461]
62307A292461N1427N4384N7101O0152O3190O5405O6568O6801O5795O3088N8750
62296A965122N3142M6348L8550L0465K2510J3985M237n618j3447j8770k3432k9153
62284B083939l5424m0452m3423m5021m6226m7324m8062m8157m7559m6432m4869
62273A590990m2610l9306l5288l1828l0180l0293l0600k9392k6505k3410k1510
62262A250068k0454j8666j5575j2553j1239j1545j1967j1496j0353r062p734o477
62250A102947n764n971o949q307r768j0981j1398j0741r475q515q330q392p552
62237I90804n124j625J642L715M513M491M251M598O196Q659J0578J0988J0465
62224A054151J0258J0888J2123J3797J5710J7235J7940J8377J9360K0709K1717
$$ y = [1292461, 1343888, 1398272, 1455373, 1515525, 1578715, 1644120, 1710688, 1777489, 1843284, 1906372, 1965122, 2018264, 2064612, 2103162, 2133627, 2156137, 2170122, 2174359, 2168741, 2155294, 2136524, 2113092, 2083939, 2048515, 2008063, 1964640, 1919619, 1873393, 1826069, 1778007, 1729850, 1682291, 1635859, 1590990, 1548380, 1509074, 1473786, 1441958, 1411778, 1381485, 1350885, 1321493, 1294988, 1271578, 1250068, 1229614, 1210948, 1195373, 1182820, 1171581, 1160036, 1148069, 1136573, 1126220, 1117158, 1109424, 1102947, 1097183, 1091212, 1084263, 1075956, 1066188, 1055207, 1043809, 1033068, 1023593, 1015078, 1006748, 998356, 990804, 985680, 984055, 985697, 989412, 993925, 998416, 1002667, 1007265, 1013461, 1022120, 1032698, 1043686, 1054151, 1064409, 1075297, 1087420, 1101217, 1116927, 1134162, 1152102, 1170479, 1189839, 1210548, 1232265]
62213A232265K2574K4137K6383K8426L0095L2208L5027L7756M0047M2728M6367
62202A598013N0278N3700N6875O0048O2367O2775O1313N8531N4319M8376M1245
62191B207840L3699K5474J5791M980n550j4890k3209l0772l7340m2701m6931m9894
62179B036497n1229n1082n0219m9245m8130m6602m4441m1400l7552l3748l0918
62168A551931k8765k6048k2497j9484j8147j7694j6440j4015j1519r769q418o912
62156A352223n380m301l871l961m131l499j211K452N971Q057Q924R606J0519J1398
62142A382796J2388J4158J6768J9337K1273K3147K5740K8718L1015L2421L3921
62131A641682L6264L8806M0170L9845L8598L7417L6365L4754L2169K8955K5778
$$ y = [1232265, 1254839, 1278976, 1305359, 1333785, 1363880, 1396088, 1431115, 1468871, 1508918, 1551646, 1598013, 1648291, 1701991, 1758866, 1818914, 1881281, 1944056, 2005369, 2063900, 2118219, 2166595, 2207840, 2241539, 2267013, 2282804, 2287784, 2282234, 2267344, 2244135, 2213363, 2176023, 2133322, 2086391, 2036497, 1985268, 1934186, 1883967, 1834722, 1786592, 1739990, 1695549, 1654149, 1616597, 1582849, 1551931, 1523166, 1497118, 1474621, 1455137, 1436990, 1419296, 1402856, 1388841, 1377322, 1367553, 1359135, 1352223, 1346843, 1342542, 1338671, 1334710, 1330579, 1327080, 1325869, 1328321, 1334292, 1342349, 1351273, 1360879, 1371398, 1382796, 1395184, 1409342, 1426110, 1445447, 1466720, 1489867, 1515607, 1544325, 1575340, 1607761, 1641682, 1677946, 1716752, 1756922, 1796767, 1835365, 1872782, 1909147, 1943901, 1976070, 2005025, 2030803]
62120B030803K3104K1322K0841K1599K2708K3190K3081K3360K4851K7567L0994
62109B293420L4409L6909L7934L7900L7563L6628L3840K8840K3080J8294J4714
62098B633531J1430P765L644q25n255q960j1707j4118j6694j8982k0287k0571
62086B538971j9963j8257j5773j3801j2986j2167j0246q364q382r757j0013q127
62074B391135n416k925j04L373O449Q231R165R989J0952J2694J6109K0549K3962
62061B504163K5811K8071L2001L5801L7197L6800L6972L8503M0525M2689M5183
62050B903716M7243M8023M8730N1502N6056N9571O0503O0513O1935O4939O8171
62039C530902P0785P2784P4478P6599Q0171Q5177Q9971R2946R4352R5609R7159
$$ y = [2030803, 2053907, 2075229, 2096070, 2117669, 2140377, 2163567, 2186648, 2210008, 2234859, 2262426, 2293420, 2327829, 2364738, 2402672, 2440572, 2478135, 2514763, 2548603, 2577443, 2600523, 2618817, 2633531, 2644961, 2652726, 2656370, 2655545, 2650290, 2641330, 2629623, 2615505, 2598811, 2579829, 2559542, 2538971, 2519008, 2500751, 2484978, 2471177, 2458191, 2446024, 2435778, 2427414, 2419032, 2409275, 2399262, 2391135, 2385719, 2382794, 2382690, 2386063, 2392512, 2400743, 2409908, 2419897, 2430849, 2443543, 2459652, 2480201, 2504163, 2529974, 2558045, 2590046, 2625847, 2663044, 2699844, 2736816, 2775319, 2815844, 2858533, 2903716, 2950959, 2998982, 3047712, 3099214, 3155270, 3214841, 3275344, 3335857, 3397792, 3462731, 3530902, 3601687, 3674471, 3748949, 3825548, 3905719, 3990896, 4080867, 4173813, 4268165, 4363774, 4460933]
62028D460933R8044R7539R6313R5599R5769R6237R6462R6478R6324R5508R3489
62017E518695R0509Q7351Q4308Q1059P7628P4767P3052P2262P2042P2442P3332
62006F377447P3924P3606P2689P1556O9679O6296O1751N7291N3783N1375M9886
61995G079283M8759M7053M4454M1886M0095L8177L4875L0940K8560K8337K8477
61984G490896K7361K5394K3621K1963J9827J7504J5826J4953J4312J3310J1476
61973G696443Q407M300K69k633m528o443r115j2332j5302j7333j8366j8991j9645
61960G584731j9781j8327j5262j2199j0845j1120j1192r238n024R8M634Q346J2119
61947G496940J6477K0667K3738K5932K8183L0449L1654L1259K9766K7444K3718
$$ y = [4460933, 4558977, 4656516, 4752829, 4848428, 4944197, 5040434, 5136896, 5233374, 5329698, 5425206, 5518695, 5609204, 5696555, 5780863, 5861922, 5939550, 6014317, 6087369, 6159631, 6231673, 6304115, 6377447, 6451371, 6524977, 6597666, 6669222, 6738901, 6805197, 6866948, 6924239, 6978022, 7029397, 7079283, 7128042, 7175095, 7219549, 7261435, 7301530, 7339707, 7374582, 7405522, 7434082, 7462419, 7490896, 7518257, 7543651, 7567272, 7589235, 7609062, 7626566, 7642392, 7657345, 7671657, 7684967, 7696443, 7704850, 7709150, 7709419, 7706786, 7702258, 7695815, 7686700, 7674368, 7659066, 7641733, 7623367, 7604376, 7584731, 7564950, 7546623, 7531361, 7519162, 7508317, 7497197, 7486005, 7476767, 7471743, 7471841, 7476475, 7484821, 7496940, 7513417, 7534084, 7557822, 7583754, 7611937, 7642386, 7674040, 7705299, 7735065, 7762509, 7786227]
61936G786227J8239J1593M364l479j1646j8948k4503k8851l3015l7154m0863m4103
61924G577861m6893m8714m9346m9877n1679n4581n7147n8709n9985o1612o3120
61913F976198o3796o3733o3520o3363o2949o1915o0250n8432n7236n6958n6804
61902F307242n5420n2224m7968m3821m0183l6578l2529k8288k4561k1484j8110
61891E906076j3267o943l54N436J0442J5143J9633K3878K8082L2180L5510L7875
61879F093691M0392M4252M8970N2972N5773N8321O1225O4060O6771P0322P5172
61868F731921Q0321Q4984R0218R7716J07559J18472J29998J43190J59158J78137
61858G921674K00125K25384K53919K85236L19076L55650L94788M35512M77016
$$ y = [7786227, 7804466, 7816059, 7820423, 7816944, 7805298, 7786350, 7761847, 7732996, 7699981, 7662827, 7621964, 7577861, 7530968, 7482254, 7432908, 7383031, 7331352, 7276771, 7219624, 7160915, 7100930, 7039318, 6976198, 6912402, 6848669, 6785149, 6721786, 6658837, 6596922, 6536672, 6478240, 6421004, 6364046, 6307242, 6251822, 6199598, 6151630, 6107809, 6067626, 6031048, 5998519, 5970231, 5945670, 5924186, 5906076, 5892809, 5885866, 5885512, 5890948, 5901390, 5916533, 5936166, 5960044, 5988126, 6020306, 6055816, 6093691, 6134083, 6178335, 6227305, 6280277, 6336050, 6394371, 6455596, 6519656, 6586427, 6656749, 6731921, 6812242, 6897226, 6987444, 7085160, 7192719, 7311191, 7441189, 7584379, 7743537, 7921674, 8121799, 8347183, 8601102, 8886338, 9205414, 9561064, 9955852, 10391364, 10868380]
61849A0868380N19621N64228O11196O60062P09659P57749Q00883Q35389Q58221
61840A7185388Q65968Q53001Q11800P36145O24402M80093L10054J22525p3262
61831B1916114k66491m45091n98208p19469q08080q66613q98339r06931q97465
61822A5509427q75499q44692q06554p62875p16939o71335o25951n79638n33093
61813I092851m88659m47573m09166l72823l39212l09030k81648k55784k30722
61804E958234k06350j82830j60913j41833j25826j11185r5810p9734o5253n4321
61794D734179m6411l9370l1807k4176j7680j2897r668p899p775r224j1533j3823
61782D501916j5624j6894j7685j7981j7651j6411j4042j0797p282l759O7M220
$$ y = [10868380, 11388001, 11952229, 12563425, 13223487, 13933146, 14690895, 15491778, 16327167, 17185388, 18051356, 18904357, 19716157, 20452302, 21076704, 21556797, 21866851, 21989376, 21916114, 21649623, 21204532, 20606324, 19886855, 19078775, 18212162, 17313823, 16406892, 15509427, 14633928, 13789236, 12982682, 12219807, 11502868, 10831533, 10205582, 9625944, 9092851, 8604192, 8156619, 7747453, 7374630, 7035418, 6726388, 6444740, 6188956, 5958234, 5751884, 5569054, 5408141, 5266308, 5140482, 5029297, 4933487, 4853753, 4788500, 4734179, 4687768, 4648398, 4616591, 4592415, 4574735, 4561838, 4552170, 4544271, 4536496, 4527272, 4515739, 4501916, 4486292, 4469398, 4451713, 4433732, 4416081, 4399670, 4385628, 4374831, 4367549, 4363790, 4363857, 4368077]
61770D368077P832R844R997Q694O214K710j140m332o480q116r829j1442j2039
61757D359990j0645p047k158K766P607J3649K1903L1763M2053N2766O4532P6751
61745D653930Q7872R7744J08310J21265J36098J51202J66085J81645J98715K17156
61735F120022K36298K55885K76613K99756L25928L54392L84258M16261M52501
61726I121914M94318N41387N93115O49849P12075P79369Q50968R26802J007248
61717A5677045J092185J180690J271209J361477J448420J528028J594647J640226
61709B6793927J654922J628622J551606J415091J214169R52031O40745K97480
61701C6148593n9051m09068p32441j012476j239163j408379j519916j578349j593934
$$ y = [4368077, 4375909, 4385753, 4395750, 4404444, 4410658, 4413368, 4412228, 4407896, 4401416, 4393300, 4383471, 4372029, 4359990, 4349345, 4342298, 4340140, 4342906, 4350513, 4364162, 4386065, 4417828, 4459881, 4512647, 4577179, 4653930, 4741802, 4839546, 4947856, 5069121, 5205219, 5356421, 5522506, 5704151, 5902866, 6120022, 6356320, 6612205, 6888818, 7188574, 7514502, 7868894, 8253152, 8669413, 9121914, 9616232, 10157619, 10750734, 11400583, 12112658, 12892027, 13742995, 14669797, 15677045, 16769230, 17949920, 19221129, 20582606, 22031026, 23559054, 25153701, 26793927, 28448849, 30077471, 31629077, 33044168, 34258337, 35210368, 35851113, 36148593, 36089542, 35680474, 34948033, 33935557, 32696394, 31288015, 29768099, 28189750, 26595816]
61692B6595816j578983j542351j488566j421369j345572j265389j183408j101830
61684A5668348j022757r46611q72252p99730p31503o69934o14743n63931n16147
61675H930740m71280m29689l92025l58974l30229l04171k79460k56425k36115
61666E872372k18431k02183j86783j73042j62061j53823j47023j40160j32723
61657D356143j25270j18389j11934j05598r9713r4737r0139q4799p8524p2365
61647C374675o7332o3648o1307o0282n9823n8605n6265n3905n2474n1355m9348
61636B740331m6483m4040m2945m2758m2202m0398l7686l5255l3800l2768l1403
61625B310593l0095k9654k9487k7925k4588k0967j8173j5522j2276r326p820p226
$$ y = [26595816, 25016833, 23474482, 21985916, 20564547, 19218975, 17953586, 16770178, 15668348, 14645591, 13698980, 12826728, 12026998, 11295495, 10625561, 10010818, 9446887, 8930740, 8459460, 8029771, 7637746, 7278772, 6948543, 6644372, 6364912, 6108487, 5872372, 5653941, 5451758, 5264975, 5091933, 4929872, 4776049, 4629026, 4488866, 4356143, 4230873, 4112484, 4000550, 3894952, 3795239, 3700502, 3610363, 3525564, 3447040, 3374675, 3307343, 3243695, 3182388, 3122106, 3062283, 3003678, 2947413, 2893508, 2841034, 2789679, 2740331, 2693848, 2649808, 2606863, 2564105, 2521903, 2481505, 2443819, 2408564, 2374764, 2341996, 2310593, 2280498, 2250844, 2221357, 2193432, 2168844, 2147877, 2129704, 2114182, 2101906, 2092580, 2084760, 2077534]
61613B077534o192m563l076j625M99K863L947L082J103j015l086n064o576p474
61599B050357q094q638q890q618p704n970l682k078k446m453o298o721o149n636
61585A964980n632o009o436o290m999k918j162j46R64K925N370P719J0225J3208
61571A971799J5904J7189J7156J6885J6715J5825J3672J0955Q638O626M016L95
61559B115775l478o367p683p985q359r320j0481j1369j2277j3865j6004j7550
61547A991037j7537j6332j5344j5618j6860j7872j7874j7225j6722j6361j5355
61536A807937j3469j1641j0699j0003q254n444k942j605r17j98N58J632M126Q322
61522A757403J2470J4717J5782J8145K2542K7060L0070L2449L5860M0135M3797
$$ y = [2077534, 2071342, 2066779, 2063703, 2062078, 2062577, 2065440, 2069387, 2072469, 2073572, 2072557, 2069471, 2064407, 2057831, 2050357, 2042263, 2033625, 2024735, 2016117, 2008413, 2002443, 1998761, 1996683, 1994237, 1989784, 1983486, 1976765, 1970616, 1964980, 1959348, 1953339, 1946903, 1940613, 1935614, 1932696, 1931534, 1931388, 1932352, 1935277, 1940647, 1948366, 1958591, 1971799, 1987703, 2004892, 2022048, 2038933, 2055648, 2071473, 2085145, 2096100, 2104738, 2111364, 2115380, 2115775, 2112297, 2105930, 2098247, 2090262, 2081903, 2072583, 2062102, 2050733, 2038456, 2024591, 2008587, 1991037, 1973500, 1957168, 1941824, 1926206, 1909346, 1891474, 1873600, 1856375, 1839653, 1823292, 1807937, 1794468, 1782827, 1772128, 1762125, 1753871, 1748427, 1745485, 1743880, 1742963, 1742765, 1743323, 1744955, 1749081, 1757403, 1769873, 1784590, 1800372, 1818517, 1841059, 1868119, 1898189, 1930638, 1966498, 2006633, 2050430]
61511B050430M6440M9146N2596N5963N8007N8420N7826N6993N6373N6001N5543
61500B653738N4521N2706N0256M7518M4729M1902L9020L6387L4484L3129L1160
61489C119550K7653K3363J9905J7428J4324R699M685M27l874r348j4917j8262
61477C190633j8907j8501j8142j7302j5624j3884j2466j0441p012k615K179P556
61465C065474J3417J8729K3023K7540L3694M1260M9231N7640O7122P7328Q7384
61454C561842R7601J09239J22577J36677J51228J67154J84829K02918K20106K37145
61444E191316K56018K76971K97374L14034L26228L35756L43784L48261L45052
61435H034794L31302L06922K72985K30242J79935J25047O9347J5395l5750q3142
$$ y = [2050430, 2096870, 2146016, 2198612, 2254575, 2312582, 2371002, 2428828, 2485821, 2542194, 2598195, 2653738, 2708259, 2760965, 2811221, 2858739, 2903468, 2945370, 2984390, 3020777, 3055261, 3088390, 3119550, 3147203, 3170566, 3190471, 3207899, 3222223, 3231922, 3236607, 3237034, 3233160, 3223812, 3208895, 3190633, 3171726, 3153225, 3135083, 3117781, 3102157, 3088273, 3075807, 3065366, 3058354, 3055739, 3057918, 3065474, 3078891, 3097620, 3120643, 3148183, 3181877, 3223137, 3272368, 3330008, 3397130, 3474458, 3561842, 3659443, 3768682, 3891259, 4027936, 4179164, 4346318, 4531147, 4734065, 4954171, 5191316, 5447334, 5724305, 6021679, 6335713, 6661941, 6997697, 7341481, 7689742, 8034794, 8366096, 8673018, 8946003, 9176245, 9356180, 9481227, 9550574, 9565969, 9530219, 9447077]
61425I447077j25095j59757j85952k03679k14266k19631k20779k17321k09031
61416G691566j97299j84126j70125j54631j37483j19499j01302q2941o4780m7542
61406F431838l1282j5473m04J2747K3697L3644M3521N2830O0970O8276P4664P8546
61394F833574P8820P7230P6856P8485Q0126Q0235P9657P9877Q0805Q1262Q0684
61383G707611P9400P7959P6953P6867P7222P6455P3473O8840O3543N7221M8922
61372H484466L9171K9608K0487J0240j837j4106k4729l3898m2551n0114n5288
61361H361449n8334o0628o2117o1261n7711n3194m9057m4469l8024k9942k1786
61350G824926j4833r507n477j684K719O714P907N615K352J033J684K317K138K287
$$ y = [9447077, 9321982, 9162225, 8976273, 8772594, 8558328, 8338697, 8117918, 7900597, 7691566, 7494267, 7310141, 7140016, 6985385, 6847902, 6728403, 6627101, 6544160, 6479380, 6431838, 6400556, 6385083, 6384679, 6397426, 6421123, 6454767, 6498288, 6551118, 6612088, 6680364, 6755028, 6833574, 6912394, 6989624, 7066480, 7144965, 7225091, 7305326, 7384983, 7464860, 7545665, 7626927, 7707611, 7787011, 7864970, 7941923, 8018790, 8096012, 8172467, 8245940, 8314780, 8378323, 8435544, 8484466, 8523637, 8553245, 8573732, 8583972, 8582135, 8568029, 8543300, 8509402, 8466851, 8416737, 8361449, 8303115, 8242487, 8180370, 8119109, 8061398, 8008204, 7959147, 7914678, 7876654, 7846712, 7824926, 7810093, 7800586, 7795109, 7793425, 7796144, 7802858, 7810765, 7816380, 7818732, 7819765, 7821449, 7823766, 7825904, 7828191]
61336G828191M013P787J3899K2361L2380M3422N6568P3334R3308J14631J36651
61325H426545J60283J85610K11091K35665K59783K83629L06096L26270L44206
61316A0739178L58945L67397L66739L56747L38293L10791K72982K25737J72178
61307A3508987J15093N5874l891o1365j13777j60142k01263k38373k71864l01010
61297A2328269l24747l42745l55411l62751l64180l59966l52079l42581l31662
61288I192147l18259l02294k85193k68213k51209k33297k13922j93198j71831
61279F954731j50868j31025j12094r3491p5314n8335m2990k8985j5932l795P457
61268F249359J8081K8106L6971M3785M8010N0034N1183N2791N4835N5871N4652
$$ y = [7828191, 7832204, 7839991, 7853890, 7876251, 7908631, 7952053, 8008621, 8081955, 8175263, 8289894, 8426545, 8586828, 8772438, 8983529, 9219194, 9478977, 9762606, 10068702, 10394972, 10739178, 11098123, 11465520, 11832259, 12189006, 12527299, 12838090, 13111072, 13336809, 13508987, 13624080, 13679954, 13676063, 13614698, 13500921, 13340779, 13139516, 12901143, 12629279, 12328269, 12003522, 11660777, 11305366, 10942615, 10578435, 10218469, 9866390, 9523809, 9192147, 8873888, 8571594, 8286401, 8018188, 7766979, 7533682, 7319760, 7126562, 6954731, 6803863, 6672838, 6560744, 6467253, 6391939, 6333604, 6290614, 6261629, 6245697, 6241902, 6249359, 6267440, 6295546, 6332517, 6376302, 6424312, 6474346, 6525529, 6578320, 6633155, 6689026, 6743678]
61257F743678N1574M7983M4602M1281L7918L4645L1248K7323K3020J8762J4160
61246G116194Q149N15p525j4720k1117k7610l4684m2050m9220n5943o2243o8175
61234F741571p3471p7438p9548q0080p9894p9549p8892p7382p4418o9634o3359
61223E907906n6643n0313m4153l7589l0896k4956k0164j6421j3941j2908j2527
61212E587395j1655j0386r727r654r079q047q125r798j1270j1043r944r115p465
61199E462087l148L583J1127J9480L0026M2723N5800O8487Q1708R5609J08523
61188E976005J19421J29351J39084J46746J49342J45607J35829J19779R6547O6328
61178G224039L1081o551m4146p9633j11813j40715j66509j88069k03510k12185
$$ y = [6743678, 6795252, 6843235, 6887837, 6929118, 6967036, 7001681, 7032929, 7060252, 7083272, 7102034, 7116194, 7124343, 7124858, 7117333, 7102613, 7081496, 7053886, 7019202, 6977152, 6927932, 6871989, 6809746, 6741571, 6668100, 6590662, 6511114, 6431034, 6351140, 6271591, 6192699, 6115317, 6040899, 5971265, 5907906, 5851263, 5800950, 5756797, 5719208, 5688312, 5663356, 5643192, 5626771, 5612830, 5599922, 5587395, 5575740, 5565354, 5555627, 5545973, 5536894, 5528847, 5520722, 5510924, 5499654, 5488611, 5478667, 5469552, 5462087, 5458939, 5462522, 5473649, 5493129, 5523155, 5565878, 5621678, 5690165, 5771873, 5867482, 5976005, 6095426, 6224777, 6363861, 6510607, 6659949, 6805556, 6941385, 7061164, 7157711, 7224039, 7255120, 7248569, 7204423, 7124790, 7012977, 6872262, 6705753, 6517684, 6314174, 6101989]
61168F101989k15178k13783k08567k00375j91131j82526j74262j64440j51836
61159D399891j37411j23482j11787j02368r4119q5947p7297o7986n8217m8923
61149C492354m1367l5792l0842k4866j7636j0182l392K476P020R644J0519J0628
61137C368564J0444R472P552N676M640L681J557j567m545p326j1154j6419k1618
61124C348957k5150k7305k9608l2818l6442l9997m3660m7500n0758n2465n2562
61113B910692n1993n1693n1721n1516n0758m9665m8468m7050m5425m4156m3783
61102B374464m3915m3532m2338m1170m0729m0363l8732l5588l2362l0904l1788
61091A953043l3957l5755l6337l6156l6193l6713l6805l5188l1455k6613k2387
$$ y = [6101989, 5886811, 5673028, 5464461, 5264086, 5072955, 4890429, 4716167, 4551727, 4399891, 4262480, 4138998, 4027211, 3924843, 3830724, 3744777, 3667480, 3599494, 3541277, 3492354, 3450987, 3415195, 3384353, 3359487, 3341851, 3331669, 3328277, 3330753, 3337773, 3347417, 3357936, 3368564, 3379008, 3388480, 3396032, 3401708, 3406348, 3410029, 3411586, 3410019, 3405474, 3398148, 3386994, 3370575, 3348957, 3323807, 3296502, 3266894, 3234076, 3197634, 3157637, 3113977, 3066477, 3015719, 2963254, 2910692, 2858699, 2807006, 2755285, 2703769, 2653011, 2603346, 2554878, 2507828, 2462403, 2418247, 2374464, 2330549, 2287017, 2244679, 2203509, 2162780, 2122417, 2083685, 2048097, 2015735, 1984831, 1953043, 1919086, 1883331, 1846994, 1810838, 1774645, 1737932, 1701127, 1665939, 1634484, 1607871, 1585484]
61080A585484j9810j8268j6159j2727r049o729n954n460m240k333J45L459P193
61067A495552R848J0601J0643J1644J3432J4450J4264J4070J4734J5673J6161
61056A641072J6550J7502J8880K0069K0715K0565J9174J6508J3358J0528P907
61045A822828M931J617j379l587n152o589q415j0701j2847j4059j4328j4502j5212
61032A722605j6230j7143j7976j8742j9104j9112j9475k0336k0533j9063j6753
61021A518138j5269j4919j4611j3790j2946j2204j0819q532o207m578l342k075
61009A398846j065n86j41P98K006L127M441O146P443P312N990M848M864N785O800
60994A456614P363P364P016O771P033P886R126J0468J1536J2016J2158J2897J4992
$$ y = [1585484, 1565674, 1547406, 1531247, 1518520, 1509471, 1502742, 1496788, 1491328, 1487088, 1484755, 1484900, 1488359, 1495552, 1505400, 1516001, 1526644, 1538288, 1551720, 1566170, 1580434, 1594504, 1609238, 1624911, 1641072, 1657622, 1675124, 1694004, 1714073, 1734788, 1755353, 1774527, 1791035, 1804393, 1814921, 1822828, 1827759, 1829376, 1827997, 1824410, 1819258, 1812669, 1804254, 1793553, 1780706, 1766647, 1752319, 1737817, 1722605, 1706375, 1689232, 1671256, 1652514, 1633410, 1614298, 1594823, 1574487, 1553954, 1534891, 1518138, 1502869, 1487950, 1473339, 1459549, 1446603, 1434399, 1423580, 1415048, 1408841, 1404263, 1400921, 1398846, 1397781, 1397195, 1397054, 1397852, 1399858, 1402985, 1407426, 1413572, 1421015, 1428327, 1434317, 1439165, 1444029, 1449814, 1456614, 1463977, 1471341, 1478357, 1485128, 1492161, 1500047, 1509173, 1519641, 1531177, 1543193, 1555351, 1568248, 1583240]
60981A583240J8094K1009K2863K3800K4587K5805K7438K9113L0574L1882L3048
60970A871453L3780L3916L3992L4840L6669L9005M1437M3777M5590M6575M7487
60959B308521M9650N3125N6580N9488O3155O8560P4459P9108Q3015Q8251R5539
60948C079451J03775J12284J21736J32551J43974J55360J67061J79499J92419
60939D388110K05679K19781K35002K50961K67685K86249L07622L31778L58801
60930F851668L90032M26983M69627N17007N69457O29127O98061P76685Q64784
60921A2193431R63536J075685J203595J347774J508104J686787J890094K127204
60913B3996210K405291K719305L037835L296615L415364L336538L057807K628964
$$ y = [1583240, 1601334, 1622343, 1645206, 1669006, 1693593, 1719398, 1746836, 1775949, 1806523, 1838405, 1871453, 1905233, 1939149, 1973141, 2007981, 2044650, 2083655, 2125092, 2168869, 2214459, 2261034, 2308521, 2358171, 2411296, 2467876, 2527364, 2590519, 2659079, 2733538, 2812646, 2895661, 2983912, 3079451, 3183226, 3295510, 3417246, 3549797, 3693771, 3849131, 4016192, 4195691, 4388110, 4593789, 4813570, 5048572, 5299533, 5567218, 5853467, 6161089, 6492867, 6851668, 7241700, 7668683, 8138310, 8655317, 9224774, 9853901, 10551962, 11328647, 12193431, 13156967, 14232652, 15436247, 16784021, 18292125, 19978912, 21869006, 23996210, 26401501, 29120806, 32158641, 35455256, 38870620, 42207158, 45264965, 47893929]
60905D7893929K118824J588674J094071O93827M33195L06146K39812J29037j03440
60896E4394075m72856r46321j477854k024559k536942k951021l205774l274672
60888C7504076l179955k976290k721555k458868k214553k001073j818685j659006
60880A8474091j512216j372860j240243j115691j000622q96112q02901p21433
60872I812013o51562n91816n39375m91821m48847m11385l79346l51356l26325
60863E620180l03879k83141k62773k42733k24688k09928j97765j86482j75034
60854C533757j63405j52271j42623j34773j27277j18030j06927r6342q8224q1951
60844B321934p5954p0354o6497o4458o2408n8587n2952m6735m0997l5860l0990
$$ y = [47893929, 50012753, 51601427, 52695498, 53389325, 53822520, 54128666, 54368478, 54497515, 54394075, 53921219, 52974898, 51497044, 49472485, 46935543, 43984522, 40778748, 37504076, 34324121, 31347831, 28626276, 26167408, 23952855, 21951782, 20133097, 18474091, 16961875, 15589015, 14348772, 13233081, 12232459, 11336347, 10533446, 9812013, 9160451, 8568635, 8029260, 7537439, 7088592, 6677207, 6297861, 5946505, 5620180, 5316301, 5033160, 4770387, 4527654, 4302966, 4093038, 3895273, 3708791, 3533757, 3370352, 3218081, 3075458, 2940685, 2813408, 2695378, 2588451, 2492109, 2403885, 2321934, 2245980, 2175626, 2109129, 2044671, 1982263, 1923676, 1870724, 1823989, 1782992, 1747132, 1716142]
60833A716142k6589k3525k2070k0969j8624j5130j2002r925q099o160n116n553
60821A542380o308o142n590n861o789p403p876r301j1742j3910j4839j4741j4170
60808A417708j3350j2503j2007j2007j2284j2355j1417q777n052k307j949k852
60796A310848k607m55K142L648M038M278N308P658J1100J4515J6872J8476K0443
60783A416264K3040K5416K6933K7708K7833K7098K5807K4760K4063K2885K0784
60772A692591J8478J6884J6063J5521J4814J3493J1202Q303N730L842J993k48
60760A818666k230l163l407m095n631p256q134q419r030j0392j1833j2650j3587
60747A718839j6220k0408k3412k2806j9501j6487j5068j4115j2862j2244j2743
$$ y = [1716142, 1689553, 1666028, 1643958, 1622989, 1604365, 1589235, 1577233, 1567308, 1559209, 1553049, 1547933, 1542380, 1536072, 1529930, 1524340, 1518479, 1511690, 1504287, 1496411, 1487110, 1475368, 1461458, 1446619, 1431878, 1417708, 1404358, 1391855, 1379848, 1367841, 1355557, 1343202, 1331785, 1323008, 1317956, 1315649, 1313700, 1310848, 1308241, 1307786, 1309928, 1313576, 1317614, 1321892, 1327200, 1334858, 1345958, 1360473, 1377345, 1395821, 1416264, 1439304, 1464720, 1491653, 1519361, 1547194, 1574292, 1600099, 1624859, 1648922, 1671807, 1692591, 1711069, 1727953, 1744016, 1759537, 1774351, 1787844, 1799046, 1807349, 1813079, 1816921, 1818914, 1818666, 1816436, 1813273, 1809866, 1805771, 1800140, 1792884, 1784750, 1776331, 1767301, 1756909, 1745076, 1732426, 1718839, 1702619, 1682211, 1658799, 1635993, 1616492, 1600005, 1584937, 1570822, 1557960, 1545716, 1532973]
60736A532973j2880j1132q029n056k559m1K327M015N435P483R981J1674J1947
60723A546138J1603J1863J3119J4623J5064J3670J1099Q957Q149Q359R216J0916
60711A682776J2967J3657J2108R995R550J0411J0356Q954Q369J0026J2395J3315
60699A814879J3061J3527J5108J6105J5287J3527J2319J1682J0522Q602P024O495
60687A958138O199N065L509K757K813K416J162J96J24m09k790o052p975q166q453
60672A948534j0147j2319j3423j3405j3480j4324j5293j5313j4141j2652j1913
60661A802124j2156j2868j3811j5235j6863j7511j6567j5133j4726j5272j5525
60650A636457j5077j4645j4438j3726j2205j0570r207p478m915k130N5J635L014
$$ y = [1532973, 1520093, 1508961, 1500932, 1495876, 1493317, 1493276, 1495603, 1499618, 1505053, 1512536, 1522517, 1534191, 1546138, 1557741, 1569604, 1582723, 1597346, 1612410, 1626080, 1637179, 1646136, 1654285, 1662644, 1671860, 1682776, 1695743, 1709400, 1721508, 1731503, 1741053, 1751464, 1761820, 1770774, 1779143, 1789169, 1801564, 1814879, 1827940, 1841467, 1856575, 1872680, 1887967, 1901494, 1913813, 1925495, 1936017, 1944619, 1951643, 1958138, 1964337, 1969402, 1972911, 1975668, 1978481, 1980897, 1982059, 1982255, 1982379, 1981970, 1979180, 1973128, 1965153, 1956987, 1948534, 1938387, 1926068, 1912645, 1899240, 1885760, 1871436, 1856143, 1840830, 1826689, 1814037, 1802124, 1789968, 1777100, 1763289, 1748054, 1731191, 1713680, 1697113, 1681980, 1667254, 1651982, 1636457, 1621380, 1606735, 1592297, 1578571, 1566366, 1555796, 1546589, 1539111, 1534196, 1532066, 1532121, 1533756, 1536770]
60637A536770M287N417O338O419M649J062k745n247o587p910r701j1587j3266
60624A507899j4816j6296j7718j9117k0269k0663k0197j9386j8438j6799j4256
60613A309944j1749j0208r210p749n865m299k952j013J458L329L984M032M178
60600A273880M442M782N527O633P401P430P222P302P404P125O838P169P918Q138
60586A369211P313N974N182N606P037Q593R511R925J0679J2358J4719J6952J8186
60573A501246J7747J5766J3818J4172J7619K2241K5005K4585K2281K0280J9525
60562A714285J9279J8300J6200J3750J1928J0726R185O565L120m39l683o318p801
60549A805097p900p423p651q905j0237j0578r747q299o998o616p610r547j1172
$$ y = [1536770, 1541057, 1546474, 1552812, 1559231, 1563880, 1564942, 1562197, 1556950, 1550363, 1542453, 1532752, 1521165, 1507899, 1493083, 1476787, 1459069, 1439952, 1419683, 1399020, 1378823, 1359437, 1340999, 1324200, 1309944, 1298195, 1287987, 1278777, 1271028, 1265163, 1260864, 1257912, 1256899, 1258357, 1261686, 1265670, 1269702, 1273880, 1278322, 1283104, 1288631, 1295264, 1302665, 1310095, 1317317, 1324619, 1332023, 1339148, 1345986, 1353155, 1361073, 1369211, 1376524, 1382498, 1387680, 1393286, 1400323, 1408916, 1418427, 1428352, 1439031, 1451389, 1466108, 1483060, 1501246, 1518993, 1534759, 1548577, 1562749, 1580368, 1602609, 1627614, 1652199, 1674480, 1694760, 1714285, 1733564, 1751864, 1768064, 1781814, 1793742, 1804468, 1813653, 1820218, 1823338, 1822899, 1819216, 1812898, 1805097, 1797197, 1789774, 1782123, 1773218, 1762981, 1752403, 1742656, 1734357, 1727359, 1720743, 1713133, 1703586, 1692414]
60536A692414j1445j0437r070q190q003q045p546o113m188k508j058P67K761L562
60522A622901K422O31R2R15J638J730K290L872N022M085J591m02r41r10j259j743
60506A641934j847k049l396o148r291j1354j1605j0616r633r206q527o581l772
60493A547909j625p21J56K296N278P740R437J1498J4690J8347K1318K3314K5007
60480A684644K7280L0732L5455M0900M5968M9568N1258N1312N0190M7743M3005
60469B158055L5147K4896J4539N982q21o891j2129j5275j5888j4949j3109r599
60457B149958l860K757Q139J1809J5016J8813K3092K7387L1438L4915L7636M0289
60445B397389M4004M8995N4471O0114O6705P4994Q4873R6095J08797J22868J37770
$$ y = [1692414, 1680969, 1670532, 1661462, 1653272, 1645269, 1637224, 1629678, 1623565, 1619377, 1616869, 1615811, 1616578, 1619339, 1622901, 1625323, 1625954, 1626046, 1626961, 1628599, 1630329, 1632619, 1636491, 1641513, 1645598, 1647189, 1646787, 1645846, 1644936, 1643677, 1641934, 1640087, 1638038, 1634642, 1628494, 1619203, 1607849, 1596244, 1585628, 1575995, 1566789, 1558262, 1551681, 1547909, 1546284, 1545563, 1545719, 1548015, 1553293, 1561033, 1570470, 1581968, 1596658, 1615005, 1636323, 1659637, 1684644, 1711924, 1742656, 1778111, 1819011, 1864979, 1914547, 1965805, 2017117, 2067307, 2115050, 2158055, 2193202, 2218098, 2232637, 2238619, 2237798, 2230907, 2218778, 2203503, 2187615, 2172666, 2159557, 2149958, 2146098, 2148855, 2156994, 2168803, 2183819, 2202632, 2225724, 2253111, 2284549, 2319464, 2357100, 2397389, 2441393, 2490388, 2544859, 2604973, 2671678, 2746672, 2831545, 2927640, 3036437, 3159305, 3297075]
60434C297075J53663J71669J92121K13506K34163K54123K74261K94576L14877
60425E400034L36160L59058L80968L96644M01952L95189L74392L35789K76495
60416H656681J97669J04114K308j00000j94206k73619l35929l81674m10915m23222
60406F841207m20510m07586l89085l67238l43068l18159k94240k71903k50805
60397C778613k30562k10925j91660j73009j55824j40672j27278j15289j04991
60388B328403r6501q8820q0650p2182o5129o0657n7831n4532m9802m4791m1216
60377A616292l9157l7017l3743l0341k8423k7837k6828k4424k1442j8854j6441
60366A311785j3675j0957r089q186p836p733p537o760n453m376l753k704o85J381
$$ y = [3297075, 3450738, 3622407, 3814528, 4028034, 4262197, 4516320, 4790581, 5085157, 5400034, 5736194, 6095252, 6476220, 6872864, 7274816, 7670005, 8044397, 8380186, 8656681, 8854350, 8958464, 8960772, 8860772, 8666566, 8392947, 8057018, 7675344, 7264429, 6841207, 6420697, 6013111, 5624026, 5256788, 4913720, 4595561, 4301321, 4029418, 3778613, 3548051, 3337126, 3145466, 2972457, 2816633, 2675961, 2548683, 2433394, 2328403, 2231902, 2143082, 2062432, 1990250, 1925121, 1864464, 1806633, 1752101, 1702299, 1657508, 1616292, 1577135, 1540118, 1506375, 1476034, 1447611, 1419774, 1392946, 1368522, 1347080, 1328226, 1311785, 1298110, 1287153, 1278064, 1269878, 1262042, 1254309, 1246772, 1240012, 1234559, 1230183, 1226430, 1223726, 1223041, 1224422]
60352A224422K514L195M158M545L247J450J620L836N395M652L190L197M466N332
60338A275219N158M486L829L678M806P097Q785Q336O492N167M851M591M052L854
60324A350401L901L046Q39j698l445m304m618m491m086l581k606p39J173J412
60310A331204k14j596q97R89J715O54l83N58L485O694Q455Q357P410O892P009
60295A380332O921O253N891O861Q887J0724J1513J1197J0001Q359P162P209Q275
60282A489585R251R327Q549P267N697M067K697J742J180J127J686K679L810M976
60268A553640O000O292N478M126L091K351J340K96M0L46j24j775l230l336k822
60253A571713k972l638l795l294k729k063q76L81P91N66P80J439J334K59j48J452
$$ y = [1224422, 1226936, 1230131, 1234289, 1238834, 1242081, 1243531, 1245151, 1248987, 1254382, 1259034, 1262224, 1265421, 1269887, 1275219, 1280377, 1284863, 1288692, 1292370, 1297176, 1304273, 1313058, 1321394, 1327886, 1333053, 1337904, 1342495, 1346547, 1350401, 1354302, 1357348, 1358187, 1356489, 1353044, 1348740, 1344122, 1339631, 1335545, 1331964, 1329358, 1328619, 1329792, 1331204, 1330990, 1329394, 1328497, 1329486, 1331201, 1331855, 1331472, 1332030, 1335515, 1342209, 1350664, 1359021, 1366431, 1373323, 1380332, 1387253, 1393506, 1399397, 1406258, 1415145, 1425869, 1437382, 1448579, 1458580, 1466939, 1474101, 1481310, 1489585, 1498836, 1508163, 1516712, 1523979, 1529676, 1533743, 1536440, 1538182, 1539362, 1540489, 1542175, 1544854, 1548664, 1553640, 1559640, 1565932, 1571410, 1575536, 1578627, 1580978, 1582318, 1582614, 1582654, 1583000, 1582876, 1581101, 1577871, 1574535, 1571713, 1568741, 1565103, 1561308, 1558014, 1555285, 1553222, 1552346, 1552727, 1553518, 1554084, 1554864, 1556303, 1557637, 1557896, 1557748, 1559200]
60237A559200M274O608P936Q778R280R141Q616Q492R008R473R060P682O139N569
60223A669256O406P745Q324Q309R160J1240J2737J2042J0336J0303J2812J6287
60211A794957J9236K1720K4228K6604K8609L0372L1831L2928L4735L8954M5518
60200B129692N1851N5572N7029N8356O1063O5591P2143Q0366Q8778R6107J02952
60189B919500J10787J19602J28058J35846J44124J53250J61770J68515J74271
60180D215723J80282J86090J90042J91333J90332J87181J81325J72455J61051
60171E855814J47679J32448J15482R7509P9564O2273M5617K9404J3814n15j2884
60160F566205k2849l0090l4224l5020l2703k7682j9951r297L911J8620L3956M9692
$$ y = [1559200, 1563474, 1570082, 1578018, 1586796, 1596076, 1605217, 1613833, 1622325, 1631333, 1640806, 1649866, 1657548, 1663687, 1669256, 1675662, 1683407, 1691731, 1700040, 1709200, 1720440, 1733177, 1745219, 1755555, 1765858, 1778670, 1794957, 1814193, 1835913, 1860141, 1886745, 1915354, 1945726, 1977557, 2010485, 2045220, 2084174, 2129692, 2181543, 2237115, 2294144, 2352500, 2413563, 2479154, 2551297, 2631663, 2720441, 2816548, 2919500, 3030287, 3149889, 3277947, 3413793, 3557917, 3711167, 3872937, 4041452, 4215723, 4396005, 4582095, 4772137, 4963470, 5153802, 5340983, 5522308, 5694763, 5855814, 6003493, 6135941, 6251423, 6348932, 6428496, 6490769, 6536386, 6565790, 6579604, 6579089, 6566205, 6543356, 6513266, 6479042, 6444022, 6411319, 6383637, 6363686, 6354389, 6358300, 6376920, 6410876, 6460568]
60148F460568O5640Q1141R5675J09458J22980J36172J48530J59571J68560J74200
60138G722495J75432J72461J66169J56543J42548J23829J01742P8265N4471L0383
60128H924338N864j8807m2699o4142q1389r4047j03419j10717j15131j14601j08312
60117H076938r7553q4067o8620n1543l3634j5630K608K1534M0794N9409P6702
60106G926938R2236J05021J13752J17975J18290J15307J09099R9740Q7659P3311
60096H959328N7417M1589K7693J6171O144k254o922o218j174O207J6066L0271
60084I144318M9231P1014R3969J18602J46081J76152K07414K38829K70409L02881
60074A0818900L37198L73510M10309M45244M77138N06308N32642N54588N70685
$$ y = [6460568, 6526208, 6607349, 6703024, 6812482, 6935462, 7071634, 7220164, 7379735, 7548295, 7722495, 7897927, 8070388, 8236557, 8393100, 8535648, 8659477, 8761219, 8839484, 8893955, 8924338, 8930202, 8911395, 8868696, 8804554, 8723165, 8629118, 8525699, 8414982, 8299851, 8185250, 8076938, 7979385, 7895318, 7826698, 7775155, 7741521, 7725891, 7728499, 7750033, 7790827, 7850236, 7926938, 8019174, 8124195, 8237947, 8355922, 8474212, 8589519, 8698618, 8798358, 8886017, 8959328, 9016745, 9058334, 9086027, 9102198, 9108342, 9106088, 9099166, 9092948, 9091774, 9097981, 9114047, 9144318, 9193549, 9264563, 9358532, 9477134, 9623215, 9799367, 10006781, 10245610, 10516019, 10818900, 11156098, 11529608, 11939917, 12385161, 12862299, 13368607, 13901249, 14455837, 15026522]
60065A5026522N80659N83923N78222N61572N34864N00750M60079M11246L53431
60056A9591268K88860K20917J51096P8843L924p2021j46147k15856k79312l35029
60046A9286543l81471m17300m41886m55305m57880m50110m33107m08584l78058
60037A5462842l42377l02336k59299k14809j69851j24985q1015l9238j295L1089
60027A3958726N6767P5983Q9854R8505J00404R4189Q0463O0898L6330P206k4658
60016A4634667n6447q6686j15740j43712j69284j91403k10742k28419k44062k56276
60006A2931896k64509k69357k71123k69050k62286k50972k36006k18040j97247
59997A0693306j74168j50182j26513j02900p8040n1572k4700J548K7550N3501
$$ y = [15026522, 15607181, 16191104, 16769326, 17330898, 17865762, 18366512, 18826591, 19237837, 19591268, 19880128, 20101045, 20252141, 20330984, 20334908, 20262887, 20116740, 19900884, 19621572, 19286543, 18905072, 18487772, 18045886, 17590581, 17132701, 16682591, 16249484, 15840900, 15462842, 15120465, 14818129, 14558830, 14344021, 14174170, 14049185, 13968170, 13928932, 13927637, 13958726, 14015493, 14091476, 14181330, 14279835, 14380239, 14474428, 14554891, 14615789, 14652119, 14659325, 14634667, 14578220, 14491534, 14375794, 14232082, 14062798, 13871395, 13660653, 13432234, 13188172, 12931896, 12667387, 12398030, 12126907, 11857857, 11595571, 11344599, 11108593, 10890553, 10693306, 10519138, 10368956, 10242443, 10139543, 10061503, 10009931, 9985231, 9986779, 10014329, 10067830]
59987A0067830P7660R7802J13964J27844J39458J46249J46119J39608J28219J12134
59977A1296887R0961O5689L8362J0152j9019m9045p8747j06482j31101j52253
59967A0965404j69951j83686j92094j94123j90623j83842j75003j63255j47580
59958I365247j28666j08059q6331o3204l8892j4172J0710L6119O2176Q8485J14691
59947I238104J40635J66001J90215K12308K30678K43553K50348K51789K48134
59938A1171765K38142K20879J97657J70753J40719J06635O8815K9658q527m5011
59928A2291485p9477j10802j37918j60844j79733j93428j99915j98361j90124
59919A0840883j77591j62172j43462j20456r3576o5167l7679j1666J3882L9573
$$ y = [10067830, 10145490, 10243292, 10357256, 10485100, 10624558, 10770807, 10916926, 11056534, 11184753, 11296887, 11387848, 11453537, 11491899, 11502051, 11483032, 11433987, 11355240, 11248758, 11117657, 10965404, 10795453, 10611767, 10419673, 10225550, 10034927, 9851085, 9676082, 9512827, 9365247, 9236581, 9128522, 9042191, 8978987, 8940095, 8925923, 8936633, 8972752, 9034928, 9123413, 9238104, 9378739, 9544740, 9734955, 9947263, 10177941, 10421494, 10671842, 10923631, 11171765, 11409907, 11630786, 11828443, 11999196, 12139915, 12246550, 12315365, 12345023, 12336496, 12291485, 12212008, 12101206, 11963288, 11802444, 11622711, 11429283, 11229368, 11031007, 10840883, 10663292, 10501120, 10357658, 10237202, 10143626, 10078459, 10040780, 10029114, 10042996, 10082569]
59909A0082569O4521Q7194J06700J23228J37702J50850J62141J69780J72351J70290
59899A1427326J65223J58168J49130J38196J25984J13095J00105Q8161P8654P2161
59889A2616203O8701O9060P4675Q5823J01244J20170J43644J72869K07170K44717
59879A3904276K84662L27217L71847M16624M59599M99836N36552N67815N90676
59870A7959104O02449O01333N85767N53653N02890M32963L46010K46282J38670
59861B1969121K7676q2711j88693k86304l71376m40390m91833n26425n45681n50701
59851A8512683n42781n24412m98455m66411m28546l85681l39789k92531k44197
59842A4789880j94590j44362r4998m7864l557L8036P6989J12255J41578J63101
$$ y = [10082569, 10147090, 10234284, 10340984, 10464212, 10601914, 10752764, 10914905, 11084685, 11257036, 11427326, 11592549, 11750717, 11899847, 12038043, 12164027, 12277122, 12377227, 12465388, 12544042, 12616203, 12684904, 12753964, 12828639, 12914462, 13015706, 13135876, 13279520, 13452389, 13659559, 13904276, 14188938, 14516155, 14888002, 15304626, 15764225, 16264061, 16800613, 17368428, 17959104, 18561553, 19162886, 19748653, 20302306, 20805196, 21238159, 21584169, 21830451, 21969121, 21996797, 21914086, 21725393, 21439089, 21067713, 20627323, 20135490, 19609065, 19063384, 18512683, 17969902, 17445490, 16947035, 16480624, 16052078, 15666397, 15326608, 15034077, 14789880, 14595290, 14450928, 14355930, 14308066, 14304509, 14342545, 14419534, 14531789, 14673367, 14836468]
59832A4836468J76684J82728J79952J65858J39482J02432N6883L982n5073j17720
59822A5671676j80809k41746k98064l46878l86023m15122m34715m45013m46492
59813A2476814m40981m30797m17007l99413l77998l53511l27030k99904k73914
59804I156259k50511k29929k11565j94996j80111j66797j55325j46519j40554
59795G479952j35896j30481j23699j16318j08702j00347r1018q1198p1392o2003
59785F458898n4049m8837m6593m6332m7336m9906n4189n9301o4095o8140p1260
59774E848860p2681p1399o7318o1526n5341m9068m1621l1640j9333o808M061J3841
59762E390027K4621L6984M9022N8682O6136P3134Q0773Q8585R5391J00290J03049
$$ y = [14836468, 15013152, 15195880, 15375832, 15541690, 15681172, 15783604, 15840487, 15844469, 15789396, 15671676, 15490867, 15249121, 14951057, 14604179, 14218156, 13803034, 13368319, 12923306, 12476814, 12035833, 11605036, 11188029, 10788616, 10410618, 10057107, 9730077, 9430173, 9156259, 8905748, 8675819, 8464254, 8269258, 8089147, 7922350, 7767025, 7620506, 7479952, 7344056, 7213575, 7089876, 6973558, 6864856, 6764509, 6673491, 6592293, 6520901, 6458898, 6404849, 6356012, 6309419, 6263087, 6215751, 6165845, 6111656, 6052355, 5988260, 5920120, 5848860, 5776179, 5704780, 5637462, 5575936, 5520595, 5471527, 5429906, 5398266, 5378933, 5372125, 5376186, 5390027, 5414648, 5451632, 5500654, 5559336, 5625472, 5698606, 5779379, 5867964, 5963355, 6063645, 6166694]
59751F166694J04105J04101J03054J00104R4387Q6049P6243O6275N6931M8417
59741G006360M0794L4553L0844L0899L5232M3546N5257O9730Q6214J04169J23732
59730G661330J45351J68990J94287K21532K51470K83937L17444L50709L83820
59721I978870M17277M50277M80306N03643N15508N10492M84198M35004L64182
59712A4139757K75016J72651O4436m0839j34904k11654k67890l03472l20756l23036
59702A3049309l13238k94109k68959k40971k11670j80871j48420j15228q2435
59693A1193408n0244j8071J4736M8496Q3007J17428J50911J83608K16563K50286
59683A2190128K84189L17784L51781L87467M25727M67003N11319N57534O03678
$$ y = [6166694, 6270799, 6374900, 6477954, 6578058, 6672445, 6758494, 6834737, 6901012, 6957943, 7006360, 7047154, 7081707, 7112551, 7143450, 7178682, 7222228, 7277485, 7347215, 7433429, 7537598, 7661330, 7806681, 7975671, 8169958, 8391490, 8642960, 8926897, 9244341, 9595050, 9978870, 10396147, 10846424, 11326730, 11830373, 12345881, 12856373, 13340571, 13775575, 14139757, 14414773, 14587424, 14651860, 14611021, 14476117, 14264463, 13996573, 13693101, 13372345, 13049309, 12736071, 12441962, 12173003, 11932032, 11720362, 11539491, 11391071, 11275843, 11193408, 11143164, 11125093, 11139829, 11188325, 11271332, 11388760, 11539671, 11723279, 11939842, 12190128, 12474317, 12792101, 13143882, 13531349, 13957076, 14424079, 14935398, 15492932, 16096610]
59674A6096610O49201O96102P46321P98720Q50389R00395R49732R97424J039268
59665B3724162J071675J094557J108816J113048J105259J086633J060963J030897
59657C2396010R97427R63248R33919R14533R06736R09697R22080R41876R65709
59648D0851235R89819J010871J024859J026370J010608R75798R22406Q50459P59287
59639D9421712O50233N28671M02773K80458J67287O6667j8236q3169j24006j39364
59629E1153026j31048j01532n2098J5793R8761J92880K96208M08269N27189O49002
59619E3056450P69808Q86962R97583J097096J179820J239593J269104J259712
59611F1756128J203453J095442R34536P22887M66219J74424j38814m57409p64613
$$ y = [16096610, 16745811, 17441913, 18188234, 18986954, 19837343, 20737738, 21687470, 22684894, 23724162, 24795837, 25890394, 26999210, 28112258, 29217517, 30304150, 31365113, 32396010, 33393437, 34356685, 35290604, 36205137, 37111873, 38021570, 38943650, 39885526, 40851235, 41841054, 42851925, 43876784, 44903154, 45913762, 46889560, 47811966, 48662425, 49421712, 50071945, 50600616, 51003389, 51283847, 51451134, 51517801, 51499565, 51416396, 51292390, 51153026, 51021978, 50920446, 50868348, 50884141, 50982902, 51175782, 51471990, 51880259, 52407448, 53056450, 53826258, 54713220, 55710803, 56807899, 57987719, 59227312, 60496416, 61756128, 62959581, 64055023, 64989559, 65712446, 66178665, 66353089, 66214275, 65756866, 64992253]
59602F4992253j044969j286358j481205j626233j721781j771463j781817j761447
59594E2516980j720335j669507j620084j581129j557606j550088j556158j571907
59586C9690166j592458j611721j622534j618308j595547j554998j500217j435266
59578B7159117j363952j289940j215877j142137j067888r93821r22640q56315
59570A8306547p94093p34167o76372o22064n72038n25782m82534m41920m03696
59561A3053881l67906l35306l06740k81928k59589k38974k20788k06440j96837
59552A0639373j91881j90443j90785j91484j92255j93515j95156j96203j95819
59543H901832j94040j91322j87650j82457j75198j65828j54840j42984j30755
$$ y = [64992253, 63947284, 62660926, 61179721, 59553488, 57831707, 56060244, 54278427, 52516980, 50796645, 49127138, 47507054, 45925925, 44368319, 42818231, 41262073, 39690166, 38097708, 36485987, 34863453, 33245145, 31649598, 30094600, 28594383, 27159117, 25795165, 24505225, 23289348, 22147211, 21079323, 20085502, 19162862, 18306547, 17512454, 16778287, 16101915, 15479851, 14907813, 14382031, 13899497, 13457577, 13053881, 12685975, 12350669, 12043929, 11762001, 11502412, 11263438, 11042650, 10836210, 10639373, 10447492, 10257049, 10066264, 9874780, 9682525, 9489010, 9293854, 9097651, 8901832, 8707792, 8516470, 8328820, 8146363, 7971165, 7805337, 7650497, 7507513, 7376758]
59534G376758j18111j04840r1155p7692o4875n2562m0398k8307j6521n368M875
59523F781804J4122K2537L0260L7025M2325M6214M9703N4006N9433O5320P1057
59512G273806P6896Q3609R1619J00757J10831J22044J34810J49319J65404J82589
59502H491684K00255K18163K37013K58031K81538L06157L30021L52686L75284
59493A1050832L98851M23048M46532M67805M85485M98541N06842N11087N11681
59484A5300704N07988M99111M85058M66760M45226M21146L94983L66937L37095
59475A9225008L06211K76127K48787K24890K04049J86245J72413J63541J59678
59466B1166949J59958J62907J66377J67528J63372J51368J29682R7281N3991K38
$$ y = [7376758, 7258647, 7153807, 7062652, 6984960, 6920085, 6867523, 6827125, 6798818, 6782297, 6776929, 6781804, 6795926, 6818463, 6848723, 6885748, 6928073, 6974287, 7023990, 7077996, 7137429, 7202749, 7273806, 7350702, 7434311, 7525930, 7626687, 7737518, 7859562, 7994372, 8143691, 8309095, 8491684, 8691939, 8910102, 9147115, 9405146, 9686684, 9992841, 10322862, 10675548, 11050832, 11449683, 11872731, 12319263, 12787068, 13272553, 13771094, 14277936, 14789023, 15300704, 15808692, 16307803, 16792861, 17259621, 17704847, 18125993, 18520976, 18887913, 19225008, 19531219, 19807346, 20056133, 20281023, 20485072, 20671317, 20843730, 21007271, 21166949, 21326907, 21489814, 21656191, 21823719, 21987091, 22138459, 22268141, 22365422, 22419413, 22419651]
59456B2419651o3241j35061k12519k91784l69118m41698n07296n63749o09372
59447A9225813o43538o66386o78085o78772o69132o50513o24531n92854n57348
59438A3464654n19819m81410m42527m03500l64926l27220k90332k54288k19631
59429A0161001j86806j55223j23664r1610n9727k8897P37K9571N7928Q6035J14238
59418I803583J42724J71191J99145K26323K52420K76542K97585L15200L29811
59409A2014524L41294L47944L47210L37395L18275K90077K52387K04639J47638
59400A4601383Q3924J6340n3225j22981j89767k49721l00790l43537l78946m06362
59390A2656318m24440m33263m34571m30283m21826m10423l96747l80410l60831
$$ y = [22419651, 22356410, 22221349, 22008830, 21717046, 21347928, 20906230, 20398934, 19835185, 19225813, 18582275, 17915889, 17237804, 16559032, 15889900, 15239387, 14614856, 14022002, 13464654, 12944835, 12463425, 12020898, 11617398, 11252472, 10925252, 10634920, 10380632, 10161001, 9974195, 9818972, 9695308, 9603698, 9543971, 9515074, 9515811, 9545382, 9603310, 9689345, 9803583, 9946307, 10117498, 10316643, 10542966, 10795386, 11071928, 11369513, 11684713, 12014524, 12355818, 12703762, 13050972, 13388367, 13706642, 13996719, 14249106, 14453745, 14601383, 14685307, 14701647, 14648422, 14525441, 14335674, 14085953, 13785163, 13441626, 13062680, 12656318, 12231878, 11798615, 11364044, 10933761, 10511935, 10101512, 9704765, 9324355, 8963524]
59381H963524l38737l15853k93314k71347k50322k30640k11519j91440j70449
59372F689903j50598j33354j17788j02261q6794p2604o0105m8567l7322k6169
59362E854341j5048m250N427J3691K1527L0065L9125M7874N6464O5607P4725Q1963
59350F271511Q6483Q9564R3018R7423J02559J08846J17570J29918J46260J66007
59340G409159J87693K09331K29397K47961K66854K88288L13017L40032L68608
59331I860340M00275M37727M81528N29009N77008O24776O73308P22793P71968
59322A5078732Q19237Q62775Q99676R26597R41486R43650R32179R05834Q65043
59313B3175209Q12849P53184O88895O21673N52760M83089M13439L44909K78399
$$ y = [8963524, 8624787, 8308934, 8015620, 7744273, 7493951, 7263311, 7051792, 6860352, 6689903, 6539305, 6405951, 6288163, 6185902, 6099108, 6026504, 5966399, 5917832, 5880510, 5854341, 5839293, 5835043, 5840470, 5854161, 5875688, 5905753, 5944878, 5992752, 6049216, 6114823, 6189548, 6271511, 6357994, 6447558, 6540576, 6637999, 6740558, 6849404, 6966974, 7096892, 7243152, 7409159, 7596852, 7806183, 8035580, 8283541, 8550395, 8838683, 9151700, 9491732, 9860340, 10260615, 10698342, 11179870, 11708879, 12285887, 12910663, 13583971, 14306764, 15078732, 15897969, 16760744, 17660420, 18587017, 19528503, 20472153, 21404332, 22310166, 23175209, 23988058, 24741242, 25430137, 26051810, 26604570, 27087659, 27501098, 27846007, 28124406]
59304B8124406K13207J47115P8563P921o3932j37098k11537k85187l54561m16952
59294B7101945m71054n15777n49930n73448n88162n96991o02855o08240o14878
59285B1980610o23256o32647o41848o49780o55546o58537o58453o54778o46210
59276A6159555o31317o10067n84199n55708n25398m93245m59700m25819l92385
59267A1481717l59606l27816k97655k69167k41340k13194j85100j58370j33643
59258I295826j10290q7532o5452m4544k4841n945J2281K9539M5454N9816P2643
59247I176955Q4261R4949J04103J10148J11994J10396J07137J02803R6220Q6369
59237A0185335P4208O1972N1004M0908L0927K1700J5287J3312J5402J9745K5292
$$ y = [28124406, 28337613, 28484728, 28563291, 28571212, 28507280, 28370182, 28158645, 27873458, 27518897, 27101945, 26630891, 26115114, 25565184, 24991736, 24403574, 23806583, 23203728, 22595488, 21980610, 21357354, 20724707, 20082859, 19433079, 18777533, 18118996, 17460543, 16805765, 16159555, 15528238, 14918171, 14333972, 13778264, 13252866, 12759621, 12299921, 11874102, 11481717, 11122111, 10794295, 10496640, 10227473, 9986133, 9772939, 9587839, 9429469, 9295826, 9185536, 9098004, 9032552, 8988008, 8963167, 8957222, 8969503, 8999042, 9044496, 9104312, 9176955, 9261216, 9356165, 9460268, 9570416, 9682410, 9792806, 9899943, 10002746, 10098966, 10185335, 10259543, 10321515, 10372519, 10413427, 10444354, 10466054, 10481341, 10494653, 10510055, 10529800, 10555092]
59226A0555092L2893M4054N8962P6177R3812J10486J25634J39683J53671J67637
59216A1558101J79394J85785J85507J79827J70319J56975J39128J17349R3270
59207A2965655O7831M0735J1874j7229m3784o5577q2349r5152j04282j08322j05882
59196A2463518r7995q7708p7192o6307n4508m2904l3347k6299k0874j6629j3782
59185A1925973j1683q495l086L835J1297K0091L2261M8916O9507R3265J20383
59174A2302264J51386J86039K23499K63062L03973L44659L82971M17261M46453
59165A5021567M68752M81105M80486M65136M34065L86186L21103K40477J47698
59156A8446575M6343o0246j68214k73351l72068m61269n37337n96706o38075o62974
$$ y = [10555092, 10587985, 10632039, 10691001, 10767178, 10860990, 10971476, 11097110, 11236793, 11390464, 11558101, 11737495, 11923280, 12108787, 12288614, 12458933, 12615908, 12755036, 12872385, 12965655, 13033486, 13074221, 13086095, 13068866, 13025082, 12959505, 12877156, 12782004, 12677722, 12569400, 12463518, 12365523, 12277815, 12200623, 12134316, 12079808, 12036904, 12003557, 11977258, 11956384, 11939755, 11925973, 11914290, 11905795, 11902709, 11906544, 11917841, 11937932, 11970193, 12019109, 12088616, 12181881, 12302264, 12453650, 12639689, 12863188, 13126250, 13430223, 13774882, 14157853, 14575114, 15021567, 15490319, 15971424, 16451910, 16917046, 17351111, 17737297, 18058400, 18298877, 18446575, 18492918, 18432672, 18264458, 17991107, 17619039, 17157770, 16620433, 16023727, 15385652, 14722678]
59146A4722678o73638o71489o58262o37150o11357n82161n49670n14969m80130
59137I343852m46249m12811l79304l46507l15785k87853k62642k39929k19535
59128F433237k00993j83473j66433j50351j36441j25055j14611j02951q9881p7476
59118E085572o7567n9675n1934m3074l2906k1820j0844j514N521J1382J7696K4976
59106D855813L3055M2229N2511O2357O9948P5753Q2165R0353R9062J06962J14601
59095E684809J23068J31909J39625J45627J50668J55586J60128J62926J62419
59086G016765J58164J51376J43584J34694J23234J08767R2936P7544O2578M7185
59076H116827L1852J8356P797j60o030r428r603o304K96J0040K2658L7363N3243
$$ y = [14722678, 14049040, 13377551, 12719289, 12082139, 11470782, 10888621, 10338951, 9823982, 9343852, 8897603, 8484792, 8105488, 7758981, 7443196, 7155343, 6892701, 6652772, 6433237, 6232244, 6048771, 5882338, 5731987, 5595546, 5470491, 5355880, 5252929, 5163048, 5085572, 5018005, 4958330, 4906396, 4863322, 4830416, 4808596, 4797752, 4796238, 4801759, 4813141, 4830837, 4855813, 4888868, 4931097, 4983608, 5045965, 5115913, 5191666, 5273831, 5364184, 5463246, 5570208, 5684809, 5807877, 5939786, 6079411, 6225038, 6375706, 6531292, 6691420, 6854346, 7016765, 7174929, 7326305, 7469889, 7604583, 7727817, 7836584, 7929520, 8007064, 8069642, 8116827, 8148679, 8167035, 8174832, 8174672, 8168642, 8159214, 8149611, 8143307, 8143603, 8153643, 8176301, 8213664, 8266907]
59063H266907P0306Q9768J12578J37642J62192J84349K04866K25784K47916K70308
59053I972616K91690L11298L28402L42277L52755L59638L61323L55171L39689
59044A3014859L15324K82722K41564J92068J36493P8107J9373l7935r1836j40720
59034A4010019j84374k23212k56903k84808l07443l26287l42209l54982l64338
59025A1365463l70604l74440l76526l77265l76079l71634l63688l54025l44348
59016H056854l33925l20923l05722k90904k77825k65063k50835k35356k19976
59007E556325k05427j91770j79158j67697j57238j47771j39312j31071j21861
58998D115020j11815j02619r5432q9676q4433p9794p6031p2558o8775o4928o1289
$$ y = [8266907, 8337213, 8426981, 8539559, 8677201, 8839393, 9023742, 9228608, 9454392, 9702308, 9972616, 10264306, 10575604, 10904006, 11246283, 11599038, 11958676, 12319999, 12675170, 13014859, 13330183, 13612905, 13854469, 14046537, 14183030, 14261137, 14280510, 14242575, 14150739, 14010019, 13825645, 13602433, 13345530, 13060722, 12753279, 12426992, 12084783, 11729801, 11365463, 10994859, 10620419, 10243893, 9866628, 9490549, 9118915, 8755227, 8401202, 8056854, 7722929, 7402006, 7096284, 6805380, 6527555, 6262492, 6011657, 5776301, 5556325, 5350898, 5159128, 4979970, 4812273, 4655035, 4507264, 4367952, 4236881, 4115020, 4003205, 3900586, 3805154, 3715478, 3631045, 3551251, 3475220, 3402662, 3333887, 3268959, 3207670]
58987C207670n7434n3289m9730m7119m4300m0287l5893l2319k9259k5803k2264
58976B769973j9363j6479j2569q133m344q81L271P409R842J0814J2179J4109J4660
58963B780488J3101J1135R933Q483O039L933L455L786L712L774N021P056Q989
58950B868905J0950J3098J4446J4461J4498J5633J6288J4441J1233R732J0386
58939C014071J0454Q165M978K995K360K248K659L968N816P561R119J0609J1943
58926C096946J3331J5397J8177K0654K1961K2453K3151K4705K7174L0270L3422
58915C347641L6195L8892M2145M5754M8800N1162N3971N8084O2981O7746P2261
58904C925632P6728Q0843Q4433Q8192R2711R7122R9927J01106J02408J05309J09597
$$ y = [3207670, 3150236, 3096947, 3047217, 3000098, 2955798, 2915511, 2879618, 2847299, 2818040, 2792237, 2769973, 2750610, 2734131, 2721562, 2713429, 2709085, 2708204, 2711475, 2718884, 2728726, 2739540, 2751719, 2765828, 2780488, 2793589, 2804724, 2814657, 2823140, 2829179, 2833112, 2836567, 2840353, 2844065, 2847839, 2852860, 2859916, 2868905, 2879855, 2892953, 2907399, 2921860, 2936358, 2951991, 2968279, 2982720, 2993953, 3003685, 3014071, 3024525, 3032690, 3037668, 3040663, 3043023, 3045271, 3047930, 3051898, 3057714, 3065275, 3074394, 3085003, 3096946, 3110277, 3125674, 3143851, 3164505, 3186466, 3208919, 3232070, 3256775, 3283949, 3314219, 3347641, 3383836, 3422728, 3464873, 3510627, 3559427, 3610589, 3664560, 3722644, 3785625, 3853371, 3925632, 4002360, 4083203, 4167636, 4255828, 4348539, 4445661, 4545588, 4646694, 4749102, 4854411, 4964008]
58893D964008J14349J19522J25831J33394J41388J49279J57734J67866J79803
58884F253174J92716K06188K20780K36854K53596K69973K86283L03948L23933
58875H547445L46105L70143L96198M24483M54878M87267N21829N58826N98376
58866A2705550O40589O85472P32668P81550Q31472Q81638R31019R78909J025235
58857B0194102J069407J108862J139539J157865J161543J148376J115178J058347
58849B9153219R75244Q65238P30154N73701M00085K13558K0001j72067l54006
58840C2405127n20571o69539p98143r02417r80737j035667j070834j087716j087185
58831B4252318j072438j047867j015729r76251r30793q82737q34873p87572p40238
$$ y = [4964008, 5078357, 5197879, 5323710, 5457104, 5598492, 5747771, 5905505, 6073371, 6253174, 6445890, 6652078, 6872858, 7109712, 7363308, 7633281, 7919564, 8223512, 8547445, 8893550, 9263693, 9659891, 10084374, 10539252, 11026519, 11548348, 12107174, 12705550, 13346139, 14031611, 14764279, 15545829, 16377301, 17258939, 18189958, 19168867, 20194102, 21263509, 22372371, 23511910, 24669775, 25831318, 26979694, 28094872, 29153219, 30128463, 30993701, 31723855, 32297556, 32697641, 32911199, 32931200, 32759133, 32405127, 31884556, 31215017, 30416874, 29514457, 28533720, 27498053, 26427219, 25339503, 24252318, 23179880, 22132013, 21116284, 20140033, 19209240, 18326503, 17491630, 16704058, 15963820]
58822A5963820o93267o48063o05879n67253n31868m98661m66600m35629m06518
58813A1110082l79767l55199l32446l11090k90370k69509k48602k28500k09705
58804H484894j91992j75234j59796j45690j31955j17457j02151q7101p3366o1003
58794G239149m9010l6060k1553o139Q844K2719L6111N0134O5000P9740R3450J06583
58782G588968J20623J36417J53348J70304J87007K03926K21487K40047K60306
58773I282433K82684L06318L29843L53414L78956M07907M39530M72219N05762
58764A2759066N41572N81072O24544O71299P20283P70510Q21279Q71980R21632
58755A9283237R68813J011914J049050J077696J095078J098757J086193J053816
$$ y = [15963820, 15270553, 14622490, 14016611, 13449358, 12917490, 12418829, 11952229, 11516600, 11110082, 10730315, 10375116, 10042670, 9731580, 9441210, 9171701, 8923099, 8694599, 8484894, 8292902, 8117668, 7957872, 7812182, 7680227, 7562770, 7460619, 7373518, 7300152, 7239149, 7190139, 7154079, 7132526, 7126387, 7135231, 7157950, 7194061, 7244195, 7309195, 7388935, 7482385, 7588968, 7709591, 7846008, 7999356, 8169660, 8356667, 8560593, 8782080, 9022127, 9282433, 9565117, 9871435, 10201278, 10554692, 10933648, 11341555, 11781085, 12253304, 12759066, 13300638, 13881710, 14506254, 15177553, 15897836, 16668346, 17489625, 18361605, 19283237, 20252050, 21263964, 22313014, 23390710, 24485788, 25584545, 26670738, 27724554]
58747B7724554R97689R15433Q06831O72811N15466L39577J52543l8182k26735
58738C1859987m07509n73957p20272q43318r41975j015749j065582j094936j108159
58729B4088530j107868j095112j071427j039138j000167r56110r09376q62647
58721A6046685q17039p72006p27109o82899o40063n98962n60105n24174m91424
58712A0232904m61779m35209m11223l88424l65625l43218l22373l03221k84851
58703F916981k66807k49339k32421k15782j99855j85509j72833j61173j50163
58694E083099j39702j29243j18377j07953r9325r2596q6673q0821p4948o8781
58684D084680o2321n6870n4012n3538n3848n4149n4785n5607n5862n5684n5864
$$ y = [27724554, 28722243, 29637676, 30444507, 31117318, 31632784, 31972361, 32124904, 32086722, 31859987, 31452478, 30878521, 30158249, 29314931, 28372956, 27357207, 26291625, 25196689, 24088530, 22980662, 21885550, 20814123, 19774985, 18774818, 17818708, 16909332, 16046685, 15229646, 14457640, 13730531, 13047632, 12407569, 11808607, 11248502, 10724328, 10232904, 9771125, 9335916, 8924693, 8536269, 8170644, 7827426, 7505053, 7201832, 6916981, 6650174, 6400835, 6168414, 5952632, 5752777, 5567268, 5394435, 5233262, 5083099, 4943397, 4814154, 4695777, 4587824, 4488499, 4395903, 4309230, 4228409, 4153461, 4084680, 4022359, 3965489, 3911477, 3857939, 3804091, 3749942, 3695157, 3639550, 3583688, 3528004, 3472140]
58673C472140n6164n5693n4992n5494n6755n6635n4792n3582n4497n6083n6634
58662B860819n6705n7374n8004n7612n6810n6427n5530n2830m9132m6365m4757
58651B269273m2751l9472l5823l3234l2325l2491l2098k9701k5847k2841k2005
58640A920685k2143k1628k0631j9963j8996j6700j3892j2414j2402j2252j1194
58629A738470j0087r543q993q194q133r538j1475j2180j0926q612o777o253o482
58616A621277o169m749k936j569m80R45K513L547M200N508P975J0766J2627J3118
58602A666573J2720J2030J1166R973Q706Q172Q816R900J0270J0007J0573J2941
58590A791847J6389J9568K2165K4849K8042L1428L4561L7574M1234M6202N2017
$$ y = [3472140, 3415976, 3360283, 3305291, 3249797, 3193042, 3136407, 3081615, 3028033, 2973536, 2917453, 2860819, 2804114, 2746740, 2688736, 2631124, 2574314, 2517887, 2462357, 2409527, 2360395, 2314030, 2269273, 2226522, 2187050, 2151227, 2117993, 2085668, 2053177, 2021079, 1991378, 1965531, 1942690, 1920685, 1898542, 1876914, 1856283, 1836320, 1817324, 1800624, 1786732, 1774318, 1761916, 1749664, 1738470, 1728383, 1718840, 1709847, 1701653, 1693520, 1683982, 1672507, 1660327, 1649401, 1640789, 1634012, 1627759, 1621277, 1615108, 1610359, 1607423, 1605854, 1605374, 1606319, 1608832, 1612379, 1616579, 1622087, 1630062, 1640828, 1653455, 1666573, 1679293, 1691323, 1702489, 1712462, 1721168, 1729340, 1738156, 1748056, 1758326, 1768333, 1778906, 1791847, 1808236, 1827804, 1849969, 1874818, 1902860, 1934288, 1968849, 2006423, 2047657, 2093859, 2145876]
58579B145876N7031O0180O2611O6708P3360Q1245Q8839R6049J03524J11745J21317
58568C068485J32997J46680J61279J76188J91690K07543K22655K37126K53005
58559D797648K71666K91495L09541L24344L35691L42644L43522L37265L23073
58550G676889K99273K64355K19051J65980J07437M5078j8357p8805j33038j80005
58540H367858k19650k51231k73472k86008k90371k89575k86324k81246k73152
58531E916829k61283k46711k31254k15889k00847j86381j72511j58676j44504
58522D098773j30487j17264j04964r3880q4798p7767p1680o5976o1608n9118n7012
58511C174219n3630m9504m6155m3603m1011l8908l8514l9283l9425l8707l8618
$$ y = [2145876, 2202907, 2263087, 2325698, 2392406, 2465766, 2547011, 2635850, 2731899, 2835423, 2947168, 3068485, 3201482, 3348162, 3509441, 3685629, 3877319, 4084862, 4307517, 4544643, 4797648, 5069314, 5360809, 5670350, 5994694, 6330385, 6673029, 7016551, 7353816, 7676889, 7976162, 8240517, 8459568, 8625548, 8732985, 8778063, 8759706, 8680901, 8547863, 8367858, 8148208, 7896977, 7623505, 7337497, 7047126, 6757551, 6471227, 6189981, 5916829, 5655546, 5408835, 5177581, 4961692, 4760845, 4574464, 4401953, 4243277, 4098773, 3968286, 3851022, 3746058, 3652178, 3567380, 3489613, 3417933, 3351957, 3290349, 3231231, 3174219, 3120589, 3071085, 3024930, 2981327, 2940316, 2901408, 2862894, 2823611, 2784186, 2745479, 2706861]
58500B706861l9798m1389m3025m5291m7753m8591m6898m3781m0653l7899l5603
58489B236180l3932l2186k9071k4769k1430k0858k2665k5113k6659k6498k4966
58478A948033k3834k4708k6717k7417k6421k6138k7957k9782k9083k6719k5596
58467A653661k6415k7036k5909k4029k2974k2542k1315j8864j6509j5841j6946
58456A415281j8207j7893j5795j3141j1053r430p394m522j493M14N92j4L64K409
58442A320118N012O823P923R162J0441J0969J1014J2069J4807J7894J9396J8867
58430A464495J7522J6785J6986J7259J6493J4473J1975R684P434M839K127k54
58418A599818k326m279n934p401r694j3583j8028k0899k1250k0174j9400j9801
$$ y = [2706861, 2667063, 2625674, 2582649, 2537358, 2489605, 2441014, 2394116, 2350335, 2309682, 2271783, 2236180, 2202248, 2170062, 2140991, 2116222, 2094792, 2073934, 2051269, 2026156, 1999497, 1972999, 1948033, 1924199, 1899491, 1872774, 1845357, 1818936, 1792798, 1764841, 1735059, 1705976, 1679257, 1653661, 1627246, 1600210, 1574301, 1550272, 1527298, 1504756, 1483441, 1464577, 1448068, 1432227, 1415281, 1397074, 1379181, 1363386, 1350245, 1339192, 1329762, 1322368, 1317846, 1316353, 1316767, 1317359, 1317345, 1317709, 1320118, 1325130, 1331953, 1339876, 1349038, 1359479, 1370448, 1381462, 1393531, 1408338, 1426232, 1445628, 1464495, 1482017, 1498802, 1515788, 1533047, 1549540, 1564013, 1575988, 1585672, 1593106, 1597945, 1600072, 1599818, 1597492, 1593213, 1587279, 1579878, 1570184, 1556601, 1538573, 1517674, 1496424, 1476250, 1456850, 1437049]
58406A437049k1053k1973k1297j8870j5947j3761j2296j1061j0271j0147r787
58395A270586q191n923m315l334j787N21K389L195L718M693N827O655P537R329
58381A290900J2549J6654J9834K0311J8662J7674J8648J9098J6109J0775O740
58370A467954M991L226M47j104L39L172M835M958M604M069L176K492K670L333
58356A509162L812M331N382O546O862O012M525L256K952L822N213N996N424L223
58342A576518m80m756q016r727j1219j3647j5965j6579j5984j5673j5296j3384
58330A435792j0455q487p441n370k103L70J847M969J1008J7543K1870K4077K5216
58317A508836K5002K3254K1248J9728J7567J4314J1906J1900J2949J3167J3122
$$ y = [1437049, 1415996, 1394023, 1372726, 1353856, 1337909, 1324148, 1311852, 1300791, 1290520, 1280373, 1270586, 1262395, 1256472, 1252157, 1248823, 1247036, 1247557, 1249946, 1253141, 1256859, 1261552, 1267379, 1274034, 1281571, 1290900, 1303449, 1320103, 1339937, 1360248, 1378910, 1396584, 1415232, 1434330, 1450439, 1461214, 1467954, 1472945, 1476171, 1476618, 1475514, 1475853, 1479025, 1483860, 1488818, 1493422, 1497491, 1500667, 1503159, 1505829, 1509162, 1512974, 1517305, 1522687, 1529233, 1536095, 1542107, 1546632, 1549888, 1552840, 1556662, 1561875, 1567871, 1573295, 1576518, 1576038, 1571282, 1563266, 1553539, 1542320, 1528673, 1512708, 1496129, 1480145, 1464472, 1449176, 1435792, 1425337, 1416850, 1409409, 1404039, 1401936, 1402306, 1404153, 1409122, 1420130, 1437673, 1459543, 1483620, 1508836, 1533838, 1557092, 1578340, 1598068, 1615635, 1629949, 1641855, 1653755, 1666704, 1679871, 1692993]
58306A692993J4164J5512J5636J5158J5665J6592J5957J3856J2687J3903J6414
58295A858537J8355J8958J8552J7851J7296J6551J4903J2562J0727R925R273Q005
58283B031495O474N000L324K012K746N858R205J0933J1872J3624J5804J7011J7421
58270B152779J8308J9784K1008K2039K3721K5961K7671K8393K8805K9750L1602
58259B429821L4195L6736L8195L8442L8416L8739L8899L8170L6408L3678L0221
58248B831920K7173K5952K6367K6632K5730K4524K4135K4690K6008K8018L0213
58237C121362L2164L4544L7994M1308M2989M4215M7359N1787N4498N5169N6699
58226C620088O0241O3752O6561P0868P7010Q1758Q3687Q6017R1216R6941J00574
$$ y = [1692993, 1707157, 1722669, 1738305, 1753463, 1769128, 1785720, 1801677, 1815533, 1828220, 1842123, 1858537, 1876892, 1895850, 1914402, 1932253, 1949549, 1966100, 1981003, 1993565, 2004292, 2014217, 2023490, 2031495, 2037969, 2042969, 2046293, 2048305, 2051051, 2056909, 2066114, 2077047, 2088919, 2102543, 2118347, 2135358, 2152779, 2171087, 2190871, 2211879, 2233918, 2257639, 2283600, 2311271, 2339664, 2368469, 2398219, 2429821, 2464016, 2500752, 2538947, 2577389, 2615805, 2654544, 2693443, 2731613, 2768021, 2801699, 2831920, 2859093, 2885045, 2911412, 2938044, 2963774, 2988298, 3012433, 3037123, 3063131, 3091149, 3121362, 3153526, 3188070, 3226064, 3267372, 3310361, 3354576, 3401935, 3453722, 3508220, 3563389, 3620088, 3680329, 3744081, 3810642, 3881510, 3958520, 4040278, 4123965, 4209982, 4301198, 4398139, 4498713]
58215D498713J03830J09059J14431J16869J16977J17089J17122J16206J15987
58206E526283J18296J21661J23859J25874J29779J34889J39609J44889J52142
58197F717281J60028J67050J75116J86694K00461K13550K26009K39381K53288
58188H538858K67230K83283L03070L24539L45706L68600L95184M22527M47055
58179A1696052M70669M97438N27172N57832N91402O30964O74077P15463P54630
58170A7115699P94967Q37322Q80896R28675R85137J049476J117397J188509J265971
58161B6164049J350317J440055J537215J646043J767114J898118K038206K185878
58153D0026995K336355K488835K653972K846640L074409L340935L656313M034212
$$ y = [4498713, 4602543, 4711602, 4826033, 4942902, 5059879, 5176968, 5294090, 5410296, 5526283, 5644579, 5766240, 5890099, 6015973, 6145752, 6280641, 6420250, 6565139, 6717281, 6877309, 7044359, 7219475, 7406169, 7606630, 7820180, 8046189, 8285570, 8538858, 8806088, 9089371, 9392441, 9716980, 10062686, 10431286, 10826470, 11248997, 11696052, 12166721, 12664159, 13191331, 13749163, 14340565, 14971529, 15645606, 16361069, 17115699, 17910666, 18747988, 19628884, 20557559, 21542696, 22592172, 23709569, 24898078, 26164049, 27514366, 28954421, 30491636, 32137679, 33904793, 35802911, 37841117, 40026995, 42363350, 44852185, 47506157, 50352797, 53427206, 56768141, 60424454, 64458666]
58145F4458666M482807N009921N633425O373288P235811Q220671R342065J0622673
58137A21379327J2056013J3583289J5119850J6622851J8171723K0014692K2501442
58130B39449187K5852661K9855741L3699741L6120688L5843430L2120765K5082420
58123D58024633J5672672N209785n102241j4362829k1873012k7073467k9718113
58116C80777428l0073960k8838639k6802259k4560178k2452136k0623033j9066827
58109B08360396j7667745j6289066j4858847j3380962j1894315j0444967r077245
58102A14747249p818233o668050n618618m676476l852223l130223k461282j786134
58094G8736010j064472k96516M60241J088503J440144J394126R16545Q7725r28128
$$ y = [64458666, 68941473, 73951394, 79584819, 85958107, 93193918, 101414589, 110756654, 121379327, 133435340, 147018629, 162138479, 178761330, 196933053, 216947745, 239449187, 265301848, 295157589, 328857330, 364978018, 400821448, 432942213, 458024633, 473697305, 478907090, 473804849, 459442020, 437569008, 410495541, 380777428, 350703468, 321864829, 295062570, 270502392, 248050256, 227427223, 208360396, 190692651, 174403585, 159544738, 146163776, 134269461, 123824494, 114747249, 106929016, 100260966, 94642348, 89965872, 86113649, 82983426, 80522144, 78736010, 77671538, 77375022, 77835263, 78923766, 80363910, 81758036, 82674581, 82762306, 81834178]
58085H1834178j959061k889737l661588m229438m546874m602750m450269m180027
58077E1314434l868905l560918l279171l032627k813264k604917k400045k201298
58069B7553289k010124j824734j648137j487456j344416j214858j097978r98057
58061A5927529r16271q47998p89137p38891o95470o54951o15433n77530n40427
58052I551421n02009m63105m27199l95834l68148l44348l25254l08932k92101
58043F124491k74677k58950k44808k29837k13741j98549j84888j71884j60222
58034D186935j51322j43913j35443j26511j19926j15641j10735j04425r9023r5583
58024B984413r2232q7462q1956p6771p2384o9490o8212o6719o3351n9447n7355
$$ y = [81834178, 79875117, 76985380, 73323792, 69094354, 64547480, 59944730, 55494461, 51314434, 47445529, 43884611, 40605440, 37572813, 34759549, 32154632, 29754587, 27553289, 25543165, 23718431, 22070294, 20582838, 19238422, 18023564, 16925586, 15927529, 15011258, 14163260, 13374123, 12635232, 11939762, 11284811, 10669378, 10091848, 9551421, 9049412, 8586307, 8159108, 7763274, 7395126, 7050778, 6725524, 6416592, 6124491, 5849814, 5590864, 5346056, 5116219, 4902478, 4703929, 4519041, 4347157, 4186935, 4035613, 3891700, 3756257, 3629746, 3509820, 3394179, 3283444, 3179019, 3079996, 2984413, 2892181, 2804719, 2722763, 2645992, 2573608, 2504118, 2435906, 2369187, 2305836, 2246389, 2189034]
58013B189034n6470n4367n0953m8013m5380m1430l6981l4699l4458l3129k9508
58002A723646k6004k4627k4528k4366k4265k4512k4594k4240k3505k1738j8589
57991A462678j5737j5251j6416j6676j5365j3847j2340r718o366m125l171j839
57979A331827J29J043L11p18j382k511m127m877m200k880j293N44J353k50k970
57964A309999m072l449l564n218o671p246q308r892r877p668n559n042m807l824
57950A224802l382m306m997m331m027n854q497r379q203o627n705n410n705o492
57936A141887p112p026o309m961k735p1K104L912O405R607J2278J3979J5439J6385
57922A193782J5231J1858Q452O453M727K125k10p91l97q08k097l014l235l719
$$ y = [2189034, 2132564, 2078197, 2027244, 1979231, 1933851, 1892421, 1855440, 1820741, 1786283, 1753154, 1723646, 1697642, 1673015, 1648487, 1624121, 1599856, 1575344, 1550750, 1526510, 1503005, 1481267, 1462678, 1446941, 1431690, 1415274, 1398598, 1383233, 1369386, 1357046, 1347328, 1340962, 1336837, 1333666, 1331827, 1331956, 1332999, 1333310, 1332592, 1331210, 1328699, 1324572, 1319695, 1315495, 1312615, 1311322, 1311866, 1313219, 1312969, 1309999, 1305927, 1302478, 1298914, 1293696, 1287025, 1279779, 1271471, 1261579, 1251702, 1244034, 1238475, 1233433, 1228626, 1224802, 1221420, 1217114, 1212117, 1207786, 1203759, 1197905, 1189408, 1180029, 1171826, 1165199, 1159494, 1154084, 1148379, 1141887, 1134775, 1127749, 1121440, 1116479, 1113744, 1113673, 1115777, 1119689, 1126094, 1135701, 1147979, 1161958, 1177397, 1193782, 1209013, 1220871, 1229323, 1235776, 1240503, 1242628, 1242418, 1241627, 1241230, 1240422, 1238325, 1235311, 1232076, 1228357]
57908A228357n212p593j0225j2238j2919j2316j1038r393p641o792p694r350r810
57895A106136q966q510q922q621o724m411k680j030N78O81j185k945k700j237
57881A049464k66J86O94L14k159n750q205q841q862r264r979j0814j1857j2925
57867I61736j3519j3258j2047j0268q866q391p853n789k665o11l57k26J065K524
57853H81475K944L000L927N655P610R867J2133J3130J2508J1861J2296J2462J0709
57840I99577P756N358L686K039Q48Q46J164M71p92j433k046m214p658j0294j0994
57825I84314j0488r746r111q826q793q117o335m611m238m563m012k463q39Q55
57811I03027L005M620M470L597M191O135P217O842O745P627P800O250M539M246
$$ y = [1228357, 1223145, 1215552, 1205327, 1193089, 1180170, 1167854, 1156816, 1147423, 1139782, 1132990, 1125296, 1115946, 1106136, 1097170, 1088660, 1079738, 1071117, 1064393, 1059982, 1057302, 1056272, 1056850, 1057531, 1056346, 1053401, 1050701, 1049464, 1049198, 1049384, 1050078, 1050392, 1048233, 1042483, 1034278, 1025437, 1016575, 1007311, 997332, 986518, 974661, 961736, 948217, 934959, 922912, 912644, 903778, 895387, 887534, 881745, 879080, 878469, 878112, 877886, 878951, 881475, 884419, 887419, 891346, 897001, 904611, 914478, 926611, 939741, 952249, 964110, 976406, 988868, 999577, 1007333, 1012691, 1016377, 1018416, 1019264, 1020110, 1021274, 1021745, 1020953, 1019520, 1017474, 1013260, 1005602, 995308, 984314, 973826, 964080, 954969, 946143, 937350, 929233, 922898, 918287, 914049, 909486, 905474, 903011, 902172, 903027, 906032, 910652, 915122, 918719, 922910, 929045, 936262, 943104, 949849, 957476, 965276, 971526, 976065, 980311]
57797I80311M449L421J264o16j651k277k806l321m102n186n948n920n587n788
57783I46243o693p688p968p108n636m940n894p587q386q080p846q165q248p799
57769H44205p738q547r258r015q483q781r913j1098j1879j2072j1326r649p886
57756G18560o919o822p205p798q226p850o458m622k926j464l49lm62j042j070
57741F55344l06J441M013O056O010M576M564P175J0122J0940J0570J1405J2946
57728G44856J2327R015O039N672O253M832J281j940l244l396l883n138o542p261
57714G58871o950o134n824o288o454n177k962j618j931k560j771L42K088K485
57700G16117K375K985M144M774M834N645P915J0387J1324J0909J0971J2422J4118
$$ y = [980311, 984760, 988181, 989445, 988829, 987178, 984901, 982095, 978774, 974672, 969486, 963538, 957618, 952031, 946243, 939550, 931862, 923894, 916786, 911150, 906210, 900316, 892729, 884343, 876263, 868417, 860252, 852004, 844205, 836467, 827920, 818662, 809647, 801164, 792383, 782470, 771372, 759493, 747421, 736095, 726446, 718560, 711641, 704819, 697614, 689816, 681590, 673740, 667282, 662660, 659734, 658270, 657921, 657918, 657456, 656414, 655344, 655038, 656479, 660492, 666548, 672558, 677134, 681698, 688873, 698995, 709935, 720505, 731910, 744856, 757183, 766198, 772237, 777909, 784162, 788994, 790275, 788335, 785091, 781695, 777812, 772674, 766132, 758871, 751921, 745787, 739963, 733675, 727221, 722044, 719082, 717464, 715533, 712973, 711202, 711544, 713632, 716117, 718492, 721477, 725621, 730395, 735229, 740874, 748789, 759176, 770500, 781409, 792380, 804802, 818920]
57687H18920J4621J4032J3306J2717J2031J1662J2310J3518J3865J2878J1689
57676I61549J1411J1889J2492J3194J4115J4898J5453J6601J8817K1047K1984
57665A133450K2153K3295K5784K8177K9509L0528L2210L4282L6160L8114M0632
57654A474294M3373M5826M8354N1656N5652N9741O3718O7596P1088P4255P8219
57643B133772Q4132R1697R9827J08473J18440J29421J39859J49306J59576J72612
57633C387115J88165K04529K20806K37192K53519K68791K82273K93925L03389
57624E639704L09220L09464L02467K86863K61613K26843J84492J37498Q8552M0016
57614G786732n307m4411p5334r7628j11688j18663j21444j24509j31330j42147
$$ y = [818920, 833541, 847573, 860879, 873596, 885627, 897289, 909599, 923117, 936982, 949860, 961549, 972960, 984849, 997341, 1010535, 1024650, 1039548, 1055001, 1071602, 1090419, 1111466, 1133450, 1155603, 1178898, 1204682, 1232859, 1262368, 1292896, 1325106, 1359388, 1395548, 1433662, 1474294, 1517667, 1563493, 1611847, 1663503, 1719155, 1778896, 1842614, 1910210, 1981298, 2055553, 2133772, 2217904, 2309601, 2409428, 2517901, 2636341, 2765762, 2905621, 3054927, 3214503, 3387115, 3575280, 3779809, 4000615, 4237807, 4491326, 4760117, 5042390, 5336315, 5639704, 5948924, 6258388, 6560855, 6847718, 7109331, 7336174, 7520666, 7658164, 7746716, 7786732, 7781425, 7737014, 7661680, 7564052, 7452364, 7333701, 7212257, 7087748, 6956418, 6814271]
57604F814271j55093j69190j85092k02839k20061k32812k37675k33220k20576
57595D957713k03127j84614j66710j48789j30210j11959r5486q0873o7078n3463
57585C715404m0125k7071j4046j097J1441K3569L5696M8144O1095P4899Q9846
57574C977755J05639J21533J37089J52431J67751J82851J97187K10235K21698
57565E474169K31254K37805K39161K33153K19129J97706J68989J32152Q7432L7545
57555G258495j3805o4081j11574j53868j88386k14505k33707k47338k55362k57575
57545E518294k54904k48794k40182k29718k18382k06989j95444j83246j70690
57536C569945j58883j48351j38125j26862j14779j03859r5639q9276q2632p5175
$$ y = [6814271, 6659178, 6489988, 6304896, 6102057, 5881996, 5649184, 5411509, 5178289, 4957713, 4754586, 4569972, 4403262, 4254473, 4124263, 4012304, 3916818, 3835945, 3768867, 3715404, 3675279, 3648208, 3634162, 3633065, 3644506, 3668075, 3703771, 3751915, 3813010, 3887909, 3977755, 4083394, 4204927, 4342016, 4494447, 4662198, 4845049, 5042236, 5252471, 5474169, 5705423, 5943228, 6182389, 6415542, 6634671, 6832377, 7001366, 7133518, 7220950, 7258495, 7244690, 7180609, 7069035, 6915167, 6726781, 6512276, 6278569, 6031231, 5775869, 5518294, 5263390, 5014596, 4774414, 4544696, 4326314, 4119325, 3923881, 3740635, 3569945, 3411062, 3262711, 3124586, 2997724, 2882945, 2779086, 2683447, 2594171, 2511539, 2436364]
57526B436364o8647o4394o1146n6537n0221m4254m0360l7912l4953l0609k6052
57515A921279k3204k2526k2236j9956j5340j0562p805o823n573k760J004M305
57503A789803O392P649R276J2356J6723K0888K3578K5118K6777K9267L2477L6156
57491B036460L9992M3491M6775N1076N7294O4312P0109P4499P9453Q6474R4880
57480B744815J03128J10808J18747J27856J38316J49396J59807J68717J76383
57471C997973J83191J88206J89470J85716J76958J63524J45441J22662R4872O1351
57461E509364K2511j8271n6015q7951j14752j37548j55488j67240j73340j75442
57451D445828j74092j68917j60631j51377j42754j34399j24790j13078r9994q7215
$$ y = [2436364, 2367717, 2303323, 2242177, 2185640, 2135419, 2091165, 2050805, 2012893, 1977940, 1947331, 1921279, 1898075, 1875549, 1853313, 1833357, 1818017, 1807455, 1799650, 1792827, 1787254, 1784494, 1785498, 1789803, 1796195, 1803844, 1813120, 1825476, 1842199, 1863087, 1886665, 1911783, 1938560, 1967827, 2000304, 2036460, 2076452, 2119943, 2166718, 2217794, 2275088, 2339400, 2409509, 2484008, 2563461, 2649935, 2744815, 2847943, 2958751, 3077498, 3205354, 3343670, 3493066, 3652873, 3821590, 3997973, 4181164, 4369370, 4558840, 4744556, 4921514, 5085038, 5230479, 5353141, 5448013, 5509364, 5531875, 5513604, 5457589, 5369638, 5254886, 5117338, 4961850, 4794610, 4621270, 4445828, 4271736, 4102819, 3942188, 3790811, 3648057, 3513658, 3388868, 3275790, 3175796, 3088581]
57441C088581p5829o5513n5506m6144l8530l2585k6526j9017j0928m136J008O061
57429B720936J2480J9905K6709L2018L7023M3840N2829O1658O7949P2487P8471
57418C226305Q7695R8927J10202J21013J31475J41056J49400J57124J64371J69405
57408D556973J70085J65972J57695J44878J26185J01236P1074L6890m45l9352
57398E491191p7116j10896j38753j59909j74555j83487j87528j87500j84658j80395
57388C906394j74990j67609j58217j48440j39593j30825j20647j09487r9243r0783
57378B566560q3461p6806p0883o5195n8883n2431m7486m4554m2217l9154l5618
57367A949872l2297k9070k5743k2899k0949j9141j6539j3469j0970r244p580n690
$$ y = [3088581, 3012752, 2947239, 2891733, 2845589, 2807059, 2774474, 2747948, 2728931, 2718003, 2713867, 2714875, 2720936, 2733416, 2753321, 2780030, 2812048, 2849071, 2892911, 2945740, 3007398, 3075347, 3147834, 3226305, 3314000, 3412927, 3523129, 3644142, 3775617, 3916673, 4066073, 4223197, 4387568, 4556973, 4727058, 4893030, 5050725, 5195603, 5321788, 5423024, 5494098, 5530988, 5530543, 5491191, 5414075, 5303179, 5164426, 5004517, 4829962, 4646475, 4458947, 4271447, 4086789, 3906394, 3731404, 3563795, 3405578, 3257138, 3117545, 2986720, 2866073, 2756586, 2657343, 2566560, 2483099, 2406293, 2335410, 2270215, 2211332, 2158901, 2111415, 2066861, 2024644, 1985490, 1949872, 1917575, 1888505, 1862762, 1839863, 1818914, 1799773, 1783234, 1769765, 1758795, 1749551, 1741971, 1736281]
57355A736281m131l337k911k213j146j37M63O48O72R77K198M779Q210J0963J1772
57340A763088J0906R652Q643P600O843P742J0855J4573J6789J7269J7277J7366
57328A908603J7031J6294J6051J6584J7108J7278J7916J9623K1593K2718K3153
57317B113952K3984K5735K7814K9312K9963L0502L2109L5185L8540M0421M0591
57306B468108M0661M1970M3683M3682M1040L7007L3575L1619L0605K9847K9678
57295B871475L1059L4069L7205L8658L8166L7197L7460L9494M2543M5144M5957
57284C298427M4753M2797M1747M2073M2980M3830M4949M6808M9015N0490N0384
57273C798253M8782M6876M6303M7690M9801N0831N0620N0839N2670N5195N6599
$$ y = [1736281, 1732150, 1728813, 1725902, 1723689, 1722543, 1722406, 1722869, 1723517, 1724189, 1725166, 1727364, 1732143, 1740353, 1751316, 1763088, 1773994, 1783646, 1792289, 1799889, 1806732, 1814474, 1825329, 1839902, 1856691, 1873960, 1891237, 1908603, 1925634, 1941928, 1957979, 1974563, 1991671, 2008949, 2026865, 2046488, 2068081, 2090799, 2113952, 2137936, 2163671, 2191485, 2220797, 2250760, 2281262, 2313371, 2348556, 2387096, 2427517, 2468108, 2508769, 2550739, 2594422, 2638104, 2679144, 2716151, 2749726, 2781345, 2811950, 2841797, 2871475, 2902534, 2936603, 2973808, 3012466, 3050632, 3087829, 3125289, 3164783, 3207326, 3252470, 3298427, 3343180, 3385977, 3427724, 3469797, 3512777, 3556607, 3601556, 3648364, 3697379, 3747869, 3798253, 3847035, 3893911, 3940214, 3987904, 4037705, 4088536, 4139156, 4189995, 4242665, 4297860, 4354459]
57262D354459N6382N5727N6099N7914O0399O2275O2844O2677O3045O4410O5845
57251E022076O6211O5559O4981O5363O6644O8168O9426P0563P2325P5394P9508
57240E786218Q3377Q5726Q6444Q6668Q7642Q9457R0949R1068R0293R0253R1723
57229F759818R3704R5040R6208R8470J01605J03816J04041J03192J02634J02380
57219G760908J01439R9242R5985R1912Q6892Q0651P3069O4383N5133M5833L6702
57208H592149K7990K0353J4520J0794R381J0726J4680J9629K3755K7208L1947
57197H803132L9196M8097N7231O6328P5886Q5959R5869J04486J10476J13120J13191
57186I712971J12239J10624J07208J01264R3683Q5852P8315P0940O3377N5003
$$ y = [4354459, 4410841, 4466568, 4522667, 4580581, 4640980, 4703255, 4766099, 4828776, 4891821, 4956231, 5022076, 5088287, 5153846, 5218827, 5284190, 5350834, 5419002, 5488428, 5558991, 5631316, 5706710, 5786218, 5869595, 5955321, 6041765, 6128433, 6216075, 6305532, 6396481, 6487549, 6577842, 6668095, 6759818, 6853522, 6948562, 7044770, 7143240, 7244845, 7348661, 7452702, 7555894, 7658528, 7760908, 7862347, 7961589, 8057574, 8149486, 8236378, 8317029, 8390098, 8454481, 8509614, 8555447, 8592149, 8620139, 8640492, 8655012, 8665806, 8675187, 8685913, 8700593, 8720222, 8743977, 8771185, 8803132, 8842328, 8890425, 8947656, 9013984, 9089870, 9175829, 9271698, 9376184, 9486660, 9599780, 9712971, 9825210, 9935834, 10043042, 10144306, 10237989, 10323841, 10402156, 10473096, 10536473, 10591476]
57176A0591476M5645L6773L0640K7707K6501K6490K9090L4909M2239M9922N9493
57165A1000885P2179Q5635R6555J05250J14586J25164J34802J42685J50503J58858
57155A2187102J65758J69977J73262J77404J81321J83091J83214J83738J85059
57146A3789926J85679J84692J82527J79220J73569J64616J52963J39999J26365
57137A5279556J11859R6741Q2341O9941N9420M9786M1053L4384L0051K6490K2366
57126A5903988J8549J6566J6002J5187J3943J3607J4409J4962J4754J5225J7561
57115A6074753K1169K5171K9948L6233M3780N1724N9184O4885O7472O6787O3410
57104A6604516N6254M2347K0268p446l6717o5432r3174j18645j39329j53406j60613
$$ y = [10591476, 10637121, 10673894, 10704534, 10732241, 10758742, 10785232, 10814322, 10849231, 10891470, 10941392, 11000885, 11073064, 11158699, 11255254, 11360504, 11475090, 11600254, 11735056, 11877741, 12028244, 12187102, 12352860, 12522837, 12696099, 12873503, 13054824, 13237915, 13421129, 13604867, 13789926, 13975605, 14160297, 14342824, 14522044, 14695613, 14860229, 15013192, 15153191, 15279556, 15391415, 15488156, 15570497, 15640438, 15699858, 15749644, 15790697, 15825081, 15855132, 15881622, 15903988, 15922537, 15939103, 15955105, 15970292, 15984235, 15997842, 16012251, 16027213, 16041967, 16057192, 16074753, 16095922, 16121093, 16151041, 16187274, 16231054, 16282778, 16341962, 16406847, 16474319, 16541106, 16604516, 16660770, 16703117, 16723385, 16715939, 16679222, 16613790, 16520616, 16401971, 16262642, 16109236, 15948623]
57093A5948623j61523j57325j50312j43554j39757j40614j46635j57097j70482
57084A4581324j85073j98647k08145k11533k10449k09137k10240k13314k18008
57075A2716778k25821k37210k49539k60533k71872k86933l06587l29904l57579
57066A0190800l91446m31310m74987n21096n69411o19283o70489p25285p87110
57057E000383q57453r35938j022702A065574a59450j344004j479741j634638j807424
57048f425257j997506k208925k446736k712687l008635l340225l711893m123693
57040b9975557m581858n109133n736896o493522p408381q507437r772883j1116935
57032h8702602j2448697j3786792j5248334j6861779j8410457j9538667k0040141
$$ y = [15948623, 15787100, 15629775, 15479463, 15335909, 15196152, 15055538, 14908903, 14751806, 14581324, 14396251, 14197604, 13989459, 13777926, 13567477, 13358340, 13148100, 12934786, 12716778, 12490957, 12253747, 12004208, 11743675, 11471803, 11184870, 10878283, 10548379, 10190800, 9799354, 9368044, 8893057, 8371961, 7802550, 7183267, 6512778, 5787493, 5000383, 4142930, 3206992, 2184290, 1065574, -159450, -1503454, -2983195, -4617833, -6425257, -8422763, -10631688, -13078424, -15791111, -18799746, -22139971, -25851864, -29975557, -34557415, -39666548, -45403444, -51896966, -59305347, -67812784, -77585667, -88702602, -101151299, -114938091, -130186425, -147048204, -165458661, -184997328, -205037469]
57025b05037469j9992879j9572078j8766942j7343245j5103530j2175987r055536
57018c17047666o357005m452291l225623k113442m25339K258512N881626J0002074
57010c15479154J4047309J7528218K0128705K1715042K2316679K2082373K1213787
57003a76447041J9908236J8336311J6643007J4947271J3334889J1855361J0526990
56996g0894976R344960Q289862P338692O476491N701062N016589M422012L905478
56988b0399830L449551L040457K671633K340554K045291J784364J556629J359116
56980b152235i66026F6257Q94326P71184O61988N66388M84666M15678L55690L01020
56970D517197K50972K06631J67469J31014R5291N9841K4633j0096m2814p1149
$$ y = [-205037469, -225030348, -244602426, -263369368, -280712613, -295816143, -307992130, -317047666, -323404671, -327856962, -331082585, -333196027, -333621366, -331362854, -325481228, -315479154, -301431845, -283903627, -263774922, -242059880, -219743201, -197660828, -176447041, -156538805, -138202494, -121559487, -106612216, -93277327, -81421966, -70894976, -61550016, -53260154, -45921462, -39444971, -33743909, -28727320, -24305308, -20399830, -16950279, -13909822, -11238189, -8897635, -6852344, -5067980, -3511351, -2152235, -966026, 66257, 960583, 1731767, 2393755, 2960143, 3444809, 3860487, 4216177, 4517197, 4768169, 4974800, 5142269, 5273283, 5368574, 5428415, 5453048, 5442952, 5400138, 5328989]
56960E328989r4014j12450j28209j42220j54352j63937j70716j75837j81521j88908
56950C816825j96782k03298k08138k11715k13114k10753k04770j96765j86958
56941A984532j73544j55385j33497j08943q1137n0115k0002J433P513k595k2950
56930A245310m4475o0698p1132p9165q6857r2651r4277r2347q9725q8231q7355
56919C58397q6042q4144q1646B8949d2046o2089n2472m3518l5342k7377j9435
56908b82279j1954n376K75N299J0079J4890J9629K3709K6597K8565L0441L2464
56896a07661L3802L3324a0078A5168J8284J0938M906P92k261m961o566o080m194
56883B6026k714k332k109j174L73K383N112Q211J0499J1609J2798J5051J7055
$$ y = [5328989, 5234975, 5122525, 4994316, 4852096, 4697744, 4533807, 4363091, 4187254, 4005733, 3816825, 3620043, 3416745, 3208607, 2996892, 2783778, 2573025, 2368255, 2171490, 1984532, 1810988, 1655603, 1522106, 1413163, 1332026, 1281911, 1261909, 1263342, 1270855, 1268260, 1245310, 1200835, 1140137, 1069005, 989840, 902983, 810332, 716055, 623708, 533983, 445752, 358397, 272355, 188211, 106565, 28949, -42046, -104135, -156607, -200125, -235467, -262844, -282279, -294233, -299609, -299334, -294035, -283956, -269066, -249437, -225728, -199131, -170566, -140125, -107661, -73859, -40535, -10078, 15168, 33452, 44390, 49296, 50088, 47827, 42866, 36300, 30220, 26026, 23312, 20980, 18871, 17697, 18070, 20453, 25565, 33776, 44275, 55884, 68682, 83733, 100788]
56870A00788J6369J2452P331L048m47m421r086j3244j5910j7336j8111j7960j6339
56857B7134A3252I78a1363j3006j2612j0763q300o052m383l561l643m008l813
56844h1504k976k085j407p62k53j78n0J167L287M398L042L03j202k33K154M456
56828g1843O465Q717J0842J1454R744O606L818K253J435O78R1K30J255K895d81
56812F554R247J1717J4933J8887K2637K5249K6918K8582L0728L3339L6626M0688
56800C06105M4409M5782M3694L8780L2259K4757J6579Q336Q16n299r386j1113
56788E35719j0953r808p764m126R91O025R684J2627J6493K1828K7903L4259M1363
56775F74241M9465N7421O2885O3512N8208M7776L4272J9417L720j2517k7751l9527
$$ y = [100788, 117157, 129609, 136940, 139988, 139541, 135120, 126034, 112790, 96880, 79544, 61433, 43473, 27134, 13252, 978, -11363, -24369, -36981, -47744, -56044, -62096, -66479, -70040, -73683, -77691, -81504, -84480, -86565, -87972, -88734, -88987, -89165, -89215, -88048, -84761, -80363, -77321, -77018, -78220, -78453, -76299, -71843, -65378, -56661, -45819, -34365, -24621, -18015, -14197, -11944, -10509, -9831, -9740, -9510, -8255, -5360, -481, 6554, 15801, 27518, 42451, 61338, 83975, 109224, 136142, 164724, 195452, 228791, 265417, 306105, 350514, 396296, 439990, 478770, 511029, 535786, 552365, 560701, 561517, 556218, 546832, 535719, 524766, 514958, 507194, 503068, 504059, 510084, 519768, 532395, 548888, 570716, 598619, 632878, 674241, 723706, 781127, 844012, 907524, 965732, 1013508, 1047780, 1067197, 1070917, 1058400, 1030649, 991122]
56763I91122m6388m8799m8061m4807l9040l1228k2730j4996q664l511J067N740
56751F89705J1138J7488K4242L0288L4687L6869L6140L1531K2588J0092m368j9112
56739I21288l2432m2464m7895m8837m6576m2524l7670l2595k7458k2125j6806
56728E23906j2154q280m239O59N583R237J1624J3553J4822J4376J2012Q353L157
56715E92609m451j3686k1885k7242l0187l1431l0520k7530k4408k2908k2294k0717
56703C15350j7986j5491j4017j3174j2497j1765j0556q765p172o384n715m309
56691A87519k799k395k824k825k423k901m312m813l219q52j2j390l747n498n888
56676A41621n041l550k173j599k165l450m264l645k049q09j93R23K821L718K068
$$ y = [991122, 944734, 895935, 847874, 803067, 764027, 732799, 710069, 695073, 686409, 682898, 683965, 689705, 700843, 718331, 742573, 772861, 807548, 844417, 880557, 912088, 934676, 944768, 940400, 921288, 888856, 846392, 798497, 749660, 703084, 660560, 622890, 590295, 562837, 540712, 523906, 511752, 503472, 499233, 499892, 505475, 514712, 526336, 539889, 554711, 569087, 581099, 589452, 592609, 588158, 574472, 552587, 525345, 495158, 463727, 433207, 405677, 381269, 358361, 336067, 315350, 297364, 281873, 267856, 254682, 242185, 230420, 219864, 211099, 203927, 197543, 191828, 187519, 184720, 182325, 179501, 176676, 174253, 171352, 167040, 162227, 159008, 158156, 158144, 156754, 153007, 147509, 141621, 136580, 133030, 130857, 129258, 127093, 123643, 119379, 115734, 113685, 112876, 112683, 113606, 116427, 120145, 122213]
56661A22213q69k473k172j715k258k958k652j267O75K632L660K869Q15o79n36
56646A15285N64J520J931J673N32j034j808j192P2J024J561J969K304K743L595
56631A30739M472M261K623P63J67J120K908M650N511M874L060J321O56J076K106
56616A70307L155L295J960K36J06J670K566J223p12o85J118K191J202p05j898
56601A85029j944j169LQ59N83q58k505l345k982j644j62L39l71r33J04K194L231
56584A76429K210L17j041k041l626n716p378q271q845r099q132n455k225m04o83
56569A16040j815k230j843j644j931j868r50Q5L86J99K57N60O53O59R76J289J042
56552A09865P43J491K971L288J583k86J69K877N213N034K727K23j047r49j93L23
$$ y = [122213, 121344, 118871, 116699, 114984, 112726, 109768, 107116, 105849, 106524, 109156, 112816, 115685, 116500, 115821, 115285, 115849, 117369, 119300, 120973, 121505, 120471, 118663, 117471, 117543, 118567, 120128, 122097, 124401, 127144, 130739, 135211, 139472, 142095, 142858, 143025, 144145, 147053, 151703, 157214, 162088, 165148, 166469, 167125, 168201, 170307, 173462, 176757, 178717, 178953, 179059, 180729, 183295, 184518, 183806, 183121, 184239, 186430, 187632, 186927, 185029, 183085, 181916, 181919, 182778, 183361, 182503, 179998, 176653, 173671, 172027, 171865, 172204, 171833, 170900, 171004, 173198, 176429, 178639, 178956, 177915, 175874, 172248, 166532, 159154, 150883, 142038, 132939, 124807, 119352, 117127, 116723, 116040, 114225, 111995, 110152, 108508, 106577, 104709, 103759, 103844, 104230, 104429, 104686, 105246, 105899, 106558, 107534, 108823, 109865, 110608, 112099, 115070, 118358, 119941, 119655, 119824, 122701, 127914, 132948, 135675, 135898, 134851, 133902, 133709, 134032]
56536A34032M2p91j180k37J907M161N382N254M377L636L410L302K698J537M15
56521A67945ON65J919L493M341L845K714K595M110N902O371N689N046M576L609
56506B22726K656L167M982O046N532N203O408P610O903N356N357O686O902N286
56492C00820L589K754J691K3o35O25K186K302J541J175P98o31k521l327k945k729
56476C04716l541n095o703p440o266l379r70j031k732l491k387r85q78j986l346
56461B54486m157l729k006n56j391m160n794m138p79R50l8j917k833k792k471
56446B18675j717k14J078N33j911m135m062j994q3L35l1K25J534L318M833N481
56430B21865M973L788L049L326L930L915L410L243L568L644K962K014J787K745
$$ y = [134032, 134074, 133283, 132103, 131866, 133773, 137934, 143316, 148570, 152947, 156583, 159993, 163295, 165993, 167530, 167945, 167951, 168516, 170435, 173928, 178269, 182114, 184828, 187423, 191533, 197435, 203806, 209495, 214541, 219117, 222726, 225382, 228549, 233531, 239577, 245109, 250312, 256720, 264330, 271233, 276589, 281946, 288632, 295534, 300820, 304409, 307163, 308854, 308877, 308242, 308867, 311053, 313355, 314896, 316071, 316869, 316238, 313717, 310390, 307445, 304716, 301175, 296080, 289377, 281937, 275671, 272292, 271322, 270291, 267559, 264068, 261681, 260696, 259818, 257832, 254486, 250329, 246600, 244594, 244038, 242647, 238487, 232693, 228555, 227776, 228726, 228688, 226771, 223938, 221146, 218675, 216958, 216744, 217822, 218355, 216444, 212309, 208247, 206253, 206170, 206505, 206474, 206699, 208233, 211551, 216384, 221865, 226838, 230626, 233675, 237001, 240931, 244846, 248256, 251499, 255067, 258711, 261673, 263687, 265474, 268219]
56416B68219M237M886L987K539K287L517M664M465L435K569J817J037J226L065
56402C11950M936M552K334J044J814K594J486m02q37J29M68o67j749j004J382
56387C28030L587M066K807R83l05q44r39o42J87J191J520P16p74k092k602k074
56371C32815q80j03p23k409l666l606l002l136m111m907m773l864k680j485m75
56356B92995k4m69j687k932l294k445j019q0j33q05j424j636j358n31P87K143
56340B78088K861K543J365pp73m42P94K080K495J928J431K358M843P330Q071P055
56324C22020N858N665O141O456O463O283N603M420L908N253P675Q845P559N092
56310D07241L460L133L126K747K407K677L200K999J782N65N94J758K565J937N35
$$ y = [268219, 272456, 277342, 281329, 283868, 286155, 289672, 294336, 298801, 302236, 304805, 306622, 307659, 308885, 311950, 316886, 321438, 323772, 324816, 326630, 329224, 330710, 330308, 329471, 329600, 330068, 329401, 327652, 326648, 328030, 331617, 335683, 338490, 339473, 339168, 338324, 337385, 336743, 336930, 338121, 339641, 340357, 339583, 337491, 334889, 332815, 331935, 331832, 331109, 328700, 325034, 321428, 318426, 315290, 311179, 306272, 301499, 297635, 294955, 293470, 292995, 292971, 292502, 290815, 287883, 284589, 282144, 281125, 281045, 280912, 280107, 278683, 277047, 275689, 275158, 275945, 278088, 280949, 283492, 284857, 284850, 284077, 283635, 284429, 286509, 289004, 290932, 292363, 294721, 299564, 306894, 314965, 322020, 327878, 333543, 339684, 346140, 352603, 358886, 364489, 368909, 372817, 378070, 385745, 394590, 402149, 407241, 410701, 413834, 416960, 419707, 422114, 424791, 427991, 430990, 432772, 433337, 433931, 435689, 438254, 440191, 440726]
56295D40726j62K99J068J379J457J973L046M081M441M149L974M626N849O721O913
56280D90540P125P923Q838R166R011Q849Q530P746P083P599R359J1209J2035J1593
56266F16606J0337R172R101J0242J1319J1049R983R876J1295J2871J3169J2262
56254G47282J1113J0325R943R650Q826P010M711L125K730K854K860L047L867M994
56240H32337N853O577P741R347J0596J0912J0872J1786J4184J6957J8618J9347
56228I75127K0880K3933K6866K7944K7987K9296L2471L5917L8389M0346M2655
56217A321811M5544M9300N4485O0677O6277P0443P4288P9378Q5844R2794R9859
56206B100700J07430J15811J24930J34776J45592J57543J70366J83189J94824
$$ y = [440726, 440564, 440863, 441931, 443310, 444767, 446740, 449786, 453867, 458308, 462457, 466431, 471057, 476906, 483627, 490540, 497665, 505588, 514426, 523592, 532603, 541452, 549982, 557728, 564811, 572410, 581769, 592978, 605013, 616606, 626943, 636115, 645216, 655458, 666777, 677826, 687809, 697685, 708980, 721851, 735020, 747282, 758395, 768720, 778663, 788313, 797139, 804149, 808860, 811985, 814715, 817569, 820429, 823476, 827343, 832337, 838190, 844767, 852508, 861855, 872451, 883363, 894235, 906021, 920205, 937162, 955780, 975127, 996007, 1019940, 1046806, 1074750, 1102737, 1132033, 1164504, 1200421, 1238810, 1279156, 1321811, 1367355, 1416655, 1471140, 1531817, 1598094, 1668537, 1742825, 1822203, 1908047, 2000841, 2100700, 2208130, 2323941, 2448871, 2583647, 2729239, 2886782, 3057148, 3240337, 3435161]
56197C435161K04669K13164K20995K28072K33731K37345K37939K33891K24189
56188E469156K09670J91815J70840J46543J20369R4464O8678M0984J1402j6763
56178F507158m0548o0191p7223r1805j03476j12835j20761j27256j32568j37998
56168E502497j43912j48327j49683j49873j52197j56856j60933j62702j63435
56159D114579j64440j64569j62013j57147j52052j47811j43464j37696j30604
56150B754783j23408j16868j10563j03849r6838r0028q3428p6804p0413o4645
56140A817939n9185n3645m8747m5540m3446m0657l6784l3353l1168k8935k5488
56129A370991k1710j8984j7049j4812j2185r739p469n158l122j414P87L702N881
$$ y = [3435161, 3639830, 3852994, 4073989, 4302061, 4535792, 4773137, 5011076, 5244967, 5469156, 5678826, 5870641, 6041481, 6188024, 6308393, 6402857, 6471535, 6512519, 6523921, 6507158, 6466610, 6406419, 6329196, 6237391, 6133915, 6021080, 5900319, 5773063, 5640495, 5502497, 5358585, 5210258, 5060575, 4910702, 4758505, 4601649, 4440716, 4278014, 4114579, 3950139, 3785570, 3623557, 3466410, 3314358, 3166547, 3023083, 2885387, 2754783, 2631375, 2514507, 2403944, 2300095, 2203257, 2113229, 2029801, 1952997, 1882584, 1817939, 1758754, 1705109, 1656362, 1610822, 1567376, 1526719, 1489935, 1456582, 1425414, 1396479, 1370991, 1349281, 1330297, 1313248, 1298436, 1286251, 1276512, 1269043, 1263885, 1260763, 1259349, 1260136, 1263838, 1269719]
56116A269719O066N234N251O217O772O432N964N838N971O739Q610J0691J1188
56103A360692R576P313O180O686Q055R046Q963Q521R422J2385J6087J8837K0736
56090A502499K3237K7044L1557L6181M1288M7975N7394O9778Q3628R6596J07819
56079B124996J18537J29842J40860J50110J57363J62951J66349J66890J65006
56070C482904J61285J55108J45726J33988J21635J09562R7965Q7266P7199O6032
56060D638670N2471L7638K3493J0125l580j7463l0465m2857n5851o9388q2468
56049D460325r5313j08812j21937j32033j37874j40344j39942j35939j28465j19298
56039C200368j09869j00265r0759q2554p6110p0296o4072n7815n2265m7215m1959
$$ y = [1269719, 1275785, 1281019, 1286270, 1292487, 1299259, 1305691, 1311655, 1317493, 1323464, 1330203, 1338813, 1349504, 1360692, 1370268, 1377581, 1383761, 1390447, 1398502, 1407548, 1416511, 1425032, 1434454, 1446839, 1462926, 1481763, 1502499, 1525736, 1552780, 1584337, 1620518, 1661806, 1709781, 1767175, 1836953, 1920581, 2017177, 2124996, 2243533, 2373375, 2514235, 2664345, 2821708, 2984659, 3151008, 3317898, 3482904, 3644189, 3799297, 3945023, 4079011, 4200646, 4310208, 4408173, 4495439, 4572638, 4638670, 4691141, 4728779, 4752272, 4762397, 4758817, 4741354, 4710889, 4668032, 4612181, 4542793, 4460325, 4365012, 4256200, 4134263, 4002230, 3864356, 3724012, 3584070, 3448131, 3319666, 3200368, 3090499, 2990234, 2899475, 2816921, 2740811, 2670515, 2606443, 2548628, 2496363, 2449148, 2407189]
56028B407189l6322l0784k6096k2691j9887j6140j0971o012l015j506J82K363
56016B236310M285O276R255J2446J4002J4140J5291J8551K2037K3570K3313K2839
56004B422315K3021K3849K5274K7274K9582L1721L3144L3514L3331L3727L4997
55993B751749L6211L7031L8678M1841M5009M6651M7766N0234N3747N6588N8552
55982C264057O0695O3088O5221O7836P1834P6117P9271Q2452Q7722R4176R8977
55971D111446J01763J04664J08334J11474J14224J18395J23919J28639J32061
55962E154919J36009J41052J45588J49117J53156J58312J63577J69136J76643
55953F547509J86084J95611K05001K15984K28758K41643K54740K70201K88250
$$ y = [2407189, 2370867, 2340083, 2313987, 2291296, 2271409, 2255269, 2244298, 2238286, 2235271, 2233765, 2233947, 2236310, 2240595, 2246871, 2256126, 2268572, 2282574, 2296714, 2312005, 2330556, 2352593, 2376163, 2399476, 2422315, 2445336, 2469185, 2494459, 2521733, 2551315, 2583036, 2616180, 2649694, 2683025, 2716752, 2751749, 2787960, 2824991, 2863669, 2905510, 2950519, 2997170, 3044936, 3095170, 3148917, 3205505, 3264057, 3324752, 3387840, 3453061, 3520897, 3592731, 3668848, 3748119, 3830571, 3918293, 4012469, 4111446, 4213209, 4317873, 4426207, 4537681, 4651905, 4770300, 4894219, 5022858, 5154919, 5290928, 5431980, 5577568, 5726685, 5879841, 6038153, 6201730, 6370866, 6547509, 6733593, 6929204, 7134205, 7350189, 7578947, 7820590, 8075330, 8345531, 8633781]
55944H633781L06748L25428L46548L70460L94639M18099M42772M69482M96954
55935A2204911N25896N59284N96860O33930O67654P00260P34414P70140Q08378
55926A8201727Q52575R04089R60277J019648J084568J156657J234276J317262
55918B6731079J409627J514681J631508J758160J893446K033999K175923K322567
55910D1470990K485520K675687K899484L165318L485357L867771M316816M845072
55902F9212015N474075O213886P051288P968618Q966611J0057298J1241220J2505697
55894A38690708J3844805J5275960J6853135J8689040K0950357K3752903K6950706
55887B75007614K9952662L1766499L1349162K8088961K2083718J4019630M812546
$$ y = [8633781, 8940529, 9265957, 9612505, 9982965, 10377604, 10795703, 11238475, 11707957, 12204911, 12730807, 13290091, 13886951, 14520881, 15188535, 15888795, 16623209, 17393349, 18201727, 19054302, 19958391, 20918668, 21938316, 23022884, 24179541, 25413817, 26731079, 28140706, 29655387, 31286895, 33045055, 34938501, 36972500, 39148423, 41470990, 43956510, 46632197, 49531681, 52696999, 56182356, 60050127, 64366943, 69212015, 74686090, 80899976, 87951264, 95919882, 104886493, 114943791, 126185011, 138690708, 152535513, 167811473, 184664608, 203353648, 224304005, 248056908, 275007614, 304960276, 336726775, 368075937, 396164898, 418248616, 432268246, 437080792]
55880D37080792m636623j3440230k0701293k5709214k8242983k8652965k7614780
55873B88082704k5795211k3687055k1609417j9730531j8073814j6565359j5121755
55866A47499562j3705514j2321186j0994180r759359q646211p661855o794947
55859G7616310o035918n382620m828059m356912l956014l616714l325496l064128
55851D3050449k822028k599061k394385k202373k021863j859361j718904j596263
55843B5836211j486320j388575j301897j220845j141578j065950r96256r30711
55835A6304079q67400q08261p56101p11208o73019o41248o13400n84976n54314
55826A0094152n24004m96078m69284m42441m16667l92566l68814l45136l23574
$$ y = [437080792, 432444169, 419003939, 398302646, 372593432, 344350449, 315697484, 288082704, 262287493, 238600438, 216991021, 197260490, 179186676, 162621317, 147499562, 133794048, 121472862, 110478682, 100719323, 92073112, 84411257, 77616310, 71580392, 66197772, 61369713, 57012801, 53056787, 49440073, 46114577, 43050449, 40228421, 37629360, 35234975, 33032602, 31010739, 29151378, 27432474, 25836211, 24349891, 22961316, 21659419, 20438574, 19296996, 18231046, 17234790, 16304079, 15436679, 14628418, 13872317, 13161109, 12488090, 11846842, 11233442, 10648466, 10094152, 9570148, 9074070, 8604786, 8162345, 7745678, 7353112, 6984298, 6639162, 6315588]
55817F315588l05261k88959k74008k61456k50854k39341k25685k12402k02074
55808D055548j93894j85325j75032j63095j50369j38486j28484j19084j08411
55799B693368r7271q8049q0523p2006o1797n2043m3851l6193k9389k5816k5856
55788B080574k6595k6159k6201k8483l1946l4931l7564m0186m1695m1292l9906
55777A705616l8636l7607l7126l7805l8888l8855l8177l8699l9742l8201l3661
55766A288219k9909k9604l0615k9781k7338k5234k3657k1843k0312j9870j9835
55755A010221j9248j8353j7266j4939j1182p882o399n486l670j936k042l571m665
55742H93582m546l745l013l389n904r758j2333j2464j2135j3412j5416j6183j5818
$$ y = [6315588, 6010327, 5721368, 5447360, 5185904, 4935050, 4695709, 4470024, 4257622, 4055548, 3861654, 3676329, 3501297, 3338202, 3187833, 3049347, 2920863, 2801779, 2693368, 2596097, 2508048, 2427525, 2355519, 2293722, 2241679, 2197828, 2161635, 2132246, 2106430, 2080574, 2053979, 2027820, 2001619, 1973136, 1941190, 1906259, 1868695, 1828509, 1786814, 1745522, 1705616, 1666980, 1629373, 1592247, 1554442, 1515554, 1476699, 1438522, 1399823, 1360081, 1321880, 1288219, 1258310, 1228706, 1198091, 1168310, 1140972, 1115738, 1092081, 1070238, 1049926, 1030056, 1010221, 990973, 972620, 955354, 940415, 929233, 921351, 914952, 909466, 905796, 903860, 901818, 898247, 893582, 889036, 885291, 882278, 878889, 872985, 863227, 850894, 838430, 826295, 812883, 797467, 781284, 765466]
55729G65466j5702j5914j5567j4777j4408j4544j4797j5162j5256j3879j0865
55718F04595q109p156p077o440o012p381r955j1725j2372j3397j5383j7103j7363
55705D65122j6161j3984j1366r102p818p329p153p391q341r670j0680j0904r891
55692C35332p197l253N80L465N749P654Q658Q769R014R660R360P159M003J176
55678D00129j344l810n516o146o704p669p753o187m667n037o503p204p161p359
55664C17069p296o125n173o362q590q809o532m472m323m671l732j777M7J336J862
55649B52452J205pK3K118M904O571O830O560O404O398O201N074K501o77k419j479
55633C02659J153L309L780L117K507K237J523j66k000k690k329k232k736k484
$$ y = [765466, 749764, 733850, 718283, 703506, 689098, 674554, 659757, 644595, 629339, 615460, 604595, 596486, 589330, 582253, 575813, 569801, 562420, 552465, 540740, 528368, 514971, 499588, 482485, 465122, 448961, 434977, 423611, 414509, 406691, 399362, 392209, 384818, 376477, 366807, 356127, 345223, 335332, 328135, 324882, 325462, 328927, 334676, 342330, 350988, 359757, 368771, 378431, 387791, 394950, 398953, 400129, 398785, 394975, 389459, 383313, 376609, 368940, 361187, 355000, 350333, 345296, 338793, 331589, 324428, 317069, 309773, 303648, 298475, 292113, 283523, 274714, 268182, 263710, 259387, 254716, 250984, 249207, 249254, 250590, 252452, 253657, 253650, 253673, 255791, 260695, 267266, 274096, 280656, 287060, 293458, 299659, 304733, 307234, 306557, 304138, 302659, 303812, 307121, 310901, 314018, 316525, 318762, 320285, 320119, 318119, 315429, 313100, 310868, 308132, 305648]
55619C05648n28K082L864M735N138M536K587Q10J147L156M453L774K025L78r06
55604C42899j655j412l52O12R96J166J502J970K501K842K255L39j989l389l731
55589C44554l945m540n420o693q335r418r134q366q765j0448j2120j3270j4399
55576B29701j5069j3748j0194o358m211l973m869o239p237o910n370l884l153
55563A38486k590j691j000j063j628k542m241o482p653o480l770j526p56r72j391
55548I4701j817k365k894k839j799l63N7j092k387k053m68J27j353l361l678j850
55532F6566P76K583K687J227p07j883j996j669j435j271j052p02k0R58J536J150
55516F6748L35lN4o9n0P92J850J831Q71K53M2q75k172j886L70K284K107R17L01
$$ y = [305648, 305120, 307202, 311066, 315801, 320939, 325475, 328062, 328872, 330019, 333175, 337628, 341402, 343427, 343805, 342899, 341244, 339832, 339480, 340092, 341088, 342254, 343756, 345726, 348227, 351069, 353324, 353663, 351674, 348285, 344554, 340609, 336069, 330649, 323956, 315621, 306203, 297069, 288703, 279938, 269490, 257370, 244100, 229701, 214632, 200884, 190690, 184332, 180121, 176148, 171279, 165040, 157803, 150893, 145523, 141639, 138486, 135896, 134205, 133205, 132142, 130514, 127972, 123731, 117249, 109596, 103116, 99346, 97820, 97064, 96092, 94701, 92884, 90519, 87625, 84786, 82987, 82624, 82681, 81589, 79202, 77149, 76681, 76808, 75455, 72094, 68416, 66566, 67342, 69925, 72612, 73839, 73132, 71249, 69253, 67584, 66149, 64878, 63826, 63124, 63104, 64062, 65598, 66748, 67083, 67080, 67134, 67065, 67015, 67807, 69657, 71488, 72359, 72612, 72654, 71779, 69607, 67721, 68091, 70375, 72482, 73399, 73700]
55497G3700j98j480k555j993n16L5m05k82J006K468L189L068K138O47m52l58M03
55480G8415Q47J142J976K793K254M94p15k91R46J748J993K193K416K259J535N53
55464A00558j43k67j89n77j538k491l175l999m998n318m533l658l742m119l335
55449E8476j462j75n75j892k461j307J075K845K195o33l228l620k382j266q42
55434D4748p53j283k636l353j784R71J920K61j659j954j482j490j294K5J355R75
55418C2567o79j520o72O80J003r0j822k816k027K1J348O37j182k307k325k135
55402A8681k131j844j258j146j900k902l334A277c68N9A191J950J400N06k00n40
55386D307l44M73J432J821J475P53j20r97j281m36Q64J134l2j360j595r20j43
$$ y = [73700, 73502, 72022, 69467, 67474, 66958, 66993, 66588, 66306, 67312, 69780, 72969, 76037, 78175, 78822, 78370, 78012, 78415, 79262, 80404, 82380, 85173, 87427, 87921, 87206, 86915, 87861, 89609, 91602, 93795, 96211, 98470, 100005, 100558, 100415, 100148, 99959, 99382, 97844, 95353, 92178, 88179, 83181, 77863, 73330, 69672, 65930, 61811, 58476, 57014, 56839, 56264, 54372, 51911, 50604, 51679, 54524, 56719, 56086, 52858, 49238, 46856, 45590, 44748, 43995, 42712, 40076, 36723, 34939, 35910, 37830, 38091, 36432, 34478, 32996, 31506, 30212, 30237, 31592, 32567, 31888, 30368, 29696, 30376, 31379, 31289, 29467, 26651, 24624, 24645, 25993, 26630, 25448, 23141, 20816, 18681, 16550, 14706, 13448, 12302, 10402, 7500, 4166, 1277, -368, -309, 1191, 3141, 4541, 5047, 4847, 4307, 3963, 4436, 5868, 7689, 9164, 9917, 9797, 8800, 7519, 7083, 7947, 9081, 9049, 7689, 6094, 5174, 5031]
55369E031N83J374J690R04m74j176p82m4L01K24k20j104j872j271J080L583M091
55352A1918K407N16J29Q13R21j66j506j998j561q02j97K4k04m96p0J221K190J583
55334A4722r5r97m28K31l24j293j084Jj7j881l908F40b704k532k018o69J741b629
55315C86L78a658l740l355j853L12K632c611i2A131a50k552k563k089j472n78
55299i404L03N56K51J54M71M85j87q83r32o53n71l89M15J425J749J241M45l74
55281e898j164j381m78R78J740J511J088Q97N24p0j87L41O81M06K36a88C79b45
55262b357k408j319K70J860g36B669J631j055H31h56k96L32K35q7p51j686j958
55245e067r41O55J766a373H56J603M01k29N96J844J688Q6j282j573j643C49a309
$$ y = [5031, 5614, 6988, 8678, 9582, 9108, 7932, 7150, 7106, 7407, 7631, 7411, 6307, 4435, 3164, 4244, 7827, 11918, 14325, 14841, 14970, 15783, 16704, 16538, 15032, 13034, 11473, 10671, 10474, 10498, 10294, 9798, 9728, 10949, 13139, 14722, 14627, 13630, 13202, 13433, 13109, 11816, 10732, 10733, 10716, 8835, 4927, 640, -2704, -5236, -7254, -7923, -6182, -2629, 386, 764, -1658, -5398, -8753, -10606, -10294, -7662, -3611, -92, 1131, -150, -2702, -5265, -7354, -8826, -9404, -9101, -8545, -8294, -8140, -7669, -7184, -7371, -8254, -9186, -9839, -10410, -10799, -10384, -8959, -7210, -5969, -5524, -5898, -7062, -8443, -8921, -7943, -6203, -4692, -3604, -2707, -2183, -2253, -2440, -2099, -1418, -1012, -776, -188, 379, -245, -2357, -4765, -6084, -5814, -3954, -736, 2669, 4300, 3245, 831, -856, -1152, -820, -585, -672, -1423, -3109, -5067, -6008, -5353, -3587, -1373, 856, 2459, 2860, 2631, 3227, 5071, 6759, 6845, 5563, 3990, 2347, 349, -1309]
55227a286D93K001R37P5j15m21j149B48i14k60e12I37J794J240K9q77r84p84E32
55207d22q90p05l70M02g08C73b47k307j994L12a691A357K235J579J725K013J586
55190A0495N15l18m75p26k001l709b05k108L65c68A300J876K207J490l62j918
55174D593k290B66a211K20B182N385M789K178M58J102K612K669P51j732l074k583
55158A4737q08R79J681J166J67n06n33n3M57L45n39j172j60K272L808K411j003
55141B3249l387l101j463m03J35J247K609K686J279l2k96m44j362k198j802o87
55125A6030j41j87PL17j58j267j804j333n83N0R35J915K154J661J518J915J511
55108B2540l19j939j463N64J817J008j048k794l305k557j237l17k31n03m01K86
$$ y = [-1286, 493, 2494, 3431, 3506, 3391, 2970, 1821, 248, -914, -1174, -512, 937, 2731, 3971, 4000, 3123, 2139, 1355, 532, -422, -1312, -2017, -2387, -1985, -708, 373, -247, -2554, -4548, -4236, -1691, 1357, 3592, 5171, 6896, 8909, 10495, 11010, 10692, 10217, 9491, 7490, 3781, -205, -2313, -1948, -368, 1300, 3176, 5383, 6873, 6511, 4593, 2303, 266, -1211, -991, 2182, 7567, 12356, 14534, 14992, 16094, 18706, 21375, 22126, 20394, 17320, 14737, 13929, 14908, 16589, 17755, 17922, 17416, 16883, 16830, 17287, 17632, 17093, 15921, 15761, 18033, 21841, 24252, 23249, 19862, 16761, 15298, 14895, 15030, 16277, 18886, 21572, 22851, 22819, 22523, 22079, 20717, 18519, 16717, 16030, 15889, 15702, 15709, 16026, 15868, 14601, 12797, 11464, 10881, 10931, 11866, 13781, 15935, 17596, 19114, 21029, 22540, 22221, 20282, 18819, 19383, 21200, 22208, 21160, 18366, 15061, 12504, 11267, 10950, 10719, 10216, 9815, 10101]
55092A0101J347K451L022K531J346N66N58L59p46j915j802l33J390K371K216R90
55076B4452o43j691k031k522l283k957p85J808L150L768N054O344N714L266J262
55061D0906P90N98k67r68p96n30o93l79Q55J460K3k313l246k323r31M4Q38J412
55043C4480J160J63n49l83K02O29R28J226J325J188J300K043L026L386K692J380
55027E4196L65J49M47O68O56P23J042J473J916K378K640K531K489L044L641L008
55011H1366J082n72q72o04q44j176p66j96n67j385j179M0P70N78P55J918K689
54994H1037J744k25j628j946j547m91J137K397K305J240M72M47M66m4q65j590
54978H2909k116k360k135j441m37P28J663J601K35j422j837o73R28J748J498N04
$$ y = [10101, 11448, 13899, 16921, 19452, 20798, 21364, 21922, 22281, 21535, 19620, 17818, 17485, 18875, 21246, 23462, 24452, 23809, 22118, 20087, 17565, 14282, 11325, 10540, 12348, 15498, 19266, 24320, 30664, 36378, 39644, 40906, 41696, 42294, 42027, 41059, 40263, 39733, 39040, 38661, 39516, 40976, 40999, 38686, 35440, 33117, 32186, 32230, 33068, 34480, 35640, 35803, 35254, 34871, 35073, 35702, 36630, 37856, 39181, 40369, 41669, 43712, 46738, 50124, 52816, 54196, 54561, 54710, 55157, 55825, 56481, 57204, 58246, 59719, 61635, 64013, 66653, 69184, 71673, 74717, 78358, 81366, 82448, 81876, 81004, 80400, 79556, 78380, 77614, 77418, 76851, 75466, 74287, 74327, 75097, 75675, 76430, 78348, 81037, 82781, 82556, 80928, 78982, 77435, 76944, 78081, 80478, 82783, 84023, 84495, 84942, 85408, 85364, 84499, 82909, 80793, 78433, 76298, 74857, 74420, 75148, 76811, 78412, 78647, 77225, 75388, 74715, 75643, 77391, 78889, 79393]
54962G9393p40j518j291m63K1Q2O29J854K418J254o28j253k37Q09M01j193k544
54945G6994k638j669o87o54j610k825l745m374m514l407q61J859L219L185K861
54930F1134K726K308J546J125J251J274R05P50J139J535J586J730K072J830Q10
54915H3721L47J579L592M626M441M122M006L584L292M516P223R183Q566O364N176
54900A54338O140Q076R315R522R579J0307J1597J2760J3476J4128J5047J5718
54888B90003J5249J3545J1311Q804N284K12n513j0055j2321j2741j2518j2483
54876B78777j2756j3199j3786j4278j3823j1536p829m748m254o211q540r238p853
54863A50726n219k583r65m70P3K041N224P825Q587Q208Q077Q468Q737Q785R266
$$ y = [79393, 78653, 77135, 75844, 75381, 75402, 75484, 76113, 77967, 80385, 81639, 81011, 79758, 79521, 80330, 80731, 79538, 76994, 74356, 72687, 72000, 71346, 69736, 66911, 63166, 58792, 54278, 50871, 50010, 51869, 55088, 58273, 61134, 63860, 66168, 67714, 68839, 70090, 71364, 72269, 73019, 74158, 75693, 77279, 79009, 81081, 82911, 83721, 84068, 85647, 89239, 93865, 98306, 102428, 106434, 110018, 113310, 117826, 125049, 134232, 142798, 149162, 154338, 160478, 168554, 177869, 187391, 196970, 207277, 218874, 231634, 245110, 259238, 274285, 290003, 305252, 318797, 330108, 338912, 344196, 344408, 338895, 328840, 316519, 303778, 291260, 278777, 266021, 252822, 239036, 224758, 210935, 199399, 191570, 186822, 182568, 176357, 167817, 158579, 150726, 145507, 142924, 141959, 141489, 141562, 143603, 148827, 156652, 165239, 173447, 181524, 189992, 198729, 207514, 216780]
54848B16780J0502J1998J3011J3002J1696R363O966N317L925J310l199q442j2438
54835B79791j4165j4296j4355j5137j5841j4877j1855q416o574o503o753o407
54823A44612n943n811n433m371l429l539m047l407j367M98O49q67k799l947l871
54808I6928l147k968l933n005m586k693j092p66m87J056K778K421j11k315k221
54793G3859n46P36P28k46j750l315l990l054j113L59O60L61J71K6l98r02r94o30
54775E9962k22j9J49M29O95R19J435K357K978K489J314Q99J822K967L291L497
54759H4962M716O140N788L534J670J872L164L747L461L274L469L765M415N766
54745A39743P254Q204R143J0929J2927J3653J3104J2908J3969J5466J6404J6678
$$ y = [216780, 227282, 239280, 252291, 265293, 276989, 286352, 293318, 298635, 302560, 303870, 300671, 292229, 279791, 265626, 251330, 236975, 221838, 205997, 191120, 179265, 170849, 164275, 157772, 151019, 144612, 138669, 132858, 127425, 123054, 119625, 116086, 112039, 108632, 107265, 107763, 108412, 107545, 104746, 100799, 96928, 93781, 90813, 86880, 81875, 77289, 74596, 73504, 72738, 72251, 73307, 76085, 78506, 78395, 76080, 73859, 73313, 74049, 74777, 74531, 72781, 69466, 65476, 62422, 61309, 61668, 62328, 62689, 62860, 62886, 62488, 61586, 60592, 59962, 59740, 59721, 59870, 60299, 60994, 61913, 63348, 65705, 68683, 71172, 72486, 73385, 75207, 78174, 81465, 84962, 89678, 95818, 101606, 105140, 106810, 108682, 111846, 115593, 119054, 122328, 125797, 129562, 133977, 139743, 146997, 155201, 164344, 175273, 188200, 201853, 214957, 227865, 241834, 257300, 273704, 290382]
54733B90382J6073J3777R847N874L186J229j198l904n741o507p170q306r421r991
54719B88130j0254j0589j0780j0317r112p470n551l317j073K30j88j784k759j692
54705B13474R75L514M787N200N825P118Q637R707J0189J0764J2365J5015J7366
54692C24936J7829J6123J3410J1027R528Q705P872O115K954j138n269r070j2532
54679C90490j5136j6141j5854j5545j5831j5978j5244j4001j3018j2337j1531
54668B29874j0462r211p805o585o295p102q092q231p474o343m898k971j062o3
54654A43280j52n82o80n54o85j211j743j732r74J32Q65Q48K89k70k91M94J710
54637A38744K271J347n27j883j893j011P6J204K237K611K039J144P66R68J062
$$ y = [290382, 306455, 320232, 330079, 335953, 339139, 340368, 339170, 335266, 329525, 323018, 315848, 307542, 298121, 288130, 277876, 267287, 256507, 246190, 237078, 229608, 224057, 220740, 219667, 219897, 219709, 217925, 215166, 213474, 214449, 217963, 222750, 227950, 233775, 240893, 249530, 259237, 269426, 280190, 292555, 307570, 324936, 342765, 358888, 372298, 383325, 392853, 401558, 409430, 415545, 418499, 417361, 412092, 403022, 390490, 375354, 359213, 343359, 327814, 311983, 296005, 280761, 266760, 253742, 241405, 229874, 219412, 210201, 202396, 195811, 189516, 182414, 174322, 166091, 158617, 152274, 147376, 144405, 143343, 143280, 143128, 142546, 141866, 141312, 140627, 139416, 137673, 135941, 134967, 135099, 135964, 136812, 137101, 136831, 136540, 137034, 138744, 141015, 142362, 141835, 139952, 138059, 137048, 137124, 138328, 140565, 143176, 145215, 146359, 147125, 148093, 149155]
54622A49155M14r60k225k164l04K344M278N104N325M890L381J677J647L568N423
54607A81553N746N523O076O676N903M187L180L346L994M978O490P612P054N312
54593B57630M272M614N264N460N672O181O332N751M967M300L414K437K330L485
54579C22109M954N705N783N740N689N357M379K208j393n436q152q781q263p885
54565C22014q045q609r538j0599j1108j0529q965o906m986l895l727l494k196
54552B29417m42J89n90j455j640j819k209j523J034L930M864L429J071q73j979
54537B31404k288k310l052m875o605o873n998n451n655n531m400l195l214m405
54523A67552n314m603k519q85j459m011o363o691n371m083l565l145k243j279
$$ y = [149155, 149569, 148609, 146384, 144220, 143916, 146260, 150538, 155642, 160967, 165857, 169238, 170915, 172562, 176130, 181553, 187299, 192822, 198898, 205574, 211477, 215664, 218844, 222190, 226184, 231162, 237652, 245264, 252318, 257630, 261902, 266516, 271780, 277240, 282912, 289093, 295425, 301176, 306143, 310443, 313857, 316294, 318624, 322109, 327063, 332768, 338551, 344291, 349980, 355337, 359716, 361924, 360531, 355095, 346943, 338162, 329899, 322014, 313969, 305360, 295822, 285223, 274115, 263586, 254621, 247715, 242729, 238834, 235107, 231613, 229417, 228975, 229164, 228574, 227119, 225479, 223660, 221451, 219928, 220962, 224892, 229756, 233185, 234256, 233383, 231404, 229116, 226806, 223754, 218879, 212274, 205401, 199403, 193952, 188297, 182766, 178366, 175171, 171957, 167552, 162238, 157635, 155116, 154231, 152772, 148761, 142398, 135707, 130336, 126253, 122688, 119543, 117300, 116021]
54509A16021q46p92o39m38o49j299j693j163Q7J048R71K23j53K77Q06M76p75k020
54491A09442k202j123L33R24L19n66p01j33M58J005J927K919L010K152J722K774
54475A22260M674N989O103N306L994K619J900K229L087L531L100J921M08p88j133
54460A65200r95j439k699l562k978j645j128j969l465m844n784o085n766n294
54446A17547m984m518l575k491j538k15J747L296L124J491j37q98q34N3J573K546
54430A12187J936P41J044K944M240L664K608K731L536L579K779K084J765J413
54416A47251J039Q80O61K06K87J566L021K909J201k50j28Q97J517J400R96O20
54400A64073L75K66j03j256k676k740p37J573J624q55l440l896k420p67o6k77
$$ y = [116021, 115175, 114383, 113744, 113306, 112657, 111358, 109665, 108502, 108589, 109637, 110608, 110831, 110678, 110955, 111761, 112237, 111462, 109442, 107240, 106117, 106450, 107374, 107693, 107127, 106426, 106293, 106751, 107756, 109683, 112602, 115612, 117764, 119486, 122260, 126934, 132923, 139026, 144332, 148326, 150945, 152845, 155074, 158161, 161692, 164792, 166713, 167121, 166333, 165200, 164205, 162766, 160067, 156505, 153527, 151882, 150754, 148785, 145320, 140476, 134692, 128607, 122841, 117547, 112563, 108045, 104470, 101979, 100441, 100226, 101973, 105269, 108393, 109884, 109747, 108849, 108015, 108068, 109641, 112187, 114123, 114864, 115908, 118852, 123092, 126756, 129364, 132095, 135631, 139210, 141989, 144073, 145838, 147251, 148290, 149170, 149831, 150037, 150324, 151890, 154911, 157820, 159021, 158771, 158643, 159540, 161057, 162457, 163453, 164073, 164448, 164714, 164611, 163355, 160679, 157939, 157202, 158775, 160399, 159544, 156104, 152208, 149788, 149021, 148955, 148678]
54384A48678r89j809k341k505k759l286l289k020k36M37k83r86p30l44q15j479
54368A25244j004M64J380Q84k50p85l28O81J580J884J510R35P89J277K023K418
54352A38702K033J036L34Q42K310L496L768L849M400M811M339L624L766M440M415
54337A86165L742L813N107O354O345N354M243L360K843L016L671L749K323m28
54323B39657l513n709o032m597l218l838o054p386o503m653l379k478j437j237
54309A79623k829m896n035k823p3J640K188J839O26j039k384l106l238k424n40
54294A57529J154J110j70m51J156K976L300K660K518K995L169K865K708K746K337
54279A88602J375O59Q45J729K723L434L660L273K335J108j80j301j941j962j800
$$ y = [148678, 147689, 145880, 143539, 141034, 138275, 134989, 131700, 129680, 129444, 129881, 129598, 128612, 127882, 127538, 126723, 125244, 124240, 124704, 126084, 126968, 126718, 125933, 125605, 126286, 127866, 129750, 131260, 132195, 132984, 134261, 136284, 138702, 140735, 141771, 142105, 142947, 145257, 148753, 152521, 156370, 160770, 165581, 169920, 173544, 177310, 181750, 186165, 189907, 193720, 198827, 205181, 211526, 216880, 221123, 224483, 227326, 230342, 234013, 237762, 240085, 239657, 236144, 230435, 224403, 219806, 216588, 212750, 206696, 199310, 192807, 188154, 184775, 182297, 180860, 179623, 176794, 171898, 166863, 164040, 163967, 165607, 167795, 169634, 170260, 169221, 166837, 163731, 160493, 158069, 157529, 158683, 159793, 159623, 159172, 160328, 163304, 166604, 169264, 171782, 174777, 177946, 180811, 183519, 186265, 188602, 189977, 190636, 191481, 193210, 195933, 199367, 203027, 206300, 208635, 209743, 209563, 208262, 206321, 204359, 202559]
54264B02559k141l072l873l920l562l703m550n212m807l699l185l958n319o074
54250A45484n878n218m498l713k930k525k620k761k465j892j645j943k233j797
54236A03366p07k6q53k998m885m920k932j66J893K503J755K88j150k072k382k087
54220H4627j229k05K09l09j046r90K7J413K706L760M189L469J779R1p65o17L64
54203I7473J775K768K552J512R94J518K017J347jn69M4O82J41j357k414j990n95
54186A05897J80o03k120k761j985o99O7Np61j805k014l76K282L409J625j414k901
54169I6026k020j12J567K859L673L464K119N30k78k06m3n41j496j796p17Q05R92
54152A04826m41j698j293O2Q91J046J135Q67k37j233q25K93K18j140j883j135
$$ y = [202559, 200418, 197346, 193473, 189553, 185991, 182288, 177738, 172526, 167719, 164020, 160835, 156877, 151558, 145484, 139606, 134388, 129890, 126177, 123247, 120722, 118102, 115341, 112876, 110984, 109339, 107396, 105163, 103366, 102659, 102633, 101780, 98782, 93897, 88977, 86045, 85879, 87772, 90275, 92030, 92318, 91168, 89096, 86714, 84627, 83398, 83193, 83402, 83093, 82047, 81057, 81084, 82497, 85203, 88963, 93152, 96621, 98400, 98491, 97726, 97109, 97473, 99248, 102016, 104568, 106080, 107074, 108592, 110609, 111956, 111955, 111386, 111430, 112112, 112253, 110896, 108482, 106492, 105897, 106077, 105474, 103354, 100593, 98608, 97909, 97976, 97981, 97220, 95415, 93401, 93025, 95307, 98716, 100341, 98927, 96026, 94006, 93894, 95461, 98320, 101993, 105457, 107576, 108106, 107828, 107622, 107579, 107038, 105542, 103746, 103029, 103834, 104826, 104385, 102687, 101394, 101456, 102347, 103393, 104528, 105395, 105158, 103925, 103100, 103393, 103611, 102471, 100588, 99453]
54136I9453q8L74R13J828K031J030K5k90j100l056m210k489Q95K655J434j187
54120I8218l175l736k950j489o20r96j557r74J71K10q89j386m85O28P98L93J08
54103H2269k78j092j682j156L81J900K436J851R78R67J964K644J851K73m49K6
54087I2883O56Q10P23K98p49j595j089p4p37k915l627j501P71M24j110p05J301
54070H3764J735j83j691r70K56j01j212j054K01O07m72j456p69J274K973K977
54054H5879J371m75j203p67l22o00r41l46Q82J419O78m18o71K0Q22J034N90k02
54036H6750r21j086n72P8J40l11m12K52R67R01K96l1m0l99j198j616j132k36L58
54017H1788N83O31M17r6n21n17k23J99Q39J448J236k0j241j228j72Q17J278J587
$$ y = [99453, 99365, 99739, 100652, 102480, 104511, 105541, 105566, 105276, 104176, 101120, 96910, 94421, 95316, 97971, 99405, 98218, 95043, 91307, 88357, 86868, 86248, 85252, 83695, 82721, 82892, 83102, 82213, 80827, 80342, 80970, 81768, 82161, 82269, 81991, 80899, 79217, 78061, 78442, 80342, 82778, 84629, 85607, 86574, 88538, 91182, 93033, 93306, 92857, 92883, 93539, 94349, 95072, 95370, 94621, 93026, 91937, 91863, 91126, 88211, 84584, 83083, 83854, 84278, 83168, 82463, 83764, 85499, 85316, 83625, 82655, 82911, 82810, 81598, 80544, 80745, 81352, 80880, 79424, 78655, 79929, 82902, 85879, 87250, 86775, 85572, 84805, 84483, 83883, 82942, 82596, 83478, 84897, 85575, 85157, 84486, 84506, 85328, 86362, 86952, 86750, 85829, 84743, 84171, 84249, 84389, 84078, 83666, 83918, 84885, 85786, 86082, 86051, 86011, 85612, 84414, 82798, 81666, 81430, 81788, 82371, 83002, 83419, 83323, 82802, 82285, 82062, 82261, 83100, 84548, 85784, 85764, 84523, 83295, 83123, 83940, 85218, 86805]
53999H6805J791J485Q86R02J852K907L266L054K643J824L98q96r15M41J934K396
53983A10773K028J988K870L972M322L904L523L594L835M108M796N878O575O555
53969A68721O781Q124R649R573P806O305O575P945Q807Q586P752O699N574M932
53955B73829N446O768P353O042L618K270L233N184N570L431L58j671k536l485
53941C15410m963o084o080n328m678m518m757n168n453n462n375n299m807l603
53927B43835k493k749m374n880o076n205m011k714j460r16j505k627l375l598
53913A96852l613l331k379q46P27J749J669K29j762k442o22K696N190N483M145
53898B03745K700K223K661L004K341J035M44J075J848J815J692K612M097M732
$$ y = [86805, 88596, 90081, 90967, 91869, 93721, 96628, 99894, 102948, 105591, 107415, 107813, 106917, 106002, 106443, 108377, 110773, 112801, 114789, 117659, 121631, 125953, 129857, 133380, 136974, 140809, 144917, 149713, 155591, 162166, 168721, 175502, 183626, 193275, 202848, 210654, 216959, 223534, 231479, 240286, 248872, 256624, 263323, 268897, 273829, 279275, 286043, 293396, 299438, 303056, 305326, 308559, 313743, 319313, 322744, 323102, 321431, 318895, 315410, 310447, 304363, 298283, 292955, 288277, 283759, 279002, 273834, 268381, 262919, 257544, 252245, 247438, 243835, 241342, 238593, 234219, 228339, 222263, 217058, 213047, 210333, 208873, 207957, 206452, 203825, 200450, 196852, 193239, 189908, 187529, 186683, 187410, 189159, 190828, 191057, 189295, 186853, 186231, 188927, 194117, 199600, 203745, 206445, 208668, 211329, 214333, 216674, 217709, 218153, 219228, 221076, 222891, 224583, 227195, 231292, 236024]
53884B36024M465M636N710O547O152M865L405K041J174J545L142M882N887O153
53870B96628N628L932J602J88J72J66p25j180J43K018K383J627J816L058L345
53855C20801K248K118M579P969R619R101P776O600N915O271P742R069Q992P982
53841D16782P263O829N812M364L443L064K394J455R52M22j478m466o356o001m798
53826D29681m334m265l854l982n809q360r400q426p125o961p668q286q454q401
53812C34356q482q904r324q931p581o496o893q220q779p959o664n635m730m027
53798B31731m144m964n336m739m041l907l559k255r66j136k396k935k078j092
53784A88183j199k031k622k914l510m424m941m622l734k627j268K85J411J482
$$ y = [236024, 240489, 245125, 250835, 257382, 263534, 268399, 271804, 273845, 275019, 276564, 279706, 284588, 290475, 296628, 302256, 306188, 307790, 307978, 308150, 308316, 307591, 306411, 306554, 308572, 310955, 312582, 314398, 317456, 320801, 323049, 325167, 329746, 337715, 347334, 356435, 364211, 370811, 376726, 382997, 390739, 399808, 408800, 416782, 424045, 430874, 436686, 441050, 444493, 447557, 449951, 451406, 452358, 452780, 451302, 446836, 440480, 434479, 429681, 425347, 421082, 417228, 413246, 407437, 399077, 389677, 381251, 374126, 367165, 359497, 351211, 342757, 334356, 325874, 316970, 307646, 298715, 291134, 284638, 277745, 269525, 260746, 252787, 246123, 240488, 235758, 231731, 227587, 222623, 217287, 212548, 208507, 204600, 201041, 198786, 197820, 196684, 194288, 191353, 189275, 188183, 186984, 184953, 182331, 179417, 175907, 171483, 166542, 161920, 158186, 155559, 154291, 154576, 155987, 157469]
53770A57469Q44N88J131J523N84j411k888k713j417m48n50j045o08J369L967N360
53754A61755M440J890m47j213m13J122K616L696M281M382M030L346K834L280M939
53739B00538O892P650O604M676L470L849N204O058N622M764N036O482P245N906
53725B79996L464K010K091K652L154M058N191N348M153K774J994R05j317l436
53711C13037l455j330Q70J424M83o82j099p20m64j544m183o926p885o735m969
53696B75822m222m680n213m571k490J2J420J028n40k173l322l925l769k560n38
53681B40279J466K680K825K018O48o37j190q59k28k57j443l139l911l039j476
53666B33737p49j041j162m57L20M25K54L07L1j265k861l308k358j139m92n7P51
$$ y = [157469, 158313, 158901, 160032, 161555, 162139, 160728, 157840, 155127, 153710, 153262, 152712, 151667, 151059, 152428, 156395, 161755, 166195, 168085, 167638, 166425, 166012, 167134, 169750, 173446, 177727, 182109, 186139, 189485, 192319, 195599, 200538, 207430, 215080, 221684, 226360, 229830, 233679, 238883, 244941, 250563, 255327, 260363, 266845, 274090, 279996, 283460, 285470, 287561, 290213, 293367, 297425, 302616, 307964, 312117, 314891, 316885, 317790, 316473, 313037, 309582, 308252, 309122, 310546, 311029, 310347, 309248, 308528, 308064, 306520, 302337, 295411, 287526, 280791, 275822, 271600, 266920, 261707, 257136, 254646, 254658, 256078, 257106, 256566, 254393, 251071, 247146, 243377, 240817, 240279, 241745, 244425, 247250, 249268, 249916, 249279, 248089, 247230, 247002, 246745, 245302, 242163, 238252, 235213, 233737, 232988, 231947, 230785, 230328, 230648, 231073, 231327, 231634, 231665, 230400, 227539, 224231, 221873, 220734, 220242, 220185, 220936]
53649B20936J723K245K215K217K803L781M354M231M333N680P458P355M481J017
53635B74829j08J442L623N038O294Q208J0091J0500R075O891N313M860N119N494
53621C56669N848O257O456O078N457N283N336M618L213K710L731M283K169j804
53607D16304m644m865l589k218r18L45J041R33N32Q7p23j826k572k797k886k548
53591C89656j024J058J740N03o62j11R61M18j593l159l548l697l932l201j101
53576C72308R00J216K08l59L52J352J221N4n26O48K723L836L517L206M002N002
53560C99660M753L552L006L528L754K829J981K885N168O688O225M895M591N700
53546D59215P054P716Q038Q765R806J0320R720Q208O537N565N869P305R029J0188
$$ y = [220936, 222659, 224904, 227119, 229336, 232139, 235920, 240274, 244505, 248838, 254518, 261976, 269331, 273812, 274829, 274721, 276163, 279786, 284824, 291118, 299326, 309417, 319917, 328992, 335883, 341196, 346056, 351175, 356669, 362517, 368774, 375230, 381308, 386765, 392048, 397384, 402002, 405215, 407925, 411656, 415939, 418108, 416304, 411660, 406795, 403206, 400988, 400070, 400415, 401456, 402389, 402921, 403008, 402285, 400459, 397887, 395090, 392204, 389656, 388632, 389690, 391430, 391933, 391271, 391160, 392121, 392539, 390946, 387787, 384239, 380542, 376610, 373409, 372308, 373208, 374424, 374632, 374273, 374625, 375977, 377198, 377252, 376726, 377374, 380097, 383933, 387450, 390656, 394658, 399660, 404413, 407965, 410971, 414499, 418253, 421082, 423063, 425948, 431116, 437804, 444029, 448924, 453515, 459215, 466269, 473985, 482023, 490788, 500594, 510914, 520634, 528842, 535379, 540944, 546813, 554118, 563147, 573335]
53532E73335J0570J0382R810R086Q616Q562Q527Q195P984Q443R305R769R515Q773
53518G00872P686O461N924O886Q894J0454J0612R535P622N165K892J793K008K737
53504G89541L434M068M206L293K085K256L858M751L597J971K070L481L993K916
53490H35520J753J757K437K700K272J558J021R57J319J646J578J410J682K381
53476H59991L117L772M436M951N146N287N631N814N350M501L990M082M669N940
53462I26677Q147J0884J3371J5266J6526J6832J6141J5428J5845J7266J8761K0371
53450A111515K3004K6514K9350L0704L1674L3519L5753L6995L7011L6920L7827
53439A470786L9922M2715M5378M7138M7939M8650N0187N2565N5100N7231N8682
$$ y = [573335, 583905, 594287, 604097, 613183, 621799, 630361, 638888, 647083, 655067, 663510, 672815, 682584, 692099, 700872, 708558, 715019, 720943, 727829, 736723, 747177, 757789, 767324, 774946, 780111, 783003, 784796, 786804, 789541, 792975, 797043, 801249, 804542, 806627, 808883, 812741, 817492, 821089, 823060, 825130, 828611, 832604, 835520, 837273, 839030, 841467, 844167, 846439, 847997, 849018, 849975, 851294, 852940, 854518, 855928, 857610, 859991, 863108, 866880, 871316, 876267, 881413, 886700, 892331, 898145, 903495, 907996, 911986, 916068, 920737, 926677, 934824, 945708, 959079, 974345, 990871, 1007703, 1023844, 1039272, 1055117, 1072383, 1091144, 1111515, 1134519, 1161033, 1190383, 1221087, 1252761, 1286280, 1322033, 1359028, 1396039, 1432959, 1470786, 1510708, 1553423, 1598801, 1645939, 1693878, 1742528, 1792715, 1845280, 1900380, 1957611, 2016293]
53428B016293N9170N8671N7875N7766N8515N9147N8533N6604N4546N3832N4983
53417B645935N7107N8676N8785N7614N5780N3693N1677N0168M9228M8179M6304
53406C233146M3918M2071M0963L9335L6044L1789K8513K6907K5445K2315J7771
53395C588217J3709J1191R331O860L769P65k239o108j1021j5904j9607k2130k4311
53382C532522k6706k9249l1922l5099l8890m2445m4616m5417m6200m7902m9710
53371C094366n0200m9416m8755m8797m8578m7302m5588m4161m2474l9776l6770
53360B592549l4814l3811l2351k9780k6819k3975k0789j7140j3833j1227q284
53349B339726m030Q70N055Q399J1946J6146K0329K3884K7010L0092L3178L6404
$$ y = [2016293, 2075463, 2134134, 2192009, 2249775, 2308290, 2367437, 2425970, 2482574, 2537120, 2590952, 2645935, 2703042, 2761718, 2820503, 2878117, 2933897, 2987590, 3039267, 3089435, 3138663, 3186842, 3233146, 3277064, 3319135, 3360098, 3399433, 3435477, 3467266, 3495779, 3522686, 3548131, 3570446, 3588217, 3601926, 3613117, 3622448, 3629308, 3633077, 3633842, 3631603, 3625495, 3614474, 3598570, 3578963, 3556833, 3532522, 3505816, 3476567, 3444645, 3409546, 3370656, 3328211, 3283595, 3238178, 3191978, 3144076, 3094366, 3044166, 2994750, 2945995, 2897198, 2848620, 2801318, 2755730, 2711569, 2669095, 2629319, 2592549, 2557735, 2523924, 2491573, 2461793, 2434974, 2410999, 2390210, 2373070, 2359237, 2348010, 2339726, 2335696, 2336566, 2341621, 2350020, 2361966, 2378112, 2398441, 2422325, 2449335, 2479427, 2512605, 2549009]
53337B549009M0202M4592M8793N2082N4707N7487O0742O4129O7372P0602P4027
53326C183744P7715Q1726Q6022R0188R3743R6771R9754J02663J04900J06417J08061
53315D231704J10232J12047J12709J12992J14128J15638J15741J13861J11208
53306E250260J08686J05764J02056R8343R4991R0679Q4123P6197O8830O2348N5481
53295F197758M7670L9878L3039K6938K0763J3653M785n876j6696k5624l2701m0087
53283F263500m9118n8608o6877p4229q2151r0797r8666j04488j08208j10235j10864
53272E309259j10712j10634j10824j10594j09632j08820j09192j10435j11045
53263D317371j09899j07096j03298r8932r4307q9932q6118q2489p8434p4039p0039
$$ y = [2549009, 2589211, 2633803, 2682596, 2734678, 2789385, 2846872, 2907614, 2971743, 3039115, 3109717, 3183744, 3261459, 3343185, 3429207, 3519395, 3613138, 3709909, 3809663, 3912326, 4017226, 4123643, 4231704, 4341936, 4453983, 4566692, 4679684, 4793812, 4909450, 5025191, 5139052, 5250260, 5358946, 5464710, 5566766, 5665109, 5760100, 5850779, 5934902, 6011099, 6079929, 6142277, 6197758, 6245428, 6285306, 6318345, 6345283, 6366046, 6379699, 6384484, 6378608, 6361912, 6336288, 6303587, 6263500, 6214382, 6155774, 6088897, 6014668, 5932517, 5841720, 5743054, 5638566, 5530358, 5420123, 5309259, 5198547, 5087913, 4977089, 4866495, 4756863, 4648043, 4538851, 4428416, 4317371, 4207472, 4100376, 3997078, 3898146, 3803839, 3713907, 3627789, 3545300, 3466866, 3392827, 3322788]
53252C322788o6780o3633n9698n4820m9700m5169m1446l8023l4253l0173k6561
53241B812532k3822k1143j7442j3053r579p822o788n099k634pK783O153R752J2494
53227B736325J3834J4449J5527J7791K1116K4739K7893L0557L3307L6259L8684
53216C010481M0068M1013M2426M4256M5650M6071M5626M4643M3565M2900M2619
53205C489318M1969M0544L8984L7728L5822L2269K8043K5176K3751K1551J7120
53194C832275J1749P520M513J056l786r015j3075j5797j8660k3110k8800l4035
53182C710835l7975m1670m6262n0990n4060n5114n5527n6431n7720n8918n9786
53171C136382n9910n9060n8144n8433n9467n9151n6618n3630n2262n2307n2063
$$ y = [3322788, 3256008, 3192375, 3132677, 3077857, 3028157, 2982988, 2941542, 2903519, 2869266, 2839093, 2812532, 2788710, 2767567, 2750125, 2737072, 2727493, 2719671, 2712883, 2707784, 2705150, 2705143, 2707926, 2714079, 2723831, 2736325, 2750159, 2764608, 2780135, 2797926, 2819042, 2843781, 2871674, 2902231, 2935538, 2971797, 3010481, 3050549, 3091562, 3133988, 3178244, 3223894, 3269965, 3315591, 3360234, 3403799, 3446699, 3489318, 3531287, 3571831, 3610815, 3648543, 3684365, 3716634, 3744677, 3769853, 3793604, 3815155, 3832275, 3844024, 3851544, 3856057, 3857113, 3853327, 3844312, 3831237, 3815440, 3796780, 3773670, 3744870, 3710835, 3672860, 3631190, 3584928, 3533938, 3479878, 3424764, 3369237, 3312806, 3255086, 3196168, 3136382, 3076472, 3017412, 2959268, 2900835, 2841368, 2782217, 2725599, 2671969, 2619707, 2567400, 2515337]
53160B515337n0894m9709m9311m9258m8447m6315m3420m0937l9437l8333l6958
53149B022318l5710l5223l4924l3699l1951l1256l1802l2011l1191l0763l1791
53138A661997l3157l3409l2985l2996l3149l2578l1627l1056l0387k8867k7377
53127A314409k7447k8737k9486k9181k8990k9476k9758k9225k8446k7956k7491
53116I98216k6885k6477k6192k5325k3684k1994k0921k0464k0523k0930k0912
53105G43909j9746j8126j7608j8245j8296j6727j4636j3327j2467j1280j0299
53094E73152j0392j0936j0576r388q691q867q857p945o768o129n959n942o132
53081D66570o306n646l931k465k654m004m606l663k521k689l834m326l310j414
$$ y = [2515337, 2464443, 2414734, 2365423, 2316165, 2267718, 2221403, 2177983, 2137046, 2097609, 2059276, 2022318, 1986608, 1951385, 1916461, 1882762, 1850811, 1819555, 1787753, 1755742, 1724551, 1693788, 1661997, 1628840, 1595431, 1562446, 1529450, 1496301, 1463723, 1432096, 1401040, 1370653, 1341786, 1314409, 1286962, 1258225, 1228739, 1199558, 1170568, 1141092, 1111334, 1082109, 1053663, 1025707, 998216, 971331, 944854, 918662, 893337, 869653, 847659, 826738, 806274, 785751, 764821, 743909, 724163, 706037, 688429, 670184, 651888, 635161, 620525, 607198, 594731, 583451, 573152, 562760, 551824, 541248, 531860, 523169, 514302, 505445, 497500, 490732, 484603, 478644, 472702, 466570, 460264, 454618, 450687, 448222, 445568, 441564, 436958, 433295, 430774, 428085, 424251, 419925, 416615, 415201]
53067D15201K15R00O63K33O89K383M215M744L951L027K440J399l34j502j142m33
53051D36649j308l737n615n321l316j251m56j433l869o588q151q035p018o206
53037C74345o030o326o949p920r049r735r369p995o546n964o046n625m186k704
53023B79901k325k733k716k023j735k654m295n648o281o275n601m168k222l84
53009B30841P44R40M59k11p87j290j665j645j150n36n5N32J239J313J89j308j663
52992B25947o43L65J11j189k477l005k467q52J215K489K195R15l3P5Q58J430J263
52975B26197N70J29M70J123J008k43j718k339k180k268l109l886l377j399R13
52960B09891K275K405J832Q63o23k242k794j596L02J092L44o15n32K37M32l90
$$ y = [415201, 415416, 416316, 416979, 417212, 417901, 420284, 424499, 429243, 433194, 436221, 438661, 440060, 439726, 438224, 437082, 436649, 435341, 431604, 425989, 420668, 417352, 416101, 415645, 414212, 410343, 403755, 395604, 387569, 380551, 374345, 368315, 361989, 355040, 347120, 338071, 328336, 318967, 310972, 304426, 298462, 292416, 286791, 282605, 279901, 277576, 274843, 272127, 270104, 268369, 265715, 261420, 255772, 249491, 243216, 237615, 233447, 231225, 230841, 231585, 232525, 232984, 232773, 231986, 230696, 229031, 227386, 226236, 225700, 225645, 226177, 227416, 228729, 228918, 227610, 225947, 225304, 225669, 225780, 224591, 222114, 219109, 216642, 215790, 217005, 219494, 221689, 222604, 222571, 222646, 223504, 224934, 226197, 226767, 226896, 227366, 228489, 229497, 229254, 227536, 225197, 223017, 220749, 217640, 213754, 210377, 208978, 209891, 212166, 214571, 216403, 217266, 216643, 214401, 211607, 210011, 210313, 211405, 211749, 211134, 210602, 210839, 211271, 210881]
52944B10881j317j202k9R36M95r30j510j16K129L074K111P08L11O98P95L15n5
52927B17294K69J305K836M580N896N954M541K596J575K081L313M047M080M209
52913B64576M859N469N541N547N906N791M179J824Q63K072L798M126L062J815
52899C19428Q55k19j442k213k245j855j345q22o24j212k383l243l214k654k267
52884B94545k332k748l367l880l723k633j186l37l54n79l01M76J240J548J282
52869B77651O58J91K76O15M85j39l11N29J507J423M60j63j06k85j309k585l263
52852B75634l018j744M85K749L774L558L322L366K381q2k120j969p79r70k521
52837B82066k980j003K018M001M263L266J696L98J05O46J105Q87M2j271k587k730
$$ y = [210881, 209564, 208362, 208333, 209269, 209764, 208834, 207324, 207208, 209337, 212411, 214522, 215230, 215541, 216239, 217034, 217349, 217294, 217563, 218868, 221704, 226284, 232180, 238134, 242675, 245271, 246846, 248927, 252240, 256287, 260367, 264576, 269435, 274904, 280445, 285992, 291898, 297689, 301868, 303692, 304555, 306627, 310425, 314551, 317613, 319428, 320283, 320064, 318622, 316409, 314164, 312309, 310964, 310142, 309518, 308306, 305923, 302680, 299466, 296812, 294545, 292213, 289465, 286098, 282218, 278495, 275862, 274676, 274339, 273985, 273406, 273105, 273581, 274821, 276369, 277651, 278309, 278500, 278776, 279391, 279876, 279737, 279426, 279955, 281462, 282885, 283345, 283182, 283076, 282791, 281482, 278897, 275634, 272616, 270872, 271357, 274106, 277880, 281438, 284760, 288126, 290507, 290425, 288305, 286336, 285557, 284587, 282066, 279086, 278083, 280101, 284102, 288365, 291631, 293327, 293725, 293830, 294476, 295581, 296468, 296510, 295239, 292652, 289922]
52821B89922q43K099M051M295L875L515K539M40j726k295p42J905L852L750J996
52806C16633O52J179K527K708J755J369J825J627N32L65J903L210K682J672K314
52791C42953M297N834O508P117P607P222O227N496M779L138R07n71j019j433k211
52776C96851k685k640k761l298l584l315l142l562m174m504m678m844m716m168
52762C44780l638l536l658l591l366l416l980m675m665l475j852j358k695m750
52748B96125n698m800k698m77R86J135J19j119j772k077k727l635l953l231j980
52733B64198j095j136k013k999l254k672j943j592j432j234j208j447j642j833
52719B38698k571l702m015k963j715j424j429n01R85J654J211L30j007l244n525
$$ y = [289922, 289079, 291178, 295229, 299524, 303399, 306914, 309453, 309893, 308167, 305872, 305130, 307035, 310887, 314637, 316633, 317285, 318464, 320991, 323699, 325454, 326823, 328648, 330275, 330807, 331172, 333075, 336285, 338967, 340639, 342953, 347250, 353084, 359592, 366709, 374316, 381538, 387765, 393261, 398040, 401178, 402085, 401514, 400495, 399062, 396851, 394166, 391526, 388765, 385467, 381883, 378568, 375426, 371864, 367690, 363186, 358508, 353664, 348948, 344780, 341142, 337606, 333948, 330357, 326991, 323575, 319595, 314920, 310255, 306780, 304928, 303570, 300875, 296125, 290427, 285627, 282929, 282452, 283438, 284573, 284692, 283573, 281801, 279724, 276997, 273362, 269409, 266178, 264198, 263103, 261967, 259954, 256955, 253701, 251029, 249086, 247494, 246062, 244828, 243620, 242173, 240531, 238698, 236127, 232425, 228410, 225447, 223732, 222308, 220879, 220378, 221363, 223017, 224228, 224558, 223551, 220307, 214782]
52704B14782o078m434j917K3O77m03k877m770l990j177P14N4j821k961l038k677
52688A80107k223k040k584l375l288k518k701m250n211m027j883q10p58k92P51
52673A44898J207O81N2n5J19K45K13k41j146j680j017L06Q10Mj081j340q06k29
52655A40940k8L5M85J497K528K765K230J919K507L414L760L672L829M107L709
52640A77369K562J496J008O67Q5l62k05K57K19o68j997l067l559l696l885m179
52624A62045m132l276j636J96J398J377K34j235k313l096l999m534l467o31K144
52609A39075K637M69k753n125n647m282j816L03Q56q2j297j773j562j366j557
52594A16080j802j572r81q94j783k609j710Q05K603J829m28j606j022l02n58q23
$$ y = [214782, 208704, 204270, 202353, 202376, 203053, 202650, 199773, 195003, 191013, 189836, 190550, 190604, 188783, 185822, 182784, 180107, 177884, 175844, 173260, 169885, 166597, 164079, 161378, 157128, 151917, 147890, 146007, 145197, 144439, 144147, 144898, 146105, 146786, 146838, 146783, 146902, 147147, 147360, 147119, 145973, 144293, 143276, 143582, 144392, 144396, 143315, 141975, 141169, 140940, 140912, 140947, 141432, 142929, 145457, 148222, 150452, 152371, 154878, 158292, 162052, 165724, 169553, 173660, 177369, 179931, 181427, 182435, 183102, 183187, 182825, 182620, 182877, 183096, 182428, 180431, 177364, 173805, 170109, 166224, 162045, 157913, 154637, 153001, 153197, 154595, 155972, 156206, 154971, 152658, 149562, 145563, 141029, 137562, 136931, 139075, 141712, 142181, 139428, 134303, 128656, 124374, 122558, 122861, 123717, 123635, 122338, 120565, 119003, 117637, 116080, 114278, 112706, 111725, 110831, 109048, 106439, 104729, 105534, 108137, 109966, 109538, 107932, 106910, 106608, 106050, 105227]
52578A05227K8J239J199r6r39j80J365J954Q81r71k149j898n66Q86J625J462R08
52561A09975P70J341J973J750P02n3K67J077J297Q65N16L81j12p91n03J055K239
52544A22749J353q15j666m4K300K953J664K50R4O83P34N8k59N62J809K035Q31
52527A35291o53j151o57J13J063K569M075M199K661J056P97J325J406J279J862
52512A55235K442J350r48j705K15K393K312J053J410L489M715L861K524K202K227
52497A82775J633J138J734K690K565J570J233K033K783K538J859J705K033K158
52483B10447J925J724J627J249N76J96K57j11j596l284l493j974j79R60K111L758
52467B14193M712L807K011J199J411J130O2m16K63Q43K97p31j317j621k011k091
$$ y = [105227, 105255, 106494, 107693, 107597, 106658, 106478, 107843, 109797, 110678, 109707, 107558, 105660, 105094, 105980, 107605, 109067, 109975, 110745, 112086, 114059, 115809, 116511, 116458, 116725, 117802, 119099, 119964, 120480, 120861, 120749, 119958, 119455, 120510, 122749, 124102, 123287, 121621, 121577, 123877, 126830, 128494, 128744, 128838, 129521, 130255, 130313, 130054, 130616, 132425, 134460, 135291, 134638, 133487, 132830, 132943, 134006, 136575, 140650, 144849, 147510, 148566, 149363, 150688, 152094, 153373, 155235, 157677, 159027, 158079, 156374, 156589, 158982, 161294, 162347, 163757, 167246, 171961, 175822, 178346, 180548, 182775, 184408, 185546, 187280, 189970, 192535, 194105, 195338, 197371, 200154, 202692, 204551, 206256, 208289, 210447, 212372, 214096, 215723, 216972, 217548, 217744, 218001, 217890, 216294, 213010, 209517, 207543, 207364, 208324, 210435, 214193, 218905, 222712, 224723, 225922, 227333, 228463, 228525, 228109, 228372, 229215, 229512, 228781, 227464, 225843, 223832, 221741]
52451B21741j588j027o40K47J762K515J333r66k583k761j904n78M96M41n63r49
52435B14976N1Q94m1j702j799l82K75p21j608p31J311K953L543L241K356J613
52419B24229J876K896L266K305R99M26K40m95j742k600k389r72J356L571M218
52404B37184K825O74n46m49L11J361K749M033M327L384J925P48J36J45Q57K017
52388B61681K866K825K202J849K127K505K316J691J346J573J843J645J209J018
52374B88696R07K59q58j470r41p6m72k684n305o225m847k760j871k265k594k365
52358B55129k578l709m372l111o93Q14O99K0m70j191k310k917k208n83J020K021
52342B35561K105J206j2m88j90k35j113j826j481o28n1O45K013L138K717J309
$$ y = [221741, 220153, 219126, 218486, 218733, 220495, 223010, 224343, 223377, 220794, 218033, 216129, 215551, 216047, 216488, 215925, 214976, 215027, 215921, 215880, 214178, 212379, 211997, 212272, 211551, 209943, 209212, 210523, 213476, 217019, 220260, 222616, 224229, 226105, 229001, 232267, 234572, 235571, 235997, 236237, 235742, 234000, 231400, 229011, 228039, 229395, 232966, 237184, 240009, 240683, 240137, 239688, 239999, 241360, 244109, 248142, 252469, 255853, 257778, 258526, 258662, 258807, 259664, 261681, 264547, 267372, 269574, 271423, 273550, 276055, 278371, 280062, 281408, 282981, 284824, 286469, 287678, 288696, 289603, 289862, 289004, 287534, 286593, 286517, 286045, 283361, 278056, 271831, 266984, 264224, 262353, 260088, 257494, 255129, 252551, 248842, 244470, 241359, 240666, 241480, 242179, 242199, 241729, 240538, 238228, 235311, 233103, 232520, 233540, 235561, 237666, 238872, 238860, 238372, 238182, 237947, 236834, 235008, 233527, 232899, 232848, 233493, 235506, 238644, 241361, 242670]
$$ [...]
##END NTUPLES=NMR SPECTRUM
##END=
