##TITLE=coffee_type TOSA01-ROVE100B_50-50%
COFFEE_meoh_noesyp64 COFFEE_meoh {C:\Bruker\TOPSPIN} Administrator 9
##JCAMPDX= 6.0         $$ Bruker NMR JCAMP-DX V2.0
##DATA TYPE= NMR SPECTRUM
##DATA CLASS= NTUPLES
##ORIGIN= Bruker BioSpin GmbH
##OWNER= Administrator
$$ 1.72 TOPSPIN		Version 2.1
$$ 2012-05-18 15:47:51.792 -0700  Administrator@X
$$ Compression mode = diff/dup
##.OBSERVE FREQUENCY= 400.13188235
##.OBSERVE NUCLEUS= ^1H
##.ACQUISITION MODE= SIMULTANEOUS (DQD)
##.ACQUISITION SCHEME= undefined
##.AVERAGES= 64
##.DIGITISER RES= 22
##SPECTROMETER/DATA SYSTEM= spect
##.PULSE SEQUENCE= noesygpps1d.comp
##.SOLVENT NAME= COFFEE_meoh
##.SHIFT REFERENCE= INTERNAL, COFFEE_meoh, 1, 14.98061
##AUDIT TRAIL= $$ (NUMBER, WHEN, WHO, WHERE, PROCESS, VERSION, WHAT)
$$ ##TITLE= Audit trail, TOPSPIN		Version 2.1
$$ ##JCAMPDX= 5.01
$$ ##ORIGIN= Bruker BioSpin GmbH
$$ ##OWNER= Administrator
$$ $$ C:\Bruker\TOPSPIN/data/Administrator/nmr/12-COFFEE-2402/112/pdata/1/auditp.txt
$$ ##AUDIT TRAIL=  $$ (NUMBER, WHEN, WHO, WHERE, PROCESS, VERSION, WHAT)
(   1,<2012-02-24 22:12:58.719 -0500>,<Administrator>,<TOPSPIN>,<go>,<TOPSPIN 2.1>,
      <created by zg
	started at 2012-02-24 22:01:27.891 -0500,
	POWCHK enabled, PULCHK disabled,
       configuration hash MD5:
       B0 76 FB 9C 50 81 44 7D 18 B3 26 32 4E 60 AD 96
       data hash MD5: 64K
       E8 C1 02 6C B3 92 E7 AD 9D 6F 67 1A 3C 06 77 9E>)
(   2,<2012-02-24 22:13:01.750 -0500>,<Administrator>,<TOPSPIN>,<proc1d>,<TOPSPIN 2.1>,
      <Start of raw data processing
       efp LB = 0.3 FT_mod = 6 PKNL = 1 PHC0 = 0 PHC1 = 0 SI = 128K 
       data hash MD5: 128K
       51 4E 5D 02 EF 79 03 1E A2 7E DE 4E 03 4A 33 C5>)
(   3,<2012-02-24 22:13:03.031 -0500>,<Administrator>,<TOPSPIN>,<proc1d>,<TOPSPIN 2.1>,
      <pk PHC0 = 24.1864 PHC1 = 0 
       data hash MD5: 128K
       F2 ED 24 EE 17 4F B6 78 3D A1 AD 36 06 B2 EC 2F>)
(   4,<2012-02-24 22:13:03.297 -0500>,<Administrator>,<TOPSPIN>,<proc1d>,<TOPSPIN 2.1>,
      <abs ABSG = 1 
       data hash MD5: 128K
       2F 28 9C 8D F3 FE A6 0A 3C 5A C8 13 47 22 7E F4>)
(   5,<2012-02-24 22:13:03.375 -0500>,<Administrator>,<TOPSPIN>,<proc1d>,<TOPSPIN 2.1>,
      <abs ABSG = 2 
       data hash MD5: 128K
       9B 73 19 33 20 38 C9 21 E1 D6 E4 99 7D 57 6C 02>)
(   6,<2012-02-24 22:13:03.422 -0500>,<Administrator>,<TOPSPIN>,<proc1d>,<TOPSPIN 2.1>,
      <abs ABSG = 3 
       data hash MD5: 128K
       59 31 CD DE 19 13 8B 19 8B 49 D6 E9 27 E5 CE 8B>)
(   7,<2012-02-24 22:13:03.500 -0500>,<Administrator>,<TOPSPIN>,<proc1d>,<TOPSPIN 2.1>,
      <abs ABSG = 4 
       data hash MD5: 128K
       4D 90 C6 68 E2 25 94 DE B0 AA F9 F8 F3 FA 1D FC>)
(   8,<2012-02-24 22:13:03.672 -0500>,<Administrator>,<TOPSPIN>,<proc1d>,<TOPSPIN 2.1>,
      <abs ABSG = 5 
       data hash MD5: 128K
       4B 6F 44 72 05 C0 AB 4C 3C 81 93 6D 54 EC 9F 54>)
(   9,<2012-02-24 22:13:03.906 -0500>,<Administrator>,<TOPSPIN>,<audit>,<TOPSPIN 2.1>,
      <user comment:
       ICON-NMR User ID: Administrator
$$ [...]
150 150 150 150 150 150 150 150
##$TP07= 0
##$TPNAME0= <>
##$TPNAME1= <>
##$TPNAME2= <>
##$TPNAME3= <>
##$TPNAME4= <>
##$TPNAME5= <>
##$TPNAME6= <>
##$TPNAME7= <>
##$TPOAL= (0..7)
0.5 0.5 0.5 0.5 0.5 0.5 0.5 0.5
##$TPOFFS= (0..7)
0 0 0 0 0 0 0 0
##$TUNHIN= 0
##$TUNHOUT= 0
##$TUNXOUT= 0
##$USERA1= <user>
##$USERA2= <user>
##$USERA3= <user>
##$USERA4= <user>
##$USERA5= <user>
##$V9= 5
##$VALIST= <valist>
##$VCLIST= <CCCCCCCCCCCCCCC>
##$VD= 0
##$VDLIST= <DDDDDDDDDDDDDDD>
##$VPLIST= <PPPPPPPPPPPPPPP>
##$VTLIST= <TTTTTTTTTTTTTTT>
##$WBST= 1024
##$WBSW= 4
##$XGAIN= (0..3)
0 0 0 0
##$XL= 0
##$YL= 0
##$YMAX_a= 14123052
##$YMIN_a= -6764692
##$ZGOPTNS= <>
##$ZL1= 120
##$ZL2= 120
##$ZL3= 120
##$ZL4= 120
##$ABSF1= 14.98061
##$ABSF2= -5.57192
##$ABSG= 5
##$ABSL= 3
##$ALPHA= 0
##$AQORDER= 0
##$ASSFAC= 0
##$ASSFACI= 0
##$ASSFACX= 0
##$ASSWID= 0
##$AUNMP= <proc_prof1d_extract>
##$AXLEFT= 0
##$AXNAME= <>
##$AXNUC= <1H>
##$AXRIGHT= 0
##$AXTYPE= 0
##$AXUNIT= <>
##$AZFE= 0.1
##$AZFW= 0.1
##$BCFW= 0
##$BC_mod= 0
##$BYTORDP= 0
##$COROFFS= 0
##$CY= 15
##$DATMOD= 1
##$DC= 0
##$DFILT= <>
##$DTYPP= 0
##$F1P= 0
##$F2P= 0
##$FCOR= 0.5
##$FTSIZE= 131072
##$FT_mod= 6
##$GAMMA= 0
##$GB= 0
##$INTBC= 1
##$INTSCL= 1
##$ISEN= 128
##$LB= 0.3
##$LEV0= 0
##$LPBIN= 0
##$MAXI= 10000
##$MC2= 0
##$MEAN= 0
##$ME_mod= 0
##$MI= 0
##$NCOEF= 0
##$NC_proc= -3
##$NLEV= 6
##$NOISF1= 0
##$NOISF2= 0
##$NSP= 0
##$NTH_PI= 0
##$NZP= 0
##$OFFSET= 14.98061
##$PC= 1
##$PHC0= 24.1864
##$PHC1= 0
##$PH_mod= 1
##$PKNL= yes
##$PPARMOD= 0
##$PPDIAG= 0
##$PPIPTYP= 0
##$PPMPNUM= 2147483647
##$PPRESOL= 1
##$PSCAL= 4
##$PSIGN= 0
##$PYNMP= <proc.py>
##$REVERSE= no
##$SF= 400.13
##$SI= 131072
##$SIGF1= 0
##$SIGF2= 0
##$SINO= 400
##$SIOLD= 131072
##$SPECTYP= <>
##$SREGLST= <1H.CDCl3>
##$SSB= 0
##$STSI= 131072
##$STSR= 0
##$SW_p= 8223.68421052632
##$SYMM= 0
##$S_DEV= 0
##$TDeff= 65536
##$TDoff= 0
##$TI= <>
##$TILT= no
##$TM1= 0
##$TM2= 0
##$TOPLEV= 0
##$USERP1= <user>
##$USERP2= <user>
##$USERP3= <user>
##$USERP4= <user>
##$USERP5= <user>
##$WDW= 1
##$XDIM= 131072
##$YMAX_p= 490736730
##$YMIN_p= -373291160
##$CURPLOT= <Network HP LaserJet P1505>
##$CURPRIN= <$Network HP LaserJet P1505>
##$DFORMAT= <normdp>
##$LAYOUT= <+/1D_H.xwp>
##$LFORMAT= <normlp>
##$PFORMAT= <normpl>
##$SURQMSG= 1
$$ End of Bruker specific parameters
$$ ---------------------------------
##NTUPLES= NMR SPECTRUM
##VAR_NAME=  FREQUENCY,     SPECTRUM/REAL,   SPECTRUM/IMAG
##SYMBOL=    X,             R,               I
##VAR_TYPE=  INDEPENDENT,   DEPENDENT,       DEPENDENT
##VAR_FORM=  AFFN,          ASDF,            ASDF
##VAR_DIM=   131072,        131072,          131072
##UNITS=     HZ,            ARBITRARY UNITS, ARBITRARY UNITS
##FACTOR=    0.0627417313425165, 1,          1
##FIRST=     8223.62146879498, 876,          -104670
##LAST=      0,             5579,            -104550
##MIN=       0,             -373291160,      0
##MAX=       8223.62146879498, 490736730,    0
$$ Real data points
##PAGE= N=1
##DATA TABLE= (X++(R..R)), XYDATA
$$ [...]
60699A337378R20P08J401K193K381J649L67o12p45k42K12j04j613m030o165o706
60683A326992n483l832l426m729o668p928q471r360j1029j2428j2565j2211j2936
60670A215926j4667j5638j4927j3703j3429j4051j4612j4502j3318j0588o746
60659A069745l528k340k735l237k984j820K66K673L901L011R89m38q61j095j546
60644A060001j992k755m606p354r681j0729j1068j1629j2398j2634j2076j1400
60632I51679j1428j2062j2401j2011j1512j1346j0619q330n430m060m483m499
60620H43498k658l08O35N07R96K434L650L875L388K740K463L129M607N817O274
60605H81047P073R204J1721J3087J3534J4352J5429J5484J4616J4568J6140J8001
$$ plain form
60699 1337378 1338298 1339006 1340407 1342600 1344981 1346630 1346997 1346385 1345640 1345398 1345610 1345506 1343893 1339863 1333698 1326992
60683 1326992 1321509 1317677 1314251 1309522 1302854 1294926 1286455 1277095 1266066 1253638 1241073 1228862 1215926
60670 1215926 1201259 1185621 1170694 1156991 1143562 1129511 1114899 1100397 1087079 1076491 1069745
60659 1069745 1066217 1063877 1061142 1057905 1054921 1053101 1053367 1056040 1059941 1062952 1063941 1063503 1062642 1061547 1060001
60644 1060001 1058009 1055254 1050648 1043294 1033613 1022884 1011816 1000187 987789 975155 963079 951679
60632 951679 940251 928189 915788 903777 892265 880919 870300 861970 856540 852480 847997 843498
60620 843498 840840 840532 841167 841674 842670 845104 848754 852629 856017 858757 861220 864349 868956 874773 881047
60605 881047 888120 897324 909045 922132 935666 950018 965447 980931 995547 1010115 1026255 1044256
60593A044256J8718J8597J8793J9566K0156J9824J8626J7474J7385J8373J9249
60582A251017J8988J7838J6538J5177J3575J2054J0732Q837N874K841Q68o55l050
60569A370634o029q196r421j0746j2171j2617j2139j2127j2971j3505j3265j3288
60557A234159j4022j4309j3364j2018j0957r345o438l234j160q2J146K969M985
60544A158330O854Q527J0144J2252J5394J8970K1468K2299K2269K1758J9939J6666
60532A354870J3603J2127J1299R484O918N139M529M157L525K925K313J305Q7r90
60518A431291k498n208q437j0595j1468j2408j4000j4969j4098j2025j0414j0136
60506A305035j0875j1716j1487r350n744k329l56M77J097J692J998K325L332M929
$$ plain form
60593 1044256 1062974 1081571 1100364 1119930 1140086 1159910 1178536 1196010 1213395 1231768 1251017
60582 1251017 1270005 1287843 1304381 1319558 1333133 1345187 1355919 1364756 1370630 1373471 1374339 1373684 1370634
60569 1370634 1364605 1356409 1346988 1336242 1324071 1311454 1299315 1287188 1274217 1260712 1247447 1234159
60557 1234159 1220137 1205828 1192464 1180446 1169489 1160144 1153706 1150472 1149312 1149230 1150376 1153345 1158330
60544 1158330 1165184 1173711 1183855 1196107 1211501 1230471 1251939 1274238 1296507 1318265 1338204 1354870
60532 1354870 1368473 1380600 1391899 1401383 1408301 1413440 1417969 1422126 1425651 1428576 1430889 1432194 1432281 1431291
60518 1431291 1428793 1423585 1415148 1404553 1393085 1380677 1366677 1351708 1337610 1325585 1315171 1305035
60506 1305035 1294160 1282444 1270957 1261607 1255863 1253534 1253178 1253655 1254752 1256444 1258442 1260767 1264099 1269028
60492A269028O342P346Q628J0728J3312J5724J7679J9213K0537K2332K5545L0256
60480A466670L5182L9001M1959M5545N0662N6924O3628P0532P7502Q4235R0783
60469B122623R7517J03904J07756J06567R9444Q7350P1801N3955L4907J6144m63
60458B901505j2955j9820k0828j7430j1920o104p66L902P843J0949J2849J2989
60446B860214J1368R166Q120R061J1432J4406J8179K3900L2331M2800N3763O4495
60434C159235P5880Q9178J04308J20051J35796J52154J69514J87012K03514K18749
60424D615391K32803K45362K56685K68829K84650L05621L31599L62614L99541
60415G303095M42535M89623N37121N80466O13570O27671O12268N58747M64213
$$ plain form
60492 1269028 1275370 1282716 1291344 1302072 1315384 1331108 1348787 1368000 1388537 1410869 1436414 1466670
60480 1466670 1501852 1540853 1582812 1628357 1679019 1735943 1799571 1870103 1947605 2031840 2122623
60469 2122623 2220140 2324044 2431800 2538367 2637811 2725161 2796962 2850917 2885824 2901968 2901505
60458 2901505 2888550 2868730 2847902 2830472 2818552 2812448 2811682 2815584 2823427 2834376 2847225 2860214
60446 2860214 2871582 2880748 2888868 2897929 2909361 2923767 2941946 2965846 2998177 3040977 3094740 3159235
60434 3159235 3235115 3324293 3428601 3548652 3684448 3836602 4006116 4193128 4396642 4615391
60424 4615391 4848194 5093556 5350241 5619070 5903720 6209341 6540940 6903554 7303095
60415 7303095 7745630 8235253 8772374 9352840 9966410 10594081 11206349 11765096 12229309
60406A2229309L32582J72562m428j84569l51984m92199n97011o65737p01725p09060
60396I027740o92977o60905o20331n75703n28633m80577m33732l89602l48394
60387D296886l10136k75269k43991k16039j91251j69596j50623j33702j18602
60378B487677j05199r3057q2155p3457o7419o2519n6735n0384m5819m4271m4344
60367A762318m3884m1943l8677l4680l0872k7997k5810k3647k1747k0864k0642
60356A431555j9726j7674j5307j3012j0178o772l943k436j711j152q19l73J288
60343A339740M450P819J0157J1662J3027J4336J5635J7464J9797K1436K1531K0762
60331A517816K0072J9094J6934J3886J1274R867R238Q455O871M596K533J452P97
$$ plain form
60406 12229309 12561891 12734453 12730025 12545456 12193472 11701273 11104262 10438525 9736800 9027740
60396 9027740 8334763 7673858 7053527 6477824 5949191 5468614 5034882 4645280 4296886
60387 4296886 3986750 3711481 3467490 3251451 3060200 2890604 2739981 2606279 2487677
60378 2487677 2382478 2289421 2207266 2133809 2066390 2003871 1947136 1896752 1850933 1806662 1762318
60367 1762318 1718434 1676491 1637814 1603134 1572262 1544265 1518455 1494808 1473061 1452197 1431555
60356 1431555 1411829 1394155 1378848 1365836 1355658 1348886 1344943 1342507 1340796 1339644 1338825 1338452 1339740
60343 1339740 1344190 1352009 1362166 1373828 1386855 1401191 1416826 1434290 1454087 1475523 1497054 1517816
60331 1517816 1537888 1556982 1573916 1587802 1599076 1608943 1618181 1626636 1633507 1638103 1640636 1642088 1642885
60318A642885q53l856o867q436q416p559o772o956q357r609q742n782l012j990
60304A555678j812j279j036k183m075n331o139p803j0568j3363j5395j6555j6622
60291A453517j5447j3789j2804j2667j2606j2042j0878r047o710m569l105j757
60279A338096K15K391L698L965M121M978O574Q513J0276J1473J2341J3568J5088
60266A435297J5670J4479J2489J1422J1752J2512J2603J1429Q803N058R04l434
60254A548984q370j3557j7344j8597j8169j7443j6421j4623j2867j2287j2222
60243A387084j1102r115p938p789o885m262j337J40J07n07j202j672j284J91J895
60228A336324K606J810p8j913k183j88K804M554M418L992M955P253R948J2641
$$ plain form
60318 1642885 1642032 1638176 1631309 1622873 1614457 1606898 1600126 1593170 1584813 1575204 1566462 1560680 1557668 1555678
60304 1555678 1553866 1552587 1551551 1549368 1545293 1539962 1533823 1526020 1515452 1502089 1486694 1470139 1453517
60291 1453517 1438070 1424281 1411477 1398810 1386204 1374162 1363284 1354237 1347527 1342958 1339853 1338096
60279 1338096 1338311 1340702 1344400 1348365 1352486 1357464 1364038 1372551 1382827 1394300 1406641 1420209 1435297
60266 1435297 1450967 1465446 1477935 1489357 1501109 1513621 1526224 1537653 1546456 1551514 1552418 1548984
60254 1548984 1540614 1527057 1509713 1491116 1472947 1455504 1439083 1424460 1411593 1399306 1387084
60243 1387084 1375982 1366867 1358929 1351140 1344255 1339993 1338656 1338796 1338903 1338396 1337194 1335522 1334238 1334429 1336324
60228 1336324 1338930 1340740 1340662 1338749 1336566 1336378 1339182 1343736 1348154 1352146 1357101 1364354 1374302 1386943
60214A386943J5254J7406J8939K0334K1637K1789K0231J8476J8609K0476K1976
60203A602070K2314K3142K5706K8320K8397K6307K5360K7729L1966L5303L7175
60192A913789L9298M3077M8356N4428O0840O7030P2434P7409Q3029Q9458R5483
60181B644631J00268J04640J09858J15894J21813J27272J32513J37220J40412
60172C734521J41396J40003J36028J29344J20737J11738J03155R4323Q4135P2506
60162D867886O0469M9045L8487K8727K0200J3705R441O734N077M981P256J1815
60150E123823J7849K4860L2717M0988M9100N7076O5197P3152Q0611Q8310R7188
60139E750871J06510J14388J20194J24790J28094J28498J25276J19582J12031
$$ plain form
60214 1386943 1402197 1419603 1438542 1458876 1480513 1502302 1522533 1541009 1559618 1580094 1602070
60203 1602070 1624384 1647526 1673232 1701552 1729949 1756256 1781616 1809345 1841311 1876614 1913789
60192 1913789 1953087 1996164 2044520 2098948 2159788 2226818 2299252 2376661 2459690 2549148 2644631
60181 2644631 2744899 2849539 2959397 3075291 3197104 3324376 3456889 3594109 3734521
60172 3734521 3875917 4015920 4151948 4281292 4402029 4513767 4616922 4711245 4795380 4867886
60162 4867886 4928355 4977400 5015887 5044614 5064814 5078519 5087960 5094694 5099771 5104752 5112008 5123823
60150 5123823 5141672 5166532 5199249 5240237 5289337 5346413 5411610 5484762 5565373 5653683 5750871
60139 5750871 5857381 5971769 6091963 6216753 6344847 6473345 6598621 6718203 6830234
60130F830234J01448Q7308P1531N6041M0224K2778M612j2301k7835m3029n7252
60119G073759o8524p6307q1574q4177q2549p6422o7856n8843m9424l8802k6952
60108F362329j4394j399J2027K5937M0420N5123O8846Q0177Q8243R2128R0329
60097F899766Q2098O8963N3427L6426J7500k613k1427l7021m9423n9145o5580
60086F922971o7589o4767n7615m7021l3902j8882k199J5687L3815N1789P0668
60075F802955R1812J15157J39596J64551J89970K15282K39912K64656K90831L17867
60065H832589L43102L64183L80336L91227L96114L94550L86641L72097L50205
60056A2211044L21178K86504K47552K04712J58186J08710N7191M374m8984j02239
$$ plain form
60130 6830234 6931682 7018990 7090521 7146562 7186786 7209564 7214176 7201875 7174040 7131011 7073759
60119 7073759 7005235 6928928 6847354 6763177 6680628 6604206 6536350 6477507 6428083 6389281 6362329
60108 6362329 6347935 6346536 6358563 6384500 6424920 6480043 6548889 6629066 6717309 6809437 6899766
60097 6899766 6981864 7050827 7104254 7140680 7158180 7155567 7134140 7097119 7047696 6988551 6922971
60086 6922971 6855382 6790615 6733000 6685979 6652077 6633195 6630996 6646683 6680498 6732287 6802955
60075 6802955 6894767 7009924 7149520 7314071 7504041 7719323 7959235 8223891 8514722 8832589
60065 8832589 9175691 9539874 9920210 10311437 10707551 11102101 11488742 11860839 12211044
60056 12211044 12532222 12818726 13066278 13270990 13429176 13537886 13595077 13599451 13550467 13448228
60046A3448228j54828k05148k49922k86095l13303l33038l45490l48796l41731
60037A0869877l25620l03196k76741k47584k16133j82029j45307j07585p1059
60028H994623l6444l124K8749N7852Q3065J03623J17899J24032J21962J12962
60018I705199R7185P3951M4813J3867j5928m4441p1585r5481j14916j31314j46270
60007I315080j58991j68163j74649j80134j84337j85934j85399j84532j83447
59998G709494j80104j72835j61876j48262j32655j15370r6573p6317n5052l3897
59988F536553j3798N370K4215M2690O0047P5566Q8812R9613J08083J14158J16858
59977G258167J14887J08194R7983Q4879O8314M8341K6741N434j5228l5842n6797
$$ plain form
60046 13448228 13293400 13088252 12838330 12552235 12238932 11905894 11560404 11211608 10869877
60037 10869877 10544257 10241061 9964320 9716736 9500603 9318574 9173267 9065682 8994623
60028 8994623 8958179 8955055 8983804 9041656 9124721 9228344 9346243 9470275 9592237 9705199
60018 9705199 9802384 9876335 9921148 9935015 9919087 9874646 9803061 9707580 9592664 9461350 9315080
60007 9315080 9156089 8987926 8813277 8633143 8448806 8262872 8077473 7892941 7709494
59998 7709494 7529390 7356555 7194679 7046417 6913762 6798392 6701819 6625502 6570450 6536553
59988 6536553 6522755 6528125 6552340 6595030 6655077 6730643 6819455 6919068 7027151 7141309 7258167
59977 7258167 7373054 7481248 7579231 7664110 7732424 7780765 7807506 7812940 7797712 7761870 7705073
59966G705073p8396j00729j22323j40146j52136j58756j61217j59538j53583j44466
59956F333783j33185j19043j01237q1081o0860m1179k1234q84J9292L9276N8946
59945E892594P6771R1386J04257J18519J34988J51247J64847J75381J82895J86202
59935G279087J83789J75305J61405J43145J21936R9068P4762M8537K0727p280
59925H300481l4447o0468q4464j04669j20121j31547j39712j43719j41927j34079
59915G205328j21749j06885r0574p3075n4569l5769j7795j250J4500L0631M7394
59904F796187O3721P8350R0879J01584J10704J18178J23814J27334J28338J26390
59894G865479J21236J13169J03265R3038Q3465P4540O6011N8395N2868N0327N0967
$$ plain form
59966 7705073 7626677 7525948 7403625 7263479 7111343 6952587 6791370 6631832 6478249 6333783
59956 6333783 6200598 6081555 5980318 5899237 5838377 5797198 5775964 5775080 5794372 5833648 5892594
59945 5892594 5969365 6060751 6165008 6283527 6418515 6569762 6734609 6909990 7092885 7279087
59935 7279087 7462876 7638181 7799586 7942731 8064667 8163735 8238497 8287034 8307761 8300481
59925 8300481 8266034 8205566 8121102 8016433 7896312 7764765 7625053 7481334 7339407 7205328
59915 7205328 7083579 6976694 6886120 6813045 6758476 6722707 6704912 6703662 6718162 6748793 6796187
59904 6796187 6859908 6938258 7029137 7130721 7241425 7359603 7483417 7610751 7739089 7865479
59894 7865479 7986715 8099884 8203149 8296187 8379652 8454192 8520203 8578598 8631466 8681793 8732760
59883H732760N4708O1720P2424Q7128J05631J27273J51498J78288K07550K38237
59873A0017217K68831K98765L28378L56948L81772L99949M10273M12326M04478
59864A3278937L84095L49606L01244K39794J66017Q1980p591r6070j77340k47677
59854A4272995l05722l51013l83008m01765m08906m06679l95948l76280l48542
59845A0895132l16028k81954k46864k09862j71594j34329r9284o5528l1920J101
59835I338870L2084O0039Q4973J07546J28484J47606J63194J72765J74632J68330
59825A0578523J53635J30063R7620N7599J2306l5514q2910j26936j65305j96955
59815A0422126k22013k41421k56506k68474k78022k85394k90714k94012k94764
$$ plain form
59883 8732760 8787468 8849188 8921612 9008740 9114371 9241644 9393142 9571430 9778980 10017217
59873 10017217 10286048 10584813 10913191 11270139 11651911 12051860 12462133 12874459 13278937
59864 13278937 13663032 14012638 14313882 14553676 14719693 14801673 14794082 14698012 14520672 14272995
59854 14272995 13967273 13616260 13233252 12831487 12422581 12015902 11619954 11243674 10895132
59845 10895132 10579104 10297150 10050286 9840424 9668830 9534501 9435217 9369689 9337769 9338870
59835 9338870 9370954 9430993 9515966 9623512 9751996 9899602 10062796 10235561 10410193 10578523
59825 10578523 10732158 10862221 10959841 11017440 11029746 10994232 10911322 10784386 10619081 10422126
59815 10422126 10200113 9958692 9702186 9433712 9155690 8870296 8579582 8285570 7990806
59806G990806k91666k83208k68895k50024k29041k07748j86380j64558j42636
59797E966650j21362j00715q0244o0626m3607k9952j8555q089J559J0192J8606
59786E533857K7852L7899M8110N8595O9971Q1976R3202J02114J07670J09015J05255
59775F375516R5518P9063N5780K7087l979l4057o0651q2100r7428j06955j12434
59764F135360j15777j17978j19564j21206j22909j23217j20195j12945j01681
59755E079888q7033p0147n2789l6411k1461q256K282R866J6064K2993L0993L8670
59743D924659M4779M8894N0484M8650M3068L4327K3532J2284K763l283n636m991
59731E219530j564M789J3405K3030L3219M4634N7866P2814Q9308J07491J27429
$$ plain form
59806 7990806 7699140 7415932 7147037 6897013 6667972 6460224 6273844 6109286 5966650
59797 5966650 5845288 5744573 5664329 5603703 5560096 5530144 5511589 5503500 5505059 5515251 5533857
59786 5533857 5561709 5599608 5647718 5706313 5776284 5858260 5951462 6053576 6161246 6270261 6375516
59775 6375516 6471034 6550097 6605877 6632964 6628985 6594928 6534277 6452177 6354749 6247794 6135360
59764 6135360 6019583 5901605 5782041 5660835 5537926 5414709 5294514 5181569 5079888
59755 5079888 4992855 4922708 4869919 4833508 4812047 4803791 4806073 4815939 4832003 4854996 4885989 4924659
59743 4924659 4969438 5018332 5068816 5117466 5160534 5194861 5218393 5230677 5233440 5230157 5224521 5219530
59731 5219530 5217966 5222755 5236160 5259190 5292409 5337043 5394909 5467723 5557031 5664522 5791951
59720E791951J48783J70897J92824K13794K34211K55666K79075L03283L26325
59711G916809L47453L66352L80455L84191L71137L36449K78120J98164J03616
59702A0682746N437q4985j59328k13865k48937k67182k71395k63761k46776k23894
59692H708060j98326j71692j44657j18179r3089o9077m5447k2561j342J8402L7845
59681G899937N7607P7614R8277J20270J43083J65328J86780K08846K32568K57351
59671I447661K82314L07943L35694L66488L99993M35047M70538N06139N42278
59662A3094095N79303O16954O54669O91506P25288P52905P72519P84534P89211
59653A9460984P84449P67930P41102P09271O77898O50312O28550O14071O07025
$$ plain form
59720 5791951 5940734 6111631 6304455 6518249 6752460 7008126 7287201 7590484 7916809
59711 7916809 8264262 8630614 9011069 9395260 9766397 10102846 10380966 10579130 10682746
59702 10682746 10688183 10603198 10443870 10230005 9981068 9713886 9442491 9178730 8931954 8708060
59692 8708060 8509734 8338042 8193385 8075206 7982117 7913040 7867593 7845032 7843690 7862092 7899937
59681 7899937 7957544 8035158 8133435 8253705 8396788 8562116 8748896 8957742 9190310 9447661
59671 9447661 9729975 10037918 10373612 10740100 11140093 11575140 12045678 12551817 13094095
59662 13094095 13673398 14290352 14945021 15636527 16361815 17114720 17887239 18671773 19460984
59653 19460984 20245433 21013363 21754465 22463736 23141634 23791946 24420496 25034567 25641592
59644B5641592O06381O11353O21159O32911O41159O40326O26868N99034N56010
59635C1176793M98097M26795L44378K54252J61671P2669q363p9081j37195j79519
59625C2530497k03640k09365j97987j71165j31012q0131k0691M6019J18848J96594
59615C1877967K78621L64510M52433N38911O20763O96334P64082Q20515Q59976
59606C7274112Q75705Q60799Q09149P16586N81696M06266J96242l7544k80566
59597D1402445n17412p34125r19552j066606j172965j239792j269852j267350
59589C3214791j238607j190854j130142j061751r92489r30810q84260q57744q53464
59580B4074670q69849q99941r33191r60350r75898r76439r59943r28004q86078
$$ plain form
59644 25641592 26247973 26859326 27480485 28113396 28754555 29394881 30021749 30620783 31176793
59635 31176793 31674890 32101685 32446063 32700315 32861986 32934655 32926292 32847211 32710016 32530497
59625 32530497 32326857 32117492 31919505 31748340 31617328 31537197 31516506 31562525 31681373 31877967
59615 31877967 32156588 32521098 32973531 33512442 34133205 34829539 35593621 36414136 37274112
59606 37274112 38149817 39010616 39819765 40536351 41118047 41524313 41720555 41683011 41402445
59597 41402445 40885033 40150908 39231356 38164750 36991785 35751993 34482141 33214791
59589 33214791 31976184 30785330 29655188 28593437 27600948 26670138 25785878 24928134 24074670
59580 24074670 23204821 22304880 21371689 20411339 19435441 18459002 17499059 16571055 15684977
59571A5684977q39221p88733p34540o78880o25279n74976n26827m80250m36100
59562A0000171l94826l55961l19719k87361k59254k33882k09514j86059j64714
59553G588881j46536j31876j20702j12548j06353j01121r7122r5791r7787j01536
59543F477509j04710j07076j10452j15371j19407j20039j17869j15181j12304
59534E455100j07630j00786r3386q6384p8900p0389o1944n4517m7477m0049l2793
59523D680845k6486k0627j4191p190m55N655J1538J7728K4307L0665L5780L9300
59511D776869M2170M5463M8912N1678N4102N7273O1106O4699O8516P4299Q2353
59500E427440R0754R7945J04563J12130J21454J32803J46156J60721J75505J90643
$$ plain form
59571 15684977 14845756 14057023 13322483 12643603 12018324 11443348 10916521 10436271 10000171
59562 10000171 9605345 9249384 8929665 8642304 8383050 8149168 7939654 7753595 7588881
59553 7588881 7442345 7310469 7189767 7077219 6970866 6869745 6772623 6676832 6579045 6477509
59543 6477509 6372799 6265723 6155271 6039900 5920493 5800454 5682585 5567404 5455100
59534 5455100 5347470 5246684 5153298 5066914 4988014 4917625 4855681 4801164 4753687 4713638 4680845
59523 4680845 4654359 4633732 4619541 4612351 4611896 4617551 4629089 4646817 4671124 4701789 4737569 4776869
59511 4776869 4819039 4864502 4913414 4965092 5019194 5076467 5137573 5202272 5270788 5345087 5427440
59500 5427440 5518194 5616139 5720702 5832832 5954286 6087089 6233245 6393966 6569471 6760114
59490F760114K06703K22803K37409K51083K65923K81921K96406L07841L17220
59481I147423L24643L27629L24629L17328L07275K92857K72434K48163K23344
59472A1785725J97466J67236J32043R5518O1840L2843Q618j1258k7354l9653m6924
59461A2356100m7763m1846k9419j0556J3801M1139O9135R7181J24587J48222J63727
59450A2884308J68488J62009J44233J15170P5465K5852l3245j00110j70535k39600
59440A3032035l03649l59423m03164m33037m51186m60742m61653m51970m32447
59431I274764m06911l78256l46978l13760k80651k48993k18521j89249j62242
59422F729203j37608j13643q8963o4168m0609j8721J819K1470M1025O1519Q3266
$$ plain form
59490 6760114 6966817 7189620 7427029 7678112 7944035 8225956 8522362 8830203 9147423
59481 9147423 9472066 9799695 10124324 10441652 10748927 11041784 11314218 11562381 11785725
59472 11785725 11983191 12150427 12282470 12377988 12439828 12472671 12481289 12470031 12442677 12403024 12356100
59461 12356100 12308337 12266491 12237072 12226516 12240317 12281456 12350591 12447772 12572359 12720581 12884308
59450 12884308 13052796 13214805 13359038 13474208 13549673 13575525 13542280 13442170 13271635 13032035
59440 13032035 12728386 12368963 11965799 11532762 11081576 10620834 10159181 9707211 9274764
59431 9274764 8867853 8489597 8142619 7828859 7548208 7299215 7080694 6891445 6729203
59422 6729203 6591595 6477952 6388989 6324821 6284212 6265491 6267310 6288780 6329805 6391324 6474590
59411F474590J05523J27175J47307J65394J81808J97812K13885K28247K38009
59402H079750K41539K38700K29396K13301J90688J62001J26770Q4302L5492j7196
59392I584743p1185j23944j72302k13465k46764k73054k92567l04755l09975l09576
59382G267156l04516k95461k83988k71725k58242k41898k23009k04258j87463
59373D996596j71777j55802j39803j24947j11677r9717q8655p7988o7394n7323
59363C901513m8317l9749l0535k1058j2908o447k44O663J3530J9484K4893L0387
59351C837212L5970M1744M8043N3835N6320N3598M7178M0956L8195L9925M5329
59340D338305N2832O1251P0696Q2009R4947J07376J16614J21364J22503J22806
$$ plain form
59411 6474590 6580113 6707288 6854595 7019989 7201797 7399609 7613494 7841741 8079750
59402 8079750 8321289 8559989 8789385 9002686 9193374 9355375 9482145 9566447 9601939 9584743
59392 9584743 9513558 9389614 9217312 9003847 8757083 8484029 8191462 7886707 7576732 7267156
59382 7267156 6962640 6667179 6383191 6111466 5853224 5611326 5388317 5184059 4996596
59373 4996596 4824819 4669017 4529214 4404267 4292590 4192873 4104218 4026230 3958836 3901513
59363 3901513 3853196 3813447 3782912 3761854 3748946 3742499 3742255 3748918 3762448 3781932 3806825 3837212
59351 3837212 3873182 3914926 3962969 4016804 4073124 4126722 4173900 4214856 4253051 4292976 4338305
59340 4338305 4391137 4452388 4523084 4605093 4700040 4807416 4924030 5045394 5167897 5290703
59330E290703J25835J33928J46574J61333J76548J92543K10218K29669K50682
59321F918033K73512K98277L24170L49990L75357M01005M28090M57358M88753
59312A0314545N21537N54748N87080O16110O38418O51219O53547O45166O25182
59303A5807552N93052N50785N02835M53517M05290L59210L15832K75265K37097
59294A9500435K00518J64192J26450Q6170M3008l820n5898j13482j73882k33513
59284A9540178k90784l45309l95142m37316m71036m97894n18600n31802n36899
59275A5515396n35659n29780n18659n00941m77195m49823m21143l92469l64156
59266A1325571l35702l06433k76773k48094k20997j94632j68246j42511j18857
$$ plain form
59330 5290703 5416538 5550466 5697040 5858373 6034921 6227464 6437682 6667351 6918033
59321 6918033 7191545 7489822 7813992 8163982 8539339 8940344 9368434 9825792 10314545
59312 10314545 10836082 11390830 11977910 12594020 13232438 13883657 14537204 15182370 15807552
59303 15807552 16400604 16951389 17454224 17907741 18313031 18672241 18988073 19263338 19500435
59294 19500435 19700953 19865145 19991595 20077765 20120773 20116953 20061055 19947573 19773691 19540178
59284 19540178 19249394 18904085 18508943 18071627 17600591 17102697 16584097 16052295 15515396
59275 15515396 14979737 14449957 13931298 13430357 12953162 12503339 12082196 11689727 11325571
59266 11325571 10989869 10683436 10406663 10158569 9937572 9742940 9574694 9432183 9313326
59257I313326r8275q1210o7662n7002m8579m2873m1039m3046m7312n2648n9254
59246H674426o7242p5407q2391q8134r3250r7760j01233j03507j04416j03325
59236G757761r9767r4195q7487p9937p1177o0882m9188l6554k3269r016O889K4515
59224G177693M2886O0973P8537R5464J11065J25075J38690J53086J67302J79026
59214H329797J87401J93605J98732K02528K04156K02727J96940J85706J69418
59205A0071010J49200J25000R5906O2438K6782r421m5837q1871j16361j49392
59195A0127454j82274k14667k43345k64814k77848k82824k80456k72318k61116
59186G847792k48919k35910k21587k06041j89290j70833j51021j31687j14226
$$ plain form
59257 9313326 9215051 9133841 9066179 9009177 8960598 8917725 8876686 8833640 8786328 8733680 8674426
59246 8674426 8607184 8531777 8449386 8361252 8268002 8170242 8069009 7965502 7861086 7757761
59236 7757761 7657994 7563799 7476312 7396375 7325198 7264316 7215128 7178574 7155305 7146289 7153178 7177693
59224 7177693 7220579 7281552 7360089 7455553 7566618 7691693 7830383 7983469 8150771 8329797
59214 8329797 8517198 8710803 8909535 9112063 9316219 9518946 9715886 9901592 10071010
59205 10071010 10220210 10345210 10441116 10503554 10530336 10520915 10475078 10393207 10276846 10127454
59195 10127454 9945180 9730513 9487168 9222354 8944506 8661682 8381226 8108908 7847792
59186 7847792 7598873 7362963 7141376 6935335 6746045 6575212 6424191 6292504 6178278
59177F178278r7966q1321o3677m5283k6408p488J0890K9027M8184O8910R0454
59166F103600J12537J36389J62967J91335K19929K48297K76587L04491L31871
59157H088003L59292L86481M11026M29724M40328M40968M29119M02861L62532
59148A1750334L09699K45245J70076Q7232J568q2641j62520k35209k97236l45791
59138A1440757l79795l99530m06067m01257l87582l67512l43056l15842k87378
59129H152738k59283k33397k11378j93922j80441j69659j60278j51226j41657
59120F451497j30910j18516j04492q9862p6207o4064n2346m0046k7704j6210n119
59109E726021O348J7533K7490L7243M8468O0086O8801P3423P6219P9196Q1426
$$ plain form
59177 6178278 6080312 5998991 5935314 5890031 5863623 5856135 5867025 5896052 5944236 6013146 6103600
59166 6103600 6216137 6352526 6515493 6706828 6926757 7175054 7451641 7756132 8088003
59157 8088003 8447295 8833776 9244802 9674526 10114854 10555822 10984941 11387802 11750334
59148 11750334 12060033 12305278 12475354 12562586 12564154 12481513 12318993 12083784 11786548 11440757
59138 11440757 11060962 10661432 10255365 9854108 9466526 9099014 8755958 8440116 8152738
59129 8152738 7893455 7660058 7448680 7254758 7074317 6904658 6744380 6593154 6451497
59120 6451497 6320587 6202071 6097579 6007717 5931510 5867446 5815100 5775054 5747350 5731140 5726021
59109 5726021 5732369 5749902 5777392 5814635 5863103 5923189 5991990 6065413 6141632 6220828 6302254
59098F302254Q1088P8020P3049O6474N8394M8949L7494K3232P479o805j8666k9946
59086F721016m1307m9979n3357n2380m9253m4044l6209k7488k0190j3829o469
59075F326511J434P560J1602J5759K1263K7076L2283L7469M3251M9357N5704O2780
59063F692049P0556P8497Q6781R5902J05012J12455J18467J25515J35176J46154
59053G766564J56397J65676J74724J82830J88109J90035J90153J89654J87173
59044I391315J80019J67352J51313J34909J19558J04948R0293P4823N7536L7558
59034A0509624J4499j2217m3794q0794j21845j64659k07610k48958k85473l14112
59024I044661l34746l49054l57006l57193l50730l41498l31283l17680k98695
$$ plain form
59098 6302254 6383342 6461362 6534411 6600885 6659279 6708228 6745722 6768954 6776433 6769628 6750962 6721016
59086 6721016 6679709 6629730 6576373 6523993 6474740 6430696 6394487 6366999 6346809 6332980 6326511
59075 6326511 6327945 6335505 6347107 6362866 6384129 6411205 6443488 6480957 6524208 6573565 6629269 6692049
59063 6692049 6762605 6841102 6927883 7023785 7128797 7241252 7359719 7485234 7620410 7766564
59053 7766564 7922961 8088637 8263361 8446191 8634300 8824335 9014488 9204142 9391315
59044 9391315 9571334 9738686 9889999 10024908 10144466 10249414 10339707 10414530 10472066 10509624
59034 10509624 10524123 10511906 10468112 10387318 10265473 10100814 9893204 9644246 9358773 9044661
59024 9044661 8709915 8360861 8003855 7646662 7295932 6954434 6623151 6305471 6006776
59015F006776k76830k56356k38381k21113k03548j86503j70763j56354j43309
59006D153619j31647j20997j11087j02009r3359q4481p6236p0772o8285o5870
58996C228876o1163n5306n0597m6961m2962l8790l5671l3388l0755k7853k5542
58985B779888k3441k0515j7138j4444j2040q382l165K559Q350J4665K1401K7727
58973B755465L3110L7141L8777L7266L3522K9353K5907K3972K4621K7863L1609
58962C098606L3916L5516L8301M2128M5274M7369M9659N2520N4807N5326N3175
58951C606597M6901L5675K1277P026n502j7104k8384l8468m6398n2076n5509n6629
58939C417406n6206n5655n5538n5085n3358n0087m5595m0577l5650l0595k4743
$$ plain form
59015 6006776 5729946 5473590 5235209 5014096 4810548 4624045 4453282 4296928 4153619
59006 4153619 4021972 3900975 3789888 3687879 3594520 3510039 3433803 3363031 3294746 3228876
58996 3228876 3167713 3112407 3061810 3014849 2971887 2933097 2897426 2864038 2833283 2805430 2779888
58985 2779888 2756447 2735932 2718794 2704350 2692310 2683928 2680763 2683322 2691672 2706337 2727738 2755465
58973 2755465 2788575 2825716 2864493 2901759 2935281 2964634 2990541 3014513 3039134 3066997 3098606
58962 3098606 3132522 3168038 3206339 3248467 3293741 3341110 3390769 3443289 3498096 3553422 3606597
58951 3606597 3653498 3689173 3710450 3717476 3711974 3694870 3666486 3628018 3581620 3529544 3474035 3417406
58939 3417406 3361200 3305545 3250007 3194922 3141564 3091477 3045882 3005305 2969655 2939060 2914317
58928B914317j8527j3434r547m922J270O612Q482P791P517Q682J0030J0633J0399
58915B939303Q881O121M186N310Q926J2765J6364K0998K6601L1450L4788L7232
58903C152925L8688L8311L6648L5338L4659L3686L2858L3737L6019L7525L7841
58892C548235L9448M4394N1904O0019O7630P4076P8747Q1950Q4793Q7654R0210
58881D309060R3119R7804J04186J10497J15937J21880J29859J39890J51151J62830
58871E536213J73981J84162J94556K06853K20674K33574K43913K52313K60256
58862G506495K68978K79868K94009L10842L28860L48017L69991L95839M25005
58853A0527904M56797M91216N27899N65739O03871O41620O77381P08988P35296
$$ plain form
58928 2914317 2895790 2882356 2872809 2867887 2869157 2875769 2884251 2892042 2899559 2908241 2918271 2928904 2939303
58915 2939303 2948184 2954305 2958491 2963801 2972727 2985492 3001856 3022854 3049455 3080905 3115693 3152925
58903 3152925 3191613 3229924 3266572 3301910 3336569 3370255 3403113 3436850 3472869 3510394 3548235
58892 3548235 3587683 3632077 3683981 3744000 3811630 3885706 3964453 4046403 4131196 4218850 4309060
58881 4309060 4402179 4499983 4604169 4714666 4830603 4952483 5082342 5222232 5373383 5536213
58871 5536213 5710194 5894356 6088912 6295765 6516439 6750013 6993926 7246239 7506495
58862 7506495 7775473 8055341 8349350 8660192 8989052 9337069 9707060 10102899 10527904
58853 10527904 10984701 11475917 12003816 12569555 13173426 13815046 14492427 15201415 15936711
58844A5936711P55791P68578P70095P57005P26996O78037O08661N19082M10716
58835B1931672K85073J44951l523j51953k93047m21763n33984o26267o96933p45981
58825A8888245p74513p85578p83998p72886p51542p19478o81096o42833o06608
58816A2369713n70055n32682m97287m65134m34370m04469l77932l55875l35626
58807H396283l14740k94093k75066k56691k37954k20278k05441j93034j81845
58798F217141j71741j62461j52497j40987j29078j18040j07539r6902q6268p5503
58788D976125o3975n2252m1979l3194k4030j3814l939N195J5178K6314L6455M4679
58776D870763N3080O3067P2946Q1403R0494J02393J15605J27340J37719J48856
$$ plain form
58844 15936711 16692502 17461080 18231175 18988180 19715176 20393213 21001874 21520956 21931672
58835 21931672 22216745 22361696 22358173 22206220 21913173 21491410 20957426 20331159 19634226 18888245
58825 18888245 18113732 17328154 16544156 15771270 15019728 14300250 13619154 12976321 12369713
58816 12369713 11799658 11266976 10769689 10304555 9870185 9465716 9087784 8731909 8396283
58807 8396283 8081543 7787450 7512384 7255693 7017739 6797461 6592020 6398986 6217141
58798 6217141 6045400 5882939 5730442 5589455 5460377 5342337 5234798 5137896 5051628 4976125
58788 4976125 4912150 4859898 4817919 4784725 4760695 4746881 4742942 4748137 4763315 4789629 4826084 4870763
58776 4870763 4923843 4986910 5059856 5141259 5231753 5334146 5449751 5577091 5714810 5863666
58766E863666J61420J74769J89108K04878K21054K36277K50742K65174K79311
58757G846399K93251L08895L27957L49768L72976L98160M26690M58190M91114
58748A1273400N24884N59505N93939O26551O56154O81258O99391P08602P08158
58739A7031842O96201O68434O21151N54320M69767L68035K49659J18565j8372
58730B0759602j54687k85370m05384n09880n96279o64597p15549p49369p66410
58721A5912077p67901p56324p35372p08732o78255o44148o07221n69665n33069
58712I911390m97480m63242m31855m03806l77276l50634l24729l01329k80639
58703F480400k61731k44149k27675k11830j96857j83751j72257j60356j46996
$$ plain form
58766 5863666 6025086 6199855 6388963 6593841 6814895 7051172 7301914 7567088 7846399
58757 7846399 8139650 8448545 8776502 9126270 9499246 9897406 10324096 10782286 11273400
58748 11273400 11798284 12357789 12951728 13578279 14234433 14915691 15615082 16323684 17031842
58739 17031842 17728043 18396477 19017628 19571948 20041715 20409750 20659409 20777974 20759602
58730 20759602 20604915 20319545 19914161 19404281 18808002 18143405 17427856 16678487 15912077
58721 15912077 15144176 14387852 13652480 12943748 12265493 11621345 11014124 10444459 9911390
58712 9911390 9413910 8950668 8518813 8115007 7737731 7387097 7062368 6761039 6480400
58703 6480400 6218669 5974520 5746845 5535015 5338158 5154407 4982150 4821794 4674798
58694D674798j33543j21230j09102r6098q3258p1936o1490n0625l9583k9177j9043
58683C859713q761Q12R036J6856K4841L1277L4171L3658L0635K4492J4451K008
58671D073189j0037k0102k8000l3973l9204m5686n3825o1529o7294p2433p8493
58660C562613q4490q8887r2303r5672r7636r6573r3690r1100q8130q2642p5121
58649B576369o8277o2980n7534n0828m3772l7578l2635k8933k5875k2210j7832
58638B127915j4883j5319j8299k1770k5505l0468l6198m1116m4628m6821m6904
58627A786004m4235m0107l6412l3120k9003k4011j8886j3507p770l079n71J160
58615A536463M208Q053J0533J1314J1836J2582J2904J3018J3617J3977J2960J1331
$$ plain form
58694 4674798 4541255 4420025 4310923 4214825 4131567 4059631 3998141 3947516 3907933 3878756 3859713
58683 3859713 3850952 3851764 3860800 3877656 3902497 3933774 3967945 4001603 4032238 4056730 4071181 4073189
58671 4073189 4063152 4043050 4015050 3981077 3941873 3896187 3842362 3780833 3713539 3641106 3562613
58660 3562613 3478123 3389236 3296933 3201261 3103625 3007052 2913362 2822262 2734132 2651490 2576369
58649 2576369 2508092 2445112 2387578 2336750 2292978 2255400 2222765 2193832 2167957 2145747 2127915
58638 2127915 2113032 2097713 2079414 2057644 2032139 2001671 1965473 1924357 1879729 1832908 1786004
58627 1786004 1741769 1701662 1665250 1632130 1603127 1579116 1560230 1546723 1538953 1535874 1535303 1536463
58615 1536463 1540671 1548724 1559257 1570571 1582407 1594989 1607893 1620911 1634528 1648505 1661465 1672796
58603A672796J0657J0372Q550N282K510O41k024o293j0840j4362j6892j8647j9394
58590A622356j9247j8584j7052j4053j0109o455l462n55K791O985J2352J8036
58578A573003K1993K3534K4649K7269L0530L2537L3391L4426L5793L7031L8857
58567A913013M2044M5582M8184N0491N3651N7038N9825O3481P0010P8803Q7880
58556B570002R7135J07553J18404J28220J37649J48370J60010J71029J81739J93125
58546D013236K03452K09524K10917K09605K05489J95563J77647J51936J18953
58537E696322P9100L4738j0057n2221r0166j22026j46294j64004j77357j86104
58527D861931j88133j83710j76138j67770j58040j46048j32563j18759j05027
$$ plain form
58603 1672796 1683453 1693825 1702375 1707657 1710167 1710808 1708784 1702491 1691651 1677289 1660397 1641750 1622356
58590 1622356 1603109 1584525 1567473 1553420 1543311 1536856 1533394 1532839 1535630 1542615 1554967 1573003
58578 1573003 1594996 1618530 1643179 1670448 1700978 1733515 1766906 1801332 1837125 1874156 1913013
58567 1913013 1955057 2000639 2048823 2099314 2152965 2210003 2269828 2333309 2403319 2482122 2570002
58556 2570002 2667137 2774690 2893094 3021314 3158963 3307333 3467343 3638372 3820111 4013236
58546 4013236 4216688 4426212 4637129 4846734 5052223 5247786 5425433 5577369 5696322
58537 5696322 5775422 5810160 5800103 5747882 5657716 5535690 5389396 5225392 5048035 4861931
58527 4861931 4673798 4490088 4313950 4146180 3988140 3842092 3709529 3590770 3485743
58518C485743r1651p8955o6452n3421m0257k8031j7159p897r92L949R390J6897
58506C131164K4580L0045L4268L9447M4308M5169M0735L2117J8875q24k5882n1845
58494C362157p5363r5910j12875j24335j29532j29851j26632j20304j11900j03163
58484B232292r4906q7067p9924p3261o5487n6144m8090m4133m2615l9643l4672
58473A566350l0180k6874k3387k0144j9043j9210j7434j3225r498p700o140l808
58461A369707k137k037k499k785k925j729K311P717J0949J1208J1228J2958J5469
58448A427435J7326J7903J6347J2414Q202N893M207O54l526m774k880p16J306
58435A499791N471J1517J6387J9903K5310L3129L9471M2005M2728M3242M1836
$$ plain form
58518 3485743 3394092 3315137 3248685 3195264 3155007 3126976 3109817 3101920 3100928 3104877 3114267 3131164
58506 3131164 3155744 3185789 3220057 3259504 3303812 3348981 3389716 3421833 3440708 3439884 3414002 3362157
58494 3362157 3286794 3190884 3078009 2953674 2824142 2694291 2567659 2447355 2335455 2232292
58484 2232292 2137386 2050319 1970395 1897134 1831647 1775503 1727413 1683280 1640665 1601022 1566350
58473 1566350 1536170 1509296 1485909 1465765 1446722 1427512 1410078 1396853 1387355 1379655 1373515 1369707
58461 1369707 1367570 1365533 1363034 1360249 1357324 1355595 1357906 1365623 1376572 1387780 1399008 1411966 1427435
58448 1427435 1444761 1462664 1479011 1491425 1499627 1505520 1509727 1510381 1506855 1502081 1499201 1498485 1499791
58435 1499791 1505262 1516779 1533166 1553069 1578379 1611508 1650979 1692984 1735712 1778954 1820790
58424A820790L7199L0750K3614J5072N601k626r653j8109k8325l7303m3764m9683
58412A743563n5319n7593n5491n2437n0941m9209m5513m1620l9187l6629l2356
58401A227268k7609k3578j9198j4194j0691r354p422l236P47K019J874K558L718
58388A122902M323N171O825P803P224O746P494P723N768L021J845K567M206O123
58374A199741P668Q263Q661R814J0277P765L260l2j958n383j0350j3180j2508
58361A212038j1488j2276j2945j1777j0185r296p742m892k357n24K425O459Q972
58348A146412R563J1092J4418J6780J7002J7310J8294J7445J4660J3539J4657
58337A311172J3314P105L25k605k958l516l767l008l471o365r037r582j0029j1534
$$ plain form
58424 1820790 1857989 1888739 1912353 1927425 1933026 1930400 1920747 1902638 1874313 1837010 1793246 1743563
58412 1743563 1688244 1630651 1575160 1522723 1471782 1422573 1377060 1335440 1296253 1259624 1227268
58401 1227268 1199659 1176081 1156883 1142689 1131998 1122644 1115222 1111986 1112733 1114752 1116626 1119184 1122902
58388 1122902 1127225 1132396 1139221 1147024 1154248 1160994 1168488 1176211 1181979 1185000 1186845 1189412 1193618 1199741
58374 1199741 1207409 1215672 1224333 1234147 1244424 1252189 1255449 1255417 1253459 1248076 1237726 1224546 1212038
58361 1212038 1200550 1188274 1175329 1163552 1153367 1144071 1136329 1131437 1129080 1128556 1130981 1137440 1146412
58348 1146412 1155975 1167067 1181485 1198265 1215267 1232577 1250871 1268316 1282976 1296515 1311172
58337 1311172 1324486 1331591 1331916 1329311 1326353 1322837 1319070 1316062 1312591 1306226 1297189 1287607 1277578 1266044
58323A266044j0983n985R05O382J0539J3687J3776J0561P851Q007Q552P415O808
58310A343559Q318R205P430N684O371P341O567O328Q520J0548J0159R985J2849
58297A452864J6726J8551J8925J9262J8602J6986J7355K0377K2144K0696J9707
58286A662195K1744K3274K0660J5966J2414R325N857M376N676O305M858N145Q791
58273A806586J1222R756Q897J2198J5748J5853J6374K1559K7887L0174K9908L0442
58261B036604K9839K5854K2458K3811K6732K6502K5110K6497K8805K8698K8342
58250B329252L0645L2611L0763K8108K8341K8460K4757K0615K0387K1090J8471
58239B613500J5954J8785K4296K6843K7721L1483L6864M0029M2451M7191N1853
$$ plain form
58323 1266044 1255061 1249076 1249981 1256363 1266902 1280589 1294365 1304926 1312777 1320784 1329336 1336751 1343559
58310 1343559 1351877 1361082 1368512 1374196 1380567 1387908 1394475 1400803 1409323 1419871 1430030 1440015 1452864
58297 1452864 1469590 1488141 1507066 1526328 1544930 1561916 1579271 1599648 1621792 1642488 1662195
58286 1662195 1683939 1707213 1727873 1743839 1756253 1765578 1771435 1775811 1781487 1787792 1792650 1797795 1806586
58273 1806586 1817808 1827564 1836461 1848659 1864407 1880260 1896634 1918193 1946080 1976254 2006162 2036604
58261 2036604 2066443 2092297 2114755 2138566 2165298 2191800 2216910 2243407 2272212 2300910 2329252
58250 2329252 2359897 2392508 2423271 2451379 2479720 2508180 2532937 2553552 2573939 2595029 2613500
58239 2613500 2629454 2648239 2672535 2699378 2727099 2758582 2795446 2835475 2877926 2925117 2976970
58228B976970N3388N5137O1048O7937P1685P5374Q2885R0539R4152R8074J07547
58217C834736J18422J24638J29629J39632J51603J58884J63087J69069J73567
58208E163267J70272J61161J51671J39996J22459J03928R1490Q3328P5120P1078
58198F333770P6728Q7259R5578J05324J23112J44848J63204J81627K06664K33491
58188G751605K53791K71230K94016L19132L39327L58445L83700M10201M29841
58179A0811288M47859M73391N01918N25399N51034N89961O35679O74774P11099
58170A5922402P57359Q10468Q58139R02506R53715J007694J054952J103930J169973
58161B4541138J248681J326470J409122J511368J627023J740071J857108J996101
$$ plain form
58228 2976970 3030358 3085495 3146543 3214480 3286165 3361539 3444424 3534963 3629115 3727189 3834736
58217 3834736 3953158 4077796 4207425 4347057 4498660 4657544 4820631 4989700 5163267
58208 5163267 5333539 5494700 5646371 5786367 5908826 6012754 6104244 6187572 6262692 6333770
58198 6333770 6410498 6497757 6593335 6698659 6821771 6966619 7129823 7311450 7518114 7751605
58188 7751605 8005396 8276626 8570642 8889774 9229101 9587546 9971246 10381447 10811288
58179 10811288 11259147 11732538 12234456 12759855 13310889 13900850 14536529 15211303 15922402
58170 15922402 16679761 17490229 18348368 19250874 20204589 21212283 22267235 23371165 24541138
58161 24541138 25789819 27116289 28525411 30036779 31663802 33403873 35260981 37257082
58153C7257082K151017K302308K455349K632876K837485L059917L315847L633054
58145E9644935M011324M440081M945905N572273O321081P168747Q130857R249769
58137A09484972J0524598J1914068J3392452J4934621J6489842J8099746K0038803
58130B14879102K2693934K6262140L0631664L5404273L9619347M1334054L8046274
58123D48870788K8352084J3513858k836358j6827232k6373876l1513777l3390656
58116C79794831l3225801l1930713l0091997k8008946k5789307k3498032k1216581
58109A86033454j8993997j6832987j4752735j2815879j1078021r552044q232121
58102I3775670p112177o166397n345694m612297l958138l379963k858067k371009
$$ plain form
58153 37257082 39408099 41710407 44165756 46798632 49636117 52696034 56011881 59644935
58145 59644935 63656259 68096340 73042245 78614518 84935599 92104346 100235203 109484972
58137 109484972 120009570 131923638 145316090 160250711 176740553 194840299 214879102
58130 214879102 237573036 263835176 294466840 329871113 369490460 410824514 448870788
58123 448870788 477222872 490736730 487900372 471073140 444699264 413185487 379794831
58116 379794831 346569030 314638317 284546320 256537374 230748067 207250035 186033454
58109 186033454 167039457 150206470 135453735 122637856 111559835 102007791 93775670
58102 93775670 86663493 80497096 75151402 70539105 66580967 63201004 60342937 57971928
58094E7971928j913005j482198j063398o36586j95701K55393P21528J210528J706175
58085E6574664K181814K671486L282579M031849M628167M521439L313327J157895
58077H2363220j297465l381711m784274n538958n794236n687357n352339m912720
58069D5614160m439212l958825l501778l099854k749947k424504k117711j848006
58061B1474323j620393j421346j248360j111494j005628r11152q23298p54148
58053A2578504p04960o61656o18443n81822n50240n12841m70155m34305m06924
58044G637158l77089l42661l13742k93220k72863k50769k34301k23462k08906
58035E120145j88874j71672j59365j45188j29202j20365j20720j22535j23124
$$ plain form
58094 57971928 56058923 54576725 53513327 52876741 52681040 52936433 53657961 54868489 56574664
58085 56574664 58756478 61427964 64710543 68742392 73370559 77891998 81205325 82363220
58077 82363220 81065755 77684044 72899770 67360812 61566576 55879219 50526880 45614160
58069 45614160 41174948 37216123 33714345 30614491 27864544 25440040 23322329 21474323
58061 21474323 19853930 18432584 17184224 16072730 15067102 14155950 13332652 12578504
58053 12578504 11873544 11211888 10593445 10011623 9461383 8948542 8478387 8044082 7637158
58044 7637158 7260069 6917408 6603666 6310446 6037583 5786814 5552513 5329051 5120145
58035 5120145 4931271 4759599 4600234 4455046 4325844 4205479 4084759 3962224 3839100
58026C839100j27508j34461j35327j29376j25797j27476j26710j19854j12694
58017B699897j08279j02483r4627q9789q7706q1715p1511o4785o3610o1328n5594
58006A818470n2069n2137m9446m2265l7401l7756l7515l3794l1834l4131l5120
57995A375002l1558k8187k8293k8038k4868k2512k3009k2289j8295j5348j6093
57984A116512j6798j4772j2924j3116j2299r076o973p659p731n548m424n937o822
57971I92433n509n057o756p499o192n975p499o839k861K13K78N98K937M321L580
57956I50173M223P839J1143J2514J4910J9310K1993K1489K1797K5441K9468L1531
57944A171831L3731L7320L9838M0750M3795N0197N5447N6376N5722N6178N5546
$$ plain form
58026 3839100 3711592 3577131 3441804 3312428 3186631 3059155 2932445 2812591 2699897
58017 2699897 2591618 2489135 2394508 2304719 2217013 2135298 2063787 1999002 1935392 1874064 1818470
58006 1818470 1766401 1714264 1664818 1622553 1585152 1547396 1509881 1476087 1444253 1410122 1375002
57995 1375002 1343444 1315257 1286964 1258926 1234058 1211546 1188537 1166248 1147953 1132605 1116512
57984 1116512 1099714 1084942 1072018 1058902 1046603 1037527 1030554 1022895 1015164 1009616 1005192 999255 992433
57971 992433 986924 981867 975111 967612 961420 955445 947946 941107 938246 938459 938737 939335 942272 946593 950173
57956 950173 954396 962235 973378 985892 1000802 1020112 1042105 1063594 1085391 1110832 1140300 1171831
57944 1171831 1205562 1242882 1282720 1323470 1367265 1417462 1472909 1529285 1585007 1641185 1696731
57933A696731N1503M5913M0604L3808K4357J4834P276r6r106j8869k8792l9516
57921A818647m8815n1960m8695m4672m3562m2938m0187l6666l3198k7377j8675
57910A381902j0915o319k162L710R236J3194J8344K6025L2752L5890L7798M0748
57898A580203M2493M0547L6289L1135K3143J1089k249j4213k5409l5713m1844
57887A645471m2368m0597l9126l6083l0197k4493k0986j6512q361L94N781R158
57875A402081J3900J9481K3509K6345K9070K9592K5108J6123M698q630k2954l5178
57863A523145m3656n0663n8047o3552o4751o3216o1311n8195n2831m7641m5146
57852I14136m3701m0359l5384l0415k5023j8782j4004j2673j3063j2734j2236
$$ plain form
57933 1696731 1748234 1794147 1834751 1868559 1892916 1907750 1915026 1914930 1905824 1886955 1858163 1818647
57921 1818647 1769832 1717872 1669177 1624505 1580943 1538005 1497818 1461152 1427954 1400577 1381902
57910 1381902 1370987 1364668 1362506 1366216 1375452 1388646 1406990 1433015 1465767 1501657 1539455 1580203
57898 1580203 1622696 1663243 1699532 1730667 1753810 1764899 1762650 1748437 1723028 1687315 1645471
57887 1645471 1603103 1562506 1523380 1487297 1457100 1432607 1411621 1395109 1386748 1387142 1392923 1402081
57875 1402081 1415981 1435462 1458971 1485316 1514386 1543978 1569086 1585209 1589907 1581277 1558323 1523145
57863 1523145 1479489 1428826 1370779 1307227 1242476 1179260 1117949 1059754 1006923 959282 914136
57852 914136 870435 830076 794692 764277 739254 720472 706468 693795 680732 667998 655762
57841F55762j2595j2108r320o354n603n712m486l085l494m385l476j681j037p34
57827E81692R77K997L286K640K835K986J357r56j790j623k128k773k251j576k307
57812E83366l466l495l580n487p689p318m724k682k044j333J74J784L130M229
57798E50865M742M893N728O934O486M065K289K570K750J101o27r09j731m600o683
57783E77873n043j939j388k738k354L5J429Q83K70L88K77N1P84J907J868R97P88
57766E74088J103O98j35k48o2p97k218l434m805o745q073p945p866r175j0323
57751E14063r374p480o892p111o074l858k139j244n16k69p08l12K024M812O510
57736D81432Q357J1755J4963J5700J5238J6533J9825K3364K6897L1082L4990L7550
$$ plain form
57841 655762 643167 631059 621739 615385 609782 604070 599584 596499 593005 588620 585144 583463 582426 581692
57827 581692 582669 585666 588952 591592 594427 597413 598770 597814 596024 594401 592273 589500 587249 585673 583366
57812 583366 579900 576405 572825 567338 559649 552331 547607 544925 542881 541548 541722 543506 546636 550865
57798 550865 555607 560500 566228 573162 579648 583713 586002 588572 591322 592423 591796 590887 589156 584556 577873
57783 577873 572830 570891 569503 566765 564411 564446 565875 566758 567028 567416 567693 567744 568528 570435 572303 573300 574088
57766 574088 575191 575889 575754 575506 575444 574647 572429 568995 564190 557445 549372 541427 533561 524386 514063
57751 514063 504689 497209 490317 483206 477132 473274 471135 469891 469375 469106 468398 468086 470110 474922 481432
57736 481432 489789 501544 516507 532207 547445 563978 583803 607167 634064 665146 700136 737686
57724G37686L9924M3245M5576M4540M1207L7864L3709K6446J6531O100m520j5430
57712A052878k4187k8548l0598l3741l7125l7674l6073l5671l6356l4897l0978
57701F87030k7630k5649k2563j7673j3400j0823q206m854k431j559p22N83R84
57688E53087K29p8P50J922L364N413O516M710J301m74m54j419l918n220m010k191
57672E59528j247l13J225K484L258M369N292M603L170L718O573R153J0212J1258
57658F23283J3052J4112J3666J3137J3610J4425J5015J5687J6301J6632J7962
57647G86882K1387K4929K5668K4453K4839K7493K9808L1124L3832L8539M2737
57636A111691M5390M8413N2070N3401N1306M9194N0109N2772N4900N7198O1506
$$ plain form
57724 737686 777610 820855 866431 910971 952178 990042 1023751 1050197 1066728 1072828 1068308 1052878
57712 1052878 1028691 1000143 969545 935804 898679 861005 824932 789261 752905 718008 687030
57701 687030 659400 633751 611188 593515 580115 569292 561086 556232 553801 552242 551520 552103 553087
57688 553087 553316 553238 553988 555910 559274 564687 571203 575913 577214 576740 576286 574867 570949 565729 561719 559528
57672 559528 558281 557968 559193 561677 564935 569304 574596 579199 582369 586087 592660 601813 612025 623283
57658 623283 636335 650447 664113 677250 690860 705285 720300 735987 752288 768920 786882
57647 786882 808269 833198 858866 883319 908158 935651 965459 996583 1030415 1068954 1111691
57636 1111691 1157081 1205494 1257564 1310965 1362271 1411465 1461574 1514346 1569246 1626444 1687950
57625A687950O7695P4922Q3637R4126J05096J15603J26547J38853J52257J66894
57615B813580J83503K00953K16311K28659K39889K50165K55748K53431K44278
57606D886517K30447K10468J79877J35008P4838J865p6509j49301k07327k47068
57596E038815k69363k76846k73579k64101k50563k32561k11014j89789j71884
57587B899115j56393j41130j25911j11471r7459q3760p1789o2346n3819m4515
57577A950522l5085k6866j9598j2649o773k567J289O346J2231J7945K3942L1183
57565A939920L9326M7432N5314O2947O9817P6156Q3344R1856J00333J07924J15807
57554B790176J24963J34087J41246J46116J49033J49040J44338J33480J15316
$$ plain form
57625 1687950 1755645 1830567 1914204 2008330 2113426 2229029 2355576 2494429 2646686 2813580
57615 2813580 2997083 3198036 3414347 3643006 3882895 4133060 4388808 4642239 4886517
57606 4886517 5116964 5327432 5507309 5642317 5717155 5719020 5642511 5493210 5285883 5038815
57596 5038815 4769452 4492606 4219027 3954926 3704363 3471802 3260788 3070999 2899115
57587 2899115 2742722 2601592 2475681 2364210 2266751 2182991 2111202 2048856 1995037 1950522
57577 1950522 1915437 1888571 1868973 1856324 1849551 1846984 1848273 1854619 1866850 1884795 1908737 1939920
57565 1939920 1979246 2026678 2081992 2144939 2214756 2290912 2374256 2466112 2566445 2674369 2790176
57554 2790176 2915139 3049226 3190472 3336588 3485621 3634661 3778999 3912479 4027795
57545D027795Q9299N6957K1553j4599n0778q5227j14397j36313j52466j64816
57535C477008j72939j75773j74030j69046j61166j51271j41889j34565j27731
57526B068598j19223j09508j00396r2078q3734p5833o9567o4769o0224n5467n0797
57515A187002m6201m1581l7278l3493l0045k7329k6069k5518k3769k0650j8241
57504H56828j7530j6801j4642j2137j0530r087p069n452m722l394r37M20o24j328
57490G52995J405O179R253J0050J1104J3518J5898J7342J8456J9478K0018K0674
57478I16370K2619K5610K8336L0588L3238L6401L9344M2024M5109M8809N3016
57467A321464N8070O4105P0236P5675Q0892Q6523R2195R7519J02976J08400J12116
$$ plain form
57545 4027795 4117094 4174051 4195604 4181005 4130227 4045000 3930603 3794290 3641824 3477008
57535 3477008 3304069 3128296 2954266 2785220 2624054 2472783 2330894 2196329 2068598
57526 2068598 1949375 1839867 1739471 1647393 1563659 1487826 1418259 1353490 1293266 1237799 1187002
57515 1187002 1140801 1099220 1061942 1028449 998404 971075 945006 919488 895719 875069 856828
57504 856828 839298 822497 807855 795718 785188 776101 769032 763580 758858 755464 754527 754947 754323 752995
57490 752995 754400 760579 769832 779882 790986 804504 820402 837744 856200 875678 895696 916370
57478 916370 938989 964599 992935 1023523 1056761 1093162 1132506 1174530 1219639 1268448 1321464
57467 1321464 1379534 1443639 1513875 1589550 1670442 1756965 1849160 1946679 2049655 2158055 2270171
57456B270171J13197J12859J11673J07011R5723P8102N6845L3318P451j9474m4746
57445B922130o6718q5252j00053j10558j17059j20098j19391j15171j09594j04673
57435A873563r9490r1815q1914p2376o4601n7865n1602m6267m1733l6984l1685
57424A197231k6462k1550j6623j1854p711l968k71K773M598O188R041J3040J7045
57411A161477K1016K5883L1639L7347M2890M8986N5580O1657O6706P1255P6090
57400A700526Q1740Q8252R4677R9539J02478J04307J04716J01518R3319Q1149
57390B652221O5879M6021K0316r017l7885o3967q6797j05539j19160j27843j32194
57379B102035j32099j28204j23030j18373j13132j05946r8259r2040q6302p9178
$$ plain form
57456 2270171 2383368 2496227 2607900 2714911 2810634 2888736 2945581 2978899 2986350 2966876 2922130
57445 2922130 2855412 2770160 2670107 2559549 2442490 2322392 2203001 2087830 1978236 1873563
57435 1873563 1774073 1682258 1600344 1527968 1463367 1405502 1353900 1307633 1265900 1228916 1197231
57424 1197231 1170769 1149219 1132596 1120742 1113031 1109063 1108792 1111565 1116163 1122351 1131392 1144432 1161477
57411 1161477 1182493 1208376 1240015 1277362 1320252 1369238 1424818 1486475 1553181 1624436 1700526
57400 1700526 1782266 1870518 1965195 2064734 2167212 2271519 2376235 2477753 2571072 2652221
57390 2652221 2718100 2764121 2784437 2775420 2737535 2673568 2586771 2481232 2362072 2234229 2102035
57379 2102035 1969936 1841732 1718702 1600329 1487197 1381251 1282992 1190952 1104650 1025472
57369A025472p1863o6895o3587n9014n2748m7009m2569l8236l4095l1510l0026
57358D87920k7839k5363k4661k5231k4196k1178j9054j9118j9207j7802j6243
57347B48028j5421j3677r943o191m683n034n677o236o879p070o478n562m347k192
57333A48638M30J797J432R13J374K049J976J423O78o77k492l616l507k887k302
57318A45229j621j176j678k640k774k268k754m710o749p703p591o471m517l153
57304H9424l661m683l744j294k11j093j403n5P79k76j181K20L048N415O997P911
57288I6193P516O223O158P934R057P530N062M477N805P277Q547J0534J3074J5015
57274B10402J6025J6638J7031J7092J7083J7245J7441J7817J8753J9704J9423
$$ plain form
57369 1025472 953609 886714 823127 764113 711365 664356 621787 583551 549456 517946 487920
57358 487920 460081 434718 410057 384826 360630 339452 320398 301280 282073 264271 248028
57347 248028 232607 218930 208987 202796 198113 193079 187402 181166 174287 167217 160739 155177 150830 148638
57333 148638 149068 150865 152297 153210 154584 156633 158609 160032 160710 160033 157541 153925 150418 147531 145229
57318 145229 143608 142432 140754 138114 135340 133072 130318 125608 118859 111156 103565 97094 92577 89424
57304 89424 85763 81080 77336 76042 75831 74738 73335 73280 74059 73783 72602 72822 75870 81285 88282 96193
57288 96193 103709 109932 116090 124024 133081 140611 145673 150150 155955 163232 171779 182313 195387 210402
57274 210402 226427 243065 260096 277188 294271 311516 328957 346774 365527 385231 404654
57263D04654J7929J6729J6533J6504J6270J6659J7624J7583J5963J4301J3558
57252E84307J2452R920P271O228O492O900P411Q444R663J0851J2585J4916J6826
57239G14266J8106K0070K3160K5788K6835K7483K8977L0556L1284L2194L4551
57228A013270L7485L9295L9964M0647M1687M2727M3814M5016M5935M6513M7293
57217A483646M8016M7480M5523M3297M0730L5916K8224J9802J2466N367k570j0166
57205A797731j5904k0296k4219k6813k7252k6872k7230k7577k6422k4231k2355
57194A528560k0631j8071j4782j1360p696m046j680p59O54L662O571P906R172
57181A477500J2030J4736J4523J1977J0057R777R774R228Q473P408N813M485L982
$$ plain form
57263 404654 422583 439312 455845 472349 488619 505278 522902 540485 556448 570749 584307
57252 584307 596759 606679 613950 620178 626670 633570 640981 649425 659088 669939 682524 697440 714266
57239 714266 732372 752442 775602 801390 828225 855708 884685 915241 946525 978719 1013270
57228 1013270 1050755 1090050 1130014 1170661 1212348 1255075 1298889 1343905 1389840 1436353 1483646
57217 1483646 1531662 1579142 1624665 1667962 1708692 1744608 1772832 1792634 1805100 1810467 1807897 1797731
57205 1797731 1781827 1761531 1737312 1710499 1683247 1656375 1629145 1601568 1575146 1550915 1528560
57194 1528560 1507929 1489858 1475076 1463716 1456020 1451974 1450294 1449535 1450189 1453851 1460422 1468328 1477500
57181 1477500 1489530 1504266 1518789 1530766 1540823 1550600 1560374 1569602 1578075 1585483 1591296 1595781 1599763
57168A599763L251J649R54K840N728O956O887P799R813J1118J1678J3359J6539
57155A698334J9531K1517K3409K5739K8136L0931L5055M0205M5161M9744N4435
57144B072197N8359N9804N8820N7357N6956N7906O0212O3556O6730O8969P1476
57133B752342P5928Q1991Q8030R3563R9165J04565J08778J11662J13740J15061
57123C744825J15723J16528J17543J17126J14180J10181J07242J05375J03462
57114D752185J01390R9206R5764R0509Q5216Q1750P9473P7006P4686P3002P0628
57103E680815O6815O3843O3996O5806O6338O5455O4613O3243N9808N5015N0630
57092F366377M6555M2198L8896L7535L5739L0989K4593J8778J2118K029j0461
$$ plain form
57168 1599763 1603014 1604663 1605617 1608457 1614185 1621141 1628028 1635827 1645640 1656758 1668436 1681795 1698334
57155 1698334 1717865 1739382 1762791 1788530 1816666 1847597 1882652 1922857 1968018 2017762 2072197
57144 2072197 2130556 2190360 2249180 2306537 2363493 2421399 2481611 2545167 2611897 2680866 2752342
57133 2752342 2828270 2910261 2998291 3091854 3191019 3295584 3404362 3516024 3629764 3744825
57123 3744825 3860548 3977076 4094619 4211745 4325925 4436106 4543348 4648723 4752185
57114 4752185 4853575 4952781 5048545 5139054 5224270 5306020 5385493 5462499 5537185 5610187 5680815
57103 5680815 5747630 5811473 5875469 5941275 6007613 6073068 6137681 6200924 6260732 6315747 6366377
57092 6366377 6412932 6455130 6494026 6531561 6567300 6598289 6622882 6641660 6653778 6655807 6645346
57081F645346k2977l6635n3663p2407r0101j08611j31540j57191j80560k01301
57071E590360k23455k47881k71276k92576l14516l38723l64729l93710m28037
57062B715457m67576n11354n61467E55054a29089p50498q22195r04638r96524
57053c602944j093004j195770j311578j442876j589196j756025j952197k179630
57045a6123220k435595k723361l049694l414078l813068m254266m754218n325906
57037d5893406n982070o745676p639296q667059r819310j1076019j2379026j3634033
57029a21835895j4805309j5986079j7253638j8400862j8935396j8510590j7366436
57022b43094205j6225728j5694316j5795990j6071145j5998384j5247414j3640424
$$ plain form
57081 6645346 6622369 6585734 6532071 6459664 6369563 6260952 6129412 5972221 5791661 5590360
57071 5590360 5366905 5119024 4847748 4555172 4240656 3901933 3537204 3143494 2715457
57062 2715457 2247881 1736527 1175060 555054 -129089 -879587 -1701782 -2606420 -3602944
57053 -3602944 -4695948 -5891718 -7203296 -8646172 -10235368 -11991393 -13943590 -16123220
57045 -16123220 -18558815 -21282176 -24331870 -27745948 -31559016 -35813282 -40567500 -45893406
57037 -45893406 -51875476 -58621152 -66260448 -74927507 -84746817 -95822836 -108201862 -121835895
57029 -121835895 -136641204 -152627283 -169880921 -188281783 -207217179 -225727769 -243094205
57022 -243094205 -259319933 -275014249 -290810239 -306881384 -322879768 -338127182 -351767606
57015c51767606j1061469p476389k985696K182683P703944J3164341J8092556
57008c32147636K2059043K4792499K6231593K6496843K5822396K4481136K2721437
57001a59542689K0734087J8654423J6579744J4581216J2709439J0999118R470923
56994e5813739Q130244O969618N975269N130166M413357L803405L284876K847818
56986a5258986K480749K169179J901725J672583J476584J306896J159389J034495
56978b057386R31942b78454D95482P10160O54651O05550N61037N20264M81742
56969D028886M42978M03178L64305L28427K95985K67329K43397K23647K05321
56960F803453J85933J65043J43233J21344J00902Q2854O5349M5181K2140m57k0084
$$ plain form
57015 -351767606 -362829075 -370305464 -373291160 -371108477 -363404533 -350240192 -332147636
57008 -332147636 -310088593 -285296094 -259064501 -232567658 -206745262 -182264126 -159542689
57001 -159542689 -138808602 -120154179 -103574435 -88993219 -76283780 -65284662 -55813739
56994 -55813739 -47683495 -40713877 -34738608 -29608442 -25195085 -21391680 -18106804 -15258986
56986 -15258986 -12778237 -10609058 -8707333 -7034750 -5558166 -4251270 -3091881 -2057386
56978 -2057386 -1125444 -278454 495482 1205642 1860293 2465843 3026880 3547144 4028886
56969 4028886 4471864 4875042 5239347 5567774 5863759 6131088 6374485 6598132 6803453
56960 6803453 6989386 7154429 7297662 7419006 7519908 7602762 7668111 7713292 7735432 7734975 7714891
56949G714891l7305n3119o6954p8667q9886j01500j11864j19283j24857j31364
56939F800092j40497j52223j65132j76060j80444j74404j56280j26682q8686m7486
56929E392198p144L1953O8365R1290Q2398L1135n2518j43335k18121k66900k91237
56918D718084k97605k92948k82310k67864k50486k32034k14585j97924j80047
56909B502281j60457j41059j23469j07322r1913p7878o6316n7420n0731m5654
56899A580062m1141l5879k9697k4166k1242k1805k5597l1598l7999m2798m5198
56888A222942m5909m5746m4682m2620m0049l7222l3545k8657k3504j9355j6187
56877H45466j2849q567l549J598O404J0616J4340J7747K0117J9696J5252P552
$$ plain form
56949 7714891 7677586 7624467 7557513 7478846 7388960 7287460 7175596 7056313 6931456 6800092
56939 6800092 6659595 6507372 6342240 6166180 5985736 5811332 5655052 5528370 5439684 5392198
56929 5392198 5385054 5417007 5485372 5576662 5659060 5690195 5637677 5494342 5276221 5009321 4718084
56918 4718084 4420479 4127531 3845221 3577357 3326871 3094837 2880252 2682328 2502281
56909 2502281 2341824 2200765 2077296 1969974 1878061 1800183 1733867 1676447 1625716 1580062
56899 1580062 1538921 1503042 1473345 1449179 1427937 1406132 1380535 1348937 1310938 1268140 1222942
56888 1222942 1177033 1131287 1086605 1043985 1003936 966714 933169 904512 881008 861653 845466
56877 845466 832617 824050 820501 822099 828503 839119 853459 871206 891323 911019 926271 933823
56865I33823j431j0283j8320k4557k7934k8686k8315k7930k7346k6006k3870k1245
56853F67900j8584j6631j5807j5268j3546j0527p703n960m292j541J685L945N186
56840E68857O687R094J1629J3226J3666J3466J3342J3775J4615J5205J5189J4980
56828G23731J5080J5361J5507J5595J5457J3961R880L482l571r835j4933j9002
56816G80713k2109k4313k5538k5430k3739k0839j7269j2915p389j114M790R854
56804F14702J4752K0274K6413L2621L8453M3592M7483M8961M6170L7512K3605
56793I94538Q039m831j3046j7446j9219j8419j5188j0922p122l667P50O624J2928
56780I13019J8426K3075K7922L3894M1056M9072N7883O7242P5208P7706P0512
$$ plain form
56865 933823 932392 922109 903789 879232 851298 822612 794297 766367 739021 713015 689145 667900
56853 667900 649316 632685 616878 601610 588064 577537 569834 563874 559582 558041 559726 563671 568857
56840 568857 575544 584638 596267 609493 623159 636625 649967 663742 678357 693562 708751 723731
56828 723731 738811 754172 769679 785274 800731 814692 824572 828054 824483 814648 799715 780713
56816 780713 758604 734291 708753 683323 659584 638745 621476 608561 601172 600058 604848 614702
56804 614702 629454 649728 676141 708762 747215 790807 838290 887251 933421 970933 994538
56793 994538 1002577 997746 984700 967254 948035 929616 914428 903506 896384 892717 893467 900091 913019
56780 913019 931445 954520 982442 1016336 1057392 1106464 1164347 1231589 1306797 1384503 1455015
56769A455015N2183K5283m673l1423n0316o0151o3124o2444n9791n5219m8824
56758A096516m1436l3772k5969j8172j0798l960K738R698J7175K5613L5218M4948
56746A097799N2601N5940N3189M2811K4572J519k0400l6281m5544n0665n3292
56735A122249n2818m8572m1978l5644l0957k7226k3096j8092j2593o969j358L958
56723H26904Q719J3246J8006K2282K4047K1707J5472O713l314j3423k2108k8235
56711H90016l1830l3426l3172l1344k9082k7407k5883k3459k0308j7676j6172
56700F00257j5386j4949j4728j4212j3035j1942j1833j2049j1151r280p924p368
56688D56400o389m818m191n001n393m021k313k271l333l346j831m01k88r57j227
$$ plain form
56769 1455015 1507198 1532481 1527808 1496385 1446069 1385918 1322794 1260350 1200559 1145340 1096516
56758 1096516 1055080 1021308 995339 977167 966369 962409 965147 974845 992020 1017633 1052851 1097799
56746 1097799 1150400 1206340 1259529 1302340 1326912 1328431 1308031 1271750 1226206 1175541 1122249
56735 1122249 1069431 1020859 978881 943237 912280 885054 861958 843866 831273 824304 822946 826904
56723 826904 835623 848869 866875 889157 913204 934911 950383 957096 953782 940359 918251 890016
56711 890016 858186 824760 791588 760244 731162 703755 677872 654413 634105 616429 600257
56700 600257 584871 569922 555194 540982 527947 516005 504172 492123 480972 471692 463768 456400
56688 456400 450011 445193 441002 436001 430608 426587 424274 422003 418670 415324 413493 413092 412804 411847 410620
56673D10620o45L86J069Q38k3n64l36P7j02r03j843k429k222j183l13q84k550
56656C98993l288k057l74k64j609k713k693j940q52M23J171O28n64o09J189L313
56640C88754L792K569J575K493M843O627O783O367O830P808P733O351N207N405
56626D63137O295O937P440Q057Q192P508P007P724R022R391Q448O992N620M415
56612E66185L721L966M762N132M711L977L387K926K376J526K10j415k975m452
56598E94037o167p786q239p357o648p369q614q557p107n870n673n636m834l628
56584E00552k883k815l000k901j972J07K919N418O797O987O313N104L791K859
56570E27276K470K251J712P65k27q47r92q02k83O76J783K242J692Q16L94J26n76
$$ plain form
56673 410620 409975 410361 411430 412268 412245 411681 411345 411422 411320 410417 408574 406145 403923 402740 402427 401543 398993
56656 398993 395705 393648 393274 393010 391401 388688 385995 384055 383203 383626 384797 385425 384861 384252 385441 388754
56640 388754 392546 395115 396690 399183 404026 410653 417436 423803 430633 438441 446174 452525 457732 463137
56626 463137 469432 476369 483809 491866 500058 507566 514573 522297 531319 540710 549158 556150 561770 566185
56612 566185 569906 573872 578634 583766 588477 592454 595841 598767 601143 602669 602879 601464 598489 594037
56598 594037 587870 580084 571845 564488 557840 550471 541857 533300 526193 520323 514650 509014 504180 500552
56584 500552 497669 494854 491854 488953 486981 487088 490007 495425 502222 509209 515522 520626 524417 527276
56570 527276 529746 531997 533709 534474 534247 533400 532408 531606 531323 531999 533782 536024 537716 538532 538926 539052 538476
56553E38476j058j48J567J942K70j517j665j012j289k247k233r51K21M04J98M05
56537E31363J071K027L272M473M992M696M178L916L769L348K528J487O58N68J299
56522E73645K189K487K256K223K825L724M294M171L394K324J536J548K459L723
56508F12798M385L905K834K285K507K603K117J993L133M758N525N693O535P887
56494F68958Q112O691N071M535M759M983N101N006M300L166K214J085j174l943
56480G18864n130m253l409m214n620o003n643n760o583p718r061j0068r741q451
56466F27210q203r769j1354j1429j0863j0652r755p414n564o196p902p869o126
56453E14114n022n466o393p209q012p974o233l939k955k956k307j157r22j207
$$ plain form
56553 538476 537418 537270 538837 540779 541049 539532 537867 536855 535566 533319 531086 530135 530356 530760 530958 531363
56537 531363 532434 534461 537733 542206 547198 551894 556072 559988 563757 567105 569633 571120 571778 572346 573645
56522 573645 575834 578321 580577 582800 585625 589349 593643 597814 601208 603532 605068 606616 609075 612798
56508 612798 617183 621088 623922 626207 628714 631317 633434 635427 638560 643318 648843 654536 661071 668958
56494 668958 677070 683761 688832 693367 698126 703109 708210 713216 717516 720682 722896 723981 722807 718864
56480 718864 713734 709481 706072 701858 696238 690235 684592 678832 672249 664531 655470 645402 635661 627210
56466 627210 619007 609238 597884 586455 575592 564940 555185 547771 542207 536011 528109 520240 514114
56453 514114 509092 503626 497233 490024 482012 474038 467805 463866 460911 457955 455648 454491 453569 452362
56439D52362l50J115P55j709l721l898l749m344m213k180J02M23p91j462j070
56424D27270j014k150l373k917n10K186L324K945K629L146L540L112K809L549
56410D44546M532M711M687N480O576O974P086P530P354N737M303N004O557N995
56396E27072L321J461J790K785L392M437N963O101L911J110j90K91J766L536M633
56381E71379M167K730K014K523L174L275L170K859J813M34k50m45j303k711l391
56366E89438l271l617m681n372n380n345m990l548k106k708m802n456l745k045
56352E32372k233l427m466n718p148p369o050m960n220n652n084m100l364k420
56338D65161j284r99j528j392l80k44j553k458j876j204j432j265J62J335J053
$$ plain form
56439 452362 452012 453127 453882 452173 448452 444554 440805 436461 432248 430068 430170 430593 429802 428340 427270
56424 427270 426256 424106 420733 417816 417306 419492 422816 425761 428390 431536 435076 438188 440997 444546
56410 444546 449078 453789 458476 463956 470532 477506 484592 492122 499476 505213 509516 514520 521077 527072
56396 527072 530393 531854 533644 536429 539821 544258 550221 556322 560233 561343 561153 561444 563210 566746 571379
56381 571379 575546 578276 580290 582813 585987 589262 592432 595291 597104 597538 597288 596843 595540 592829 589438
56366 589438 586167 582550 577869 572497 567117 561772 556782 553234 551128 548420 543618 538162 534417 532372
56352 532372 530139 526712 522246 516528 509380 502011 495961 491001 485781 480129 475045 470945 467581 465161
56338 465161 463877 462878 461350 459958 459578 459334 457781 455323 453447 452243 450811 449546 449708 451043 452096
56323D52096N71J025J180j06j420j142k22l35j046j084o01j12J070L136M355L616
56307D60981K585L057L923L291J887J556J829J040r0P98L757O103O072M699L863
56292E05351M122M699M386K549R1j074k59J249K377L776N999P674P232N231L443
56277E56846K545K225K505L500M786O170Q041R791R560O936M418M345N871O731
56263F34270O699P145Q248Q904Q799Q658Q904R501J0526J1489J1018Q746O708
56250G49615P234J0061J2923J4322J4366J3566J2316J1119J0222R252P887O271
56238H79154M553K968K489L839N487M755J499j370j989j746k163k069K40M009
56224H99656P194R165J0555J1824J3263J4993J6036J5307J4213J5721J9859K3225
$$ plain form
56323 452096 452667 453692 454872 454766 453346 452204 451982 451647 450601 449517 448916 448804 449874 453010 457365 460981
56307 460981 463566 466623 470546 473837 475724 477280 479109 480149 480059 480857 484614 490717 496789 501488 505351
56292 505351 509473 514172 518558 521107 521198 520124 519865 521114 523491 527267 533266 540940 548172 553403 556846
56277 556846 559391 561616 564121 567621 572407 578577 586618 596409 605969 612905 617323 621668 627539 634270
56263 634270 640969 648114 656362 665266 674065 682723 691627 701128 711654 723143 734161 742907 749615
56250 749615 756849 766910 779833 794155 808521 822087 834403 845522 855744 864996 872883 879154
56238 879154 883707 886675 889164 893003 898490 903245 904744 903374 901385 899639 897476 895407 895647 899656
56224 899656 906850 916015 926570 938394 951657 966650 982686 997993 1012206 1027927 1047786 1071011
56212A071011K4287K5628K8929L1691L1970L2679L7151M3411M7283M9092N2546
56201A475678N8417O3994O8277P3239P9791Q6331R1935R7869J05100J12599J18692
56190B431922J22593J24577J25764J27154J27721J24798J17653J08857J00297
56181C511336Q9948P5130N7049L9289K3230P965o596j9526l0901m1217m9747n5871
56169C600089o0872o5796o9013o8830o7216o7688p0484p2943p3815p4146p4593
56158B834693p4872p5410p6780p7966p7588p6197p5145p4140p2240o9959o8089
56147B016307o5838o2685o0335n9853n8721n4072m7297m1975l8675l5505l2375
56136A458976l0691k9721k7305k3698k1029j9507j7646j5635j4871j4687j3095
$$ plain form
56212 1071011 1095298 1120926 1149855 1181546 1213516 1246195 1283346 1326757 1374040 1423132 1475678
56201 1475678 1534095 1598089 1666366 1739605 1819396 1905727 1997662 2095531 2200631 2313230 2431922
56190 2431922 2554515 2679092 2804856 2932010 3059731 3184529 3302182 3411039 3511336
56181 3511336 3601284 3676414 3733463 3772752 3795982 3803947 3797351 3777825 3746924 3705707 3655960 3600089
56169 3600089 3539217 3473421 3404408 3335578 3268362 3200674 3130190 3057247 2983432 2909286 2834693
56158 2834693 2759821 2684411 2607631 2529665 2452077 2375880 2300735 2226595 2154355 2084396 2016307
56147 2016307 1950469 1887784 1827449 1767596 1708875 1654803 1607506 1565531 1526856 1491351 1458976
56136 1458976 1428285 1398564 1371259 1347561 1326532 1307025 1289379 1273744 1258873 1244186 1231091
56125A231091j0448q916q688p953o204m427k698o02P30L37P8K177N305O641O640
56110A203063P804R896J0666J0501J1863J4656J6468J7039J8304K0271K1106K1072
56098A382709K2178K4112K4545K3321K2236K1165J8680J6093J6281J8536J9226
56087A609082J7682J7080J9301K3384K9148L7793M8452N8424O7235P6423Q5402
56076B089406R2032R7365J05056J15781J26942J38311J52925J71387J89892K04897
56066C483994K15427K20001K15998K03716J87250J70271J54109J40020J28933
56057E119719J18277J03125Q1398N4629K4161q840l9815o2630p6227q5290r3878
56046E134629j02735j12926j26922j44561j62179j76666j86881j91110j87691
$$ plain form
56125 1231091 1220643 1211727 1203039 1195086 1188882 1184455 1181757 1181155 1181885 1182222 1182300 1184477 1189782 1196423 1203063
56110 1203063 1210867 1220763 1231429 1241930 1253793 1268449 1284917 1301956 1320260 1340531 1361637 1382709
56098 1382709 1404887 1428999 1453544 1476865 1499101 1520266 1538946 1555039 1571320 1589856 1609082
56087 1609082 1626764 1643844 1663145 1686529 1715677 1753470 1801922 1860346 1927581 2004004 2089406
56076 2089406 2181438 2278803 2383859 2499640 2626582 2764893 2917818 3089205 3279097 3483994
56066 3483994 3699421 3919422 4135420 4339136 4526386 4696657 4850766 4990786 5119719
56057 5119719 5237996 5341121 5422519 5477148 5501309 5492469 5452654 5390024 5313797 5228507 5134629
56046 5134629 5031894 4918968 4792046 4647485 4485306 4308640 4121759 3930649 3742958
56037C742958j78480j67310j54847j39259j21712j06161r3730q2186p1067o2134
56027B566072n4814m6529l7837l2078k9733k8228k6959k7128k7053k3631j8236
56016B213846j5152j4379j2220q509o545o058l390J276M115N126P985J2222J3469
56003B191786J2108J3520J8714K2700K3442K4521K7472K9509L0170L2398L5647
55992B461987L5949L4033L5049L9127M0936L9809M1058M5809M9123N0004N3329
55981B926213N9620O3052O2254O3088O7774P1451P2404P5376Q1534Q5713Q6970
55970C715449R1171R9444J05125J06055J08608J15403J20471J21327J24121J31642
55960D838816J37918J40155J44432J53973J63379J70210J80428J96478K11980
$$ plain form
56037 3742958 3564478 3397168 3242321 3103062 2981350 2875189 2781459 2699273 2628206 2566072
56027 2566072 2511258 2464729 2426892 2394814 2365081 2336853 2309894 2282766 2255713 2232082 2213846
56016 2213846 2198694 2184315 2172095 2163586 2157041 2150983 2147593 2148869 2152984 2158110 2166095 2178317 2191786
56003 2191786 2203894 2217414 2236128 2258828 2282270 2306791 2334263 2363772 2393942 2426340 2461987
55992 2461987 2497936 2531969 2567018 2606145 2647081 2686890 2727948 2773757 2822880 2872884 2926213
55981 2926213 2985833 3048885 3111139 3174227 3242001 3313452 3385856 3461232 3542766 3628479 3715449
55970 3715449 3806620 3906064 4011189 4117244 4225852 4341255 4461726 4583053 4707174 4838816
55960 4838816 4976734 5116889 5261321 5415294 5578673 5748883 5929311 6125789 6337769
55951F337769K24095K38966K58768K76190K88102L01814L21184L39830L54757
55942H941475L72808L96500M17947M34328M54450M82133N08682N30414N57532
55933A3096269N96114O37375O74561P14039P59739Q03671Q42284Q84820R35066
55924A9943938R83548J028558J084762J158990J238561J316199J403961J508703
55916B9667220J618023J726283J849174J994971K147348K296083K458440K650652
55908D6408194K866882L107822L399372L759421M179043M661853N245582N954783
55900G9582952O770098P676552Q702037R874100J1182968J2620548J4201024J5909789
55892A66520068J7713453J9677952K1986265K4765030K7991862L1603771L5371347
$$ plain form
55951 6337769 6561864 6800830 7059598 7335788 7623890 7925704 8246888 8586718 8941475
55942 8941475 9314283 9710783 10128730 10563058 11017508 11499641 12008323 12538737 13096269
55933 13096269 13692383 14329758 15004319 15718358 16478097 17281768 18124052 19008872 19943938
55924 19943938 20927486 21956044 23040806 24199796 25438357 26754556 28158517 29667220
55916 29667220 31285243 33011526 34860700 36855671 39003019 41299102 43757542 46408194
55908 46408194 49275076 52382898 55782270 59541691 63720734 68382587 73628169 79582952
55900 79582952 86353050 94029602 102731639 112605739 123788707 136409255 150610279 166520068
55892 166520068 184233521 203911473 225897738 250662768 278654630 310258401 345629748
55885C45629748L8277987L8183296L2811762K1642689O821566q027824j9975091
55878D55364133k7950193l2330578l3985412l3759038l2371455l0356769k8019530
55871B36591158k5525462k3011313k0575058j8239953j6010288j3935820j2079542
55864A07213722j0460234r066839p893688o923335o106702n398320m789159m278951
55856E2296494l843196l454467l110686k815844k555655k316857k108713j941017
55848C0150059j799688j665998j541686j434384j336042j236354j141588j060545
55840A8933774r86416r10332q38628p79690p27545o74935o29124n98369n75209
55831A2213526n48764n21819n00923m81333m56440m31116m11637l92867l68784
$$ plain form
55885 345629748 383907735 422091031 454902793 476545482 483367048 475339224 455364133
55878 455364133 427413940 395083362 361097950 327338912 294967457 264610688 236591158
55871 236591158 211065696 188054383 167479325 149239372 133229084 119293264 107213722
55864 107213722 96753488 87686649 79792961 72869626 66762924 61364604 56575445 52296494
55856 52296494 48453298 44998831 41888145 39072301 36516646 34199789 32091076 30150059
55848 30150059 28350371 26684373 25142687 23708303 22372261 21135907 19994319 18933774
55840 18933774 17947358 17037026 16198398 15418708 14691163 14016228 13387104 12788735 12213526
55831 12213526 11664762 11142943 10642020 10160687 9704247 9273131 8861494 8468627 8099843
55822H099843l45223l28960l14484k94611k74201k60231k47940k29969k10357
55813E593867j96497j85508j70976j55392j43934j33541j19764j07272j02388
55804D278595j02420j02848j07251j19195j31869j37060j37338j38540j37588
55795C164486j29265j18098j11457j06680r6802q3825p4828o9477o2364n3666
55785B258024m7073m1235l3333k7332k8842l5263m0036m2934m7100n0225m8082
55774A816569m3198m0706l9017l3654k6888k4238k4520k2462j8624j7753j9655
55763A505854k0423k0703k4279l0215l4216l6153l8861m1346m0573l8019l7391
55752A143675l7654l5287l1312k9134k7616k3357j7837j5203j4653j1998p163
$$ plain form
55822 8099843 7754620 7425660 7111176 6816565 6542364 6282133 6034193 5804224 5593867
55813 5593867 5397370 5211862 5040886 4885494 4741560 4608019 4488255 4380983 4278595
55804 4278595 4176175 4073327 3966076 3846881 3715012 3577952 3440614 3302074 3164486
55795 3164486 3035221 2917123 2805666 2698986 2602184 2518359 2443531 2374054 2311690 2258024
55785 2258024 2210951 2169716 2136383 2109051 2080209 2044946 2004910 1961976 1914876 1864651 1816569
55774 1816569 1773371 1732665 1693648 1659994 1633106 1608868 1584348 1561886 1543262 1525509 1505854
55763 1505854 1485431 1464728 1440449 1410234 1376018 1339865 1301004 1259658 1219085 1181066 1143675
55752 1143675 1106021 1070734 1039422 1010288 982672 959315 941478 926275 911622 899624 892461
55741H92461l565j486J389M394N121M744O001P587O490M135M076N367M357J400
55727I42471k72o74k002l115j211K432M341N018P489J1257J3531J4992J8309K2185
55713A034751K2709J9547J5380J0528L712l245p210r199j2774j8115k2692k6230
55701A007162k9808l1784l0141k7282k6994k8312k7822k6106k6026k6470k4140
55690G02277j9955j7298j5215j0071k985J021Q58p4o23k815o311q265q925j1263
55676F00356j4862j6111j4739j4216j5220j4562j1365q708q176q059p722q783
55664D57833j0963j1638j0396r611r941r623q529q478r255q828p545p563q181
55651C37282o581l233j527j880j311R04K389K828M598P446P906N047J906J51j787
$$ plain form
55741 892461 888896 887410 888799 893193 898314 903058 909059 916646 923136 927271 931347 936714 941071 942471
55727 942471 942199 941525 939523 936408 935197 937629 941970 946988 954477 965734 979265 994257 1012566 1034751
55713 1034751 1057460 1077007 1092387 1102915 1106627 1103382 1096172 1086973 1074199 1056084 1033392 1007162
55701 1007162 977354 945570 915429 888147 861153 832841 805019 778913 752887 726417 702277
55690 702277 682322 665024 649809 639738 636753 637774 638632 638558 637935 635120 628809 620544 611619 600356
55676 600356 585494 569383 554644 540428 525208 510646 499281 490573 482397 474338 466616 457833
55664 457833 446870 435232 424836 415225 405284 395661 387132 378654 369399 360571 353026 345463 337282
55651 337282 330701 327468 325941 324061 322750 323654 326043 328871 333469 340915 348821 353868 355774 355925 354138
55636C54138m212m857l441k630l075k182O43K342J569J215L476O524Q109Q774
55622C66393R587J0082J0165J0841J1662J0732Q257O626O101M168K88k750l410
55609D48742l399l782l120j123j09q06m26K916P193R950J1670J3507J4789J4962
55595E10964J5547J8051K1955K6124L0010L2454L1972K9348K7261K6301K4122
55584G94109J9603J4704J0805O401K39o016j0230j2557j4066j4665j4074j2948
55572G61305j1678r718p042m656l045j921j885m150q271j2334j5730j9415k3433
55559F38027k6698k9226l1706l2926l0913k6874k4461k4498k3946k0954j7418
55548C48407j5329j3966j2162j0473r581r045q673q794q582o820m640m475n950
$$ plain form
55636 354138 349926 345069 341628 338998 335923 333741 334384 336726 338295 339510 342986 349510 357619 366393
55622 366393 375980 386062 396227 407068 418730 429462 437719 444345 450446 454614 454902 452152 448742
55609 448742 445343 441561 438441 437318 437209 436403 435977 438893 446086 456036 467706 481213 496002 510964
55595 510964 526511 544562 566517 592641 622651 655105 687077 716425 743686 769987 794109
55584 794109 813712 828416 839221 845622 845861 839845 829615 817058 802992 788327 774253 761305
55572 761305 749627 739909 732867 728211 725166 723245 721360 717210 708939 696605 680875 661460 638027
55559 638027 611329 582103 550397 517471 486558 459684 435223 410725 386779 365825 348407
55548 348407 333078 319112 306950 296477 286896 277851 269178 260384 251802 244982 240342 235867 229917
55535B29917o173m595l710m276l939j838n09j315j928m47J513K063K148L133M252
55520B14296M688N461P148Q319Q127P880Q349Q302P467P980J0900J4074J5563
55507C28554J6494J8432K0623K1981K3095K4102K3185J9411J4541R903M211l173
55495E21359r678j3097j5251j9065k3911k6876k7068k5867k4139k1725j8813j5733
55483B80136j2371r192p535p534p378o028m790m684m463l047j833k419l746l634
55469B01482j713R51L583N481N665M454L880N100O875P741P901P823P232O761
55455B73216Q212J1639J4524J5430J5975J7512J8583J7688J6021J5130J4338J2696
55443D50964J1103R997P448K122m043q807j2948j7832k1978k3280k2795k3044
$$ plain form
55535 229917 223744 219149 215439 211163 207224 205386 204877 203562 201634 201187 202700 204763 206911 210044 214296
55520 214296 218984 224445 231593 239912 248039 255919 264268 272570 280037 288017 298917 312991 328554
55507 328554 345048 363480 384103 406084 429179 453281 476466 495877 510418 520321 524532 521359
55495 521359 511681 498584 483333 464268 440357 413481 386413 360546 336407 314682 295869 280136
55483 280136 267765 258573 251038 243504 236126 230098 225308 220624 216161 213114 211281 208862 205116 201482
55469 201482 199769 200720 204303 209784 215449 219903 223783 228883 235758 243499 251400 259223 266455 273216
55455 273216 281428 293067 307591 323021 338996 356508 375091 392779 408800 423930 438268 450964
55443 450964 462067 472064 479512 481634 477591 468784 455836 438004 416026 392746 369951 346907
55431C46907k4005k3901k2590k1120j9205j6189j3421j2648j2911j1919r742q350
55419A50906q235q158p699p443p097n878m423m141m875n122m266k971j865j292
55405G7441j560k206k035j096j154k845m241l879l166l701m271l009p03P65J592
55390D5932K851L661K557N04m05k40m17p34j02P28K46q73r00l57j120k781l020
55373D5530j366K99Q80J020J171J144J351K116K195M25j753j971m77P04J358K729
55357E5355M142L443Q62q61n93M4L7L52J332J645Q12J53K94K33k00O17L325N916
55339G6908O166M107J100j888m108m731l795k517j948k117k636l064k686j302
55325E7489j10m09j540j813j149r13j131k96J774L069K267N28m58n98o13n78l10
$$ plain form
55431 346907 322902 299001 276411 255291 236086 219897 206476 193828 180917 168998 159256 150906
55419 150906 142671 134513 126814 119371 112274 106396 101973 97832 92957 87835 83569 80598 78733 77441
55405 77441 75881 73675 71640 70544 69390 66545 62304 58425 55259 51558 47287 44278 43575 44340 45932
55390 45932 48783 52444 55001 55505 55100 54860 54443 53709 53607 54335 54581 53708 52808 52451 51331 48550 45530
55373 45530 44164 44463 45343 46363 47534 48678 50029 52145 54340 54765 53012 51041 50564 51268 52626 55355
55357 55355 59497 62940 63802 62941 62348 62392 62429 62781 64113 65758 66570 66723 67017 67250 67050 67667 70992 76908
55339 76908 83074 87181 88281 86393 82285 77554 73759 71242 69294 67177 64541 61477 58791 57489
55325 57489 57379 56970 55430 53617 52468 51555 50424 50128 51902 54971 57238 57766 57308 56710 56097 55519 55209
55308E5209j88o66j597k529l061k841j977j299j342j271QK002L116K741J617M50
55292D8372m13l92O35J321L02j589k378j929j708j852q83J188K079N57j588k060
55276C9662r73M8L04K04M9j53k21J5L29L71k9r41k108k744k282j280o95n10j7
55257B9029O87P17j18r55j115p20j52K25L6m99l84O93J355M45q12m35J117J547
55239C0661M02l19L84R90K43o98l31O51N50o10j158q5J795K989K814J819J012
55222D1109P63O14K75J49M38M11m79j290o90J003K064J588K82q09j278j124o57
55205D2369m79p55p10K38J331J511J050R42J219J217R59Q19L98o15j114P0J860
55188E0310J975J20j806k568k738k916k734j992j051R7J649K885K849K008J574
$$ plain form
55308 55209 55021 54355 52758 50229 47168 44327 42350 41051 39709 38438 38446 40448 43564 46305 47922 48372
55292 48372 47959 47567 48202 49523 49825 48236 45858 43929 42221 40369 39486 40674 42753 43310 41722 39662
55276 39662 38689 38737 39041 39245 39294 39141 38920 38935 39264 39635 39606 38665 36557 33813 31531 30251 29556 29046 29029
55257 29029 29716 30433 30315 29360 28245 27525 27373 27598 27634 27135 26751 27444 28799 29244 28432 27997 29114 30661
55239 30661 31063 30744 31128 32118 32361 31663 31332 31983 32533 31923 30765 30680 32475 35464 38278 40097 41109
55222 41109 41872 42486 42761 42910 43348 43759 43280 41990 41300 42303 44367 45955 46237 45428 44150 43026 42369
55205 42369 41890 41135 40425 40663 41994 43505 44555 45497 46716 47933 48892 49711 50109 49494 48380 48450 50310
55188 50310 52285 52405 50599 48031 45293 42377 39643 37651 36600 36697 38346 41231 44080 46088 47662
55173D7662J330O9j928k929k416j580r59J69J770K623K411K132K012J193o2k81
55157E1216M47K10j260j482Q36L197K644j07j872j162Q07K251K343J227j05m25
55141E8765K79N86m87k135k907k357j007L19O57n08k270l012k460j733j166J91
55125D0755K319L461K591J012K63J10j52q4O61R83nj094o25Q15J185k9j325j488
55107D9353q43k51m7j25j73K32J142J898J700M43j283k619k762j552k1L58n93
55090D4857j499j337o73n49q95q43J6J286K294K450J523K8j088j357j087o85k68
55073D2173J32N61J223J945J825M40r68o66J284L204M062M086L362J687K9K32
55057F4611K482M612M644K848P59m49j52J578L335L270J285r21k320l548m901
$$ plain form
55173 47662 48992 49061 47133 44204 41788 40208 39249 39418 41188 43811 46222 48354 50366 51559 51497 51216
55157 51216 51663 51873 50613 49131 49967 53164 55808 55701 53829 52667 53474 55725 58068 59295 59190 58765
55141 58765 59044 59630 59143 57008 54101 51744 50737 51056 51713 51205 48935 45923 43463 41730 40564 40755
55125 40755 43074 46535 49126 50138 50401 50511 50359 50275 50936 51919 51914 50820 50195 51010 52195 52166 50841 49353
55107 49353 48510 48259 48212 48087 47914 48146 49288 51186 52886 53329 52046 49427 46665 45113 45092 45450 44857
55090 44857 43358 42021 41348 40799 39904 39061 39077 40363 42657 45107 46630 46658 45570 44213 43126 42441 42173
55073 42173 42305 42866 44089 46034 47859 48299 47331 46665 47949 51153 55215 59301 62663 64350 64379 64611
55057 64611 67093 71705 76349 79197 79956 79507 79355 80933 84268 87538 88823 87902 85582 82034 77133
55042G7133n333m309k948k135j053J051L150L857L470L221L295K845J378o64k223
55027H0735k100o2K169K307L22j468j561q82o60n83j35N6m29n97L32J376J394
55010H0214R66J227J796J434M8j287j736j090N06K273K950K109O53m98j301j758
54994H6506j471o76l89q18r83m81j05k4P01K069K498J418M66Q07J308Q08K10N99
54976I2443J332J688K459L851M017J963p5J59J253N83j185j435k13J10p72o32
54960A05546J303L044L013J855O25m53r34j08J448K111J428M94R7J55R29K700
54944A23253M168L372N57j737j925q55K21J186J871J359n24k325k654j842j266
54929A22859j764l100m170l678j453Q84J505N55k76q5M85O84M46k18j257k010
$$ plain form
55042 77133 71800 67491 64543 62408 61355 62406 65556 69413 72883 76104 79399 82244 83622 82958 80735
55027 80735 78635 78573 80742 83049 83371 81903 80342 79460 78800 78217 78082 78138 77709 77112 77444 78820 80214
55010 80214 81180 82407 84203 85637 85685 84398 82662 81572 82078 84351 87301 89410 90063 89565 88264 86506
54994 86506 85035 84359 83970 83152 82169 81688 81583 81559 82260 84329 86827 88245 88711 89518 90826 91634 91844 92443
54976 92443 93775 95463 97922 101773 105790 107753 107678 107837 109090 109673 108488 107053 106840 106950 106178 105546
54960 105546 106849 109893 112906 114761 115386 114933 113999 113891 115339 117450 118878 119372 119469 119624 120553 123253
54944 123253 127421 130793 131350 129613 127688 126833 127054 128240 130111 131470 130946 128621 125967 124125 122859
54929 122859 121095 117995 113825 110147 108694 109578 111083 111638 111362 111277 111762 112446 112892 112674 111417 109407
54913A09407j761q44o7P14K080L433L532K587K060K332K322J641J339J996K746
54898A33517K884K953L526M184M469M727N278N779N971O266P000P901Q647R159
54884B12261R188Q620Q336R654J2422J4796J5339J4421J3054J1386R057O212L335
54871C48081M60k867o886j1132j4522j6133j6109j5498j4842j3602j1560r908
54859B15482r797j0423r962q084o106m940m243l542k708j376P05K601K926J955
54845A62488J590K980N312P263Q397Q774Q490Q141Q723J0493J2660J4390J5357
54832B75058J5211J3497J0257N941Q50m498q725j0618j0756j0845j1493j1879
54820B52000j1554j1022j0516r695q763q417q417p688o090m642l806l039k315
$$ plain form
54913 109407 107646 106802 106735 107449 109529 112962 116494 119081 121141 123473 125795 127436 128775 130771 133517
54898 133517 136401 139354 142880 147064 151533 156260 161538 167317 173288 179554 186554 194455 203102 212261
54884 212261 221449 230069 238405 248059 260481 275277 290616 305037 318091 329477 338534 344746 348081
54871 348081 348541 345674 338788 327656 313134 297001 280892 265394 250552 236950 225390 215482
54859 215482 205685 195262 185300 177216 171110 166170 161927 158385 155677 154301 155006 157607 160533 162488
54845 162488 164078 167058 172370 179633 188030 196804 205294 213435 222158 232651 245311 259701 275058
54832 275058 290269 303766 314023 319964 320814 316316 307591 296973 286217 275372 263879 252000
54820 252000 240446 229424 218908 209213 200450 192033 183616 175928 169838 165196 161390 158351 156036
54807A56036k341k925k882k012j436j362m78J618L213K839J185m38j869l115l181
54792A42852j605J38L22p82j686j815j537j085p78j435l056l966k755n11M05o59
54776A22047k357l483l870l497k376j389j635k728l022j861m46j8k35n7N44O05
54760I6222k39q90J51K912N489N878M184K365J705J384J64j378j462K94K138K342
54744A21259J367J240L074N687O851N659L496K545L616N698P485Q689R714J0594
54730A96974J0876J0475J0213J1172J3517J6153J7740J7954J7414J6561J5195
54719C54244J3218J0857P806L252k444p088q960q960r092r441q490o117m209l979
54705C20597m486m456l843k822p95K380N409O931P081O792O515O621Q063J1222
$$ plain form
54807 156036 153695 150770 147888 145876 144440 143078 142600 144218 147431 150270 151455 151017 149148 146033 142852
54792 142852 141247 141385 141707 140925 139239 137424 135887 134802 134024 132589 129533 125567 122812 122301 122706 122047
54776 122047 119690 116207 112337 108840 106464 105075 103440 100712 97690 95829 95383 95365 95130 95073 95617 96222
54760 96222 95983 95093 95244 98156 103645 109523 113707 116072 117777 119161 119325 117947 116485 116779 118917 121259
54744 121259 122626 123866 126940 132627 139478 145137 148633 151178 154794 160492 167977 176666 186380 196974
54730 196974 207850 218325 228538 239710 253227 269380 287120 305074 322488 339049 354244
54719 354244 367462 378319 386125 389377 386933 379845 370885 361925 352833 343392 334902 328785 324576 320597
54705 320597 316111 311655 307812 304990 304195 306575 311984 318915 325996 332788 339303 345924 353987 365209
54691C65209J4565J5754J4096J0948P921N541L608J981P15j25n19m79m0N90P48
54676D40513n26l514p127r883j1598j3305j5475j7342j8255j8642j9030j9034
54664B86782j8068j6361j4543j2701j0661q777p706p485p414o737n318l751k858
54651A64402k743k475j246K18L83r42k226k321j825j704j737j266n79l58k59O82
54635A46004K317L274K746J608J232J682J665K91j617k395j609m80j2M18J687
54620A56811K995K821J505J222K951N119N903N477N081N076N239N980P777R795
54606B23752J0576J0047R596R950J0038Q514N690L275K421K706L165L722N058
54593C08510P280R575J1332J2916J4775J6558J7743J8614J9740K1077K2382K3910
$$ plain form
54691 365209 379774 395528 409624 420572 428493 434034 437642 439623 440338 440213 439694 439215 439175 439765 440513
54676 440513 439987 436473 429346 419463 407865 394560 379085 361743 343488 324846 305816 286782
54664 286782 268714 252353 237810 225109 214448 205671 197965 190480 183066 176329 171011 167260 164402
54651 164402 161659 159184 157938 158156 158539 157597 155371 153050 151225 149521 147784 146518 145939 145581 145322 146004
54635 146004 148321 151595 154341 155949 157181 158863 160528 160819 159202 156807 155198 154718 154706 155124 156811
54620 156811 159806 162627 164132 165354 168305 173424 179327 184804 189885 194961 200200 206180 213957 223752
54606 223752 234328 244375 253971 263921 273959 282473 288163 291438 293859 296565 299730 303452 308510
54593 308510 315790 325365 336697 349613 364388 380946 398689 417303 437043 458120 480502 504412
54581E04412K5577K5944K3400J8092J1522M582k659r574j5268k0002k4660k8604
54569E12762k9984k8485k5902k3548k0995j8042j5830j4891j3855j1514q720p050
54557B93946o736p034p323o744m199j41K843K789P70p93j256j680k560l414m110
54542B54358n052o115o652o536o245o053n681m674k774m81O52o35l240m381l083
54527A93408j497j794l289m054l873l759l677k871j770j545k030j871o26P47J395
54512A62894J228L16r71j587r13%k26j000m96J440K771K114N43p3N88J391J442
54495A69461J028J086K017L055K994J750O58Q64K034L136L843M346M597M609M987
54480B10465O126P352P786P667P966R033J0483J1950J3215J3910J3816J2968J1096
$$ plain form
54581 504412 529989 555933 579333 597425 608947 613529 610870 601296 586028 566026 541366 512762
54569 512762 482778 454293 428391 404843 383848 365806 349976 335085 321230 309716 300996 293946
54557 293946 287210 280176 272853 266109 261910 261769 264612 267401 268171 267378 266122 264442 261882 258468 254358
54542 254358 249306 243191 236539 230003 223758 217705 212024 207350 204576 204095 204747 204112 200872 196491 193408
54527 193408 191911 190117 186828 182774 178901 175142 171465 168594 166824 165279 163249 161378 160752 161499 162894
54512 162894 164122 164438 163467 161880 160967 160967 160741 159741 159245 160685 163456 165570 166113 166040 166628 168019 169461
54495 169461 170489 171575 173592 176647 179641 181391 182049 182913 184947 188083 191926 196272 200869 205478 210465
54480 210465 216591 223943 231729 239396 247362 256395 266878 278828 292043 305953 319769 332737 343833
54467C43833P779L685L25k123n395j0303j4773j6260j5010j3202j1883j0729r874
54454B46070r845j0055r369p896o474m938k742q77q88k249k802j876q61o42n41
54439A84015q7J59j1k8N2m87j349j193J94J435J715J757K144K310J827J186P47
54422A94386L10K72J523L551M282K848J058J131L013M836N128L750J556j47n66
54407B26931k28k07m64l9J081J748J512J233J345J084qj157j664j816j997k149
54391B25205k592l841n117m717k623r34q32j014k96J24j143k908k857r41Q29J282
54375A97625J008O07j80j527k958l928m080l079j030J116K335K569K328J671M53
54360A92930p27q81K7Q33M92p07j447o96J260L118L926L909L704L364K795K641
$$ plain form
54467 343833 351612 355297 355622 353499 348104 337801 323028 306768 291758 278556 266673 255944 246070
54454 246070 236225 226170 216801 208905 202431 197493 194751 193874 192986 190737 187935 186059 185198 184556 184015
54439 184015 183928 184087 184076 184048 184100 183613 182264 181071 181265 182700 184415 186172 188316 190626 192453 193639 194386
54422 194386 194696 194968 196491 200042 204324 207172 208230 209361 212374 217210 222338 226088 227644 227497 226931
54407 226931 226703 226496 226032 225993 227074 228822 230334 231567 232912 233996 233988 232831 231167 229351 227354 225205
54391 225205 222613 218772 213655 208938 206315 205381 204549 203535 203239 203363 202220 199312 196455 195514 196343 197625
54375 197625 198633 199240 199060 197533 194575 190647 186567 183488 182458 183574 185909 188478 190806 192477 192930
54360 192930 192203 191322 191349 192182 192674 191967 190520 189824 191084 194202 198128 202037 205741 209105 211900 214541
54344B14541L575M953N525N366N637O423O542N862N845P075P949O962M804K996
54330B94055J868J087P71P23l10k988n867p050o551n690m947l936k831k314k470
54315B53550k903l484l933l483k152j501k630m217m177k663j656j978k495k145
54301B14133j048L21J480J555J00j572j458O56L097M665N415N165L282N81m65
54286B35907J409M407N816N087L854L661M585N570N401L681J245p10k101l776
54272B74036n733o604n538l660k782l275m030m230m152m346m793n114n233n401
54258B09145n666n532m572l372l348n079p208p698o022l439j261J63P52J84j398
54243A55649k930l394k764j673o81k94j108l194n553o746o067m001j747m60m59
$$ plain form
54344 214541 218116 223069 228594 233960 239597 246020 252562 258424 264269 271344 279293 286255 291059 294055
54330 294055 295923 297010 297781 298504 298194 295206 289339 282289 275738 270048 265101 261165 258334 256020 253550
54315 253550 250647 247163 243230 239747 237595 236094 233464 229247 225070 222407 220751 218773 216278 214133
54301 214133 213085 213406 214886 216441 216541 214969 213511 214167 217264 221929 227344 232509 235791 236372 235907
54286 235907 237316 241723 247539 252626 256480 260141 264726 270296 275697 279378 280623 279913 277812 274036
54272 274036 268303 261699 256161 252501 249719 246444 242414 238184 234032 229686 224893 219779 214546 209145
54258 209145 203479 197947 193375 190003 186655 181576 174368 166670 160648 157209 155948 156111 156863 157047 155649
54243 155649 152719 149325 146561 144888 144207 143913 142805 139611 134058 127312 121245 117244 115497 115037 114578
54228A14578r38p86J29Q57P05L7n72j166j824j880p21R89J827J321M25J54N29
54211A13664R54J033O85J03j44N37J875K674K160J007M54O52O67kp04o64K3Q50
54193A25824J680K409K347R27j039j770n29J496K647K457J443Oj555k380j550
54178A32413N49K239K304J111k21j148j729j909j506o96J76J100K203L071L024
54163A40981K159J483J615J855J015j055l174l929k829o69J024J061m94k489l890
54148A32664m511m529l970l051k348j900q50J046K185R28j679k667r46J247J406
54133A13025k73j881k463k390k009j353p61o11o84n86m99p64j242j690k089k008
54117I1722o93J351K103O88r22n88Q39J110L69O70K191K764J544K70J99L33k42
$$ plain form
54228 114578 113640 112854 112983 113840 114545 114582 114010 112844 111020 109140 108419 109408 111235 112556 112981 113135 113664
54211 113664 114618 115651 116336 116439 116295 116832 118707 121381 123541 124548 125002 125654 126321 126319 125615 124951 124974 125824
54193 125824 127504 129913 132260 133187 132148 130378 129849 131345 133992 136449 137892 137898 136343 133963 132413
54178 132413 132962 135201 137505 138616 138395 137247 135518 133609 132103 131407 131583 132683 134886 137957 140981
54163 140981 143140 144623 146238 148093 149108 148053 144879 140950 138121 137452 138476 139537 139043 136554 132664
54148 132664 128153 123624 119654 116603 114255 112355 111505 112551 114736 115664 113985 111318 110372 111619 113025
54133 113025 112752 110871 108408 106018 104009 102656 101895 101284 100600 100014 99515 98751 97509 95819 93730 91722
54117 91722 91029 92380 94483 95171 94249 93661 94500 95610 95979 96649 98840 101604 103148 103418 103617 103950 103708
54100A03708o41j78L8q64j668j034J79K76p69j770k218k074q55J310K668J796
54084I7904j26p92J6N49no68o25k06K61Q77J251O18p18j389q40j45l99j241j491
54065I2831n78J026K257K267J272N86J251K761L770L738L059J954L82j074j496
54050A14006r75o90j326k304k821k757k349j752j105m22O27K088K973K269P36
54035A06198L99J946L855M554M246L866L427K562J732J604J781J287J44o57o01
54020A36343j57J25J04l67j352k240k094j040m33j078j966j613j53Q62N86k31
54004A25296o48p85j132j392r39J20J105J783K340K570K130J574J989L251L745
53989A41007K444M36l95M26J793K518K268J417P87J240K808M411N056M988N075
$$ plain form
54100 103708 103067 102889 102927 102063 100395 99361 99540 99816 99047 97277 95059 92985 92130 93440 96108 97904
54084 97904 97778 96986 97002 97551 97546 96878 96253 96047 96308 97185 98436 99054 98336 96947 96107 95962 95563 94322 92831
54065 92831 92253 93279 95536 97803 99075 99661 100912 103673 107443 111181 114240 116194 116576 115502 114006
54050 114006 113031 112341 111015 108711 105890 103133 100784 99032 97927 97505 98132 100220 103193 105462 106198
54035 106198 106597 108543 112398 116952 121198 125064 128491 131053 132785 134389 136170 137457 137601 136944 136343
54020 136343 136186 136311 136415 136048 134696 132456 130362 129322 128889 127811 125845 124232 124079 124941 125527 125296
54004 125296 124648 123863 122731 121339 120400 120520 121625 123408 125748 128318 130448 132022 134011 137262 141007
53989 141007 143451 143887 143492 143918 145711 148229 150497 151914 152701 153941 156749 161160 166216 171204 176279
53974A76279N448N582N540O045P246Q214P989O646N131M509N328P260R200J0060
53960B70477R631Q481P125N630L950K278R49K69L12Q51J471J907K009J484K03
53945C17027j163j545q75l87j128k784m466n836o814p099o843o956p646p576n749
53930B50160l451k627k954k462q11J95l87j304j502j801k994l975l401j990j506
53915B19190k164k741k822l228m141m427l349j885j475k009j937k44K294M026
53901A95088M254L675L161K626J569K52l65J60J257K157K553K460K083K133L325
53886B26388N154N892M588K479J581K323L482M241N138O749Q472R231Q914Q379
53872C03011Q250Q167P239N082K413O06M08R79P86l97j062k01Q10j25k517l330
$$ plain form
53974 176279 181727 187309 192849 198894 206140 214354 222343 228989 234120 238629 243957 251217 260417 270477
53960 270477 280108 288589 295714 301344 305294 307572 308521 308790 309102 309953 311424 313331 315340 316824 317027
53945 317027 315864 314319 313444 313057 311929 309145 304679 298843 292029 284930 278087 271131 263485 255909 250160
53930 250160 246709 244082 241128 238666 237855 238050 237663 236359 234857 233056 230062 226087 222686 220696 219190
53915 219190 217026 214285 211463 208235 204094 199667 196318 194433 192958 190949 189012 188768 191062 195088
53901 195088 199342 203017 206178 208804 210373 210625 210260 210420 211677 213834 216387 218847 220930 223063 226388
53886 226388 231542 237434 242022 244501 246082 248405 251887 256128 261266 268015 276487 285718 294632 303011
53872 303011 311261 319428 326667 331749 334162 334768 335176 336155 336941 336544 335482 335281 336091 335966 333449 330119
53856C30119p76L314N965O572O621P001P418Q001R315J0613J0147P839N935O062
53842D24146P203P586P172O932O815O093M962M171L559K363P17n13j182j879k726
53827D75419l414m252n745p193p271o279o312q482j1189j2065j0796r088q424
53814C74909q681q873q445p745p454p761q117p895p054o038n166m469l920l525
53800B79766l396l815m954o256o718o123n442n473n740n422m676m119l579k451
53786B11602r13K34P41Q18K99j002k331k587j915j490j747k000j852j710j665
53771A94482j083K28J348J269L9j345j664k40K241L893L556K357K236L210L503
53756B14030K477J649K312L648M134L660L284L629M438N185N451N047M172L184
$$ plain form
53856 330119 329343 332657 338622 345194 351815 358816 366234 374235 383550 394163 404310 412149 418084 424146
53842 424146 431349 438935 446107 453039 459854 465947 470909 475080 478639 481002 481719 481206 480024 478145 475419
53827 475419 472005 467753 462008 454815 447544 441265 434953 426471 415282 403217 392421 383333 374909
53814 374909 366228 357355 348910 341165 333711 325950 317833 309938 302884 296846 291680 287211 283291 279766
53800 279766 276370 272555 267601 261345 254627 248504 243062 237589 231849 226427 221751 217632 214053 211602
53786 211602 210689 210923 211664 212482 212781 211779 209448 206861 204946 203456 201709 199709 197857 196147 194482
53771 194482 193399 193627 194975 196244 196283 194938 193274 193034 195275 199168 202724 205081 207317 210527 214030
53756 214030 216507 218156 220468 224116 228250 231910 235194 238823 243261 248446 253897 258944 263116 266300
53742B66300K126J033N31J331L064M563N264N439N084L844K208J539K388L856
53728C08570M876N145M600L265J980K038L412M511M125K657J049k50q75m59M28
53713C45072N50k25p02m77p02j936k883k384j244q36j137j442j862k700l318k954
53697C20820j944j000k20K17m86k204l090j890j08p3j736l206l756m298n144n402
53681B86480m675l717l094k633k381k819l759m219l783l235l478m442n251n055
53667B33939l729k084j107p44K8J456K266J502J03m35o7L78R89K349L880M274
53651B42998L434K495K062J811J677K013K599K829K840L166L454K948K108K204
53637B78638L211L793L568L708M841N918N907N345N371O223P290P776O928M637
$$ plain form
53742 266300 268426 269459 269990 271321 274385 278948 284212 289651 294735 298579 300787 302326 304714 308570
53728 308570 313446 318591 323191 326456 328436 330474 333886 338397 342522 345179 346228 345978 345103 344644 345072
53713 345072 345622 345397 344695 344218 343516 341580 338697 336313 335069 334233 333096 331654 329792 327092 323774 320820
53697 320820 318876 317876 317656 317873 317387 315183 312093 310203 310095 310022 308286 305080 301324 297026 291882 286480
53681 286480 281805 278088 274994 272361 269980 267161 263402 259183 255400 252165 248687 244245 238994 233939
53667 233939 230210 228126 227019 226275 226303 227759 230025 231527 231630 231195 231128 231506 232495 234844 238724 242998
53651 242998 246432 248927 250989 252800 254477 256490 259089 261918 264758 267924 271378 274326 276434 278638
53637 278638 281849 285642 289210 292918 297759 303677 309584 314929 320300 326523 333813 341589 348517 353154
53623C53154K241J736L521N734O287M828K461N44Q9J339L347M729N076M882M184
53608D04152K567O38j32M71R73O72Q14K194L259K233p6j487j601j760k269j878
53592D08770k79Q12n6k039l149k572j054L72J135J028K43n55p55m69k32o9N56
53575D01687J671K296J499k09j240o96P94K108K865L258L264K748K091J969K454
53560D26559K896K766K274K120K902M629O572P766P912P539P061O244N143M828
53546D97211O194Q418R718R572R169R604J0701J1718J2311J2452J2248J2105J2338
53533F33759J2491J1862J0797J0400J0767J0664R421Q013P651Q337R428J0567
53521G54157J1273J0811R483R039J0379J1763J0832P819N103L796K717R49m62
$$ plain form
53623 353154 355395 357131 360652 366386 372673 377501 379962 380506 380595 381934 385281 390010 395086 399968 404152
53608 404152 406719 407357 407225 407696 408669 409341 410155 412349 415608 417841 417765 416278 414677 412917 410648 408770
53592 408770 408491 409303 409247 407208 404059 401487 400433 400805 401940 402968 403211 402656 401901 401432 401200 401131 401687
53575 401687 403358 405654 407153 406944 405704 405008 405802 407910 410775 414033 417297 420045 422136 424105 426559
53560 426559 429455 432221 434495 436615 439517 444146 450718 458484 466396 473935 480996 487240 492383 497211
53546 497211 503405 511823 521541 531113 540282 549886 560587 572305 584616 597068 609316 621421 633759
53533 633759 646250 658112 668909 679309 690076 700740 710161 718174 725825 734162 743590 754157
53521 754157 765430 776241 785724 794763 805142 816905 827737 835556 840659 844455 847172 848121 847659
53508H47659k48R49J355J96j927m263o495q229q846q105o576n254m877n496o508
53493G83335p193p406p532p672p191n512l140j402j063j643k114j882r21N68K211
53478G31443L480M174M806O045P738Q980R303R342R954J1080J1943J2330J3030
53465H43648J4835J7353J9220J9470J8589J8065J8953K1019K3332K5543K8181
53454A068208L1627L5069L6942L6578L5272L5378L8032M1874M4396M4641M4140
53443A492157M4987M7595N0825N3636N5696N6874N7386N8351O0864O4155O5952
53432B108478O5293O3759O3217O3486O3367O2828O2788O3372O3979O4733O6205
53421B811505O7749O7668O5429O2413O0015N8206N6526N5215N4330N2667M8827
$$ plain form
53508 847659 847411 848360 849715 849911 847984 843721 837226 828997 820151 812046 805470 800216 795339 789843 783335
53493 783335 776142 768736 761204 753532 746341 740829 737689 736287 735224 733581 731467 729585 728664 729232 731443
53478 731443 734923 739097 743903 749948 757686 766666 775969 785311 795265 806345 818288 830618 843648
53465 843648 858483 875836 895056 914526 933115 951180 970133 991152 1014484 1040027 1068208
53454 1068208 1099835 1134904 1171846 1208424 1243696 1279074 1317106 1358980 1403376 1448017 1492157
53443 1492157 1537144 1584739 1635564 1689200 1744896 1801770 1859156 1917507 1978371 2042526 2108478
53432 2108478 2173771 2237530 2300747 2364233 2427600 2490428 2553216 2616588 2680567 2745300 2811505
53421 2811505 2879254 2946922 3012351 3074764 3134779 3192985 3249511 3304726 3359056 3411723 3460550
53410C460550M3156L7635L3903L1976L0880K9697K7863K5168K2006J9418J8317
53399C780569J8522J8662J7149J3307P670J541l744p454r900j2254j5608k0096
53387C788364k5094l0060l4887l9471m3481m6693m9192n1187n2966n4982n7411
53376C302940n9672o0923o1076o0697n9941n8488n6598n5171n4447n3635n2255
53365B670037n0690m8871m5762m1060l6241l2695k9722k5711k0502j5255j0556
53354B312972o068j639K643P294J3019J9472K5466L0273L4055L7371M1172M6467
53342B562497N2806N7882O0204O1471O4508O9309P3316P5400P7316Q0783Q5345
53331C320837Q9946R4713J00034J05303J09773J13743J17834J22004J25940J29704
$$ plain form
53410 3460550 3503706 3541341 3575244 3607220 3638100 3667797 3695660 3720828 3742834 3762252 3780569
53399 3780569 3799091 3817753 3834902 3848209 3855879 3857420 3853676 3846222 3836322 3824068 3808460 3788364
53387 3788364 3763270 3733210 3698323 3658852 3615371 3568678 3519486 3468299 3415333 3360351 3302940
53376 3302940 3243268 3182345 3121269 3060572 3000631 2942143 2885545 2830374 2775927 2722292 2670037
53365 2670037 2619347 2570476 2524714 2483654 2447413 2414718 2384996 2359285 2338783 2323528 2312972
53354 2312972 2306904 2305265 2307908 2315202 2328221 2347693 2373159 2403432 2437487 2474858 2516030 2562497
53342 2562497 2615303 2673185 2733389 2794860 2859368 2928677 3001993 3077393 3154709 3235492 3320837
53331 3320837 3410783 3505496 3605530 3710833 3820606 3934349 4052183 4174187 4300127 4429831
53321D429831J33316J36476J39175J41839J44405J46049J46210J45144J43187
53312E705632J40356J36946J33598J30409J26673J21644J14882J06236R6570Q8177
53302F901123Q2745P8972P3968O7024N9967N3535M6021L6378K6094J6503O521
53291G448851n168j7764l0360m4472o1839q0874r7995j11901j24007j34892j43056
53280F596523j47554j49644j51010j51976j52200j51810j51091j50042j48819
53271E242377j47904j47378j46646j45187j43012j40166j36395j31595j26187
53262C977907j20769j15577j10174j03643r5457q6441p8296p1736o5779n9432
53252C070603n3373m8891m5714m2083l6966l1202k6388k3343k1723k0400j8248
$$ plain form
53321 4429831 4563147 4699623 4838798 4980637 5125042 5271091 5417301 5562445 5705632
53312 5705632 5845988 5982934 6116532 6246941 6373614 6495258 6610140 6716376 6812946 6901123
53302 6901123 6983868 7062840 7136808 7203832 7263799 7317334 7363355 7399733 7425827 7442330 7448851
53291 7448851 7443683 7425919 7395559 7351087 7289248 7208374 7110379 6998478 6874471 6739579 6596523
53280 6596523 6448969 6299325 6148315 5996339 5844139 5692329 5541238 5391196 5242377
53271 5242377 5094473 4947095 4800449 4655262 4512250 4372084 4235689 4104094 3977907
53262 3977907 3857138 3741561 3631387 3527744 3432287 3345846 3267550 3195814 3130035 3070603
53252 3070603 3017230 2968339 2922625 2880542 2843576 2812374 2785986 2762643 2740920 2720520 2702272
53241B702272j5062j1727r124p039m625j558J849N349Q862J2038J4384J5840J6927
53228B728386J8554K1738K6925L3139L8609M2785M6921N1951N6758N9700O0978
53217C186444O2077O3343O3725O2744O1216N9943N8924N8072N7438N6515N4493
53206C844934N1548M8775M6574M4163M1182L8520L6806L5021L1663K6607K0817
53195D266610J4562P255r34q477j4320j9599k6497l5464m4634n2345n9145o6421
53183C960591p3810p9432q2411q3646q4011q3392q1999q0996q0830q0210p7978
53172C071876p4934p2630p1294p0223o9488o9751p0925p2288p3551p4549p4463
53161B277780p2737p0432o9165o8933o8305o6596o4330o1686n8043n3374m8815
$$ plain form
53241 2702272 2687210 2675483 2666359 2659320 2654695 2653137 2654986 2660335 2669197 2681235 2695619 2711459 2728386
53228 2728386 2746940 2768678 2795603 2828742 2867351 2910136 2957057 3009008 3065766 3125466 3186444
53217 3186444 3248521 3311864 3375589 3438333 3499549 3559492 3618416 3676488 3733926 3790441 3844934
53206 3844934 3896482 3945257 3991831 4035994 4077176 4115696 4152502 4187523 4219186 4245793 4266610
53195 4266610 4281172 4288427 4287493 4279016 4264696 4245097 4218600 4183136 4138502 4086157 4027012 3960591
53183 3960591 3886781 3807349 3724938 3641292 3557281 3473889 3391890 3310894 3230064 3149854 3071876
53172 3071876 2996942 2924312 2853018 2782795 2713307 2643556 2572631 2500343 2426792 2352243 2277780
53161 2277780 2205043 2134611 2065446 1996513 1928208 1861612 1797282 1735596 1677553 1624179 1575364
53150A575364m5421m3249m1851m0795l9647l8317l7349l7060l6637l5151l3153
53139A146734l1981l1754l1426l0694l0258l0049k8820k6060k3015k1276k1273
53128H40128k2356k3358k3144k1677k0571k1234k2622k2421k0329j8238j7112
53117F07066j5935j4374j3955j5350j6597j5652j3078j0670q955p764p727r211
53105D57798j0723j0531r092q117p866p323o543o617p402p312n746l979l241l329
53091C59977l677m417n699o945p473p158o114m472k747j621j001j37Q98Q63r15
53076C09362l186m077l215j855j112r87j000r93j027r68n91J05R23J671K180K209
53060B97439J632Q10M44Q01J277J003j49j516k476k925k876k181r28K56P34N23
$$ plain form
53150 1575364 1529943 1486694 1444843 1404048 1364401 1326084 1288735 1251675 1215038 1179887 1146734
53139 1146734 1114753 1082999 1051573 1020879 990621 960572 931752 905692 882677 861401 840128
53128 840128 817772 794414 771270 749593 729022 707788 685166 662745 642416 624178 607066
53117 607066 591131 576757 562802 547452 530855 515203 502125 491455 482500 474736 467009 457798
53105 457798 447075 436544 427452 419335 411469 404146 397603 390986 383584 376272 370526 366547 363306 359977
53091 359977 356300 351883 346184 339239 331766 324608 318494 314022 311275 309654 308653 308516 309414 310277 309362
53076 309362 306176 302099 298884 297029 295917 294930 293930 292937 291910 290942 290351 290456 291379 293050 295230 297439
53060 297439 299071 299881 300325 301126 302403 303406 303257 301741 299265 296340 293464 291283 290355 290611 291345 291868
53044B91868J87K70R87K211L421L914L375K166Q82j84q52p22M78K248L531L816
53028C17596L745M515O543Q742R271P284M021J701J244J442O56j235l087m118
53014C58320m445m214l271k011j597k703m590n970o423o290n556l833j531j37
53000C05749p40k770m670n470n295m639l827l035k334j676j236j506k607l724
52986B62220m008l889m544n965o617n438l226j450o13n30j300k941m600n297n115
52971B06687m717m020k523o63L80L14nj39o86j911k821k456j351r17j641k562
52955A80969k468j307k99o92k378l900m043l000j706o08L23Q67R39J267K481L638
52939A70083L104J095r9Q84K692L336K896K887L661L976K974J436O33P38Q09J09
$$ plain form
53044 291868 292055 292325 293312 295523 298944 302858 306233 308399 309281 309097 308245 307523 308001 310249 313780 317596
53028 317596 321341 325856 332399 341141 350412 357696 361717 363418 364662 366104 366760 365525 362438 358320
53014 358320 353875 349661 346390 344379 342782 340079 335489 329519 323096 316806 311250 307417 305886 305749
53000 305749 305009 302239 297569 292099 286804 282165 278338 275303 272969 271293 270057 268551 265944 262220
52986 262220 258212 254323 249779 243814 237197 231759 228533 227083 226470 225940 224640 221699 217099 211802 206687
52971 206687 201970 197950 195427 194764 195144 195458 195453 195314 194628 192717 189896 187440 186089 185172 183531 180969
52955 180969 178501 177194 176895 176203 173825 169925 165882 162882 161176 160568 160891 161758 162697 163964 166445 170083
52939 170083 173187 174282 174183 175067 177759 181095 183991 186878 190539 194515 197489 198925 199558 200296 201105 201214
52923B01214r19j093j6J102O74j259k898k846j700r85j128j165j97J552L120L677
52907A97133K991J453j95j241j262k01J495K845K960J909P48M27R52J713K261
52892B13988K486K386K069J933K484L765N037N279M331L438M090O046P251O301
52878B70884M407L812M765N297M028J797J03p40j105q14M28J759J578o06l443
52863B92150n133n230m773m780n053m790m045l698l810l137j113P07M26j587l312
52848B42822l849l909l769k764j141m78j417k625k898k753k931k737j423P1L51
52833B10550j51K42J887L268K963J172o29r61M71K270K443O24j420k086j882k112
52817B16649k530j811m2R65Q7j507j834m77J122J421M54m69m33J56N97J059J891
$$ plain form
52923 201214 200295 199202 199186 200288 200962 199703 196805 193959 192259 191274 190146 188981 188784 190336 193456 197133
52907 197133 200124 201577 201382 200141 198879 198678 200173 203018 205978 207887 208635 209062 210014 211727 213988
52892 213988 216474 218860 220929 222862 225346 229111 234148 239427 243758 247196 251286 257332 264583 270884
52878 270884 275291 279103 283868 289165 293193 294990 295093 294353 293248 292434 292862 294621 296199 295593 292150
52863 292150 287017 281787 277014 272234 267181 262391 258346 254648 250838 247701 246588 247295 247721 246134 242822
52848 242822 238973 235064 231295 228531 227390 226912 225495 222870 219972 217219 214288 211551 210128 210199 210550
52833 210550 210399 210641 212528 215796 218759 219931 219302 218341 218812 221082 223525 224149 222729 220643 218761 216649
52817 216649 214119 212308 212266 213231 213318 211811 209977 209500 210622 212043 212497 212028 211595 211751 212348 213407 215298
52800B15298K245J015r58j227J073L923M989M085K230l6k187l048k209j059q90
52785B23244j047l47Q11J472K077L409M614M456L764M123M772L456L05j946j938
52770B51225j285j421j348K01K413L680L778L499L217K912K675K367J641R34J277
52755B75765K550L260K826K610L612M452L083l58l722n330n214m474m301n262
52741B69497o675p180o439n610n470n187l854k330k120l079l675l230k540k321
52727B09787k299k114j991k186k487k565k371j960j502j462k284l671m685m662
52713A73548l802k738j908j378j032p47m97l84n08r31j643k306k214j143k51j128
52697A50938l449m510k224J951M326L170L59j338j416j323k032l091l818m197
$$ plain form
52800 215298 217543 218558 217600 216373 217446 221369 226358 230443 232673 232637 230450 227402 225193 224134 223244
52785 223244 222197 221850 222661 224133 226210 229619 234233 238689 242453 246576 251348 254804 255109 253163 251225
52770 251225 249940 248519 247171 247372 249785 253465 257243 260742 263959 266871 269546 271913 273554 274488 275765
52755 275765 278315 281575 284401 287011 290623 295075 298158 297800 294078 288748 283534 279060 274759 269497
52741 269497 262822 255642 249203 243593 238123 232936 229082 226752 224632 221553 217878 214648 212108 209787
52727 209787 207488 205374 203383 201197 198710 196145 193774 191814 190312 188850 186566 182895 178210 173548
52713 173548 169746 167008 165100 163722 162690 161943 161446 161062 160554 159623 157980 155674 153460 152317 152066 150938
52697 150938 147489 142979 140755 142706 147032 150202 150561 149223 147807 146484 144452 141361 137543 133346
52683A33346m394m211l638l264l513l703k764q05Q09J254J220J572J872J132k77
52668A14636q10K26J824K819L164L174K415M44j913l123k803k056j719j148O11
52653A15741L049M462L950K390J133M28l06j180j665j582j341j105n50J37L8j179
52637A22420k446k594j814j044n24L2L96J31l41k51P9k89r32q6K827N921O904
52620A28389N585L703K933L652N004N603M726L218K655L345M003L751L334L635
52606A83536M072L637K722K570L259L472K317L32j466k717l637m304m411l532
52592A85850j765j16J39j166k816l718m133m825n623n720n044m210l316j865J3
52577A41685J200Q99l78j372j160K91K040K648J542l9l16P93J654J310O23N19
$$ plain form
52683 133346 128952 124741 121103 117839 114326 110623 107859 107054 107863 109117 110337 111909 113781 114913 114636
52668 114636 113826 114052 115876 118695 121859 125033 127448 127892 125979 122856 120053 117997 116278 115130 115741
52653 115741 118790 123252 127202 129592 130725 131153 130847 129667 128002 126420 125079 123974 123424 123561 123599 122420
52637 122420 119974 117380 115566 114522 113998 114030 114426 114557 114216 113965 114044 113755 112823 112737 115564 121485 128389
52620 128389 133974 137677 140610 144262 149266 154869 159595 162813 165468 168813 172816 176567 179901 183536
52606 183536 187608 191245 193967 196537 199796 203268 205585 205917 204451 201734 198097 193793 189382 185850
52592 185850 184085 183969 184108 182942 180126 176408 172275 167450 161827 156107 151063 146853 143537 141672 141685
52577 141685 142885 143784 143406 142034 140874 141165 143205 145853 147395 147356 147040 147833 149487 150797 151420 151939
52561A51939M78k01q90p33m35j145k141j528O65K072J271l19p85l53k89m52J48
52544A47302J132R89n15j962k437k537k762k414q34J394L203M171M212L166J382
52529A53490r2n95m27J07J155K242K108P21J61J844L918L400L53k083j835m0J165
52512A65592J190N94k77j203j684j522j283j430j630j286l43P87J659K009K044
52497A63217K428L338L776K735R04k3L13P22O68J041K137K620J522p4n08K45J054
52480A86115J367J294O95n04j534j510o96j69l26n22J9J387K814L018J371j032
52464A91787k171j466l20P0K46R48J482Q95k16o14l86n09j061j265q44l0J171
52447A87717K382K234J15k085j910K48J671J144R5k26m35j183j698j174j20P12
$$ plain form
52561 151939 152417 152216 151326 150593 150158 149013 146872 145344 146009 148081 149352 149033 148248 147895 147606 147154 147302
52544 147302 148434 149423 148908 146946 144509 141972 139210 136796 135962 137356 140559 144730 148942 152108 153490
52529 153490 153398 152803 152376 152483 153638 155880 157988 158709 158870 160714 164632 168032 168385 166302 164467 164427 165592
52512 165592 166782 167376 167099 165896 164212 162690 161407 159977 158347 157061 156718 157505 159164 161173 163217
52497 163217 165645 168983 172759 175494 176398 176375 176688 177410 178078 179119 181256 183876 185398 185324 184816 185061 186115
52480 186115 187482 188776 189471 188967 187433 185923 185227 185058 184732 184210 184229 185616 188430 191448 192819 191787
52464 191787 189616 188150 187830 187900 188146 189094 190576 191471 191255 190641 190255 189746 188685 187420 186576 186546 187717
52447 187717 190099 192333 192448 190363 188453 188701 190372 191516 191611 191385 190950 189767 188069 186895 186775 187487
52431A87487J410K047K017J184M76M24L10k98l92R62K986M189M138L165J348r70
52415B10483k589k840k721l292l690k469l34M55p99k478l143k942k221o52J442
52400A82210K500J636jq53r84j346j831j457j21J192J880K320K797K832J947M37
52384A93158r84j874k066j513m96L23M45J07O8Q19K113L176L304K403J034n9m77
52367A99481k26M88J190J155Q2j129r45R84L012L164J381m17n46P26J800J641
52351B11841P98O32J818L612M635M279L202K423K270K405K493K323J570P0j678
52336B42693k785k833j993m69J551L362M050L659L251L366L087J409r77k180j345
52321B53846L18R53M7j176j121N63K684L740L402K610K324K619K933K763J906
$$ plain form
52431 187487 188897 190944 192961 194145 194621 195045 195355 195057 194665 195627 198613 202802 206940 210105 211453 210483
52415 210483 207894 205054 202333 199041 195351 192882 192548 193003 192204 189726 186583 183641 181420 180768 182210
52400 182210 184710 186346 186345 185492 184508 183162 181331 179874 179753 180945 182825 185145 187942 190774 192721 193158
52384 193158 192174 190300 188234 186721 186225 186548 186993 187100 187168 187987 190100 193276 196580 198983 200017 199958 199481
52367 199481 199255 199743 200933 202088 202170 201041 200096 201080 204092 207256 208637 208220 207674 208400 210200 211841
52351 211841 212639 213271 215089 218701 223336 227615 230817 233240 235510 237915 240408 242731 244301 244371 242693
52336 242693 239908 237075 235082 234613 236164 239526 243576 247235 250486 253852 256939 258348 257371 255191 253846
52321 253846 254164 255117 255164 253988 252867 253430 256114 259854 263256 265866 268190 270809 273742 276505 278411
52306B78411N97k82K40K044L757M268L939L733L743L382K565J714Q74o7l68J065
52290C09615L881O066O202N042M218M109L935L465L474M473N774O238N528M320
52276C76340L451L142L023K732K376K305K532K726K860L387M430N164M658L277
52262D22403K487L012L817L517K241J371J601K246K607L108M413O027O604N522
52248D70976L517J794J169J906L697N558O393O103N743O318P737R173J0164J0927
52234E51175J1887J3084J4084J4344J3835J3210J3113J3377J3320J2763J2245
52223F96437J2214J2628J3378J4336J4850J4071J2230J0704J0263J0094R296Q530
52211H39031R026J0564J1657J1598J1083J0729J0151Q894P390O440O257O417O426
$$ plain form
52306 278411 279008 278726 278966 281010 284767 289035 292974 296707 300450 303832 306397 308111 308985 308918 308550 309615
52290 309615 313496 319562 325764 330806 335024 339133 343068 346533 350007 354480 360254 366492 372020 376340
52276 376340 379791 382933 385956 388688 391064 393369 395901 398627 401487 404874 409304 414468 419126 422403
52262 422403 424890 427902 431719 435236 437477 438848 440449 442695 445302 448410 452823 458850 465454 470976
52248 470976 474493 476287 477456 479362 483059 488617 495010 501113 506856 513174 520911 530084 540248 551175
52234 551175 563062 576146 590230 604574 618409 631619 644732 658109 671429 684192 696437
52223 696437 708651 721279 734657 748993 763843 777914 790144 800848 811111 821205 830501 839031
52211 839031 848057 858621 870278 881876 892959 903688 913839 922733 930123 936563 942820 949237 955663
52198I55663O021N280M581M206L942L408K729K376K360K206J778J553J761J995
52184I99859J947J962K293K355J543N34Q70L023N566O738O357N716N823O532P350
52169A058468Q237R215R826R737R561J0214J1591J2632J2797J2662J2898J3495
52157A191333J4184J4785J4669J2966J0015P697P333P953P696O392N393N245M949
52144A310610L721K106R31J33q26k134l720n517p168q045q004p636p287o500n038
52129A255626l883m213n580o113m934l437l503m916n612m460k687j990k230k129
52115A199939j622j934l286m201l764l101l592m702m915l999k982k394j994j873
52101A155580k391l030k808j927j788l168n360p349q611q704p370n468m603n239
$$ plain form
52198 955663 961684 966964 971545 975751 979693 983101 985830 988206 990566 992772 994550 996103 997864 999859
52184 999859 1001806 1003768 1006061 1008416 1009959 1010493 1011363 1014386 1019952 1026690 1033047 1038763 1044586 1051118 1058468
52169 1058468 1066705 1075920 1085746 1095483 1105044 1115258 1126849 1139481 1152278 1164940 1177838 1191333
52157 1191333 1205517 1220302 1234971 1247937 1257952 1265649 1272982 1280935 1288631 1295023 1300416 1305661 1310610
52144 1310610 1314331 1316437 1317368 1317501 1316675 1314541 1310821 1305304 1298136 1290091 1282087 1274451 1267164 1260664 1255626
52129 1255626 1251743 1247530 1241950 1235837 1230903 1227466 1223963 1219047 1213435 1208975 1206288 1204298 1202068 1199939
52115 1199939 1198317 1196383 1193097 1188896 1185132 1182031 1178439 1173737 1168822 1164823 1161841 1159447 1157453 1155580
52101 1155580 1153189 1150159 1147351 1145424 1143636 1140468 1135108 1127759 1119148 1110444 1103074 1097606 1093003 1087764
52087A087764o155o276n915n703n411m809m597n418o570o809o096n596o134p315
52073A004960p963p049m543j801o26j414k732l219l273m006n238n647m737l494
52059I49218k974l150l493l929m662n447n576m654l151j952j324n52J089L156
52045I12599M418M448M156M458N107N339N116N069N581O602Q045R698J1001J1626
52031A003263J2169J3534J5615J7288J7812J7634J7577J7732J7602J6951J6195
52020A183372J5947J6402J7153J7546J7243J6516J5989J6109J6681J6801J5429
52009A365188J2520R619Q710J0070J1680J1198Q410N249L643L715M063L380J725
51996A459170M05M99J409J281p89l358m217l120k059k552l668l534k147j520k935
$$ plain form
52087 1087764 1081609 1075333 1069418 1063715 1058304 1053495 1048898 1043480 1036910 1030101 1024005 1018409 1012275 1004960
52073 1004960 996997 989948 985405 983604 982978 981564 978832 975613 972340 968334 963096 957449 952712 949218
52059 949218 946244 943094 939601 935672 931010 925563 919987 915333 912182 910230 908906 908354 909443 912599
52045 912599 917017 921465 925621 930079 935186 940525 945641 950710 956291 962893 970938 980636 991637 1003263
52031 1003263 1015432 1028966 1044581 1061869 1079681 1097315 1114892 1132624 1150226 1167177 1183372
52020 1183372 1199319 1215721 1232874 1250420 1267663 1284179 1300168 1316277 1332958 1349759 1365188
52009 1365188 1377708 1387327 1396037 1406107 1417787 1428985 1437395 1442644 1446287 1450002 1454065 1457445 1459170
51996 1459170 1459575 1460074 1461483 1462764 1461975 1458617 1454400 1451280 1449221 1446669 1443001 1439467 1437320 1435800 1432865
51981A432865n188o214n749n360o011o743o162m426k899k291j990j217r7O31N11
51966A379660k74j068j153k90R83J844J968J616J035K49o70j542k412l422m279
51951A372245m429m048m257n845q108r520r477q982r395j0801j1866j1571j0829
51938A263117j1775j5187j9235k1505k1745k1578k1917k1961k1048k0066k0243
51927A046857k1431k2473k2807k2898k3409k4502k5635k5703k3803k0341j6909
51916G96946j4820j4234j5021j7370k0653k2724k1824j8920j6686j6258j6268
51905F02168j5331j3937j3131j2535j0948q452o606o448p253p697p618p870q706
51892D75636r170q386o846n819n769n981n694m896l914k833j764j114j178j681
$$ plain form
51981 1432865 1427677 1421463 1415714 1410354 1404343 1397600 1391438 1387012 1384113 1381822 1379832 1378615 1378518 1379149 1379660
51966 1379660 1379386 1378318 1377165 1376875 1377858 1379702 1381670 1383286 1384321 1384570 1383900 1382358 1379946 1376524 1372245
51951 1372245 1367816 1363768 1359511 1353666 1345558 1336038 1326561 1317579 1308184 1297383 1285517 1273946 1263117
51938 1263117 1251342 1236155 1216920 1195415 1173670 1152092 1130175 1108214 1087166 1067100 1046857
51927 1046857 1025426 1002953 980146 957248 933839 909337 883702 857999 834196 813855 796946
51916 796946 782126 767892 752871 735501 714848 692124 670300 651380 634694 618436 602168
51905 602168 586837 572900 559769 547234 536286 527834 521228 514780 507527 499830 492212 484342 475636
51892 475636 466466 458080 451234 445415 439646 433665 427971 423075 419161 416328 414564 413450 412272 410591
51878D10591k142k412k645k951l386l953m399m268l527k779k516k406j743l57
51864C71107J194K179K152J154j94j053j196j238j686k059j410L05J881J958L39
51849C73433j735k573j514M51J698J569O01o77k203l465l193r64J588K223N77
51834C65816j720l150l553l316k495j195q1J89k94r12j309j639k085k365j892
51819C39999m52J260K129J767J019R00J368J478P32k15k70R82K890M251M084K279
51803C64201k74k278k951k550j969j747j466m02J265K313J946R04N24R57J206
51788C59679P11r2p76j386j592o78J068K031J213l98j337j595j972k307j812p14
51772C50043p6m4L21J401K466L049L558M033L453J233j293j942j14K430L355K049
$$ plain form
51878 410591 408449 406037 403392 400441 397055 393102 388703 384435 380908 378129 375613 373207 371464 371107
51864 371107 372301 374480 376632 377786 377592 376539 375343 374105 372419 370360 368950 369255 371136 373094 373433
51849 373433 371698 369125 367611 368062 369760 371329 371930 371253 369050 365585 362392 361428 363016 365239 365816
51834 365816 364096 360946 357393 354077 351582 350387 350306 350495 350201 349289 347980 346341 344256 341891 339999
51819 339999 339547 340807 342936 344703 345722 346622 347990 349468 350200 349985 349715 350697 353587 357838 361922 364201
51803 364201 363927 361649 358698 356148 354179 352432 350966 350564 351829 354142 356088 356992 357516 358473 359679
51788 359679 360390 360298 359522 358136 356544 355866 356934 358965 360178 359780 358443 356848 354876 352569 350757 350043
51772 350043 349967 349923 350244 351645 354111 357160 360718 364751 368204 369437 368144 366202 366088 368518 371873 373922
51756C73922K5p87j05O18K03p14o38O85J990K351K373L076M324M981M503L729
51740D00536M071O080Q828J0635J0512R094Q176R066J1218J2442J0707N943J7
51727E07325n063q678j1249j2949j3469j2842j1689j0515r446q653q392q506q592
51714C77282q695q930q525o483l497j756k141l036k807k079k278l129l277k514
51700C18135j679r72o5N72K19n39n63k85j133k875l618k846k340l222m091l381
51684B91317j894j460k179k612j989p66N39J596J661J93j763k202n69J391J804
51669B83067R39M75J001J327M31q20p57P83K164K122J275J069J868K802L043K517
51653C03306J702J326K013L530M623M247K817J761J994L277M638M878L257M45
$$ plain form
51756 373922 373947 373160 373055 373673 373876 373162 372524 373209 375199 377550 379923 382999 387323 392304 396807 400536
51740 400536 404607 410687 419515 430150 440662 449756 457932 466998 478216 490658 501365 507308 507325
51727 507325 502262 493584 482335 469386 455917 443075 431386 420871 411425 402772 394380 385874 377282
51714 377282 368587 359657 351132 344649 341152 339396 337255 334219 331412 329333 327055 323926 320649 318135
51700 318135 316456 315484 315419 315991 316210 315671 315108 314823 313690 310815 307197 304351 302011 298789 294698 291317
51684 291317 289423 287963 285784 283172 281183 280417 280956 282552 284213 284406 282643 280441 279872 281263 283067
51669 283067 284006 284481 285482 286809 287240 286420 285663 286446 288610 290732 292007 293076 294944 297746 300789 303306
51653 303306 305008 306334 308347 311877 316500 320747 323564 325325 327319 330596 335234 340112 343369 343814
51639C43814j677k049j754k247l020k482q21j18j399l262l947l359k384j500q71
51624C12924p54q98k43J825M374N650M682K010q15k307k349k446l915n940o449
51609C05349n017l477l357l996l937k921j620n08O2l81j536j978q05R62J631R43
51593B79414m7o39r79j183j062o09m2N80J166J328J000R59J927L323L762K789
51577B91687J360O46Q78J520J985K004J583Q45K4l22N93K916N285N656L495P19
51561C20874p2J944N368Q095Q864P843O343N759O381P337P806P783P474O687N345
51546D13831L957K889J637k76j953j679R76M168N299L485M83r75J54K338L444
51531D37778L340L751N673P889Q443O807M083J788Q54J230J762J022j236l756
$$ plain form
51639 343814 342137 340088 338334 336087 333067 330585 329764 329646 328247 324985 321038 317679 315295 313795 312924
51624 312924 312170 311272 311029 312854 317228 322878 327560 329570 328755 326448 324099 321653 317738 311798 305349
51609 305349 300332 296855 293498 289502 285565 282644 281024 280516 280578 280197 278661 276683 275878 276840 278471 279414
51593 279414 279367 278728 277749 276566 275504 274895 274853 275433 276599 277927 278927 279886 281813 285136 288898 291687
51577 291687 293047 293693 294571 296091 298076 300080 301663 302508 302532 302210 302803 305719 311004 316660 320155 320874
51561 320874 320802 322746 328114 336209 345073 352916 359259 365018 371399 378736 386542 394325 401799 408486 413831
51546 413831 417788 420677 422314 422038 420085 418406 419382 423550 428849 432334 432817 431842 431996 434334 437778
51531 437778 441118 444869 450542 458431 466874 473681 477764 479552 480406 481636 483398 484420 483184 479428
51517D79428n257n756o000o330o557o530o263n894n846o415o999o464m759l221
51503C97137k807k986l031l238l857l933k679j184j145k352l056k608k078k204
51489C59979k337j913j488j599j678j039j66o3p28j198r51n99q89j561j571l43
51473C41856J494K801L050K577J904J270P45L49N5N8P97K106K663J334r65k062
51457C60032j382o25r93j372l95J151J538Q67P28J594K281K031J453J242J361
51442C69511J790K884M439N508N657N558N877O379O688P049P660P862O838M839
51428D48539K969J837J066J98o33j213k055l946o687q960r808r735r705r585q473
51413C83809o463m936m839n549n817n143l855k586j970k167k364j430O08K538
$$ plain form
51517 479428 474171 468415 462415 456085 449528 442998 436735 430841 424995 418580 411581 405117 400358 397137
51503 397137 394330 391344 388313 385075 381218 377285 374606 373422 372277 369925 366869 364261 362183 359979
51489 359979 357642 355729 354241 352642 350964 349925 349759 349696 348968 347770 346819 346220 345331 343770 342199 341856
51473 341856 343350 346151 349201 351778 353682 354952 355697 356046 356101 356159 356956 359062 361725 363059 362094 360032
51457 360032 358650 358025 357032 355660 355265 356416 357954 358821 359549 361143 363424 365455 366908 368150 369511
51442 369511 371301 374185 378624 384132 389789 395347 401224 407603 414291 421340 429000 436862 443700 448539
51428 448539 451508 453345 454411 454609 453976 452763 450708 446762 440075 431115 421307 411572 401867 392282 383809
51413 383809 377346 372410 367571 362022 356205 351062 347207 344621 342651 340484 338120 336690 337298 339836
51399C39836L513L660L033J332q25j869j349o67q62j193j036j521l554n686o008
51384C26804n123n065o050o544o103n810o001n818n146m867m915m212k960k819
51370B55371m041m461k562J79J345O60m63j411k727m421n392m793l089j389j56
51355B22650J031K429L203K147m59k494k150J33K607M333N239M811K480p09k459
51340B42792j647P26L085M549M465K369q30k821k152R9J557J131j57n08P37K422
51324B55817K807J608M05N96J688K359K360K312K373K525L356M917N563M008J904
51309B94598J919L426L028k14l149l223j967k069l319l754l151k960l663m321
51295B71181m417m506n174o352p496p775o644m751l467l161l051l061m077n538
$$ plain form
51399 339836 343349 347009 350042 351374 350549 348680 347331 346664 345802 344609 343573 342052 338498 332812 326804
51384 326804 321681 316616 310566 304022 297919 292109 286108 280290 275144 270277 265362 261150 258190 255371
51370 255371 251330 246869 244307 244486 245831 246491 246028 244617 241890 237469 232077 227284 224195 222806 222650
51355 222650 223681 226110 229313 231460 231001 228507 226357 226490 229097 233430 238669 243480 245960 245251 242792
51340 242792 241145 241871 244956 249505 253970 256339 255509 252688 250536 250635 252192 253323 253166 252658 253395 255817
51324 255817 258624 260232 260637 261233 262921 265280 267640 269952 272325 274850 278206 283123 288686 292694 294598
51309 294598 296517 299943 302971 302757 299608 296385 294418 292349 289030 285276 282125 279165 275502 271181
51295 271181 266764 262258 257084 250732 243236 235461 228817 224066 220599 217438 214387 211326 207249 201711
51281B01711m927j342K239K418q3j645p75N17J45j490k727k677j446M00J954K257
51265A94529R72j458m090n595m772j792J442L026K778J794R81P61J347K264K316
51250A94503J089k52o49p52j581k491k116o41N74J198J931K547J909j9j854k734
51234A90662k937k434n99K082L653K931R50n02q77p75p95j118j641j971j830j613
51218A83186j863k153j500j8R73Q75O57J163J707J195j31j123j317j218j274j383
51202A77776j403j412j362q39N24K445L856L654J860k01j139q35j86J10J2k88
51186A82572n49k85P32J872K226J792J362J197P47j53p15k77Q10J715K093K056
51170A97195J755J258N33n20j633j879o60J072J606P04K0P51K028K415K010J892
$$ plain form
51281 201711 196784 195442 197681 200099 200016 198371 197596 198113 198258 196768 194041 191364 189918 190318 192272 194529
51265 194529 195501 194043 189953 184358 179586 177794 179236 182262 185040 186834 187815 188576 189923 192187 194503
51250 194503 195592 195340 194691 193939 192358 189867 187751 187110 187684 188882 190813 193360 195269 195250 193396 190662
51234 190662 187725 185291 184692 186774 190427 193358 194308 193806 192929 192154 191359 190241 188600 186629 184799 183186
51218 183186 181323 179170 177670 177652 178625 179500 180157 181320 183027 184222 184091 182968 181651 180433 179159 177776
51202 177776 176373 174961 173599 172760 173284 175729 179585 183239 185099 184898 183759 182924 182738 182848 182860 182572
51186 182572 182023 181738 182470 184342 186568 188360 189722 190919 191666 191513 190798 190521 191331 193046 195139 197195
51170 197195 198950 200208 200741 200221 198588 196709 196049 197121 198727 199431 199451 200202 202230 204645 206655 208547
51154B08547K104J615K02q98n67P42J643J411N37oK79J110J791J850J393Q82O72
51137B23307P71R29Q81N72K38K78Q97J831K453K338J731J340J403J211o3k108
51121B38009l604l792l210k619j914q79j84o17j585j625m25P79J037P80N82J0
51105B20743j398k733k540q54N79L09j303k768l116k608k092k158k754l286l077
51090A90944j920l49Q55J504K120L017L565K899J291L6j73j08p66j922k608k489
51074A95896j903r35N13J764J646J31j151p31R27K083J827Q84M71R25J673K153
51058B06173K412K788L285L537L350K899K357J664R10M31K54j07p13n57J289L992
51042B33964N432M574K618J395J332J562J462J290J367J317M95j044k415k826
$$ plain form
51154 208547 210651 212266 212468 211570 211003 211745 213388 214799 215336 215330 215609 216719 218510 220360 221753 222635 223307
51137 223307 224078 225007 225888 226460 226698 226976 227873 229704 232157 234495 236226 237566 238969 240180 240117 238009
51121 238009 234405 230613 227403 224784 222870 221991 221807 221190 219605 217980 217555 218334 219371 220151 220733 220743
51105 220743 219345 216612 214072 213218 213797 214106 212803 210035 206919 204311 202219 200061 197307 194021 190944
51090 190944 189024 188675 189530 191034 193154 196171 199736 202635 203926 203962 203789 203681 202915 200993 198385 195896
51074 195896 193993 193058 193571 195335 196981 197112 195961 195230 196157 198240 200067 200951 201422 202347 204020 206173
51058 206173 208585 211373 214658 218195 221545 224444 226801 228465 229375 229806 230060 229953 229240 228683 229972 233964
51042 233964 239396 243970 246588 247983 249315 250877 252339 253629 254996 256313 256808 255764 253349 250523
51028B50523k404j804j282o08J32L75K4k06R1J85o11j670j903j547j788k744l224
51011B31539k682j923j475o15J014K098J336l08m50J690M384N535M703K838R31
50996B48615n03j288j579j891k625l565l999l458k275j298r27n21Q86L188M934
50981B33694M838L265J641O90l2q56j199m47J013K330L283M143M671M243K951
50966B64228J746J206J042J125J984L603M656M024K486J613J478R68J77N53K288
50951B93177L482K960K298L387N329N736M454L845N224P044P265O049N024M913
50937C60187N023M707M355M763O013P173P296O647O546P597Q650Q354P352P660
50923D52323R868J2155J2722J2019J1722J2415J3330J3981J4784J6116J7631J8856
$$ plain form
51028 250523 248119 246315 245033 244425 244557 244932 244956 244750 244841 245026 244415 242745 240842 239295 237507 234763 231539
51011 231539 228857 226934 225459 224844 225858 227956 229292 228984 228534 230224 234608 240143 244846 247684 248615
50996 248615 248112 246824 245245 243354 240729 237164 233165 229707 227432 226134 225207 224686 225572 228760 233694
50981 233694 238532 241797 243438 244128 244096 243240 242041 241594 242607 244937 248220 252363 257034 261277 264228
50966 264228 265974 267180 268222 269347 271331 274934 279590 283614 286100 287713 289191 290159 290336 290889 293177
50951 293177 296659 299619 301917 305304 310633 316369 320823 324668 329892 336936 344201 350250 355274 360187
50937 360187 365210 369917 374272 379035 385048 392221 399517 406164 412710 420307 428957 437311 444663 452323
50923 452323 462191 474346 487068 499087 510809 523224 536554 550535 565319 581435 599066 617922
50911F17922J9874K1100K2763K4845K7316L0084L2861L5195L6755L7523L7876
50900I44114L8482M0028M2755M6218M9479N1669N2410N1819N0260M8119M5534
50889A460887M2199L7774L2634K7836K3976K0471J6594J2746R837P703N309K558
50877A700524O21J84N55R88J595K183J544j019m481p501j0139j3056j6068j8942
50863A636988k2622k7946l3726l7874m0136m1916m3785m4987m5355m5614m5590
50852A207437m3992m0630l7091l4678l3077l1609l0179k8294k4888k0041j5558
50841H67400j2719j0784q644o695n816n554m709k977r32J025K652L545L810M468
50827H24070O087P623P628O193M689M042M197M928O097P228P758P685P442P237
$$ plain form
50911 617922 637796 658896 681659 706504 733820 763904 796765 831960 868715 906238 944114
50900 944114 982596 1022624 1065379 1111597 1161076 1212745 1265155 1316974 1367234 1415353 1460887
50889 1460887 1503086 1540860 1573494 1601330 1625306 1645777 1662371 1675117 1684954 1692657 1697966 1700524
50877 1700524 1701145 1701329 1701884 1702872 1704467 1706650 1708194 1707175 1702694 1695193 1685054 1671998 1655930 1636988
50863 1636988 1614366 1586420 1552694 1514820 1474684 1432768 1388983 1343996 1298641 1253027 1207437
50852 1207437 1163445 1122815 1085724 1051046 1017969 986360 956181 927887 902999 882958 867400
50841 867400 854681 843897 835253 828558 822742 817188 812479 809502 808570 809595 812247 815792 819602 824070
50827 824070 830157 837780 845408 851601 856290 860332 864529 869457 875554 882782 890540 898225 905667 912904
50813I12904O990O658O339O318P130R017J1153J2270J2343J2708J4031J5404J6074
50800A049339J6845J8715K1280K3775K6658L0792L5852M1099M6838N3407N9405
50789A424005O2966O4774O7740P3388Q0289Q6515R1959R7382J02585J06693J09447
50778B367743J11154J11868J11335J09467J06197J01008R3273Q3203P2226O2103
50768C329577N3477M5381L6518K7046J8576J2310Q001N219M493O266R387J2048
50756C568299J3844J5572J7152J7146J4542R770L524m288j3788k4155l4164m3239
50744C540215n1485n9041o5820p1712p6584q0167q2144q2370q1032p8538p4936
50733B736386o9561o1818n2393m2825l3480k3088j1061P90J0283J7775K5369L3690
$$ plain form
50813 912904 919894 926552 932891 939209 946339 955356 966509 978779 991122 1003830 1017861 1033265 1049339
50800 1049339 1066184 1084899 1106179 1129954 1156612 1187404 1223256 1264355 1311193 1364600 1424005
50789 1424005 1486971 1551745 1619485 1692873 1773162 1859677 1951636 2049018 2151603 2258296 2367743
50778 2367743 2478897 2590765 2702100 2811567 2917764 3018772 3112045 3195248 3267474 3329577
50768 3329577 3383054 3428435 3464953 3491999 3510575 3522885 3530886 3536105 3540598 3546864 3556251 3568299
50756 3568299 3582143 3597715 3614867 3632013 3646555 3656325 3659849 3655561 3641773 3617618 3583454 3540215
50744 3540215 3488730 3429689 3363869 3292157 3215573 3135406 3053262 2970892 2889860 2811322 2736386
50733 2736386 2666825 2605007 2552614 2509789 2476309 2453221 2442160 2442950 2453233 2471008 2496377 2530067
50721B530067M1318M7350N2410N6602N8281N6130N1156M5485L9943L3835K6480
50710C039057J7992Q984L47o918j2428j7026k2295k9459l8702m9048n8714o6105
50698B765685p0864p3798p5666p6433p5686p3307o9747o5924o2685n9673n5167
50687B006735m8103m0000l3504k8994k4200j7547j0169l747K040Q491J5481K1792
50675A848275K7204L2654L8566M4301M9335N3904N8418O2996O7599P2004P5764
50664B431020P8623Q0594Q1070P8571P2499O4701N7972N3107M8424M2109L3984
50653C122674K4977J6159Q484K364k791p627j1250j1752q921n004j991P28M830
50640C130880J0075J4451J6839J8022J8745J8131J4734Q417N09p489j4791k1234
$$ plain form
50721 2530067 2571385 2618735 2671145 2727747 2786028 2842158 2893314 2938799 2978742 3012577 3039057
50710 3039057 3057049 3066033 3066380 3059462 3047034 3030008 3007713 2978254 2939552 2890504 2831790 2765685
50698 2765685 2694821 2621023 2545357 2468924 2393238 2319931 2250184 2184260 2121575 2061902 2006735
50687 2006735 1958632 1918632 1885128 1856134 1831934 1814387 1804218 1800471 1802511 1811002 1826483 1848275
50675 1848275 1875479 1908133 1946699 1991000 2040335 2094239 2152657 2215653 2283252 2355256 2431020
50664 2431020 2509643 2590237 2671307 2749878 2822377 2887078 2945050 2998157 3046581 3088690 3122674
50653 3122674 3147651 3163810 3172294 3174658 3171867 3164240 3152990 3141238 3132317 3127313 3125322 3126050 3130880
50640 3130880 3140955 3155406 3172245 3190267 3209012 3227143 3241877 3250294 3250803 3243314 3228523 3207289
50628C207289k6919l1951l6020l8280l8001l5530l2159k8791k4976j9729j3115
50617B881818o304J26P183J6056K6273L6202M5398N5297O7203Q0411R3105J04535
50605C407303J15361J26169J36521J45449J51902J54639J52536J45636J35415
50596D670931J23586J10948R7576Q3531O9032N4460M0678K8694J8288P536n347
50585E299913j9769l3239m3969n2120n8565o3562o7061o9147o9395o6621o0306
50574D696159n1874m3615l6435k9518k2203j5246j0015p109o229o830q273r695
50562D449117j0529j1319j3384j7272k1833k5206k6524k6100k4147k0396j5272
50551D237135j0356o606k776K978R968J5035J6226J4870J3149J0887O266j048
$$ plain form
50628 3207289 3180370 3148419 3112399 3074119 3036118 3000588 2968429 2939638 2914662 2894933 2881818
50617 2881818 2875514 2875640 2882823 2898879 2925152 2961354 3006752 3062049 3129252 3209663 3302768 3407303
50605 3407303 3522664 3648833 3785354 3930803 4082705 4237344 4389880 4535516 4670931
50596 4670931 4794517 4905465 5003041 5086572 5155604 5210064 5250742 5279436 5297724 5305260 5299913
50585 5299913 5280144 5246905 5202936 5150816 5092251 5028689 4961628 4892481 4823086 4756465 4696159
50574 4696159 4644285 4600670 4564235 4534717 4512514 4497268 4487253 4480144 4473915 4467085 4458812 4449117
50562 4449117 4438588 4427269 4413885 4396613 4374780 4349574 4323050 4296950 4272803 4252407 4237135
50551 4237135 4226779 4220173 4217397 4220375 4230343 4245378 4261604 4276474 4289623 4300510 4306776 4305728
50539D305728r345j7442k6093l6369m7747n8843o9066p8656q7352r4111r8261
50528C682443j00430j01959j03554j04729j04459j02294r8740r4650r0449q6031
50518B695148q1185p5835p0020o3944n7965n2081m5550l7576k8544k0059j3355
50507B149034q030k809K725P902J2356J6788K1891K7145L1511L4989L8589M2842
50495B374933M7296N1758N7057O3822P1344P8537Q5526R3205J01588J09669J16803
50484C251538J23065J28320J31922J33534J33164J30372J24758J17447J10715
50475D384835J05570J00991R6130R1899Q9378Q8078Q6895Q5686Q4509Q2495P9143
50464E375609P6013P5195P6609P8517Q0533Q4139Q9975R6255J00457J01461R9617
$$ plain form
50539 4305728 4296383 4278941 4252848 4216479 4168732 4109889 4040823 3962167 3874815 3780704 3682443
50528 3682443 3582013 3480054 3376500 3271771 3167312 3065018 2966278 2871628 2781179 2695148
50518 2695148 2613963 2538128 2468108 2404164 2346199 2294118 2248568 2210992 2182448 2162389 2149034
50507 2149034 2141004 2138195 2140920 2148822 2161178 2177966 2199857 2227002 2258513 2293502 2332091 2374933
50495 2374933 2422229 2473987 2531044 2594866 2666210 2744747 2830273 2923478 3025066 3134735 3251538
50484 3251538 3374603 3502923 3634845 3768379 3901543 4031915 4156673 4274120 4384835
50475 4384835 4490405 4591396 4687526 4779425 4868803 4956881 5043776 5129462 5213971 5296466 5375609
50464 5375609 5451622 5526817 5603426 5681943 5762476 5846615 5936590 6032845 6133302 6234763 6334380
50453F334380R5779R0559Q3713P3957O0144M2729K3253K714j8568l9821o0084
50442F688755p9543r8903j17055j31027j38914j41566j40722j36874j29639j18889
50432E455623j04663q7232o8303n0677l5604k1653p632M602J1921J3540J0771
50421E120693L789q977k7778m9975p2465r4227j15462j35201j51247j62191j68551
50410D138408j71785j72805j71646j68143j62460j54965j45942j35763j25218
50401B729681j15209j05946r6854q7554p8537p0452o3106n5788m8537m2341l7794
50390A927563l4130l0021k5105k0179j5907j1931p533k805J407M615P118R292
50378A802384J1193J3082J5674J9255K3055K6225K8993L2194L5942L9637M3080
$$ plain form
50453 6334380 6430159 6520718 6604431 6678388 6738532 6781261 6804514 6807228 6788660 6748839 6688755
50442 6688755 6609212 6510309 6393254 6262227 6123313 5981747 5841025 5704151 5574512 5455623
50432 5455623 5350960 5263728 5195425 5144748 5109144 5087491 5079859 5084461 5096382 5109922 5120693
50421 5120693 5124482 5115505 5087727 5037752 4965287 4871060 4755598 4620397 4469150 4306959 4138408
50410 4138408 3966623 3793818 3622172 3454029 3291569 3136604 2990662 2854899 2729681
50401 2729681 2614472 2508526 2411672 2324118 2245581 2175129 2112023 2056235 2007698 1965357 1927563
50390 1927563 1893433 1863412 1838307 1818128 1802221 1790290 1782757 1779952 1781359 1785974 1793092 1802384
50378 1802384 1813577 1826659 1842333 1861588 1884643 1910868 1939861 1972055 2007997 2047634 2090714
50367B090714M6709N0687N4488N7442N9162N9671N9779O0914O3702O6981O9157
50356B739406P0196P1092P1829P1500P0436P0324P1801P3677P5092P6558P8111
50345C540022P8464P7359P6846P8315P9663P7544P1580O4121N6563M8282L9083
50334D287842L0181K2101J3361K195j1608k7052m2904n7759p0441q1156r1224
50323C973536j00931j08444j11788j11164j08330j04252r8427r0290q0285o9331
50313B990294n8059m6914l6407k6786j7826r574l135m4o56l788q300j4468k3047
50300B741290l3411m3670n2590o0303o6997p1992p4723p5684p5691p4802p2689
50289B038738o9566o5994o2343n8994n6386n4095n0639m5185l8893l3548k9496
$$ plain form
50367 2090714 2137423 2188110 2242598 2300040 2359202 2418873 2478652 2539566 2603268 2670249 2739406
50356 2739406 2809602 2880694 2952523 3024023 3094459 3164783 3236584 3310261 3385353 3461911 3540022
50345 3540022 3618486 3695845 3772691 3851006 3930669 4008213 4079793 4143914 4200477 4248759 4287842
50334 4287842 4318023 4340124 4353485 4355680 4344072 4317020 4274116 4216357 4145916 4064760 3973536
50323 3973536 3872605 3764161 3652373 3541209 3432879 3328627 3230200 3139910 3059625 2990294
50313 2990294 2932235 2885321 2848914 2822128 2804302 2794728 2791593 2791549 2790893 2787105 2778805 2764337 2741290
50300 2741290 2707879 2664209 2611619 2551316 2484319 2412327 2337604 2261920 2186229 2111427 2038738
50289 2038738 1969172 1903178 1840835 1781841 1725455 1671360 1620721 1575536 1536643 1503095 1473599
50278A473599k6075k3357k1832k0585j7775j3252r040o500m529j537J989M206
50266A335312M567M528N748Q479J1688J4088J5073J5168J5650J7354J9804K1708
50254A489167K2186K1385K0172J9444J9659K0541K1264K1200K0604K0343K0883
50243A716848K1690K1833K1119K0305K0066J9989J9011J6729J3739J0621P239
50232A909189L332o52l933o222p782q978j0385j2867j6737k0981k4084k5760k7098
50219A747042k8990l1090l2583l3247l3295l2773l1691l0363k9072k7601k5626
50208A410711k3392k1517k0077j8552j6837j5687j5671j6030j5447j3825j2450
50197A221226j2083j1778j0318q047o194m884l254j441q19j800k844k509j237
$$ plain form
50278 1473599 1447524 1424167 1402335 1381750 1363975 1350723 1341683 1335183 1330654 1329117 1331106 1335312
50266 1335312 1339879 1344407 1350155 1358634 1370322 1384410 1399483 1414651 1430301 1447655 1467459 1489167
50254 1489167 1511353 1532738 1552910 1572354 1592013 1612554 1633818 1655018 1675622 1695965 1716848
50243 1716848 1738538 1760371 1781490 1801795 1821861 1841850 1860861 1877590 1891329 1901950 1909189
50232 1909189 1912521 1911869 1907936 1901714 1893932 1884954 1874569 1861702 1844965 1823984 1799900 1774140 1747042
50219 1747042 1718052 1686962 1654379 1621132 1587837 1555064 1523373 1493010 1463938 1436337 1410711
50208 1410711 1387319 1365802 1345725 1327173 1310336 1294649 1278978 1262948 1247501 1233676 1221226
50197 1221226 1209143 1197365 1187047 1179000 1172806 1167922 1164668 1163227 1162408 1160608 1157764 1155255 1154018
50184A154018k5J410L768O261P322O879O325O246N767M341K739J696Q34l61j513
50169A205707k076k420l205m232m767m797n135o321p954r321j0165j0516j0139
50156A124659q735o832n793o274o901n500j973J065J288m08j101M27K396K587
50142A088905J026l89k36J117K265K379K072K617M288N729N464L711K116J813
50128A122877K440L112L558L968M230L883K737J269L72N27J146J061q1j320j632
50113A148147j232j030j170r38J71K049M444O932Q623Q953Q860R997J2642J5374
50099A221822J7163J8640K0591K2296K2486K1464K1006K2053K3449K3572K2725
50088A457267K2998K5603K9048L0832L0656L0731L2819L6260L9678M3322M8256
$$ plain form
50184 1154018 1153993 1155403 1159171 1165432 1172754 1179633 1185958 1192204 1197971 1202312 1205051 1206747 1207581 1207220 1205707
50169 1205707 1203631 1201211 1198006 1193774 1189007 1184210 1179075 1172754 1164800 1155479 1145314 1134798 1124659
50156 1124659 1115924 1109092 1103299 1097025 1090124 1084624 1082651 1083716 1085004 1084596 1083495 1083922 1086318 1088905
50142 1088905 1089931 1089542 1089306 1090423 1092688 1095067 1097139 1099756 1104044 1109773 1115237 1118948 1121064 1122877
50128 1122877 1125317 1128429 1131987 1135955 1140185 1144068 1146805 1148074 1148446 1148973 1150119 1151180 1151099 1149779 1148147
50113 1148147 1146915 1145885 1144715 1143777 1143948 1145997 1150441 1157373 1165996 1174949 1183809 1193806 1206448 1221822
50099 1221822 1238985 1257625 1278216 1300512 1322998 1344462 1365468 1387521 1410970 1434542 1457267
50088 1457267 1480265 1505868 1534916 1565748 1596404 1627135 1659954 1696214 1735892 1779214 1827470
50077A827470N4157N9631O4502P0027P6850Q4181R1274R8521J06783J16710J28708
50066B778814J42483J56577J69784J82862J97155K11350K21671K25745K24062
50057D510503K16908K02479J80118J53417J27703J05508Q6690P1741O1921N6224
50047E773212N0823M2265K9250J0925j4313m6921q4364j22547j58425j90378k16895
50036E072632k36189k46949k48838k42530k29963k14241j98274j83074j67749
50027C104825j51264j33907j16971j01549q8096p6831o7817o0367n3001m4648
50017B210374l5893k8485k3559k0606j8202j5320j1868q436n812m479m282m591
50005B028841m799m620m082l522l246k901j517J092L408L707K465K130M264P910
$$ plain form
50077 1827470 1881627 1941258 2005760 2075787 2152637 2236818 2328092 2426613 2533396 2650106 2778814
50066 2778814 2921297 3077874 3247658 3430520 3627675 3839025 4060696 4286441 4510503
50057 4510503 4727411 4929890 5110008 5263425 5391128 5496636 5583326 5655067 5716988 5773212
50047 5773212 5824035 5866300 5895550 5906475 5892162 5845241 5760877 5638330 5479905 5289527 5072632
50036 5072632 4836443 4589494 4340656 4098126 3868163 3653922 3455648 3272574 3104825
50027 3104825 2953561 2819654 2702683 2601134 2513038 2436207 2368390 2308023 2255022 2210374
50017 2210374 2174481 2145996 2122437 2101831 2083629 2068309 2056441 2048005 2042193 2037714 2033432 2028841
50005 2028841 2024042 2019422 2015340 2011818 2008572 2005671 2004154 2005246 2008654 2012361 2014826 2016956 2021220 2029130
49991B029130J1210J3509J5194J6520J7586J8936K1131K3868K6160K7262K7209
49980B247715K6812K7333K9560L2748L5160L6087L6685L8276M0773M3386M6064
49969B640599M9142N2282N4907N7331O0363O4104O8133P2706P8588Q5818R3582
49958C377555J01502J10150J20190J31688J44438J58393J73778J91237K11544
49949D720475K34563K58807K82909L07128L32171L56520L76157L87114L87387
49940G643231L76484L54968L25590K93663K64542K40510K20589K03002J86819
49931A0109398J71317J54513J32925J02688O1117P926n4415j21241j86945k46478
49921A0130805k96657l36775l67956l91656m08446m18006m20060m15247m05147
$$ plain form
49991 2029130 2040340 2053849 2069043 2085563 2103149 2122085 2143216 2167084 2193244 2220506 2247715
49980 2247715 2274527 2301860 2331420 2364168 2399328 2435415 2472100 2510376 2551149 2594535 2640599
49969 2640599 2689741 2742023 2796930 2854261 2914624 2978728 3046861 3119567 3198155 3283973 3377555
49958 3377555 3479057 3589207 3709397 3841085 3985523 4143916 4317694 4508931 4720475
49949 4720475 4955038 5213845 5496754 5803882 6136053 6492573 6868730 7255844 7643231
49940 7643231 8019715 8374683 8700273 8993936 9258478 9498988 9719577 9922579 10109398
49931 10109398 10280715 10435228 10568153 10670841 10731958 10739884 10685469 10564228 10377283 10130805
49921 10130805 9834148 9497373 9129417 8737761 8329315 7911309 7491249 7076002 6670855
49912F670855l91507l75301l56468l34648l10362k85476k62179k41256k21511
49903C892147k01341j80972j62493j47389j34786j22835j11291j01522r4084q7683
49893B547751q1019p4502o9318o5629o2589n9702n7208n5340n3917n2533n0689
$$ plain form
49912 6670855 6279348 5904047 5547579 5212931 4902569 4617093 4354914 4113658 3892147
49903 3892147 3690806 3509834 3347341 3199952 3065166 2942331 2831040 2729518 2635434 2547751
49893 2547751 2466732 2392230 2322912 2257283 2194694 2134992 2077784 2022444 1968527 1915994 1865305
$$ [...]
##END NTUPLES=NMR SPECTRUM
##END=
