##TITLE=coffee_type TOSA01-ROVE100B_60-40%
COFFEE_meoh_noesyp64 COFFEE_meoh {C:\Bruker\TOPSPIN} Administrator 13
##JCAMPDX= 6.0         $$ Bruker NMR JCAMP-DX V2.0
##DATA TYPE= NMR SPECTRUM
##DATA CLASS= NTUPLES
##ORIGIN= Bruker BioSpin GmbH
##OWNER= Administrator
$$ 1.72 TOPSPIN		Version 2.1
$$ 2012-05-18 15:48:42.011 -0700  Administrator@X
$$ Compression mode = diff/dup
##.OBSERVE FREQUENCY= 400.13188235
##.OBSERVE NUCLEUS= ^1H
##.ACQUISITION MODE= SIMULTANEOUS (DQD)
##.ACQUISITION SCHEME= undefined
##.AVERAGES= 64
##.DIGITISER RES= 22
##SPECTROMETER/DATA SYSTEM= spect
##.PULSE SEQUENCE= noesygpps1d.comp
##.SOLVENT NAME= COFFEE_meoh
##.SHIFT REFERENCE= INTERNAL, COFFEE_meoh, 1, 14.98061
##AUDIT TRAIL= $$ (NUMBER, WHEN, WHO, WHERE, PROCESS, VERSION, WHAT)
$$ ##TITLE= Audit trail, TOPSPIN		Version 2.1
$$ ##JCAMPDX= 5.01
$$ ##ORIGIN= Bruker BioSpin GmbH
$$ ##OWNER= Administrator
$$ $$ C:\Bruker\TOPSPIN/data/Administrator/nmr/12-COFFEE-2402/152/pdata/1/auditp.txt
$$ ##AUDIT TRAIL=  $$ (NUMBER, WHEN, WHO, WHERE, PROCESS, VERSION, WHAT)
(   1,<2012-02-24 23:45:42.078 -0500>,<Administrator>,<TOPSPIN>,<go>,<TOPSPIN 2.1>,
      <created by zg
	started at 2012-02-24 23:34:11.484 -0500,
	POWCHK enabled, PULCHK disabled,
       configuration hash MD5:
       B0 76 FB 9C 50 81 44 7D 18 B3 26 32 4E 60 AD 96
       data hash MD5: 64K
       DF CD 1F 66 8E 01 E8 D5 69 D4 91 5D 7E C8 26 BD>)
(   2,<2012-02-24 23:45:45.500 -0500>,<Administrator>,<TOPSPIN>,<proc1d>,<TOPSPIN 2.1>,
      <Start of raw data processing
       efp LB = 0.3 FT_mod = 6 PKNL = 1 PHC0 = 0 PHC1 = 0 SI = 128K 
       data hash MD5: 128K
       FE B1 B1 D1 56 18 FF B0 F2 61 94 17 EE E7 03 88>)
(   3,<2012-02-24 23:45:46.781 -0500>,<Administrator>,<TOPSPIN>,<proc1d>,<TOPSPIN 2.1>,
      <pk PHC0 = 24.08752 PHC1 = 0 
       data hash MD5: 128K
       44 B6 43 F2 5F 4B DB 53 06 11 C8 77 30 2E B9 9C>)
(   4,<2012-02-24 23:45:47.250 -0500>,<Administrator>,<TOPSPIN>,<proc1d>,<TOPSPIN 2.1>,
      <abs ABSG = 1 
       data hash MD5: 128K
       DD 12 D7 F0 EC 3C 56 C8 62 9B 10 73 EF AA 6F 0D>)
(   5,<2012-02-24 23:45:47.328 -0500>,<Administrator>,<TOPSPIN>,<proc1d>,<TOPSPIN 2.1>,
      <abs ABSG = 2 
       data hash MD5: 128K
       6B CF DA CD B1 1F BE AE 41 2F 00 79 89 D4 0F 7B>)
(   6,<2012-02-24 23:45:47.391 -0500>,<Administrator>,<TOPSPIN>,<proc1d>,<TOPSPIN 2.1>,
      <abs ABSG = 3 
       data hash MD5: 128K
       FC 51 1A C2 E2 0E 5A 69 FA 6A 89 B2 85 0A 9E D6>)
(   7,<2012-02-24 23:45:47.469 -0500>,<Administrator>,<TOPSPIN>,<proc1d>,<TOPSPIN 2.1>,
      <abs ABSG = 4 
       data hash MD5: 128K
       9C 0E 10 90 B3 E3 53 02 76 23 4D 34 C5 ED E7 85>)
(   8,<2012-02-24 23:45:47.516 -0500>,<Administrator>,<TOPSPIN>,<proc1d>,<TOPSPIN 2.1>,
      <abs ABSG = 5 
       data hash MD5: 128K
       DA 07 F5 23 91 D5 0A 39 35 9A D9 34 D2 9A C1 22>)
(   9,<2012-02-24 23:45:47.625 -0500>,<Administrator>,<TOPSPIN>,<audit>,<TOPSPIN 2.1>,
      <user comment:
       ICON-NMR User ID: Administrator
$$ [...]
150 150 150 150 150 150 150 150
##$TP07= 0
##$TPNAME0= <>
##$TPNAME1= <>
##$TPNAME2= <>
##$TPNAME3= <>
##$TPNAME4= <>
##$TPNAME5= <>
##$TPNAME6= <>
##$TPNAME7= <>
##$TPOAL= (0..7)
0.5 0.5 0.5 0.5 0.5 0.5 0.5 0.5
##$TPOFFS= (0..7)
0 0 0 0 0 0 0 0
##$TUNHIN= 0
##$TUNHOUT= 0
##$TUNXOUT= 0
##$USERA1= <user>
##$USERA2= <user>
##$USERA3= <user>
##$USERA4= <user>
##$USERA5= <user>
##$V9= 5
##$VALIST= <valist>
##$VCLIST= <CCCCCCCCCCCCCCC>
##$VD= 0
##$VDLIST= <DDDDDDDDDDDDDDD>
##$VPLIST= <PPPPPPPPPPPPPPP>
##$VTLIST= <TTTTTTTTTTTTTTT>
##$WBST= 1024
##$WBSW= 4
##$XGAIN= (0..3)
0 0 0 0
##$XL= 0
##$YL= 0
##$YMAX_a= 14332529
##$YMIN_a= -6662606
##$ZGOPTNS= <>
##$ZL1= 120
##$ZL2= 120
##$ZL3= 120
##$ZL4= 120
##$ABSF1= 14.98061
##$ABSF2= -5.57192
##$ABSG= 5
##$ABSL= 3
##$ALPHA= 0
##$AQORDER= 0
##$ASSFAC= 0
##$ASSFACI= 0
##$ASSFACX= 0
##$ASSWID= 0
##$AUNMP= <proc_prof1d_extract>
##$AXLEFT= 0
##$AXNAME= <>
##$AXNUC= <1H>
##$AXRIGHT= 0
##$AXTYPE= 0
##$AXUNIT= <>
##$AZFE= 0.1
##$AZFW= 0.1
##$BCFW= 0
##$BC_mod= 0
##$BYTORDP= 0
##$COROFFS= 0
##$CY= 15
##$DATMOD= 1
##$DC= 0
##$DFILT= <>
##$DTYPP= 0
##$F1P= 0
##$F2P= 0
##$FCOR= 0.5
##$FTSIZE= 131072
##$FT_mod= 6
##$GAMMA= 0
##$GB= 0
##$INTBC= 1
##$INTSCL= 1
##$ISEN= 128
##$LB= 0.3
##$LEV0= 0
##$LPBIN= 0
##$MAXI= 10000
##$MC2= 0
##$MEAN= 0
##$ME_mod= 0
##$MI= 0
##$NCOEF= 0
##$NC_proc= -3
##$NLEV= 6
##$NOISF1= 0
##$NOISF2= 0
##$NSP= 0
##$NTH_PI= 0
##$NZP= 0
##$OFFSET= 14.98061
##$PC= 1
##$PHC0= 24.08752
##$PHC1= 0
##$PH_mod= 1
##$PKNL= yes
##$PPARMOD= 0
##$PPDIAG= 0
##$PPIPTYP= 0
##$PPMPNUM= 2147483647
##$PPRESOL= 1
##$PSCAL= 4
##$PSIGN= 0
##$PYNMP= <proc.py>
##$REVERSE= no
##$SF= 400.13
##$SI= 131072
##$SIGF1= 0
##$SIGF2= 0
##$SINO= 400
##$SIOLD= 131072
##$SPECTYP= <>
##$SREGLST= <1H.CDCl3>
##$SSB= 0
##$STSI= 131072
##$STSR= 0
##$SW_p= 8223.68421052632
##$SYMM= 0
##$S_DEV= 0
##$TDeff= 65536
##$TDoff= 0
##$TI= <>
##$TILT= no
##$TM1= 0
##$TM2= 0
##$TOPLEV= 0
##$USERP1= <user>
##$USERP2= <user>
##$USERP3= <user>
##$USERP4= <user>
##$USERP5= <user>
##$WDW= 1
##$XDIM= 131072
##$YMAX_p= 502041206
##$YMIN_p= -288586795
##$CURPLOT= <Network HP LaserJet P1505>
##$CURPRIN= <$Network HP LaserJet P1505>
##$DFORMAT= <normdp>
##$LAYOUT= <+/1D_H.xwp>
##$LFORMAT= <normlp>
##$PFORMAT= <normpl>
##$SURQMSG= 1
$$ End of Bruker specific parameters
$$ ---------------------------------
##NTUPLES= NMR SPECTRUM
##VAR_NAME=  FREQUENCY,     SPECTRUM/REAL,   SPECTRUM/IMAG
##SYMBOL=    X,             R,               I
##VAR_TYPE=  INDEPENDENT,   DEPENDENT,       DEPENDENT
##VAR_FORM=  AFFN,          ASDF,            ASDF
##VAR_DIM=   131072,        131072,          131072
##UNITS=     HZ,            ARBITRARY UNITS, ARBITRARY UNITS
##FACTOR=    0.0627417313425165, 1,          1
##FIRST=     8223.62146879498, -7078,        -104074
##LAST=      0,             -1573,           -106888
##MIN=       0,             -288586795,      0
##MAX=       8223.62146879498, 502041206,    0
$$ Real data points
##PAGE= N=1
##DATA TABLE= (X++(R..R)), XYDATA
$$ [...]
60735A043762K859L199M527P337J0463J2023J1861J1762J2958J4638J5425J5259
60723A166073J5028J5167J5367J5241J4616J3473J1992J0490R125P864O803O158
60711A307397N870N456M421K729J072N75J690L312L698K572J373R53K87j508l215
60696A336682l078j481l15l01q06j760l607n451n505l809k437k482k717k021j205
60681A299707j367k173l075m689p406r827j0307r356q786q914q237n892l004j262
60667A215412j094j663k077k105j932j703j458j523k481m359o004n967m058j625
60653A177363k65p05k684n102o406n821m346l758m457n225n083m383l877l900
60639A121351m824p030r907j1951j2530j2518j2647j2525j1971j1914j2783j3271
$$ plain form
60735 1043762 1046621 1049820 1054347 1061684 1072147 1084170 1096031 1107793 1120751 1135389 1150814 1166073
60723 1166073 1181101 1196268 1211635 1226876 1241492 1254965 1266957 1277447 1286572 1294436 1301239 1307397
60711 1307397 1313267 1318723 1323144 1325873 1326945 1327520 1329210 1332522 1336220 1338792 1340165 1341118 1341405 1339897 1336682
60696 1336682 1333604 1332123 1331808 1331507 1330701 1328941 1325334 1319883 1314378 1310569 1308132 1305650 1302933 1300912 1299707
60681 1299707 1298340 1296167 1293092 1288403 1280997 1271170 1260863 1251507 1242721 1233807 1225570 1219678 1216674 1215412
60667 1215412 1214318 1212655 1210578 1208473 1206541 1204838 1203380 1201857 1199376 1195017 1189013 1183046 1178988 1177363
60653 1177363 1177098 1176393 1173709 1168607 1162201 1156380 1152034 1148276 1143819 1138594 1133511 1129128 1125251 1121351
60639 1121351 1116527 1109497 1099590 1087639 1075109 1062591 1049944 1037419 1025448 1013534 1000751 987480
60627I87480j2097j0191r493j0206j0770j0190q871p426o116n516o178p325p211
60614H75890n342l223k307k051r06J417L685M933N537O221O739O325N262N043
60600I07223O530Q736J0198J1005J2259J3852J4345J3344J2421J2861J3867J4097
60588A050738J3802J3980J4363J3979J3193J3269J3938J3350J0964Q835R143J1627
60576A201181J4419J6369J7436J7473J6095J3806J2028J1643J2045J1960J0769
60565A355224Q755O473M294K297K42k315n447q415j0172j0502j0297j0474j0985
60552A308678j1187j0889j0437r932q961p163m618j578J574M049M955M327L498
60539A262316L880N587P500Q497Q276P140N489L612J668k53j982l062k889j329
$$ plain form
60627 987480 975383 965192 955699 945493 934723 924533 915662 908236 902120 896604 890426 883101 875890
60614 875890 870548 867325 865018 862967 862061 863478 867163 872096 877633 883854 890593 896918 902180 907223
60600 907223 913753 922489 932687 943692 955951 969803 984148 997492 1009913 1022774 1036641 1050738
60588 1050738 1064540 1078520 1092883 1106862 1120055 1133324 1147262 1160612 1171576 1180411 1189554 1201181
60576 1201181 1215600 1231969 1249405 1266878 1282973 1296779 1308807 1320450 1332495 1344455 1355224
60565 1355224 1363979 1370452 1374746 1377043 1377285 1374970 1369523 1361108 1350936 1340434 1330137 1319663 1308678
60552 1308678 1297491 1286602 1276165 1266233 1257272 1250109 1245491 1243913 1245487 1249536 1254491 1258818 1262316
60539 1262316 1266196 1271783 1279283 1287780 1296056 1303196 1308685 1312297 1313965 1313712 1311730 1308668 1305779 1304450
60525A304450P67K078K158K042L024N012O720P490P903Q320Q041O646N147M569
60511A374367M238K870Q81OP05J514J097n31k941n841q148q278o285m446m589
60496A344619n860o261n405m448l851k681p4L599P164R681J1011J1856J3209J5438
60482A387997J8152K1028K4345K8320L2443L6012L9116M2686M7636N4090O1368
60471A793193O8658P5876Q3459R0957R6336R7450R3808Q5935P3692N6815L7012
60460B653191J7614Q79j2801k2809k7552k6679k2159j5997q484J02P818J2762
60448B555885J5219J6435J6466J4938J2866J1838J2033J2842J4764J8817K4537
60437B726640L0484L6546M4034N3602O4750P7335R1856J08002J24341J39802J54406
$$ plain form
60525 1304450 1305217 1307295 1309453 1311495 1314519 1319531 1326251 1333741 1341644 1349964 1358005 1364651 1369798 1374367
60511 1374367 1378605 1381475 1382356 1382362 1383067 1384581 1385678 1385147 1382206 1376365 1368217 1359939 1353654 1349208 1344619
60496 1344619 1338759 1332498 1327093 1322645 1318794 1316113 1316039 1319638 1326802 1336483 1347494 1359350 1372559 1387997
60482 1387997 1406149 1427177 1451522 1479842 1512285 1548297 1587413 1630099 1677735 1731825 1793193
60471 1793193 1861851 1937727 2021186 2112143 2208479 2305929 2399737 2485672 2559364 2616179 2653191
60460 2653191 2670805 2671684 2658883 2636074 2608522 2581843 2559684 2543687 2535203 2535305 2543123 2555885
60448 2555885 2571104 2587539 2604005 2618943 2631809 2643647 2655680 2668522 2683286 2702103 2726640
60437 2726640 2757124 2793670 2837704 2891306 2956056 3033391 3125247 3233249 3357590 3497392 3651798
60426C651798J68295J81111J92501K02434K11058K19164K28622K41509K58877
60417E555369K81070L08742L42480L81788M25479M72486N20701N64942N96968
60408I450025O07253N86531N27594M28522K94744J36812l3501k03936l60527m89754
60398A0943763n83551o41252o66778o65858o45680o13793n75201n31716m84947
60389E534987m38255l94693l54608l16859k81437k49574k22009j98301j77368
60380B901883j58028j39595j22524j07934r6162q6504p8497p2263o7336o2543
60370A910497n7677n3904n1723m9766m6592m2557l8919l6111l3827l1868k9921
60359A437632k7437k4644k2703k1940k1005j8856j6494j5286j4709j3313j1287
$$ plain form
60426 3651798 3820093 4001204 4193705 4396139 4607197 4826361 5054983 5296492 5555369
60417 5555369 5836439 6145181 6487661 6869449 7294928 7767414 8288115 8853057 9450025
60408 9450025 10057278 10643809 11171403 11599925 11894669 12031481 11997980 11794044 11433517 10943763
60398 10943763 10360212 9718960 9052182 8386324 7740644 7126851 6551650 6019934 5534987
60389 5534987 5096732 4702039 4347431 4030572 3749135 3499561 3277552 3079251 2901883
60380 2901883 2743855 2604260 2481736 2373802 2277640 2191136 2112639 2040376 1973040 1910497
60370 1910497 1852820 1798916 1747193 1697427 1650835 1608278 1569359 1533248 1499421 1467553 1437632
60359 1437632 1410195 1385551 1362848 1340908 1319903 1301047 1284553 1269267 1254558 1241245 1229958
60348A229958j0166j0246j0004q268n679l765l473m669o243o764n830m519l786
60335A146546k929q35J796L135L034L365N001O274N452L479K747L761M579L520
60321A188925J152p61j447j664k494m154n905o771o386n337m664m809n091m496
60307A136098k933j398p67q08o94j66K72K26N2M33J516K540K576J682J175K215
60291A142019M152N040M031K471K101L068M483O009P633Q490P625N832N140O033
60277A214127O752N999M987N684P911R503R071P546O846P706R085R512Q763Q089
60263A321581Q662J0071J0767R914Q277P039O228M617J170l589p736r688r808
60250A357505r840j0676j1339j0610q750o871n429m279l555l209k227J96K975
$$ plain form
60348 1229958 1219792 1209546 1199542 1191274 1185595 1181830 1178357 1173688 1167445 1160681 1154851 1150332 1146546
60335 1146546 1143617 1142782 1144578 1147713 1150747 1154112 1159113 1165387 1170839 1174318 1177065 1180826 1185405 1188925
60321 1188925 1190077 1189316 1187869 1186205 1183711 1179557 1173652 1166881 1160495 1155158 1150494 1145685 1140594 1136098
60307 1136098 1133165 1131767 1131000 1130192 1129498 1129332 1129604 1129830 1129882 1130315 1131831 1134371 1136947 1138629 1139804 1142019
60291 1142019 1146171 1151211 1155242 1157713 1159814 1162882 1167365 1173374 1181007 1189497 1197122 1202954 1208094 1214127
60277 1214127 1220879 1226878 1231865 1237549 1245460 1254963 1264034 1271580 1278426 1286132 1295217 1304729 1313492 1321581
60263 1321581 1330243 1340314 1351081 1360995 1369272 1376311 1382539 1387156 1388326 1384737 1377001 1367313 1357505
60250 1357505 1347665 1336989 1325650 1315040 1306290 1299419 1293990 1289711 1286156 1282947 1280720 1280916 1283891
60237A283891M046K966J199N1k40N63K739N255O126M717K335Q5k171m176m511
60222A302875k655j93J362K579M635P011Q345Q662R130R954J0185R563R218J0223
60208A390894J2294J4179J4944J4702J4285J4324J4831J5891J8111K1554K4697
60197A570706K5969K6231K8220L3100L9132M4203M8141N1808N5500N9339O3865
60186B046214O9130P4302P9192Q4859R1655R8115J03112J07824J13956J21104
60176B989463J27412J31914J34655J35392J33858J30697J26685J21570J15018
60167D146664J07708R9956R0132P6556O0385M4749L1204J8846O702m805j4699
60156D663398k2157k6358k7210k6161k4790k2596j7751j0090j618O192J4131K3854
$$ plain form
60237 1283891 1287937 1290903 1292102 1292153 1291913 1292476 1295215 1300470 1306596 1311313 1313648 1313733 1311562 1307386 1302875
60222 1302875 1300220 1300027 1301389 1303968 1308603 1315614 1323959 1332621 1341751 1351705 1361890 1371453 1380671 1390894
60208 1390894 1403188 1417367 1432311 1447013 1461298 1475622 1490453 1506344 1524455 1546009 1570706
60197 1570706 1596675 1622906 1651126 1684226 1723358 1767561 1815702 1867510 1923010 1982349 2046214
60186 2046214 2115344 2189646 2268838 2353697 2445352 2543467 2646579 2754403 2868359 2989463
60176 2989463 3116875 3248789 3383444 3518836 3652694 3783391 3910076 4031646 4146664
60167 4146664 4254372 4354328 4444460 4521016 4581401 4626150 4657354 4676200 4682902 4678097 4663398
60156 4663398 4641241 4614883 4587673 4561512 4536722 4514126 4496375 4486285 4484667 4490859 4504990 4528844
60144D528844L6008N0024O4611P8177Q9840J00237J10465J20212J27940J32663
60134E439021J34417J33145J28472J20555J09891R6394P9946O1671M3199K4909
60124F371620O368j1757k8117m2895n7331p0729q0244q4368q4532q2185p6476
60113E759354o6366n3326l9930k6731j2227M593K2978M1254N7774P1485Q2466
60102E841324R1609R9031J03312J02968R8029Q9541P8268O4868N0608L6707K3241
60091F679506R677l605j5171k3837k9421l2188l2132k8890k1925j0817M276K2343
60079F517816M2011O2290Q2975J04392J26825J50034J73408J96778K20795K46150
60069G923474K72654K99632L26763L53745L79344M01836M20296M34387M42834
$$ plain form
60144 4528844 4564852 4614876 4679487 4757664 4847504 4947741 5058206 5178418 5306358 5439021
60134 5439021 5573438 5706583 5835055 5955610 6065501 6161895 6241841 6303512 6346711 6371620
60124 6371620 6377988 6366231 6338114 6295219 6237888 6167159 6086915 6002547 5918015 5835830 5759354
60113 5759354 5692988 5639662 5599732 5573001 5560774 5565367 5588345 5629599 5687373 5758858 5841324
60102 5841324 5932933 6031964 6135276 6238244 6336273 6425814 6504082 6568950 6619558 6656265 6679506
60091 6679506 6689183 6685578 6670407 6646570 6617149 6584961 6552829 6523939 6502014 6491197 6495473 6517816
60079 6517816 6559827 6622117 6705092 6809484 6936309 7086343 7259751 7456529 7677324 7923474
60069 7923474 8196128 8495760 8822523 9176268 9555612 9957448 10377744 10812131 11254965
60060A1254965M43443M35094M18627L95181L64646L26598K81825K32112J78958
60051A4331449J23239O5592O486n3576j13212j69922k21462k67238l07525l41405
60041A3052426l66105l78838l79158l69395l52664l30566l03017k70313k34476
60032A0067894j97907j61303j23893q5552m7637j1843K0783M9605P4319R5207
60022I679673J12356J24358J28871J24869J13412R5975P3257M6104J6335j4204
60012A0501006m4587p4054j01240j25009j45366j62848j77507j89080j97459k02525
60002I081331k04123k02737j99448j94812j88605j80904j72337j62607j50143
59993G425615j34114j15706r6434p6356n5150l3818j3634N812K5786M5960O4431
$$ plain form
60060 11254965 11698408 12133502 12552129 12947310 13311956 13638554 13920379 14152491 14331449
60051 14331449 14454688 14520280 14526766 14473190 14359978 14190056 13968594 13701356 13393831 13052426
60041 13052426 12686321 12307483 11928325 11558930 11206266 10875700 10572683 10302370 10067894
60032 10067894 9869987 9708684 9584791 9499239 9451602 9439759 9460542 9510147 9584466 9679673
60022 9679673 9792029 9916387 10045258 10170127 10283539 10379514 10452771 10498875 10515210 10501006
60012 10501006 10456419 10382365 10281125 10156116 10010750 9847902 9670395 9481315 9283856 9081331
60002 9081331 8877208 8674471 8475023 8280211 8091606 7910702 7738365 7575758 7425615
59993 7425615 7291501 7175795 7079361 7003005 6947855 6914037 6900403 6906215 6932001 6977961 7042392
59982G042392Q0094R3495J05176J14446J20024J20955J16655J06996R2604P4507
59972H067344N3446L0096N703j8375m1705o4716q7486j09188j28471j43827j53946
59961G408875j58610j59051j56618j51322j42480j30422j16364j00806q3335o4205
59951F145662m4765k5792o521J3944L4884N4412P1419Q6643J01898J18352J35416
59940F685552J51389J65194J76976J86569J92180J91629J84434J71535J53367
59931H258825J29894J02615P4625M7798K1199o703l5329o2639q7413j09341j27407
59920H206124j39870j46162j47624j45804j40779j31659j18295j01889q4067o5658
59910F984317m6529k6468o006J3902L2834N1178O9213Q6308J01245J13084J21583
$$ plain form
59982 7042392 7122486 7215981 7321157 7435603 7555627 7676582 7793237 7900233 7992837 8067344
59972 8067344 8120790 8150886 8156589 8138214 8096509 8031793 7944307 7835119 7706648 7562821 7408875
59961 7408875 7250265 7091214 6934596 6783274 6640794 6510372 6394008 6293202 6209867 6145662
59951 6145662 6100897 6075105 6068584 6082528 6117412 6171824 6243243 6329886 6431784 6550136 6685552
59940 6685552 6836941 7002135 7179111 7365680 7557860 7749489 7933923 8105458 8258825
59931 8258825 8388719 8491334 8565959 8613757 8634956 8628253 8592924 8530285 8442872 8333531 8206124
59920 8206124 8066254 7920092 7772468 7626664 7485885 7354226 7235931 7134042 7049975 6984317
59910 6984317 6937788 6911320 6905314 6919216 6952050 7003228 7072441 7158749 7259994 7373078 7494661
59899G494661J27080J30242J31524J30577J26655J19949J11899J03593R4473Q3701
59889H654354P2365O2981N6750N2733N0185N0193N4095O1538P1636Q5204J04047
59878I376081J28104J55028J83016K12554K44702K78782L12704L44677L73653
59869A1609301L98778M19364M34710M42787M39437M20217L83353L30218K63327
59860A5141492J84957R7742N383q7720j76860k57005l23644l74605m10440m32518
59850A3366782m41329m37398m23079m02124l77194l48559l15477k78398k39353
59841A0103871k00408j62217j24345q6788n0543j6548J5446M6237P5579J01947
59831I702231J23871J40836J52610J58411J57129J47936J30193J03354O7484K3830
$$ plain form
59899 7494661 7621741 7751983 7883507 8014084 8140739 8260688 8372587 8476180 8570653 8654354
59889 8654354 8726719 8789700 8846450 8899183 8949368 8999561 9053656 9115194 9186830 9272034 9376081
59878 9376081 9504185 9659213 9842229 10054783 10299485 10578267 10890971 11235648 11609301
59869 11609301 12008079 12427443 12862153 13304940 13744377 14164594 14547947 14878165 15141492
59860 15141492 15326449 15424191 15429574 15341854 15164994 14907989 14584345 14209740 13799300 13366782
59850 13366782 12925453 12488055 12064976 11662852 11285658 10937099 10621622 10343224 10103871
59841 10103871 9903463 9741246 9616901 9530113 9479570 9463022 9478468 9524705 9600284 9702231
59831 9702231 9826102 9966938 10119548 10277959 10435088 10583024 10713217 10816571 10884055 10907885
59821A0907885k5490p8162j31748j83495k30641k70970l02951l25608l38805l43774
59811H676241l42912l38516l31354l20502l04892k85219k63926k43016k22409
59802F023495k01093j79476j59476j42181j26546j10944r5153q0243o7241n6598
59792D804544m8483m2822l9269l7548l7483l8263l8312l6594l3637l0537k7299
59781D394297k3144j8283j4325j2593j2910j4481j7420k2677l0533l9614m7584
59770D140733n2760n5055n5410n4558n2477m8946m4168l8579l2426k5871j9321
59759C661162j3168p071J7Q784J8605K7997L6089M3312N0288N6401O0267O1798
59747D004481O2872O5251O8610P1547P3854P6146P7410P4773O6617N4683M2192
$$ plain form
59821 10907885 10882395 10804233 10672485 10488990 10258349 9987379 9684428 9358820 9020015 8676241
59811 8676241 8333329 7994813 7663459 7342957 7038065 6752846 6488920 6245904 6023495
59802 6023495 5822402 5642926 5483450 5341269 5214723 5103779 5008626 4928383 4861142 4804544
59792 4804544 4756061 4713239 4673970 4636422 4598939 4560676 4522364 4485770 4452133 4421596 4394297
59781 4394297 4371153 4352870 4338545 4325952 4313042 4298561 4281141 4258464 4227931 4188317 4140733
59770 4140733 4087973 4032918 3977508 3922950 3870473 3821527 3777359 3738780 3706354 3680483 3661162
59759 3661162 3647994 3640923 3640940 3649724 3668329 3696326 3732415 3775727 3826015 3882416 3942683 4004481
59747 4004481 4067353 4132604 4201214 4272761 4346615 4422761 4500171 4574944 4641561 4696244 4738436
59736D738436L0926K1210J3723R633R099J1027J4524J9704K6895L5933M6422N8090
59724E035622P0694Q4308R9723J17830J38220J59114J79199J99082K20392K43891
59714F548075K68931K94530L20222L45705L69937L90429M02745M00533L77014
59705I718121L27719K52831J57696N1807n2832j44216k13804k59052k82657k89374
59695I266239k83625k69290k49663k26486j99871j70159j39275j09391q0978n3235
59685G484266k5899O54K6609N2509P7854J01372J22886J43748J65160J87348K10679
59674H547186K36163K64126K93343L22403L51262L80930M12230M45459M80629
59665A1733731N17539N55979N95975O37300O78750P18700P56444P91849Q23546
$$ plain form
59736 4738436 4769362 4790572 4804295 4813928 4823027 4834054 4848578 4868282 4895177 4931110 4977532 5035622
59724 5035622 5106316 5190624 5290347 5408177 5546397 5705511 5884710 6083792 6304184 6548075
59714 6548075 6817006 7111536 7431758 7777463 8147400 8537829 8940574 9341107 9718121
59705 9718121 10045840 10298671 10456367 10508174 10455342 10311126 10097322 9838270 9555613 9266239
59695 9266239 8982614 8713324 8463661 8237175 8037304 7867145 7727870 7618479 7537501 7484266
59685 7484266 7458367 7459021 7485630 7538139 7615993 7717365 7840251 7983999 8149159 8336507 8547186
59674 8547186 8783349 9047475 9340818 9663221 10014483 10395413 10807643 11253102 11733731
59665 11733731 12251270 12807249 13403224 14040524 14719274 15437974 16194418 16986267 17809813
59656A7809813Q48559Q64098Q68727Q61659Q42638Q13477P78535P42615P09063
59647B5139184O80279O58725O46188O42703O46811O56004O66389O73200O72611
59638C1082094O62109O38743N98856N40933M67386L82160K88108J88449Q9356
59629C4938194j575p9151j41211j86183k12373k19610k09444j83302j41967q7160
59619C3476218k2071N0198J27918K10327K96926L87042M79064N70178O57707P40088
59609C6973595Q15189Q78134R22357R42327R33335Q88996Q01833O67750M88934
59600D4312450K72292K7304k33408m93605p36265r47773j119636j247610j330825
59591C8502924j371637j375206j348469j298972j233903j159651j082488j009657
$$ plain form
59656 17809813 18658372 19522470 20391197 21252856 22095494 22908971 23687506 24430121 25139184
59647 25139184 25819463 26478188 27124376 27767079 28413890 29069894 29736283 30409483 31082094
59638 31082094 31744203 32382946 32981802 33522735 33990121 34372281 34660389 34848838 34938194
59629 34938194 34936619 34857468 34716257 34530074 34317701 34098091 33888647 33705345 33563378 33476218
59619 33476218 33454147 33504345 33632263 33842590 34139516 34526558 35005622 35575800 36233507 36973595
59609 36973595 37788784 38666918 39589275 40531602 41464937 42353933 43155766 43823516 44312450
59600 44312450 44584742 44612046 44378638 43885033 43148768 42200995 41081359 39833749 38502924
59591 38502924 37131287 35756081 34407612 33108640 31874737 30715086 29632598 28622941
59583B8622941r49424r09645q95553r07356r38744r78268j013965j037519j044600
59574A9947867j033097j003356r59596r08329q54227p98505p41491o84819o30157
59565A2334290n77570n26736m78774m35471l97119l62279l29464k98272k69178
59556H659427k42836k19433j98350j78845j61295j47004j36258j27454j18977
59547G128975j11479j07203j07152j09759j12587j14777j17394j21537j26490
59538F100597j30020j30535j28447j25234j21601j17148j11427j04501r6627q8170
59528D946887p9748p1625o2993n2785m1354l0482k1485j4065p182k95O579J3225
59516D584677J9267K4413K8960L3534L8076M1726M3932M5191M6521M8671N1870
$$ plain form
59583 28622941 27673517 26763872 25868319 24960963 24022219 23043951 22029986 20992467 19947867
59574 19947867 18914770 17911414 16951818 16043489 15189262 14390757 13649266 12964447 12334290
59565 12334290 11756720 11229984 10751210 10315739 9918620 9556341 9226877 8928605 8659427
59556 8659427 8416591 8197158 7998808 7819963 7658668 7511664 7375406 7247952 7128975
59547 7128975 7017496 6910293 6803141 6693382 6580795 6466018 6348624 6227087 6100597
59538 6100597 5970577 5840042 5711595 5586361 5464760 5347612 5236185 5131684 5035057 4946887
59528 4946887 4867139 4795514 4732521 4679736 4638382 4607900 4586415 4572350 4565168 4564873 4571452 4584677
59516 4584677 4603944 4628357 4657317 4690851 4728927 4770653 4814585 4859776 4906297 4954968 5006838
59505E006838N5807N9907O4178O9671P7428Q7101R7411J07770J18553J29974J41780
59494F016418J54101J67470J81994J97492K14254K32410K50690K67384K82607
59485G964820K97837L12968L25732L34648L40441L43536L42183L34704L22002
59476A0918871L06156K87843K66941K44451K21401J96495J67225J33656R9423
59467A2842462O8584M2741K1416L960r485j7958k0114j5195l829J2446L2453N5703
59455A3013184Q1633J08915J35326J57702J72418J76623J69076J49400J17115
59446A4281392P2238J6597m6436j13619j82569k50906l15521l72954m20107m54618
59436A2213497m75392m83073m79669m67318m47569m21733l91487l58823l25529
$$ plain form
59505 5006838 5062645 5122552 5186730 5256401 5333829 5420930 5518341 5626111 5744664 5874638 6016418
59494 6016418 6170519 6337989 6519983 6717475 6931729 7164139 7414829 7682213 7964820
59485 7964820 8262657 8575625 8901357 9236005 9576446 9919982 10262165 10596869 10918871
59476 10918871 11225027 11512870 11779811 12024262 12245663 12442158 12609383 12743039 12842462
59467 12842462 12911046 12953787 12975203 12979163 12969678 12951720 12931606 12916411 12912582 12925028 12957481 13013184
59455 13013184 13094817 13203732 13339058 13496760 13669178 13845801 14014877 14164277 14281392
59446 14281392 14353630 14370227 14323791 14210172 14027603 13776697 13461176 13088222 12668115 12213497
59436 12213497 11738105 11255032 10775363 10308045 9860476 9438743 9047256 8688433 8362904
59427H362904k92682k60526k28962j98313j69425j42781j17664r2658o7072m1625
59417F751196j7597M590K5799M7133O8568Q9045J08011J26416J45604J65572J84963
59406G699300K02501K17641K29948K38867K44247K45983K42635K31404K10238
59397I762764J79377J40434R4709M3310j1654o7058j20025j68817k12551k50453
59387I390036k81425l04410l19342l27463l30170l27796l20248l08622k94873
59378F575687k79830k62943k44408k26020k09189j93392j77626j62085j47274
59369D672920j32724j18079j04358r2409q1034o8613n6130m6260l9467l3089k4882
59358C875875j5676p607j276M262R758J5193K0395K5463L0832L7240M4685N0950
$$ plain form
59427 8362904 8070222 7809696 7580734 7382421 7212996 7070215 6952551 6859893 6792821 6751196
59417 6751196 6733599 6738189 6763988 6811121 6879689 6968734 7076745 7203161 7348765 7514337 7699300
59406 7699300 7901801 8119442 8349390 8588257 8832504 9078487 9321122 9552526 9762764
59397 9762764 9942141 10082575 10177284 10220594 10208940 10141882 10021857 9853040 9640489 9390036
59387 9390036 9108611 8804201 8484859 8157396 7827226 7499430 7179182 6870560 6575687
59378 6575687 6295857 6032914 5788506 5562486 5353297 5159905 4982279 4820194 4672920
59369 4672920 4540196 4422117 4317759 4225350 4144316 4075703 4019573 3973313 3933846 3900757 3875875
59358 3875875 3860199 3852592 3851316 3855578 3865336 3880529 3900924 3926387 3957219 3994459 4039144 4090094
59346D090094N2337M7204L8416L1264K9118L1840L7780M5910N5908O7545Q0615
59335D608031R4381J06512J13638J14528J12472J13216J20226J32625J47820J64860
59325E828309J84523K07043K31110K55198K79159L04254L31882L62368L94844
59316H378690M28373M63046M99507N37417N75134O11201O45049O75468O99232
59307A3513117P12471P13067P00792O75901O39238N93586N43165M91120M38598
59298A9021055L86569L37296K92899K53085K15090J75835J33925Q9666M3363o189
59288B0942594o0949j21138j84346k47629l09260l67491m19088m61464m95549
59279A8275680n24132n47457n63066n70152n71227n68387n60461n45524n24198
$$ plain form
59346 4090094 4142431 4189635 4228051 4259315 4288433 4320273 4358053 4403963 4459871 4527416 4608031
59335 4608031 4702412 4808924 4922562 5037090 5149562 5262778 5383004 5515629 5663449 5828309
59325 5828309 6012832 6219875 6450985 6706183 6985342 7289596 7621478 7983846 8378690
59316 8378690 8807063 9270109 9769616 10307033 10882167 11493368 12138417 12813885 13513117
59307 13513117 14225588 14938655 15639447 16315348 16954586 17548172 18091337 18582457 19021055
59298 19021055 19407624 19744920 20037819 20290904 20505994 20681829 20815754 20905420 20948783 20942594
59288 20942594 20881645 20760507 20576161 20328532 20019272 19651781 19232693 18771229 18275680
59279 18275680 17751548 17204091 16641025 16070873 15499646 14931259 14370798 13825274 13301076
59270A3301076m98741m70417m39607m07377l74986l42593l09959k77738k46850
59261I932808k17235j88524j61308j36711j15261r7073q2256p0268n9888n0888
59251H753396m4735m2485m3132m5151m8463n3456n9363o5268p1606p8726q5076
59240H115935q8837r0632r2394r4040r3586r0245q5187p9152p1506o1965n1303
59229G217088l9900k7321j3738o9J3776K9122M6291O3670P9782R4986J10311J25760
59217G699758J40657J54753J68154J80672J91939K01622K09120K13587K14554
59208I374816K12020K05593J94229J77098J54194J26034R3541N8430K2838j2154
59198A0606639m7220q3492j20634j56351j87605k12402k30707k43718k52155k55586
$$ plain form
59270 13301076 12802335 12331918 11892311 11484934 11109948 10767355 10457396 10179658 9932808
59261 9932808 9715573 9527049 9365741 9229030 9113769 9016696 8934440 8864172 8804284 8753396
59251 8753396 8708661 8666176 8623044 8577893 8529430 8475974 8416611 8351343 8279737 8201011 8115935
59240 8115935 8027098 7936466 7844072 7750032 7656446 7566201 7481014 7401862 7330356 7268391 7217088
59229 7217088 7177188 7149867 7136129 7136060 7149836 7178958 7225249 7288919 7368701 7463687 7573998 7699758
59217 7699758 7840415 7995168 8163322 8343994 8535933 8737555 8946675 9160262 9374816
59208 9374816 9586836 9792429 9986658 10163756 10317950 10443984 10537525 10595955 10618793 10606639
59198 10606639 10559419 10475927 10355293 10198942 10011337 9798935 9568228 9324510 9072355 8816769
59188H816769k53656k47411k38662k28259k15786k00928j84438j67608j51294
59179F928727j35526j19808j03604q6715o9217n1117l2421j3377N883K5856M7047
59168F395728O8900R0477J12348J36459J63489J91684K19152K46126K73966L03041
59158H201370L32610L61709L88778M11318M27072M34690M32399M17325L87548
59149A1794819L43642K86952K17899J37855N1066l7583j25659k11567k90909l57513
59139A1809002m08040m43132m64159m71541m66500m51883m30541m04550l76059
59130G892597l46833l16835k85540k54717k27487k04347j82799j61490j41893
59121E770656j24838j08267r0380p2754n8217m6941l6657k5809j4778m678L708
$$ plain form
59188 8816769 8563113 8315702 8077040 7848781 7632995 7432067 7247629 7080021 6928727
59179 6928727 6793201 6673393 6569789 6483074 6413857 6362740 6330319 6316942 6322825 6348681 6395728
59168 6395728 6464628 6555105 6667453 6803912 6967401 7159085 7378237 7624363 7898329 8201370
59158 8201370 8533980 8895689 9284467 9695785 10122857 10557547 10989946 11407271 11794819
59149 11794819 12138461 12425413 12643312 12781167 12832233 12794650 12668991 12457424 12166515 11809002
59139 11809002 11400962 10957830 10493671 10022130 9555630 9103747 8673206 8268656 7892597
59130 7892597 7545764 7228929 6943389 6688672 6461185 6256838 6074039 5912549 5770656
59121 5770656 5645818 5537551 5447171 5374417 5316200 5269259 5232602 5206793 5192015 5187337 5191045
59110E191045J0181J5433K0826K7264L4601M2237M9629N6110O1268O5644O9947
59099E644185P3487P4707P3336P0543O6879O1756N5190M8114M0386L0537J8208
59088F257328N102p359j9339l0687l9818m5927n0385n4294n6367n5051n1374m7712
59076E804117m4697m1098l5892k8926k0319j0695j372P085J5792K5841L6565M6882
59064E753283N7350O9255Q2294R4916J06554J17970J29616J41021J51750J61832
59054F865841J71432J80899J90637K00107K07639K12408K15812K19510K22673
59045H686958K22750K18686K11785K03441J93499J81244J66638J50133J31767
59036A0366901J10803Q5836N5411J9158k1884o6440j13992j63809k13490k59548
$$ plain form
59110 5191045 5201226 5216659 5237485 5264749 5299350 5341587 5391216 5447326 5508594 5574238 5644185
59099 5644185 5717672 5792379 5865715 5936258 6003137 6064893 6120083 6168197 6208583 6239120 6257328
59088 6257328 6262430 6255071 6235732 6205045 6165227 6119300 6068915 6014621 5958254 5903203 5851829 5804117
59076 5804117 5759420 5718322 5682430 5653504 5633185 5622490 5621118 5628203 5643995 5669836 5706401 5753283
59064 5753283 5810633 5879888 5962182 6057098 6163652 6281622 6411238 6552259 6704009 6865841
59054 6865841 7037273 7218172 7408809 7608916 7816555 8028963 8244775 8464285 8686958
59045 8686958 8909708 9128394 9340179 9543620 9737119 9918363 10085001 10235134 10366901
59036 10366901 10477704 10563540 10618951 10638109 10616225 10549785 10435793 10271984 10058494 9798946
59026I798946k99381l31838l56201l71710l78419l77594l70944l59903l45634
59017F607322l29172l11276k92475k73283k54201k35554k17543k00345j84170
59008D309303j69296j56035j44204j32910j21599j11193j03094r6851r0109q1516
58998C102496p2515o5326o0149n5504n0577m5881m1908l8364l4838l1422k8415
58987B577597k5977k4028k2272k0431j8689j7419j6257j4011j0038n209j043J842
58975B404065M025O464R721J3560J6874J8318J7291J4200R933N657K791K045K416
58962B527360K204J168N14O73N58n44j862k590l003l383l311k932l324m515m730
58947B502283l052j246j215j978j237J097L027L404K454j60n208j1698j6986j9844
$$ plain form
59026 9798946 9499565 9167727 8811526 8439816 8061397 7683803 7312859 6952956 6607322
59017 6607322 6278150 5966874 5674399 5401116 5146915 4911361 4693818 4493473 4309303
59008 4309303 4140007 3983972 3839768 3706858 3585259 3474066 3370972 3274121 3184012 3102496
58998 3102496 3029981 2964655 2904506 2849002 2798425 2752544 2710636 2672272 2637434 2606012 2577597
58987 2577597 2551620 2527592 2505320 2484889 2466200 2448781 2432524 2418513 2408475 2403266 2402223 2404065
58975 2404065 2408090 2414554 2424275 2437835 2454709 2473027 2490318 2504518 2514451 2520108 2522899 2524944 2527360
58962 2527360 2529564 2530732 2531246 2531919 2532477 2531933 2530071 2527481 2524478 2521095 2517784 2514852 2511528 2507013 2502283
58947 2502283 2499231 2497985 2496770 2494792 2493555 2494652 2497679 2501083 2503537 2503377 2498169 2486471 2469485 2449641
58933B449641k1586k3503k4800k4129k1849j9451j7438j4921j1228p031l621j448
58921B258636L16K727N805Q621J0633J2403J4769J7825K1135K4530K8152L1868
58909B437420L5158L7598L9266M0771M2761M5150M6961M7347M6494M4979M2766
58898B906671L9955L8071L8960M2229M5362M6871M7854M9964N3393N7628O2496
58887C429454O7425P1154P3425P5781P9482Q3852Q7812R1818R6802J02394J07847
58876D367246J13829J21698J31567J42415J53508J64450J74709J84506J95520
58867E749448K09145K24630K40315K56092K73119K91757L11564L32960L57173
58858H246203L84458M13718M43999M75249N07669N41344N76412O12609O48761
$$ plain form
58933 2449641 2428055 2404552 2379752 2355623 2333774 2314323 2296885 2281964 2270736 2263705 2260084 2258636
58921 2258636 2258952 2261679 2267484 2276105 2286738 2299141 2313910 2331735 2352870 2377400 2405552 2437420
58909 2437420 2472578 2510176 2549442 2590213 2632974 2678124 2725085 2772432 2818926 2863905 2906671
58898 2906671 2946626 2984697 3023657 3065886 3111248 3158119 3205973 3255937 3309330 3366958 3429454
58887 3429454 3496879 3568033 3641458 3717239 3796721 3880573 3968385 4060203 4157005 4259399 4367246
58876 4367246 4481075 4602773 4734340 4876755 5030263 5194713 5369422 5553928 5749448
58867 5749448 5958593 6183223 6423538 6679630 6952749 7244506 7556070 7889030 8246203
58858 8246203 8630661 9044379 9488378 9963627 10471296 11012640 11589052 12201661 12850422
58849A2850422O83446P15857P45367P70727P90353Q02608Q05033P94014P66318
58840A9724145P20259O54766N68522M61527L36745J99095N3639r4197k37911l71307
58830B2015283m90089n91099o71326p29482p67559p88774p94701p86197p66271
58821A5629785p39579p09079o75101o37705n98347n59241n22415m89028m58443
58812A0240847m28622l98828l71007l46938l25391l04196k83798k65921k49678
58803G266468k32391k14115j97966j85451j74622j63594j53124j44308j36102
58794E664795j26603j15184j02437q9504p8122o9466o2262n3783m3313l2686k2820
58783D868615j2242k26J1118J9766K6905L5028M4410N3744O3179P4198Q6737R8717
$$ plain form
58849 12850422 13533868 14249725 14995092 15765819 16556172 17358780 18163813 18957827 19724145
58840 19724145 20444404 21099170 21667692 22129219 22465964 22665059 22718698 22624501 22386590 22015283
58830 22015283 21525194 20934095 20262769 19533287 18765728 17976954 17182253 16396056 15629785
58821 15629785 14890206 14181127 13506026 12868321 12269974 11710733 11188318 10699290 10240847
58812 10240847 9812225 9413397 9042390 8695452 8370061 8065865 7782067 7516146 7266468
58803 7266468 7034077 6819962 6621996 6436545 6261923 6098329 5945205 5800897 5664795
58794 5664795 5538192 5423008 5320571 5231067 5152945 5083479 5021217 4967434 4924121 4891435 4868615
58783 4868615 4856373 4856147 4867265 4887031 4913936 4948964 4993374 5047118 5110297 5184495 5271232 5369949
58771E369949J08866J18395J29259J41977J55818J70237J85111K00125K14976
58762F794713K30353K47734K67621K88702L09678L31312L55306L81581M08449
58753I615449M35619M64828M96746N29576N62195N96314O33261O70310P02953
58744A4707251P29528P50742P65357P69443P59759P34973O93421O32454N50844
58735B1093772M49773L31075J96940N2113r5721k38918l72083m91247n92928o74960
58725A9657816p36956p79393q03439q11724q07567p93144p69750p39713p05998
58716A2710132o69861o31059n90814n52278n17257m84648m53149m23525l96991
58707G990550l72957l49784l26680l03859k81848k61402k43160k26745k11058
$$ plain form
58771 5369949 5478815 5597210 5726469 5868446 6024264 6194501 6379612 6579737 6794713
58762 6794713 7025066 7272800 7540421 7829123 8138801 8470113 8825419 9207000 9615449
58753 9615449 10051068 10515896 11012642 11542218 12104413 12700727 13333988 14004298 14707251
58744 14707251 15436779 16187521 16952878 17722321 18482080 19217053 19910474 20542928 21093772
58735 21093772 21543545 21874620 22071560 22123673 22027952 21789034 21416951 20925704 20332776 19657816
58725 19657816 18920860 18141467 17338028 16526304 15718737 14925593 14155843 13416130 12710132
58716 12710132 12040271 11409212 10818398 10266120 9748863 9264215 8811066 8387541 7990550
58707 7990550 7617593 7267809 6941129 6637270 6355422 6094020 5850860 5624115 5413057
58698E413057j95737j81350j68072j55343j42884j30802j18728j06301r4340q3881
58688D035619p4264o4102n4013m6034m0156l3913k5926j7550j0324m150J025L915
58676C670127L439k17o913j6963k9355m1414n1265n8950o4547o7264o7321o6601
58664C202756o6347o6102o5784o6569o8557o9808o9241o8494o9258p0577p0501
58653B451518o8871o6856o5016o3269o1552n9231n5160m9506m4342m1333m0087
58642A836295l9408l8687l7246l4223l0192k7227k6330k6370k6315k6410k6306
58631A497581k4428k0590j7042j5405j4658j3524j2531j1989j0420p053l754k157
58619A344030q19K384O760J0100J1961J3325J4299J4497J4548J5125J5566J5333
$$ plain form
58698 5413057 5217320 5035970 4867898 4712555 4569671 4438869 4320141 4213840 4119500 4035619
58688 4035619 3961355 3897253 3843240 3797206 3757050 3723137 3697211 3679661 3669337 3665187 3666212 3670127
58676 3670127 3673566 3673349 3666436 3649473 3620118 3578704 3527439 3468489 3403942 3336678 3269357 3202756
58664 3202756 3136409 3070307 3004523 2937954 2869397 2799589 2730348 2661854 2592596 2522019 2451518
58653 2451518 2382647 2315791 2250775 2187506 2125954 2066723 2011563 1962057 1917715 1876382 1836295
58642 1836295 1796887 1758200 1720954 1686731 1656539 1629312 1602982 1576612 1550297 1523887 1497581
58631 1497581 1473153 1452563 1435521 1420116 1405458 1391934 1379403 1367414 1356994 1349941 1346187 1344030
58619 1344030 1343211 1345595 1352355 1362455 1374416 1387741 1402040 1416537 1431085 1446210 1461776 1477109
58607A477109J5492J6734J7401J5739J2770J0528Q680N382P01l386n867p421q776
58594A555086j0189j1988j3910j4650j3664j2503j2623j2978j1735r227p048n114
58582A419457j910K943Q360J3563J8309K1967K4088K5442K7000K8766L0877L4549
58570A653411M0090M5408M8633N0942N4575N9267O3308O7004P2166P8801Q5225
58559B318830R1337R8967J08936J20115J31598J43517J55555J66751J77155J87745
58549C700506J98489K08226K16578K24157K30459K33133K29868K19838K02974
58540E664228J78815J46623J06336N9614J0202l7597q1277j20149j52945j77408
58530E596442j93188k02909k08659k09364k03746j93954j83506j72887j59957
$$ plain form
58607 1477109 1492601 1509335 1526736 1542475 1555245 1565773 1574453 1579835 1580536 1577150 1571283 1563862 1555086
58594 1555086 1544897 1532909 1518999 1504349 1490685 1478182 1465559 1452581 1440846 1431619 1424571 1419457
58582 1419457 1417547 1420490 1428850 1442413 1460722 1482689 1506777 1532219 1559219 1587985 1618862 1653411
58570 1653411 1693501 1738909 1787542 1838484 1893059 1952326 2015634 2082638 2154804 2233605 2318830
58559 2318830 2410167 2509134 2618070 2738185 2869783 3013300 3168855 3335606 3512761 3700506
58549 3700506 3898995 4107221 4323799 4547956 4778415 5011548 5241416 5461254 5664228
58540 5664228 5843043 5989666 6096002 6155616 6165818 6128221 6046944 5926795 5773850 5596442
58530 5596442 5403254 5200345 4991686 4782322 4578576 4384622 4201116 4028229 3868272
58521C868272j44116j27384j11707r7399q4103p1428n8924m6970l7067k9876k3943
58510C035355j7848j2243p933l606K290Q845J4412J9503K5151K9690L0266K6446
58498C150328J9281P866r458l0926n2043p0281q5849r8044j04622j05370j02870
58487B518012r8942r3312q6423q0366p5816p0941o4718n8874n5101n2440m9012
58476A732067m4669m0571l7288l4602l2302l0330k8556k6788k4613k1666j8592
58465A392090j6961j7220j7766j7294j6730j7226j7682j6500j4511j3548j3233
58454A213419j1949j0083r178q461n592q63K679L544L468M363O287Q745J1394
58441A207773J3126J3034J2641J4680J9272K3685K6226K7915L0039L2505L5149
$$ plain form
58521 3868272 3724156 3596772 3485065 3387666 3303563 3232135 3173211 3126241 3089174 3059298 3035355
58510 3035355 3017507 3005264 2997331 2993725 2996015 3004860 3019272 3038775 3063926 3093616 3123882 3150328
58498 3150328 3169609 3177475 3168017 3137091 3085048 3014767 2928918 2830874 2726252 2620882 2518012
58487 2518012 2419070 2325758 2239335 2158969 2083153 2012212 1947494 1888620 1833519 1781079 1732067
58476 1732067 1687398 1646827 1609539 1574937 1542635 1512305 1483749 1456961 1432348 1410682 1392090
58465 1392090 1375129 1357909 1340143 1322849 1306119 1288893 1271211 1254711 1240200 1226652 1213419
58454 1213419 1201470 1191387 1182209 1173748 1168156 1167293 1169972 1173516 1176984 1181347 1187634 1196379 1207773
58441 1207773 1220899 1233933 1246574 1261254 1280526 1304211 1330437 1358352 1388391 1420896 1456045
58430A456045L8316M1617M4036M5525M6506M5873M1780L4453K6000J7599R095
58419A846845J006n909j2846k1766l1898m0290m5899n0108n3132n3310n0508m6989
58407A435196m4076m0835l6862l3431l1038k8548k5689k3737k2786k0993j7462
58396A109739j3568j0610q485p092o625n966l539k39J220M30r8J147L063M755
58382A064132O816Q945R544Q712Q694J0333J2071J3353J5746J9454K1894K1495
58370A221189J9842J8316J5430R598K292l534o516p077o342n955p130r035r676
58357A231402q839q016p428n819l439k234k413j793N32K869M213N955R223J3025
58343A227238J6076J8027J8351J6476J3536J1350R521O328K309l55j717l451m563
$$ plain form
58430 1456045 1494361 1535978 1580014 1625539 1672045 1717918 1759698 1794151 1820151 1837750 1846845
58419 1846845 1847851 1841942 1829096 1807330 1775432 1735142 1689243 1639135 1586003 1532693 1482185 1435196
58407 1435196 1391120 1350285 1313423 1279992 1248954 1220406 1194717 1170980 1148194 1127201 1109739
58396 1109739 1096171 1085561 1077076 1069984 1063359 1057393 1053854 1053615 1054835 1055265 1055167 1056314 1059377 1064132
58382 1064132 1070948 1079893 1089437 1098149 1106843 1117176 1129247 1142600 1158346 1177800 1199694 1221189
58370 1221189 1241031 1259347 1274777 1284375 1286667 1283133 1276617 1269540 1263198 1257243 1250113 1241078 1231402
58357 1231402 1222563 1214547 1207119 1201300 1197861 1195627 1193214 1191421 1191953 1194822 1199035 1204990 1214213 1227238
58343 1227238 1243314 1261341 1279692 1296168 1309704 1321054 1330575 1336903 1339212 1338857 1337140 1333689 1329126
58330A329126k360J882L131l28m743p157q987j1538j2846j1461r249p910o412
58317A251148m084k467k024p63J698K717J319L74J698L030K469J958L573N940
58303A266586P160P949R364J0685J1734J3808J6414J6948J5640J6404K0486K3909
58291A437087K3932K3158K4006K4082K1036J7498J6653J6725J4479J0849Q579
58280A638084P190M670J800O71R03R26J087K491M664O891R610J2443J3528J2842
58266A717800J3115J5431J7407J7671J8351K0941K3652K5173K6979K9731L1588
58255A957839L2298L4260L7474L8436L6397L5267L6770L7514L5541L3577L2711
58244B348084K9500K3042J8225J7831J8210J7001J7865K2698K6601K6281K6225
$$ plain form
58330 1329126 1326766 1328648 1331779 1331451 1326708 1319551 1310564 1299026 1286180 1274719 1265470 1257560 1251148
58317 1251148 1247064 1244597 1242573 1241810 1243508 1246225 1247544 1247918 1249616 1252646 1255115 1257073 1260646 1266586
58303 1266586 1273746 1281695 1291059 1301744 1313478 1327286 1343700 1360648 1376288 1392692 1413178 1437087
58291 1437087 1461019 1484177 1508183 1532265 1553301 1570799 1587452 1604177 1618656 1629505 1638084
58280 1638084 1645274 1649944 1651744 1652415 1653318 1654244 1655331 1657822 1662486 1669377 1678987 1691430 1704958 1717800
58266 1717800 1730915 1746346 1763753 1781424 1799775 1820716 1844368 1869541 1896520 1926251 1957839
58255 1957839 1990137 2024397 2061871 2100307 2136704 2171971 2208741 2246255 2281796 2315373 2348084
58244 2348084 2377584 2400626 2418851 2436682 2454892 2471893 2489758 2512456 2539057 2565338 2591563
58233B591563L0390L5033L6346L7957M3592M9272N0512N0686N4311N8430N9018
58222C097110N9766O5775P4242Q0078Q5306R4011J03562J09851J15807J25472
58212D010980J34943J38791J40090J44181J47589J43517J33731J24563J15443
58203E233828J02110Q7355P7935P4158P2306P3709Q1705R3504J04698J17563J35445
58192F254316J54113J68626J83006K02528K22543K36453K48390K65793K85778
58183H221546L01820L17494L39630L64135L83094L99909M22421M47188M66588
58174A1663825M85643N15017N52660N89360O26908O73234P25023P73662Q23239
58165A7428571Q83916R52652J019442J086565J161772J239479J310398J382763
$$ plain form
58233 2591563 2621953 2656986 2693332 2731289 2774881 2824153 2874665 2925351 2979662 3038092 3097110
58222 3097110 3156876 3222651 3296893 3376971 3462277 3556288 3659850 3769701 3885508 4010980
58212 4010980 4145923 4284714 4424804 4568985 4716574 4860091 4993822 5118385 5233828
58203 5233828 5335938 5423293 5501228 5575386 5647692 5721401 5803106 5896610 6001308 6118871 6254316
58192 6254316 6408429 6577055 6760061 6962589 7185132 7421585 7669975 7935768 8221546
58183 8221546 8523366 8840860 9180490 9544625 9927719 10327628 10750049 11197237 11663825
58174 11663825 12149468 12664485 13217145 13806505 14433413 15106647 15831670 16605332 17428571
58165 17428571 18312487 19265139 20284581 21371146 22532918 23772397 25082795 26465558
58157B6465558J471289J572735J676697J791701J933457K095998K264131K446112
58149D1717678K662293K910579L178522L481403L850304M290278M790359N365360
58141G2246776O042358O815758P666224Q612672R685767J0857791J2064593J3296009
58133A47287948J4612452J6111434J7972281K0481951K3839545K7895574L2187007
58126C00388192L6128559L8818055L8598377L3420960K2413599P270818q283214
58119D68755346k0730184k8581885l2336652l3250091l2418754l0628355k8429763
58112B62379662k6115871k3769916k1435043j9185328j7055355j5026926j3114419
58105A26676804j1379704r849225q494220p302496o293526n450478m709966m035943
$$ plain form
58157 26465558 27936847 29509582 31186279 32977980 34911437 37007435 39271566 41717678
58149 41717678 44379971 47290550 50469072 53950475 57800779 62091057 66881416 72246776
58141 72246776 78289134 85104892 92771116 101383788 111069555 121927346 133991939 147287948
58133 147287948 161900400 178011834 195984115 216466066 240305611 268201185 300388192
58126 300388192 336516751 375334806 413933183 447354143 469767742 477038560 468755346
58119 468755346 448025162 419443277 387106625 353856534 321437780 290809425 262379662
58112 262379662 236263791 212493875 191058832 171873504 154818149 139791223 126676804
58105 126676804 115297100 105447875 96953655 89651159 83357633 77907155 73197189 69161246
58097F9161246l440889k922857k446448j998042j592494j208370p83750k98138
58089E4470258K05315O97511J191862J678334K127741K604768L244016L972687
58081G0192492M319345L688707J911883n29760k856455m520992n414631n701736
58073F1088853n591028n247968m798984m329309l875726l446114l046976k687284
58065B8065464k368236k084091j831479j610175j417116j247717j102778r86839
58057A5417033q98286q27234p65608p13575o72675o38200o03768n69154n37435
58048I191098n07241m74198m38178m02604l67704l31027k94439k64232k43428
58039E868047k29170k18241k09807k02153j92044j78709j64346j50084j35716
$$ plain form
58097 69161246 65720357 62797500 60351052 58353010 56760516 55552146 54768396 54470258
58089 54470258 54675573 55373084 56564946 58243280 60371021 62975789 66219805 70192492
58081 70192492 74511837 78200544 80112427 79582667 76726212 72205220 66790589 61088853
58073 61088853 55497825 50249857 45450873 41121564 37245838 33799724 30752748 28065464
58065 28065464 25697228 23613137 21781658 20171483 18754367 17506650 16403872 15417033
58057 15417033 14518747 13691513 12925905 12212330 11539655 10901455 10297687 9728533 9191098
58048 9191098 8683857 8209659 7771481 7368877 7001173 6670146 6375707 6111475 5868047
58039 5868047 5638877 5420636 5210829 5008676 4816632 4637923 4473577 4323493 4187777
58030D187777j23330j16337j14297j13377j12322j13255j16292j18403j18330
58021C141834j17689j16437j12307j05655r9971r6284r1899q5812q0507p7002
58011B158271p2908o7161o2113n9167n6530n3138n0623m9501m7422m3136l8583
58000A557989l5282l2171k8722k6610k6482k6363k4896k3136k1806j9975j7722
57989A274824j6836j7508j7517j5914j4305j3422j1867r457q350r361j0418j0016
57977A119853r104q319o677m205k701k565k009m87K90k55o71q93k749n796o618
57962A067094m067j370j060j483n27Q02J041J297K845M386M329L568L608L971
57948A084434L682L440M422O493R038J1765J3678J3411J1681J1061J2286J3193
$$ plain form
58030 4187777 4064447 3948110 3833813 3720436 3608114 3494859 3378567 3260164 3141834
58021 3141834 3024145 2907708 2795401 2689746 2589775 2493491 2401592 2315780 2235273 2158271
58011 2158271 2085363 2018202 1956089 1896922 1840392 1787254 1736631 1687130 1639708 1596572 1557989
58000 1557989 1522707 1490536 1461814 1435204 1408722 1382359 1357463 1334327 1312521 1292546 1274824
57989 1274824 1257988 1240480 1222963 1207049 1192744 1179322 1167455 1157998 1149648 1140287 1129869 1119853
57977 1119853 1110749 1102430 1095753 1091548 1088847 1086282 1084273 1083786 1084076 1083821 1083150 1082257 1079508 1073712 1067094
57962 1067094 1063027 1061657 1060597 1059114 1058587 1059389 1060430 1061727 1064572 1068958 1073287 1076855 1080463 1084434
57948 1084434 1088116 1091556 1095978 1102471 1111509 1123274 1136952 1150363 1162044 1173105 1185391 1198584
57936A198584J2296J0607Q793N512J27n813j1362j7710k5216l1528l4513l4712
57924A075065l3314l0203k5600k1225j8078j5135j1717q817o976n298l649l140
57912H91913l344k104N97J869M81j126j055p39j450j596J2J500J235P06J504K336
57896H90739J846J374J847R49l242q348j0945j1470j2343j3408j3031j1915j1901
57883H00152j2121j0077n778j638J054K652L146K568K661N107Q560J0085R104
57870H15475P478O155M177O98l948q846j2604j3745j2557j1561j2513j4193j4752
57857G29264j4511j4459j3899j2042j0214r769r350p101m294l546m504m463k573
57844F18539m09J201K866M473N148N242N864O589O082M660L810L522K687J858
$$ plain form
57936 1198584 1210880 1221487 1230280 1235792 1235919 1230106 1218744 1201034 1175818 1144290 1109777 1075065
57924 1075065 1041751 1011548 985948 964723 946645 931510 919793 910976 904000 898702 895053 891913
57912 891913 888569 886465 887062 888931 889412 888286 887231 886492 885042 883446 883458 884958 886193 886899 888403 890739
57896 890739 892585 893959 895806 896755 893513 885165 874220 862750 850407 836999 823968 812053 800152
57883 800152 788031 777954 772176 770538 771592 774244 777390 779958 782619 787726 796286 806371 815475
57870 815475 822953 829108 833285 833983 830035 821189 808585 794840 782283 770722 758209 744016 729264
57857 729264 714753 700294 686395 674353 664139 654370 645020 637919 633625 630079 625575 621112 618539
57844 618539 618130 619331 622197 626670 631818 637060 642924 649513 655595 660255 664065 667587 670274 672132
57830F72132K827N322O867O274M901L928K797R78o90j393j584k132l286m793o179
57815F85969o924p102p534q407q556p181n331m343l778k542r41J96J441L744O311
57800F35022P646P965Q452Q781P803O106N511O210O639N987M802L377J677N27
57786G16505O64R54k57k315l120k522k389l423m482n150o277p747q194p514p188
57771F57545p505o893m692k408j348j078j066j899l852n903p092p533p521p090
57757E91665o857p696r112r635r238r508j0865j1613j0554q748p612o962o025
57744D77240m937m103l245k155j279p85m5J194K176K450K691L534M626N630P085
57729D90077R374J1777J3426J4496J5550J6283J5767J3761J1132R026P829O838
$$ plain form
57830 672132 674959 680281 687148 693422 698323 702251 705048 706026 705336 703943 702359 700227 696941 692148 685969
57815 685969 679045 671943 664409 656002 647446 640265 634934 630591 626813 624271 623330 623526 624967 628711 635022
57800 635022 642668 650633 659085 667866 675669 681775 687286 693496 700135 706122 710924 714301 715978 716505
57786 716505 717169 718123 717866 715551 712431 709909 707520 704097 699615 694465 688188 680441 672247 664733 657545
57771 657545 650040 643147 638455 636047 634699 633621 632555 630656 626804 620901 613809 606276 598755 591665
57757 591665 584808 577112 568000 558365 549127 539619 528754 517141 506587 497839 490227 483265 477240
57744 477240 472303 468200 464955 462800 461521 460736 460691 461885 464061 466511 469202 472736 477362 482992 490077
57729 490077 499451 511228 524654 539150 554700 570983 586750 600511 611643 620669 628498 635336
57717F35336N095K642O69p1l83j520l497n350o577p311p527p224o988p408q184
57702E81702q719r045r296r033q159p505p299o180l461j015q07j648r80R95J952
57687E11502J738K686N200O382M327J243P26L585P612J0163J0050Q096O535O859
57673E86704P989P689N651L716L220L887N227P136R038J0273J1331J2883J3989
57660F88733J3540J2928J4399J7054J7812J6637J6968K0070K2676K1914J9263
57649H81994J7636J7525J8257K0175K3084K4938K4670K4416K6472K9987L3050
57638A142204L6042M0182M4462M7134M9006N2189N6286N8761N8822N8460N9641
57627A703189O2771O7860P5066Q3779R2856J02020J11938J22919J34782J47680
$$ plain form
57717 635336 640431 643073 643742 643671 643288 641768 638271 632921 626344 619033 611506 604282 597294 589886 581702
57702 581702 572983 563938 554642 545609 537450 529945 522646 516466 513005 511990 511183 509535 508555 509550 511502
57687 511502 513240 515926 521126 527508 531835 533078 533804 537389 545001 555164 565214 573310 579845 586704
57673 586704 594693 602382 608033 611749 614969 618856 624083 631219 640257 650530 661861 674744 688733
57660 688733 702273 715201 729600 746654 764466 781103 798071 818141 840817 862731 881994
57649 881994 899630 917155 935412 955587 978671 1003609 1028279 1052695 1079167 1109154 1142204
57638 1142204 1178246 1218428 1262890 1310024 1359030 1411219 1467505 1526266 1585088 1643548 1703189
57627 1703189 1765960 1833820 1908886 1992665 2085521 2187541 2299479 2422398 2557180 2704860
57617B704860J61800J76378J90218K03189K16111K29153K41005K49456K52278
57608D624448K48065K37100K21118K01314J76232J41562R2158K5793n2853j31834
57598E783103j97788k43718k70625k82302k81188k69716k52278k33245k14357
57589C537886j95768j78068j61607j45403j28725j12586r8093q4661p1667o0344
57579B300964n1931m5161l7763k9556k1920j5118q262j271N255J1588J8298K4690
57567B149813K9734L4087L9397M5982N3036O0558O9138P8258Q6745R4698J03179
57556B844625J12215J20886J29112J37522J45609J51614J54183J52508J45107
57547D093381J30264J07983Q0062M8201J3260k3549o0000r3536j21841j43283
$$ plain form
57617 2704860 2866660 3043038 3233256 3436445 3652556 3881709 4122714 4372170 4624448
57608 4624448 4872513 5109613 5330731 5532045 5708277 5849839 5941997 5967790 5914937 5783103
57598 5783103 5585315 5341597 5070972 4788670 4507482 4237766 3985488 3752243 3537886
57589 3537886 3342118 3164050 3002443 2857040 2728315 2615729 2517636 2432975 2361308 2300964
57579 2300964 2249033 2203872 2166109 2136553 2114633 2099515 2091253 2089982 2095237 2106825 2125123 2149813
57567 2149813 2179547 2213634 2253031 2299013 2352049 2412607 2481745 2560003 2646748 2741446 2844625
57556 2844625 2956840 3077726 3206838 3344360 3489969 3641583 3795766 3948274 4093381
57547 4093381 4223645 4331628 4411690 4459891 4473151 4449602 4389602 4296066 4174225 4030942
57537D030942j57841j67254j73102j75237j73059j67582j60785j53634j46083
57528B556365j38261j30177j21005j10464j00300r2615q7101q1557p4750o7217
57518A552918n9809n3163m8099m4841m2278l9400l6687l4493l1386k6352k1435
57507A114975j9375j9360j8170j5181j2924j2541j2114j0220q019o508m567j470
57495I74526J080J405O78J373L993O904Q689R394R914J1066J2918J4700J5795
57482A072435J6699J8235K0131K1619K3195K6065K9879L2860L4499L6413L9847
57471A371877M4158M8479N3277N9166O5505P1213P6064Q0343Q4140Q7733R1820
57460B133775R6628J01348J04991J07254J08240J07777J05130R8843Q7239O9957
$$ plain form
57537 4030942 3873101 3705847 3532745 3357508 3184449 3016867 2856082 2702448 2556365
57528 2556365 2418104 2287927 2166922 2056458 1956158 1863543 1776442 1694885 1620135 1552918
57518 1552918 1493109 1439946 1391847 1347006 1304728 1265328 1228641 1194148 1162762 1136410 1114975
57507 1114975 1095600 1076240 1058070 1042889 1029965 1017424 1005310 995090 987071 980563 975996 974526
57495 974526 975606 977011 977689 979062 983055 989959 998648 1008042 1017956 1029022 1041940 1056640 1072435
57482 1072435 1089134 1107369 1127500 1149119 1172314 1198379 1228258 1261118 1295617 1332030 1371877
57471 1371877 1416035 1464514 1517791 1576957 1642462 1713675 1789739 1870082 1954222 2041955 2133775
57460 2133775 2230403 2331751 2436742 2543996 2652236 2760013 2865143 2963986 3051225 3121182
57450C121182M8773K5824J483k4704n1266p4839r2994j05626j13513j17233j17797
57439B499290j16525j13667j08475j01204r3576q6747q0089p2658o4683n7085
57429A604581n0545m5414m1500l7608l2358k5783j9222j3526q586m538j988p04
57417A322809N84K823O083J0329J5414K0335K3964K6793L0513L5818M1900M8059
57405A585424N4239O0018O4899O9583P5300Q1710Q7314R1846R6266J00226J01837
57394B468662J00300R6428Q9951P8661O1273L9183J4388j2334m0130o6718q9529
57383B740135j07109j18841j24950j27226j27965j27523j24528j18865j12326
57374A650802j05896r8851r1255q4798p9930p4649o7602o0213n4224m9273m4501
$$ plain form
57450 3121182 3169955 3195779 3197262 3172558 3121292 3046453 2953459 2847833 2734320 2617087 2499290
57439 2499290 2382765 2269098 2160623 2059419 1965843 1879096 1799007 1726349 1661666 1604581
57429 1604581 1554036 1508622 1467122 1429514 1397156 1371373 1352151 1338625 1330039 1325501 1323513 1322809
57417 1322809 1323393 1326216 1332299 1342628 1358042 1378377 1402341 1429134 1459647 1495465 1537365 1585424
57405 1585424 1639663 1699681 1764580 1834163 1909463 1991173 2078487 2170333 2266599 2366825 2468662
57394 2468662 2568962 2665390 2755341 2834002 2895275 2934458 2948846 2936512 2896382 2829664 2740135
57383 2740135 2633026 2514185 2389235 2262009 2134044 2006521 1881993 1763128 1650802
57374 1650802 1544906 1446055 1354800 1270002 1190072 1115423 1047821 987608 933384 884111 839610
57363H39610m0538l8021l5952l3202l0188k7532k4754k1710j9586j8861j8149
57352E31117j6639j5788j6627j7368j5897j3098j1310j0772j0013q723p886p684
57340C79312p398o955o869p025o965o804o632n856m345l300l599m322m199l502
57326C01541l130k931k419k057k297k438j901j605k463l622l761l169k925l042
57312B63781k979l065l766m418m244l745l714l823l616l656m167l783j468J461
57298B18798L020L203L144K782J416k87j028j027j449k122j762j85J290J605Q47
57283B28245l39j196j139m08K21Q12K090L453L017O93r08j27J266J102K57Q63
57267B37902K785M319N004N416N481N244N993Q455J1153J2620J3683J5327J6228
$$ plain form
57363 839610 799072 761051 725099 691897 661709 634177 609423 587713 568127 549266 531117
57352 531117 514478 498690 482063 464695 448798 435700 424390 413618 403605 394882 386996 379312
57340 379312 371914 364959 358090 351065 344100 337296 330664 324808 320463 317163 313564 309242 305043 301541
57326 301541 298411 295480 293061 291004 288707 286269 284368 282763 280300 276678 272917 269748 266823 263781
57312 263781 260802 257737 253971 249553 245309 241564 237850 234027 230411 226755 222588 218805 217337 218798
57298 218798 221818 225021 228165 230947 232363 232076 231048 230021 228572 226450 224688 224503 225793 227398 228245
57283 228245 227906 226710 225571 225163 225384 226196 228286 231739 234756 235449 234541 234414 235680 236782 237039 237902
57267 237902 240687 245006 250010 255426 260907 266151 272144 280599 291752 304372 318055 333382 349610
57254C49610J5191J4227J5985J9528K1943K2870K4052K5362K5026K3165K1564
57243E78523K0235J7628J4131J1920J1294J0409Q883Q442R510J0246R734R425
57231G20380J0617J2732J4852J6905J8866K0430K1857K3594K5371K7005K9399
57220I42008L2844L5487L5737L5164L6440L9403M1982M3919M6260M7931M6405
57209A383580M1495L5242K8431K0600J3070Q096M986P55n075r996j2943j5363
57197A492878j7403j7067j4183j1525j0813j0799j0239r459q120m922o14K110
57185A379844K764L751N870O903N995N660P502R530R840R735J0903J2502J3462
57172A484261J4926J7936K0958K2164K2302K3281K5574K8707L2440L6030L8219
$$ plain form
57254 349610 364801 379028 395013 414541 436484 459354 483406 508768 533794 556959 578523
57243 578523 598758 616386 630517 642437 653731 664140 673023 681465 690975 701221 710955 720380
57231 720380 730997 743729 758581 775486 794352 814782 836639 860233 885604 912609 942008
57220 942008 974852 1010339 1046076 1081240 1117680 1157083 1199065 1242984 1289244 1337175 1383580
57209 1383580 1425075 1460317 1488748 1509348 1522418 1530514 1535500 1536255 1531180 1521184 1508241 1492878
57197 1492878 1475475 1458408 1444225 1432700 1421887 1411088 1400849 1391390 1383270 1378348 1377734 1379844
57185 1379844 1382608 1386359 1392229 1399132 1405127 1410787 1418289 1427819 1437659 1447394 1458297 1470799 1484261
57172 1484261 1499187 1517123 1538081 1560245 1582547 1605828 1631402 1660109 1692549 1728579 1766798
57161A766798L9337M1405M4914M7770M8651M8983N0148N1274N1509N2125N4468
57150B297382N7854O1089O4155O7040O8973P0235P2465P5838P8177P8297P7931
57139C069436P8968Q1171Q3911Q7616R1952R5162R6846R8841J01623J02603R9951
57128D088080R5693R2909R2045R1813R1498R0578Q8327Q5497Q4150Q4197Q2682
57117E067469P8170P3122P0008O7883O4998O1962N9843N7570N3915N0009M7430
57106E752379M5603M3219M0456L7964L5497L3280L2636L3793L5146L5847L6549
57095F162369L6615L3913K8840K5097K4565K4872K3788K2179K0397J5878P043
57084F425556m000j5456k8796m5026o1971p8341r6400j17273j37878j56067j74585
$$ plain form
57161 1766798 1806135 1847540 1892454 1940224 1988875 2037858 2088006 2139280 2190789 2242914 2297382
57150 2297382 2355236 2416325 2480480 2547520 2616493 2686728 2759193 2835031 2913208 2991505 3069436
57139 3069436 3148404 3229575 3313486 3401102 3493054 3588216 3685062 3783903 3885526 3988129 4088080
57128 4088080 4183773 4276682 4368727 4460540 4552038 4642616 4730943 4816440 4900590 4984787 5067469
57117 5067469 5145639 5218761 5288769 5356652 5421650 5483612 5543455 5601025 5654940 5704949 5752379
57106 5752379 5797982 5841201 5881657 5919621 5955118 5988398 6021034 6054827 6089973 6125820 6162369
57095 6162369 6198984 6232897 6261737 6286834 6311399 6336271 6360059 6382238 6402635 6418513 6425556
57084 6425556 6421556 6406100 6377304 6332278 6270307 6191966 6095566 5978293 5840415 5684348 5509763
57073E509763j95949k17606k36696k55453k77079l00042l21622l43679l69676
57064B991961l99028m29417m61666m97519n35950I1571e33145o83952p52544q26811
57054b796452r08152j000140j102837j215985j344000j491436j657452j841281
57046a3357735k048949k287239k555177k849216l172437l530622l924760m357979
57038c8084114m845688n408186o057793o804564p665320q643177r695711j0749882
57030i7954435j1768963j2791592j3868378j4928687j5713448j5898311j5373854
57023a98297668j4443247j3669292j3395464j3352542j2775385j0974330p838220
57016b84746148l840647L52157M248730P629522J0462341J2804882J4735192J6288869
$$ plain form
57073 5509763 5313814 5096208 4859512 4604059 4326980 4026938 3705316 3361637 2991961
57064 2991961 2592933 2163516 1701850 1204331 668381 91571 -533145 -1217097 -1969641 -2796452
57054 -2796452 -3704604 -4704744 -5807581 -7023566 -8367566 -9859002 -11516454 -13357735
57046 -13357735 -15406684 -17693923 -20249100 -23098316 -26270753 -29801375 -33726135 -38084114
57038 -38084114 -42929802 -48337988 -54395781 -61200345 -68865665 -77508842 -87204553 -97954435
57030 -97954435 -109723398 -122514990 -136383368 -151312055 -167025503 -182923814 -198297668
57023 -198297668 -212740915 -226410207 -239805671 -253158213 -265933598 -276907928 -284746148
57016 -284746148 -288586795 -288234638 -283985908 -276356386 -265894045 -253089163 -238353971 -222065102
57008b22065102J7430377J8090473J8232212J7882795J7121827J6057156J4803674
57001a02446588J3462543J2107936J0789685R542242Q387300P334804O389482
56994c4432596N555335M830861M204726L661720L190883K784639K434017K129802
56986e640613J866017J637944f98073E62928J103062R66369Q51471P55991O75971
56977D915792O06648N43340M83725M28273L77116L28454K81419K38205K01171
56968H404143J69782J42488J19562J01480Q6154P0561N4124L8231K3246Q322o447
56957I211646j9939l1890m3063n3948o5001p7980r5188j17074j41852j67753j94603
56946H203355k22947k52450k81539l08095l30075l45657l53014l50271l36226
$$ plain form
57008 -222065102 -204634725 -186544252 -168312040 -150429245 -133307418 -117250262 -102446588
57001 -102446588 -88984045 -76876109 -66086424 -56544182 -48156882 -40822078 -34432596
56994 -34432596 -28877261 -24046400 -19841674 -16179954 -12989071 -10204432 -7770415 -5640613
56986 -5640613 -3774596 -2136652 -698073 562928 1665990 2632359 3483830 4239821 4915792
56977 4915792 5522440 6065780 6549505 6977778 7354894 7683348 7964767 8202972 8404143
56968 8404143 8573925 8716413 8835975 8937455 9023609 9094170 9148294 9186525 9209771 9218093 9211646
56957 9211646 9191707 9159817 9116754 9062806 8997805 8919825 8824637 8707563 8565711 8397958 8203355
56946 8203355 7980408 7727958 7446419 7138324 6808249 6462592 6109578 5759307 5423081
56937E423081l11478k78703k41544k02991j64565j26683q9548n3050j5669K4515
56927C963365O4116Q8929P8706K3235o5115j57444k28353k69990k88855k94119
56917B914475k91070k81997k68466k51732k32752k12503j91789j70943j50256
56908H62967j30360j11649r3889p6980o1599m8450l7360k7720j9415j2546o553
56897B36446m47N954J1443J4148J2753P218j242j0662j8977k4538k6718k6322
56885A79056k5022k3790k2059j8845j4316r562n166q49L552P753J1695J5586J9029
56872A17062K1169K2256K4044K7597L1059L0574K3760J1915j118j1904j9192k3400
56860B53822k5157k4812k2957k0629j8671j7200j5950j4699j3148j0944q277o040
$$ plain form
56937 5423081 5111603 4832900 4591356 4388365 4223800 4097117 4007569 3954519 3938850 3963365
56927 3963365 4027481 4116410 4195116 4218351 4153236 3995792 3767439 3497449 3208594 2914475
56917 2914475 2623405 2341408 2072942 1821210 1588458 1375955 1184166 1013223 862967
56908 862967 732607 620958 527069 450089 388490 340040 302680 274960 255545 242999 236446
56897 236446 235999 241953 253396 267544 280297 287515 286273 275611 256634 232096 205378 179056
56885 179056 154034 130244 108185 89340 75024 65462 60296 59447 62999 70752 82447 98033 117062
56872 117062 138231 160487 184531 212128 243187 273761 297521 309436 308318 296414 277222 253822
56860 253822 228665 203853 180896 160267 141596 124396 108446 93747 80599 69655 61378 55338
56848E5338m804l948k363K35L189N817P776Q900R398J0100J1722J3858J5417J6083
56834A46718J6587J7374J7769J6986J5339J3898J3166J2816J2685J3311J4887
56823C11536J5945J3977P911l53p475j1618j3484j4664j5727j6004j4478j0744
56811B44822n630r34K215M729Q385J3199J7281J9834K2736K7977L4711M0515M4930
56798D74770M9537N4212N5140M7954L2439J3293l547j4864k0856k3177k3134k1502
56786F20265j8945j5726j1501o169p02L694P288J1692J7894K5358L3334M2007
56774G08489N1779O2196P1910P8685P8760O7803M4485J3297j7407m0795n5022
56763A064180o2094o4476o3183n8409n1007m2727l4932k7608k0068j2231m615
$$ plain form
56848 55338 50534 46586 44223 44458 47647 53464 61240 70140 79538 89638 101360 115218 130635 146718
56834 146718 163305 180679 198448 215434 230773 244671 257837 270653 283338 296649 311536
56823 311536 327481 341458 349369 349016 341541 329923 316439 301775 286048 270044 255566 244822
56811 244822 239192 238258 240473 245202 253587 266786 284067 303901 326637 354614 389325 429840 474770
56798 474770 524307 578519 633659 681613 714052 727345 723798 708934 688078 664901 641767 620265
56786 620265 601320 585594 574093 567924 567222 570916 578204 589896 607790 633148 666482 708489
56774 708489 760268 822464 894374 973059 1051819 1119622 1164107 1177404 1159997 1119202 1064180
56763 1064180 1002086 937610 874427 816018 765011 722284 687352 659744 639676 627445 622830
56752F22830K699J0160J7960K5913L4011M2147M9291N3848N4614N0286L8651J8491
56740A020901p065l0972m7240n4721n5777n3149m8933m4643m0483l5458k9353
56729E73107k3629j9307j5304j0160m119J831P729J3794J8913K1800K2810K2782
56717F10247K0761J4896N236n999j6645k5509l1586l4319l4680l4253l3278l1020
56705D03851k7935k5621k4336k2380j8584j4068j0849r660r717r826r191p723
56693B13961o031m748l851l065k731l600n702p955q832p314l728m8J355Rk104
56678A55616k884k196j040K05J476J997J082n98j837k437k721k383j273n55j245
56663A41207k305k070r91p18r27K80K789L912K198n38j973k084j954j598m68J024
$$ plain form
56752 622830 625529 635689 653649 679562 713573 755720 805011 858859 913473 963759 1002410 1020901
56740 1020901 1013836 982864 935624 880903 825126 771977 723044 678401 637918 602460 573107
56729 573107 549478 530171 514867 504707 500588 502419 510148 523942 542855 564655 587465 610247
56717 610247 631008 645904 651140 645141 628496 602987 571401 537082 502402 468149 434871 403851
56705 403851 375916 350295 325959 303579 284995 270927 260078 250418 240701 230875 221684 213961
56693 213961 207930 203182 199331 196266 193535 189935 184233 176278 167446 160132 156404 156356 157711 157720 155616
56678 155616 152732 150536 149496 149701 151177 153174 154256 153658 151821 149384 146663 144280 143007 142452 141207
56663 141207 138902 136832 135841 135123 134196 134476 137265 141177 143375 142837 140864 138780 136826 135228 134760 135784
56647A35784J872J674O67o72j465q68O01J227K96p82l49J432L161L937L631K372
56631A52518Q27L01J450L128L483J900p24l309n305o378o294n233l780k503j703
56616A28378j424j377j061j36J265K666L502L362K414J542J606K455L073K749
56602A49014J725O75L3j64k18n50j118j164j87J001J096J87k75L75R77L29j019
56585A50717j770j949k636l818l908j912R45K660K932L194M359N603N856N421
56571A65694N279N391M880L566K224J304N95J73L74M99r02l603n004l189L56K484
56555A80121K230J341J444K265K753K498J638M63l92j40J267K886L782L894L802
56540B09852L869L836L114J568j8n40J60J078J376J369J787K583L042K732J858
$$ plain form
56647 135784 137656 139330 139997 139325 137860 136992 137593 138820 139116 138334 137985 139417 142578 146515 150146 152518
56631 152518 153345 153646 155096 158224 161707 163607 162883 159574 154269 147891 141597 136364 132584 130081 128378
56616 128378 126954 125577 124516 124380 125645 128311 131813 135175 137589 139131 140737 143192 146265 149014
56602 149014 150739 151414 151447 151283 151065 150515 149397 148233 148046 149047 150143 150330 150055 150430 151407 151736 150717
56585 150717 148947 146998 144362 140544 136636 134724 135669 138329 141261 144455 148814 154417 160273 165694
56571 165694 170973 176364 181244 184810 187034 188338 188933 189106 189480 189979 189077 185474 180470 177281 177637 180121
56555 180121 182351 183692 185136 187401 190154 192652 194290 194753 194361 194221 195488 198374 202156 206050 209852
56540 209852 213721 217557 220671 222239 222221 221681 221841 222919 224295 225664 227451 230034 233076 235808 237666
56525B37666R57O32J134J873J831Q71N7L57J592L018M161M659M156L035K434K839
56509B71272L454L642L995N139O414O833O629O739P399Q175Q794R071Q747Q215
56495C64518Q583J0085J1384J1392J0740J0346R790Q529P499P560P392N140J641
56482D74599k43N58K107K266Q68j118k959m203m646m738n241o197p016p436p619
56467D28982p535p086o660o716p085p405p796q357q586q117p374o675n572m078
56453C29940l472m541o055o406n723m901l747j987r07j681k974k608j058p07j912
56438B81261k558j642p81j439k809l238k244n10Q49Q32l61r00N93K766K992R72
56422B73783r10p97Q17K634M061M866M810M117L309K552K003K209L093L423K735
$$ plain form
56525 237666 238623 239255 240389 242262 244093 244964 245021 245378 246970 249988 254149 258808 262964 265999 268433 271272
56509 271272 274726 278368 282363 287502 293916 300749 307378 314117 321516 329691 338485 347556 356303 364518
56495 364518 373101 383186 394570 405962 416702 427048 436838 445367 452866 460426 467818 472958 474599
56482 474599 474356 474914 477021 479287 480155 479037 476078 471875 467229 462491 457250 451053 444037 436601 428982
56467 428982 421447 414361 407701 400985 393900 386495 378699 370342 361756 353639 346265 339590 334018 329940
56453 329940 326468 321927 315872 309466 303743 298842 295095 293108 292201 290520 287546 284938 283880 283173 281261
56438 281261 278703 277061 276280 274841 272032 268794 266550 266040 266889 267721 267360 266460 267053 269819 272811 273783
56422 273783 272873 272076 272893 275527 279588 284454 289264 293381 296690 299242 301245 303454 306547 309970 312705
56407C12705K602M189N893N851N437P161R984J0439Q197O701P775R234Q960Q033
56393D13161Q209R124R597R460Q652O677M200L053L364K835K83k213k269m16J254
56378D74971K002K269K070J213J39p87j951l381m090l533k769l071m207m984m813
56363D49078m164m105n562q122r674q455n472l359k986k916k272j934k481l006
56349C84570k828k584k783k915k666k557k730k619k260k392k803k339j030m44
56335C51620j356k622k936k085k52K228M081M032K837K536L394L637K485J168
56321C68767N54J08l07K5O69N1j806k876k256j220n24O59K249K604J531J173K427
56304C71828L273K344J394K176L301K635Q43K14J369L241N028O297O311N037L853
$$ plain form
56407 312705 315307 319496 325389 331240 336677 343838 353822 364261 372458 379159 386934 396168 405128 413161
56393 413161 421370 430494 440091 449551 458203 464880 469080 472133 475497 478332 478615 476402 474133 473717 474971
56378 474971 476973 479242 481312 482525 482664 481877 479926 476545 472455 468922 466153 463082 458875 453891 449078
56363 449078 444914 440809 435247 427125 417451 408996 403524 400165 397179 394263 391991 390057 387576 384570
56349 384570 381742 379158 376375 373460 370794 368237 365507 362888 360628 358236 355433 353094 352064 351620
56335 351620 350264 347642 344706 342621 342369 344597 348678 352710 355547 358083 361477 365114 367599 368767
56321 368767 369321 369429 369122 369147 369816 369867 368061 365185 362929 361709 361185 361844 364093 366697 368228 369401 371828
56304 371828 375101 377445 378839 381015 384316 386951 387794 388008 389377 392618 397646 403943 410254 415291 419144
56289D19144L811M058L299J786P55P61J431K084K077J450J488L347O163Q066Q809
56274D68529R408R555Q001N605M997O632Q043P717O876O549N939M881M935O624
56260E64291Q328R105J0000J1360J1823J1279J1664J3273J3585J1643J0260J1500
56248F98111J2999J1710Q771P671R284J1385J1789R871O337L167K421L722M385
56235H01623L031J149K70k3j61P05K706M412N286O575Q631R998J0270J0972J2472
56220H77916J3080J2585J3402J6690K0526K3337K5942K8776L0669L1861L4486
56209A129270L8574M1625M3678M8176N5641O1643O3821O5974P1715P8888Q4269
56198A783274Q9265R6499J04738J11895J19307J28308J35948J39201J40550J44373
$$ plain form
56289 419144 422955 427013 430312 432098 432853 433614 435045 437129 439206 440656 442144 445491 451654 459720 468529
56274 468529 477937 487492 495493 501098 506095 512727 520770 528487 535363 541912 547851 552732 557667 564291
56260 564291 572619 581724 591724 603084 614907 626186 637850 651123 664708 676351 686611 698111
56248 698111 711110 722820 731591 739262 748546 759931 771720 781591 787928 791095 793516 797238 801623
56235 801623 804654 805803 806073 806050 805889 806594 809300 813712 818998 825573 834204 844202 854472 865444 877916
56220 877916 890996 903581 916983 933673 954199 977536 1003478 1032254 1062923 1094784 1129270
56209 1129270 1167844 1209469 1253147 1301323 1356964 1418607 1482428 1548402 1620117 1699005 1783274
56198 1783274 1872539 1969038 2073776 2185671 2304978 2433286 2569234 2708435 2848985 2993358
56188B993358J50064J53383J52509J48414J41271J30787J18287J04619Q8006O7431
56178D248129M5739K5930P066j2376l0234m3702n3759o2470o8995p2485p5558
56167C907285q0235q3715q3202q1644q3158q6091q6597q6162q8818r3132r4027
56156B960504r1329q9728r0784r1448r0312q9393q9365q8368q5956q3498q0544
56145A989779p5204o8146o2084n7626n3414m9540m6762m3566l8329l3193l1346
56134A430569l1626l0435k7566k5359k3499j9986j6080j4857j5568j4805j2479
56123A198309j1279j0838q175l773j506k166k331l02J759K355K814M127N541O903
56109A181438Q971J1313J3103J5386J9327K3241K4884K5253K6393K7162K5614
$$ plain form
56188 2993358 3143422 3296805 3449314 3597728 3738999 3869786 3988073 4092692 4180698 4248129
56178 4248129 4293868 4319798 4326864 4314488 4284254 4240552 4186793 4124323 4055328 3982843 3907285
56167 3907285 3827050 3743335 3660133 3578489 3495331 3409240 3322643 3236481 3147663 3054531 2960504
56156 2960504 2869175 2779447 2688663 2597215 2506903 2417510 2328145 2239777 2153821 2070323 1989779
56145 1989779 1914575 1846429 1784345 1726719 1673305 1623765 1577003 1533437 1495108 1461915 1430569
56134 1430569 1398943 1368508 1340942 1315583 1292084 1272098 1256018 1241161 1225593 1210788 1198309
56123 1198309 1187030 1176192 1168017 1164244 1162738 1160572 1158241 1157939 1159698 1162053 1164867 1168994 1174535 1181438
56109 1181438 1190409 1201722 1214825 1230211 1249538 1272779 1297663 1322916 1349309 1376471 1402085
56098A402085K3750K4964K8094K9006K6983K4826K3707K2794K2683K4385K6094
56087A679371K5660K4920K6854L0262L2228L3755L7463M1959M4443M7053N4194
56076B078162O5215P6034Q6438R9280J13893J27175J40130J56403J75120J91657
56066C309507K04424K14214K18149K11713J96366J78381J60857J43452J28372
56057D965435J18532J10311R5809P2471M3955J2810k0021m9618o9659q0755q8813
56046E110457r6076j01812j10187j27407j50780j70195j81254j87943j91749j88263
56036C604791j76451j61840j47845j32172j14162r7764q4951p3550o3176n6095
56026B496785n1143m4518l7319l4347l4830l2856k7524k3725k2248j8588j2616
$$ plain form
56098 1402085 1425835 1450799 1478893 1507899 1534882 1559708 1583415 1606209 1628892 1653277 1679371
56087 1679371 1705031 1729951 1756805 1787067 1819295 1853050 1890513 1932472 1976915 2023968 2078162
56076 2078162 2143377 2219411 2305849 2405129 2519022 2646197 2786327 2942730 3117850 3309507
56066 3309507 3513931 3728145 3946294 4158007 4354373 4532754 4693611 4837063 4965435
56057 4965435 5083967 5194278 5290087 5362558 5406513 5419323 5399302 5349684 5280025 5199270 5110457
56046 5110457 5014381 4912569 4802382 4674975 4524195 4354000 4172746 3984803 3793054 3604791
56036 3604791 3428340 3266500 3118655 2986483 2872321 2774557 2689606 2616056 2552880 2496785
56026 2496785 2445642 2401124 2363805 2329458 2294628 2261772 2234248 2210523 2188275 2169687 2157071
56015B157071r599j0080q559l983j660k677j415L869P798P941Q617J1869J3886
56002B173078J3272J3860J6807J8672J9374K2830K8136K9752K8030K9279L3898
55991B426988L5397L2915L3248L8012M0664L9110L9434M3788M6357M4950M5059
55980B865922M8825N1536N2409N6932O5190P0038P0278P3057P9885Q3448Q2065
55969C599585Q3568R0537R5592R5986R8794J06723J12990J15396J21038J31630
55959D651839J38984J40759J45809J58035J69988J78277J89709K06025K18828
55950F198253K26025K36830K53790K67009K73171K82625L00061L16421L27837
55941H682022L43865L68275L90707M06246M24073M48013M68782M84715N08959
$$ plain form
56015 2157071 2147472 2137392 2128833 2124850 2123190 2120513 2119098 2122967 2130765 2138706 2147323 2159192 2173078
56002 2173078 2186350 2200210 2217017 2235689 2255063 2277893 2306029 2335781 2363811 2393090 2426988
55991 2426988 2462385 2495300 2528548 2566560 2607224 2646334 2685768 2729556 2775913 2820863 2865922
55980 2865922 2914747 2966283 3018692 3075624 3140814 3210852 3281130 3354187 3434072 3517520 3599585
55969 3599585 3683153 3773690 3869282 3965268 4064062 4170785 4283775 4399171 4520209 4651839
55959 4651839 4790823 4931582 5077391 5235426 5405414 5583691 5773400 5979425 6198253
55950 6198253 6424278 6661108 6914898 7181907 7455078 7737703 8037764 8354185 8682022
55941 8682022 9025887 9394162 9784869 10191115 10615188 11063201 11531983 12016698 12525657
55932A2525657N46120N83638O16349O56687P09753P62649Q10334Q66842R37930
55923A9015959J008707J071936J141587J223989J304149J376360J458763J561190
55915B9162640J669656J779794J912020K074802K248670K427284K636545K890842
55907D6802253L171634L474860L836400M282868M802821N394845O091037O898096
55899H4754814P772202Q692918R703385J0836684J2073115J3420703J4959357
55892A62213178J6748046J8780717K1100161K3836723K7040923L0604838L4394095
55885C34718681L8080211M0424159L8988227L1429361J7679040P21527j5128096
55878D86913110k6821481l3675216l6572755l6739782l5216999l2827467l0124248
$$ plain form
55932 12525657 13071777 13655415 14271764 14928451 15638204 16400853 17211187 18078029 19015959
55923 19015959 20024666 21096602 22238189 23462178 24766327 26142687 27601450 29162640
55915 29162640 30832296 32612090 34524110 36598912 38847582 41274866 43911411 46802253
55907 46802253 49973887 53448747 57285147 61568015 66370836 71765681 77856718 84754814
55899 84754814 92527016 101219934 110923319 121760003 133833118 147253821 162213178
55892 162213178 178961224 197741941 218842102 242678825 269719748 300324586 334718681
55885 334718681 372798892 413223051 452211278 483640639 501319679 502041206 486913110
55878 486913110 460091629 426416413 389843658 353103876 317886877 285059410 254935162
55871B54935162k7351946k4592421k1925009j9416786j7072394j4891087j2922732
55864A16762787j1210998r735729q460777p387054o512688n789044n162314m620657
55856E7883526m163646l764254l397919l074606k807190k577834k365445k176395
55848C3556237k018863j874978j726810j584761j463713j354968j246758j149502
55840B1135884j075637j014719r51873q91961q44056q00279p51024p04056o68740
55831A3433539o37312o00091n63524n35736n09766m78035m48305m28663m11268
55822H820839l87030l62210l44940l29264l08058k88100k76953k67734k52109
55813F004441k35923k26983k19393k04976j88871j78964j70458j55673j39474
$$ plain form
55871 254935162 227583216 202990795 181065786 161649000 144576606 129685519 116762787
55864 116762787 105551789 95816060 87355283 79968229 73455541 67666497 62504183 57883526
55856 57883526 53719880 49955626 46557707 43483101 40675911 38098077 35732632 33556237
55848 33556237 31537374 29662396 27935586 26350825 24887112 23532144 22285386 21135884
55840 21135884 20060247 19045528 18093655 17201694 16357638 15557359 14806335 14102279 13433539
55831 13433539 12796227 12196136 11632612 11096876 10587110 10109075 9660770 9232107 8820839
55822 8820839 8433809 8071599 7726659 7397395 7089337 6801237 6524284 6256550 6004441
55813 6004441 5768518 5541535 5322142 5117166 4928295 4749331 4578873 4423200 4283726
55804D283726j30843j27782j23802j20932j23763j28443j29268j28545j29344
55795C141004j26896j17453j07052j01369r5675q4725p3266o6593o0164m9055
55785B258756l8516l4612l3671l1505l3434m3782n4558n6522n3284n2754n2791
55774A773327m7407l9735l6383l5239l0524k4185k1229j9819j6604j5677k1281
55763A465244k7649k7354k4163k6385l2698l5851l5692l7133l9217l7374l3320
55752A108408l2190l2732k9985k4892k1993k0518j6758j2255j0982j1367r454
55741H85282o752o690o783k862K351L500K123L310N922N000J297k34N19m98l671
55726H81814o082p641r891j1050r277q096j1364j5771j5656j2284j0655j0126
$$ plain form
55804 4283726 4152883 4025101 3901299 3780367 3656604 3528161 3398893 3270348 3141004
55795 3141004 3014108 2896655 2789603 2688234 2592559 2507834 2434568 2367975 2307811 2258756
55785 2258756 2220240 2185628 2151957 2120452 2087018 2043236 1988678 1932156 1878872 1826118 1773327
55774 1773327 1725920 1686185 1649802 1614563 1584039 1559854 1538625 1518806 1502202 1486525 1465244
55763 1465244 1437595 1410241 1386078 1359693 1326995 1291144 1255452 1218319 1179102 1141728 1108408
55752 1108408 1076218 1043486 1013501 988609 966616 946098 929340 917085 906103 894736 885282
55741 885282 878530 871840 865057 862195 864546 868046 870169 873479 879401 884401 885698 885464 885983 885485 881814
55726 881814 875732 868091 858200 847150 837873 829777 818413 802642 786986 774702 764047 753921
55714G53921o569j559q79n163r712j2526j5231j7344j6741j4892j5060j6253j5175
55701F06817j2640j1894j2274j0881r028j0500j4599j7072j6752j5727j4525j2774
55689D48151j2716j6193j9964j9745j6924j5470j4632j1110o227m152m567l768
55677C02683j696j373k595k517j410j607j936N29M096M254J047j400j978l203
55663B92894n380o165n581n847o450m865j882r36k370l248k679k458k897k554
55649B39582j568j102l40J884L898L838L587N552P576O126K575R47J244N36j016
55634B73319r95k13j425l644l321m28J959L138M692O168O079N962Q117J0737J0608
55619C20753R061R489J0711Q919M740J924K56l424q071r278o974n593o553o995
$$ plain form
55714 753921 747352 745793 744914 739751 730039 717513 702282 684938 668197 653305 638245 621992 606817
55701 606817 594177 582283 570009 559128 550100 539600 525001 507929 491177 475450 460925 448151
55689 448151 435435 419242 399278 379533 362609 347139 332507 321397 315170 311018 306451 302683
55677 302683 300987 299614 297019 294502 293092 291485 289549 290078 294174 298428 299475 298075 296097 292894
55663 292894 287514 281349 275768 269921 263471 258606 256724 255788 253418 250170 247491 245033 242136 239582
55649 239582 238014 236912 236572 238456 242354 246192 249779 255331 262907 269033 271608 272555 273799 274335 273319
55634 273319 272324 272111 270686 267042 263721 263293 265252 268390 273082 279250 285329 291291 299408 310145 320753
55619 320753 329814 339303 350014 358933 363673 365597 365853 362429 354358 345080 338106 332513 325960 318965
55605C18965o077o026o628n008j588j48j275j537K57J562J420J664K312J375l16
55590B98952L57L001L953K604J877K119N87k648m336m287n749q753r371o836n067
55575B66403n772o166n272o049r161j0690q780o845p437q181o852n485o272p510
55561A65931o858n044l775l227l425m810n933m304r02J03k486n034m713k834j169
55546A11520O72K437K107m37k455k626k609l061k353o32o10k578l032l19K643
55531I8667L346L131L516L295J692N95J165J820J649K193L817M165K482J642L506
55516A36681N912O660O933Q241R479R525R637J0799J1785J2025J3201J5881J7854
55503B74613J7951J8143J9536J9661J6390J1326O659J705m669j0959j5161j7672
$$ plain form
55605 318965 312888 306862 300234 295226 293638 293490 292215 290678 290935 292497 293917 295581 297893 299268 298952
55590 298952 299309 302310 306263 308867 310744 312863 313450 310802 306466 302179 296430 287677 278306 271470 266403
55575 266403 260631 254465 249193 243144 233983 223293 214513 207668 200231 192050 185198 179713 173441 165931
55561 165931 159073 154029 150254 147027 143602 138792 132859 128555 127653 127756 125270 120236 115523 112689 111520
55546 111520 112192 114629 116736 116299 113844 111218 108609 105548 103195 102563 101953 99375 96343 96024 98667
55531 98667 102013 105144 108660 111955 113647 114242 115407 117227 118876 121069 124886 129051 131533 133175 136681
55516 136681 142593 149253 156186 164427 173906 183431 193068 203867 215652 227677 240878 256759 274613
55503 274613 292564 310707 330243 349904 366294 377620 384279 385984 381315 370356 355195 337523
55491C37523j9598k0324j9063j6743j4510j2371j0634j0290j0761j0055q323q074
55479A76777r631r946p600n278n203n741m896l654l315k753j084l7r53k109j651
55464A12926n27j36K59J437K204J748J326J444L54k370l901k467n91j155l039
55449A07512l602k999l048l912m663n213n502m832l882m763p181p685m875k083
55435D3272k245l568l285k175j968j517M65J816L56j601n62K239K784O13j146
55420C3478j135j016j740k285k087j789j683j569j707j961j140Q47J682k45k990
55405A4660l662k300p31O25K040K337O52j172r74J80j17j488j722q06p14j886
55389D922B025a097l038k437r92J76N0PJ877h84D552M270L029K307J051n55j025
$$ plain form
55491 337523 317925 297601 278538 261795 247285 234914 224280 213990 203229 193174 184851 176777
55479 176777 167146 157200 149600 144322 139119 133378 128482 124828 121513 118760 117676 117639 116686 114577 112926
55464 112926 112399 112263 112522 113959 116163 117911 119237 120681 121035 118665 114764 112297 111706 110551 107512
55449 107512 103910 100911 97863 93951 89288 84075 78573 73741 69859 65096 57915 50230 45355 43272
55435 43272 41027 37459 34174 31999 30031 28514 28979 30795 31151 29550 28988 31227 34011 34624 33478
55420 33478 32343 31327 29587 27302 25215 23426 21743 20174 18467 16506 15366 16213 17895 17650 14660
55405 14660 10998 8698 7967 8592 10632 12969 13621 12449 11475 11655 11538 10050 8328 7522 6808 4922
55389 4922 2025 -1097 -4135 -6572 -7564 -7388 -7338 -7331 -5454 -884 4552 8822 11851 14158 15209 14654 13629
55372A3629l93l22j138j254J07J766K550K446J722N31m43m52J79N54N50N36M29
55355B0997K06N55J596J927N66j177j438n46j84n41k00J549L857N418N332L552
55339D1469J482J028K046K171L00j587j618j009j807l442m008l496l282l463l148
55324B1636k460k068j564l82O86Q94J173K352L094J936P1m21J13Kn61k49M25j15
55306B4562j452j759j069j188k549l689l700k988j912p09k80q25n75J836M557
55291H260M708K542O23l75j824l535l510j550J15N21J211K832L239N39l810C612
55274a620j492a269A039L41C07O8K249K777J500K05o15j821A685i03q80J53q5
55257a715r1P52a11m84k134k171n95J260a864E34J442j7F19a429j678K3a030A404
$$ plain form
55372 13629 13236 12914 11776 10522 10629 12395 14945 17391 19113 19644 19201 18749 18928 19482 20032 20568 20997
55355 20997 21203 21758 23354 25281 25847 24670 23232 22686 22502 21961 21761 23310 27167 32585 37917 41469
55339 41469 42951 43979 46025 48196 48496 46909 45291 44282 42475 39033 35025 31529 28247 24784 21636
55324 21636 19176 17108 15544 15162 15848 16742 17915 20267 23361 25297 25368 24947 25060 25062 24501 24252 24677 24562
55306 24562 23110 21351 20282 19094 16545 12856 9156 6168 4256 3547 3267 2442 1867 3703 8260
55291 8260 12968 15510 16133 15758 13934 10399 6889 5339 5454 5975 7186 10018 13257 13796 9986 3612
55274 -1620 -3112 -1269 1039 1380 307 375 2624 5401 6901 7106 6491 4670 1685 -903 -1783 -1630 -1715
55257 -1715 -1806 -1054 -111 -595 -2729 -4900 -5495 -4235 -1864 534 1976 1959 619 -1429 -3107 -3084 -1030 1404
55238B066I03a40B7M51j81B6K35J45h9m96K22C03Q12J442K046J220q21k236F92
55218c97o5C14R40J28o09r6Q90P43k95o78l62C61i43j012K47g56E9J003J412N40
55198C014j425e59p42f00K83j053j305j04a314I85J694l92c38l134j660J91J008
55181c933Q32L07j8M15h58A216J097j46K66J882K448J367L09K88M87L29K91K39
55163A0073o86j971j844k64N20n36j593q85P29J576J633J609J196m6j185q81Q15
55146H260K708L872L946K855J085l43q19o23k54M5L8m04p72m09M50J018J142J137
55128B2932P52l91j588j724j069p90r47o05J24M4r14j407q66k91l99o64o23n87
55110A0987o43l90o0l96j140j114j22P08O58J86j27r2N47J554J590j02j841j453
$$ plain form
55238 2066 903 -140 27 478 297 26 261 406 -89 -585 -363 303 1115 2557 4603 5823 5002 2766 692
55218 -397 -462 314 1254 1382 773 677 1567 2310 2015 1337 975 361 -943 -1955 -1708 -756 59 1062 2474 3014
55198 3014 1589 -559 -1301 -600 -317 -1370 -2675 -2779 -1314 985 2679 2287 -338 -3472 -5132 -4941 -3933
55181 -3933 -3101 -2794 -2812 -2397 -858 1216 2313 2167 2433 4315 6763 8130 8439 8727 9214 9543 9834 10073
55163 10073 9387 7416 5572 5308 5828 5292 3699 2814 3543 5119 6752 8361 9557 9511 8326 7445 8260
55146 8260 10968 14840 18786 21641 22726 22383 21564 20941 20687 20732 20770 20366 19594 19185 19635 20653 21795 22932
55128 22932 23684 23293 21705 19981 18912 18122 17175 16570 16694 16738 15824 14417 13551 13260 12861 12197 11574 10987
55110 10987 10344 9954 9894 9498 8358 7244 7122 7830 8488 8674 8547 8455 9002 10556 12146 12044 10203 8750
55092H750L60J100N61Q66K326K620R34l81L27J325N19j265j936j185nJ192K243
55075A8351K336J040p53j984k377j575Q97L899M763K508n98j962j549o34N62K242
55059B5166L482L254K102J326J209J270J486K073K706K923K663J744j06k145k745
55044D6408j448K45R14P60M19l24j535k206j505o3R93J284Q24m05j717j740j09
55027D0795J837K722K537J891J181R34J555K282J928J033J412L000L380J382j056
55012F6813j883j592j415r77L04J374J081J52k88q04k280l731l546j942l27Q44
54996E1783J768J875N93j044j452o30K75R27J733K426K260J236j24j664l119l452
54980E3391j988L22J960K511K354J656P85P38J776K617K239J461J334J266L77
$$ plain form
55092 8750 9110 10210 10771 11637 13963 16583 17517 17136 17463 18788 19307 18042 16106 14921 14916 16108 18351
55075 18351 20687 21727 20974 18990 16613 15038 15935 19834 24597 27105 26507 24545 22996 22362 22924 25166
55059 25166 28648 31902 34004 35330 36539 37809 39295 41368 44074 46997 49660 51404 51298 49153 46408
55044 46408 44960 45205 46119 46879 47298 46974 45439 43233 41728 41665 42658 43942 44766 44361 42644 40904 40795
55027 40795 42632 45354 47891 49782 50963 51897 53452 55734 57662 58695 60107 63107 66487 67869 66813
55012 66813 64930 63338 61923 60946 61250 62624 63705 63857 63569 62765 60485 56754 53208 51266 50939 51783
54996 51783 53551 55426 56019 54975 53523 52893 53168 54095 55828 58254 60514 61750 61626 59962 56843 53391
54980 53391 51403 51725 53685 56196 58550 60206 60991 61729 63505 66122 68361 69822 71156 72422 72799
54965G2799m32K35J732K282J705J226J049L83m65k26R18J248J39j002q96J52J520
54948H2367L263M936M897K147j772l892k800J13K346K700J813P58q6o13k91J081
54932I6967K321J772n69l002m196m200l311j543L24Q12k59j254j010l42l71p35
54916H1404n94j34R1J98L25J14j51P39K841M117L161J459J218K081K075R90N73
54899A00507J675L121L523K813J845J592K692M918P219Q816R811J0229R588Q219
54885A76568P743R073J0963J1846J2035J2679J3629J4025J4108J4549J4656J3125
54873C24999J0173P213M583J270l257q305j2960j6589j8511j8432j7069j5456
54861B37659j3948j2647j1979j1791j0806q335n776m923n461n603m581k891q10
$$ plain form
54965 72799 72367 72602 74334 76616 78321 79547 80596 80979 80514 80288 81206 82454 82593 81591 80695 80847 82367
54948 82367 85630 90566 95463 97610 95838 91946 89146 89259 91605 94305 96118 96876 96790 96177 95886 96967
54932 96967 99288 101060 100491 97489 93293 89093 85782 84239 84563 85375 85116 83862 82852 82510 82139 81404
54916 81404 80810 80676 80767 80965 81290 81404 81253 81992 84833 88950 92111 93570 94788 96869 98944 99934 100507
54899 100507 102182 105303 108826 111639 113484 115076 117768 122686 129905 138721 148532 158761 168349 176568
54885 176568 184311 193384 204347 216193 228228 240907 254536 268561 282669 297218 311874 324999
54873 324999 335172 342385 346968 348238 344981 336676 323716 307127 288616 270184 253115 237659
54861 237659 223711 211064 199085 187294 176488 168153 162377 157454 151993 146390 141809 138918 138108
54848A38108J622L530L950L449L507M540N837P033Q154Q678Q213P825R079J1784
54834B25309J4163J5093J4855J3887J2145R523N797O36n232r732j1784j2984j5218
54821B56458j7512j7520j5339j3351j2533j1525r559p759o990o640o115n658n013
54808A20944l264p66N57j76j447j517o69k82p48j321j302o66M9J60l88p64l94
54791A08006Kn08j445j635j116q14o46K10J158L97k290m737n041l564j823q53
54775H5301j182k853m633m649k657o00j21p33j113j001q73o95j24O66J232J595
54759F7560K066K635K957K638J550J70m86K8P81N75k83l56Q48K312L114L398L470
54742I2977L116K382K116L050M845O436P076O939O999Q012R353R441Q004P052
$$ plain form
54848 138108 139730 143260 147210 150659 154166 158706 164543 171576 179730 188408 196621 204446 213525 225309
54834 225309 239472 254565 269420 283307 295452 304975 310772 311408 306176 296444 284660 271676 256458
54821 256458 238946 221426 206087 192736 180203 168678 159119 151360 144370 137730 131615 125957 120944
54808 120944 117680 116914 117471 117295 115848 114331 113662 113380 112632 111311 110009 109343 109392 109552 109164 108400 108006
54791 108006 108008 107500 106055 104420 103304 102490 101844 102054 103212 103609 101319 96582 91541 87977 86154 85301
54775 85301 84119 81266 76633 71984 69327 68727 68606 67873 66760 65759 64886 64191 64067 64733 65965 67560
54759 67560 69626 72261 75218 77856 79406 79576 79090 79118 79899 80474 80191 79835 80683 82995 86109 89507 92977
54742 92977 96093 98475 100591 103641 108486 114922 121998 128937 135936 143948 153301 162742 170746 177798
54728A77798Q514J1662J4281J5678J6776J7827J8012J7309J6673J6021J3973J0110
54716C54634N761J956j720n565q650j0225j0924j1599j2033j1637j0506q980p029
54703B63483m765k753j333l17K89Q7p83j341o82J375M530P943J0147J0380R980
54688B96240J0988J3274J4728J4595J4636J6158J7754J7355J5154J2913J1321
54677D55116R506O647K831j493o007j0475j4690j8353k0913k1935k1763k1170
54665C37301k0389j9174j7806j7006j6721j6042j4550j2795j1150r289p190n599
54653A69590n024n100n289n332m801l292j464p92j740l022l137j927l24O21L60
54638A29327p44j436p88O29J678K282K934L109J935K20k15P22J310R49R00J580
$$ plain form
54728 177798 186312 197974 212255 227933 244709 262536 280548 297857 314530 330551 344524 354634
54716 354634 360395 362351 360631 355066 346416 336191 325267 313668 301635 289998 279492 270512 263483
54703 263483 258718 255965 254632 254315 254604 254691 253908 252567 251885 253260 257790 265733 275880 286260 296240
54688 296240 307228 320502 335230 349825 364461 380619 398373 415728 430882 443795 455116
54677 455116 464622 471269 474100 472607 466600 456125 441435 423082 402169 380234 358471 337301
54665 337301 316912 297738 279932 262926 246205 230163 215613 202818 191668 182379 175189 169590
54653 169590 164566 159466 154177 148845 144044 140752 139288 138496 136756 133734 130597 128670 128346 128967 129327
54638 129327 128583 127147 126359 126988 128666 130948 133882 136991 138926 139146 138931 139653 140963 141912 142812 144392
54622A44392J580L17o46k33K70l97j111j90J956L781M891N628N607M606L964N088
54606A79503P187Q269P867P130O572N543L878K580K474L186L707L436K617K059
54592B46008K248K707K910L602N951R163J0751R949R210J0870J3882J5618J5710
54579C58579J5998J7365J8726J9119J8991J8944J8528J6710J2915P492J591l530
54567E21428p589j1301j5076j8259k0109k0719k0421j9273j7740j6842j6650j5823
54555C21626j3694j1609j0821j0270q273n474m022m238m290l182k044j984k492
54542B39233k709k937l918n457o590o614n567m028k785k334k523k938l577m751
54528A82505o374p719p875o518m447l317m079n494n084k153J034J830J46j990
$$ plain form
54622 144392 145972 146289 145643 145410 145680 145283 144172 143982 145938 149719 154610 160238 165845 170451 174415 179503
54606 179503 186690 194959 202826 209956 216528 222071 225949 228529 231003 234189 237896 241332 243949 246008
54592 246008 248256 250963 253873 257475 263426 272589 283340 293289 302499 313369 327251 342869 358579
54579 358579 374577 391942 410668 429787 448778 467722 486250 502960 515875 523367 524958 521428
54567 521428 513839 502538 487462 469203 449094 428375 407954 388681 370941 354099 337449 321626
54555 321626 307932 296323 285502 275232 266959 261485 257463 253225 248935 245753 243709 241725 239233
54542 239233 236524 233587 229669 224212 217622 211008 205441 201413 198628 196294 193771 190833 187256 182505
54528 182505 176131 168412 160537 154019 149572 146255 142176 136682 131598 129445 130479 132309 132455 130465
54514A30465k906k382j060L0q8j160j520k62J162R88O5P50L080M311K795L33n17
54497A34084J61M36k84n96N60K390L382L087K206J475J015P31P73J381K422L359
54481A56582L720L513L225L387M066M753M976N017N550O488O853O273N782O425
54467B26610P721Q502Q644Q668Q085N754J941j499l281l780l879m068m804o280
54453B48334p560p424o364o056o661o614n569n267o450p242o099m405m203n008
54439A63412m876l438j997j548k215l619m397k782P24K836J601n65k44K023L051
54424A47966K110J413J996K482K136K101K830L041K195J644K181K525J497k9n54
54409A75534L4R87K033L033L392K824J957J440J114N97Nl40k46N13J868K807K107
$$ plain form
54514 130465 127559 125177 124117 124147 124059 122899 121379 121117 122279 123267 123332 124082 127162 131473 134268 134601 134084
54497 134084 134245 134681 134397 133801 134361 136751 140133 143220 145426 146901 147916 148647 149420 150801 153223 156582
54481 156582 160302 163815 167040 170427 174493 179246 184222 189239 194789 201277 208130 214403 220185 226610
54467 226610 234331 242833 251477 260145 268230 273984 275925 274426 271145 267365 263486 259418 254614 248334
54453 248334 240774 233350 226986 220930 214269 207655 202086 196819 190369 183127 177028 172623 168420 163412
54439 163412 158536 155098 153101 151553 149338 145719 141322 138540 139264 142100 143701 143136 142892 144915 147966
54424 147966 150076 151489 153485 155967 158103 160204 163034 166075 168270 169914 172095 174620 176117 176088 175534
54409 175534 175568 176555 178588 181621 185013 187837 189794 191234 192348 192945 192950 192610 192364 192877 194745 197552 199659
54392A99659L7j797k413k319k162j887j648k160l319l692k364m05M52n1p97j045
54376A74089j146j682k641l466l615l068k319j797j453j086p95o61l89J75N38
54361A50684L66K74Q79J512J109P6j55O38J195R41Q63J763K913L265K891K587
54345A71801K917M075N828P081O554M470K694K610L716M915O034P284Q064P511
54331B45554N791M014K970K496J866M12j865l998m840m432m061m633n535n588
54317B28151m572l341k762l029l654l863l296k489k339l013l830m192m016l222
54303A80533j686P1J024Q71M05L19L50N5l43m44l35k12J14Q66J908L137M643O113
54285A97389O732O235N347M658L811K511J557J784K531K309Q40p26j592k221l041
$$ plain form
54392 199659 199696 197899 195486 193167 191005 189118 187470 185310 181991 178299 175935 175530 175982 175931 175134 174089
54376 174089 172943 171261 168620 165154 161539 158471 156152 154355 152902 151816 151021 150360 149971 150146 150684
54361 150684 151050 151324 152203 153715 154824 154900 154745 155383 156578 157519 158382 160145 163058 166323 169214 171801
54345 171801 174718 178793 184621 191702 198256 202726 205420 208030 211746 216661 222695 229979 238043 245554
54331 245554 251345 255359 258329 260825 262691 263103 261238 257240 252400 247968 243907 239274 233739 228151
54317 228151 223579 220238 217476 214447 210793 206930 203634 201145 198806 195793 191963 187771 183755 180533
54303 180533 178847 178918 179942 180813 181218 181537 181887 181942 181599 181155 180820 180608 180722 181588 183496 186633 191276 197389
54285 197389 204121 210356 215703 220361 224172 226683 228240 230024 232555 234864 235704 234978 233386 231165 228124
54270B28124l363k346n62L30n22k265l534m121m923o418p810p919o552m575k914
54255A70630j925j621j970k837l876m631m677l897k772k255k903m268n362n645
54241A21991n271m585l758k798j681n60J9m98j771k551j950l84J080J705J071
54226A00059r24l268m013k548r26j475l463l904j604J400K757K459J892J719J730
54211H9891J851K101K124J562O35j50m55p6J034K373L029K594J505L80n13r48
54195A06937p17j04K66K43J97J80m9j10P45K140K449R32j044j738j145n46o06
54178A08030j018j433j781j806j310o97n25n35P8J330K118J587L12l90j60r3j225
54161A02482k884l270j750J47N69l66j018n36L48Q16J086J623K102J801O03q44
$$ plain form
54270 228124 224761 222415 221853 222183 221661 219396 215862 211741 206818 200400 192590 184671 178119 173544 170630
54255 170630 168705 167084 165114 162277 158401 153770 149093 145196 142424 140169 137266 132998 127636 121991
54241 121991 116720 112135 108377 105579 103898 103338 103357 102859 101088 98537 96587 96203 97283 98988 100059
54226 100059 99135 95867 91854 89306 88380 86905 83442 79538 77934 79334 82091 84550 86442 88161 89891
54211 89891 91742 93843 95967 97529 98164 98014 97559 97483 98517 100890 103919 106513 108018 108398 107885 106937
54195 106937 106220 106116 106382 106625 106822 107002 106953 106843 107588 109728 112177 113109 112065 110327 109182 108636 108030
54178 108030 107012 105579 103798 101992 100682 99985 99460 98925 99003 100333 102451 104038 104350 103960 103800 103707 102482
54161 102482 99598 96328 94578 94725 95294 94928 93910 93374 93722 94538 95624 97247 99349 101150 101753 100909
54145A00909j731j617o89L59R05Q29J38j405l661n508n711m302k331m60J246K350
54129G9321K223J261P20R62J009K37o73r68r16j038j192r70l25P38K084K818J838
54112H7129l94j905j746j242j760k569k282j297j059j569j353J18J573J731P70
54097G4145k83p39n42p3P3l23p36m91K87R20J213J563K018K011J221K16k00J20
54079H0400O83J030J003N26m22j512k056j666p78m9O21J725K738K167k35k323
54063H1852j937J26J072j54j743j851q44r5pk63q49j800k595k750k326j337N40
54046F5039K871M156L616K434K095K298J811O65l2r4m21j210j478p38K11N72O33
54029H2428R18J196J014N74L35J20o05j765k508k117p42P96J639J369K42q18p14
$$ plain form
54145 100909 99178 97561 96872 97231 98136 98965 99103 97698 94037 88529 82818 78516 76185 75725 76971 79321
54129 79321 81544 82805 83525 84487 85496 85733 85060 84092 83176 82138 80946 79976 79651 80389 82473 85291 87129
54112 87129 86735 84830 83084 81842 80082 77513 75231 73934 72875 71306 69953 70071 71644 73375 74145
54097 74145 73862 73123 72581 72508 72581 72258 71522 71031 71318 72238 73451 75014 77032 79043 80264 80480 80280 80400
54079 80400 81083 82113 83116 83642 83220 81708 79652 77986 77208 77159 77780 79505 82243 84410 84175 81852
54063 81852 79915 80041 81113 80959 79216 77365 76521 76426 76419 76156 75307 73507 70912 68162 65836 64499 65039
54046 65039 67910 72066 75682 78116 80211 82509 84320 84985 84953 84859 84438 83228 81750 81012 81223 81795 82428
54029 82428 83346 84542 85556 86130 86465 86585 85980 84215 81707 79590 78848 79644 81283 82652 82894 82076 81362
54012H1362Q81L040M327M167L192K240J525R64P36Q53N94p01k321k572p66J804
53996I9325L226K990K207K157K970L745L761L296L037K972K440J347N24N76J173
53981A35746J900K848L739L588K286J428K251L657L866L189L236M105M578M767
53967A81184O100Q484R928R564Q781Q589Q164O973O186O518O616N207L341K713
53953B78348L075L054K537K510L131L606L541L144K421J178l68j783k893l582
53939B97919l799m089n245o949p794p189o071n226m307l186k622k705k274j057
53925B35406o45j940l404l455k858k831k504q26M53j264n120p360o146l286j100
53910A93120l6J81n44j702j882o27P19P27l89j420j680j313p22j46M92J374K221
$$ plain form
54012 81362 82243 85283 89610 93777 96969 99209 100734 101698 102434 103287 103881 103180 100859 98287 97521 99325
53996 99325 102551 105541 107748 109905 112875 116620 120381 123677 126714 129686 132126 133473 133997 134573 135746
53981 135746 137646 140494 144233 147821 150107 151535 153786 157443 161309 164498 167734 171839 176417 181184
53967 181184 187284 195768 205696 215260 224041 232630 240794 247767 253953 260471 267087 272294 275635 278348
53953 278348 281423 284477 287014 289524 292655 296261 299802 302946 305367 306545 306177 304394 301501 297919
53939 297919 294120 290031 284786 277837 270043 262854 256783 251557 247250 244064 241442 238737 236463 235406
53925 235406 234761 232821 229417 225962 223104 220273 217769 216943 217396 216132 211012 203652 197506 194220 193120
53910 193120 193084 193265 192721 191019 189137 188510 189229 189956 189567 188147 186467 185154 184432 184286 184778 186152 188373
53893A88373K314J485O20N68J030J326J577K271L160L505L100K322J658J763L204
53878B18276N443O943P092O916P153P060O260O094P426Q517P265M421K456K073
53864C03395K010J591J192P13r9k44J329L541M390M064M427N762O518O240O149
53849C50978O628O732O521P338R240J0503J0365R964R977R513Q112O653N494L853
53835D61871J836Q29J014N77j477l712m604m477m144l482k616k671m033n541o556
53820D22814p935r830j0543r121p282p036q005q758r198r737r656q361p138p598
53806C02616r091r534q199o085m166k816k367k802l339l519m066n449o481n818
53792B28884m112l182l601m459n020n167m683l516k429k201k491k575k661l296
$$ plain form
53893 188373 190687 192172 192792 193360 194390 195716 197293 199564 202724 206229 209329 211651 213309 215072 218276
53878 218276 223719 230662 237754 244670 251823 258883 265143 271237 278663 287180 294445 298866 301322 303395
53864 303395 305405 306996 308188 308901 308802 308558 309887 313428 317818 321882 326309 332071 338589 344829 350978
53849 350978 357606 364338 370859 378197 387437 397940 408305 418269 428246 437759 445871 452524 458018 461871
53835 461871 463707 464536 465550 466127 464650 460938 456334 451857 447713 444231 441615 438944 434911 429370 422814
53820 422814 414879 405049 394506 385385 378103 371067 363062 354304 345106 335369 325713 317352 310214 302616
53806 302616 293525 283991 275792 269707 265541 262725 260358 257556 254217 250698 246632 241183 234702 228884
53792 228884 224772 221590 217989 213530 208510 203343 198660 195144 192715 190514 188023 185448 182787 179491
53778A79491m030l948l125k288j425o3J389J915J389O98M80P16J294J981K122
53763A76596J403N44L19L42o1l75L25J471J547M51k44L78J377J596J218J073J310
53746A89270J546J747K296L344M551N411N659N482N347N628O454P764R168R839
53732B63506R215P806O730O305N974N636N912O744P078O594O377O944O986N395
53718C57202L314K534K809K520J427P13N94j36j942l645m187m044m280n208o398
53703C41273p330p599p179o511n985n432m670m103m046l959l413l173m037n065
53689B68771m579k805j787k420l366l339k922l136l653l514k751k155k010j970
53675B28364j820j676j636j736j944j880j002N48J728J689P85J43N07J655K737
$$ plain form
53778 179491 175461 171513 168388 166100 164675 164612 166001 167916 169305 170003 170483 171199 172493 174474 176596
53763 176596 177999 178543 178862 179204 179143 178768 179093 180564 182111 182562 182318 182696 184073 185669 186887 187960 189270
53746 189270 190816 192563 194859 198203 202754 208165 213824 219306 224653 230281 236735 244499 253667 263506
53732 263506 272721 280527 287257 293562 299536 305172 311084 317828 324906 331500 337877 344821 351807 357202
53718 357202 360516 363050 365859 368379 369806 370519 371113 370977 369035 365390 361203 357159 352879 347671 341273
53703 341273 333943 326344 319165 312654 306669 301237 296567 292464 288418 284459 281046 277873 273836 268771
53689 268771 264192 261387 259600 257180 253814 250475 247553 244417 240764 237250 234499 232344 230334 228364
53675 228364 226544 224868 223232 221496 219552 217672 216670 217218 218946 220635 221420 221563 222070 223725 226462
53660B26462L046K695K480K715K533J130n92q68M34J477J123M97J066K380L025
53645B49603K843K775L010K885K470K647L493M029L946M164N025N301M077K497
53631B98765K288L285L949L940M400N601O146N209M026M030M670M450L382K811
53617C56952L366M457N519O251N795L432M18o48J042L419M379M232M248M189K906
53602D09957N77j307j889j572q95j07K65l78j739k828l110k665j442N10K065J683
53586C97125n56k693l248k826k748l044k863k170j786j874j502j11J364J533M19
53571C75020m24K20J752K605K257J759K200L338M192M400M384M349L944L041K298
53556D15335K549L881N533O641O885O522O031N836O178O896P305O744N551N135
$$ plain form
53660 226462 229508 232203 234683 237398 239931 241061 240469 239601 240035 241512 242635 243132 244198 246578 249603
53645 249603 252446 255221 258231 261116 263586 266233 269726 273755 277701 281865 286890 292191 296268 298765
53631 298765 301053 304338 308287 312227 316627 322228 328374 333583 337609 341639 346309 350759 354141 356952
53617 356952 360318 364775 370294 376545 382340 385772 386190 385542 386584 390003 394382 398614 402862 407051 409957
53602 409957 410534 409227 407338 405766 404871 404764 405029 404651 402912 400084 396974 394309 392867 393377 395442 397125
53586 397125 396569 393876 390628 387802 385054 382010 379147 376977 375191 373317 371815 371704 373068 374601 375020
53571 375020 374596 374816 376568 379173 381430 383189 385389 388727 392919 397319 401703 406052 409996 413037 415335
53556 415335 417884 421765 427298 433939 440824 447346 453377 459213 465391 472287 479592 486336 491887 497022
53542D97022O498Q928J0781J1405J1402J1217J0536R446Q948R552J0211R600P976
53529F23522O896P330Q762R875R581P664N138L668M086N570O742P109O986O594
53515G19523N992N487N176M480L012J549J125J370R84k21j010o56k1j67r61j714
53499G43948k298k855k967k080m95P95J196Q59J5j339k848l540k693p98Q64J618
53483G27382J934K423K852K677K113J892K106K169J929K019K812L962N277P053
53469G68600Q986R868R307Q837J0028J2161J3319J3325J4005J6388J9305K1219
53457I25348K2075K2549K2770K2908K4070K7204L1380L4447L5564L5980L7080
53446A241375L8628L9593L9979M0839M2736M5161M7524M9831N1996N3470N4189
$$ plain form
53542 497022 503520 512448 523229 534634 546036 557253 567789 577235 586183 595735 605946 615546 623522
53529 623522 630418 637748 646510 656385 665966 673630 678768 682436 686522 692092 698834 705943 712929 719523
53515 719523 725515 731002 736178 740658 743670 745219 746344 747714 748698 748477 747467 746811 746790 746623 745662 743948
53499 743948 741650 738795 735828 733748 733253 734048 735244 736103 736118 734779 731931 728391 725698 724900 725764 727382
53483 727382 729316 731739 734591 737268 739381 741273 743379 745548 747477 749496 752308 756270 761547 768600
53469 768600 777586 787454 796761 805598 815626 827787 841106 854431 868436 884824 904129 925348
53457 925348 947423 969972 992742 1015650 1039720 1066924 1098304 1132751 1168315 1204295 1241375
53446 1241375 1280003 1319596 1359575 1400414 1443150 1488311 1535835 1585666 1637662 1691132 1745321
53435A745321N5227N7557O0495O2387O2583O1841O0913N9927N9204N9450O0660
53424B405565O1841O2270O2278O2336O2308O2062O1905O1904O1619O1043O0869
53413C086000O1110O0487N7973N4193N0404M6933M3472M0122L7124L4227L1349
53402C603394K9233K8454K8250K7244K4893K1505J7576J3822J0941Q434M652r62
53390C817436o848j1781j6832k3062k8694l1256l1831l4245l9887m6023m9854
53379C497123n1701n3166n4385n4723n4680n5352n6766n7984n8444n8316n7823
53368B883783n6827n4847n1427m6926m2814m0308l8792l6499l2833k8870k5507
53357B428133k2346j8850j5331j2203r062n080K92P100J4581K1082K5369K8195
$$ plain form
53435 1745321 1800548 1858105 1918600 1980987 2043570 2105411 2166324 2226251 2285455 2344905 2405565
53424 2405565 2467406 2529676 2591954 2654290 2716598 2778660 2840565 2902469 2964088 3025131 3086000
53413 3086000 3147110 3207597 3265570 3319763 3370167 3417100 3460572 3500694 3537818 3572045 3603394
53402 3603394 3632627 3661081 3689331 3716575 3741468 3762973 3780549 3794371 3805312 3813746 3818398 3817436
53390 3817436 3810588 3798807 3781975 3758913 3730219 3698963 3667132 3632887 3593000 3546977 3497123
53379 3497123 3445422 3392256 3337871 3283148 3228468 3173116 3116350 3058366 2999922 2941606 2883783
53368 2883783 2826956 2772109 2720682 2673756 2630942 2590634 2551842 2515343 2482510 2453640 2428133
53357 2428133 2405787 2386937 2371606 2359403 2350341 2345261 2345553 2352653 2367234 2388316 2413685 2441880
53345B441880L1539L6162M1002M5002M8315N1520N5094N9684O5385P0558P3211
53334C019352P4032P6032Q0430Q4994Q7643Q9579R3143R8346J03600J08549J13922
53323D029622J19351J23648J26896J30364J34321J37615J39452J40082J39781
53314E221132J38506J36782J35551J34877J33754J31384J27722J22766J16345
53305F398819J08761J00726R2557Q4311P6574O9988O3859N6533M7653L8932L1890
53294G170603K5664J8026Q126k749j2966k2386l2257m3822n7414p2555q8445j04048
53282F785777j17972j28869j36257j40803j43608j45408j46553j47290j47593
53273E531424j47046j45470j43521j42067j41005j39436j37074j34693j32713
$$ plain form
53345 2441880 2473419 2509581 2550583 2595585 2643900 2695420 2750514 2810198 2875583 2946141 3019352
53334 3019352 3093384 3169416 3249846 3334840 3422483 3512062 3605205 3703551 3807151 3915700 4029622
53323 4029622 4148973 4272621 4399517 4529881 4664202 4801817 4941269 5081351 5221132
53314 5221132 5359638 5496420 5631971 5766848 5900602 6031986 6159708 6282474 6398819
53305 6398819 6507580 6608306 6700863 6785174 6861748 6931736 6995595 7052128 7099781 7138713 7170603
53294 7170603 7196267 7214293 7222419 7219670 7206704 7184318 7152061 7108239 7050825 6978270 6889825 6785777
53282 6785777 6667805 6538936 6402679 6261876 6118268 5972860 5826307 5679017 5531424
53273 5531424 5384378 5238908 5095387 4953320 4812315 4672879 4535805 4401112 4268399
53264D268399j30171j25995j20825j16389j12986j08860j02677r5504q9224q3862
53254C181906p8056p1779o6582o2750n8147n1095m2928l6222l1499k7241k2487
53243B633120j7648j3226r371o571n109l863j257K509N716P753R703J2137J4227
53230B628120J5750J8031K1761K5616K8354L0904L4760L9469M3433M6482M9916
53219B982596N4279N8583O1671O3174O3122O1748N9836N8410N7778N7312N6166
53208C634675N3861N0412M6333M2393L9115L6656L5064L4033L2300K8525K3199
53197D056566J8578J5779J2979P698R7p408j3351j8591k4602l1697l9229m6550
53185C930269n3401n9858o6051p1664p5957p8698q0705q2873q5055q6410q6475
$$ plain form
53264 4268399 4138228 4012233 3891408 3775019 3662033 3553173 3450496 3354992 3265768 3181906
53254 3181906 3103850 3032071 2965489 2902739 2844592 2793497 2750569 2714347 2682848 2655607 2633120
53243 2633120 2615472 2602246 2592875 2586304 2581195 2577332 2576075 2578584 2584300 2592053 2601756 2613893 2628120
53230 2628120 2643870 2661901 2683662 2709278 2737632 2768536 2803296 2842765 2886198 2932680 2982596
53219 2982596 3036875 3095458 3157129 3220303 3283425 3345173 3405009 3463419 3521197 3578509 3634675
53208 3634675 3688536 3738948 3785281 3827674 3866789 3903445 3938509 3972542 4004842 4033367 4056566
53197 4056566 4075144 4090923 4103902 4111600 4111697 4104289 4090938 4072347 4047745 4016048 3976819 3930269
53185 3930269 3876868 3817010 3750959 3679295 3603338 3524640 3443935 3361062 3276007 3189597 3103122
53174C103122q5257q2803p9597p6867p5478p4775p3508p1626p0128o9339o8575
53163B275169o7486o6559o6004o5207o3664o1665n9644n7608n5482n3285n0692
53152A607873m7185m3040l9402l6852l4631l1858k9018k7409k7382k7870k7678
53141A235548k6655k5463k4593k3909k3038k1935k1001k0711k1132k1873k2409
53130I82829k2414k1855k0878j9768j9027j9174k0108k0782k0122j8514j7721
53119G62466j8762k0410k0579j8811j6449j4585j3091j1688j0678j0132r558r007
53107E88716r412j0968j2214j1789j0360r630r935j0096r424q616q527q993r236
53094D59516q808p768o425n174m463m607n497o417o462n499m590m793n557n213
$$ plain form
53174 3103122 3017865 2935062 2855465 2778598 2703120 2628345 2554837 2483211 2413083 2343744 2275169
53163 2275169 2207683 2141124 2075120 2009913 1946249 1884584 1824940 1767332 1711850 1658565 1607873
53152 1607873 1560688 1517648 1478246 1441394 1406763 1374905 1345887 1318478 1291096 1263226 1235548
53141 1235548 1208893 1183430 1158837 1134928 1111890 1089955 1068954 1048243 1027111 1005238 982829
53130 982829 960415 938560 917682 897914 878887 859713 839605 818823 798701 780187 762466
53119 762466 743704 723294 702715 683904 667455 652870 639779 628091 617413 607281 597723 588716
53107 588716 579304 568336 556122 544333 533973 524343 514408 504312 494888 486272 477745 468752 459516
53094 459516 450708 442940 436515 431341 426878 422271 416774 410357 403895 398396 393806 389013 383456 378243
53080C78243l242j099l28p28j188j469k159l353m282m255l329k211j781k362l220
53065C43237l234k265j188l28J001K897L956L016R63l57m25j81m08r80j350r07
53049C43447O46K436K616M92k183l110k120p84n3K90L29j44o12j97Q13J158M66
53032C43490l09m40p6O90K121L728M201L061J486Q52J189J539J234L36p71j843
53016C60488k964m239n266n349m682m529n483o265n426l631k792l309l772l343
53002B99438k725k532k397k240k921m726o320o217m541k560j240r10j721l469
52988B54919n183n628m333k067l59l69j834l179l116k009j160j074j112o94j09
52973B22693n4r58k577l845l556j821l09l10j270k118l038m422n057l510q55L17
$$ plain form
53080 378243 375001 373902 373574 372846 371658 370189 368030 364677 360395 356140 352811 350600 348819 346457 343237
53065 343237 340003 337738 336550 336222 337223 340120 344076 347092 348055 347698 347273 347092 346684 345704 344354 343447
53049 343447 344093 346529 349145 349637 347454 344344 342224 341440 341387 341677 342006 341862 341250 341053 341866 343024 343490
53032 343490 343181 342741 342665 343355 345476 349204 353405 356466 357952 358804 359993 361532 362766 363102 362331 360488
53016 360488 357524 353285 348019 342670 337988 333459 327976 321711 316285 312654 309862 306553 302781 299438
53002 299438 296713 294181 291784 289544 286623 281897 275577 269360 264819 262259 261019 260109 258388 254919
52988 254919 249736 244108 239775 237708 237349 236980 235146 231967 228851 226842 225682 224608 223496 222802 222693
52973 222693 222639 221681 219104 215259 211703 209882 209573 209263 207993 205875 202837 198415 193358 189848 188993 189310
52957A89310l71p40K59R47Lj184p85N53Q06n43k282l333l510k965k034j266q32
52940A72033k50P45J636J875J570J032L27l63o78p26r04r67l05O87Q29Lo28n19
52922A75397k80L5J213K708K407r0k063j309N60O28r55j576k38J404J773R91k10
52905A80395j299j542m81J051J599R73L25M71J291K533M003N048N103M670M626
52890B08766M744M163L057K555L001L654M047M335M347L720L081L689N573P264
52876B65996P651O924N487L296P02j246k005k016j651p09N31R06j70j763k667
52861B79266k876l130l635m012m124m260m616m995m836l559j262R41J834J345
52847B42081L82n85j801l115l593k688j101M4J73o91k058k898k393j194r15j838
$$ plain form
52957 189310 188939 188199 188458 189405 189408 188224 187439 187992 188798 188255 185973 182640 179130 176165 174131 172865 172033
52940 172033 171783 172528 174164 176039 177609 178641 178968 178605 177927 177201 176297 175330 175025 175712 176541 176544 175916 175397
52922 175397 175117 175152 176365 179073 181480 181390 179327 178018 178578 179206 178251 176675 176437 177841 179614 180605 180395
52905 180395 179096 177554 177073 178124 179723 180696 181021 181492 182783 185316 189319 194367 199470 204140 208766
52890 208766 213510 217673 220730 223285 226286 229940 233987 238322 242669 246389 249470 253159 258732 265996
52876 265996 273647 280571 286058 289354 290056 288810 286805 284789 283138 282429 282960 283866 283696 281933 279266
52861 279266 276390 273260 269625 265613 261489 257229 252613 247618 242782 239223 237961 238902 240736 242081
52847 242081 242463 241878 240077 236962 233369 230681 229580 229624 229797 229106 227048 224150 221757 220563 219648 217810
52831B17810k336j266J92K97n93o97L80J109L78j013j651j324q91r07r52k28J375
52814B09683K917L241K277J134O86O18L62K82J027K102K321J538Q10O17J53j071
52798B28697k146k152j657j697j887j008P80J802J238L20M97J472K050K092K443
52783B30844L238L665L452L435M052M393L573K319K107L021L591K783J188jk72
52768B71388L54J870L867N221M978L423J607K26m08J40J834L323L034J283J9J65
52752C02324N34l6r06j125j228k055k800k258j333k161m700o440n964m758m653
52737B62441n256n177m310l448k819k343k436l266l954l876l776m335m545l251
52723B09649j503j337k604l145k118j040j114j486r94q0Q9p23j882k774l037k682
$$ plain form
52831 217810 215474 214208 214400 214697 214104 213407 213787 214896 215274 214261 212610 211286 210395 209488 208536 208308 209683
52814 209683 212600 215841 218118 219252 219938 220556 220918 221200 222227 224329 226650 228188 228998 229615 229768 228697
52798 228697 226551 224399 222742 221045 219158 218150 218930 220732 221970 222290 222787 224259 226309 228401 230844
52783 230844 234082 237747 241199 244634 248686 253079 256652 258971 261078 264099 267690 270473 271661 271660 271388
52768 271388 271742 273612 277479 282700 287678 291101 292708 292934 292526 292666 294500 297823 300857 302140 302159 302324
52752 302324 302858 302822 301916 300791 299563 297508 294708 292450 291117 288956 284256 277816 271852 267094 262441
52737 262441 257185 252008 247698 244250 241431 239088 236652 233386 229432 225556 221780 217445 212900 209649
52723 209649 208146 206809 204205 201060 198942 197902 196788 195302 194308 194228 194317 193594 191712 188938 185901 183219
52707A83219k373k774l287k560n49J082J144K26p44j902l430m401l942k685j885
52692A55139j714j553j441k021l270m333m521l841k724j724j237j054n59K95P27
52677A26169K38o28j107j092p62j85J52n83k176k953j793K48J360J240P79K93
52661A19200m51r69m92M44M38p35j730j617r46m94j78L35P70O88J69m91j234k000
52643A10707k386k002j004JN54Q17J341K212K618J741J45o60j98L00j05m73N81
52626A14189K669M142M357M064L781L150J966P38l8k28L88J942L711M449L810
52611A53090K743K355K835L553L647K741J595J589K732K952O25k784m269l150
52597A70254j553j007r10p29j433l364m724l949k167j435j709j587j230k072l741
$$ plain form
52707 183219 180846 178072 174785 172225 171676 172758 173902 174128 173384 171482 168052 163651 159709 157024 155139
52692 155139 153425 151872 150431 148410 145140 140807 136286 132445 129721 127997 126760 125706 125147 125442 126169
52677 126169 126407 125779 124672 123580 122818 122633 122785 122202 120026 117073 115280 115528 116888 118128 118907 119200
52661 119200 118749 117780 117288 117732 118170 117435 115705 114088 113142 112648 112470 112805 113575 114263 114432 113941 112707 110707
52643 110707 108321 106319 105315 105316 105870 106687 108028 110240 112858 114599 114744 114084 113886 114186 114081 113608 114189
52626 114189 116858 121000 125357 129421 133202 136352 138318 139056 139018 138790 139178 141120 144831 149280 153090
52611 153090 155833 158188 161023 164576 168223 170964 172559 174148 176880 179832 180457 177673 173404 170254
52597 170254 168701 167694 166784 166055 164622 161258 156534 152585 150418 148983 147274 145687 144457 142385 138644
52582A38644l787j273J318J172j164k655j776j33N6j256k260j742l79M39L98L99
52566A26001J190K347K879K468J703J145O07l26j386j706j009k32n25j779k686
52551A28691k320j227o09q43j189p86L35J200Q20p11j976j582K16J700J813J326
52535A24858J476K154K365K050K269L357L980K656k60k722l111j722j6J208K212
52520A40754L004K599O60r06L29L838O102M971K472J962L635M687L350Q78n61
52505A77774l61M67O39l59j745j895j15K205L147K681K356K725K626J242n88j640
52489A89159j693j050J42J439J935J248M7r70j768k278k009j003k60m00o89j84
52473A81666Q56J485J489J371J432J592J801J942J633O98l87j000j020o08J21
$$ plain form
52582 138644 134857 133584 134902 136074 134910 132255 130479 130346 130402 129146 126886 125144 124765 125204 125602 126001
52566 126001 127191 129538 132417 134885 136588 137733 138340 138014 136628 134922 133913 133681 133156 131377 128691
52551 128691 126371 125144 124535 123692 122503 121717 122052 123252 124072 123361 121385 119803 120019 121719 123532 124858
52535 124858 126334 128488 130853 132903 135172 138529 142509 145165 144905 142183 139072 137350 137334 138542 140754
52520 140754 143758 146357 147017 146111 146440 150278 156380 161351 163823 165785 169420 174107 177457 178335 177774
52505 177774 177413 177880 178519 178160 176415 174520 174405 176610 179757 182438 184794 187519 190145 191387 190799 189159
52489 189159 187466 186416 186558 187997 189932 191180 191227 190257 188489 186211 184202 183199 182939 182539 181850 181666
52473 181666 182522 184007 185496 186867 188299 189891 191692 193634 195267 195965 195578 194578 193558 192950 193071
52458A93071R15J267R68K86n89j606k132j192R67K562K419J545J486J967J633
52443B03567N83M24J724K981K634R64o17j308j315j162j242j637j911j419j95
52428B02071Q28Q59K73Q6O54J213Q87j80q69l13R81J523M89j242k102j644p77
52411B02737k38M04J724L092L211J837J43p77r97j039p92J97J697K899L319L064
52395B20481K357J466J023J502K316K335J561J284K097K764J903j1j292j150j19
52380B38517J168K417L100K600J167j70q22j049j155j113j064j383j891j717l32
52365B38273J610K809K444Q32q25j510j410j563k213k214p84R81J399M67m71q24
52349B37001j003r10M8J330J465L60l58R7M93j15n84N44K651L953L953L538L237
$$ plain form
52458 193071 193986 195253 196221 196507 195918 194312 192180 190988 191955 194517 196936 198481 199967 201934 203567
52443 203567 204150 204574 206298 209279 211913 212877 212260 210952 209637 208475 207233 205596 203685 202266 202071
52428 202071 202899 203758 204031 204117 204771 205984 206871 206691 205822 205509 206490 208013 208502 207260 205158 203514 202737
52411 202737 202499 202903 204627 207719 210930 212767 212910 212133 211136 210097 209305 209502 211199 214098 217417 220481
52395 220481 222838 224304 225327 226829 229145 231480 233041 234325 236422 239186 241089 241078 239786 238636 238517
52380 238517 239685 242102 245202 247802 248969 248799 247977 246928 245773 244660 243596 242213 240322 238605 238273
52365 238273 239883 242692 245136 245968 245143 243633 242223 240660 238447 236233 235449 236430 237829 238296 237825 237001
52349 237001 235998 235088 235136 236466 237931 238291 237933 238030 238523 238408 237824 238368 241019 244972 248925 252463 255700
52332B55700K767K057J635J849K392K602J892L55r05n21J516L602M241L409J997
52317B84588P93M65J391K833L259K288J284J236J342P71M42J381K483J954L75
52302C06885R7J734L335L350K536K211K310K092J636J602K154K970L750M192L918
52287C44772K975K047J707J764J677J212M31n51j395j469l78J481L208M167M374
52272C66022M255M196M256M207L798K992K015J341J492K572L903M468L949L074
52258D12540K774L213L850M163M094M020M397N259O065O413O812Q071R841J0683
52244D92195R966Q850Q744R597J0484J1300J2670J4390J5090J3841J1593J0525
52232F29245J1933J4772J6515J5694J3554J2626J3886J5989J7277J7431J6914
$$ plain form
52332 255700 258467 260524 262159 264008 266400 269002 270894 271249 270344 269823 271339 274941 279182 282591 284588
52317 284588 285381 285846 287237 290070 293329 295617 296901 298137 299479 300250 300692 302073 304556 306510 306885
52302 306885 306982 308716 312051 315401 317937 320148 322458 324550 326186 327788 329942 332912 336662 340854 344772
52287 344772 347747 349794 351501 353265 354942 356154 356585 356034 354639 353170 352792 354273 357481 361648 366022
52272 366022 370277 374473 378729 382936 386734 389726 391741 393082 394574 397146 401049 405517 409466 412540
52258 412540 415314 418527 422377 426540 430634 434654 439051 444310 450375 456788 463600 471671 481512 492195
52244 492195 502161 511011 519755 529352 539836 551136 563806 578196 593286 607127 618720 629245
52232 629245 641178 655950 672465 688159 701713 714339 728225 744214 761491 778922 795836
52221G95836J5933J4673J3706J3418J3606J4030J4593J4733J3841J2686J2928
52210I49983J4344J4338J1534Q230P348Q363Q631P810P996R717J0651R057O175
52197A074177M248L824L971L791K804J041n03o28L40O60l44j223o24P18J228P21
52181A094201K08K28O28J570L477N955P735Q043P549P711R174J0976J1603J0921
52167A179979J0534J1689J3468J4123J3721J3922J5063J5338J3602J1449J1057
52156A323945J2038J2052J0216Q354Q517J0307J1302R754O362L328J944J555R52
52143A420626N6m98r04k007l607m387m024m078n812q140q956p908o649o501p029
52128A350182p021o087m917m435m902n620n582m608l657l747m748n610n556m631
$$ plain form
52221 795836 811769 826442 840148 853566 867172 881202 895795 910528 924369 937055 949983
52210 949983 964327 978665 990199 998429 1005777 1014140 1022771 1030581 1038577 1048294 1058945 1068002 1074177
52197 1074177 1078425 1082249 1086220 1090011 1092815 1093856 1093353 1092725 1093065 1093725 1093381 1092158 1091534 1092252 1093480 1094201
52181 1094201 1094409 1094637 1095265 1096835 1100312 1106267 1114002 1122045 1129594 1137305 1146479 1157455 1169058 1179979
52167 1179979 1190513 1202202 1215670 1229793 1243514 1257436 1272499 1287837 1301439 1312888 1323945
52156 1323945 1335983 1348035 1358251 1366605 1375122 1385429 1396731 1406485 1412847 1416175 1418119 1419674 1420626
52143 1420626 1420682 1420184 1419280 1417273 1413666 1409279 1405255 1401177 1395365 1387225 1378269 1370361 1363712 1357211 1350182
52128 1350182 1343161 1337074 1332157 1327722 1322820 1317200 1311618 1307010 1303353 1299606 1294858 1289248 1283692 1279061
52114A279061l294j970j025p01q99j338j943k859m093n262n830n462m357l335
52100A236693l482n270p789r089p836m848k695l295n934q034p918o284m874m516
52086A154829m904n570o167o209n464m527m178m309m263m049m277m926n212m936
52072A085838m865n465o115o105n635n277n068m760m358l978l672l857n144p113
52058A014426p943o257l037p38n39j282j298n14k06j041j998j517O38L096M469
52043I96259M626M159L397K701L159N553Q713J0294R683Q900R927J2271J4110
52030A093752J5020J6089J7880J9667K0776K1495K2213K2635K2473K2249K2760
52019A317009K3896K4610K4064K2443K0546J8907J7568J6481J5683J5055J4334
$$ plain form
52114 1279061 1275767 1273797 1272772 1272071 1271172 1269834 1267891 1265032 1260939 1255677 1249847 1244385 1240028 1236693
52100 1236693 1233211 1227941 1220152 1211063 1203227 1198379 1195684 1192389 1186455 1178421 1170503 1164219 1159345 1154829
52086 1154829 1149925 1144355 1138188 1131979 1126515 1121988 1117810 1113501 1109238 1105189 1100912 1095986 1090774 1085838
52072 1085838 1080973 1075508 1069393 1063288 1057653 1052376 1047308 1042548 1038190 1034212 1030540 1026683 1021539 1014426
52058 1014426 1006483 1000226 997189 996451 995912 994630 993332 992818 992612 991571 989573 988056 988694 991790 996259
52043 996259 1000885 1005044 1008441 1011142 1014301 1019854 1028567 1038861 1048544 1057444 1067371 1079642 1093752
52030 1093752 1108772 1124861 1142741 1162408 1183184 1204679 1226892 1249527 1272000 1294249 1317009
52019 1317009 1340905 1365515 1389579 1412022 1432568 1451475 1469043 1485524 1501207 1516262 1530596
52008A530596J3395J2259J0775Q852P179O864P806Q158O249K601r41l501n404
51995A604888o473n876l972k708l308m714n226m772m587n299o376p055o988o312
51981A531222n592n425n632n349m309l329k950k479j291k42m99j435j186O82K479
51966A494665K658J628Q46R84J710K513K967K568J151n85j583j591j429j896k830
51951A501776l594m152n064o295o938o555o238p440j0105j2927j5316j7875k0684
51938A378593k2514k2663k2453k3623k5806k6907k5896k4087k3454k4581k6566
51927A110043k8253k9070k9126k8881k8568k7917k6630k5134k4373k4724k5448
51916H11919k5487k4561k3240k2111k1207k0308j9501j9165j9371j9522j8901
$$ plain form
52008 1530596 1543991 1556250 1567025 1575877 1583056 1589920 1597726 1605884 1612133 1614734 1613793 1610292 1604888
51995 1604888 1598415 1592539 1588567 1585859 1582551 1577837 1572611 1567839 1563252 1557953 1551577 1544522 1537534 1531222
51981 1531222 1525630 1520205 1514573 1509224 1504915 1501586 1498636 1496157 1494866 1494624 1494125 1492690 1491504 1492186 1494665
51966 1494665 1497323 1498951 1499797 1500781 1502491 1505004 1507971 1510539 1511690 1511105 1509522 1507931 1506502 1504606 1501776
51951 1501776 1498182 1494030 1488966 1482671 1475733 1469178 1462940 1455500 1445395 1432468 1417152 1399277 1378593
51938 1378593 1356079 1333416 1310963 1287340 1261534 1234627 1208731 1184644 1161190 1136609 1110043
51927 1110043 1081790 1052720 1023594 994713 966145 938228 911598 886464 862091 837367 811919
51916 811919 786432 761871 738631 716520 695313 675005 655504 636339 616968 597446 578545
51905E78545j7499j6084j5326j5033j4359j2698j0372q447p746p894p590o122
51893D39375m365l876n067o740p341o260m105k249k054l747o002p083o598n604
51879C68284n167n447o073o501n905l889j549p25j706k754k513j736j800k687
51865C19832l501m107m801n069m161k612j698j525r90K31J077Q73L95M97O51k24
51849B94868k050l581l891l235k488k236k510l077l615l728l094j932j114j362
51835B56955k275k672k222k024l015m316m033j692J024K186J624O47K37J45k44
51820B40325o90l21R44J805R80r86k159j538j86L18j28m11Q4Q39J113P57O6n53
51802B40259o83j02R13J726J886J357L78o65j253r25L78K123L314L152J896R92
$$ plain form
51905 578545 561046 544962 529636 514603 500244 487546 477174 468727 460981 453087 445497 439375
51893 439375 435010 431134 426067 419327 411986 405726 401621 399372 397318 393571 387569 380486 373888 368284
51879 368284 363117 357670 351597 345096 339191 335302 333753 333028 331322 328568 326055 324319 322519 319832
51865 319832 316331 312224 307423 302354 298193 295581 293883 292358 291368 291599 292676 293549 293944 294441 295092 294868
51849 294868 292818 289237 285346 282111 279623 277387 274877 271800 268185 264457 261363 259431 258317 256955
51835 256955 254680 252008 249786 247762 244747 240431 236398 234706 235730 237916 239540 240187 240424 240569 240325
51820 240325 239635 239314 240258 242063 243043 242057 239898 238360 238174 238492 238364 237953 238037 238876 239989 240746 240812 240259
51802 240259 239576 239474 240387 242113 243999 245356 245734 245069 243816 242891 243269 245392 248706 251858 253754 254746
51786B54746J652L294L967K589J97j372j383l98P55J530J675J442J640K732M002
51771B77068M092K371m74l026m005k944n83J587K538K527K508K969L513L321J951
51756B93413%j067l44J228J775Q36j12J29Q68Q45K44K90J376K603K984K390J479
51739C08937J068J271J111j98j522p15K167M252L549J707J417K502K899K492L156
51724C34093N102O076M843L264L736O204Q780J0032R649P939N829M611M920O286
51710D21364Q071J0003J1368J0844Q027M395J818N59n12k148l947n152n571n639
51696D53480n888o385o642o184n137m082l481l517m038m311l272q76J256J505
51682D02428L40l05L50J133Q67j75j056j427j416j146p88n44k58L25Q26N66l49
$$ plain form
51786 254746 256398 259692 263659 266248 266445 265073 263690 263292 264047 265577 267252 268694 270334 273066 277068
51771 277068 281160 283531 283057 280031 276026 273082 272499 274086 276624 279151 281659 284628 288141 291462 293413
51756 293413 293413 292346 292002 293230 295005 295841 295729 295858 296726 297571 297815 298105 299481 302084 305068 307458 308937
51739 308937 310005 311276 312387 312189 310667 309952 312119 316371 319920 321627 323044 325546 328445 330937 334093
51724 334093 339195 345271 350114 353378 357114 363318 372098 382130 391779 399718 405547 410158 415078 421364
51710 421364 429435 439438 450806 461650 469677 474072 475890 476449 475937 473789 469842 464690 459119 453480
51696 453480 447592 441207 434565 428381 423244 419162 415681 412164 408126 403815 400543 399667 400923 402428
51682 402428 402768 402463 402813 403946 404813 404638 403582 402155 400739 399593 398805 398261 398003 398328 399154 399720 399371
51665C99371j187j884l046m438m795l672k347k165k861l240k779j881j165j028
51651C62883j404j619j044o5L96L18M80Q63N61l81o52L51J728K845M083N012L921
51634C78276P75j401k11K513L264J876J220K490L757L435K421J982J863J645K128
51619D06033L889N794O205M863K575j41l156o109q662j0715j1768j0847q015n290
51605C64656m816o398p802p372n485l622k936l763n505o663n830l147l39J078
51591C02056J206R72O68o0j121j828j885j738j723j584j247j304k018k376j154
51576B86864J170K536J587q70k924l443k483p43P29P62r79l176l750j919Q87K425
51560B76673J817K01n73K60J865K823K463J173k23r96o41R14K932M213M244L840
$$ plain form
51665 399371 398184 396300 393254 388816 384021 380349 378002 375837 372976 369736 366957 365076 363911 362883
51651 362883 361479 359860 358816 358751 359147 359465 359945 360808 361369 360988 360336 360687 362415 365260 369343 374355 378276
51634 378276 379051 377650 377439 379952 383216 385092 386312 388802 392559 395994 398415 400397 402260 403905 406033
51619 406033 409922 415716 421921 426784 429359 429218 426062 419953 411291 400576 388808 377961 369946 364656
51605 364656 359840 353442 345640 338268 332783 329161 326225 322462 316957 310294 304464 301317 300978 302056
51591 302056 303262 304234 304902 304842 303721 301893 300008 298270 296547 294963 293716 292412 290394 288018 286864
51576 286864 288034 290570 292157 291287 288363 284920 282437 281694 282423 283185 282206 279030 275280 273361 274248 276673
51560 276673 278490 278691 278118 278378 280243 283066 285529 286702 286479 285483 284842 285756 288688 292901 297145 300985
51544C00985M232N527O529O144M702L597L691M418M573L738K544J733J379J244
51530C55036J249J284R55J21n76l19Q36J914J989R45n80j631j649j079q72r92
51514C56631j61K220M676N377M671M432N184N670N307N075N391N058L418J925
51500D14874K118L238L463K607J968K081K218J811R82k10j607k271j447j95n53
51485D29077k765m851n289m763m493m274l385k375k461l453l838l007k154k399
51471C79570k963k229p1J788J907P86P7O08J717K311J979J112L45J9j42p54j827
51454C84233k257q71J846L793L333J029j072j472k86J282J969J276j79j104o96
51439C90824N99J656J926J858K113K729L259L529L809M019L293J222o88n9L210
$$ plain form
51544 300985 305217 310744 317273 323417 328119 331716 335407 339825 344398 348136 350680 352413 353792 355036
51530 355036 356285 357569 358524 358645 358069 357750 358586 360500 362489 363434 362854 361223 359574 358495 357623 356631
51514 356631 356470 358690 363366 368743 373414 377846 383030 388700 394007 399082 404473 409531 412949 414874
51500 414874 416992 420230 423693 426300 428268 430349 432567 434378 435360 435150 433543 431272 429825 429630 429077
51485 429077 426312 421461 416172 411409 406916 402642 399257 396882 394421 390968 387130 384123 381969 379570
51471 379570 376607 374378 374307 376095 378002 378788 378865 379473 381190 383501 385480 386592 386937 386956 386814 386060 384233
51454 384233 381976 381105 382951 386744 390077 391106 390034 388562 388276 389558 391527 392803 392624 391520 390824
51439 390824 391423 393079 395005 396863 398976 401705 404964 408493 412302 416321 419614 420836 420148 420089 423299
51424D23299O048N655L022J440K144L379L688L860M866N881N688M684M057L932
51410D81643L710L479L774M382M540L922K579M16k300m445n116m759m368m190
51396D83267m168m848o449p714p240n634m709m821m700l900l471l755l407j621
51382D16830J24j36k179l904l798k146k30Q29N62o16j593j433k10J146J768J436
51366D06450N43k59l86K85J117R51r37l796n738n687m853n305p036p716o020l845
51350C57768l765n331n699l707j314p21j779l013l776m191m058l118k048k002
51336C13246l130m357m703m237l580k991k251j263l74kj55n71j229k348l810n024
51320B73221n512n234m192k354k70R78J010O62O55M93m61j666k289k691l612m413
$$ plain form
51424 423299 429347 435002 438024 439464 441608 444987 448675 452535 457401 463282 468970 473654 477711 481643
51410 481643 485353 488832 492606 496988 501528 505450 508029 508445 506145 501700 496584 491825 487457 483267
51396 483267 479099 474251 467802 460088 452848 447214 442505 437684 432984 429084 425613 421858 418451 416830
51382 416830 416954 416818 414639 410735 406937 404791 404561 405390 405952 405336 403743 402310 402100 403246 405014 406450
51366 406450 406993 406734 406348 406633 407750 408701 407764 403968 398230 392543 387690 382385 375349 367633 361613 357768
51350 357768 354003 348672 342973 339266 337952 337231 335452 332439 328663 324472 320414 317296 315248 313246
51336 313246 310116 305759 301056 296819 293239 290248 287997 286734 286360 286358 286203 285632 284403 282055 278245 273221
51320 273221 267709 262475 258283 255929 255659 256637 257647 258309 258964 259457 258996 257330 255041 252350 248738 244325
51304B44325l831k308j663k276k459j196K61M83K1K16J085J747K066K494K839
51289B41804K495J624J078J315K255L844N844P195O748M708K539J269N43m49j779
51274B81033k807l063k768k591l000l813m508m846m930m698l917k861k409k982
51260B31840l864m085l594l029k663k242j682j209q69m47L6L19K91J8n81j562
51244B06677k513k885k844l070l581l430k006k8J367J996K385K473J694L64o7
51229A96532J144K736K925J720P20O75O26k77j218r90M2L89m44j447j764j736
51213A99633j965k184j750q19k72o18j390j835j858k027k573k790j879k79N34
51198A77928o9r69q20N8L01m35j179j368j638k414k782j623O48K281K113P64k26
$$ plain form
51304 244325 240494 238186 236523 234247 231788 230592 230853 231336 231357 231573 232658 234405 236471 238965 241804
51289 241804 244299 245923 247001 248316 250571 254415 260259 267454 274202 278910 281449 282718 283261 282812 281033
51274 281033 278226 275163 272395 269804 266804 262991 258483 253637 248707 244009 240092 237231 234822 231840
51260 231840 227976 223891 220297 217268 214605 212363 210681 209472 208603 208156 208192 208511 208802 208820 208239 206677
51244 206677 204164 201279 198435 195365 191784 188354 186348 186320 187687 189683 192068 194541 196235 196599 196532
51229 196532 197676 200412 203337 205057 205777 206452 207078 206801 205583 204593 204635 205024 204580 203133 201369 199633
51213 199633 197668 195484 193734 192915 192643 192025 190635 188800 186942 184915 182342 179552 177673 177394 177928
51198 177928 177859 176890 176070 176128 176429 175994 174815 173447 171809 169395 166613 164990 165638 167919 170032 170796 170570
51181A70570j15L67J15q03j091J35K115L342L223K282J136J50j31P55K381L655
51165A88086L922L255J826n1j413j331k59M48L88L58N32O2r76r88P39K518K570
51148A99686J650J798L310M652M811M106L022J897J533K430L432K804Q70j95M34
51133B36240R87j62k186l301l219k688j791l40P11J06j545k102o79J258K036J715
51117B25040J148K46j554l593m136k419L00K130K342J498L53p80j712k095j782
51102B14986j219j136j738k406k358j456k77N25O40J3j076j750j008R25K243J339
51086B06247j234l423m143m061l913l245j570K26P44j23j118j226n51K27O11M96
51070A83944J88J65M93O78L93pj52l54r26j336r00kL30o2l57o7M60Q23Q76K68
$$ plain form
51181 170570 170455 170822 170937 170134 169043 169178 171293 174635 177858 180140 181276 181426 181295 182050 184431 188086
51165 188086 192008 195263 197089 197038 195625 194294 194035 194483 194871 195229 195761 195823 194847 193859 194598 197116 199686
51148 199686 201336 203134 206444 211096 215907 220013 223035 224932 226465 228895 232327 235131 236001 235806 236240
51133 236240 237227 237065 234879 231578 228359 225671 223880 223540 224251 224357 222812 220710 220031 221289 223325 225040
51117 225040 226188 226434 224880 221287 217151 214732 215032 217162 219504 221002 221355 220575 218863 216768 214986
51102 214986 213767 212631 210893 208487 206129 204673 204396 204921 205561 205574 204498 202748 201740 202665 204908 206247
51086 206247 205013 201590 197447 193386 189473 186228 184658 184884 185628 185505 184387 183161 182610 182837 183448 183944
51070 183944 184132 184297 184790 185468 185861 185854 185702 185348 184422 183086 182186 182184 182514 182452 182095 182028 182488 183311 184187 184455
51050A84455j131k246j418J416M085M394K381n0j142n38Q22J533R16k68o69L5
51034A92575R84J571K119K857L253K995K703K959L336L182K734K596K610K149
51020B28623J369J237K213L443L657K647J614J811K884L220K264J637K802M430
51006B63851L935J458K6J090K203O74k374l734k706j611k083l136l152k009o34
50991B51798K36K43n83j464j385l81L94J58n60q28m69L7L12L27J44k56j031k288
50973B44404l611l947k512J75K634L779L624K826K114K060K717L384L231K349
50959B63227J721J968K612K678J793N71R0Q67K198K802K440K276L083L728K663
50944B94717O57M28L154O640P977O959N762N755O050N310L824L157M214O241P682
$$ plain form
51050 184455 183324 181078 179660 181076 185161 189555 191936 191886 190744 190206 191028 192561 193477 193209 192540 192575
51034 192575 193559 195130 197249 200106 203359 206354 209057 212016 215352 218534 221268 223864 226474 228623
51020 228623 229992 231229 233442 236885 240542 243189 244803 246614 249498 252718 254982 256619 259421 263851
51006 263851 267786 269244 269270 270360 272563 273237 270863 267129 264423 262812 260729 257593 254441 252432 251798
50991 251798 252034 252277 251694 250230 248845 248464 248858 249016 248456 247628 247159 247196 247508 247835 247979 247723 246692 244404
50973 244404 240793 236846 234334 234509 237143 240922 244546 247372 249486 251546 254263 257647 260878 263227
50959 263227 264948 266916 269528 272206 273999 274570 274660 275527 277725 280527 282967 285243 288326 292054 294717
50944 294717 295374 295802 298956 305596 313573 320532 326294 332049 338099 343409 347233 350390 354604 360845 368527
50929C68527P740P087P086Q359J0221J1735J2991J4734J6742J7509J6204J4226
50917E13161J3869J5625J7978J9852K1906K4787K7444K8472K8397K9273L2248
50906G73012L6689M1386M5527M8539N0335N1878N4307N7306N9452O0445O1604
50895A340480O3748O5827O6344O4913O1727N6828N0785M4974M0022L4980K9175
50884A919803K3833K0407J8108J4851J0170N542J936j207m309o488o694n184l334
50871A987434k634m057p621j2160j6045j8612k0748k3961k9006l5189m0778m4410
50859A732213m6457m8635n1861n4932n6060n5130n3657n2681n1661m9472m5730
50848A165937m1075l6684l3486l1441k9705k7730k5785k3952k1330j7154j2222
$$ plain form
50929 368527 376267 383354 390440 398799 409020 420755 433746 448480 465222 482731 498935 513161
50917 513161 527030 542655 560633 580485 602391 627178 654622 683094 711491 740764 773012
50906 773012 809701 851087 896614 945153 995488 1047366 1101673 1158979 1218431 1278876 1340480
50895 1340480 1404228 1470055 1536399 1601312 1663039 1719867 1770652 1815626 1855648 1890628 1919803
50884 1919803 1943636 1964043 1982151 1997002 2007172 2012714 2014650 2013443 2009134 2002646 1995952 1990768 1987434
50871 1987434 1984800 1980743 1973122 1960962 1944917 1926305 1905557 1881596 1852590 1817401 1776623 1732213
50859 1732213 1685756 1637121 1585260 1530328 1474268 1419138 1365481 1312800 1261139 1211667 1165937
50848 1165937 1124862 1088178 1054692 1023251 993546 965816 940031 916079 894749 877595 865373
50837H65373q283o123n126m428l645k585j167L41J655K869L970M411L993L599
50823H54854M056M701M356L376L246M229M925M601M405N650P939R763J0286R915
50809I36302R679J0484J2569J5253J7563J9173K0499K1972K3726K5900K8571L1554
50797A173245L4762L8585M3210M7928N1964N5794O0624O6739P3284P9653Q6001
50786A811789R2422R8686J04820J11090J17303J22999J28212J33083J36982J38983
50776B996369J38989J37197J32816J24860J14006J02092Q9778P6396O2174M8580
50766D023257L6209K4290J3008M101j661n709r036j0275q042l689L1J946K407
50753D066837J185k544q525j5575k3313l2507m3520n5486o7125p7647q6930r5250
$$ plain form
50837 865373 857090 850967 845841 841413 837768 835183 834016 834357 836012 838881 842851 847262 851255 854854
50823 854854 858910 863611 867967 871343 874589 878818 883743 888344 892749 898399 906338 916101 926387 936302
50809 936302 945981 956465 969034 984287 1001850 1021023 1041522 1063494 1087220 1113120 1141691 1173245
50797 1173245 1208007 1246592 1289802 1337730 1389694 1445488 1506112 1572851 1646135 1725788 1811789
50786 1811789 1904211 2002897 2107717 2218807 2336110 2459109 2587321 2720404 2857386 2996369
50776 2996369 3135358 3272555 3405371 3530231 3644237 3746329 3836107 3912503 3974677 4023257
50766 4023257 4059466 4083756 4096764 4100865 4099204 4093495 4084459 4074184 4066142 4062453 4062484 4064430 4066837
50753 4066837 4068022 4065478 4056953 4041378 4018065 3985558 3942038 3886552 3819427 3741780 3654850 3559600
50741C559600j02687j08426j11061j09941j05830r9887r2801q5101p7361o9398
50731B597107o0273m9755l8879k8405j7847o889L500J2522K1003K9991L8766M5788
50719B546629N0920N5054N7993N8415N5773N0889M4736L7890L0973K4238J6815
50708C030325P720k401j1767j9763k7401l5421m3270n0387n7035o3385o8726p2365
50696B586124p4476p5503p5450p4203p1973o8725o3900n7366n0269m4143l9212
50685A890904l4189k7897k0619j3496o865J17P935J5561K1580K6150L0801L6325
50673A926307M1979M7123N2372N8393O4642P0336P5806Q1667Q7217R0887R1983
50662B688712R1036Q8788Q5699Q2014P7296P0283O0390M9018L8253K8502J8597
$$ plain form
50741 3559600 3456913 3348487 3237426 3127485 3021655 2921768 2828967 2743866 2666505 2597107
50731 2597107 2536834 2487079 2448200 2419795 2401948 2395059 2398559 2411081 2432084 2462075 2500841 2546629
50719 2546629 2597549 2652603 2710596 2769011 2824784 2875673 2920409 2958299 2989272 3013510 3030325
50708 3030325 3038045 3035644 3023877 3004114 2976713 2941292 2898022 2847635 2790600 2727215 2658489 2586124
50696 2586124 2511648 2436145 2360695 2286492 2214519 2145794 2081894 2024528 1974259 1930116 1890904
50685 1890904 1856715 1828818 1808199 1794703 1787838 1787955 1795890 1811451 1833031 1859181 1889982 1926307
50673 1926307 1968286 2015409 2067781 2126174 2190816 2261152 2336958 2418625 2505842 2596729 2688712
50662 2688712 2779748 2868536 2954235 3036249 3113545 3183828 3244218 3293236 3331489 3359991 3378588
50651C378588P900l077j3808k3863l1762l5494l4829l1760k8117k3909j8700j3248
50639C127921q698n154k091K83J122n7l194q063j4031j9829k4443k8246l2380
50626B983140l6946m0365m0810l7921l2889k7126k1224j5049q380j148O762J5323
50614B743367K4069L2484M0882N0287O1117P2617Q4046R5689J07872J19517J28805
50603C560752J35099J39270J42097J43172J41398J35802J25851J12075R6595Q2172
50593D814283P0112N9406M8201L5668K2487R951j170j1184k1014l0964m0346m8519
50581D906911n5577o1289o4201o3082n8922n3936m8764m2240l3998k5534j8256
50570D381112j2089o743k650J65K531M271L522m95n410q332r665j2148j6613k0978
$$ plain form
50651 3378588 3386488 3383411 3369603 3345740 3313978 3278484 3243655 3211895 3183778 3159869 3141169 3127921
50639 3127921 3119223 3114069 3111978 3112261 3113383 3113326 3110132 3102069 3088038 3068209 3043766 3015520 2983140
50626 2983140 2946194 2905829 2865019 2827098 2794209 2767083 2745859 2730810 2722430 2721282 2728044 2743367
50614 2743367 2767436 2799920 2840802 2891089 2952206 3024823 3108869 3204558 3312430 3431947 3560752
50603 3560752 3695851 3835121 3977218 4120390 4261788 4397590 4523441 4635516 4732111 4814283
50593 4814283 4884395 4943801 4992002 5027670 5050157 5060108 5058938 5047754 5026740 4995776 4955430 4906911
50581 4906911 4851334 4790045 4725844 4662762 4603840 4549904 4501140 4458900 4424902 4399368 4381112
50570 4381112 4369023 4362280 4359630 4359795 4362326 4366597 4370119 4369624 4364214 4355882 4346217 4334069 4317456 4296478
50556D296478k3497k4719k5428k4602k0725j4169o984q05M174Q518J2621J6237
50544D197099J8399J7880J4160P839m9q898j8555k8925m0006n1997o4918p8069
50532C963960r0184j00096j07309j12037j14908j16443j16719j15445j12427j07812
50522B870580j01942r5244q8203q1096p3757o6033n8473n1908m6175m0030l2810
50511B134909k5504j9377j4148q541k302L594Q743J3924J9499K4453K7894L0622
50499B193766L4182L8865M3673M7999N2364N7419O3035O8474P3027P6600Q0171
50488B829575Q5340R2747J01045J08145J13393J17756J21919J25056J25623J22704
50478C943303J16534J08408J00204R3258Q7762Q3693Q1853Q2714Q4651Q5034Q3468
$$ plain form
50556 4296478 4272981 4248262 4222834 4198232 4177507 4163338 4156354 4155549 4159723 4168241 4180862 4197099
50544 4197099 4215498 4233378 4247538 4255377 4255328 4246430 4227875 4198950 4158944 4106947 4042029 3963960
50532 3963960 3873776 3773680 3666371 3554334 3439426 3322983 3206264 3090819 2978392 2870580
50522 2870580 2768638 2673394 2585191 2504095 2430338 2364305 2305832 2253924 2207749 2167719 2134909
50511 2134909 2109405 2090028 2075880 2067339 2065037 2068631 2077374 2091298 2110797 2135250 2163144 2193766
50499 2193766 2227948 2266813 2310486 2358485 2410849 2468268 2531303 2599777 2672804 2749404 2829575
50488 2829575 2914915 3007662 3108707 3216852 3330245 3448001 3569920 3694976 3820599 3943303
50478 3943303 4059837 4168245 4268449 4361707 4449469 4533162 4615015 4697729 4782380 4867414 4950882
50467D950882Q2199Q2686Q3525Q2925Q1721Q2250Q5253Q9596R4399R9650J04923
50456E920009J08984J10907J10494J07706J02551R5353Q6013P3325N6199L5469
50446F807010J3299r124l2020n5133p6968r6213j12633j25977j35280j40073j41258
50435E895630j39806j35225j26249j12638r5598p6663n6914l7229j8700k684R456
50424E103380J6793J9263J7400J1451Q73j5106l6420o1584q7992j12884j34333
50413D720841j51533j64366j72948j77615j78882j77084j72416j65623j58063
50404C202311j50565j42681j33690j23764j13469j02788r1764q1663p4014o8367
50394B119546o2405n4720m6465l9693l4862l0576k5279j8812j2617q471o587n083
$$ plain form
50467 4950882 5033081 5115767 5199292 5282217 5363938 5446188 5531441 5621037 5715436 5815086 5920009
50456 5920009 6028993 6139900 6250394 6358100 6460651 6556004 6642017 6715342 6771541 6807010
50446 6807010 6820309 6811185 6779165 6724032 6647064 6550851 6438218 6312241 6176961 6036888 5895630
50435 5895630 5755824 5620599 5494350 5381712 5286114 5209451 5152537 5115308 5096608 5093924 5103380
50424 5103380 5120173 5139436 5156836 5168287 5169160 5154054 5117634 5056050 4968058 4855174 4720841
50413 4720841 4569308 4404942 4231994 4054379 3875497 3698413 3525997 3360374 3202311
50404 3202311 3051746 2909065 2775375 2651611 2538142 2435354 2343590 2261927 2187913 2119546
50394 2119546 2057141 2002421 1955956 1916263 1881401 1850825 1825546 1806734 1794117 1785646 1779059 1773976
50382A773976k019K358O351R521J3161J7884K2359K5277K7229K9591L2531L5361
50370A993580L8070M1179M4405M6833M8408N0225N3102N6619N9817O2291O4234
50359B558763O5787O6793O7295O7929O9400P1312P2015P0404O7692O6553O8262
50348C312205P1509P4298P6129P7622P8842P9021P7682P5194P2128O8607O4346
50337D127583N8848N1662M2756L2718K2282J1720P38j1086k3914l7593n1707o5751
50325D158256p9256r1767j02773j11691j17811j20231j18245j12278j03937r4616
50315C105651q4323p2659o0499m9594m0394l1414k1257j0451r17N649Q462P472
50303B755726L105m059j3649k5115l7007m7415n5462o1806o7376p2226p5743p7323
$$ plain form
50382 1773976 1771957 1774315 1780666 1790187 1803348 1821232 1843591 1868868 1896097 1925688 1958219 1993580
50370 1993580 2031650 2072829 2117234 2164067 2212475 2262700 2315802 2372421 2432238 2494529 2558763
50359 2558763 2624550 2691343 2758638 2826567 2895967 2967279 3039294 3109698 3177390 3243943 3312205
50348 3312205 3383714 3458012 3534141 3611763 3690605 3769626 3847308 3922502 3994630 4063237 4127583
50337 4127583 4186431 4238093 4280849 4313567 4335849 4347569 4348307 4337221 4313307 4275714 4224007 4158256
50325 4158256 4079000 3987233 3884460 3772769 3654958 3534727 3416482 3304204 3200267 3105651
50315 3105651 3021328 2948669 2888170 2838576 2798182 2766768 2745511 2735060 2734143 2739792 2748254 2755726
50303 2755726 2758831 2754772 2741123 2716008 2679001 2631586 2576124 2514318 2446942 2374716 2298973 2221650
50291B221650p6664p4064p0625o7350o4062o0025n5561n1775m8654m5001m0716
50280A567153l7252l5109l2642k8614k4303k1454j9624j7332j4585j2177r536
50269A314525n671j753mm0J160M985R218J1310J1741J2721J4941J7136J8098J7925
50255A426292J7673J8633K1470K5318K8122K8553K7151K5289K3851K3530K5268
50244A691150K8995L2445L2935L0496K7883K6954K6291K3288J7722J1966P969
50233A958094N314K511r46m451p440r751j1306j2304j3666j6326k0078k3784k6759
50220A819108k9249l1425l2911l3569l3919l4200l3818l2296l0193k8316k6669
50209A472543k5015k3913k4120k5111k5206k3437k0634j8320j7021j6037j4610
$$ plain form
50291 2221650 2144986 2070922 2000297 1932947 1868885 1808860 1753299 1701524 1652870 1607869 1567153
50280 1567153 1529901 1494792 1462150 1433536 1409233 1387779 1368155 1350823 1336238 1324061 1314525
50269 1314525 1308854 1307101 1307097 1307057 1308217 1313202 1322420 1333730 1345471 1358192 1373133 1390269 1408367 1426292
50255 1426292 1443965 1462598 1484068 1509386 1537508 1566061 1593212 1618501 1642352 1665882 1691150
50244 1691150 1720145 1752590 1785525 1816021 1843904 1870858 1897149 1920437 1938159 1950125 1958094
50233 1958094 1963408 1965919 1964973 1960522 1953082 1943331 1932025 1919721 1906055 1889729 1869651 1845867 1819108
50220 1819108 1789859 1758434 1725523 1691954 1658035 1623835 1590017 1557721 1527528 1499212 1472543
50209 1472543 1447528 1423615 1399495 1374384 1349178 1325741 1305107 1286787 1269766 1253729 1239119
50198A239119j2956j1834j1337j0526q710o598n395m943l880j696M77J579J926
50185A165226K155J986J096L67R94K710M009L891K557P36q37j516j157k51P36
50170A182702J762K423J792j14j668j610j025j870m294o882q921j0586j1293r994
50156A130422p379n725o016o831o650n665m600l354j837q79j146j927j982r43
50142A075488P83K624L814L653K539J931K471K989K201O35j46K43O28k13k271
50127A097369m456n484m995l983l684l982l771k999l050m488n922o211o451q099
50113A029794j0078r789o764l432k010k240k603k325j406J28J916K861K124M41
50099I96617l54P32K720L660K627N83p80q52m79n83r16n34Q71K589L703L808L133
$$ plain form
50198 1239119 1226163 1214329 1202992 1192466 1183756 1177158 1171763 1166820 1162940 1161244 1161721 1163300 1165226
50185 1165226 1167381 1169367 1170463 1170830 1171824 1174534 1178543 1182434 1184991 1185727 1184890 1183374 1182217 1181966 1182702
50170 1182702 1184464 1186887 1188679 1188565 1186897 1185287 1184262 1182392 1178098 1171216 1162295 1151709 1140416 1130422
50156 1130422 1123043 1117318 1111302 1104471 1097821 1092156 1087556 1084202 1082365 1081486 1080340 1078413 1076431 1075488
50142 1075488 1076271 1078895 1082709 1086362 1088901 1090832 1093303 1096292 1098493 1099128 1098982 1099225 1099853 1099640 1097369
50127 1097369 1092913 1087429 1082434 1078451 1074767 1070785 1067014 1064015 1060965 1056477 1050555 1044344 1037893 1029794
50113 1029794 1019716 1009927 1003163 999731 997721 995481 992878 990553 989147 989275 991191 994052 996176 996617
50099 996617 996263 996995 999715 1003375 1006002 1006585 1005805 1004953 1004474 1003891 1002975 1002441 1003312 1005901 1009604 1013412 1016545
50082A016545K345K235L098M405N296N389N010M791N169N999O509O060N200N385
50068A083436P147R092R548Q777Q498R423J0398J0231R354R078R853J1053J2019
50055A207907J2681J3099J3047J2322J1324J0981J1872J3462J4604J4961J5448
50044A351708J6958J9106K0804K1805K2849K4443K6427K8766L1889L5798L9732
50033A640285M3216M6776N1034N5775O0601O6103P3366Q2484R2328J01894J11231
50022B425093J21004J31697J43501J56391J69945J83241J95110K04351K09660
50013C939993K09769K03875J92017J75151J55021J33796J13433R5183P9726O7484
50003E365448N8402N1496M5131L7718K7766J3531o427l1978o1274r2228j23422
$$ plain form
50082 1016545 1018890 1021125 1024223 1028628 1033924 1039313 1044323 1049114 1054283 1060282 1066791 1072851 1078051 1083436
50068 1083436 1090583 1099675 1109223 1118000 1126498 1135921 1146319 1156550 1165904 1174982 1184835 1195888 1207907
50055 1207907 1220588 1233687 1246734 1259056 1270380 1281361 1293233 1306695 1321299 1336260 1351708
50044 1351708 1368666 1387772 1408576 1430381 1453230 1477673 1504100 1532866 1564755 1600553 1640285
50033 1640285 1683501 1730277 1781311 1837086 1897687 1963790 2037156 2119640 2211968 2313862 2425093
50022 2425093 2546097 2677794 2821295 2977686 3147631 3330872 3525982 3730333 3939993
50013 3939993 4149762 4353637 4545654 4720805 4875826 5009622 5123055 5218238 5297964 5365448
50003 5365448 5423850 5475346 5520477 5558195 5585961 5599492 5593065 5561087 5499813 5407585 5284163
49992E284163j53130j78220j95319k03211k03635j99643j93308j84910j73888
49983C598899j60537j46730j34542j24067j13354j01067q8522p8171p0747o5022
49973B516140n9974n5677n2081m8496m4774m1669l9330l6594l2744k8930k6733
49962B049138k5913k4772k2416j9608j7470j6256j5513j4703j3382j1282q519
49951A859304n637l357k088j400q3K661N986Q130Q581Q697R707J1269J2630J4191
49937A928591J6634J9340K1054K1623K1771K1616K0985K0874K2758K6223K9039
49926B170508L0126L0891L2912L5742L8143M0222M2971M6506N0163N3938N8593
49915B630715O4453P1132P8433Q6633R5802J05694J16397J28395J41790J56145
$$ plain form
49992 5284163 5131033 4952813 4757494 4554283 4350648 4151005 3957697 3772787 3598899
49983 3598899 3438362 3291632 3157090 3033023 2919669 2818602 2730080 2651909 2581162 2516140
49973 2516140 2456166 2400489 2348408 2299912 2255138 2213469 2174139 2137545 2104801 2075871 2049138
49962 2049138 2023225 1998453 1976037 1956429 1938959 1922703 1907190 1892487 1879105 1867823 1859304
49951 1859304 1853667 1850310 1848222 1846822 1846739 1849400 1855386 1863516 1872097 1880794 1890501 1901770 1914400 1928591
49937 1928591 1945225 1964565 1985619 2007242 2029013 2050629 2071614 2092488 2115246 2141469 2170508
49926 2170508 2200634 2231525 2264437 2300179 2338322 2378544 2421515 2468021 2518184 2572122 2630715
49915 2630715 2695168 2766300 2844733 2931366 3027168 3132862 3249259 3377654 3519444 3675589
49905C675589J71359J88080K06918K27696K49711K71977K92571L08116L15236
49896E907253L12863L02710K87209K67810K45596K22647K01455J83210J67681
49887H098434J54635J43953J34009J21455J03573P9705M9558J1529l5195q7416
49877H774240j38819j84425k22826k54239k78446k95610l07378l15544l20311
49868F456642l20898l17252l10043k99512k85717k69802k53653k37893k21336
49859C940536k03226j85235j69979j57769j46049j32680j18808j07335r9038r1739
49849B528678q3448p4840o7828o3001n9669n7464n6288n5281n3445n1210m9852
49838A856352m9371m8396m6239m3583m0895l7755l4285l1679l0361k8983k6280
$$ plain form
49905 3675589 3846948 4035028 4241946 4469642 4719353 4991330 5283901 5592017 5907253
49896 5907253 6220116 6522826 6810035 7077845 7323441 7546088 7747543 7930753 8098434
49887 8098434 8253069 8397022 8531031 8652486 8756059 8835764 8885322 8896851 8861656 8774240
49877 8774240 8635421 8450996 8228170 7973931 7695485 7399875 7092497 6776953 6456642
49868 6456642 6135744 5818492 5508449 5208937 4923220 4653418 4399765 4161872 3940536
49859 3940536 3737310 3552075 3382096 3224327 3078278 2945598 2826790 2719455 2620417 2528678
49849 2528678 2445230 2370390 2302562 2239561 2179892 2122428 2066140 2010859 1957414 1906204 1856352
49838 1856352 1806981 1758585 1712346 1668763 1627868 1590113 1555828 1524149 1493788 1464805 1438525
$$ [...]
##END NTUPLES=NMR SPECTRUM
##END=
