##TITLE=coffee_type TOSA01-ROVE100B_70-30%
COFFEE_meoh_noesyp64 COFFEE_meoh {C:\Bruker\TOPSPIN} Administrator 4
##JCAMPDX= 6.0         $$ Bruker NMR JCAMP-DX V2.0
##DATA TYPE= NMR SPECTRUM
##DATA CLASS= NTUPLES
##ORIGIN= Bruker BioSpin GmbH
##OWNER= Administrator
$$ 1.72 TOPSPIN		Version 2.1
$$ 2012-05-18 15:46:45.557 -0700  Administrator@X
$$ Compression mode = diff/dup
##.OBSERVE FREQUENCY= 400.13188235
##.OBSERVE NUCLEUS= ^1H
##.ACQUISITION MODE= SIMULTANEOUS (DQD)
##.ACQUISITION SCHEME= undefined
##.AVERAGES= 64
##.DIGITISER RES= 22
##SPECTROMETER/DATA SYSTEM= spect
##.PULSE SEQUENCE= noesygpps1d.comp
##.SOLVENT NAME= COFFEE_meoh
##.SHIFT REFERENCE= INTERNAL, COFFEE_meoh, 1, 14.98061
##AUDIT TRAIL= $$ (NUMBER, WHEN, WHO, WHERE, PROCESS, VERSION, WHAT)
$$ ##TITLE= Audit trail, TOPSPIN		Version 2.1
$$ ##JCAMPDX= 5.01
$$ ##ORIGIN= Bruker BioSpin GmbH
$$ ##OWNER= Administrator
$$ $$ C:\Bruker\TOPSPIN/data/Administrator/nmr/12-COFFEE-2402/62/pdata/1/auditp.txt
$$ ##AUDIT TRAIL=  $$ (NUMBER, WHEN, WHO, WHERE, PROCESS, VERSION, WHAT)
(   1,<2012-02-24 20:17:06.219 -0500>,<Administrator>,<TOPSPIN>,<go>,<TOPSPIN 2.1>,
      <created by zg
	started at 2012-02-24 20:05:35.859 -0500,
	POWCHK enabled, PULCHK disabled,
       configuration hash MD5:
       B0 76 FB 9C 50 81 44 7D 18 B3 26 32 4E 60 AD 96
       data hash MD5: 64K
       B1 30 DD 64 0E AC BA 0A 1B 5B 56 C7 F4 92 BE B1>)
(   2,<2012-02-24 20:17:09.250 -0500>,<Administrator>,<TOPSPIN>,<proc1d>,<TOPSPIN 2.1>,
      <Start of raw data processing
       efp LB = 0.3 FT_mod = 6 PKNL = 1 PHC0 = 0 PHC1 = 0 SI = 128K 
       data hash MD5: 128K
       04 D4 41 EC 37 E8 19 45 38 17 4F 18 51 2C 86 F5>)
(   3,<2012-02-24 20:17:10.656 -0500>,<Administrator>,<TOPSPIN>,<proc1d>,<TOPSPIN 2.1>,
      <pk PHC0 = 20.61584 PHC1 = 0 
       data hash MD5: 128K
       1B A0 0D E2 60 27 55 1E F5 9B 98 5D 63 F0 FD 8A>)
(   4,<2012-02-24 20:17:10.922 -0500>,<Administrator>,<TOPSPIN>,<proc1d>,<TOPSPIN 2.1>,
      <abs ABSG = 1 
       data hash MD5: 128K
       6A 10 76 C2 28 4B 27 B5 EC 27 3F 56 1F 6D EF 4E>)
(   5,<2012-02-24 20:17:11.031 -0500>,<Administrator>,<TOPSPIN>,<proc1d>,<TOPSPIN 2.1>,
      <abs ABSG = 2 
       data hash MD5: 128K
       49 C0 BC D4 57 2B 09 33 DE 51 EF 0D 30 1D 7B 8D>)
(   6,<2012-02-24 20:17:11.094 -0500>,<Administrator>,<TOPSPIN>,<proc1d>,<TOPSPIN 2.1>,
      <abs ABSG = 3 
       data hash MD5: 128K
       FE D4 3A 96 21 D3 57 4C EA F1 59 A2 A0 82 F0 44>)
(   7,<2012-02-24 20:17:11.203 -0500>,<Administrator>,<TOPSPIN>,<proc1d>,<TOPSPIN 2.1>,
      <abs ABSG = 4 
       data hash MD5: 128K
       9D 6F C9 C3 4C A7 8C 48 74 4A 1C E0 43 90 CE 2C>)
(   8,<2012-02-24 20:17:11.266 -0500>,<Administrator>,<TOPSPIN>,<proc1d>,<TOPSPIN 2.1>,
      <abs ABSG = 5 
       data hash MD5: 128K
       82 FE DB B2 03 70 72 91 43 42 75 8A 1D A2 6B 8D>)
(   9,<2012-02-24 20:17:11.391 -0500>,<Administrator>,<TOPSPIN>,<audit>,<TOPSPIN 2.1>,
      <user comment:
       ICON-NMR User ID: Administrator
$$ [...]
150 150 150 150 150 150 150 150
##$TP07= 0
##$TPNAME0= <>
##$TPNAME1= <>
##$TPNAME2= <>
##$TPNAME3= <>
##$TPNAME4= <>
##$TPNAME5= <>
##$TPNAME6= <>
##$TPNAME7= <>
##$TPOAL= (0..7)
0.5 0.5 0.5 0.5 0.5 0.5 0.5 0.5
##$TPOFFS= (0..7)
0 0 0 0 0 0 0 0
##$TUNHIN= 0
##$TUNHOUT= 0
##$TUNXOUT= 0
##$USERA1= <user>
##$USERA2= <user>
##$USERA3= <user>
##$USERA4= <user>
##$USERA5= <user>
##$V9= 5
##$VALIST= <valist>
##$VCLIST= <CCCCCCCCCCCCCCC>
##$VD= 0
##$VDLIST= <DDDDDDDDDDDDDDD>
##$VPLIST= <PPPPPPPPPPPPPPP>
##$VTLIST= <TTTTTTTTTTTTTTT>
##$WBST= 1024
##$WBSW= 4
##$XGAIN= (0..3)
0 0 0 0
##$XL= 0
##$YL= 0
##$YMAX_a= 14344418
##$YMIN_a= -6609862
##$ZGOPTNS= <>
##$ZL1= 120
##$ZL2= 120
##$ZL3= 120
##$ZL4= 120
##$ABSF1= 14.98061
##$ABSF2= -5.57192
##$ABSG= 5
##$ABSL= 3
##$ALPHA= 0
##$AQORDER= 0
##$ASSFAC= 0
##$ASSFACI= 0
##$ASSFACX= 0
##$ASSWID= 0
##$AUNMP= <proc_prof1d_extract>
##$AXLEFT= 0
##$AXNAME= <>
##$AXNUC= <1H>
##$AXRIGHT= 0
##$AXTYPE= 0
##$AXUNIT= <>
##$AZFE= 0.1
##$AZFW= 0.1
##$BCFW= 0
##$BC_mod= 0
##$BYTORDP= 0
##$COROFFS= 0
##$CY= 15
##$DATMOD= 1
##$DC= 0
##$DFILT= <>
##$DTYPP= 0
##$F1P= 0
##$F2P= 0
##$FCOR= 0.5
##$FTSIZE= 131072
##$FT_mod= 6
##$GAMMA= 0
##$GB= 0
##$INTBC= 1
##$INTSCL= 1
##$ISEN= 128
##$LB= 0.3
##$LEV0= 0
##$LPBIN= 0
##$MAXI= 10000
##$MC2= 0
##$MEAN= 0
##$ME_mod= 0
##$MI= 0
##$NCOEF= 0
##$NC_proc= -3
##$NLEV= 6
##$NOISF1= 0
##$NOISF2= 0
##$NSP= 0
##$NTH_PI= 0
##$NZP= 0
##$OFFSET= 14.98061
##$PC= 1
##$PHC0= 20.61584
##$PHC1= 0
##$PH_mod= 1
##$PKNL= yes
##$PPARMOD= 0
##$PPDIAG= 0
##$PPIPTYP= 0
##$PPMPNUM= 2147483647
##$PPRESOL= 1
##$PSCAL= 4
##$PSIGN= 0
##$PYNMP= <proc.py>
##$REVERSE= no
##$SF= 400.13
##$SI= 131072
##$SIGF1= 0
##$SIGF2= 0
##$SINO= 400
##$SIOLD= 131072
##$SPECTYP= <>
##$SREGLST= <1H.CDCl3>
##$SSB= 0
##$STSI= 131072
##$STSR= 0
##$SW_p= 8223.68421052632
##$SYMM= 0
##$S_DEV= 0
##$TDeff= 65536
##$TDoff= 0
##$TI= <>
##$TILT= no
##$TM1= 0
##$TM2= 0
##$TOPLEV= 0
##$USERP1= <user>
##$USERP2= <user>
##$USERP3= <user>
##$USERP4= <user>
##$USERP5= <user>
##$WDW= 1
##$XDIM= 131072
##$YMAX_p= 479856358
##$YMIN_p= -279616861
##$CURPLOT= <Network HP LaserJet P1505>
##$CURPRIN= <$Network HP LaserJet P1505>
##$DFORMAT= <normdp>
##$LAYOUT= <+/1D_H.xwp>
##$LFORMAT= <normlp>
##$PFORMAT= <normpl>
##$SURQMSG= 1
$$ End of Bruker specific parameters
$$ ---------------------------------
##NTUPLES= NMR SPECTRUM
##VAR_NAME=  FREQUENCY,     SPECTRUM/REAL,   SPECTRUM/IMAG
##SYMBOL=    X,             R,               I
##VAR_TYPE=  INDEPENDENT,   DEPENDENT,       DEPENDENT
##VAR_FORM=  AFFN,          ASDF,            ASDF
##VAR_DIM=   131072,        131072,          131072
##UNITS=     HZ,            ARBITRARY UNITS, ARBITRARY UNITS
##FACTOR=    0.0627417313425165, 1,          1
##FIRST=     8223.62146879498, 3154,         -102593
##LAST=      0,             8513,            -102364
##MIN=       0,             -279616861,      0
##MAX=       8223.62146879498, 479856358,    0
$$ Real data points
##PAGE= N=1
##DATA TABLE= (X++(R..R)), XYDATA
$$ [...]
66894 2509938 2537238 2564176 2591669 2620102 2649310 2678979 2709004 2739467 2770300 2801101 2831525
66883 2831525 2861847 2892792 2924633 2956744 2988320 3019231 3049717 3079513 3108143 3136237 3165676
66872 3165676 3197678 3231094 3263385 3293222 3321524 3350041 3379745 3410736 3442690 3474704 3505429
66861 3505429 3534265 3562181 3590562 3619473 3647828 3675090 3701767 3728187 3753878 3778639 3803225
66850 3803225 3828186 3852711 3875567 3896900 3918219 3940661 3963902 3986642 4007538 4025754 4041431
66839 4041431 4055868 4070665 4086359 4102174 4117097 4130585 4142138 4150994 4156978 4161285 4165657 4170749
66827 4170749 4175738 4179567 4182045 4183520 4183967 4182975 4180600 4177590 4174481 4170795 4165611 4158728 4150590 4141044
66813 4141044 4128980 4113817 4096842 4080340 4065509 4051724 4037566 4021822 4003633 3982700 3959680
66802 3959680 3935653 3910835 3884572 3857003 3829821 3804512 3780396 3755409 3728556 3700598 3672459
66791 3672459 3644059 3614935 3584996 3554149 3522072 3489085 3456634 3425974 3396504 3366105 3333223
66780 3333223 3298265 3263038 3229263 3197500 3166944 3136118 3104161 3071506 3039066 3006938 2974450
66769 2974450 2941410 2908463 2875882 2842840 2808608 2774075 2741219 2711064 2682730 2654454 2624940
66758 2624940 2593773 2561326 2528715 2497308 2467713 2439329 2411134 2382642 2353898 2324910 2295596
66747 2295596 2266192 2237283 2209372 2182597 2156779 2131467 2106062 2080242 2054321 2028946 2004400
66736 2004400 1980372 1956333 1931927 1907126 1882340 1858344 1835590 1813525 1791043 1767830 1744814
66725 1744814 1722998 1702207 1681406 1660022 1638472 1617542 1597730 1579185 1561853 1545506 1529928
66714 1529928 1515083 1500818 1486323 1470309 1452056 1432191 1412343 1394065 1377995 1363689 1350126
66703 1350126 1336641 1323469 1311055 1298803 1285174 1269470 1252974 1237608 1223745 1210131 1195826
66692 1195826 1181254 1167173 1153641 1140615 1128771 1118742 1109729 1099770 1087505 1073261 1058456 1044493
66680 1044493 1032280 1022079 1013333 1004838 995541 985263 974552 963851 952919 941144 928535 916270
66668 916270 905990 898304 892134 885677 877862 868804 859221 849798 840830 832080 823135 814258 806596 800996
66654 800996 796841 792727 788102 783471 779023 773995 767671 760094 751457 741693 731302 721817 714492 708914
66640 708914 703623 697844 691947 686560 682063 678706 676301 673693 669369 662902 655314 647820 640764 633912
66626 633912 627242 621013 615393 610325 605575 600715 595278 589235 583147 577649 572824 568271 563800 559899
66612 559899 557303 555970 554642 551786 547020 541274 535390 529169 522211 515249 509789 506515 504732 503412
66598 503412 502100 500556 498237 494711 490322 485945 482061 478362 474231 469525 464818 460900 458131 456422
66584 456422 455670 455721 455696 454015 449831 444176 438931 434795 430963 426733 422471 418791 415783 413551 412671 413263
66568 413263 414085 413373 410414 405669 399628 392417 384705 378235 374803 374673 376285 377577 377584 376676 375449 373793
66552 373793 371311 368223 365278 362801 360468 358045 355704 353428 350841 348042 345967 345335 345630 345732 345228
66537 345228 344513 343890 343234 342472 341722 340864 339438 337072 333749 329764 325801 322988 322287 323456 324779 324112
66521 324112 320514 315104 310266 307602 306572 305553 304226 304054 305944 308356 308780 306524 302901 298976 294634
66506 294634 290074 286674 285448 285525 285133 283565 281324 278778 275763 272493 269977 269104 269705 270794 271524 271763
66490 271763 271970 272528 273150 272932 271159 267979 264134 260284 256886 254485 253445 253194 252384 250290 247758 246262
66474 246262 246198 246612 246499 245757 244749 243659 242565 241674 240990 240147 238970 237802 236789 235357 233129 230937
66458 230937 230005 230334 230941 231535 232687 234141 234405 232691 230067 227847 225911 223691 221821 221367 221987 222227
66442 222227 221349 219582 216904 213118 209198 206960 206842 207138 205979 203276 200343 198474 198292 199552 201043
66427 201043 201342 200136 198331 196746 195490 194777 195200 196694 198212 199019 199385 199349 197863 194270 189851 186819
66411 186819 186211 187533 189850 192168 193365 193054 192364 192831 194508 195970 195967 194231 191056 187315 184754 184911
66395 184911 187293 189538 189787 188246 186225 184552 183333 182480 181820 181057 180121 179381 179289 179948 181001 181617 180687
66378 180687 177643 173234 169076 166284 164824 164094 163647 163302 163098 163275 163964 164924 165910 167023 168078 167981 165702
66361 165702 161909 158665 157279 157213 157349 157448 157969 159114 160479 161182 160337 158140 156443 157094 159433 160695
66345 160695 159445 157303 156426 156592 156132 154763 153765 153805 154105 153732 152399 149992 146648 143547 142449 143897
66329 143897 146649 149226 151141 152295 152143 150322 147629 145578 145035 145678 146686 147573 148407 149479 150716
66314 150716 151360 150389 147512 143715 140656 139276 138989 138361 136766 135183 135021 136316 137667 138002 137661 137394
66298 137394 137087 136159 134635 132996 131331 129522 127986 127305 127200 126842 126260 126516 128152 130204 131173 130513
66282 130513 128851 127214 126270 125948 125561 124568 123258 122427 122480 123297 124702 126360 127334 126663 124553 122251 120539
66265 120539 119185 117990 117402 117610 117973 118009 118201 119029 119831 119540 118192 116967 116894 118110 120109 122062 123041
66248 123041 122545 120786 118211 115047 111753 109490 109405 111486 114534 117165 118427 117889 115912 113840 113223
66233 113223 114589 117277 120375 123358 125840 127310 127441 126433 124866 123286 121896 120550 119118 117932
66219 117932 117602 118219 119088 119616 120138 121333 123007 124073 123794 122578 121386 120690 120215 119537 118745 118418 118918
66202 118918 119802 120218 119799 118820 117516 115849 114149 113198 113270 113676 113790 113903 114435 114954 114883 114745 115659 117803
66184 117803 120223 121993 122698 122043 120132 118067 117209 117717 118725 119851 121218 121952 120391 116525 112832
66169 112832 111513 111960 112151 111619 111450 111785 111171 108765 105853 104405 104829 105874 106362 106406 106937 108487 110606
66152 110606 112319 113016 112774 111989 111008 110218 110089 110726 111516 111676 111132 110524 110192 109589 108047 105999 104941
66135 104941 106013 108858 112135 114944 117316 119480 121255 122352 122733 122394 121297 119901 119115 119131 118872 117439
66119 117439 115646 115061 115789 116440 116305 116337 117502 119282 120442 120479 119687 118497 117351 116667 116330 115757 114893
66102 114893 114437 114520 114022 112073 109593 108244 108310 108739 109053 109965 111893 113861 114364 112886 110262 107858 106496
66085 106496 105876 105074 103778 102765 102783 103326 103217 102257 101576 102264 104192 106287 107432 107032 105223 102739 100248
66068 100248 97794 95146 92599 90941 90582 91206 92353 93880 95727 97586 99022 99852 100432 101647 104202
66053 104202 107519 109792 109825 108602 108249 109486 110925 110941 109403 107335 105746 105223 105961 107550 109079 110023
66037 110023 110788 112057 113805 115282 115837 115586 115356 115948 117175 117731 116487 113915 111649 110602 110214 109783
66021 109783 109653 110557 112336 114047 115024 115348 115556 116315 118039 120320 122047 122607 122694 123407 124837 126166 126948
66004 126948 127536 128255 128819 128753 127878 126249 124113 122134 121224 121745 123112 124475 125636 126940 128367 129077
65988 129077 128108 125325 121589 118048 115499 114227 113988 114001 113504 112726 112886 114619 116866 118123 118459 119184
65972 119184 120560 121309 120892 120870 122931 126495 129464 130731 130698 129834 128133 126005 124461 124210 125367 127883
65956 127883 131259 134061 135100 135197 136278 138446 139601 138778 138163 140398 145050 149418 152080 153809 155284
65941 155284 155857 155062 153962 154158 156226 159651 163631 167428 170398 172254 173132 173304 173108 173119 173680 174159 173415
65924 173415 171332 169237 168283 168009 167086 165087 162830 161286 160728 160794 160812 160200 159080 158435 159175 161070 163006
65907 163006 164216 164812 165236 165793 166774 168374 170172 171081 170230 167854 165198 163544 163216 163301 162453 160190 157277
65890 157277 154627 152288 150166 149266 150948 154718 157966 158659 157437 156235 155627 154753 153369 152395 152212 151709
65874 151709 149767 146902 144664 143931 144499 145971 148176 150724 152915 154418 155650 157158 158864 160175 160727
65859 160727 160760 160740 160830 160853 160709 160658 161103 162169 163580 164906 165784 166010 165727 165597 166413 168184 169828 170185 169272
65840 169272 168064 167097 165945 164365 163232 163567 165021 166252 166804 167648 169474 171262 171373 169629 167523
65825 167523 166449 166412 166587 166501 166392 166782 167957 169583 170605 169819 166923 163055 160071 159253 160609 163254
65809 163254 166237 168903 170626 170681 168869 166211 164431 164443 165652 166894 167483 166965 164612 160187 154996 151201
65793 151201 149949 150705 152219 153255 152594 149638 145476 142352 141512 142294 143707 145816 148840 151781 153068
65778 153068 152166 149762 146735 143722 141247 139372 137509 135403 134069 134832 137522 140385 141851 141781 141061
65763 141061 140637 140947 141723 142269 142266 142118 142238 142513 142985 144297 146528 148214 147899 146302 145578 146450 147594 147931
65745 147931 147872 147675 146220 142558 137660 133468 130896 129719 129841 131547 134723 138583 142045 144034 144052 143157
65729 143157 143671 146841 151068 153464 152961 150881 148571 145843 142232 138622 136520 136072 135830 134707 133457
65714 133457 133735 135962 138812 140934 142514 144504 146711 147633 146416 144174 142820 143081 144179 145100 145551
65699 145551 145889 146668 148257 150339 151747 151236 148643 145008 141405 137844 133596 128508 123648 120360 118806
65684 118806 117871 116645 115548 115578 116814 118328 119423 120213 120920 121319 121179 120595 119587 117918 115722 113780
65668 113780 112708 112205 111443 109845 107220 103694 99912 96836 94729 92837 90670 89244 90199 93687 97812
65653 97812 100288 100304 98744 97040 95977 95401 94948 94817 95548 97014 98181 98116 96843 94979 93117 91963
65637 91963 92328 94164 95969 96021 94162 91745 90063 89502 89987 91253 92475 92547 91186 89337 88153 87945
65621 87945 88292 88703 88866 88626 88196 88266 89546 92112 95314 98321 100692 102399 103400 103472 102705 102001 102506
65604 102506 104317 106154 106679 105887 104816 104192 103848 103325 102542 101809 101551 102061 103261 104646 105533 105374 103915
65587 103915 101448 99012 97858 98296 99331 99749 99278 98377 97372 96355 95613 95563 96346 97911 100255 103120
65571 103120 105755 107552 108728 109827 110688 110492 108732 105666 102059 98958 97388 97531 98331 98567 98195 98023
65555 98023 98355 98792 99170 99696 100195 100182 99815 99795 100130 100014 99248 98709 98886 98931 97962 96571 96203 97487 99892
65536 99892 102561 104686 105473 104713 103394 102997 104016 105618 106792 107267 107234 106726 105648 104207 102948 102389
65520 102389 102670 103461 104078 103781 102205 99638 96776 94138 91774 89628 87997 87319 87551 88188 88924 89847
65504 89847 90811 91191 90679 89872 89541 89626 89493 88949 88404 88191 88314 88725 89292 89560 89187 88566 88386 88570 88335
65485 88335 87440 86677 86898 88104 89849 92008 94604 97048 98115 96975 94294 92056 91889 93446 94855
65470 94855 94940 94432 94690 95916 97265 98022 97855 96498 94332 92898 93546 95664 97382 97944 98115 98339 98099
65453 98099 97505 97917 100076 102746 104326 104955 106018 108142 110688 112852 114294 114742 113748 111054 106970 102390
65437 102390 98469 95983 94853 94405 94018 93237 91672 89510 87915 88010 89489 91101 92352 93571 94442 94114
65421 94114 93160 93686 96565 99921 101482 101355 101294 102210 103722 105376 106968 108093 108621 109275 110693 112248
65405 112248 112856 112589 112489 113064 113965 114965 116240 117744 119112 120062 120372 119813 118746 118194 118467 118349 116627
65388 116627 113883 111572 109951 108308 106876 106843 108449 110568 112373 113982 115178 114975 113016 110133 106954
65373 106954 103134 98699 94969 93120 92661 92368 92113 92705 94266 95927 97132 98366 100205 102197 103187
65358 103187 102647 101328 100468 100472 100691 100458 99969 99947 100887 102948 105972 108940 109956 107915 104203 101720 101861
65341 101861 103256 103863 103583 104094 106484 109783 111983 112111 111058 110336 110326 110126 109166 108316 108926 111218 114276
65324 114276 117333 120333 123376 126391 129410 132499 135359 137651 139830 142914 147147 151443 154545 156384
65310 156384 158023 160602 164582 169796 175926 182876 190637 198874 207030 215044 223572 233010 242647 251190
65296 251190 257794 262063 263583 262386 259675 257157 255579 254424 252823 250003 245118 237716 228468 218617
65282 218617 208670 198435 188285 179391 172547 167651 164381 162338 160454 157387 152953 148266 144288 141260
65268 141260 139644 140062 141646 141945 139597 136024 133360 131615 129185 125444 121396 118119 115928 114935 115128
65253 115128 115695 115324 113600 111425 109825 108876 107931 106299 103543 99749 95841 93201 92501 93032 93403 92778
65237 92778 91283 89477 87823 86781 86954 88553 90643 91447 89864 86494 82885 80096 78345 77655 78047
65222 78047 79231 80829 82871 85425 87846 89162 89175 88411 87069 85069 83152 82661 83832 85513 87019
65207 87019 88953 91393 92703 91464 88639 86387 85362 84652 83875 83687 84189 84408 83748 82758 81988 81079 79635
65190 79635 78214 77728 78177 78584 78010 76330 74222 72768 73019 75573 80209 85710 90208 92264 92036 91169
65174 91169 91214 92266 93362 93857 93916 93909 94003 94448 95661 97594 99215 99062 96500 92482 88882 86955 86502 86600
65156 86600 86786 87073 87188 86691 85903 85721 86083 85563 83238 80282 78761 79192 80164 80193 79069 77314 75227
65139 75227 72938 70982 70242 71106 72738 73526 72577 70705 69507 69621 70522 71908 74182 77193 79591 80301
65123 80301 79920 79816 80404 81103 81405 81039 79612 77170 74863 74100 75192 77474 80357 83290 85255 85519
65107 85519 84831 84688 85436 86160 86342 86378 86399 85888 84907 84523 85446 87036 88166 88474 88431 88820 90343 93001 95719
65088 95719 97309 97940 98712 99723 99750 98269 96576 96200 97173 98604 100046 101352 101977 101477 100295 99247
65072 99247 98631 98452 98995 100322 101674 102213 102095 101997 101919 101180 99413 96918 94319 92533 92597 94712 97695
65055 97695 100203 102169 104171 105787 105880 104474 103098 102911 103514 103980 104085 104053 103963 104082 105104 107325 109988
65038 109988 112057 113344 114467 116120 118745 122383 126336 129464 131489 133583 137015 141688 146799 152423
65024 152423 159210 166598 172702 176474 179026 182239 186805 192198 197681 202439 205307 205639 204492 204000 205216
65009 205216 207111 207937 207060 205176 203122 200838 197389 191762 183816 174632 165891 158678 152727 146781 139876
64994 139876 132517 126533 123336 122249 121014 118155 114297 110895 108443 106566 105128 104127 102928 100832
64980 100832 98299 96491 95601 94844 94126 94279 95246 95450 93716 90592 87019 82971 78483 74870 73408 73455
64964 73455 73321 72592 72341 73277 74944 76719 78509 80423 82622 85398 88579 91014 91548 90414 88826 87451
64948 87451 86223 85383 85490 86390 87206 87447 87247 86690 86020 86307 88530 91844 94080 94189 92994 91377 89331
64931 89331 87249 86537 87898 90135 91595 92005 92167 92736 94010 95974 97794 98186 97056 95847 95540 95406
64915 95406 94569 93529 92948 92150 90453 89001 89440 91329 92732 93086 93608 94841 95645 95107 93921 93257 93477
64898 93477 94456 95954 97022 96169 92973 88924 86002 85014 85626 87172 88804 89665 89764 90162 91540 93081
64882 93081 93505 92841 92293 92571 93214 93526 93354 92716 91387 89362 87369 86382 86564 86967 86350 84233 81184
64865 81184 78318 76652 76749 78447 80743 82259 82252 81186 80135 79710 79763 79950 80286 81184 83130 86147 89324
64848 89324 91230 91292 90558 90455 90923 90551 88675 86513 85773 86723 88136 88723 88101 86703 85348 84818 85404
64831 85404 86790 88471 90059 91088 91055 90117 89265 89233 89553 89398 89054 89556 90867 91498 90388 88249 86441
64814 86441 85244 84109 83136 83209 84690 86795 88408 88931 88343 87143 86384 86960 88497 89593 89510 88979 88901
64797 88901 89003 88498 87375 86100 84523 82355 80488 80432 82212 84047 84705 85040 86445 88683 90256 90355
64781 90355 89454 88354 87629 87744 88706 89559 89150 87556 86026 85422 85441 85475 85366 85061 84396 83710 83866 84998
64763 84998 85899 85503 84503 84562 86191 88361 90142 91646 93100 94026 94022 93695 93956 94668 94765 93701 92191 91371
64745 91371 91618 92334 92586 91887 90632 89817 90043 90744 90789 89905 88984 88746 88644 87659 85896 84693 85136 86985
64727 86985 89159 90792 91635 91800 91523 91046 90536 90077 89690 89272 88653 87985 88022 89557 92513 95883 98697
64710 98697 100598 101425 100931 99445 98323 98887 100932 102897 103624 103401 103170 103323 103631 103845 103832 103488 103045 103286
64692 103286 104788 107033 108879 109889 110414 110323 108741 105708 103073 102556 103423 103441 101996 100809 101278 102527
64676 102527 102912 102270 101542 100942 99745 97622 95117 92939 91559 91332 92205 93458 94473 95531 97090 98651
64660 98651 99374 99506 99964 100641 100546 99740 99687 101131 102988 104003 104334 104751 105398 106282 107877 110111 111627 111359
64642 111359 110189 109730 109891 109086 106682 103920 102229 101729 101645 101249 100164 98587 97508 97963 99723 101322
64626 101322 101617 100793 99649 98696 98345 99252 101700 104878 107439 108776 109354 109831 110173 109851 108645 107068
64610 107068 105982 105967 107083 109016 111249 113279 115036 117008 119542 121990 123054 122111 119759 117028 114645
64595 114645 113235 113375 114872 116508 117080 116335 114516 111651 107877 103893 100363 97442 95587 96103 99635
64580 99635 104438 107453 107210 104869 102507 101418 101992 103967 106370 108083 108851 109105 108758 107144 104393 101901
64564 101901 100917 101432 102742 104301 105623 106366 107162 109463 113612 117663 119053 117229 113864 110830 108727
64549 108727 107283 106324 106051 106671 107900 108816 108508 107087 105700 105213 105301 105290 105478 106815 109441 112311 114473
64532 114473 116015 117355 118112 117333 114880 112088 110747 111550 113733 116078 117927 119205 120055 120882 122396
64517 122396 124999 128083 130398 131162 130520 129040 127300 125961 125636 126409 127798 129307 130682 131580 131479 130127
64501 130127 127711 124455 120479 116250 112754 110936 111099 112822 115150 116954 117694 117923 118523 119472 120050 120267
64485 120267 121134 123057 124887 125228 123975 121858 119154 115843 112585 110477 109900 110452 111923 114377 117201
64470 117201 119081 119507 119666 121179 124163 127046 128341 128179 127897 128295 128667 127761 125473 123154 122136 122323
64454 122323 122413 121312 119118 116886 115552 114984 114099 112209 110138 109379 110003 110161 108215 104888 102670 103355
64438 103355 106686 111058 114726 116461 115982 114201 112651 112211 112554 112890 112970 113126 113539 113837 113552 112790 112215
64421 112215 112356 113208 114681 117048 120363 123651 125398 125063 123534 121854 120162 118296 116729 116101 116177 116074
64405 116074 115546 115367 116318 118155 119755 120090 119157 118125 118454 120586 123500 125667 126292 125655 124676 124364 125233
64388 125233 126787 127928 128259 128649 130057 132170 133758 134078 133368 132237 131262 131051 131960 133654 135398 136732
64372 136732 137515 137589 137118 137001 138099 140029 141509 142029 142291 142793 142861 141728 139865 138517 138260 138789 139945
64355 139945 142172 145778 150349 155307 160687 166763 172872 177335 179074 179005 179183 180653 182870 185208 188010
64340 188010 191618 195197 197376 197619 196326 194140 191912 190704 190691 190454 188601 185856 184194 183882 182969 180176
64324 180176 176858 175147 175240 175576 174974 173462 171345 168610 165312 161839 158623 155950 154073 153219 153462 154624
64308 154624 156114 156951 156436 154875 153079 151074 148188 144789 142872 143967 147106 149905 151259 151869 152372
64293 152372 152286 151043 149077 147439 147033 148472 151837 156083 159378 160713 160796 160835 160940 160490 159764 160176 162541
64276 162541 165728 167521 166670 163840 160782 158857 158312 158643 159441 160850 163179 166166 168926 170842 172322
64261 172322 174330 177291 180824 184536 188468 192495 195871 198055 199749 202397 206490 210835 213738 214593
64247 214593 214151 213591 213587 213982 214032 212978 210591 207293 203837 201024 199593 199954 201744 203886 205337 205813 205708
64230 205708 205485 205310 205188 205221 205636 206553 207848 209436 211712 215331 220196 224932 228016 229455 230749 232927
64214 232927 235200 236016 235088 233709 233124 233208 233033 232356 232017 232840 234563 236151 236914 236730 235354 232415 228542
64197 228542 225617 224956 225658 225741 224644 223402 222453 220700 217332 213357 210542 209619 210224 211731 213343 214135
64181 214135 214057 214252 215471 216852 217503 218584 222241 228621 235602 241567 246847 252014 256423 259437 261822
64166 261822 264656 267652 269774 271081 272781 275583 279042 282546 286098 289870 293672 297181 300296 302932
64152 302932 304662 304873 303455 301389 300531 302369 306749 311992 316400 319454 321626 323731 326780 331675 338168
64137 338168 344511 349107 352445 356508 362198 368241 372952 376184 378828 380966 381459 379367 375236 370749
64123 370749 367299 364894 362285 358107 352002 344740 337402 330666 324749 319568 314732 309694 304295 299037
64109 299037 294593 291192 288701 287161 286798 287491 288548 289281 289729 290622 292531 295177 297807 300261 303266
64094 303266 307395 312181 316858 321673 327486 334088 340136 345343 351596 360835 372537 384521 395758
64081 395758 406990 418789 430591 441938 453175 464280 474233 482434 489717 496881 503013 506359 506330
64068 506330 503594 498713 491961 484232 476726 469562 461778 452969 443922 435305 426708 417556 408259 399833
64054 399833 392803 386958 381904 377585 374516 373496 374497 375853 375525 373539 372284 373749 377321 381149
64040 381149 384841 389523 395641 402192 408305 414354 421043 428334 435906 443955 452828 462213 471392 480062
64026 480062 488457 496809 505098 513188 520741 527076 531609 534522 536576 538042 538094 535492 529819 521998 513727
64011 513727 506451 500569 495324 489501 482498 474886 467926 462659 459524 458553 459460 461428 463292 464312 464676
63996 464676 465082 466023 467717 470395 474185 478863 484253 490875 499599 510433 522193 533685 544766 555955
63982 555955 567456 579184 591402 604614 618751 633042 646910 660654 675028 690305 705897
63971 705897 720769 734195 746261 757645 768796 779417 788939 797379 805416 813626 821995 830318 838871
63958 838871 848498 860101 873995 889626 906008 922632 939874 958267 977585 997059 1016348 1035670
63946 1035670 1054929 1073401 1090674 1107311 1124117 1141167 1158113 1175083 1192651 1211093 1230281
63935 1230281 1250285 1271507 1294251 1318666 1345183 1374512 1407109 1443111 1482866 1526973 1575524
63924 1575524 1627793 1683048 1741421 1803781 1871067 1943942 2022606 2106613 2195298 2288924 2389149
63913 2389149 2497852 2615614 2741685 2875185 3015807 3163628 3319071 3483365 3658514
63904 3658514 3846411 4048105 4264113 4495416 4744297 5014430 5310073 5634903 5991789
63895 5991789 6383966 6816070 7293486 7821048 8403349 9046119 9755754 10536451 11388160
63886 11388160 12307590 13290243 14330641 15421331 16552835 17714142 18891896 20068825
63878 20068825 21223819 22333748 23374773 24322586 25153702 25848444 26393046 26778796 26999743
63869 26999743 27051521 26931515 26639158 26176560 25550498 24774801 23870632 22863664 21779891
63860 21779891 20642565 19471287 18283001 17093726 15919562 14776095 13676912 12632668
63852 12632668 11651124 10737258 9893096 9118025 8409997 7766532 7184526 6659577 6186348
63843 6186348 5759757 5375453 5029139 4716152 4432180 4173943 3938624 3722968 3523747
63834 3523747 3339070 3168387 3010854 2864287 2726126 2594951 2470458 2352188 2238931
63825 2238931 2129448 2023449 1921892 1826517 1738823 1658895 1585103 1515282 1448250 1383982 1322558
63814 1322558 1263673 1207401 1154717 1106649 1063041 1022699 984682 949003 915984 885431 856786
63803 856786 829810 804653 781267 759188 738030 717911 699184 682174 667423 655688 646980 639794
63791 639794 632113 623333 614571 606988 600657 595409 591818 590376 590188 589393 586819 582572 577092 570350 562061
63776 562061 552184 541118 529586 518159 506580 493916 479857 465513 452386 440877 430451 420769
63764 420769 411727 402679 392826 382463 372842 364651 357473 350770 344243 337153 328636 319367 311675 307158
63750 307158 304903 302786 299772 296199 292664 289605 287339 285488 282773 278342 273023 268425 265099 262377
63736 262377 259722 257260 255095 253034 251094 249631 248790 248278 247592 246186 243741 240740 238374 237267 236715
63721 236715 235874 235136 235250 235582 234610 232086 229384 227437 225612 223112 220389 218530 218067 218954 220896 223094
63705 223094 224454 224760 224993 225779 226223 225187 223237 222235 223206 225525 228132 230584 232800 234676 236363
63690 236363 238298 240504 242245 242785 242223 241269 240544 240523 241928 245436 250830 256865 262409 267584 273470 280716
63674 280716 288796 296768 304414 312270 320723 329573 338695 348722 360554 374184 388398 401892 414461
63661 414461 426718 438796 449820 458746 465218 469267 470776 469859 467342 463906 458871 450962 440544
63648 440544 429957 421018 413182 405121 397256 391306 387654 384601 380439 375087 369324 363392 357022 350140
63634 350140 342956 335810 329391 324687 322222 321556 321810 322371 322927 323434 324547 327539 333045 340066 346808
63619 346808 352540 358137 364799 372712 381157 389662 398817 409882 423539 438964 454281 467890 479178
63606 479178 488042 494382 498380 500586 501073 498795 492637 483113 472322 462057 452581 443411 434541 426239
63592 426239 418093 409128 399046 388869 380119 373582 368944 365382 362297 359713 358307 358997 362171 367091
63578 367091 372194 376233 379280 382652 387848 395530 405333 416338 427557 438208 447955 457195 467029
63565 467029 478699 492895 509543 528185 548438 570268 594051 620333 649163 679572 710068
63554 710068 739935 769802 800693 832766 865288 897413 928349 956898 981571 1001447 1016511
63543 1016511 1027084 1033382 1035756 1034906 1031607 1026648 1021087 1015885 1010904 1004778 996313 985634 973550
63530 973550 960181 944917 927534 908719 889328 869436 848337 825539 801864 779397 759895
63519 759895 743229 727939 713342 700283 689614 680932 673488 667410 663109 660162 657930 656820 657833
63506 657833 661126 666219 673444 683912 697816 713871 730760 748399 767570 789057 813232 839709
63494 839709 867305 895251 924540 957084 993172 1030621 1066733 1100170 1130578 1157513 1180554
63483 1180554 1199796 1215471 1227601 1236546 1243315 1248732 1252836 1255644 1257943 1260544 1263150 1264609 1263929
63470 1263929 1260361 1252661 1238967 1217708 1188723 1153802 1116058 1077955 1039518 999057 956070 912803
63458 912803 872411 836129 802899 771243 740703 711736 684919 660261 636976 614229 592422
63447 592422 573249 558035 546464 537375 530168 524720 520515 516796 513311 510208 507470 505200 504094
63434 504094 504808 507040 510008 513637 518531 524985 532776 541629 551116 560440 569385 579270 591786 606841
63420 606841 622640 637916 652787 667148 679588 688640 694100 696293 694971 689986 682473 674121 665312
63407 665312 654866 641864 627125 612562 599409 587432 575954 565373 557219 552441 549992 547739
63395 547739 544681 541679 539951 539650 540248 541592 543898 547072 550697 554579 558859 563679 569192 575875 584336
63380 584336 594711 606499 619189 632960 648692 667375 689511 714937 743077 773277 804954
63369 804954 837641 871101 905377 940650 977203 1015707 1057305 1102791 1151468 1201105 1249316
63358 1249316 1294907 1337710 1377305 1412168 1440192 1459974 1471607 1476299 1475356 1469687 1460210 1448269
63346 1448269 1435188 1421491 1406921 1391274 1374749 1357213 1337465 1313691 1284925 1251971 1216776
63335 1216776 1180943 1144995 1109082 1074060 1041325 1011578 984226 958302 933714 911337 892229
63324 892229 877089 866163 859039 854507 851122 848263 846665 847882 853090 862022 872953 884154 895725
63311 895725 909686 927917 950347 975599 1002932 1032887 1066223 1102873 1141878 1181802 1221413
63300 1221413 1260623 1300541 1341772 1382703 1420302 1452608 1479459 1500623 1514556 1519861 1517270 1509264
63288 1509264 1498076 1484793 1470196 1455571 1442327 1430847 1419623 1405611 1386066 1360650 1331669
63277 1331669 1301996 1272790 1243252 1212110 1179016 1144775 1110684 1077622 1045635 1014505 984671
63266 984671 957133 932235 909052 886420 864301 843707 825506 809748 796026 784003 773439
63255 773439 763988 755231 747026 739878 734732 732006 730852 729774 728064 726122 724280 722005 718661 714542
63241 714542 710585 707402 705069 703471 702242 700660 698326 695905 694492 694173 693751 692126 689560 687319 686315
63226 686315 686397 686895 687540 688650 690364 692071 692885 692497 691103 688727 685401 681992 679891 679396 679302 678710 678454
63209 678454 679801 682419 684784 686259 687639 689791 692860 696740 701099 704819 706710 707293 708762 712478
63195 712478 717331 721340 724181 727362 732474 740053 749708 760407 770726 779714 787825 796729 807992
63182 807992 821844 836983 851559 864850 878116 893321 910843 929194 947265 965806 985904
63171 985904 1007026 1028000 1049416 1073401 1100833 1130075 1158860 1186294 1212482 1237318 1260530
63160 1260530 1282355 1303336 1323777 1343922 1364293 1385259 1406367 1426466 1444305 1458974 1470309
63149 1470309 1479214 1486966 1493694 1497911 1498027 1493779 1485656 1473580 1457103 1436675 1413752 1389594 1364592
63136 1364592 1338730 1312129 1285253 1259268 1236102 1217425 1203507 1193693 1187796 1186089 1187942 1191652
63124 1191652 1196208 1202442 1211856 1224882 1240798 1258750 1278178 1298607 1319655 1341151 1362932 1384760
63112 1384760 1406693 1429121 1452034 1474529 1495433 1514216 1530970 1545774 1558438 1568673 1576229
63101 1576229 1580999 1583070 1582404 1578448 1570520 1558588 1542926 1522903 1497193 1465933 1431799 1397965
63089 1397965 1365480 1333587 1302069 1271942 1243837 1216944 1190098 1163321 1137994 1115937 1098391
63078 1098391 1085314 1075349 1066765 1058655 1051254 1045265 1041107 1038502 1036474 1034054 1031368 1029736 1030235 1032553
63064 1032553 1035637 1038885 1042022 1044518 1046229 1048267 1052006 1057360 1063134 1068860 1075007 1081287 1086308 1089392
63050 1089392 1091533 1093930 1096667 1099493 1102809 1106920 1111006 1113819 1115097 1115745 1117070 1120163 1125250 1130949
63036 1130949 1134983 1136504 1137217 1139408 1143334 1147465 1150887 1154433 1159533 1166812 1175846 1185558 1194799 1203175
63022 1203175 1211421 1220600 1230964 1242016 1253467 1265629 1278952 1293711 1309973 1327269 1344333 1359951
63010 1359951 1374319 1389204 1406516 1426883 1449468 1472703 1495262 1516805 1538072 1560005 1582836
62999 1582836 1606326 1630800 1657315 1686561 1718053 1750747 1784233 1818957 1855516 1894151 1934898
62988 1934898 1977736 2022298 2067680 2112994 2158215 2204237 2251993 2301657 2352639 2403959 2454573
62977 2454573 2503905 2552465 2601447 2651173 2700337 2747418 2792415 2836247 2878802 2918780 2955515
62966 2955515 2989499 3020532 3046471 3064632 3073625 3073076 3062452 3041352 3010608 2972101 2927664 2878901
62954 2878901 2827793 2776386 2725638 2675182 2624517 2574240 2526267 2483105 2446724 2417607 2394853
62943 2394853 2377379 2364922 2357869 2356574 2361081 2370948 2384946 2401488 2419902 2440850 2465035 2492009
62931 2492009 2520669 2550240 2579982 2608692 2635499 2660707 2684824 2707115 2726158 2741528 2753649
62920 2753649 2762125 2765461 2762624 2753705 2738719 2716763 2686841 2648730 2602745 2549460 2490005 2425867
62908 2425867 2357954 2286505 2212330 2137418 2063807 1992397 1923315 1856907 1793784 1734171 1677691
62897 1677691 1623728 1571976 1522967 1478142 1438799 1404635 1373693 1343964 1314763 1286586 1260321
62886 1260321 1236873 1216791 1199635 1184022 1168738 1153565 1138688 1123712 1107857 1091061 1074434
62875 1074434 1059373 1046244 1033958 1020936 1006553 991473 976628 962428 949341 938474 930558
62864 930558 924632 918704 911683 903808 895588 887547 880857 876480 873306 868849 862596 857083 854482 853590
62850 853590 851729 848372 844946 841787 837615 832078 826768 823071 820550 818261 816461 816047 817054 818623
62836 818623 820034 821066 821651 821786 821707 821761 822101 822558 822668 821839 819922 817663 816228 816184 817274 819076 821349
62819 821349 823788 826175 828879 832399 836110 838469 839021 839409 841508 845106 848310 849802 849698 848476 846181
62804 846181 842777 838406 833122 827142 821445 817179 814218 811127 806929 802158 797878 794688 793170 794089
62790 794089 797006 799572 799646 797801 796472 796842 797935 798746 799674 801269 802867 803400 802818 801921 801319 801214 801699
62773 801699 802619 803556 804487 806008 808380 810860 812533 813367 813852 814095 813966 813692 813568 813488 813471 814174 815956 817871
62755 817871 818594 818104 817376 816658 815387 813851 813538 815317 818380 821581 824906 828868 833265 837491 841771
62740 841771 847328 855251 865379 876130 885490 892897 900458 911564 927720 947084 966589 985051
62728 985051 1003764 1024685 1048865 1076372 1106793 1139579 1174370 1211212 1250338 1291897 1336218
62717 1336218 1384201 1436933 1494787 1557256 1623755 1694237 1768739 1846536 1926227 2006819 2088271
62706 2088271 2170442 2251563 2328438 2398427 2460596 2514448 2558173 2589114 2605707 2608002 2596423
62695 2596423 2571152 2533048 2484142 2426503 2361232 2289088 2211577 2130782 2048503 1966102 1884910
62684 1884910 1806149 1730417 1657582 1587245 1519308 1454284 1393065 1336128 1283019 1233080 1186620
62673 1186620 1144738 1107859 1075088 1045240 1017869 992984 970473 950261 932461 916902 903041
62662 903041 890820 881043 874328 870091 867063 864450 862189 860674 860825 863840 870053 878215 886607 894748
62648 894748 903631 914550 928190 944558 963313 984316 1008192 1035938 1067701 1102464 1139302 1178298
62636 1178298 1219756 1263479 1309728 1360109 1416150 1477346 1541722 1608156 1676968 1748295 1821104
62625 1821104 1893965 1965611 2034204 2096933 2151011 2194889 2228318 2251496 2264148 2265071 2252714 2226648
62613 2226648 2188368 2140319 2084502 2022406 1955590 1885357 1812311 1737271 1662198 1588943 1517419
62602 1517419 1446593 1377388 1312863 1254950 1202416 1152890 1105692 1061726 1021589 984960 951319
62591 951319 920191 890963 863161 836778 811908 788376 766082 745287 726239 708982 693783
62580 693783 681036 670417 660866 651798 643446 635525 626791 616920 607759 601275 596833 592015 585832 579574
62566 579574 574443 569924 565086 560338 557088 556167 557178 559009 560655 561918 563493 566143 569812 574060
62552 574060 579241 586333 595318 604585 612561 619497 627060 636550 648030 660860 674391 688202 702235
62539 702235 716883 732659 749716 767906 787307 808461 832020 858369 887657 920054 955707
62528 955707 994346 1035017 1076472 1117996 1159645 1201403 1242255 1280612 1315612 1347410 1375886
62517 1375886 1399672 1417041 1427460 1431614 1430001 1422133 1407272 1385426 1357504 1324947 1289486 1252750
62505 1252750 1215630 1178129 1140110 1102054 1064837 1029063 995021 963134 933888 907186 882196
62494 882196 858108 834897 813175 793393 775307 758238 741818 726480 713010 701474 690837
62483 690837 680075 669477 660283 652951 646400 639348 631882 625243 620372 617238 615330 614127 613093 611895
62469 611895 610909 611004 612526 614831 617215 620115 624924 632631 642848 654291 666103 678619 692855 709251
62455 709251 727060 745135 763321 782873 805410 831631 861102 893038 926968 962782 1000469
62444 1000469 1039907 1080754 1122438 1164246 1205231 1243858 1278012 1305947 1327397 1343368 1354586
62433 1354586 1360538 1360187 1353093 1339365 1319169 1293169 1263155 1231116 1197621 1162234 1125769 1090826
62421 1090826 1059249 1030174 1001743 973905 948029 924310 901433 879069 858974 842781 829861
62410 829861 818377 807667 798576 791894 787374 784107 781093 777493 772917 767710 762803 759307 758075 759144
62396 759144 761484 763859 766223 769701 774920 781097 787226 793369 800042 807043 813902 821006 829109 837832
62382 837832 845699 851733 856107 859054 860149 859068 856276 852247 846407 837586 825555 811735 798207
62369 798207 786138 775280 764920 754867 745236 735659 725485 714873 704998 697014 691409 688500 688490
62356 688490 690583 692998 694745 696617 699694 703745 708173 713639 721326 731139 742064 753819 766595
62343 766595 779480 791091 801846 813696 827167 840464 852254 863579 875884 888588 899997
62332 899997 909643 918250 925947 931886 935523 937311 938179 938883 939697 940319 940382 940338 941291 943684 946956 950934
62316 950934 956661 965057 975648 987625 1001490 1018540 1039255 1063328 1090972 1123041 1159927 1201316
62304 1201316 1247011 1297095 1351385 1409527 1471606 1537884 1608046 1681476 1758035 1837467 1917967
62293 1917967 1996367 2069866 2136735 2195315 2243601 2280350 2305682 2320115 2323797 2317128 2301185 2276743
62281 2276743 2243580 2201536 2151752 2096105 2035948 1972317 1906867 1841501 1777206 1714336 1654041
62270 1654041 1598166 1547321 1500201 1455600 1414193 1377307 1344523 1313817 1283947 1255440 1228999
62259 1228999 1204292 1181064 1160392 1143680 1130807 1120361 1111501 1104568 1099881 1097058 1095846 1096649 1099518
62246 1099518 1103177 1105747 1106276 1105142 1103160 1100725 1097737 1094019 1089688 1085097 1080334 1074989 1068781 1062316
62232 1062316 1056696 1052329 1048693 1045405 1042825 1041362 1040855 1041092 1042313 1044665 1047719 1051156 1055487 1061423
62218 1061423 1068928 1077639 1087930 1100655 1115849 1132498 1149822 1168284 1189129 1213307 1241017 1271946
62206 1271946 1305690 1342003 1380793 1422042 1466022 1513642 1566133 1624101 1687063 1754093 1824547
62195 1824547 1897872 1973135 2049098 2124380 2197093 2264616 2324178 2373467 2410628 2434531 2445733
62184 2445733 2446374 2438033 2420107 2391375 2352797 2307412 2257502 2203276 2144790 2083820 2022957 1963723
62172 1963723 1906553 1852147 1801776 1756338 1715777 1679610 1647555 1619429 1594661 1572329 1552018
62161 1552018 1534563 1521330 1512244 1504973 1496904 1487912 1480470 1476905 1477326 1480381 1485142 1491540 1499488 1508266
62147 1508266 1516654 1523414 1528062 1531705 1536774 1545300 1557294 1571178 1585744 1601459 1619867 1641989
62135 1641989 1667351 1694467 1722228 1750802 1781198 1814216 1850115 1888975 1930669 1974271 2018258
62124 2018258 2061746 2105003 2148078 2189302 2225929 2256366 2281367 2302997 2322924 2341865 2360271
62113 2360271 2379116 2399951 2424194 2452287 2483580 2517146 2552739 2590983 2632795 2678749 2728678
62102 2728678 2781369 2834438 2884831 2929886 2968179 2999545 3024500 3043723 3057915 3067768 3073791 3076116
62090 3076116 3074673 3069680 3061948 3052535 3042096 3030635 3018021 3004726 2992070 2981748 2975013 2972192
62078 2972192 2972918 2976733 2983346 2992339 3002972 3014692 3027779 3043146 3061325 3081828 3103699 3126522
62066 3126522 3150628 3176363 3203498 3231697 3261501 3294420 3331657 3372780 3415987 3459738 3503843
62055 3503843 3548810 3594641 3640866 3687549 3735524 3785284 3836153 3886974 3937383 3987885 4038798
62044 4038798 4089861 4141108 4193488 4247898 4303873 4360076 4416175 4473445 4533161 4595143 4658561
62033 4658561 4723592 4791458 4863126 4938878 5018953 5103570 5192228 5283939 5378269 5475100 5573141
62022 5573141 5669968 5764294 5857190 5950224 6043506 6136688 6230800 6327103 6424170 6517790 6604333
62011 6604333 6683280 6756150 6824130 6887583 6947225 7004805 7062381 7120861 7178977 7233743 7282444
62000 7282444 7324348 7360202 7390286 7413608 7429081 7436742 7437492 7432124 7420859 7403440 7379502 7349246
61988 7349246 7313872 7274875 7232770 7187034 7137498 7085214 7031671 6977747 6923956 6871258 6820984
61977 6820984 6774009 6730441 6690129 6653232 6620258 6591610 6567033 6545552 6526131 6508337 6492048
61966 6492048 6476599 6460846 6444300 6427739 6412205 6397538 6382258 6364922 6345474 6325283 6305874
61955 6305874 6287575 6269523 6250978 6232314 6214359 6197178 6180118 6162945 6146221 6130508 6115827
61944 6115827 6101982 6088716 6075293 6060706 6044776 6028457 6012360 5995227 5974355 5947407 5913407
61933 5913407 5872239 5823921 5768654 5707258 5641062 5571155 5497953 5421767 5343747 5265796 5189272
61922 5189272 5114179 5040055 4967330 4897334 4831148 4768864 4709729 4652601 4596668 4542300 4490835
61911 4490835 4442958 4397894 4354996 4315295 4279929 4247535 4215098 4181597 4148993 4119082 4091166
61900 4091166 4063817 4037308 4012930 3991018 3971098 3953268 3938148 3925994 3916846 3910969 3908178 3907507
61888 3907507 3908735 3913486 3923470 3938197 3955939 3976580 4001824 4032590 4067813 4106165 4147559 4192340
61876 4192340 4240091 4289966 4341529 4394730 4449555 4505991 4563904 4622811 4682333 4742898 4805231
61865 4805231 4869014 4932959 4996725 5062131 5132009 5208401 5292492 5385914 5491339 5611566 5748205
61854 5748205 5901384 6070936 6258048 6465630 6696763 6952986 7234493 7541770 7876452
61845 7876452 8240609 8635897 9063578 9524819 10020776 10552667 11121491 11726534 12363152
61836 12363152 13021634 13687386 14340692 14955460 15499471 15938521 16242978 16392845 16379325
61827 16379325 16204428 15880498 15429138 14877762 14254168 13582472 12882914 12173844 11472113
61818 11472113 10791081 10139287 9521765 8942078 8402649 7904122 7445776 7026585 6645319
61809 6645319 6300035 5988349 5708078 5456893 5231716 5029401 4847886 4685964 4542321
61800 4542321 4415888 4306809 4215671 4141623 4082544 4037159 4005484 3986645 3977817 3976275 3981357
61789 3981357 3993217 4010553 4030851 4052318 4074166 4095070 4112528 4124156 4129126 4128236 4122882 4113871
61777 4113871 4100974 4083911 4064086 4044850 4029455 4019013 4012986 4011182 4014328 4022739 4035297 4049956
61765 4049956 4064649 4077471 4086604 4090597 4088542 4079819 4063957 4041072 4012408 3980143 3946399 3912321
61753 3912321 3878225 3844805 3814131 3789076 3771581 3761742 3758787 3762817 3775359 3798358 3832742 3877835
61741 3877835 3932076 3994571 4066063 4148206 4241870 4346530 4461439 4586967 4724564 4875773
61731 4875773 5041503 5221798 5416099 5624230 5847620 6089088 6350954 6633885 6938292
61722 6938292 7266441 7622358 8010076 8433147 8895955 9404243 9963601 10578066 11250835
61713 11250835 11985915 12788330 13662680 14611757 15636102 16733692 17898818 19120137 20378558
61704 20378558 21645543 22882299 24040297 25063878 25895574 26483785 26790860 26799124 26513090
61695 26513090 25957531 25172044 24203879 23101477 21910525 20672139 19421611 18187200
61687 18187200 16989911 15844704 14761998 13748217 12805687 11933324 11128552 10389109 9713129
61678 9713129 9097666 8537668 8026966 7560434 7134928 6748082 6396630 6076268 5782978
61669 5782978 5514072 5267968 5043198 4837625 4648394 4472640 4308373 4154637 4010697
61660 4010697 3875266 3746746 3623904 3505896 3391865 3281245 3174603 3073457 2978832 2890268
61650 2890268 2806576 2727185 2652366 2582457 2517463 2457295 2401780 2350290 2301822 2255711 2211929
61639 2211929 2170411 2130450 2091204 2052652 2015499 1980029 1945472 1910845 1876213 1842806 1811826
61628 1811826 1783353 1756376 1729776 1703228 1677331 1652953 1630407 1609163 1588304 1567283 1546349
61617 1546349 1526442 1508621 1493312 1479857 1466970 1453867 1440819 1428453 1416777 1405315 1394049
61606 1394049 1383619 1374497 1366458 1359171 1352869 1348017 1344468 1341343 1337809 1333880 1330450 1328599 1328753 1330541
61592 1330541 1333454 1337478 1342867 1349580 1357362 1366228 1376146 1386226 1394981 1401782 1407450 1413038 1418503 1422956
61578 1422956 1425653 1426377 1425502 1424315 1424618 1427109 1430513 1433143 1435047 1437731 1442134 1447961 1454855 1462860 1471255
61563 1471255 1477945 1480759 1479075 1474018 1467514 1461031 1454399 1445668 1432889 1416229 1397719 1379008 1360472
61550 1360472 1342593 1326653 1313222 1301151 1289061 1276898 1265066 1253155 1240891 1229464 1220242
61539 1220242 1212648 1204999 1197205 1190818 1186265 1181916 1176668 1171915 1169850 1170780 1173157 1175672 1178425 1182403
61525 1182403 1188521 1196913 1206729 1216948 1227676 1240094 1254807 1270938 1287383 1304287 1322617 1342891
61513 1342891 1365135 1389512 1416065 1444188 1473340 1504154 1537884 1574726 1613537 1653289 1693901
61502 1693901 1735414 1777036 1817413 1855459 1890807 1924047 1956779 1990771 2026433 2062212 2095791
61491 2095791 2125823 2152434 2176382 2198106 2217676 2235461 2252524 2269860 2287012 2301875 2312386
61480 2312386 2318221 2320401 2319634 2315877 2309398 2301197 2292038 2281940 2271181 2261071 2252974 2247023 2242626
61467 2242626 2240078 2240994 2247159 2259433 2277650 2300980 2328338 2359226 2394594 2436459 2486186 2543288
61455 2543288 2606292 2674782 2750190 2834626 2929414 3034973 3151607 3279783 3419851 3572233
61445 3572233 3738067 3918996 4115988 4328717 4556272 4797783 5051789 5315428 5584662
61436 5584662 5854552 6118393 6367105 6590736 6780914 6931548 7038039 7097504 7110236 7079822
61426 7079822 7011293 6909790 6780978 6631346 6467158 6293600 6115305 5936876 5762399 5595097
61416 5595097 5437774 5292661 5160407 5040394 4932887 4839922 4763207 4702141 4654911 4620560
61406 4620560 4598733 4588312 4587991 4597806 4618478 4649389 4688564 4734535 4786775 4844266 4905144 4968121
61394 4968121 5033068 5099891 5167927 5236745 5306422 5376695 5446811 5516497 5585977 5654762 5721629
61383 5721629 5786221 5849435 5911644 5971742 6028675 6082600 6133516 6179868 6219917 6253804 6283021
61372 6283021 6308207 6328603 6343347 6352245 6355464 6353410 6346773 6335715 6319132 6295672 6265676 6231347
61360 6231347 6194944 6157438 6119039 6080259 6042129 6005796 5972190 5941908 5915339 5892918 5874992
61349 5874992 5861066 5849489 5838449 5827264 5816368 5806173 5796331 5785938 5773940 5759564 5742973
61338 5742973 5725645 5709711 5696896 5688312 5684990 5688079 5698628 5717793 5747270 5789089 5844960 5916252
61326 5916252 6004522 6111484 6238311 6385356 6552548 6739668 6946309 7172056 7416534 7678475
61316 7678475 7954398 8238627 8524683 8806159 9076162 9326642 9548829 9734284 9875917
61307 9875917 9969155 10012956 10009372 9961645 9872820 9746160 9585943 9396979 9183586 8949770
61297 8949770 8700251 8440463 8175250 7908087 7641812 7379765 7125708 6882596 6651717
61288 6651717 6433276 6227719 6036096 5858882 5694844 5541814 5398738 5266387 5145835
61279 5145835 5036980 4939182 4852851 4779427 4719714 4672985 4637906 4613720 4600224 4597061 4603498
61268 4603498 4618736 4642006 4672383 4708634 4749211 4792406 4836769 4881539 4926490 4971120 5014148
61257 5014148 5054005 5089795 5121626 5150131 5175826 5198778 5218609 5234862 5247589 5257573 5265742 5272354
61245 5272354 5276905 5278696 5277046 5270838 5258286 5237671 5208348 5170945 5126777 5077315 5024046 4968326
61233 4968326 4911124 4853039 4794635 4736536 4679096 4622337 4566576 4512913 4462601 4415978 4372618
61222 4372618 4332802 4298158 4270128 4248014 4229360 4212338 4197006 4184022 4173093 4163419 4154981 4148264
61210 4148264 4142899 4137718 4132354 4127845 4125207 4124301 4124790 4127613 4134632 4147129 4165320 4189034 4217838
61197 4217838 4250375 4284594 4319410 4355916 4396541 4443152 4496258 4555908 4622832 4698360 4783279
61186 4783279 4876846 4976869 5080395 5184032 5283665 5374222 5449916 5504761 5533203 5531120 5496925
61175 5496925 5431807 5338760 5221413 5083739 4930352 4766548 4597890 4429573 4265632 4108352
61165 4108352 3958607 3817022 3684500 3561470 3447160 3340230 3239916 3146297 3059891 2981564
61155 2981564 2912281 2852090 2799494 2752581 2710579 2673602 2641224 2612494 2587329 2566657 2550744
61144 2550744 2538526 2529175 2523404 2522376 2525957 2532914 2542431 2554676 2570091 2588762 2610208 2633218
61132 2633218 2656038 2677286 2696565 2713735 2727774 2736932 2739943 2736736 2728182 2715708 2700906 2684680
61120 2684680 2666513 2645090 2619919 2591923 2562104 2530093 2494572 2455063 2412812 2369694 2326491
61109 2326491 2282477 2236507 2188216 2138303 2088175 2039454 1993282 1949617 1907401 1865766 1824800
61098 1824800 1784847 1745683 1707294 1671173 1639649 1613539 1591323 1571052 1552267 1535509 1520659
61087 1520659 1506699 1492820 1478931 1464955 1450137 1433272 1413667 1392059 1370564 1351253 1334537
61076 1334537 1319322 1304838 1291688 1280822 1272327 1265944 1262098 1261328 1263050 1265997 1269950 1276040 1284967
61063 1284967 1295755 1306818 1317677 1329012 1341301 1354122 1366830 1379379 1392123 1405033 1417498
61052 1417498 1428982 1439541 1449543 1459118 1468275 1477350 1486763 1496256 1504913 1512177 1518277 1523271 1526129
61039 1526129 1525439 1520908 1513676 1505132 1495831 1485591 1474268 1462277 1450482 1439638 1429804 1420298 1410368
61026 1410368 1399862 1389156 1378401 1367079 1354479 1340668 1326865 1314565 1304163 1294596 1284465
61015 1284465 1273308 1261662 1250310 1239908 1231042 1223929 1218138 1213183 1209457 1207970 1209046 1211853 1215342
61002 1215342 1219052 1222816 1226320 1229315 1231908 1234390 1237158 1240930 1246484 1253904 1262474 1271494 1280885 1290972
60988 1290972 1302168 1314901 1329220 1344493 1360204 1377108 1396702 1419301 1443516 1468002 1492822
60977 1492822 1518690 1545796 1574027 1603647 1635066 1668429 1703804 1741171 1779974 1819458 1859888
60966 1859888 1902500 1947798 1994877 2043034 2093016 2145866 2201367 2258438 2316277 2374481 2432956
60955 2432956 2492567 2554930 2620665 2688745 2758476 2831080 2908342 2990795 3078525 3172706 3274756
60944 3274756 3384739 3502207 3628193 3764874 3913666 4075010 4249683 4438961 4643620
60935 4643620 4863778 5099262 5349218 5612242 5888410 6180770 6493803 6831161 7195970
60926 7195970 7591914 8022126 8487961 8990989 9535887 10130240 10783105 11505940 12313295
60917 12313295 13219602 14236412 15376023 16657070 18103748 19741411 21597465 23705314
60909 23705314 26103241 28832611 31941237 35468765 39380268 43473442 47360032 50594762
60901 50594762 52885918 54223128 54830162 55017196 55070857 55219356 55596536 56159069 56633919
60892 56633919 56603270 55709489 53831137 51103727 47804195 44216531 40562023 36990031
60884 36990031 33590698 30411863 27478177 24804357 22396225 20247821 18344846 16670464
60876 16670464 15205036 13923096 12796187 11799566 10914165 10123588 9413012 8771244 8190898
60867 8190898 7665784 7189680 6757264 6364085 6005333 5676183 5373097 5093144 4832355
60858 4832355 4586435 4352921 4131155 3920497 3720367 3531705 3356262 3194173 3043739
60849 3043739 2903633 2773749 2653815 2542851 2440329 2346397 2260548 2181241 2107106 2037536
60839 2037536 1972103 1910525 1853179 1800500 1751886 1706293 1663693 1624628 1588559 1554275 1521931
60828 1521931 1492955 1467648 1444486 1422252 1401212 1381506 1361880 1341080 1319485 1298411 1278491
60817 1278491 1259412 1240523 1221132 1200888 1180437 1161155 1143794 1127947 1113071 1099170 1086081
60806 1086081 1073011 1059588 1046822 1036248 1028297 1021991 1016179 1010820 1007149 1006582 1009275 1013851 1018777
60793 1018777 1023747 1029386 1036084 1043871 1053037 1063911 1076149 1089187 1103329 1119418 1137360 1155949
60781 1155949 1174255 1192273 1210070 1227281 1243705 1259489 1274448 1287964 1299750 1309847 1317693
60770 1317693 1322170 1322929 1320833 1316950 1312084 1307494 1304666 1303529 1301915 1297701 1290786 1282219 1272221 1260214
60756 1260214 1246300 1231602 1217203 1203564 1190967 1179685 1169496 1159510 1148871 1137568 1126490
60745 1126490 1116647 1108277 1100805 1093703 1087103 1081221 1075612 1069812 1064636 1061864 1062267 1064728 1067794 1071532
60731 1071532 1077179 1085379 1095459 1106343 1117572 1129277 1141571 1154343 1167612 1181777 1197202 1213603
60719 1213603 1230123 1246031 1260964 1274468 1285965 1295590 1304476 1313632 1322933 1331768 1340207 1348802 1357588
60706 1357588 1366011 1373559 1379840 1384454 1387582 1390292 1393363 1396149 1397507 1397329 1396114 1393643 1389552 1384909
60692 1384909 1381498 1379421 1377002 1373397 1369801 1367615 1366826 1366703 1366780 1366441 1364687 1360975 1355438 1347965 1338336
60677 1338336 1327696 1318379 1311457 1305659 1299459 1292879 1286417 1279680 1272416 1265666 1260466 1256307 1252205 1248385
60663 1248385 1245507 1243032 1239879 1236044 1231983 1226977 1219958 1211841 1205293 1201896 1200765 1200142 1199104 1197483
60649 1197483 1195299 1192697 1189725 1186067 1181718 1177783 1175423 1174001 1171576 1167493 1163117 1159400 1155073 1148316
60635 1148316 1139321 1129894 1120993 1111914 1101803 1090830 1079556 1068058 1056236 1044330 1032419 1019819
60623 1019819 1005906 991612 979152 969725 962059 953986 945108 937004 930990 926807 923723 921762 921120
60610 921120 921215 921330 921718 923130 925501 928131 931130 935682 942503 950789 959195 967362 975879 985040 994444
60595 994444 1003977 1014454 1026545 1039288 1050625 1059790 1068465 1078789 1090682 1102162 1112152 1121861
60583 1121861 1133024 1145726 1158510 1169940 1179485 1187452 1194761 1202504 1211227 1220889 1231742 1244640
60571 1244640 1259941 1276638 1293209 1309024 1324282 1339018 1352910 1365862 1377909 1388487 1396402
60560 1396402 1400758 1401668 1400055 1396953 1392810 1387171 1379259 1369169 1358286 1348164 1339242 1331015 1323225
60547 1323225 1316357 1311060 1307518 1305394 1304135 1303361 1303097 1303500 1304371 1305339 1306538 1308427 1310715 1312229 1312325 1311629
60531 1311629 1310730 1308951 1305484 1301103 1297523 1295329 1293878 1293230 1294758 1299364 1306162 1313577 1320963 1328475
60517 1328475 1336074 1343603 1351540 1360775 1371305 1381602 1389662 1394745 1397982 1401146 1404786 1407763 1408705 1407593
60503 1407593 1405625 1403829 1402352 1400978 1399631 1398119 1395890 1392484 1388096 1383469 1379338 1376078 1373844 1372926
60489 1372926 1373999 1377933 1385190 1395346 1407397 1420685 1435586 1453327 1475110 1501349 1531681 1565806
60477 1565806 1604268 1648245 1698596 1755263 1817658 1885359 1958362 2036676 2119468 2204019 2285391
60466 2285391 2357804 2416989 2461372 2491139 2506777 2509032 2499865 2482711 2461588 2440162 2421540 2408388
60454 2408388 2402695 2405127 2414669 2429298 2447338 2468088 2490987 2514655 2537433 2558749 2579299 2600094
60442 2600094 2622284 2647838 2679047 2716674 2759652 2807484 2862158 2926806 3003104 3091082 3190984
60431 3190984 3303958 3430869 3571615 3725975 3894207 4076287 4271198 4477790 4696408
60422 4696408 4929415 5180318 5452901 5751427 6081109 6447400 6854165 7302369 7789562
60413 7789562 8308141 8841789 9363863 9841476 10242670 10540471 10712923 10744519 10631198 10383440
60403 10383440 10022749 9574929 9066174 8521878 7964490 7410854 6872480 6358253 5875543
60394 5875543 5428853 5019201 4645616 4306569 4000061 3723730 3475489 3253489 3055352
60385 3055352 2878231 2719713 2577925 2450958 2337194 2236064 2147125 2068147 1995413 1926457
60375 1926457 1861511 1801801 1747398 1697398 1651218 1608765 1569729 1533430 1499127 1466134 1434025
60364 1434025 1402964 1373453 1345630 1319469 1295825 1276285 1261267 1248911 1236621 1223501 1210748
60353 1210748 1199955 1191593 1184944 1178879 1172544 1165698 1158665 1152100 1146758 1143178 1141254 1140207 1139361 1138880
60339 1138880 1139322 1140546 1141628 1141902 1141673 1141849 1143274 1146381 1150890 1155760 1160029 1163831 1168148 1173488 1179405
60324 1179405 1185341 1191212 1196864 1201603 1204668 1205724 1204582 1200973 1195072 1187991 1181333 1176312 1173287 1171763
60310 1171763 1170739 1169449 1168032 1167173 1167037 1166983 1166459 1165723 1165450 1166002 1167180 1168413 1169122 1169416 1170506 1173818
60294 1173818 1179441 1185904 1191711 1196645 1201383 1206470 1212034 1217976 1223954 1229605 1235126 1241342 1248810 1257280
60280 1257280 1266262 1275558 1284711 1292546 1298228 1302698 1308222 1316172 1325674 1334650 1341849 1347617 1353061 1359006
60266 1359006 1365759 1373337 1381492 1389750 1397924 1406466 1415655 1424370 1430480 1432857 1432365 1430289 1426555 1420458
60252 1420458 1412491 1404095 1395661 1386219 1375488 1364985 1356334 1349341 1342634 1335697 1329403 1324739 1321782
60239 1321782 1320016 1319179 1319631 1322054 1326751 1333061 1339536 1344932 1349101 1352827 1356795 1360686 1363328 1363737 1361977
60224 1361977 1358999 1355890 1353631 1353336 1356007 1361783 1370018 1380300 1392673 1406541 1420332 1433106 1445731
60211 1445731 1459489 1474200 1488869 1503738 1520261 1539031 1558917 1578383 1596778 1614348 1631967
60200 1631967 1650925 1672091 1695359 1720738 1749628 1783763 1823040 1865841 1911570 1961356 2015991
60189 2015991 2074792 2137143 2203794 2275912 2354032 2438644 2530597 2630099 2736391 2849113 2968858
60178 2968858 3095534 3227416 3362867 3501916 3644919 3790452 3935676 4078028 4215400
60169 4215400 4345487 4466398 4577579 4678931 4769218 4846302 4908627 4955598 4987158 5004224
60159 5004224 5009193 5004608 4991351 4969357 4940214 4907966 4877075 4850425 4829457 4815151 4808274 4809278
60147 4809278 4818626 4837246 4866510 4907849 4962288 5030057 5110752 5204034 5310001 5428467 5557902
60136 5557902 5695219 5836485 5977748 6115643 6247512 6370914 6483071 6581267 6663752 6729458
60126 6729458 6776630 6802737 6806461 6789130 6753508 6701835 6635902 6558597 6474308 6387742 6302757
60115 6302757 6222043 6147442 6080818 6025098 5983959 5959930 5953174 5962730 5988369 6030446 6088343 6159936
60103 6159936 6242354 6332485 6427077 6523308 6619290 6713233 6802189 6882399 6950849 7005952 7046931
60092 7046931 7073539 7086621 7088234 7080785 7066262 7046374 7023256 7000169 6981740 6973096 6978094 6998327
60080 6998327 7034039 7085871 7155569 7245553 7358265 7495409 7657228 7842874 8052238 8287104
60070 8287104 8549874 8841424 9160909 9507385 9880562 10279741 10702382 11143638 11596712
60061 11596712 12053817 12507428 12950867 13377575 13780277 14151365 14483960 14772171 15010749
60052 15010749 15195161 15322038 15389182 15395387 15340636 15226126 15053800 14826481 14549333 14230887
60042 14230887 13881888 13513047 13134091 12754108 12381640 12024210 11688157 11378788 11100412
60033 11100412 10856465 10649779 10482127 10353347 10262006 10207530 10190485 10209636 10259775 10333813
60023 10333813 10426195 10532656 10647312 10761916 10868040 10958502 11026992 11068478 11080768 11064474
60013 11064474 11020940 10951267 10857537 10743410 10612402 10466169 10304938 10129046 9939879 9740161
60003 9740161 9533671 9324045 9113699 8904478 8699156 8501344 8314005 8139070 7978318
59994 7978318 7833278 7704352 7591672 7497237 7424570 7375514 7348768 7342406 7356435 7391696 7447410
59983 7447410 7521186 7610602 7713307 7825905 7944065 8063812 8181893 8294940 8399050 8490110
59973 8490110 8564098 8617263 8646750 8651199 8630496 8585080 8515703 8423614 8310763 8180146 8036130
59962 8036130 7883812 7727509 7570084 7414015 7262695 7120191 6990056 6874759 6775936 6694624
59952 6694624 6631261 6585884 6558521 6549560 6560003 6591223 6643979 6717562 6810406 6921701 7051837
59941 7051837 7201045 7367966 7549684 7742451 7941921 8143072 8340409 8528291 8701245
59932 8701245 8854639 8985388 9091671 9171810 9223825 9246179 9238438 9201067 9135273 9043489 8929529
59921 8929529 8797903 8653257 8500543 8345013 8191550 8044392 7907677 7785569 7681253
59912 7681253 7596198 7530901 7486142 7463117 7462485 7483546 7524350 7582742 7657710 7749511 7857822
59901 7857822 7979850 8111039 8247575 8387203 8527491 8664819 8795971 8919719 9035751
59892 9035751 9142754 9238739 9322923 9396270 9460340 9516675 9567403 9615663 9665139 9719548 9782553
59881 9782553 9857684 9948210 10057407 10188937 10346707 10534328 10754846 11010708 11303531 11633688
59871 11633688 11999957 12399261 12826485 13274757 13735974 14200657 14657012 15090388 15484126
59862 15484126 15821355 16086940 16269168 16360791 16358988 16264888 16083765 15825416 15502913 15129928
59852 15129928 14719202 14283265 13835226 13387667 12950912 12532877 12140006 11777542 11449112
59843 11449112 11156912 10902464 10686958 10511075 10374799 10277237 10216450 10190115 10196884 10236652
59833 10236652 10308742 10409991 10534932 10677379 10831148 10989701 11145917 11292045 11419080
59824 11419080 11516503 11574003 11584159 11543308 11450103 11304450 11108397 10867303 10589061 10281935
59814 10281935 9953164 9609116 9256017 8900383 8548960 8208074 7882417 7574175 7283688
59805 7283688 7011370 6758796 6527647 6317991 6128438 5957949 5806553 5673840 5557603
59796 5557603 5454837 5363632 5283208 5212369 5148852 5090143 5034154 4979365 4925417 4873857 4827336
59785 4827336 4787558 4754328 4726390 4702331 4680733 4660617 4642024 4625102 4608222 4588094 4562253
59774 4562253 4530397 4492805 4448876 4398346 4343003 4285824 4228957 4173589 4121243 4073887 4032860
59763 4032860 3998624 3971461 3951639 3939152 3934132 3937340 3949476 3970266 3998838 4034586 4076806 4124020
59751 4124020 4174967 4230195 4291495 4359599 4433427 4511566 4593286 4677602 4762228 4843988 4919687
59740 4919687 4986488 5042495 5087758 5124315 5154786 5181155 5204938 5227611 5250204 5273131 5297239
59729 5297239 5324960 5359895 5405350 5463516 5535619 5622212 5723454 5839803 5972795 6125021
59719 6125021 6299401 6498656 6725149 6980430 7264710 7577351 7918267 8288230 8686638
59710 8686638 9108145 9540905 9967228 10365344 10711401 10982378 11160317 11236390 11212821 11101916
59700 11101916 10922580 10695380 10438402 10166244 9891697 9626665 9380391 9157554 8959430
59691 8959430 8787043 8642608 8528336 8445019 8391875 8367001 8367981 8393130 8442487 8517062 8617194
59680 8617194 8742341 8892265 9067319 9267541 9492550 9742512 10018164 10319908 10648263
59671 10648263 11005518 11395439 11820630 12281429 12778073 13312526 13887183 14503024 15160259
59662 15160259 15859736 16602146 17386184 18208325 19063512 19944773 20842591 21745800 22642975
59653 22642975 23522811 24374929 25192693 25975559 26727784 27455170 28163883 28861428 29556437
59644 29556437 30256434 30965966 31686298 32415417 33147704 33873787 34580451 35250690 35865372
59635 35865372 36406970 36862392 37222630 37481673 37638054 37697266 37670931 37573387 37419972 37227738
59625 37227738 37015228 36800447 36599818 36428967 36302868 36234546 36234588 36312096 36474938 36728898
59615 36728898 37077960 37525697 38074760 38724092 39467467 40294926 41193825 42147076 43130785
59606 43130785 44113893 45058982 45923038 46659617 47223328 47574443 47682062 47527454 47108170
59597 47108170 46439377 45549787 44475501 43256572 41935777 40555853 39155072 37764778
59589 37764778 36409924 35109802 33876977 32715765 31621752 30582101 29576762 28581941
59581 28581941 27575687 26542952 25477769 24383084 23269575 22153266 21051397 19978343
59573 19978343 18944317 17956909 17022404 16144991 15325642 14563155 13856476 13205188 12607710
59564 12607710 12060218 11558180 11098362 10678645 10296410 9948150 9630699 9342043 9080774
59555 9080774 8845161 8632771 8440531 8265221 8104352 7956470 7820062 7692214 7568953
59546 7568953 7446867 7323945 7199093 7071812 6942493 6811988 6680310 6546502 6410531
59537 6410531 6274800 6142809 6016247 5894140 5775127 5660141 5552343 5454655 5367908 5291576
59527 5291576 5225552 5170341 5125656 5089975 5062098 5042438 5032016 5030563 5036392 5048048 5065425 5089268
59515 5089268 5120034 5157235 5199405 5244724 5292017 5341133 5392219 5445137 5500104 5558380 5621494
59504 5621494 5689974 5763776 5843927 5932761 6032212 6142583 6263369 6394659 6537300 6692199
59494 6692199 6860220 7042747 7241796 7459119 7695204 7949475 8221653 8512498 8822487
59485 8822487 9149841 9490631 9841012 10198479 10560589 10923423 11282012 11631565 11967682
59476 11967682 12286274 12584289 12859792 13110371 13332124 13521384 13677063 13800502 13893899
59467 13893899 13960165 14003545 14028645 14039178 14039160 14034972 14034382 14043577 14066740 14108260 14173101 14264341
59455 14264341 14381889 14523704 14685988 14861021 15036627 15199298 15337185 15439718 15496223
59446 15496223 15496752 15433744 15302237 15099650 14826835 14489029 14095071 13656038 13184643 12694178
59436 12694178 12196428 11700800 11215721 10749558 10308974 9897239 9515323 9164011 8844194
59427 8844194 8556106 8299679 8075086 7881782 7717598 7580134 7468708 7383765 7324735 7289715
59417 7289715 7277114 7286346 7316976 7368473 7441110 7536141 7654505 7795818 7958665 8141428 8342703
59406 8342703 8561269 8795495 9042323 9296943 9553811 9807542 10052106 10279496 10480118
59397 10480118 10644749 10765840 10837403 10854895 10815899 10720835 10572944 10377705 10141871 9872427
59387 9872427 9576165 9260040 8931226 8596271 8260462 7928413 7604727 7293331 6996428
59378 6996428 6714921 6449803 6202381 5973244 5761856 5567510 5390109 5229748 5085951
59369 5085951 4957570 4843085 4740821 4649234 4567440 4495433 4433662 4382385 4341423 4310325 4288483
59358 4288483 4275017 4268765 4268822 4275222 4288770 4309942 4338182 4372656 4413248 4459977 4511235 4563272
59346 4563272 4611987 4655455 4695085 4734770 4778622 4828834 4885631 4949561 5023283 5110078 5210580
59335 5210580 5321764 5439130 5559224 5680673 5804694 5935257 6077461 6234911 6409255
59326 6409255 6602160 6816070 7052551 7311841 7595376 7907220 8251371 8628926 9039799
59317 9039799 9486188 9971922 10498591 11064634 11668444 12309852 12987000 13692929 14416494
59308 14416494 15145831 15869930 16577784 17258191 17901510 18501311 19053903 19556593 20007163
59299 20007163 20405273 20753554 21056218 21316188 21533757 21707575 21835763 21915681 21943660 21916027
59289 21916027 21830145 21684090 21476064 21205237 20873356 20485287 20048221 19570376 19059526
59280 19059526 18521705 17961271 17382534 16791063 16193381 15596118 15005833 14428748 13869877
59271 13869877 13333009 12821926 12340530 11890799 11471777 11082083 10722739 10395967 10101747
59262 10101747 9837469 9600988 9392152 9210898 9055545 8923865 8814527 8726420 8657411 8604930
59252 8604930 8567379 8543957 8533110 8531847 8536633 8544519 8553278 8560797 8564749 8562951 8553867 8536465 8509817
59239 8509817 8473441 8428185 8376004 8318307 8255092 8186455 8114534 8043127 7975553 7913621 7858521
59228 7858521 7811872 7775775 7752359 7743230 7748891 7768918 7803429 7854129 7922985 8009926 8112871
59217 8112871 8230242 8362508 8510889 8675321 8854137 9044908 9244724 9449950 9656449
59208 9656449 9860091 10056711 10241677 10410055 10557420 10680447 10776628 10843452 10878006 10877593
59198 10877593 10841126 10770410 10670338 10547638 10408538 10256839 10094073 9921626 9742291 9559316
59188 9559316 9374617 9189158 9004915 8824978 8651226 8483300 8320818 8165519 8020083
59179 8020083 7885681 7762176 7650411 7552960 7472516 7410469 7367116 7342418 7336537 7350391 7385915
59168 7385915 7445318 7530124 7641415 7780782 7950314 8151483 8384510 8648987 8944900 9273024
59158 9273024 9634030 10026333 10444104 10877685 11316082 11748443 12162954 12545684 12881764
59149 12881764 13157420 13360515 13480702 13511079 13449742 13298848 13062853 12749071 12369387 11939368
59139 11939368 11474904 10990106 10497565 10008435 9531425 9072708 8637185 8228896 7850037
59130 7850037 7500726 7180304 6888257 6623866 6385930 6173128 5983799 5815285 5664541
59121 5664541 5529736 5410551 5306838 5217958 5143407 5082758 5034428 4995670 4964642 4941759 4928294
59110 4928294 4924187 4927906 4938116 4954846 4978984 5010797 5049094 5092256 5140452 5196133 5261437 5335460
59098 5335460 5415069 5497973 5583779 5672366 5762924 5854747 5947228 6038420 6125023 6204648 6276876
59087 6276876 6341353 6396066 6438644 6468399 6485973 6491679 6485479 6468246 6441964 6408685 6369915 6326895
59075 6326895 6280955 6233779 6187698 6145489 6109542 6081487 6062643 6054067 6055750 6066605 6086057 6115277
59063 6115277 6156266 6210105 6276718 6355823 6447302 6550837 6666148 6793733 6934677 7089383
59053 7089383 7256851 7435567 7624956 7825638 8038161 8261750 8494603 8735198 8982601
59044 8982601 9235360 9490912 9746725 10001268 10252849 10497804 10730727 10945933 11137205
59035 11137205 11296133 11412577 11477927 11487444 11439196 11332011 11165689 10942834 10669661 10354901
59025 10354901 10008042 9638038 9252855 8859824 8465970 8077444 7698631 7332363 6980958
59016 6980958 6646460 6329902 6031210 5750177 5487052 5242102 5015277 4806402 4614896
59007 4614896 4438997 4276004 4123707 3981214 3848290 3724593 3609782 3503724 3406282 3317253
58997 3317253 3236505 3163530 3096996 3035525 2978846 2927236 2879847 2834736 2790849 2748888 2709946
58986 2709946 2674286 2641766 2612258 2585162 2559624 2535880 2515374 2498964 2486007 2475833 2468968
58975 2468968 2466066 2466641 2469815 2475305 2482559 2489797 2495188 2498563 2500895 2502644 2503863 2505581 2509570 2516378
58961 2516378 2524408 2531362 2536246 2539813 2543378 2547305 2550633 2552256 2552282 2551720 2551003 2549615 2547399 2545327 2544558
58946 2544558 2545424 2547735 2551357 2555989 2561034 2566110 2570937 2574345 2574388 2570141 2562538 2552661 2540139 2524274
58932 2524274 2506094 2488105 2472294 2459227 2448708 2440312 2433405 2427578 2423321 2421782 2423859 2429799 2439480
58919 2439480 2452646 2468886 2487519 2507503 2527838 2548687 2571862 2599184 2630343 2663455 2697755
58908 2697755 2734336 2773976 2815973 2859943 2906978 2957540 3009547 3060244 3109223 3158089 3208015
58897 3208015 3259293 3312664 3369112 3428405 3489463 3552291 3618089 3687283 3758901 3832367 3908694
58886 3908694 3989297 4074454 4163548 4256292 4353237 4455380 4563539 4678026 4798968 4927028
58876 4927028 5063459 5209179 5364287 5528927 5704024 5890538 6088596 6298241 6520724
58867 6520724 6758093 7011724 7282040 7569396 7874546 8198561 8543317 8911948 9307898
58858 9307898 9733367 10189256 10676415 11196292 11750648 12341448 12970781 13639842 14347808
58849 14347808 15092271 15870354 16678225 17509248 18353331 19198104 20029761 20832429 21587505
58840 21587505 22274295 22871476 23358601 23717766 23935449 24003953 23922175 23695512 23334589 22853267
58830 22853267 22267695 21596869 20862386 20085631 19284564 18473464 17664858 16870155 16098198
58821 16098198 15354616 14643313 13967934 13331301 12734067 12174711 11650929 11160806 10702812
58812 10702812 10275007 9874618 9498785 9145849 8815560 8507737 8221128 7953900 7704707
58803 7704707 7472560 7255953 7052917 6861978 6682602 6514821 6358932 6215448 6084719
58794 6084719 5966497 5860225 5765572 5682262 5609505 5546295 5492382 5448531 5415652 5393981 5383152
58783 5383152 5382858 5393210 5414420 5446200 5487753 5538626 5599340 5670699 5752708 5844977 5948101
58772 5948101 6063581 6191998 6332281 6483424 6646275 6823041 7015599 7224633 7449664
58763 7449664 7689453 7943335 8212927 8501732 8812403 9145364 9501020 9882172 10292779
58754 10292779 10735039 11209256 11716224 12258067 12836512 13451670 14102910 14789789 15511348
58745 15511348 16264789 17044859 17843790 18651146 19453613 20234855 20975615 21654548 22249740
58736 22249740 22740189 23107086 23335680 23417417 23350546 23138788 22790173 22317243 21736941 21068747
58726 21068747 20332379 19546699 18729183 17895162 17057784 16228844 15418744 14635186 13883054
58717 13883054 13166290 12488735 11852278 11255395 10694804 10167904 9672878 9207790 8771122
58708 8771122 8362382 7980759 7623773 7288459 6973256 6677633 6400761 6141770 5900330
58699 5900330 5675479 5464788 5266337 5080752 4909621 4752583 4607799 4474681 4354127
58690 4354127 4246300 4150072 4064554 3989418 3923667 3865666 3814577 3770493 3733319 3702689 3678526
58679 3678526 3660151 3645072 3629987 3612583 3591161 3563611 3528865 3488674 3445582 3399421 3348170
58668 3348170 3292043 3234122 3176665 3119235 3061032 3002691 2944880 2887063 2828505 2768946 2707821
58657 2707821 2644573 2580196 2516666 2454379 2392112 2329931 2269880 2213047 2158290 2104982 2054737
58646 2054737 2008903 1966341 1925445 1886663 1851032 1817463 1783587 1748706 1714334 1682227 1653087
58635 1653087 1626764 1602541 1579426 1556969 1535516 1515397 1496590 1479532 1465120 1453211 1442248
58624 1442248 1431293 1421480 1414502 1410558 1408808 1408985 1411317 1415458 1420835 1427818 1437392 1449505 1462576
58611 1462576 1474950 1486398 1497856 1509674 1520479 1528362 1533420 1538325 1545637 1555076 1564301 1571670 1576960
58598 1576960 1579974 1580267 1578238 1574879 1570237 1563635 1555579 1547786 1540972 1534348 1527907 1523582 1523213 1526681
58584 1526681 1532846 1541146 1551443 1563538 1577892 1596021 1619207 1647136 1678149 1710339 1742545 1775326
58572 1775326 1810990 1851501 1896289 1943332 1992350 2045374 2104112 2168479 2238054 2313199 2394204
58561 2394204 2481078 2574801 2677143 2788803 2909425 3039817 3181929 3335927 3499834 3673395
58551 3673395 3859912 4062366 4279569 4508003 4745608 4991238 5241317 5489127 5726737
58542 5726737 5945959 6138199 6295464 6411699 6482472 6504442 6476763 6402509 6287479 6138042
58532 6138042 5961048 5764591 5556784 5343674 5129289 4917214 4710872 4512470 4322882
58523 4322882 4142711 3973098 3815939 3673755 3548549 3439990 3345287 3261522 3187538 3123318
58513 3123318 3068608 3022936 2985882 2956335 2932250 2912153 2896380 2886186 2882209 2884185 2891188 2901513
58501 2901513 2913115 2924507 2934026 2937875 2930463 2907675 2868869 2815443 2749321 2673739 2593475 2512445
58489 2512445 2432007 2352563 2275403 2201811 2131881 2065743 2004577 1948910 1897279 1848332 1802998
58478 1802998 1762669 1726262 1691146 1656379 1623165 1592536 1564250 1537690 1512318 1487560 1463509
58467 1463509 1441409 1422217 1405096 1388310 1370997 1353038 1334066 1314185 1295111 1279010 1266189
58456 1266189 1254957 1243632 1231886 1220505 1210690 1203331 1198325 1194875 1192596 1191580 1191348 1191116 1191525 1194505
58442 1194505 1200701 1208592 1216989 1226664 1238430 1251446 1264930 1279941 1297855 1318557 1341695 1368166
58430 1368166 1398498 1431084 1463874 1496588 1529410 1560794 1588692 1612973 1634520 1652717 1665634
58419 1665634 1671959 1671037 1662089 1645325 1622936 1596999 1567250 1532858 1495492 1458422 1423156 1389053
58407 1389053 1355662 1323374 1292225 1262130 1234115 1209509 1188131 1168791 1151156 1135691 1122311
58396 1122311 1110585 1100608 1092234 1084353 1076555 1070515 1067901 1067804 1068148 1068672 1070567 1074049 1078406 1083612 1089773
58381 1089773 1095848 1101162 1107371 1116560 1128153 1140110 1152416 1166623 1182479 1197869 1211951 1225540
58369 1225540 1238348 1248615 1255905 1261706 1266643 1269325 1268701 1265651 1261549 1256998 1252634 1249665 1248719 1248996
58355 1248996 1248987 1247612 1245065 1243311 1244958 1250589 1257974 1265020 1272342 1281597 1292740 1304816 1318047 1332751
58341 1332751 1347238 1359305 1369147 1378456 1387394 1394888 1401145 1407215 1412490 1415332 1415811 1415217 1413160 1407928
58327 1407928 1399621 1390269 1380794 1370476 1359638 1350206 1342957 1336314 1328532 1319481 1310151 1301967 1296535
58314 1296535 1294423 1294284 1294580 1295639 1298507 1302775 1307521 1313457 1321887 1332338 1343407 1355136 1368245
58301 1368245 1382066 1395773 1410597 1428073 1447091 1465609 1484233 1504892 1526818 1547392 1566393
58290 1566393 1585828 1605821 1624368 1641231 1658434 1676483 1693284 1707211 1718306 1726329 1730750 1732975
58278 1732975 1735624 1739241 1742397 1745003 1748694 1754018 1760190 1767539 1777250 1788913 1801393 1815695 1833665
58265 1833665 1854202 1874384 1894233 1916709 1942955 1971193 2000377 2031233 2063475 2095692 2128193
58254 2128193 2162398 2197407 2230981 2263987 2299754 2338561 2376623 2411087 2442283 2470802 2496348
58243 2496348 2520079 2544271 2569106 2593344 2618241 2646871 2679414 2713169 2747313 2783525 2821976
58232 2821976 2861253 2902442 2948582 2999683 3052811 3107242 3164894 3225819 3288510 3354702 3428152
58221 3428152 3508260 3590696 3675053 3765931 3865621 3971834 4083824 4204394 4334150 4469889
58211 4469889 4610500 4758518 4913931 5072350 5231018 5390611 5549388 5702168 5847612
58202 5847612 5990550 6134886 6280276 6427794 6582161 6745722 6916499 7094793 7285278
58193 7285278 7490030 7705904 7931420 8169864 8423356 8690831 8974169 9278813 9605507
58184 9605507 9948847 10306833 10684084 11082937 11499916 11934470 12392668 12878555 13390496
58175 13390496 13929853 14504281 15118335 15770192 16461993 17203421 17999843 18846724 19741108
58166 19741108 20688638 21693783 22753971 23869814 25050634 26303484 27627557 29025909
58158 29025909 30511117 32092611 33771044 35552799 37456618 39496894 41673987 43991104
58150 43991104 46467795 49127493 51986472 55065997 58400771 62025394 65970385 70286004
58142 70286004 75056295 80381448 86367388 93142429 100855205 109637707 119597382 130863275
58134 130863275 143606398 157997731 174207293 192513818 213411377 237582148 265751069
58127 265751069 298395858 335113683 373712660 409802710 437792578 453111163 454167608
58120 454167608 442632821 422082518 396259529 368045796 339278003 310983746 283704885
58113 283704885 257778402 233492063 211089802 190719017 172419266 156145019 141776542
58106 141776542 129133679 118021122 108273547 99757825 92351417 85939011 80422576 75716846
58098 75716846 71736570 68399532 65639777 63409673 61675016 60422130 59671085 59468908
58090 59468908 59857475 60843591 62394723 64441753 66844532 69319740 71413614 72609655
58082 72609655 72537957 71124850 68562716 65157131 61202225 56947590 52602542 48328117
58074 48328117 44233078 40391024 36853958 33646336 30763253 28187358 25901245 23880268
58066 23880268 22088022 20490145 19065316 17796278 16659527 15632016 14700020 13853112
58058 13853112 13075749 12352159 11673806 11035285 10428315 9846273 9289918 8762849 8265765
58049 8265765 7799822 7370080 6979978 6626819 6307126 6021022 5766172 5532881 5311349
58040 5311349 5099917 4901190 4714564 4538083 4373538 4223610 4086660 3959149 3840299
58031 3840299 3729912 3624657 3521110 3419729 3321652 3224448 3125212 3025127 2926909 2830363
58021 2830363 2734338 2640484 2551211 2466235 2384508 2307001 2234260 2163928 2094079 2026451 1963317
58010 1963317 1904076 1848062 1797400 1753361 1712933 1672815 1634059 1598983 1566446 1534389 1504304
57999 1504304 1478680 1455999 1432679 1408338 1385104 1363171 1341055 1319157 1299329 1281651 1264644
57988 1264644 1247751 1230954 1213493 1195679 1180323 1169454 1161093 1151967 1141666 1131468 1121255 1110823
57976 1110823 1102151 1096753 1092419 1086205 1079210 1074648 1072389 1069200 1063680 1057331 1051111 1044310 1036815 1029707
57962 1029707 1023672 1019040 1016819 1017366 1018688 1018407 1016806 1015847 1016215 1017623 1020877 1026893 1034383 1040981 1046089
57947 1046089 1050478 1054129 1056880 1060244 1065948 1073395 1080952 1088967 1098926 1110405 1121431 1131263 1140245
57934 1140245 1147451 1151105 1151076 1148503 1143159 1133426 1118809 1100529 1079989 1058441 1037551 1018151 998886
57921 998886 978115 956735 937352 921284 908237 898001 890311 883818 877512 872611 870847 871519 872514
57908 872514 873524 875813 879253 882122 883607 884251 884232 883492 883266 885005 887835 889286 888450 886303 883190 878428
57892 878428 872335 866224 860130 852791 844222 836207 829829 824420 819324 814958 811737 809499 808268 808267 809243
57877 809243 811090 814654 820295 826218 830190 832433 834596 836303 835228 830586 823966 816420 807220 796028
57863 796028 783823 770920 756388 740495 725618 713405 702689 691548 680106 670006 662118 655910
57851 655910 650490 645420 640908 637711 636501 637266 639678 643634 648705 653622 657519 661236 666089 671706
57837 671706 676493 679805 682152 683724 684563 685895 689192 693871 697908 700883 704323 708715 712376 713992
57823 713992 714297 714282 713503 711205 707637 703115 697126 689474 681372 674418 669176 665381 662645 660426 658133
57808 658133 655768 653737 651819 649362 646754 645484 646295 648343 650758 653986 658969 665814 673827 682236
57794 682236 690422 697984 704745 710306 713922 715588 716776 718895 721375 722642 722601 722432 722124 720255 716492
57779 716492 712191 707890 702225 694423 686263 680272 677061 675411 673928 671697 668300 664144 660063 656006
57765 656006 650977 644771 638775 634345 631251 628260 624403 619141 612209 603856 594630 584798 574797 565992
57751 565992 559549 554529 548747 541757 535238 530108 525393 520660 517282 515972 515079 512994 510668 510076 511692
57736 511692 515234 521331 530192 539700 547322 553542 561317 572181 584647 596337 605963 613094 617649
57723 617649 620122 621234 621086 619511 617313 616155 617029 619460 622167 623783 623150 619849 614618 608727 602989
57708 602989 597685 592903 588322 583197 577429 572145 568290 565100 561041 555987 551388 548449 547215 547308 548437
57693 548437 550094 551702 553182 554694 556059 557389 560063 565718 574033 582668 589797 595745 601668 607652
57679 607652 612903 617200 621382 626631 633715 642653 652605 662258 670709 678035 684967 692145 699748 707600
57665 707600 715556 723898 733370 744638 757756 772285 787766 803877 820329 836985 854027 871728
57653 871728 890253 909951 931599 955821 982346 1010200 1038510 1066746 1094476 1121620 1149034
57642 1149034 1178176 1209962 1244354 1281195 1321023 1364687 1412385 1463277 1516145 1570518 1627282
57631 1627282 1687908 1752801 1820809 1890983 1964641 2044909 2134118 2232401 2339272 2455879 2584961
57620 2584961 2728758 2887608 3060701 3247699 3449218 3665731 3896259 4138274 4388668
57611 4388668 4644235 4900659 5151137 5386766 5599166 5782991 5935417 6052427 6125320 6141685
57601 6141685 6091298 5972501 5793829 5570187 5317745 5051262 4783420 4523848 4277749 4046253
57591 4046253 3828966 3626557 3441180 3274928 3128152 2999102 2884994 2783564 2693855 2615761
57581 2615761 2549083 2493127 2446852 2408977 2378070 2353173 2334621 2323759 2321288 2326003 2335739 2349707
57569 2349707 2369399 2396797 2432079 2473841 2521521 2576650 2641185 2715395 2798291 2889808 2991426
57558 2991426 3104433 3228445 3362028 3504012 3653596 3809506 3969403 4129690 4285407
57549 4285407 4430484 4558403 4662533 4736211 4773751 4772455 4733425 4659963 4555584 4424061
57539 4424061 4270770 4102720 3926877 3748581 3571103 3396006 3224155 3057196 2898040
57530 2898040 2749222 2610862 2481054 2358370 2243308 2137123 2040112 1951501 1870404 1796236
57520 1796236 1728400 1665996 1607979 1553589 1502733 1455875 1413321 1374792 1339964 1308972 1281746
57509 1281746 1257102 1233473 1210557 1189390 1170559 1153289 1136711 1121173 1107679 1096719 1088287
57498 1088287 1082402 1078841 1076787 1075571 1075640 1078190 1083967 1092778 1103798 1115923 1128383 1141739 1157786
57485 1157786 1177500 1199373 1220784 1241029 1262121 1286609 1315497 1348281 1383867 1421107 1459496
57474 1459496 1500012 1544549 1593908 1646962 1702433 1760871 1824123 1893407 1968844 2050484 2138731
57463 2138731 2233647 2334827 2442262 2556536 2677459 2802713 2928232 3049715 3163529 3266414
57453 3266414 3354956 3425600 3474969 3500029 3498395 3469238 3414208 3337150 3242631 3134930 3018529
57442 3018529 2898618 2779821 2664230 2551532 2441452 2335456 2235881 2144283 2061227 1986901
57432 1986901 1920947 1862105 1809021 1761458 1720071 1685159 1656359 1633428 1616372 1604659 1597195
57421 1597195 1593469 1594036 1599390 1608943 1621731 1637780 1658166 1683748 1714297 1748781 1786134 1825702
57409 1825702 1867346 1911460 1958943 2010935 2068307 2131274 2199669 2273693 2354192 2441835 2536039
57398 2536039 2634887 2736017 2837278 2936490 3030805 3116227 3187538 3238903 3265271 3263844 3234515
57387 3234515 3179188 3100915 3003373 2890539 2766426 2635055 2500386 2365873 2233973 2106245
57377 2106245 1983826 1867602 1758109 1655647 1560290 1471538 1388307 1309985 1237332 1171648
57367 1171648 1113062 1060316 1012132 967840 926693 887725 851008 818032 789835 765235 741862
57356 741862 718808 697302 678643 662120 645474 627236 608237 590727 576084 563709 552372
57345 552372 542194 534563 530056 527249 524026 519557 514592 510253 507071 504867 503009 500885 498627 497390
57331 497390 498672 503300 511084 521050 531746 541759 550539 558800 567895 578904 592397 608619 627258
57318 627258 647066 666290 683800 699684 714664 729052 742282 753376 761783 767896 772863 778042
57306 778042 784426 792210 800656 808620 815551 821792 827695 832838 836676 839726 843390 848541 854925 861956
57292 861956 869398 877129 884995 893257 902611 913306 924619 935573 945916 956193 967144 979098
57280 979098 991597 1003594 1014561 1025454 1037948 1052491 1067686 1081875 1094807 1107444 1120623
57269 1120623 1134226 1147377 1159327 1170464 1182241 1195470 1208977 1220984 1231870 1244269 1260031
57258 1260031 1278189 1296530 1314009 1330799 1346995 1362556 1378091 1394680 1413004 1433161 1455024
57247 1455024 1478332 1502855 1528824 1556738 1586433 1617024 1648029 1679648 1711550 1742567 1772333
57236 1772333 1802102 1832905 1864004 1894442 1925167 1957929 1992617 2027474 2061940 2097616 2136081
57225 2136081 2177108 2219627 2263399 2308880 2355978 2403644 2450597 2496129 2540276 2583307 2625027
57214 2625027 2664529 2700632 2732446 2759685 2782777 2802613 2819698 2833518 2843292 2849309 2852892 2855159
57202 2855159 2856674 2858253 2860958 2865046 2870099 2876437 2884993 2895266 2905005 2912909 2920338 2929239 2939735
57189 2939735 2951086 2963846 2979287 2997426 3017400 3039530 3065532 3096772 3133429 3175201 3221794
57178 3221794 3272788 3327883 3387062 3449891 3515106 3581607 3649287 3718051 3786647 3853408 3917692
57167 3917692 3979896 4040723 4101366 4163691 4229230 4298409 4371445 4449271 4532812 4622152 4717137
57156 4717137 4817745 4922959 5030378 5138028 5245648 5353315 5460135 5565446 5669939
57147 5669939 5774206 5877551 5979866 6083293 6190123 6300105 6411604 6524362 6639185
57138 6639185 6755986 6874245 6994401 7116565 7238636 7357992 7474570 7590191 7705395
57129 7705395 7819019 7930339 8039395 8145557 8247801 8346028 8440152 8528478 8609275 8683722
57119 8683722 8755069 8825036 8892949 8958129 9020989 9081773 9140078 9195815 9249386 9301305 9352699
57108 9352699 9405176 9458667 9510614 9558963 9604733 9649860 9694144 9736381 9776562 9814187 9846175
57097 9846175 9869598 9885155 9894916 9898201 9893030 9880070 9861269 9835880 9802003 9761167 9717206 9671206
57085 9671206 9621648 9568866 9514862 9458831 9397125 9327836 9251663 9168513 9077274 8978689 8874264
57074 8874264 8762259 8638549 8500956 8348655 8177771 7981941 7756876 7500325 7208568
57065 7208568 6877604 6506682 6095371 5637945 5125957 4555273 3924932 3230437 2464707
57056 2464707 1624594 709477 -286181 -1372371 -2556909 -3846832 -5255043 -6797525 -8485355
57047 -8485355 -10328683 -12348061 -14573464 -17034856 -19765724 -22815577 -26247831 -30126826
57039 -30126826 -34520117 -39512659 -45204827 -51697937 -59097253 -67525390 -77107827 -87933968
57031 -87933968 -100034648 -113377801 -127857604 -143309131 -159583643 -176578575 -194064807
57024 -194064807 -211411721 -227586090 -241602261 -253055496 -262193243 -269462045 -275007485
57017 -275007485 -278552271 -279616861 -277802557 -272976288 -265332498 -255307662 -243373590 -229871673
57009 -229871673 -215035931 -199139628 -182573663 -165790442 -149214310 -133204555 -118048443
57002 -118048443 -103946455 -91006412 -79263616 -68704120 -59274509 -50894655 -43480265
56995 -43480265 -36953651 -31235100 -26237511 -21876008 -18075403 -14765897 -11881296 -9366541
56987 -9366541 -7180665 -5289388 -3660505 -2266834 -1084700 -85627 765026 1499614 2143884
56978 2143884 2720876 3250456 3741963 4193506 4601201 4964483 5282509 5553529 5781204
56969 5781204 5975688 6145348 6291867 6415192 6517703 6601007 6663768 6705789 6730412 6740932
56959 6740932 6738619 6725914 6707052 6683283 6651092 6606775 6548768 6473842 6374975 6244799 6077705
56948 6077705 5867888 5610881 5310488 4981164 4641127 4305285 3985142 3690260 3426004
56939 3426004 3192302 2987481 2812185 2668996 2561274 2493909 2472430 2499067 2569781 2673056
56929 2673056 2787196 2879721 2917089 2880973 2775114 2616806 2425341 2218067 2009646 1808559
56919 1808559 1615764 1429959 1252793 1087267 934080 792676 663987 549399 448423
56910 448423 359703 283077 218800 166008 123425 90164 64710 44999 30829 24194 25801 33420
56898 33420 45129 61865 84689 111432 138057 161536 179439 188684 187501 177792 163507 147206
56886 147206 129599 111336 93446 76542 60942 47110 35306 25567 18519 14935 14132 14536 16635
56873 16635 23538 37493 57477 81097 106833 132986 156323 173740 184212 187838 184401 174401
56861 174401 160324 145162 130348 116170 103212 92167 82968 75061 67860 60536 52507 44688 38950
56848 38950 35663 33008 29270 24466 19442 14909 11728 10314 9361 7064 3974 2362 2373 1617 -513 -1008
56832 -1008 2926 10981 22073 36476 53486 70064 84758 100702 121524 145905 168966 187552
56820 187552 201341 210259 214263 215145 215626 216635 217480 218126 219195 220466 221751 224817 232141 243904 258216
56805 258216 274225 293197 316672 345200 378783 417078 459321 504918 553058 600208 639241
56794 639241 663481 671591 667143 654353 636262 616103 597367 581814 569149 559001 551874 548298
56782 548298 548754 554566 567390 587727 615188 650095 693472 745590 805993 874702 951337 1032090
56770 1032090 1108375 1169136 1204860 1210999 1189606 1148071 1095189 1037683 979774 924197 872218
56759 872218 823764 779329 741335 712339 692538 680458 675469 678136 688840 707827 736014 773889
56747 773889 819854 871091 925176 978418 1023057 1049206 1051077 1030384 993532 947015 895599 842643
56735 842643 790392 740287 693529 651171 613829 581974 556283 536957 523176 514163 510327 512381
56723 512381 519981 532399 549789 572024 596524 618745 634764 642364 640306 628493 608828 584315
56711 584315 557106 528346 499237 470683 442460 414523 388734 367253 349433 332379 314692
56700 314692 297716 283132 271342 262323 255872 250608 244822 238855 234632 232400 229966 225824 220885
56687 220885 216243 211242 205006 198161 191881 186694 183232 182436 183644 183923 180890 175316 169769 165664 162852
56672 162852 161074 160302 159984 159098 156956 153585 149703 146505 144655 143240 140574 136241 131368 126752 122133
56657 122133 117557 113866 111125 108179 104744 102522 102964 105103 106828 107474 107978 109211 111307 114002 116683
56642 116683 118581 119734 121210 123785 127090 130656 134860 140075 145698 150879 155502 159795 163826 168089
56628 168089 173524 179991 185635 188911 190590 192679 195947 199551 202542 204698 206202 207410 208716 210100
56614 210100 211243 212516 215025 219048 223239 226203 227992 229190 229504 228473 226870 225988 225925 225775 225269 225135
56598 225135 225884 227134 228051 227840 226079 223171 220094 217157 213587 208983 204412 201119 198807 196287 193274
56583 193274 190423 187953 185466 182934 180788 179153 177913 177317 177569 178131 178436 179082 181118 184200 186508
56568 186508 186613 184610 181464 178195 175724 174420 173640 172511 171313 171175 172216 172877 171579 168442 165100
56553 165100 163377 164282 167570 171785 175194 177101 178176 179412 181085 182810 184272 185674 187613 190527
56539 190527 194195 197897 201212 204443 208030 211878 215604 219106 222407 225230 227238 228655 230217 232600
56525 232600 236064 240327 244408 247066 247979 248325 249612 252187 255388 258849 262884 267654 272626 276961 280038
56510 280038 281736 282651 283906 286223 289281 292460 295957 300548 306394 312861 319595 327040 335577 344692
56496 344692 353474 361685 369989 379105 388919 398510 407052 414651 422198 430468 439480 448503 456281 461399
56482 461399 463137 462107 459614 456341 452288 447968 444564 442442 440339 436648 430817 422946 412936 401083
56468 401083 388943 378511 370564 364415 359012 353719 348423 343573 339812 336984 333915 329765 325131 321023
56454 321023 317259 312796 307322 301621 296529 292321 288921 285934 282559 278219 273257 268594 264992 262961
56440 262961 262698 263333 262965 260577 257532 256122 256877 258316 259118 259380 259882 261153 263352 266155 268671 270199
56424 270199 271063 272096 273643 275735 278696 282560 286410 289521 292790 297664 303881 309778 314782 319986
56410 319986 326046 331990 336616 339854 342390 345107 349278 356039 365028 374569 383642 392733 402341 411851
56396 411851 420447 428108 435086 441341 447065 452784 458311 462576 465242 467662 471437 476694 482298 486952
56382 486952 489502 489238 486934 484871 484807 486284 487704 488448 488972 489230 488170 484891 479667 473774 468587 464558
56366 464558 460651 455168 447691 439857 433656 429195 424791 419098 412436 406027 400562 395857 391462 387145
56352 387145 382762 378158 373507 369548 366853 364771 361865 357848 354335 352934 353154 353144 351994 350201 348272
56337 348272 346299 344974 345447 347726 350315 351963 352803 353449 354014 354556 355482 356858 358119 358994 359848 360627
56321 360627 360432 358901 357212 356929 358403 360807 363073 364276 363948 362737 362106 362745 363912 364955 366597
56306 366597 369802 374068 377947 380948 383999 388124 393387 399130 404730 410088 415486 420811 425092 427419
56292 427419 428334 429459 431600 434173 436652 439390 442463 444953 446239 446984 447890 448426 447917 447084 447237 448419
56276 448419 449561 450282 451504 454368 459235 465629 472558 479089 485094 491176 497730 504710 512518 522071
56262 522071 533345 544886 555637 566306 577941 590090 601656 612898 625158 638941 653449
56251 653449 667738 681325 693987 706027 718341 731192 743269 753076 760941 768522 776591 784539
56239 784539 791889 798961 805977 812691 819043 825199 830816 835251 838744 842518 847527 853837 861383 870482
56225 870482 881388 894030 908410 924631 942311 960471 978336 996112 1015065 1037033 1063479
56214 1063479 1094430 1128474 1164256 1201895 1242640 1287566 1337061 1391078 1449182 1510658 1575295
56203 1575295 1643972 1718076 1798591 1886019 1980578 2081944 2189469 2303444 2425636 2557801
56193 2557801 2700003 2850850 3008698 3171872 3338446 3506756 3675495 3842315 4002903
56184 4002903 4152516 4288001 4407485 4508897 4590175 4650551 4690343 4709678 4708506 4687610 4648657
56173 4648657 4593701 4525675 4448745 4366692 4281106 4192346 4101798 4011627 3922374 3832381 3739914
56162 3739914 3644734 3547472 3448546 3348016 3245690 3141321 3035399 2929559 2825471 2723549
56152 2723549 2623461 2525357 2429632 2336116 2244744 2156586 2072923 1993726 1918360 1847365 1782014
56141 1782014 1722301 1666844 1614788 1566499 1522427 1482409 1445940 1412051 1379430 1347961 1319613
56130 1319613 1296250 1277004 1259378 1242405 1226903 1213195 1200796 1190233 1182801 1178226 1174659 1171414
56118 1171414 1169811 1170830 1173804 1177908 1183172 1189519 1196569 1205019 1216534 1231644 1249191 1268388 1289743
56105 1289743 1313416 1338321 1363625 1389663 1416632 1443695 1470067 1495855 1521306 1546339 1571136
56094 1571136 1595868 1619609 1640854 1659435 1676728 1693976 1711769 1730998 1752544 1776095 1801107
56083 1801107 1828835 1861234 1897889 1936570 1977277 2023260 2077482 2140675 2213885 2300211 2402454
56072 2402454 2520940 2654959 2804395 2968482 3144468 3328611 3516894 3703884 3883042
56063 3883042 4049897 4203897 4346344 4478013 4599295 4710293 4809007 4890663 4950096 4984215
56053 4984215 4992381 4976712 4942645 4896724 4842258 4778290 4702810 4614401 4510385 4387028 4243944
56042 4243944 4086276 3920883 3752422 3584519 3422031 3269609 3129498 3002442 2889127
56033 2889127 2789210 2700830 2622789 2555606 2499037 2450458 2407199 2368539 2334026 2301979 2271326
56022 2271326 2242983 2217909 2195807 2176883 2162247 2151056 2140090 2128112 2117948 2112148 2109501 2108183
56010 2108183 2109365 2114706 2122885 2131792 2142037 2155279 2171121 2188599 2208808 2232972 2259749 2287347
55998 2287347 2316481 2348288 2381260 2413405 2445686 2480224 2516808 2554285 2593663 2636595 2682388
55987 2682388 2729652 2779308 2832611 2887817 2942347 2997093 3055285 3118159 3184738 3254698 3328433
55976 3328433 3405389 3485062 3568375 3655678 3745382 3837344 3935451 4043629 4161221 4285549 4416866
55965 4416866 4557282 4706856 4864455 5030647 5206172 5389485 5579425 5778197 5988087
55956 5988087 6207424 6433611 6667703 6911787 7164345 7422828 7688809 7966118 8255883
55947 8255883 8557769 8873817 9206426 9554664 9917050 10295679 10693315 11109357 11543432
55938 11543432 11999663 12482063 12989167 13519226 14077493 14672208 15306719 15982116 16704005
55929 16704005 17478933 18306659 19183208 20109086 21087681 22119142 23203843 24348858 25563192
55920 25563192 26849930 28211055 29655867 31195920 32836142 34580508 36441492 38433337
55912 38433337 40561563 42831592 45263000 47882557 50708653 53757252 57058622 60653514
55904 60653514 64579538 68881052 73631862 78934964 84907749 91684178 99418054 108256958
55896 108256958 118322336 129747785 142735123 157548465 174469028 193792988 215852335
55889 215852335 240980443 269461099 301511272 337082529 375196778 413112934 446278135
55882 446278135 469671015 479856358 476272926 460947854 437175776 408252941 376833398
55875 376833398 344796906 313355765 283258830 254994923 228899542 205167914 183859855
55868 183859855 164930241 148250232 133615567 120779653 109506805 99597587 90877645
55861 90877645 83188939 76396887 70389290 65062898 60320869 56081979 52278780 48845029
55853 48845029 45715212 42835887 40167254 37675164 35333082 33131628 31074888 29165400
55845 29165400 27399559 25774388 24286868 22925416 21671090 20508206 19426551 18414670
55837 18414670 17460667 16560453 15717028 14930617 14196125 13509505 12868404 12266295 11693967
55828 11693967 11147968 10630713 10141714 9675675 9230050 8807464 8409161 8032143 7673960
55819 7673960 7334633 7012577 6704062 6407776 6124982 5854427 5592203 5337594 5094590
55810 5094590 4867160 4657389 4468006 4301237 4154243 4020309 3895184 3778123 3666945
55801 3666945 3557415 3448307 3342346 3241231 3143864 3049827 2960150 2874246 2790666 2711406
55791 2711406 2640867 2579798 2524666 2473545 2427869 2387258 2347173 2303421 2255303 2203332 2147744
55780 2147744 2090604 2035778 1985313 1938521 1895098 1856032 1821184 1789461 1761577 1738952 1719741
55769 1719741 1699988 1679058 1659707 1642187 1622746 1598924 1571997 1542914 1510213 1473691 1436102
55758 1436102 1399196 1361632 1322643 1284346 1248448 1213871 1179686 1147499 1118978 1093518 1070059
55747 1070059 1048908 1030463 1014496 1001671 993102 987554 981955 975737 971602 970948 971748 972205 973096 974825
55733 974825 975439 973530 970177 966038 959425 949317 937575 925943 913349 898322 881813 865442 849109
55720 849109 832566 817432 805518 796668 789885 784737 779955 772627 760903 746130 730747 715559
55708 715559 700432 685854 672182 658863 645822 634090 623937 614100 603932 594344 585486 575823
55696 575823 564963 555094 547804 541584 534317 526136 517772 508183 496267 483409 471884 461793 451626
55683 451626 440802 429687 418113 405771 393350 381610 370125 358424 347533 339021 333298 329980
55671 329980 328915 329685 331054 332100 332946 333515 332833 330531 327580 324494 320290 314518 308827 305063 302963
55656 302963 301032 298535 295506 292037 288679 286345 284933 283461 282271 283246 286853 291130 294835 299284
55642 299284 305347 310963 313878 314879 315843 316294 314535 310971 307612 305162 303132 302169 303785 307985 313161
55627 313161 318184 323001 327622 332138 337312 343764 351069 358792 367420 376874 385220 390565 393249 394415
55613 394415 393509 389299 382512 375300 368625 362256 356865 353881 353150 352596 350515 347041 343452 341222 341365
55598 341365 343482 345701 346530 346274 345836 345242 344641 345517 349047 353988 357866 359642 359705 358144 354780 350175
55582 350175 344752 337670 328439 318909 311583 306414 301261 294970 287908 280017 270734 260794 251798 243879
55568 243879 235859 227882 221759 218205 215576 211893 206658 200319 193482 187003 181577 176873 172145 167593
55554 167593 163884 160590 156763 152966 150952 151077 151601 150917 149107 147106 145711 145534 146512 147244 146166 143479
55538 143479 140619 137983 134904 131946 131166 133364 136672 138692 138803 137757 136208 134472 132837 131439 130388
55523 130388 130154 131167 133112 135562 139004 144016 149667 154313 157969 162362 168402 175133 181423 187145
55509 187145 192420 197333 202901 210694 220819 231742 242633 254271 266826 278336 286604 291432 293894
55496 293894 294348 292315 287504 280010 270089 258575 246957 236353 226797 217853 209215 200248 189807
55483 189807 177163 162723 147642 133397 121738 113849 109027 105202 101332 98406 97580 98417 99624
55470 99624 100644 101727 103181 105209 107851 110554 112498 113854 115874 119209 122993 126247 129210 132494
55456 132494 135688 137761 138265 137377 135277 132281 129099 126187 123186 119563 115307 110494 104836 98441 92389
55441 92389 87673 83995 80439 76972 74302 72382 70017 66202 61285 56607 53263 51228 49446 46795
55427 46795 43106 39159 35759 33150 31380 30607 30701 30958 30786 30549 31331 33742 36887 38563 36888 32248
55411 32248 27450 25277 25890 27181 27484 27057 26963 27607 28743 29897 30233 28922 26349 24265 23972 24922 25760
55394 25760 26189 26911 28109 28995 28830 27657 25901 23915 22126 21202 21657 23235 24798 24974 23186 20135
55378 20135 17274 15732 15636 16127 15829 13824 10735 8590 8947 11292 13835 15558 16675 17458 17883 18500
55362 18500 20256 22859 24462 23749 21510 19465 18429 18444 19803 22639 25898 28031 28788 29372 30700 32382
55346 32382 33703 34850 36698 39801 43975 48532 52429 54465 53994 51699 49246 47835 47248 46523 45305
55331 45305 44031 43069 42394 42239 43243 45494 47981 49476 49594 48713 47509 46957 47971 50205 51850 51549
55315 51549 49986 48573 47186 44520 40446 36515 33855 31735 28739 24629 20698 18746 19708 22696 25421
55300 25421 26158 25189 23881 22858 21959 21367 21410 21495 20606 18885 17462 16659 15665 14068 12421 11094 9855
55283 9855 8737 8116 7826 7500 7744 9297 11053 10875 8827 7461 8094 8957 8218 6876 7031 8815 10811
55266 10811 12289 13293 13513 12807 12145 12440 13037 12695 11480 10339 9534 8999 9529 11904 15167 17488 18675
55249 18675 20231 22839 25224 25878 24704 22592 20265 18048 16193 15056 15070 16383 18221 19172 18712 18033
55233 18033 18681 20700 22760 23725 23396 22150 20582 19278 18398 17800 17887 19531 22609 25589 27375 28571
55217 28571 29870 30391 29099 26996 26030 26283 26041 24463 22394 20466 18160 15171 12244 10137 8868
55202 8868 8322 8501 8880 8597 7646 6941 7005 7630 8941 11493 14800 16996 16728 14646 12486 11413 11717
55185 11717 13245 15390 17205 18150 18464 18574 18678 19089 20219 21767 22551 21719 19756 17908 16953 16870 17384
55168 17384 18433 20168 22571 25000 26403 26360 25626 25067 24417 22997 21468 21693 24625 29220 33739 37220
55152 37220 39417 40229 39806 38574 36781 34617 32945 32917 34369 35553 35157 33760 32519 31321 29433 27411
55136 27411 26911 28502 30816 32305 32979 33800 34806 34628 32019 27473 22997 20206 18900 17669 15755
55121 15755 13958 13658 15206 17453 18821 18886 18915 20514 23482 25397 23937 19551 15166 13191 13377 13792
55105 13792 13163 11820 10857 11048 12548 15092 18137 20827 22117 21402 19323 17591 17497 18564 19102 18124
55089 18124 16398 15575 16584 18911 21190 22470 22995 23567 24054 23132 20146 16762 15747 18074 22012 25202
55073 25202 26908 28033 29729 32432 35745 38718 40463 40779 40086 38917 37825 37594 38860 41361 44073
55058 44073 46263 48008 49670 51368 53022 54415 55221 55459 55830 56916 58103 58094 56566 54596 53392 53416
55042 53416 54716 57013 59216 60037 59608 59460 60380 61312 61020 59748 58360 56834 54802 52883 52245 53158
55026 53158 54952 57109 59556 62155 64733 67285 69466 70379 69742 68784 68969 70225 71416 72145 72840 73389
55010 73389 73114 72235 72036 73315 75717 78637 81539 83216 82270 78975 75449 73281 72115 71262 71296 72823
54994 72823 74826 75818 75943 76245 76251 74173 69786 65506 63870 65051 67496 70045 72555 75161 77848 80523
54978 80523 82851 84295 84787 84921 84946 84069 81670 78843 77599 78426 79698 79846 79225 79200 80185 81473 82535
54961 82535 83479 84235 84292 83598 83120 83992 86396 89549 92577 95097 97190 99184 101420 103854 105803 106342
54945 106342 105173 103060 101287 100663 101025 101664 102151 102801 104330 107084 110550 113598 115075 114253 110949 105660
54929 105660 99728 95001 92751 92740 93577 94118 94327 94712 95392 96174 97241 99096 101674 104074 105471 106023
54913 106023 106519 107352 108143 108348 107892 107152 106528 106253 106610 108059 110886 114754 118880 122796 126597 130304
54897 130304 133436 135738 138021 141542 146570 152209 157721 163462 170336 178874 188999 200075 210961
54884 210961 220712 229699 239557 251534 265281 279587 293807 307942 321542 333107 340639 342777
54872 342777 339728 333195 324913 315207 303608 290843 278930 268652 258102 244950 229471 214147
54860 214147 200850 189763 180693 173829 168902 164853 160876 157089 153990 151962 151460 152839 155747 159332
54846 159332 163196 167541 172423 177742 183997 192011 201635 211721 221763 232576 244846 257950 270820
54833 270820 283056 294311 303326 308629 309921 307967 303370 296224 286716 275300 262304 248051 233359
54820 233359 219351 206648 195176 184749 175397 167018 159195 151644 144639 138827 134693 132247 130950
54807 130950 129803 127741 124363 120418 117314 115904 115834 116298 117049 118072 118392 116308 111463 106039 102987
54792 102987 103228 105207 106883 107406 107027 106316 105593 104552 102383 98866 95255 93268 93149 93480 92948 91438
54776 91438 89280 86472 83141 80034 77941 77062 77204 77962 78439 77603 75472 73330 72352 72611 73829 76211
54760 76211 79722 83229 85348 85840 85386 84316 82515 80450 79311 79804 81424 83290 85429 88882 94473
54745 94473 101535 108000 112099 113993 115469 117967 121370 124902 128629 133628 140963 150810 162290 173856
54731 173856 184281 193758 203857 216011 230244 245647 261709 278582 296131 313282 328449 340476
54719 340476 349078 354575 357273 357123 353939 347793 339055 328341 316657 305266 294908 285314 276056
54706 276056 267667 261209 256859 253673 250864 248603 247463 247791 249642 252544 255286 256897 257961 260136
54692 260136 264391 270722 279431 291155 305408 320776 337023 355225 375017 393740 409700 424415
54680 424415 439789 454555 465674 471999 474179 471855 463799 450699 435123 418315 399389 378255
54668 378255 357022 337349 318423 298990 279963 263429 249958 238252 226897 215382 203908
54657 203908 193269 184658 178599 174126 169617 164343 158846 154030 150358 147739 145753 144020 142481 141259
54643 141259 140325 139632 139558 140626 142728 145124 147237 148929 150040 150524 151165 153118 156257 158823 159383 158419
54627 158419 157369 156754 156085 155103 154128 153435 153092 153422 154912 157587 160877 164034 166415 167653 168177 169388
54611 169388 172622 177863 183880 189600 194800 199519 203496 206520 208966 211695 215574 221073 227844 234561
54597 234561 239594 242332 243731 245310 247766 250740 253651 256353 259093 262308 266634 272756 280946 290818
54583 290818 301667 313017 324808 337381 351466 367936 387048 407827 428420 447203 463459
54572 463459 477041 487650 494533 496753 493707 485548 473136 457491 439389 419650 399471 379979
54560 379979 361504 343949 327966 315009 305736 298849 292159 284633 276958 270263 264851 260205 255780
54547 255780 251495 247600 244260 241401 238917 236707 234335 231014 226435 221421 217113 213568 209830 205404
54533 205404 200794 196432 192025 187305 182507 177668 172384 166904 162430 159489 156965 153731 150331 147832
54519 147832 145844 143280 140567 139328 139903 140750 140479 139110 137192 135147 133803 134063 135387 135945 134996 133947
54503 133947 134268 135504 136305 136329 135961 135025 133235 131436 130937 131606 131936 131241 130751 132030 135059 138407 140889
54486 140889 142476 143814 145332 146977 148592 150317 152613 155987 160685 166505 172756 178565 183474 187713
54472 187713 191809 196108 200934 206896 214565 223826 233918 244079 253760 262339 269156 273929 276696 277326
54458 277326 275503 271194 264718 256410 246790 237058 228659 222105 216701 211550 206207 200224 192954 184399
54444 184399 175759 168552 163459 160315 158763 158368 158384 158000 156924 155597 154902 155548 157355 159130 159687 159071
54428 159071 158266 157767 157257 156827 157444 159534 161974 163349 163590 163498 163205 162320 161400 162017 164950 169089 172486
54411 172486 174053 174045 173445 173142 173315 173297 172252 170126 167696 165711 164383 163878 164704 167134 170453 173259 174508
54394 174508 174078 172504 170552 168993 168266 168075 167667 166735 165727 164942 163788 161590 158926 157269 157119 157308
54378 157308 156618 155364 154735 155057 155476 155081 153665 151576 149469 147989 147072 145811 143691 141763 141736 144036
54362 144036 147632 151577 155590 159073 160951 161093 160815 161258 161999 161996 161167 160357 160367 161746 164875 169347 173690
54345 173690 176712 178916 181764 185741 189981 193774 197459 201620 206190 210778 215367 220160 224969 229255
54331 229255 232785 235850 238583 240297 240021 237849 235337 234083 234171 234488 234291 233640 232305 229358 224467 218943
54315 218943 214702 212317 210490 207367 202236 196204 191254 188287 186145 183179 179617 177350 177107 177172 175831
54300 175831 174017 174205 177131 180874 183011 182629 180351 177539 175620 175300 176119 177343 179141 182119 185882
54285 185882 189275 192179 195804 200616 205141 207809 209182 211220 214748 218685 221586 222839 222244 219531
54271 219531 214926 209642 205202 202410 201194 200991 200877 199765 197165 193692 190282 186936 182865 177897 173022
54256 173022 169079 165513 161038 155295 149218 143836 139309 135315 131929 129794 129344 129926 129797 127355 122672
54241 122672 117695 114676 114391 115802 117075 116760 114518 111210 108131 105790 103610 101081 98668 97190 96779
54226 96779 97041 97733 98581 98874 98122 96862 95872 94785 92505 89006 85788 84439 85418 88151 91343 93238
54210 93238 92695 90453 88681 88971 91232 94389 97389 99605 101111 102613 104423 105716 105659 104853 104593 105085
54194 105085 105765 106849 108811 110613 110555 108912 107530 106551 104107 99974 96829 96453 97083 96392 95003 94913
54178 94913 96085 96949 97121 97397 97867 98087 98425 99470 100776 101828 103366 106022 108559 109320 108445 106790
54162 106790 103819 99057 94623 93349 94747 95678 95005 94664 95866 97224 97516 97570 98100 97956 96129 93826
54146 93826 93095 94576 97642 101521 105191 107297 107225 105614 103305 100753 98769 98374 99306 100033 99930 100003 100699
54129 100699 100548 98118 94051 89988 86554 83634 81646 81150 81793 82699 83533 84422 85364 86413 87755 88966
54113 88966 88939 87259 84943 83160 81954 80831 79702 78541 77105 75817 75976 78148 81211 83896 86360
54098 86360 89160 91544 92127 90718 88402 86208 84667 84068 84099 83748 82625 81807 82269 83106 82648 80931 79632
54081 79632 79679 80295 80451 80024 79294 78381 77504 77040 77040 77271 77799 78869 80277 81497 82401 83175 83650 83449 82807
54062 82807 82472 82736 83254 83790 84407 84826 84375 82843 80867 79279 78463 78361 78553 78310 77114 75269 73597
54045 73597 72527 71969 72034 73191 75506 78199 80278 81333 81593 81518 81525 81929 82967 84805 87261 89495 90425
54028 90425 89865 88854 88437 88485 88267 87816 87912 88849 90008 90722 90816 90240 88933 87350 86450 86759 87739 88428 88394
54009 88394 87896 87591 88279 90400 93261 95120 94709 92675 91011 91026 92390 94327 97051 101225 106244 110153
53993 110153 111751 112153 113562 116888 121292 125668 129643 133198 136439 139918 144139 148308 150645 150717 150652
53978 150652 153081 158261 164091 168673 172082 175757 180861 187302 193929 199748 205086 211221 218600 226052
53964 226052 232253 237420 242863 249350 256576 263734 269742 273450 274686 274974 276127 278249 280118 281431
53950 281431 283446 287075 291453 294850 296204 295341 292657 289232 286551 285208 284144 281800 277859 273396
53936 273396 269586 266805 264887 263602 262595 261256 259102 256361 253929 252497 251849 251248 250379 249380 247875
53921 247875 244764 239555 233476 228463 225188 222673 219676 215736 210911 205324 199367 193849 189558 186842
53907 186842 185651 185593 185908 185869 185490 185553 186819 189422 193022 197021 200469 202270 201939 200158 198405 198068 199672
53890 199672 202585 205372 206904 207381 208057 209891 212818 216395 220612 225577 230790 235477 239768 244988 252285
53875 252285 261122 269595 276334 281797 287502 294306 301799 309063 315323 319858 322064 322132 321303 321007 321937
53860 321937 324087 327199 330685 333541 334928 334869 334104 333477 333733 335565 339328 344904 352055 360546 369661
53845 369661 378365 386659 396080 407623 419479 428267 432836 435691 440094 446568 452899 456787 457677 456396
53831 456396 454056 451471 448958 446281 442965 438915 434687 430897 427286 422610 415761 406940 397341 387657
53817 387657 377486 366419 355169 345066 336748 329801 323417 316926 310051 303190 297208 292334 287544
53804 287544 281699 275010 268536 262442 255825 248403 241352 235935 232009 228439 224515 220373 216308 212308
53790 212308 208358 204903 202620 201543 200633 198748 196217 194724 195093 195754 194196 189714 183996 179325 176972
53775 176972 176959 178203 178856 177610 174927 172297 170266 168180 165874 164400 164645 166243 168336 170497 172354
53760 172354 173300 173360 173598 174894 176791 178156 178542 178381 178413 179368 181591 184381 186316 186902 187397 189366 192965
53743 192965 197279 201776 206607 211830 217129 222101 226392 230011 233978 239923 248218 257140 264864 271666
53729 271666 279022 287143 294936 302095 309431 316834 322662 326119 328880 333159 338944 344374 348326 351391
53715 351391 354312 356715 357837 357787 357386 357075 356544 355489 354238 353301 352384 350256 345797 339068 331245 323612
53699 323612 316846 311033 305991 301394 296854 292232 287919 284607 282453 280410 276732 270643 263477 257680
53685 257680 254500 253079 251997 250885 249798 247711 243126 236527 231000 229385 231174 233117 232721 230425
53671 230425 228310 227615 227985 228516 228687 228432 228013 227985 228720 229793 230386 230563 231600 234480 238408 241553 243168
53654 243168 244389 246876 251137 256238 260646 263344 264754 266649 270507 275702 280000 282209 283525 285664
53640 285664 288493 290528 291183 291250 291352 291435 292089 294879 300424 307125 312956 317885 323322 329606 335508 340274
53624 340274 344664 349400 353862 357342 360597 364876 369878 374004 376545 378386 380432 382467 383936 384893
53610 384893 385709 386714 388560 391936 396229 399411 400245 399930 400555 402510 404625 406364 408363 410751 412365
53595 412365 412177 410542 408523 406768 405432 404502 403599 402091 399938 398024 397158 397162 397362 397623 398265 399151 399407
53578 399407 398204 395597 392609 390479 389787 390222 391217 392644 394725 397428 400274 402582 403708 403408 402469
53563 402469 402617 405019 408955 412691 415582 418593 422813 428338 434718 441524 448190 454138 459414 464523
53549 464523 469497 474008 478650 484959 493601 503495 513310 522796 531916 539888 546342 552545 560054 568606
53535 568606 576743 584220 592248 601319 610243 617849 624491 631247 638458 645733 652811 659716 666469 673278
53521 673278 680752 689310 698310 706304 712370 716924 720979 724850 727905 729597 730334 731082 732427 734283 736256
53506 736256 737914 738991 739850 741519 744629 748360 751146 752395 752810 753100 753245 753137 752838 751864 749395 745901
53490 745901 743509 743823 746012 747989 748890 749443 750411 751777 753293 754831 756131 756938 757501 758519 760594 763980
53474 763980 768541 773727 779083 785136 793078 803001 813279 822543 831528 841934 854097 867025 880334
53461 880334 894748 910850 928609 948132 969660 992683 1016232 1040234 1065475 1092073 1119212
53450 1119212 1146768 1176044 1208299 1243443 1280764 1320014 1361054 1403186 1445786 1489224 1534468
53439 1534468 1581921 1631077 1681119 1731491 1782144 1833611 1886759 1942166 1999642 2058200 2116397
53428 2116397 2173097 2228489 2284140 2341349 2399561 2457214 2514062 2571607 2630866 2690730 2749266
53417 2749266 2805992 2862129 2918940 2976455 3033546 3088676 3140629 3188977 3233959 3275860 3314723
53406 3314723 3350650 3383989 3415070 3444065 3471274 3497138 3521762 3544795 3565888 3584884 3601290
53395 3601290 3614031 3622133 3625406 3624166 3618589 3608667 3594593 3576860 3556062 3532709 3507051 3478868
53383 3478868 3447597 3412806 3374489 3332973 3288843 3242884 3195675 3147156 3096974 3045447 2993777
53372 2993777 2943084 2893510 2844513 2795759 2747521 2700515 2655685 2613931 2575603 2540174 2506678
53361 2506678 2474696 2444909 2418457 2395602 2375260 2356351 2339668 2327781 2322748 2324333 2330832 2341121
53349 2341121 2355243 2373466 2395700 2421875 2452221 2487005 2526268 2569652 2616203 2664806 2715364
53338 2715364 2769100 2827030 2888597 2952610 3018919 3088125 3160237 3235109 3313881 3398234 3488043
53327 3488043 3581447 3677597 3777674 3882487 3990749 4100888 4213291 4329396 4449417 4572202
53317 4572202 4696783 4822899 4950354 5078673 5207024 5333815 5457035 5575836 5691189
53308 5691189 5803973 5912915 6015388 6109902 6196867 6277232 6351395 6419404 6481258 6536815 6585901
53297 6585901 6628426 6664024 6691832 6711144 6722043 6724874 6719430 6705093 6681284 6647113 6601155 6542367
53285 6542367 6470971 6387761 6293094 6187592 6073483 5954131 5832089 5708364 5583338 5457408
53275 5457408 5330710 5203190 5075304 4948051 4822139 4697637 4574441 4452520 4331765
53266 4331765 4212192 4094379 3979216 3867282 3759054 3655447 3557400 3464931 3377339 3294387
53256 3294387 3216558 3144135 3076813 3014388 2957090 2904943 2857320 2813427 2772862 2735701 2702418
53245 2702418 2673662 2649613 2629582 2612717 2598930 2588483 2581003 2575763 2572818 2572855 2575906 2581304 2588983
53232 2588983 2599573 2612906 2627684 2643328 2661045 2682263 2706988 2734646 2765586 2800468 2838745
53221 2838745 2879175 2921734 2967747 3017828 3070561 3123561 3175239 3225378 3274605 3323656 3372752
53210 3372752 3421403 3468928 3515175 3560404 3604461 3646467 3685406 3720657 3751847 3778628 3801020
53199 3801020 3819817 3836338 3851569 3865315 3875904 3880773 3877866 3866957 3849616 3827708 3801956 3771899
53187 3771899 3736828 3696256 3649671 3596667 3537794 3474815 3409483 3342243 3272643 3200820 3127838
53176 3127838 3054502 2980813 2907016 2834324 2763808 2695153 2627478 2561044 2497060 2435762 2375732
53165 2375732 2315438 2254647 2193973 2133878 2074626 2016570 1959795 1903935 1849008 1796079 1746352
53154 1746352 1699843 1655691 1613748 1575070 1540533 1509465 1480026 1450660 1420884 1390886 1360788
53143 1360788 1330513 1300262 1270766 1242697 1215847 1189319 1162928 1137992 1116091 1096956 1078212
53132 1078212 1057564 1034920 1012085 990639 970610 951070 931405 911573 891406 870229 847544
53121 847544 823961 801109 780425 762127 745424 729480 713805 697864 680979 663041 645044
53110 645044 628483 614247 602268 591938 582366 572396 561160 548900 536766 525517 514867 504496
53098 504496 495077 487552 481530 475211 467089 457357 447516 438994 432243 426743 421581 416130 410360 404551
53084 404551 398884 393481 388534 384086 379936 376216 373746 373126 373602 373576 372268 370136 367737 365190 363000
53069 363000 362173 362774 363275 362268 360208 358449 357109 355048 351859 348650 346500 344986 342856 339793 336970
53054 336970 335787 336280 337052 336875 336037 335629 335775 335540 334716 334582 336098 338309 339599 339962 340851 343108 346232
53037 346232 349592 353181 356965 360542 363776 366990 370208 372837 374358 374767 374233 372857 370903 368648 366010
53022 366010 362900 359898 357729 355976 353282 349146 344661 341092 338500 336177 333673 330813 327295 322952
53008 322952 318001 312705 307164 301702 296848 292557 288045 282825 277449 272862 269584 267783 267379 267587 267143
52993 267143 265611 263809 262319 260347 256934 252602 248793 246181 244586 244050 244644 245380 244728 242549 240409
52978 240409 239482 239043 237579 234680 231147 227700 224309 220666 216745 212748 208845 205290 202736 202026 203187
52963 203187 204800 205082 203867 202815 203193 204156 204035 202768 201808 201841 201933 201275 200625 201220 202823 203605 201809
52946 201809 197323 191956 188359 188116 190359 192509 192682 191243 189938 190031 191565 193819 195856 196873 196747
52931 196747 196199 195947 195736 194676 192610 190650 190056 190803 191609 191344 190188 189229 189089 189392 189814 191099 194256
52914 194256 198742 202284 203009 201305 199150 198164 198853 201093 204190 206546 206547 204404 202430 202793 205404 208587
52898 208587 211415 214469 218299 221996 223970 223830 223012 223507 226253 230878 236697 243542 251510 260233 268771
52883 268771 276326 282807 288598 293907 298389 301282 301906 300332 297745 295844 295502 296116 296544 296476 296476 296722 296313
52866 296313 294095 289957 285064 280913 278233 276610 275040 272931 270573 268539 266829 264981 262944 261304
52852 261304 260452 259991 259222 257827 255828 253341 250793 248949 248208 248081 247841 247479 247490 247920 248197 247835 246863
52835 246863 245636 244713 244730 245810 247148 247750 247559 247220 246914 246280 245557 245801 247507 249784 251433 252238 252555
52818 252555 252320 251241 249694 248528 247959 247210 245407 242595 239932 239074 241032 245158 249420 252051 252911
52803 252911 253023 253158 253341 253423 253380 253120 252707 252820 254211 256422 257805 257354 256069 255803 257034 258557 259330
52786 259330 259829 261111 263134 264668 264816 264009 263503 264502 267959 274410 283125 291645 297128 298561 297419
52771 297419 296098 296025 297189 298765 299809 299814 299131 298801 299756 302235 305827 309762 313210 315871 318373 321354
52755 321354 324029 324544 322268 318783 315763 312655 307738 301015 294568 289897 286280 282295 277792 273609
52741 273609 270138 267134 264480 262185 259762 256459 252305 248384 245747 244334 243050 240757 237132 232798
52727 232798 228776 225618 222914 219683 215419 210713 206808 204530 203749 203700 203549 202605 200432 197189 193680
52712 193680 190700 188293 185950 183415 180880 178461 176039 173736 172025 171178 171016 171290 171713 171528 169952
52697 169952 167409 165399 164514 163556 161576 159779 159844 160940 160285 156751 152179 148651 146062 143319 140609
52682 140609 139140 139281 140129 140643 140370 139334 137939 136806 136101 135195 133415 130877 128256 126209 125425 126539
52666 126539 129129 131295 131165 128748 125639 123263 122206 122753 124781 127019 127670 126233 124000 122451 121881
52651 121881 121805 121760 121220 119562 116790 113909 112048 111603 112539 114862 118196 121438 123496 124175 123896 122981 121745
52634 121745 120820 120658 120940 121113 121215 121535 121801 121606 121550 122993 126517 131395 136636 141814 146734 151227 155569
52617 155569 160232 164785 167873 168992 169508 171100 173658 175622 176076 175558 174864 173996 172625 170952 169637
52602 169637 169076 169001 168762 167977 166810 165470 163494 160116 155607 151592 149427 148602 147416 144871 141242 137201
52586 137201 133473 131156 131129 132787 134337 134811 134964 135771 136921 137420 136991 136170 135555 135621 136742 138582 139805
52569 139805 139170 136854 134216 132438 131819 132010 132408 132623 133036 134460 136634 137707 136182 132993 130493 129506
52553 129506 128596 126366 123306 120963 120231 121003 122713 124660 126326 127723 128992 129630 129037 128060 128841 132348
52537 132348 136928 140218 141760 142783 144092 145477 146801 148252 149418 149376 148030 146435 145439 145001 145247
52522 145247 147158 151260 156212 159691 160602 159874 159257 159903 161990 164948 167848 169984 171349 172473 173760
52507 173760 175224 176796 178497 180242 181770 183053 184547 186794 189857 193284 196547 199287 201175 201803
52493 201803 200943 198904 196545 194825 194213 194428 194755 194688 194378 194454 195347 196786 197995 198462 198472 198767 199678 200788
52475 200788 201526 201849 202056 202115 201671 200858 200617 201778 204061 206443 208374 210097 211759 212905 213215 213213 213705
52458 213705 214735 215667 216113 216206 215925 214851 212801 210234 207709 205447 203753 203337 204609 206966 209379 211430
52442 211430 213089 213800 212847 210746 209154 208933 209310 209608 210705 213576 217162 219304 219731 220514 223122 226334
52426 226334 227871 227132 225458 224397 224577 225733 226886 226836 225374 223903 224048 225765 227543 228347 228591 229175
52410 229175 230386 231908 233353 234485 235357 236315 237586 238897 239847 240386 240427 239428 237267 235311 235335 237112
52394 237112 238209 236805 233879 232012 232640 235118 237890 239890 241066 242050 243225 244121 244214 244293 246007 249646
52378 249646 253316 255045 254934 254450 254354 254275 253827 253115 252322 251629 251299 251150 250303 248255 245909 244724 245067 246130
52360 246130 247079 247432 246736 245083 243777 244258 246220 247765 247629 246360 245245 244988 245580 246430 246402 244676 241964
52343 241964 240075 239935 240808 241703 242566 243726 245142 246848 249292 252489 255473 257348 258427 259647 261315
52328 261315 263121 265099 267776 271369 275287 278562 280643 281939 283577 286291 289530 292034 293303 294014
52314 294014 295144 297434 301548 307567 313957 318320 319985 320934 323312 326906 330068 332219 334056 335815
52300 335815 337022 337979 340016 343788 348379 352600 356247 359533 362103 363482 364094 365065 367070 369956 373472
52285 373472 377719 382545 386950 389641 390291 389884 389748 390531 392247 394753 397670 400249 402124 404133 407595
52270 407595 412641 417955 422282 425422 427499 428290 427995 427955 429703 433597 438914 444908 451160 457316 463276
52255 463276 469416 475981 482495 488478 494579 502282 512391 524256 536498 548047 558592 568459 578194
52242 578194 588193 598928 611364 626368 643291 659976 674947 688911 703281 718042 732358 746794
52230 746794 763257 782560 803384 824000 843953 863658 883372 903096 922719 941844 960188
52219 960188 978331 997185 1016405 1034517 1051141 1067885 1085938 1103772 1118674 1130135 1140358
52208 1140358 1151437 1163368 1175105 1186379 1197560 1208249 1217074 1223144 1227327 1231561 1236750 1241618
52196 1241618 1244077 1243781 1242786 1243447 1246065 1248968 1250461 1250097 1248286 1245609 1242820 1240874 1240328 1240846 1241678 1242579
52180 1242579 1243958 1246155 1249002 1252292 1256345 1261784 1268951 1277967 1289242 1303194 1319149 1335184 1349731
52167 1349731 1363065 1376569 1390794 1405120 1419312 1434297 1450772 1467753 1483313 1496497 1507860
52156 1507860 1518266 1527785 1535822 1541883 1546116 1549304 1552229 1554737 1555612 1553892 1550153 1545910 1541795 1537086
52142 1537086 1531216 1524804 1518608 1512299 1505248 1497999 1491664 1485896 1478818 1469482 1459317 1450392 1443108 1436508
52128 1436508 1430159 1424488 1419503 1414430 1408854 1403287 1398364 1394153 1390442 1387023 1383534 1379679 1375709 1372064
52114 1372064 1368501 1364517 1360731 1358707 1358891 1359677 1359224 1357338 1354921 1352434 1349825 1347220 1344689 1341782 1338116
52099 1338116 1333888 1329124 1323231 1316242 1309673 1304814 1300678 1295022 1287063 1277944 1268952 1260770 1254136 1249525
52085 1249525 1246050 1242293 1238380 1235629 1233857 1230848 1225178 1217983 1211021 1204335 1196920 1188647 1180494 1173578
52071 1173578 1168631 1165550 1162842 1158563 1152533 1146557 1141766 1137127 1131592 1126258 1122801 1120802 1118333 1114570
52057 1114570 1110197 1105761 1101270 1097129 1093884 1091174 1088527 1086953 1088041 1091318 1094275 1095436 1095975 1097856
52043 1097856 1101793 1107606 1115117 1123820 1132865 1142351 1153706 1167835 1183686 1199543 1215099 1231330
52031 1231330 1249031 1268475 1289966 1313519 1338163 1362650 1386861 1411619 1437102 1462378 1486697
52020 1486697 1510436 1534339 1558445 1582256 1605610 1628789 1651765 1673717 1693460 1710255 1724107
52009 1724107 1735380 1744350 1751296 1756908 1762156 1767577 1772834 1777141 1779901 1780817 1779707 1776635 1772097 1766677
51995 1766677 1760542 1753541 1745834 1738126 1731180 1725299 1720203 1715240 1709685 1703142 1695794 1688196 1680938 1674599
51981 1674599 1669774 1666604 1664337 1661923 1659170 1656738 1654873 1653010 1651191 1650951 1653630 1658209 1662214 1664804
51967 1664804 1667636 1672204 1677630 1682036 1685079 1687811 1690480 1691810 1690541 1686703 1681342 1675765 1671110 1667659
51953 1667659 1664344 1659700 1653614 1647397 1641843 1635990 1628183 1617672 1604661 1589424 1572062 1552707 1531444
51940 1531444 1508317 1483769 1458596 1433005 1406266 1377847 1348354 1318646 1288685 1258204 1228091
51929 1228091 1199800 1173236 1146369 1117367 1086393 1054908 1023920 993568 963911 935296 907858
51918 907858 881183 854740 828565 803298 779447 756739 734402 712149 690547 670218 651009
51907 651009 632303 613926 596328 580027 565282 552172 540395 529020 517108 504858 493699
51896 493699 484838 477968 471689 465042 458212 451757 445530 438708 430856 422692 415566 410265 406484 403414
51882 403414 400500 397607 394784 392092 389432 386458 382914 379154 375873 373118 369944 365450 359898 354515
51868 354515 350421 347917 346404 344633 341490 337069 332711 329550 327365 325309 323287 321818 320831 319468
51854 319468 317121 314083 311116 308816 307311 306125 304564 302760 302026 303411 306061 307831 307518 305749 303673
51839 303673 301662 299490 297069 294603 292430 290761 289205 286742 282857 278576 275539 274144 273436 272746 272249
51824 272249 271731 270091 266752 262689 259395 257431 256433 255793 254928 253604 252558 253029 255081 257086 257509 256539
51808 256539 255310 254283 253269 252528 252885 254905 258499 263006 267182 269591 269756 268705 267964 268353 269971
51793 269971 272532 275083 276266 275840 275421 276784 279833 283087 285657 287720 289502 290913 292013 292865 293082
51778 293082 292405 291527 291389 291954 292633 293683 295966 299440 303069 306298 309445 312486 314627 315416 315297 314874
51762 314874 314515 314814 316265 318211 319208 318828 318018 317411 316532 315185 314217 314046 313639 312089 310260 309724 310754
51745 310754 312561 314863 317903 321336 324456 327368 330616 333496 334003 331034 325985 321705 320196 321506
51731 321506 324354 327425 330216 332867 335360 337257 338499 340041 343126 348013 353756 359204 363792 367545
51717 367545 370802 373948 377101 380073 382818 385702 389071 392897 397244 402691 409608 417361 425007 432753
51703 432753 441725 451956 461379 467431 469438 468942 467867 466728 464723 461300 457269 454185 452716 452046
51689 452046 450927 448869 446056 442799 439681 437766 437730 438771 439144 437937 435841 434202 433916 435179 437377
51674 437377 438877 437725 433364 427465 422570 419844 418271 415980 412198 407957 404896 403470 402670 401538
51660 401538 400329 399730 399687 399788 400276 401456 402374 401469 398621 395281 392334 389290 386038 383806 383440 384034
51644 384034 384432 384949 386249 387512 387356 385930 384508 383454 382314 381650 382860 385901 388965 390979 392938
51629 392938 396057 399915 403341 406026 408399 410855 414070 419256 427011 436397 446073 455741 465464 473962
51615 473962 478880 478974 475225 469561 462990 455117 445143 433283 421229 410966 402872 395428 387077 377861
51601 377861 368810 360462 352855 346527 342384 340448 339490 337950 334761 329613 323239 317416 313740 312273
51587 312273 312007 312490 313949 315840 316550 315168 312592 310267 308639 307475 306764 306301 305010 301974 298021
51572 298021 295258 294878 296153 297586 298308 298236 297717 297454 298156 299703 300924 300620 298691 296008 293421 291262
51556 291262 289644 288749 288730 289558 291185 293700 297182 301447 305970 310007 312828 314084 314220 314462 316014 319143
51540 319143 323208 327573 332157 337015 341893 346587 351371 356515 361643 366276 370837 376319 382733 388665
51526 388665 392731 394813 395483 394950 393343 391355 389598 387504 383980 379291 375410 373932 374283 374572 373925
51511 373925 373369 374525 377959 382993 388723 394852 401459 408354 414928 420670 425482 429449 432590 435100
51497 435100 437528 440323 443239 445567 446985 447802 448322 448348 447573 446215 444916 444088 443602 443156 442695 442314 441947
51480 441947 441451 440936 440587 439997 438129 434451 429801 425463 421488 416822 411321 406579 404018 402883 401257
51465 401257 398717 396820 396819 398035 399018 399584 400944 404074 408533 412822 415566 416335 415593 414030 412004 409586
51449 409586 406800 403583 399719 395275 391081 388370 387913 389679 393013 396655 399020 399413 399013 399674 401557
51434 401557 402952 402830 402476 403754 406635 409524 411542 413329 415836 419342 423670 428479 433243 437712 442483
51419 442483 448332 454876 460664 464817 467870 470817 474184 478360 483876 490515 496690 500720 502574 503718
51405 503718 505327 507255 508831 509915 510836 511594 511704 510920 509967 510260 512566 515885 517978 517255 514006 509581
51389 509581 504670 498914 492104 485113 479273 474968 471151 466216 459357 451197 443241 436544 430819 425026
51375 425026 418974 414049 411882 412279 412971 411779 408846 406371 406187 408018 410169 411483 412179 412975 413982
51360 413982 414687 414749 414462 414399 414811 415440 415784 415367 413779 410694 406095 400437 394372 388100 381153 373067 364372
51343 364372 356709 351616 348961 346675 342407 335702 328380 322607 318757 315549 312005 308489 305600 302807
51329 302807 298943 293791 288451 284128 281110 279067 277704 276793 275865 274341 272011 269270 266922 265704 265746
51314 265746 266333 266309 264872 262056 258514 255029 252212 250362 249435 249148 249220 249503 249830 249778 248662 245942 241869
51297 241869 237670 234715 233360 232862 232500 232251 232100 231460 230036 228794 229041 230741 232754 234727 237603 242001
51281 242001 247252 252536 257920 263443 268153 271143 273068 275543 279236 283411 287116 289927 291575 291726
51267 291726 290351 287776 284315 280226 275867 271343 266238 260325 254473 250106 247748 246608 245484 243431
51253 243431 239840 234869 229914 226667 225339 224425 222335 218634 213736 208494 204308 202368 202045 201017 197974
51238 197974 194493 193224 194746 197250 199059 200234 201590 203119 203971 203582 202373 201350 201118 201357 201342 200904
51222 200904 200523 200535 200831 201435 202688 204415 205632 205748 205476 205822 206699 207381 207898 208858 209978 209868 207533
51205 207533 203429 198984 195620 194126 194093 193886 191979 188511 184918 182126 180065 178882 179297 181266 183471
51190 183471 184806 185427 185648 184907 182953 181084 180836 181890 182636 182558 182735 184039 186182 188677 191449 194114
51174 194114 195800 196321 196520 196892 196797 195836 195076 195875 198112 200662 203186 206189 209482 211821 212399 211713 210662
51157 210662 209580 208561 208002 208244 209160 210463 211926 213050 213167 212402 211882 212350 213063 212820 211681 210863 211203
51140 211203 212656 215169 219002 223967 229132 233657 237366 240364 242646 244254 245210 245135 243578 241014 238794
51125 238794 237746 237376 236801 235870 234943 234286 234288 235641 238491 241715 243692 243548 241217 236866 231153 225656
51109 225656 221974 220242 219248 218109 217214 217465 219128 221490 223225 223120 221032 218165 215948 214606 213214
51094 213214 211038 208347 206014 204954 205834 208597 212090 214695 215554 214849 213089 210801 208801 207891 207960 207967
51078 207967 207023 205072 202461 199504 196671 194594 193660 193934 195357 197350 198412 197165 194020 190925 189174
51063 189174 188414 188000 188189 189411 191375 193573 195866 197893 198839 198552 197980 197660 196732 194496 192020 190840
51047 190840 190710 190135 188804 188014 188688 190319 191956 193127 193713 193990 194958 197538 201194 204328 206186 207417
51031 207417 208705 210087 212009 215665 221379 227510 231881 233846 234409 234952 236439 239153 242375 244723 245680
51016 245680 246455 248618 252098 255374 257462 258892 260544 262442 264195 266088 268912 272662 276072 277975
51002 277975 278855 280353 283054 285539 286206 285368 284567 284099 282547 279033 274729 271432 269437 267654 265305
50987 265305 262691 260631 259857 260593 262047 262597 261315 259208 258113 258406 258648 257674 256194 255857 257271 259489
50971 259489 261078 261271 260275 259023 258639 259788 262361 265748 269332 272618 275133 276631 277549 278933 281593
50956 281593 285268 288842 291456 293310 295286 297979 301349 305143 309233 313403 317188 320324 323294 327069
50942 327069 332143 337957 343441 348092 352392 357236 363134 370064 377881 386559 396107 406590 418264 431256
50928 431256 444979 458364 471001 483549 496547 509380 521301 533083 546534 562273 579156
50917 579156 596332 614786 636047 660250 686555 714976 746583 781873 819928 859497 900230
50906 900230 942567 987070 1034295 1084923 1139543 1198342 1261137 1327450 1396381 1466614 1536923
50895 1536923 1606671 1675710 1743711 1809734 1872490 1931055 1985132 2034522 2078427 2115689 2145833
50884 2145833 2169446 2187287 2199501 2206339 2209331 2210867 2212257 2212739 2210752 2205910 2199419 2192834 2186708
50871 2186708 2180248 2171796 2159670 2143034 2122267 2098404 2071894 2041770 2006192 1964149 1916676 1866140
50859 1866140 1814121 1760228 1703222 1643008 1581109 1519350 1458797 1400013 1343552 1289751 1238626
50848 1238626 1190564 1146757 1108183 1074276 1043307 1014211 987474 964087 944221 927291 912840
50837 912840 900839 891255 883711 877575 872257 867631 864310 863216 864538 867288 870215 872983 876065 879684
50823 879684 883471 887229 891459 896834 903386 910470 917449 924372 932138 941887 953978 967670 982077
50810 982077 997233 1013722 1031592 1050458 1070556 1092600 1116432 1141143 1167118 1196600 1231053
50799 1231053 1269118 1308794 1350934 1398492 1452414 1510381 1570378 1633784 1703796 1781970 1867682
50788 1867682 1960290 2060343 2168686 2285376 2409706 2540745 2677783 2820464 2968429 3120680
50778 3120680 3275597 3431513 3586528 3737342 3879260 4008324 4123125 4223762 4309610 4379271
50768 4379271 4432424 4470443 4494984 4507165 4508636 4502494 4492277 4480353 4467761 4455242 4443878 4434863
50756 4434863 4428956 4425909 4424078 4420646 4412503 4396942 4371717 4334992 4285726 4223871 4149898 4064222
50744 4064222 3967401 3860797 3746679 3627537 3505443 3382049 3259037 3138459 3022696 2914076
50734 2914076 2814276 2723895 2642620 2570061 2506548 2453066 2410359 2378319 2356433 2344519 2342598
50723 2342598 2350135 2365936 2388906 2418278 2452727 2489757 2526507 2561009 2592383 2620312 2644866
50712 2644866 2666450 2685008 2699201 2707107 2708018 2703008 2693487 2679637 2660525 2635319 2604012 2567202
50700 2567202 2525501 2479210 2428456 2373816 2316778 2259371 2203233 2149209 2097668 2048746 2002326
50689 2002326 1958526 1918618 1884912 1859130 1841056 1829229 1822685 1821452 1825521 1834224 1847037 1864491
50677 1864491 1887839 1918002 1955252 1999673 2051249 2109333 2172715 2240849 2314768 2396056 2484844
50666 2484844 2579353 2677462 2777908 2879474 2979804 3076110 3166886 3251945 3330673 3401137 3461306
50655 3461306 3510328 3548002 3573620 3586293 3586365 3575732 3556512 3529929 3496844 3459105 3419903 3382746
50643 3382746 3350164 3323239 3301959 3285691 3273457 3264145 3256654 3249853 3242475 3233299 3221417 3205927
50631 3205927 3185339 3157851 3122675 3080856 3034458 2985208 2934242 2882635 2831485 2781820 2735173
50620 2735173 2694032 2660736 2635844 2618440 2608183 2606107 2613208 2629326 2654056 2687910 2731883 2786662
50608 2786662 2852972 2931860 3023415 3125575 3235330 3351039 3472554 3599071 3727734 3854441
50598 3854441 3975158 4086430 4185779 4272367 4346788 4409785 4461530 4502280 4532891 4554086 4565734
50587 4565734 4567509 4559933 4544163 4520970 4490611 4453751 4412070 4367871 4323352 4280133 4239127 4200941
50575 4200941 4166727 4138549 4118391 4106759 4102570 4104311 4110646 4119829 4129467 4137657 4144009 4148905 4151963
50562 4151963 4152012 4148460 4141761 4132287 4119640 4103732 4085990 4068728 4053525 4040885 4031268 4025691 4025171
50549 4025171 4030159 4040526 4055455 4072984 4090260 4104784 4115342 4121606 4123087 4118692 4106966 4086453
50537 4086453 4055927 4014508 3961536 3896527 3819706 3732635 3637758 3537050 3431592 3322666 3212532
50526 3212532 3103504 2996751 2892798 2792813 2698438 2610343 2527815 2450122 2377771 2312242 2254815
50515 2254815 2205653 2163494 2126239 2092569 2063331 2040804 2026250 2018516 2015364 2015639 2019712 2028202
50503 2028202 2041000 2057605 2077997 2103007 2133871 2171250 2214492 2262070 2313101 2368367 2429545
50492 2429545 2497577 2572096 2652373 2738276 2830066 2927590 3030055 3136560 3246581 3359693
50482 3359693 3474679 3588899 3698882 3802047 3898128 3988808 4075890 4159996 4241035 4319332
50472 4319332 4395656 4470405 4543656 4616261 4690041 4766210 4844032 4921936 4999826 5079531 5162988
50461 5162988 5250891 5343204 5439916 5540495 5643347 5746735 5849912 5952591 6053471 6149975
50451 6149975 6239121 6317813 6382522 6429790 6457421 6464624 6451027 6416363 6361348 6288021 6198728
50440 6198728 6095379 5980022 5855536 5725500 5594044 5466187 5347328 5241471 5150279 5074266
50430 5074266 5014163 4970348 4941721 4926332 4922804 4929923 4944748 4962118 4976145 4981417 4972979 4946541
50418 4946541 4899519 4831323 4742331 4633302 4506144 4364335 4211722 4051298 3885698 3718325
50408 3718325 3553096 3393056 3239775 3093942 2955931 2825872 2703923 2590810 2487706
50399 2487706 2395080 2311776 2235551 2164795 2099826 2042427 1993972 1953929 1920229 1890979 1865620
50388 1865620 1844517 1827895 1815396 1806555 1801436 1800779 1805321 1814746 1827431 1841694 1857267 1875099
50376 1875099 1895842 1919328 1945626 1975590 2009679 2047039 2086622 2128661 2173972 2222126 2271513
50365 2271513 2321307 2372312 2425573 2481067 2538186 2596694 2656513 2717081 2777597 2837669 2897227
50354 2897227 2956105 3014237 3072172 3130912 3191241 3253469 3317702 3383953 3451963 3521185 3590965
50343 3590965 3660546 3728953 3795113 3858154 3917384 3971938 4020593 4062077 4095505 4120411 4136328
50332 4136328 4142392 4137440 4120443 4090740 4047841 3991356 3921439 3839259 3746860 3646685 3541408
50321 3541408 3433883 3326711 3221847 3121068 3026779 2941626 2866996 2802359 2746553 2699432
50311 2699432 2661979 2635135 2618904 2612271 2613278 2619013 2625845 2630057 2628552 2619418 2602030 2576377 2542149
50298 2542149 2498799 2446783 2388322 2326343 2262655 2197504 2130853 2063542 1997034 1932419 1870055
50287 1870055 1810069 1752789 1698471 1646869 1597554 1550895 1508231 1470637 1437758 1408542 1382930
50276 1382930 1361909 1345665 1332623 1320938 1310307 1301679 1295759 1292547 1291777 1292827 1294570 1296581 1300467
50263 1300467 1308717 1321702 1336784 1351091 1364492 1379133 1396635 1416705 1438283 1460903 1484532
50252 1484532 1508909 1533848 1559927 1587995 1617862 1648140 1677785 1707178 1737159 1767519 1797369
50241 1797369 1826558 1855434 1883056 1907066 1926006 1940721 1952598 1961353 1965638 1965173 1961074 1954580
50229 1954580 1946575 1937970 1929098 1918739 1904909 1886793 1864972 1840048 1812365 1783076 1753927 1725427
50217 1725427 1696419 1665989 1634634 1603122 1571533 1540254 1510674 1483658 1458112 1432188 1405431
50206 1405431 1378880 1353616 1330225 1309215 1290829 1274526 1259449 1245363 1232531 1220933 1210287
50195 1210287 1200600 1192075 1184679 1178424 1173778 1171071 1169769 1169063 1169005 1170208 1172559 1175051 1177058 1179077 1181977
50180 1181977 1185950 1190330 1194173 1196947 1198854 1200372 1201441 1201513 1200604 1199604 1198985 1197835 1194971 1190460 1185145
50165 1185145 1179170 1172124 1164391 1157023 1150243 1143305 1136078 1129483 1123876 1118243 1111823 1105688 1101661 1099999
50151 1099999 1098972 1096681 1092838 1088909 1086820 1087413 1089905 1092943 1096125 1100089 1105092 1110117 1113735 1115355
50137 1115355 1115198 1113445 1110040 1105315 1100401 1096746 1095086 1094708 1093896 1091432 1087629 1083513 1079214 1073872 1067266
50122 1067266 1060700 1055728 1052409 1049318 1044926 1038675 1031034 1022943 1014981 1006766 997440 986958 976516
50109 976516 967397 959896 953776 949177 946269 944363 942365 940255 939324 940650 943814 947372 950108 951512
50095 951512 951529 950459 948979 947743 946806 945701 944174 942586 941397 940493 939330 937740 936293 935771 936526 938559
50079 938559 941960 946819 952685 958572 963725 968212 972548 976916 981090 985056 989297 994221 999534 1004651
50065 1004651 1009733 1015873 1023867 1033065 1041973 1049896 1057464 1065498 1073972 1082383 1090585 1098816 1107343 1116566
50051 1116566 1127049 1138749 1150394 1160345 1168169 1174965 1182133 1190212 1198884 1207699 1216768 1226985 1239439
50038 1239439 1254369 1271042 1289075 1309251 1332148 1356363 1379350 1400235 1420862 1443788 1470181
50027 1470181 1499995 1533043 1569085 1607636 1648632 1692884 1741029 1792408 1845991 1902473 1964622
50016 1964622 2035067 2114068 2199757 2290498 2386761 2490693 2604079 2727152 2859425 3001036
50006 3001036 3152478 3313018 3479947 3649267 3816432 3976558 4125165 4259561 4379123
49997 4379123 4483886 4573569 4648593 4711423 4765969 4815551 4861596 4903571 4939245 4965022 4976735
49986 4976735 4970501 4943041 4891895 4816075 4716558 4595836 4457180 4304598 4142974 3977372
49976 3977372 3811958 3649805 3493456 3345066 3205934 3076300 2955823 2844104 2740883
49967 2740883 2645911 2558697 2478402 2404301 2336405 2275187 2220380 2170467 2123742 2079589 2038385
49956 2038385 2000551 1966220 1935410 1907924 1883320 1861540 1843334 1829337 1818836 1810095 1801974 1794658
49944 1794658 1788736 1784178 1780424 1777049 1774101 1772004 1771198 1771647 1772704 1773693 1774615 1776060 1778493 1781790 1785267
49929 1785267 1787984 1789430 1790390 1792793 1798045 1805701 1814392 1823860 1835198 1849024 1864455 1880392 1897181
49916 1897181 1916298 1938685 1964013 1991509 2021011 2053018 2088050 2126316 2168082 2213949 2264335
49905 2264335 2318717 2376026 2436285 2501547 2574672 2657283 2749295 2850272 2960607 3081290 3213243
49894 3213243 3357426 3515370 3688944 3879171 4085242 4304904 4535708 4775330 5020213
49885 5020213 5264568 5501844 5727448 5939355 6136373 6317354 6482731 6635248 6777706
49876 6777706 6910721 7033785 7147287 7251143 7341404 7410215 7449882 7456017 7426741 7360833 7258041
49865 7258041 7120388 6952075 6758359 6544770 6316459 6077306 5829919 5576961 5322083
49856 5322083 5069180 4821322 4580871 4349897 4129688 3920213 3720899 3532020 3354983
49847 3354983 3191305 3041510 2904688 2778845 2662076 2553690 2453974 2362918 2279719 2203524
49837 2203524 2133681 2068879 2007166 1947716 1891735 1840379 1792377 1745063 1697616 1651885 1609826
49826 1609826 1571467 1535917 1503191 1473818 1447141 1421259 1394874 1368583 1344089 1322623 1304372
49815 1304372 1288898 1275409 1262828 1250445 1238787 1229192 1222070 1216136 1210040 1204279 1200617 1199876 1201391
49802 1201391 1204618 1210082 1218241 1228376 1239316 1250594 1262304 1274434 1286933 1299956 1313526 1327584
49790 1327584 1342946 1361431 1384208 1410517 1438841 1468717 1500411 1533529 1567578 1603872 1645319
49779 1645319 1693651 1747859 1806026 1868084 1936231 2013161 2100437 2198198 2305955 2423631 2551934
49768 2551934 2691534 2842005 3001869 3169277 3341616 3514211 3680456 3834197 3971997
49759 3971997 4093047 4197633 4286402 4360754 4423179 4476870 4524983 4569635 4610735 4645550 4669577
49748 4669577 4677884 4665608 4627947 4560908 4462885 4335557 4183286 4011863 3827630 3636858
49738 3636858 3444933 3255789 3072319 2897304 2733518 2582710 2444782 2318416 2202427
49729 2202427 2096229 1999219 1910368 1828781 1754227 1686682 1625593 1570081 1519826 1475143 1435974
49718 1435974 1401100 1368709 1337657 1307989 1280337 1255085 1232106 1211032 1191542 1173454 1156733
49707 1156733 1141464 1127656 1115062 1103325 1092314 1082072 1072349 1062589 1052630 1043096 1034686 1027367
49695 1027367 1020813 1015328 1011511 1009047 1006745 1003964 1001193 998834 996326 993182 990131 988315 987726 987356
49681 987356 986678 986055 985747 985393 984804 984549 985468 987876 991394 995196 998363 1000421 1001755 1003286 1005649 1008771
49665 1008771 1012106 1014997 1017002 1018224 1019232 1020256 1020646 1019601 1017414 1015505 1015165 1016643 1019358 1022498
49651 1022498 1025345 1027442 1028638 1028896 1028310 1027579 1027912 1029736 1031811 1032475 1031694 1030925 1031082 1031779 1032656 1034095
49635 1034095 1035957 1036874 1035863 1033887 1032705 1032632 1032485 1031505 1030281 1029767 1030295 1031739 1033827 1035935 1037170 1037161
49619 1037161 1036450 1035717 1034804 1032970 1030107 1027312 1025923 1026186 1027195 1028092 1028830 1029659 1030469 1031117 1031835 1032648 1032845
49602 1032845 1031936 1030874 1031250 1033247 1035457 1036834 1037617 1038058 1037670 1036441 1035492 1035467 1035345 1034099 1032569 1032248
49586 1032248 1032936 1033323 1033445 1034609 1036715 1037670 1036295 1034360 1034479 1036809 1039129 1039854 1039865 1041119 1044200 1047849
49570 1047849 1050809 1053522 1057404 1062628 1067644 1071355 1074837 1079818 1086121 1091937 1096357 1100168 1104119 1108020
49556 1108020 1112008 1117189 1124093 1131691 1138979 1146609 1155843 1166680 1178220 1190312 1203498 1217656 1232011
49543 1232011 1246521 1261970 1278458 1294887 1310535 1326359 1344120 1364674 1387605 1412127 1437723
49532 1437723 1463979 1490340 1516328 1542013 1568201 1596082 1626507 1659414 1693860 1728749 1763717
49521 1763717 1799423 1836831 1876102 1916471 1957489 1999968 2045045 2092526 2141046 2189981 2240276
49510 2240276 2293053 2348367 2405925 2466014 2528684 2592681 2656384 2719634 2783617 2849083 2915603
49499 2915603 2982558 3049914 3117852 3186427 3255713 3325593 3395263 3463560 3529857 3593906 3654828
49488 3654828 3711058 3761630 3806853 3847527 3884143 3916932 3945901 3970490 3989994 4004595 4015244
49477 4015244 4022268 4025051 4023505 4018831 4012098 4003065 3991452 3978618 3966638 3956047 3945770 3935333
49465 3935333 3925985 3919401 3916124 3915677 3917409 3920678 3924737 3929200 3934709 3942760 3954569 3970071 3988071
49452 3988071 4007495 4028379 4051458 4076894 4103776 4130845 4157211 4182248 4205381 4226365 4245290
49441 4245290 4261884 4275062 4283392 4285647 4280832 4268533 4249688 4226151 4198716 4166207 4127259 4082219
49429 4082219 4032276 3977509 3917288 3852251 3784219 3714079 3641282 3565730 3488704 3411418 3334094
49418 3334094 3257250 3182563 3111181 3042064 2973318 2904687 2837503 2772398 2708402 2644638 2582079
49407 2582079 2523024 2469048 2419775 2373522 2328993 2286139 2245447 2206878 2170172 2135836 2104800
49396 2104800 2076924 2050846 2025841 2002865 1982958 1965400 1948494 1931791 1916512 1903984 1894440
49385 1894440 1887089 1880467 1872931 1863945 1855028 1848643 1845888 1845748 1846472 1846875 1846475 1845545 1845383 1847535 1852184
49370 1852184 1858085 1864495 1872304 1882621 1895078 1908433 1922172 1936484 1951132 1965700 1980938 1998675
49358 1998675 2020008 2044277 2070079 2096367 2122254 2146676 2169110 2190063 2210117 2229041 2246740
49347 2246740 2264602 2284516 2306477 2328379 2348743 2368699 2390707 2416154 2444926 2476379 2509502
49336 2509502 2542670 2574717 2606239 2638621 2671661 2703442 2732923 2761380 2790521 2820291 2849482
49325 2849482 2877515 2904389 2929549 2952354 2973584 2995164 3018110 3041721 3065059 3088279 3112058
49314 3112058 3136485 3161086 3185523 3209782 3233940 3258052 3282078 3305898 3329879 3355433 3384230
49303 3384230 3416382 3449965 3482941 3515240 3548421 3583644 3620709 3659037 3698826 3740865 3785582
49292 3785582 3832774 3882207 3934111 3988717 4045396 4102704 4159694 4217081 4276789 4340373 4408134
49281 4408134 4479520 4553802 4630313 4708680 4789154 4872322 4958372 5047062 5138463 5232901 5329892
49270 5329892 5428057 5526796 5627148 5729947 5833867 5936778 6038700 6141689 6246473 6350769
49260 6350769 6451679 6548448 6641813 6731777 6817458 6898558 6975361 7047388 7113387 7172887 7226514
49249 7226514 7274258 7314417 7344922 7365096 7375732 7378203 7374203 7365617 7353558 7337621 7316790 7291169
49237 7291169 7262444 7232872 7204147 7176846 7150251 7123006 7094805 7067508 7043798 7024639 7008770
49226 7008770 6994836 6983152 6975063 6971415 6972273 6977532 6987063 7000547 7017629 7037907 7060381 7083488
49214 7083488 7106444 7130163 7155868 7182892 7208647 7230853 7248932 7263042 7272625 7276484 7273749 7264107
49202 7264107 7247301 7222928 7190774 7151054 7104282 7050940 6991223 6925152 6853059 6775917 6694846
49191 6694846 6610308 6522259 6431156 6338346 6245121 6151963 6059122 5967519 5878298 5791659 5706889
49180 5706889 5623567 5542106 5462927 5385841 5310780 5238613 5170463 5106238 5044381 4983210 4922223
49169 4922223 4862119 4804037 4748955 4697310 4648748 4602356 4557498 4514466 4474152 4437187 4403625
49158 4403625 4373373 4346605 4323650 4304640 4289295 4276932 4266796 4258499 4252075 4247459 4244170 4241912
49146 4241912 4241286 4243193 4247394 4252339 4256821 4261385 4267600 4276204 4286473 4297228 4308043 4319590 4333287
49133 4333287 4350500 4371466 4394768 4418274 4440813 4462848 4485592 4509874 4535824 4563066 4590846
49122 4590846 4618326 4645171 4671693 4698201 4724521 4750495 4776485 4802680 4828063 4851041 4871439
49111 4871439 4891078 4911741 4933217 4954127 4974182 4994452 5015400 5035926 5054961 5073074 5091700
49100 5091700 5111362 5131486 5151585 5171840 5192689 5214579 5238028 5263247 5289887 5317697 5347207
49089 5347207 5379049 5412840 5447525 5482645 5518353 5554440 5590505 5627091 5665358 5705394 5745996
49078 5745996 5786384 5826781 5866881 5905267 5941146 5975334 6008486 6039684 6068013 6094461 6120784
49067 6120784 6147295 6173161 6198040 6221831 6243508 6262092 6278500 6294558 6310238 6323716 6334379
49056 6334379 6343890 6353694 6363059 6370500 6375883 6380218 6384191 6387826 6390998 6393652 6395893 6398175 6400934 6404015
49042 6404015 6407257 6411631 6418631 6428087 6437679 6445285 6451059 6456691 6463445 6471507 6480528 6489996 6499477 6508908
49028 6508908 6518293 6526957 6533868 6539075 6544087 6550474 6558641 6568076 6577786 6586323 6592672 6597734 6603707 6611213
49014 6611213 6618176 6622374 6623882 6623914 6622588 6619426 6615150 6611012 6606654 6600405 6591746 6581955 6572042 6561455
49000 6561455 6549324 6535735 6521010 6504449 6484695 6461252 6435182 6408227 6381276 6353798 6324943
48989 6324943 6294970 6264909 6234800 6203352 6169932 6135845 6102654 6070025 6036513 6002046 5968300
48978 5968300 5936820 5907912 5881196 5855943 5830945 5805452 5780580 5758646 5740637 5725308 5711050
48967 5711050 5697655 5685789 5675697 5667129 5659883 5653796 5648632 5644420 5641510 5640102 5640166 5641907 5645599 5650779
48953 5650779 5656461 5662534 5670085 5679779 5690721 5701678 5712843 5725447 5739921 5755196 5769750 5782820
48941 5782820 5794758 5806813 5820427 5836147 5853124 5869983 5886109 5901680 5916718 5930771 5943652
48930 5943652 5955831 5967751 5979177 5989679 5999637 6010156 6021779 6033601 6043985 6052047 6058079 6062539
48918 6062539 6065214 6065697 6064259 6061588 6057736 6051969 6043904 6034325 6024445 6014574 6003919 5991576 5977372
48905 5977372 5961680 5944890 5927503 5910464 5894765 5880458 5866536 5852169 5837716 5824060 5811383
$$ [...]
##END NTUPLES=NMR SPECTRUM
##END=
