##TITLE=coffee_type TOSA02-ROVE100A_85-15%
COFFEE_meoh_noesyp64 COFFEE_meoh {C:\Bruker\TOPSPIN} Administrator 2
##JCAMPDX= 6.0         $$ Bruker NMR JCAMP-DX V2.0
##DATA TYPE= NMR SPECTRUM
##DATA CLASS= NTUPLES
##ORIGIN= Bruker BioSpin GmbH
##OWNER= Administrator
$$ 1.72 TOPSPIN		Version 2.1
$$ 2012-05-18 15:39:24.636 -0700  Administrator@X
$$ Compression mode = diff/dup
##.OBSERVE FREQUENCY= 400.13188235
##.OBSERVE NUCLEUS= ^1H
##.ACQUISITION MODE= SIMULTANEOUS (DQD)
##.ACQUISITION SCHEME= undefined
##.AVERAGES= 64
##.DIGITISER RES= 22
##SPECTROMETER/DATA SYSTEM= spect
##.PULSE SEQUENCE= noesygpps1d.comp
##.SOLVENT NAME= COFFEE_meoh
##.SHIFT REFERENCE= INTERNAL, COFFEE_meoh, 1, 14.98061
##AUDIT TRAIL= $$ (NUMBER, WHEN, WHO, WHERE, PROCESS, VERSION, WHAT)
$$ ##TITLE= Audit trail, TOPSPIN		Version 2.1
$$ ##JCAMPDX= 5.01
$$ ##ORIGIN= Bruker BioSpin GmbH
$$ ##OWNER= Administrator
$$ $$ C:\Bruker\TOPSPIN/data/Administrator/nmr/12-COFFEE-2002/22/pdata/1/auditp.txt
$$ ##AUDIT TRAIL=  $$ (NUMBER, WHEN, WHO, WHERE, PROCESS, VERSION, WHAT)
(   1,<2012-02-20 20:54:18.719 -0500>,<Administrator>,<TOPSPIN>,<go>,<TOPSPIN 2.1>,
      <created by zg
	started at 2012-02-20 20:42:48.484 -0500,
	POWCHK enabled, PULCHK disabled,
       configuration hash MD5:
       B0 76 FB 9C 50 81 44 7D 18 B3 26 32 4E 60 AD 96
       data hash MD5: 64K
       91 BB E8 DF E1 D1 93 19 4E DC 85 B5 3C 14 7A F2>)
(   2,<2012-02-20 20:54:21.484 -0500>,<Administrator>,<TOPSPIN>,<proc1d>,<TOPSPIN 2.1>,
      <Start of raw data processing
       efp LB = 0.3 FT_mod = 6 PKNL = 1 PHC0 = 0 PHC1 = 0 SI = 128K 
       data hash MD5: 128K
       C5 A4 D2 BB D0 89 E0 AA 42 D6 04 4D C3 EC A8 16>)
(   3,<2012-02-20 20:54:22.781 -0500>,<Administrator>,<TOPSPIN>,<proc1d>,<TOPSPIN 2.1>,
      <pk PHC0 = 18.66577 PHC1 = 0 
       data hash MD5: 128K
       A1 19 EC A0 59 E6 B2 2B 03 07 93 AC CB 53 CF 8A>)
(   4,<2012-02-20 20:54:23.063 -0500>,<Administrator>,<TOPSPIN>,<proc1d>,<TOPSPIN 2.1>,
      <abs ABSG = 1 
       data hash MD5: 128K
       1A F4 A8 7E 9F 4B 96 A1 47 13 19 D8 BC EF 0C DE>)
(   5,<2012-02-20 20:54:23.141 -0500>,<Administrator>,<TOPSPIN>,<proc1d>,<TOPSPIN 2.1>,
      <abs ABSG = 2 
       data hash MD5: 128K
       38 F4 02 0D 74 7C CB 8A B9 50 54 E1 1B 67 99 DB>)
(   6,<2012-02-20 20:54:23.203 -0500>,<Administrator>,<TOPSPIN>,<proc1d>,<TOPSPIN 2.1>,
      <abs ABSG = 3 
       data hash MD5: 128K
       D4 62 8A 0D 62 46 1F DB 2C AD 15 91 70 89 EE 39>)
(   7,<2012-02-20 20:54:23.266 -0500>,<Administrator>,<TOPSPIN>,<proc1d>,<TOPSPIN 2.1>,
      <abs ABSG = 4 
       data hash MD5: 128K
       A4 75 06 2D 50 8A 44 DA 40 AC 14 A1 BB 70 BF 34>)
(   8,<2012-02-20 20:54:23.375 -0500>,<Administrator>,<TOPSPIN>,<proc1d>,<TOPSPIN 2.1>,
      <abs ABSG = 5 
       data hash MD5: 128K
       9B F0 2C 46 55 2B 8B 43 93 59 96 43 DA A1 08 37>)
(   9,<2012-02-20 20:54:23.625 -0500>,<Administrator>,<TOPSPIN>,<audit>,<TOPSPIN 2.1>,
      <user comment:
       ICON-NMR User ID: Administrator
$$ [...]
150 150 150 150 150 150 150 150
##$TP07= 0
##$TPNAME0= <>
##$TPNAME1= <>
##$TPNAME2= <>
##$TPNAME3= <>
##$TPNAME4= <>
##$TPNAME5= <>
##$TPNAME6= <>
##$TPNAME7= <>
##$TPOAL= (0..7)
0.5 0.5 0.5 0.5 0.5 0.5 0.5 0.5
##$TPOFFS= (0..7)
0 0 0 0 0 0 0 0
##$TUNHIN= 0
##$TUNHOUT= 0
##$TUNXOUT= 0
##$USERA1= <user>
##$USERA2= <user>
##$USERA3= <user>
##$USERA4= <user>
##$USERA5= <user>
##$V9= 5
##$VALIST= <valist>
##$VCLIST= <CCCCCCCCCCCCCCC>
##$VD= 0
##$VDLIST= <DDDDDDDDDDDDDDD>
##$VPLIST= <PPPPPPPPPPPPPPP>
##$VTLIST= <TTTTTTTTTTTTTTT>
##$WBST= 1024
##$WBSW= 4
##$XGAIN= (0..3)
0 0 0 0
##$XL= 0
##$YL= 0
##$YMAX_a= 13976396
##$YMIN_a= -6545092
##$ZGOPTNS= <>
##$ZL1= 120
##$ZL2= 120
##$ZL3= 120
##$ZL4= 120
##$ABSF1= 14.98061
##$ABSF2= -5.57192
##$ABSG= 5
##$ABSL= 3
##$ALPHA= 0
##$AQORDER= 0
##$ASSFAC= 0
##$ASSFACI= 0
##$ASSFACX= 0
##$ASSWID= 0
##$AUNMP= <proc_prof1d_extract>
##$AXLEFT= 0
##$AXNAME= <>
##$AXNUC= <1H>
##$AXRIGHT= 0
##$AXTYPE= 0
##$AXUNIT= <>
##$AZFE= 0.1
##$AZFW= 0.1
##$BCFW= 0
##$BC_mod= 0
##$BYTORDP= 0
##$COROFFS= 0
##$CY= 15
##$DATMOD= 1
##$DC= 0
##$DFILT= <>
##$DTYPP= 0
##$F1P= 0
##$F2P= 0
##$FCOR= 0.5
##$FTSIZE= 131072
##$FT_mod= 6
##$GAMMA= 0
##$GB= 0
##$INTBC= 1
##$INTSCL= 1
##$ISEN= 128
##$LB= 0.3
##$LEV0= 0
##$LPBIN= 0
##$MAXI= 10000
##$MC2= 0
##$MEAN= 0
##$ME_mod= 0
##$MI= 0
##$NCOEF= 0
##$NC_proc= -3
##$NLEV= 6
##$NOISF1= 0
##$NOISF2= 0
##$NSP= 0
##$NTH_PI= 0
##$NZP= 0
##$OFFSET= 14.98061
##$PC= 1
##$PHC0= 18.66577
##$PHC1= 0
##$PH_mod= 1
##$PKNL= yes
##$PPARMOD= 0
##$PPDIAG= 0
##$PPIPTYP= 0
##$PPMPNUM= 2147483647
##$PPRESOL= 1
##$PSCAL= 4
##$PSIGN= 0
##$PYNMP= <proc.py>
##$REVERSE= no
##$SF= 400.13
##$SI= 131072
##$SIGF1= 0
##$SIGF2= 0
##$SINO= 400
##$SIOLD= 131072
##$SPECTYP= <>
##$SREGLST= <1H.CDCl3>
##$SSB= 0
##$STSI= 131072
##$STSR= 0
##$SW_p= 8223.68421052632
##$SYMM= 0
##$S_DEV= 0
##$TDeff= 65536
##$TDoff= 0
##$TI= <>
##$TILT= no
##$TM1= 0
##$TM2= 0
##$TOPLEV= 0
##$USERP1= <user>
##$USERP2= <user>
##$USERP3= <user>
##$USERP4= <user>
##$USERP5= <user>
##$WDW= 1
##$XDIM= 131072
##$YMAX_p= 496145175
##$YMIN_p= -320597110
##$CURPLOT= <Network HP LaserJet P1505>
##$CURPRIN= <$Network HP LaserJet P1505>
##$DFORMAT= <normdp>
##$LAYOUT= <+/1D_H.xwp>
##$LFORMAT= <normlp>
##$PFORMAT= <normpl>
##$SURQMSG= 1
$$ End of Bruker specific parameters
$$ ---------------------------------
##NTUPLES= NMR SPECTRUM
##VAR_NAME=  FREQUENCY,     SPECTRUM/REAL,   SPECTRUM/IMAG
##SYMBOL=    X,             R,               I
##VAR_TYPE=  INDEPENDENT,   DEPENDENT,       DEPENDENT
##VAR_FORM=  AFFN,          ASDF,            ASDF
##VAR_DIM=   131072,        131072,          131072
##UNITS=     HZ,            ARBITRARY UNITS, ARBITRARY UNITS
##FACTOR=    0.0627417313425165, 1,          1
##FIRST=     8223.62146879498, 3103,         -87579
##LAST=      0,             5805,            -87701
##MIN=       0,             -320597110,      0
##MAX=       8223.62146879498, 496145175,    0
$$ Real data points
##PAGE= N=1
##DATA TABLE= (X++(R..R)), XYDATA
$$ [...]
66858 3492834 3521524 3551308 3581950 3611439 3638780 3665784 3695044 3726720 3758417 3788069 3815808
66847 3815808 3842787 3869177 3894107 3917109 3938869 3960567 3982757 4004866 4025652 4044324 4061356
66836 4061356 4077958 4094636 4110521 4124384 4135979 4146150 4155929 4165948 4176454 4187218 4197289
66825 4197289 4205271 4210242 4212415 4212877 4212634 4211747 4209245 4204051 4196195 4186963 4177663 4168399 4158309 4146714
66811 4146714 4133596 4119183 4103691 4087476 4070803 4053308 4034314 4014041 3993890 3974915 3956375
66800 3956375 3936416 3914031 3889745 3864454 3838324 3811112 3783054 3754903 3727261 3700139 3672974
66789 3672974 3644798 3614564 3581795 3547069 3511688 3476770 3442767 3409695 3377479 3345902 3314453
66778 3314453 3282482 3249491 3215333 3180376 3145506 3111576 3078586 3045682 3012290 2978933 2946516
66767 2946516 2915057 2883678 2851733 2819310 2786683 2753988 2721567 2689928 2658964 2627854 2596195
66756 2596195 2564762 2534595 2505690 2476999 2447430 2416529 2384734 2353451 2324345 2297778 2272215
66745 2272215 2245833 2218434 2191166 2164774 2139057 2113758 2088828 2063701 2037341 2009415 1980781
66734 1980781 1952661 1925896 1900956 1877728 1855197 1832274 1809228 1787410 1767292 1747869 1728302
66723 1728302 1708843 1689436 1668762 1645953 1622386 1600358 1580477 1561584 1542842 1524549 1507021
66712 1507021 1489930 1472875 1455607 1437633 1418658 1399540 1381854 1366239 1351914 1337889 1323719
66701 1323719 1308989 1293200 1276619 1260321 1244852 1229669 1214454 1200110 1187694 1176942 1166678
66690 1166678 1156266 1145805 1135160 1123695 1111096 1097921 1085123 1073209 1061841 1050127 1037427
66679 1037427 1024091 1011236 999712 989476 979996 970830 961545 951640 941086 930782 921890 914631
66667 914631 907906 900112 890372 879280 868587 859735 852448 845007 836097 826005 815836 806150 796809
66654 796809 787606 778359 768722 758755 749590 742754 738554 735481 731382 725064 716954 708607 701503 695929
66640 695929 690906 685274 678642 671240 663441 655912 649648 645036 641174 636906 632247 627898 623632 618478
66626 618478 612570 607426 603774 600294 595334 588967 582340 575711 568341 560026 551691 544457 538933 535311
66612 535311 533279 531727 529331 525680 521365 516904 512319 507913 504570 502667 501117 498178 493137 486865
66598 486865 480867 476130 472785 470310 467846 464581 460229 455284 450635 446715 443087 439139 435147 432129
66584 432129 430409 428946 426833 425017 425396 427986 430013 428495 423156 416209 409878 404987 401517 399262
66570 399262 397673 395954 393899 392142 391073 389903 387374 383286 378856 375560 373934 373473 373243 372359 370177
66555 370177 366519 361838 356967 352511 348490 344702 341357 339136 338540 339298 340461 340988 340180 337834 334226
66540 334226 329956 325649 321878 319316 318531 319266 320122 319527 317100 313811 310840 308621 306947 305516 304308
66525 304308 303742 304440 306300 307887 307511 305171 302650 301294 300533 299265 297771 297066 296786 295185 291406 286636
66509 286636 282628 279993 278384 277465 276981 276434 275413 274021 272466 270532 267944 265047 262651 261256 260691
66494 260691 260366 259632 258170 256331 254863 254024 253326 252391 251507 250863 249841 247906 245788 244734 244721 244445 243193
66477 243193 241605 240200 238262 235003 231129 228361 227695 228788 230613 231937 231523 228929 225231 222205 220625
66462 220625 220022 220057 221060 222771 223641 222370 219597 217005 215040 212699 209643 207208 206658 207325 207451 206369
66446 206369 204815 203339 201528 199090 196803 195742 195984 196564 196520 195649 194416 193452 193042 192972 192984 193312 194323
66429 194323 195589 195994 195115 193893 193323 192996 191712 189191 186298 183792 181769 180382 180110 181014 182501 184137
66413 184137 185984 187845 189005 189226 189213 189510 189566 188683 187313 186479 186263 185790 184597 183123 181840 180709 179662
66396 179662 178919 178634 178751 179208 179663 179069 176528 172903 170708 171648 174775 177639 178839 178844 178744 179064 179654
66379 179654 179991 179438 177765 175595 173927 173158 172846 172356 171265 169194 166010 162598 160796 161818 164783
66364 164783 167378 168053 167219 166285 166014 166093 165921 165256 164134 162668 161190 160223 159852 159211 157139 153608 150190
66347 150190 148717 149601 151817 154402 157362 160869 164212 166249 166715 166319 165374 163157 159241 154854 151945
66332 151945 150943 150336 148710 146443 144911 144649 144975 144933 143810 141035 136566 131443 127131 124029 121380
66317 121380 118906 117659 118561 120813 122794 124340 126940 131319 135742 137656 136729 135315 135515 136609 136241
66302 136241 133811 131392 130871 131415 130964 129469 128948 130331 131895 131492 129067 126129 123795 122374 122002 122440
66286 122440 122753 122347 121910 122290 122911 122562 121358 120470 120151 119620 118907 119123 120484 121724 122053 122155 122495 122203
66268 122203 120761 119349 119098 119098 117676 114843 112084 110475 110404 112273 115642 118236 117869 115255 113024 112017
66252 112017 110696 108459 107148 108210 110382 111748 112565 114334 117088 119371 120361 120435 119854 118322 115879
66237 115879 113182 110930 109734 110182 111994 113479 113175 111909 111936 113886 116012 116762 116594 116406 115610 113140
66221 113140 109622 107004 106224 106497 106926 107582 108555 109058 108339 106950 106247 106719 107510 107647 107169 106772 106800 106995
66203 106995 107016 106785 106316 105613 104877 104598 105194 106567 108073 108899 108568 107285 105814 104801 104168 103311 101993
66186 101993 100750 100351 101056 102627 104760 107173 109387 110796 111088 110408 109082 107258 104907 102189 99843
66171 99843 99025 100400 103271 105972 107432 108128 109240 111171 113307 114961 115846 115633 113818 110519 107000
66156 107000 104852 104652 105611 106394 106045 104401 102146 100526 100524 101918 103361 103704 103093 102491 102363 102432 102694 103797
66138 103797 105895 107851 108525 108508 109461 111706 113589 113660 112453 111362 110704 109969 109392 109906 111569 113247 114157
66121 114157 114717 115450 116027 116136 116519 118058 120045 120416 118048 114125 110788 108860 107474 105728 103930 102934
66105 102934 102834 102900 102611 102176 102061 102496 103513 104911 106047 106223 105514 104670 104005 103052 101637 100490 100134
66088 100134 99908 98929 97455 96355 95786 95458 95733 97081 98667 98958 97912 97128 97458 97844 97109 95681 94706
66071 94706 94443 94385 94198 93767 93076 92719 93769 96255 98531 98987 97746 95832 93574 90977 88896 88361 89075
66054 89075 89997 91222 93767 97421 100305 101132 100775 100938 102042 103055 102894 101496 99842 99156 99829 101006
66038 101006 101445 100631 98720 95821 92120 88450 85739 83929 82386 81394 82190 85284 89670 93900 96961
66023 96961 98004 96554 93573 91142 90333 90321 90166 90273 91228 92431 93225 94407 97044 100338 102297 102342 101808
66006 101808 101923 102695 103917 105818 108243 110383 111876 113256 114779 115735 115563 114884 114674 114966 115096 114789
65990 114789 114298 113757 113029 112054 110841 109323 107712 106810 107292 108642 109335 108375 106414 105092 105303 106257 106299
65973 106299 104679 102344 100867 100824 101580 102506 103752 105626 107857 109918 111653 113083 113995 114380 114944 116312
65957 116312 117731 117506 115105 112081 110362 110199 110504 110715 111275 112320 113039 112957 112955 114077 115736 116242 115195
65940 115195 114284 115159 117329 118915 118987 118194 117377 116597 115836 115711 116915 119399 122600 126188 130034 133668
65924 133668 136334 137680 138113 138461 139433 141317 143821 146152 147489 147620 147089 146683 146761 147106 147392 147619 147812
65907 147812 147337 145121 141106 137156 135601 136731 138457 138798 137947 137364 137551 137653 136926 135589 134178 132882
65891 132882 131775 131047 130674 130254 129443 128294 127043 125840 124816 124161 124047 124591 125766 127086 127669 127201
65875 127201 126654 127283 128873 129776 128909 126965 125313 124494 124298 124639 125500 126376 126550 125911 125078 124835 125583 126994
65857 126994 127909 127176 125108 123591 124094 126044 127863 129100 130542 132514 134213 134821 134319 133083 131499
65842 131499 130096 129230 128417 126828 124605 122881 122278 122340 122703 123672 125050 125583 124544 122995 122365 122439 122056
65825 122056 121294 121411 122633 123548 123312 123359 125989 131711 138617 144114 146837 147106 146117 144851 143611 142347
65809 142347 141063 139638 137703 135309 133687 134428 137573 141167 143178 143350 142570 140981 137822 133163 128808
65794 128808 126726 127024 128067 128413 128048 127696 127688 127978 128843 130758 133413 135460 135682 134231 132372 131098 130353
65777 130353 129617 128840 128530 129038 130100 131206 132164 132999 133293 132236 129829 127724 127938 130494 133056 133454
65761 133454 132046 130936 131336 132662 134004 135302 136677 137608 137548 136800 135918 134622 132252 129233 127118 126738
65745 126738 127087 126670 125499 124951 125787 127155 127829 127764 127889 128746 129991 131112 132031 132831 133342 133230 132290 130566
65727 130566 128433 126583 125562 125241 125106 125145 125943 127639 129319 129965 129658 129341 129532 129741 129102 127230 124554
65710 124554 122002 120211 118844 117080 115021 114090 115454 118478 121436 123333 124190 123893 121999 118864 115902
65695 115902 114275 113984 114533 115707 117350 119113 120833 122503 123488 122666 120025 117363 116465 117042 117386 116765
65679 116765 116108 116346 116953 116452 113872 109449 104326 99807 96688 95012 94302 93889 93215 92310 92024 93122
65663 93122 94940 95732 94853 93733 93868 94665 94560 93673 93680 95061 96235 95978 95113 94797 94419 92622 89723 87595
65645 87595 87275 87996 88707 89411 90439 91265 90878 89087 86931 85752 86105 87562 89320 90853 91982 92546
65629 92546 92358 91649 91210 91744 93087 94397 95033 94932 94212 92936 91468 90618 91045 92667 94873 97096 98897
65612 98897 99800 99582 98656 97672 96672 95149 93145 91654 91464 91977 91884 90832 89717 89258 89075 88611 88285
65595 88285 88933 90343 91179 90583 89227 88314 87884 86750 84232 81447 80380 81708 84023 85474 85809 86329
65579 86329 87972 90221 92107 93583 95230 96978 97953 97625 96413 94946 93402 91976 91480 92668 95014
65564 95014 96830 96922 95875 95430 96681 99120 101289 102113 101483 99910 97929 95847 93802 91973 90785 90817
65548 90817 92194 94043 94909 94006 91901 89758 88153 86929 86022 85865 86794 88367 89549 89599 88779 88203 88814
65531 88814 90351 91549 91701 91830 93738 97741 101911 103837 102836 100103 97067 94184 91285 88455 86176
65516 86176 84728 83817 82950 82103 81776 82155 82337 80820 77091 72603 69826 70103 72431 74408 74388 72764 71279
65499 71279 71282 72796 75056 77454 79696 81474 82552 83100 83416 83341 82417 80675 78703 76836 75003 73623
65483 73623 73760 75631 77595 77648 75685 73389 72119 72030 73231 76363 81260 86114 89076 90190 90865 91795
65467 91795 92424 92318 91972 91933 91854 90920 88921 86655 85491 86507 89651 93694 97397 100632 103882 106836
65451 106836 108433 108492 108212 108360 107880 105381 101495 98526 97840 98673 99658 100459 101428 102530 103382 103920 104407
65434 104407 104941 105426 105907 106475 106862 106493 105075 103059 101392 100638 100330 99403 97533 95751 95234 95712 95837
65417 95837 95106 94524 95079 96487 98064 99968 102572 105117 106242 105901 105679 106866 108947 110532 111232 111896
65401 111896 113087 113956 113106 110543 108239 108289 110589 112954 113565 112561 110946 108907 106146 103208 101149
65386 101149 100014 98817 97253 96366 96986 98352 98965 98331 97293 96895 97368 98024 97903 96720 95275 94588
65370 94588 94561 94030 92389 90600 90168 91528 93814 95826 96787 96561 95665 94907 94608 94363 93853 93614 94597 97203
65352 97203 100990 104932 107624 107880 105944 103748 103084 103621 103602 102426 101497 102177 103904 105117 105449 106013 107592
65335 107592 109409 110141 109670 109272 110033 111635 113043 114092 115670 118164 120458 121075 119991 118665 118436 119562
65319 119562 121766 124934 128898 133077 136808 139804 142138 144083 146138 148760 151790 154664 157572 161873
65305 161873 168597 176848 184600 191137 197935 206844 218101 230452 242549 253416 261943 266859 267580
65292 267580 264715 259671 254036 249151 245494 242112 237189 229806 221008 212693 205564 198637 190760 182147
65278 182147 174231 168280 164399 161706 159283 156910 154902 153260 151301 148428 145103 142551 141375 140922
65264 140922 140210 139022 137597 135594 132140 127117 121888 118212 116536 115707 114385 112301 109937 107463 104716
65249 104716 102148 100904 101444 102578 102522 100651 97743 94829 92546 91330 91262 91485 90665 88417 85725 83664
65233 83664 82267 81002 79707 78575 77751 77428 77825 78496 78213 76313 73844 72639 73345 74979 76268 76816
65217 76816 76992 77266 77765 78174 78121 77832 78079 79175 80492 81447 82403 83804 85030 85193 84787 85198 86530 87198
65199 87198 86095 84023 82390 81489 80861 80588 81295 83168 85664 88022 89650 90331 90471 90876 91937 93341
65183 93341 94789 96380 97880 98352 97306 95778 95380 96387 97463 97237 95580 93476 92204 92546 94114
65168 94114 95463 95417 94329 93532 93665 94179 94410 94266 93682 92250 89964 87744 86604 86591 87069 87763 88825
65151 88825 89957 90194 89025 87405 87106 88859 91412 92778 92354 91331 90838 90299 88268 84618 80964 78816
65135 78816 78083 77802 77603 77755 78209 78429 78096 77354 76402 75455 75087 75864 77391 78414 78342 78170 79284 81688
65117 81688 84120 85789 87159 88880 90703 92004 92820 93641 94294 93807 91629 88491 85739 84031 83040 82251
65101 82251 81649 81589 82272 83462 84580 85001 84487 83496 82980 83684 85613 88218 90945 93398 95124 95735 95498
65084 95498 95489 96684 98941 101243 102870 103868 104238 103308 100546 96803 94087 93922 96231 99886 103848 107388
65068 107388 109601 109501 107036 103710 101684 101969 103619 104773 104311 102330 99404 96094 93271 92065 92839
65053 92839 94584 95958 96643 97044 97024 96074 94866 95362 98629 103337 107289 109840 111768 113295 113650 112792
65037 112792 112260 113467 115859 117600 117863 117865 119787 125101 133654 143774 153301 161177 168287 176362 185815
65022 185815 194915 201347 204412 205482 206432 207920 209273 209779 209666 209549 209155 207250 203136 197778 192775
65007 192775 188403 183440 177032 169967 163657 158474 153721 148804 143734 138698 133911 129849 126909 124684
64993 124684 122235 119182 115960 112869 109677 106507 104279 103469 103021 101433 98797 96786 96471 96895 96243
64978 96243 93912 90937 88701 87782 87979 88722 89031 87517 83368 77696 73261 72104 73556 75167 75469 75093
64962 75093 75213 76009 77149 78792 81160 83625 85182 85508 84836 83198 80863 79270 80140 83206 85835 85523
64946 85523 82247 78019 74814 73481 73988 75808 78127 80369 82694 85654 89193 92133 92933 91157 88247
64931 88247 86516 87056 88879 90368 91180 92090 93346 94211 94235 93926 93780 93566 93191 93466 95147 97577 99183
64914 99183 99171 98091 96802 95599 94501 93890 94387 96069 97922 98322 96371 92750 88933 85698 82923 80750
64898 80750 79912 80443 80964 80162 78573 78043 79592 82491 85236 86639 86123 83910 81208 79527 79363 79912
64882 79912 80252 80402 80905 81848 82829 83752 85072 86964 88595 88765 87427 86100 86308 87807 88896 88475 87170
64865 87170 86317 86437 87099 87817 88589 89704 91317 93015 93771 92768 90434 88103 86463 84953 83029 81247
64849 81247 80470 80643 81082 81500 82024 82652 83522 85336 88560 92367 95155 96099 95557 94237 92723 91693 91732
64832 91732 92839 94546 96294 97296 96669 94676 93223 93887 95686 96157 94552 92520 91512 91187 90910 91236
64816 91236 92745 94413 94429 92334 89541 87985 88768 91703 95593 99078 101489 102733 102550 100624 97496
64801 97496 94466 92209 90188 87807 85375 83513 82380 81922 82171 82878 83681 85020 87779 91391 93457
64786 93457 92354 89356 87005 86101 85606 84926 84717 85475 86721 87849 88702 89070 88549 87318 86369 86596 88018
64769 88018 90014 91913 93219 93694 93351 92238 90380 88225 86752 86622 87377 87938 87635 86353 84186 81650
64753 81650 79874 79675 80491 81007 80691 80090 79902 80586 82602 85869 88937 89833 88155 85619 84291 84904 86915
64736 86915 89333 91307 92690 94217 96381 98130 97721 95065 92123 90684 90883 92209 94486 97037 98330
64721 98330 97772 96797 96851 97227 96480 95161 95144 96532 97391 96833 96349 97251 98592 98929 98841 100063 102770 105268
64703 105268 106088 105065 102444 98391 93804 90359 88992 88972 89123 89377 90445 92353 94113 94833 94588 94135
64687 94135 94128 94618 95077 95045 94890 95570 97234 98537 98127 96568 95824 96865 98754 100306 101520 102825 103935
64670 103935 104345 104235 103943 103070 101149 98863 97409 96790 95838 94126 92739 92760 93744 94264 93488 91904 90909
64653 90909 91885 95097 99112 101770 102130 101206 100614 100934 101553 101582 100546 98590 96391 94538 92804 90565
64637 90565 88202 87336 88886 91413 92365 90914 88720 87864 88953 91533 95265 99684 103265 104166 102409
64622 102409 100449 100637 102510 103557 102568 101000 100644 101167 101027 99942 99022 98727 98211 96954 95757 95608
64606 95608 96561 98232 100508 103092 105154 106180 106625 107166 107867 108633 109728 111051 111592 110621 108981 108244
64590 108244 108778 109484 109175 107361 103998 99564 95403 93057 93112 95261 99283 104993 111256 116145 118478
64575 118478 118584 117465 115964 114823 114545 114767 114499 113400 112200 111515 110916 109623 107495 104929 102269 99786
64559 99786 97707 95918 94118 92658 92568 94260 96780 98864 100214 101113 101361 100441 98502 96496 95403 95802
64543 95802 97862 101155 104648 107367 108934 109198 107974 105748 104014 103851 104531 104546 103816 103683 104807 106324
64527 106324 107397 108388 109952 111996 114171 116459 118549 119546 119263 119012 119897 120886 120009 117324 115149 114935
64511 114935 115317 114185 111729 110160 110771 112487 113518 113433 113030 112784 112312 111267 110049 109298 109099 109152 109542
64494 109542 110908 113675 117352 120739 122811 123404 123185 123011 123169 123143 122234 120436 118641 117900 118546 119956
64478 119956 121064 121237 120863 121091 122681 125053 126758 126844 125462 123217 120595 118281 117173 117311 117318 115875
64462 115875 113650 112779 114260 116711 118052 117650 116327 114980 113937 113255 112822 112271 111391 110552 110211 110149 109826
64445 109826 109358 109396 109925 110002 109100 108014 107854 108659 109622 110324 110961 111509 111514 110894 110239 109962 109655 108750 107444
64426 107444 106450 106058 105976 106005 106366 107228 108378 109554 110715 111726 112059 111233 109438 107439 105956 105384 105928
64409 105928 107462 109104 109508 108100 105901 104791 105854 108588 111507 113194 112924 110894 108222 106374 106161
64394 106161 107263 108947 111057 113914 117342 120364 122179 123090 124073 125556 127032 127830 127863 127457 126872 126305
64378 126305 126156 126814 128046 128933 128710 127683 127088 127826 129390 130200 129171 126827 124794 124289 125306 127032
64362 127032 128629 129594 129940 130318 131552 133670 135743 137153 138590 141071 144211 146455 147216 147786 149571
64347 149571 152166 154105 155034 156099 158065 160007 160416 159121 157519 156992 157544 158112 157870 156972 156049 155324
64331 155324 154421 152939 150933 148843 147221 146546 146953 147905 148429 147970 146900 145944 145336 144802 144127 143341 142433
64314 142433 141353 140312 139665 139395 139082 138449 137569 136458 134895 132958 131386 131031 132047 133902 136093 138549
64298 138549 141242 143626 144726 143953 141813 139504 137600 135375 131914 127838 125279 125874 129159 133285 136876
64283 136876 139718 141993 143635 144558 144996 145378 146136 147751 150527 154038 157120 158872 159552 160090 160765 160886
64267 160886 159905 158443 157779 158586 160621 163414 166625 169615 171499 172239 173210 175831 179710 182860 184014
64252 184014 184114 185198 188272 192626 196774 199462 200059 198757 196564 194583 193046 191352 189236 187440 186813
64237 186813 187053 186972 186080 185313 185823 187496 189220 190439 191716 193651 195888 197675 198983 200449 202400 204543
64221 204543 206606 208765 211247 213961 216722 219622 222953 226909 231379 235828 239422 241626 242767 243671
64207 243671 244718 245608 246055 246164 245835 244369 241174 236540 231302 225938 220474 215099 210396 206971 205117
64192 205117 204770 205482 206550 207455 208140 208728 209242 209888 211223 213522 216168 218260 219712 221116 222580 223565
64176 223565 224156 225698 229479 235231 241587 247733 253725 259254 263085 264423 264331 264949 267301 270495 273208
64161 273208 275313 277622 280529 283580 286166 287985 288908 288990 288683 288454 288142 287359 286596 287007 288690 290115
64145 290115 290072 289528 290515 293543 297078 299501 300635 301347 302554 304896 308573 313069 317480 321328 324665
64130 324665 327307 328702 328885 329011 330365 332956 335312 335574 332875 328053 323086 319352 316411 312955 308894
64115 308894 305645 304159 303625 302796 301798 301606 302189 302280 301075 299245 297985 297746 298367 299955 303036 307790
64099 307790 313495 318925 323291 326823 330488 335225 341365 348586 356220 363791 371598 380714 391960 404764
64085 404764 417469 429053 440190 452271 465675 479518 492939 506022 519205 532181 543792
64074 543792 552974 559472 563462 564780 563001 558249 551369 543063 533423 522798 512396 503056 493783 482764
64060 482764 469876 456988 445539 435216 425647 417898 412979 409827 406324 401855 397483 393989 391335
64047 391335 390012 391191 394882 399230 402424 404558 406949 410410 414815 419815 425235 431116 437818 445726
64033 445726 454553 463472 472244 481640 492233 503502 514714 526018 537672 548672 557275 562886 566560
64020 566560 569600 572448 574936 576646 576758 574447 569997 564871 560109 555087 548509 540270 531686 523995
64006 523995 517323 511202 505470 500324 495793 491653 487880 484951 483505 483722 485181 487459 490767 495736
63992 495736 502460 510024 517327 524377 532499 543036 555915 569611 582647 595099 608427 623659
63980 623659 639865 654877 667714 679968 694356 712053 731809 751514 769939 786830 802078
63969 802078 815499 827255 837822 847442 855957 863374 870440 878537 888889 901587 915263 928138
63957 928138 939843 952108 967215 985864 1006900 1028823 1050761 1072069 1091985 1110270 1127540
63946 1127540 1144416 1160804 1176546 1192230 1208533 1225174 1241485 1257999 1276479 1298131 1322528
63935 1322528 1348676 1376417 1406286 1438598 1473394 1511001 1551927 1596362 1644393 1696697 1754326
63924 1754326 1817656 1886137 1959357 2037796 2122136 2212403 2308496 2411226 2521930 2640998 2767680
63913 2767680 2901695 3044206 3196582 3358875 3530500 3712139 3905959 4113936 4336955
63904 4336955 4576036 4833794 5114240 5421506 5759033 6129599 6535944 6981926 7473410
63895 7473410 8017480 8620464 9287192 10022250 10830527 11715124 12674906 13704784 14797858
63886 14797858 15946253 17140379 18368801 19618722 20875026 22118132 23323687 24464919
63878 24464919 25515093 26448691 27242991 27880691 28350895 28646830 28763150 28695973 28444514
63869 28444514 28011622 27403713 26632203 25715420 24677718 23545671 22344680 21097985 19826760
63860 19826760 18549935 17284435 16046199 14850417 13710117 12634651 11629795 10698731
63852 10698731 9842456 9059841 8348381 7705111 7126286 6606394 6138614 5717024 5338001
63843 5338001 4998826 4695254 4421310 4171693 3943599 3735692 3545809 3370555 3207043
63834 3207043 3054125 2911329 2777165 2649230 2526056 2408214 2297175 2193199 2094713 1999804
63824 1999804 1907921 1819843 1736278 1657118 1582094 1511370 1444973 1382140 1322008 1264762 1211393
63813 1211393 1162344 1117015 1074603 1034667 996747 960327 925604 893592 864860 838677 813929
63802 813929 790486 769075 750178 733595 718769 705009 691716 678949 667452 657622 648848 640540
63790 640540 633294 628026 624228 620247 615387 610594 606731 603237 599052 593990 588393 582052 574337 565083
63776 565083 554609 543006 530080 515987 501382 486954 473203 460617 449444 439122 428393
63765 428393 416401 403526 390955 379516 369146 359407 350175 341702 334146 327328 320911 314597 308173
63752 308173 301686 295642 290619 286385 281877 276567 271532 268403 267238 266157 263311 258635 253484 249251
63738 249251 246786 246480 248027 250265 251921 252607 252732 252564 251920 250732 249334 247901 246032 243240 239730
63723 239730 236455 234430 234059 234899 235832 235565 233330 229430 225060 221388 218626 216066 213135 210291 208660
63708 208660 208798 210022 211007 210862 209565 207686 206003 205337 206385 209400 213829 218317 221369 222368 221976 221330
63692 221330 220916 220544 220348 221185 223651 227019 229586 230034 228385 226023 225076 227271 232636 239380 245620 251208
63676 251208 257297 264221 270786 276119 281363 288595 298353 309150 319464 329409 340068 351868 364146
63663 364146 376010 387056 397289 406765 415321 422474 427667 430785 432242 432285 430511 426545 420917 414620
63649 414620 407965 400713 393336 387047 382174 377550 372301 367357 364056 361824 358548 353153 346554 339967
63635 339967 333533 327118 321434 317436 314980 312808 309777 305866 302078 299512 298340 297754 297177 297333 299629
63620 299629 304642 311852 320656 330658 340927 350222 358495 367282 377944 390216 402958 415474 427346
63607 427346 437740 445779 451236 454289 455157 454462 453069 450731 445762 437142 426298 415657 405995 396440
63593 396440 386524 376768 367545 359010 352123 348102 346501 345271 343237 341385 341062 342024 342981 343300 343545
63578 343545 344888 348375 354172 361276 368523 375976 384575 394502 405059 416269 429231 444323 460353
63565 460353 476304 492797 510985 530977 552317 575113 599646 625600 652723 681533 712358
63554 712358 744417 777099 811572 849666 891241 933636 973493 1008265 1036417 1057526 1072344
63543 1072344 1081901 1086567 1086626 1083260 1077935 1071130 1062859 1054134 1046500 1040118 1033595 1025798 1016450 1004724
63529 1004724 988851 968007 943678 918499 894469 872541 852816 834298 815330 795116 774468
63518 774468 754757 736924 721827 710380 702365 695895 689055 681700 674975 669859 667062 667588 672016
63505 672016 679451 688387 698583 711027 726031 742515 759502 777456 797723 821287 848385 878672
63493 878672 911306 945386 980799 1018267 1058050 1098734 1137639 1172387 1201942 1226471 1246562
63482 1246562 1262509 1274069 1280937 1283675 1284123 1284609 1286538 1289707 1292914 1294990 1295156 1292547 1285847 1273686
63468 1273686 1255427 1231425 1202558 1169719 1133739 1095321 1054764 1011996 967381 922546 879952
63457 879952 841280 806210 772919 739804 706792 675208 646583 621560 599713 580279 563104
63446 563104 548931 538550 531440 525439 518265 509538 500966 494353 489842 486391 483361 480975 479474 478854
63432 478854 479543 482508 488174 495707 503830 512010 520505 529693 539861 551311 564009 577188 589889
63419 589889 601973 614150 626756 638864 648898 655964 660285 662349 662036 658878 652928 644847 635047
63406 635047 623409 610285 597186 585626 575582 566045 557042 549944 545412 542168 538565 534571 531314
63393 531314 529289 528125 527767 528702 530966 533910 537215 541354 546807 553527 561507 571220 582968 596186
63379 596186 610040 624655 641322 661278 684362 709028 733782 758615 784867 813748 845441
63368 845441 879847 917577 959351 1004533 1051125 1097637 1144588 1193811 1246286 1300680 1353784
63357 1353784 1402404 1445081 1482057 1513532 1538207 1553980 1560017 1557815 1550250 1539916 1528243 1515538
63345 1515538 1501442 1485449 1467203 1446343 1422320 1394587 1362944 1327586 1289135 1248924 1208856
63334 1208856 1170337 1133430 1097423 1062010 1027440 993938 961840 932187 906312 884681 866810
63323 866810 852344 841467 834195 830071 828666 829641 832342 836379 842797 853418 868430 885614 902705
63310 902705 919767 938660 961135 988183 1020194 1056472 1095095 1134438 1174650 1216740 1260535
63299 1260535 1304502 1347382 1388979 1429199 1466871 1499578 1524442 1539679 1546020 1546150 1542142 1534064
63287 1534064 1521825 1507330 1493261 1480147 1466206 1449941 1431319 1410272 1385706 1356610 1323036
63276 1323036 1285549 1244885 1202639 1161074 1121519 1083714 1047160 1012111 978814 947039 917057
63265 917057 889883 865522 842106 818141 794836 774795 758716 744704 730714 716547 703464
63254 703464 692757 684742 678355 671788 664336 657487 653364 652113 651719 650428 648330 646294 644354 641858
63240 641858 638663 635460 632994 631343 630022 628646 627412 626759 626505 625705 623690 620917 618388 616614 615716
63225 615716 616049 617800 620103 621588 621970 622236 623112 624282 625411 626905 628942 630590 630747 629514 627895
63210 627895 626605 626043 627090 630821 637165 644590 651471 657367 662748 667980 672971 677627 682235 687331
63196 687331 693275 699971 706976 713978 721143 728931 737526 746589 755659 764735 774292 784704 795768 807002
63182 807002 818441 830941 845530 862464 881049 900290 919700 939681 961342 985759 1013048
63171 1013048 1042167 1071871 1101774 1132189 1163078 1193749 1223765 1253568 1283770 1314092 1343472
63160 1343472 1371119 1397168 1422316 1447126 1471699 1495780 1518968 1540892 1561195 1579443 1595071
63149 1595071 1607398 1615656 1619078 1617186 1610034 1598021 1581436 1560305 1534763 1505529 1474024 1442019
63137 1442019 1410837 1380589 1350377 1319757 1290052 1263858 1243196 1228383 1218534 1212582 1209725 1209515
63125 1209515 1211958 1217267 1225399 1236198 1249958 1267156 1287252 1308407 1328965 1348869 1369203 1390831
63113 1390831 1414033 1438897 1465134 1491580 1516687 1539642 1560499 1579356 1596005 1610379 1622488
63102 1622488 1631587 1636077 1634843 1628460 1618546 1605906 1589633 1568194 1541321 1510699 1478763 1446964
63090 1446964 1415321 1383341 1350844 1317928 1284909 1252764 1223068 1196815 1173400 1151269 1129513
63079 1129513 1108564 1089613 1073751 1061383 1051837 1043657 1035724 1028089 1021439 1016125 1012212 1010056 1009965
63066 1009965 1011329 1012904 1014150 1015712 1018483 1022734 1028212 1034492 1041029 1047257 1052888 1057958 1062699 1067635
63052 1067635 1073411 1080028 1086646 1092764 1099089 1106209 1112910 1117255 1119362 1121601 1125651 1130790 1135728 1140731
63038 1140731 1146881 1154244 1161924 1169310 1176179 1182039 1186369 1189263 1191122 1192095 1192555 1193721 1196904 1202330
63024 1202330 1209302 1217236 1225807 1234447 1242603 1250488 1258882 1268162 1278037 1288306 1299525 1312963 1329870
63011 1329870 1350317 1372550 1394176 1414471 1434958 1457286 1481418 1506551 1532867 1561178 1591525
63000 1591525 1623444 1657240 1693800 1733338 1775493 1820467 1868717 1919468 1970796 2021552 2072326
62989 2072326 2124367 2178355 2234299 2291717 2349857 2408544 2468659 2530758 2593406 2654168 2712242
62978 2712242 2768663 2823852 2876740 2926886 2975694 3024453 3072634 3119420 3165645 3212558 3259230
62967 3259230 3302639 3339919 3369260 3388952 3397249 3393648 3379289 3355435 3322033 3278261 3224384 3162908
62955 3162908 3097833 3032596 2968619 2905976 2845170 2787747 2735225 2688365 2647662 2613599 2585927
62944 2585927 2563663 2546629 2536211 2533647 2538154 2547717 2561297 2579198 2601530 2627404 2655658 2685527
62932 2685527 2716401 2747655 2778838 2809620 2839566 2868349 2895922 2921954 2945369 2965103 2980998
62921 2980998 2993121 3000322 3000377 2991711 2974300 2948735 2915084 2872963 2822308 2763887 2699205 2629778
62909 2629778 2556222 2478388 2396888 2314036 2232492 2153312 2076229 2001595 1930856 1865010 1803822
62898 1803822 1746901 1694539 1646931 1603483 1563488 1526733 1492823 1460689 1429678 1400593 1374763
62887 1374763 1352294 1331992 1312849 1294809 1278050 1262268 1247027 1232439 1219106 1207369 1196738
62876 1196738 1186049 1174249 1161096 1147158 1133271 1120067 1107823 1096340 1084976 1073143 1060791
62865 1060791 1048131 1035009 1021260 1007760 996317 987882 981370 974889 967853 961210 955805 951313 946979
62852 946979 942666 938687 934929 930767 925977 921340 917990 916067 914421 911945 909053 907300 907362 907941 907131
62837 907131 904669 902295 901912 903836 906869 909589 911290 912041 912286 912354 912126 911235 909731 908333 907702 907592
62821 907592 907184 906228 905281 904739 904293 903715 903485 903926 904310 903797 902976 903259 904665 905441 904304 902030 900171
62804 900171 899194 898710 898715 899471 900649 901606 902295 903013 903560 903552 903278 903249 903054 901698 899110 896380 894499 893657 893658
62785 893658 894089 894230 893925 894463 897308 901894 906162 909562 913828 920111 926916 932002 935048 937196 939064
62770 939064 940657 942435 944918 947620 949648 950958 951937 952330 952012 952242 954432 957721 959601 959232 958562 959581
62754 959581 961984 964319 966086 967554 968440 968081 966517 964445 962400 960827 960659 962801 966974 971800 976299
62739 976299 980915 987001 995640 1007044 1020633 1035496 1050925 1066807 1083661 1102416 1124089 1149298
62727 1149298 1177776 1208500 1240631 1274400 1310912 1351119 1395222 1443056 1494740 1550711 1611256
62716 1611256 1676332 1745994 1820760 1901157 1986841 2076414 2168343 2261835 2356513 2451334 2544165
62705 2544165 2632411 2713718 2786026 2847331 2895704 2929491 2947434 2948934 2934403 2905229 2863013
62694 2863013 2808804 2743226 2667423 2583689 2495039 2404090 2312299 2220091 2127507 2034771 1942590
62683 1942590 1852278 1765578 1684050 1608487 1539007 1475644 1418528 1367319 1320779 1277184 1235218
62672 1235218 1194487 1155548 1119560 1087562 1059687 1035180 1013466 994926 980215 968909 959326
62661 959326 949841 940133 931104 923937 919414 917914 919566 924095 930472 937223 943566 950199 958484 968921
62647 968921 981137 995425 1013237 1035499 1061339 1089468 1120248 1155265 1195223 1239437 1287164
62636 1287164 1338125 1391739 1447381 1505783 1568698 1636422 1706820 1777737 1849288 1922610 1997166
62625 1997166 2070567 2140515 2205537 2263964 2313553 2352473 2379836 2395085 2397575 2386954 2363389
62614 2363389 2327335 2279712 2222264 2157080 2085633 2008897 1928412 1846485 1765169 1685739 1609271
62603 1609271 1536745 1468115 1402155 1338106 1277041 1220879 1170323 1124398 1081739 1041621 1003752
62592 1003752 967839 933704 901639 872390 846767 825074 806670 790235 774783 760364 747547
62581 747547 736332 725925 715591 705280 695275 685484 675453 665017 654664 645125 636814 629855
62569 629855 624541 621222 619539 618235 616184 613419 610677 608325 606490 605927 607498 610613 613473 615521
62555 615521 618421 623661 630344 636861 643792 653064 664455 675218 683883 692552 704243 719355 736145
62542 736145 753607 772230 792430 813958 836888 861846 888932 917470 947148 978557 1012280
62531 1012280 1048227 1086280 1126846 1170111 1215237 1261036 1307276 1354645 1403195 1451077 1495168
62520 1495168 1533090 1564617 1590925 1612450 1627780 1634712 1631952 1619579 1598554 1570628 1538296 1503692
62508 1503692 1467189 1427754 1384855 1339456 1293158 1247247 1202798 1160703 1120973 1082768 1045815
62497 1045815 1011181 979827 950932 922660 894475 867773 844179 823923 806083 789708 774373
62486 774373 760055 746848 734672 723127 711705 700176 688638 677343 666673 657137 649074 642399
62474 642399 636964 633017 630931 630559 631368 633209 636378 640716 645215 649009 652511 657177 664274 674195 686780
62459 686780 701735 718588 736634 755292 774441 794341 815503 838891 865895 897333 932265
62448 932265 968490 1004797 1042323 1082923 1126358 1169947 1211223 1250056 1287612 1323862 1356884
62437 1356884 1384369 1404941 1417996 1422973 1419409 1407652 1389248 1366350 1340499 1311849 1279803 1244508
62425 1244508 1207477 1170526 1134458 1099238 1065189 1033339 1004386 977833 952618 928474 906316
62414 906316 887132 870737 855935 841872 828841 817548 808098 800188 793839 789038 784824 779934 774694
62401 774694 771165 770692 772179 773641 774619 775986 778120 780824 784809 791512 800965 811166 820293 828589
62387 828589 837278 846477 855253 863219 870896 878412 884921 889772 893551 897132 899831 899346 893961 884383
62373 884383 872916 861153 849233 837141 825492 814467 802980 789968 776078 763187 752446
62362 752446 743684 736538 731147 727592 725465 724312 724033 724713 726448 729314 733135 737488 742487 749170 758276
62347 758276 768897 779341 789144 799077 809296 818922 827781 837081 847638 858697 869490 880823
62335 880823 893917 908316 922146 934162 944434 953156 959769 963585 964767 964430 963744 962823 960674 956825
62321 956825 952869 951467 953644 958188 964059 971923 982404 994327 1006476 1020218 1038300 1061186 1086624
62308 1086624 1113306 1143227 1179401 1222368 1270190 1321332 1376441 1437171 1504023 1575786 1650981
62297 1650981 1729284 1810980 1894975 1978202 2057598 2132086 2201667 2264860 2318298 2359149 2387069
62286 2387069 2403358 2408937 2403683 2387202 2359578 2321555 2274500 2220167 2160195 2095764 2027800 1957437
62274 1957437 1886220 1815922 1748133 1683904 1623756 1567943 1516451 1468683 1423586 1380525 1339803
62263 1339803 1301995 1267049 1234568 1204730 1178217 1155135 1134643 1115891 1098965 1084706 1073804
62252 1073804 1066258 1061482 1058789 1057723 1057875 1058545 1058951 1058799 1058142 1056532 1053079 1047859 1042487 1038397 1035125
62237 1035125 1031321 1027001 1023474 1021122 1018743 1015469 1012066 1009642 1008062 1006539 1005136 1004769 1006067 1009021
62223 1009021 1013668 1020493 1029987 1041988 1055455 1068904 1081486 1093812 1107458 1123468 1141555 1160774
62211 1160774 1180513 1200810 1222340 1246360 1274099 1305773 1340606 1378089 1418821 1463774 1513279
62200 1513279 1567184 1625615 1689046 1757785 1831625 1909533 1989295 2068014 2143577 2215319 2282525
62189 2282525 2342668 2392019 2428122 2450994 2461830 2461328 2449705 2427714 2396772 2358017 2311738 2258046
62177 2258046 2197929 2133381 2066488 1998629 1930711 1863867 1799559 1739096 1683358 1632999 1588495
62166 1588495 1549825 1516346 1487128 1461393 1438784 1419414 1403506 1390664 1379787 1370173 1362434 1357499
62154 1357499 1354778 1352302 1348954 1345660 1343984 1344473 1346996 1351725 1358570 1366182 1372792 1378243 1384380 1393259
62140 1393259 1405423 1419910 1435373 1451163 1467763 1486252 1507119 1529849 1554015 1580344 1609925
62129 1609925 1642603 1677010 1712196 1748356 1785841 1824360 1863575 1903624 1944269 1983981 2020607
62118 2020607 2052923 2081141 2106064 2128373 2148897 2169167 2191150 2216201 2244372 2275088 2308655
62107 2308655 2346619 2390201 2438645 2489792 2542073 2595022 2647628 2697237 2740871 2777131 2806106
62096 2806106 2827905 2842259 2849423 2850456 2846330 2837352 2823740 2806181 2785493 2762138 2736420 2708800
62084 2708800 2679853 2650313 2621516 2595337 2573113 2554876 2539995 2528182 2519342 2512896 2508190 2505510
62072 2505510 2505801 2509240 2514877 2521892 2530368 2540548 2552334 2566109 2583128 2604103 2627998 2653194
62060 2653194 2679459 2707827 2738911 2772501 2808569 2847312 2888013 2929153 2970210 3012386 3056980
62049 3056980 3103813 3151856 3200615 3250228 3300784 3352371 3405428 3460494 3517791 3577396 3639328
62038 3639328 3703108 3767905 3833666 3901494 3972254 4045528 4120821 4199004 4281092 4365844 4450045
62027 4450045 4531443 4610286 4687754 4764344 4840634 4918592 5000670 5087558 5177440 5267345 5354815
62016 5354815 5438630 5518782 5596084 5671500 5745635 5818824 5891554 5964563 6038689 6114845 6193955
62005 6193955 6276401 6361344 6446902 6531175 6612922 6691151 6764457 6831408 6891616 6945950 6995329
61994 6995329 7039563 7077693 7109180 7134234 7153077 7165616 7172063 7173259 7169896 7161720 7148204 7129950
61982 7129950 7108921 7087054 7064899 7041827 7017428 6992430 6968178 6945413 6923854 6902976 6882662
61971 6882662 6862809 6842788 6822027 6800991 6780722 6761317 6741751 6721515 6701612 6683331 6666721
61960 6666721 6651016 6635965 6621952 6609162 6597485 6586962 6577592 6568995 6561124 6555092 6552250 6552434 6554075
61947 6554075 6556316 6560201 6567494 6578910 6593662 6609987 6625882 6640202 6653497 6667090 6680713 6691650
61935 6691650 6696796 6695119 6687404 6673928 6653349 6624052 6585967 6540624 6489632 6433550 6372491 6307582
61923 6307582 6241178 6175187 6109544 6042917 5974687 5905553 5836380 5767479 5699303 5632855 5568833
61912 5568833 5507057 5447348 5390303 5336442 5285072 5234911 5185619 5137948 5092556 5049406 5008297
61901 5008297 4969221 4932035 4896370 4862089 4829442 4798746 4770325 4744746 4722591 4703901 4688307
61890 4688307 4675750 4666478 4660220 4656132 4654055 4655285 4661496 4673123 4689262 4708842 4731340 4756574
61878 4756574 4784519 4815364 4849143 4885157 4922345 4960522 5000690 5043649 5088635 5134063 5179543
61867 5179543 5226533 5276769 5330458 5386420 5443890 5503934 5569038 5641491 5722407 5812504 5913676
61856 5913676 6029110 6161396 6310955 6477179 6661068 6865866 7094871 7349523 7630178
61847 7630178 7937942 8274915 8643216 9044885 9482541 9959095 10476695 11036604 11639813
61838 11639813 12286328 12972968 13691970 14431075 15172982 15893306 16559876 17135924 17585659
61829 17585659 17879118 17995709 17927265 17679610 17270813 16726987 16078405 15356687 14591606
61820 14591606 13807716 13023364 12252745 11507894 10798026 10128079 9499771 8914502 8374270
61811 8374270 7879510 7427372 7013429 6634871 6291069 5981170 5702359 5450997 5224627
61802 5224627 5022071 4842086 4682845 4542555 4419730 4312806 4220314 4141670 4077053 4026021
61792 4026021 3986767 3957168 3936068 3922853 3916086 3913320 3912330 3912009 3911936 3911419 3909111 3903295 3892550 3876489
61778 3876489 3856115 3833338 3810079 3787848 3767944 3751482 3739004 3730439 3725812 3725736 3730760 3740290 3752580
61765 3752580 3765852 3779011 3791121 3800742 3806267 3806708 3801718 3791284 3776122 3758172 3739617 3721139
61753 3721139 3702180 3683474 3668240 3659827 3658863 3663962 3674692 3692421 3718502 3753443 3798112 3853873
61741 3853873 3920607 3996191 4079327 4171826 4276570 4394057 4522593 4661447 4812016 4975935
61731 4975935 5153880 5346657 5555893 5782835 6027678 6290945 6574602 6880988 7211642
61722 7211642 7568297 7954373 8374258 8831538 9329146 9871043 10462549 11109052 11815638
61713 11815638 12588156 13433169 14355800 15358124 16440161 17601358 18839587 20148114
61705 20148114 21513049 22911768 24311052 25665323 26917429 28003245 28858976 29429558
61697 29429558 29677096 29587443 29172075 28464341 27512373 26371764 25099214 23747154 22360048
61688 22360048 20973247 19613850 18301927 17051333 15870595 14764265 13734336 12781064
61680 12781064 11903008 11096906 10358262 9682759 9067103 8508104 8001149 7540492 7121298
61671 7121298 6740530 6395424 6082136 5796786 5536967 5300972 5086071 4888956 4707570
61662 4707570 4540859 4386650 4241419 4102760 3970576 3845159 3725401 3609924 3498677
61653 3498677 3392084 3289495 3190018 3094366 3004370 2920667 2841985 2766726 2694294 2625090 2560266
61642 2560266 2501297 2448432 2399330 2350586 2301155 2253295 2209625 2170221 2133243 2097417 2062787
61631 2062787 2029531 1997224 1965409 1934213 1904155 1875607 1848567 1822894 1798755 1776635 1756553
61620 1756553 1737362 1717527 1696777 1676271 1656886 1638179 1619619 1601952 1586316 1572515 1559399
61609 1559399 1546736 1535415 1525636 1516162 1505944 1495422 1485469 1475890 1466034 1456318 1447896 1440870 1434051
61596 1434051 1426835 1420314 1415930 1413677 1412386 1411342 1410817 1411147 1412071 1413219 1414707 1416992 1420439 1425234 1431340
61581 1431340 1438231 1444895 1450443 1454713 1458287 1462127 1467261 1474240 1482391 1489973 1495833 1500887 1507261 1515783
61567 1515783 1525130 1533850 1542381 1552070 1562605 1571660 1577294 1579618 1579535 1576881 1570851 1561742 1550990 1539401
61553 1539401 1526333 1510894 1493253 1474469 1455802 1438478 1423321 1409991 1397111 1383669 1369822
61542 1369822 1355943 1341721 1327057 1313130 1301442 1292035 1283660 1275593 1268350 1262734 1259141 1257652 1257839
61529 1257839 1258572 1259253 1261190 1266383 1274753 1284105 1293348 1304141 1318386 1335491 1353400 1371232 1389464
61516 1389464 1408526 1428815 1451556 1477837 1506899 1536939 1567588 1600141 1635261 1672050 1709855
61505 1709855 1749339 1790879 1833138 1874525 1915304 1956973 1999779 2042018 2081924 2119349 2155216
61494 2155216 2190067 2223865 2256883 2289795 2322418 2353072 2380020 2403341 2424515 2444128 2461026
61483 2461026 2474091 2483703 2490650 2494548 2494543 2491012 2485268 2477898 2468654 2457885 2446732 2435783 2424845
61470 2424845 2414442 2406302 2401705 2400219 2400876 2404036 2411469 2424935 2445073 2471300 2502525 2538351 2579790
61457 2579790 2628471 2685212 2749895 2822580 2903782 2993680 3092269 3200683 3321267 3455664 3603756
61446 3603756 3765127 3940543 4131145 4337106 4558268 4795425 5049611 5320136 5604071
61437 5604071 5897215 6194460 6489267 6773729 7039312 7277019 7477376 7631775 7734712
61428 7734712 7784754 7783598 7734917 7644096 7518134 7364949 7192248 7006468 6812365 6613895
61418 6613895 6415869 6224193 6043661 5875714 5719206 5573379 5439505 5319888 5216306
61409 5216306 5129644 5060079 5007076 4969614 4946750 4937725 4941536 4956995 4983320 5020125 5066652 5121567
61397 5121567 5183674 5252168 5325889 5402985 5481798 5561613 5642104 5722480 5801713 5879284 5955203
61386 5955203 6029500 6102143 6173268 6243051 6311402 6378086 6442903 6505375 6564438 6618885 6668139
61375 6668139 6712287 6751519 6785892 6815460 6840069 6859042 6871659 6878128 6879617 6877024 6870045 6857742
61363 6857742 6839753 6816645 6789319 6758415 6724260 6687130 6647613 6606921 6566731 6528535 6493273
61352 6493273 6461729 6434853 6413099 6395619 6380776 6367527 6355711 6344892 6333724 6320985 6306634
61341 6306634 6291254 6274826 6256800 6237197 6217081 6198169 6182579 6172652 6170062 6175082 6187769 6210197
61329 6210197 6246588 6300584 6372972 6462762 6569953 6696383 6844184 7014342 7206875 7421541
61319 7421541 7657785 7914318 8189133 8479805 8783405 9095927 9411679 9722999 10020407
61310 10020407 10293245 10530894 10724380 10867629 10957607 10993465 10975834 10907054 10791632 10635726
61300 10635726 10445624 10226437 9981983 9715751 9432143 9137060 8837015 8537223 8240526
61291 8240526 7948407 7662873 7386955 7123603 6874736 6641252 6423240 6220117 6031252
61282 6031252 5856780 5697407 5553416 5424467 5310386 5211331 5126982 5056390 4998992 4955010
61272 4955010 4924464 4906572 4900574 4906153 4922350 4946920 4977838 5014877 5058647 5108381 5161627 5215924
61260 5215924 5269924 5323028 5374840 5425073 5473260 5518424 5559411 5595493 5626370 5652088 5673566
61249 5673566 5692622 5710405 5725873 5736562 5740751 5738134 5728754 5712475 5689609 5660981 5627049 5587695
61237 5587695 5543125 5494124 5441183 5384072 5322624 5257430 5189623 5120656 5052469 4987051 4925350
61226 4925350 4866981 4811290 4758298 4708544 4662653 4621255 4584799 4553211 4526103 4503224 4484013
61215 4484013 4466925 4450273 4433952 4419169 4406005 4392518 4377202 4361344 4347609 4336827 4327586
61204 4327586 4319023 4312785 4311722 4317245 4328505 4343819 4362402 4384688 4411379 4442699 4478783 4520478
61192 4520478 4569304 4626691 4693635 4770855 4858526 4955737 5060873 5172701 5290286 5411424
61182 5411424 5531688 5645289 5746264 5828561 5886017 5913299 5906784 5864385 5785707 5673526 5534492
61171 5534492 5376796 5206713 5027985 4844108 4659726 4479190 4304850 4137629 3978667
61162 3978667 3829353 3689966 3559477 3437297 3324656 3223424 3133655 3053105 2979605 2913237
61152 2913237 2855423 2806178 2763299 2724466 2689306 2658941 2634228 2615115 2601246 2592422 2588456 2589116
61140 2589116 2594170 2603264 2615828 2631335 2649404 2669356 2689970 2709955 2728311 2743987 2755766 2763274
61128 2763274 2767710 2770629 2771999 2770254 2764361 2755042 2743728 2731000 2716493 2699718 2680365 2658114
61116 2658114 2632652 2603790 2571248 2534733 2494796 2453356 2412497 2372464 2331446 2287693 2241319
61105 2241319 2193592 2145066 2095390 2044852 1995065 1947691 1903120 1860803 1820285 1781389 1743991
61094 1743991 1708340 1675243 1645234 1617855 1592386 1568853 1547308 1526401 1503858 1478639 1451754
61083 1451754 1424750 1398299 1372480 1347455 1323395 1300556 1279866 1262663 1249385 1239121 1230803
61072 1230803 1223994 1218231 1212747 1207747 1204962 1205886 1210043 1215939 1223077 1231955 1242568 1254158 1266258
61059 1266258 1278892 1291766 1304229 1316135 1327972 1340190 1353086 1367205 1382909 1399478 1415433
61048 1415433 1429952 1443450 1456739 1470139 1483198 1494568 1502336 1505463 1505046 1503310 1501209 1497814 1492172
61035 1492172 1484786 1476723 1468167 1458664 1448372 1438284 1429166 1420796 1412412 1403677 1394936 1386443 1377550
61022 1377550 1367151 1355056 1342373 1330229 1318659 1307299 1296565 1287179 1278731 1269726 1259207 1247652
61010 1247652 1236205 1225717 1216659 1209242 1203336 1198718 1195585 1194403 1195168 1197215 1199790 1202433 1204969 1207687
60996 1207687 1211425 1216772 1223157 1229358 1235069 1241359 1249463 1259584 1270843 1281947 1292001 1301365 1311763
60983 1311763 1324978 1341393 1360203 1380727 1402686 1425513 1448590 1472315 1497933 1526054 1556132
60972 1556132 1587549 1620313 1654547 1690375 1728671 1770903 1817641 1867916 1920502 1975124 2032118
60961 2032118 2091716 2154117 2219454 2287128 2355883 2425100 2495672 2569296 2647319 2730292 2817969
60950 2817969 2909710 3005620 3107228 3216200 3332709 3456469 3589082 3733423 3890326 4057936
60940 4057936 4235214 4424231 4627825 4846792 5080961 5331722 5601990 5894918 6214075
60931 6214075 6563611 6946519 7363650 7815969 8306840 8841130 9424265 10064868 10777268
60922 10777268 11579108 12487391 13518638 14690750 16021505 17527463 19229147 21156237
60914 21156237 23343363 25823666 28631939 31799133 35300381 38967158 42453233 45338237
60906 45338237 47328636 48401785 48779831 48781361 48692865 48726708 49003548 49491420 49949019 49982490
60896 49982490 49229466 47542534 45033794 41973080 38648435 35285478 32034617 28985438
60888 28985438 26182435 23640474 21358489 19325531 17521313 15919429 14494391 13226114
60880 13226114 12099089 11099787 10215279 9432820 8740085 8126131 7581516 7096817 6662035
60871 6662035 6268667 5911499 5586946 5290416 5017044 4764582 4533402 4322926 4129139
60862 4129139 3946083 3769094 3596573 3429529 3269826 3118364 2974746 2838672 2710888
60853 2710888 2591969 2480758 2375196 2274629 2180269 2093331 2013675 1940336 1872503 1809686
60843 1809686 1751651 1698484 1650079 1605465 1563229 1522846 1485063 1450782 1420033 1392236 1367021
60832 1367021 1344474 1324805 1307976 1293602 1281264 1270909 1262560 1255492 1248304 1240398 1232925 1227559
60820 1227559 1224485 1222183 1218795 1213045 1204283 1192817 1180206 1168157 1156856 1145150 1132463 1119616
60808 1119616 1107453 1095583 1083095 1069961 1057116 1045413 1034867 1024790 1014584 1004614 996246 990630
60796 990630 987581 986129 985928 987367 990447 994691 1000367 1008637 1019867 1032794 1046126 1060129 1075690
60783 1075690 1092585 1109930 1127964 1147921 1169943 1192318 1213272 1232507 1250280 1265842 1277938
60772 1277938 1286757 1294324 1302654 1312016 1321264 1329193 1335008 1338076 1338213 1336261 1333600 1330806 1327408 1323259
60758 1323259 1319418 1316991 1315500 1313068 1308079 1300259 1290450 1279929 1269708 1259788 1249059 1236462 1222255
60745 1222255 1207718 1193858 1180890 1168749 1157335 1146296 1135318 1124719 1115191 1106971 1099891 1094157
60733 1094157 1090318 1088425 1087961 1088564 1090010 1091541 1092507 1093890 1097940 1105569 1115102 1124326 1132967 1142446 1154077
60718 1154077 1168287 1184664 1201670 1217041 1229731 1241100 1253170 1266274 1279558 1293108 1307717
60707 1307717 1322637 1335558 1345536 1354391 1364289 1375162 1385746 1396011 1406797 1417411 1425530 1430059
60695 1430059 1432689 1435655 1438938 1440967 1441547 1442420 1444613 1446742 1447043 1446165 1446547 1449303 1452953 1455298 1455338 1453052
60679 1453052 1448510 1441975 1434168 1425653 1416368 1406183 1395366 1384073 1372058 1359462 1347223 1336087
60667 1336087 1325822 1316055 1307093 1299111 1291404 1283645 1277188 1273591 1272141 1270428 1267442 1264603 1263416 1263565
60653 1263565 1263973 1264428 1265142 1265485 1264251 1260978 1256402 1251751 1247828 1244449 1240621 1235652 1230207 1225752 1222915
60638 1222915 1221057 1219467 1217997 1216230 1213187 1208666 1203980 1200402 1197414 1193383 1187494 1180068 1171327 1160929
60624 1160929 1148629 1134533 1118776 1101853 1085251 1070751 1058798 1048248 1037928 1027606 1017182
60613 1017182 1006028 994034 982695 973984 968216 963925 959988 957044 956457 958576 962658 967965 974139
60600 974139 980665 986745 991986 996654 1001153 1005707 1010677 1016542 1023270 1030302 1037465 1045291 1054019 1063011
60586 1063011 1071771 1080833 1090762 1100873 1109972 1117867 1124986 1130993 1135298 1138844 1143781 1151058 1159750 1169102
60572 1169102 1179676 1191795 1204394 1216555 1229019 1242999 1258340 1273967 1289279 1303998 1317552
60561 1317552 1330087 1343468 1359621 1377965 1395726 1410693 1422500 1431444 1437601 1441329 1443382 1444069
60549 1444069 1443159 1440874 1438034 1435007 1431437 1427295 1423281 1419760 1416075 1411282 1404820 1396158 1384641 1370317
60535 1370317 1354403 1338458 1323513 1310203 1298932 1289448 1280863 1272819 1266279 1262689 1262533 1264954 1268424
60522 1268424 1271644 1274320 1277401 1282094 1288401 1295070 1301085 1306480 1311447 1315663 1319218 1323282 1328788 1334974
60508 1334974 1340353 1344904 1350156 1357100 1365033 1372663 1379404 1385194 1389881 1393515 1396778 1400459 1404650 1408923
60494 1408923 1413058 1417055 1420552 1423019 1424872 1427785 1433289 1441354 1451070 1462521 1476976 1495007 1515581
60481 1515581 1537924 1563481 1594711 1632334 1675183 1722735 1776045 1835424 1898512 1961777 2023024
60470 2023024 2081118 2133856 2177722 2209976 2229904 2237869 2234260 2220131 2198285 2172969 2148428 2127742
60458 2127742 2112554 2103379 2100233 2103199 2112382 2127270 2146392 2167917 2190658 2214402 2239368 2265685
60446 2265685 2293600 2323942 2357913 2396270 2439077 2486637 2540436 2602772 2675520 2759591 2855413
60435 2855413 2963418 3084144 3218457 3367717 3533127 3714727 3911691 4123736 4351632
60426 4351632 4596277 4858442 5140231 5445923 5780266 6146065 6543706 6971608 7424621
60417 7424621 7890695 8349168 8772538 9130499 9394655 9543236 9564510 9457452 9230419 8899978
60407 8899978 8489795 8027298 7538117 7042112 6553569 6083419 5639794 5226858 4844845
60398 4844845 4492333 4168448 3872829 3604160 3359785 3137184 2935431 2754626 2593935
60389 2593935 2450780 2322303 2207144 2105149 2015561 1936282 1865144 1801288 1744806 1695243
60379 1695243 1650883 1609491 1569543 1530665 1493122 1457196 1423151 1391477 1362661 1336688 1313131
60368 1313131 1291718 1272260 1254011 1235964 1218253 1202269 1188465 1174910 1159425 1142838 1128496
60357 1128496 1118402 1111332 1105249 1100071 1096938 1095836 1095390 1094666 1094067 1094424 1096031 1098580 1101475 1104138 1106467
60342 1106467 1108903 1111745 1114648 1117191 1119592 1122290 1125270 1128526 1132917 1139518 1147965 1156396 1163312 1168839
60328 1168839 1173881 1178864 1183855 1189086 1194496 1199207 1202450 1204861 1207832 1211397 1213695 1213058 1209938 1206174
60314 1206174 1202937 1200216 1197921 1196307 1195129 1193430 1190823 1188335 1187281 1187616 1188139 1188193 1188591 1190826 1195679
60299 1195679 1202549 1209744 1215652 1220062 1224338 1229947 1237016 1244709 1252590 1260850 1269456 1278141 1287325 1297935
60285 1297935 1309812 1321204 1330613 1338569 1346854 1356300 1366053 1374793 1382053 1388264 1393914 1398710 1401547
60272 1401547 1401667 1400034 1399083 1400690 1404656 1409449 1413979 1418227 1422683 1427911 1434323 1441497 1447687 1450691
60258 1450691 1449500 1444827 1438114 1430477 1422511 1414511 1406602 1398904 1391703 1385348 1380011 1375792 1372924 1371533
60244 1371533 1371147 1370702 1369174 1366297 1362892 1360487 1360159 1361450 1362743 1362973 1362612 1362743 1363751 1365399 1367586
60229 1367586 1370250 1372958 1375446 1378329 1382433 1387568 1392810 1397838 1403068 1408597 1414202 1420536 1429105 1440389
60215 1440389 1452859 1464542 1475026 1485310 1496252 1507796 1519469 1531180 1543707 1558471 1576360
60204 1576360 1596585 1617388 1638322 1661082 1687494 1717322 1748933 1781681 1816624 1855045 1897263
60193 1897263 1943121 1992865 2047018 2105772 2168876 2236085 2307601 2384177 2466850 2556481 2653501
60182 2653501 2758067 2870276 2990108 3117392 3252000 3393870 3542591 3697040 3855610
60173 3855610 4016568 4177937 4337265 4491990 4640060 4779933 4909984 5028257 5132858
60164 5132858 5222338 5295574 5351660 5390280 5412253 5419435 5413920 5397404 5371569 5338984 5303267 5268093
60152 5268093 5236189 5209295 5188575 5174780 5168529 5171216 5185429 5213682 5256721 5313762 5384461 5469810
60140 5469810 5570797 5686829 5815769 5954875 6101329 6252407 6405601 6558205 6706568
60131 6706568 6846389 6974025 7086909 7182438 7257521 7309985 7339762 7347878 7334923 7301272 7248192
60120 7248192 7177755 7092300 6995204 6891854 6788486 6689799 6598395 6516249 6445638 6388599 6346627
60109 6346627 6321074 6312930 6321944 6346833 6386702 6441546 6511211 6594386 6688537 6789938 6893829
60098 6893829 6995740 7093064 7184637 7268692 7342265 7402788 7449124 7480841 7497950 7502144 7497056
60087 7497056 7486424 7473064 7460370 7453248 7455875 7469481 7494218 7532822 7590624 7671834 7777271
60076 7777271 7906000 8057913 8234350 8437397 8669229 8931412 9224278 9547335 9900327
60067 9900327 10283160 10694604 11131834 11591368 12069482 12561183 13059658 13557455 14047739
60058 14047739 14523755 14977538 15399920 15781837 16115456 16394603 16614764 16772592 16864999
60049 16864999 16888917 16842413 16725986 16542611 16297031 15995711 15647367 15262726 14853225 14429910
60039 14429910 14003284 13583423 13179585 12799626 12449802 12134946 11858611 11623112 11429631
60030 11429631 11278429 11168973 11099903 11068886 11072568 11106696 11166209 11244986 11335537 11429425 11518681
60019 11518681 11597273 11661225 11707410 11732489 11733355 11708586 11659182 11587571 11495805 11384681 11254441
60008 11254441 11106019 10941400 10762871 10572155 10370321 10158421 9938181 9712332 9484631
59999 9484631 9259681 9042401 8837103 8646678 8472573 8315573 8176550 8056601 7956961 7879190
59989 7879190 7825156 7796086 7791488 7809500 7848592 7908499 7989117 8088889 8204772 8333408 8471501
59978 8471501 8614960 8758377 8895845 9022199 9133426 9226252 9297673 9344796 9365040 9356648
59968 9356648 9319246 9253875 9162440 9047280 8911333 8758503 8593498 8421095 8245478 8070239
59958 8070239 7899044 7736134 7585900 7451718 7335294 7237320 7158632 7100479 7063826 7048900
59948 7048900 7055659 7084491 7136139 7210835 7307596 7424627 7560793 7716613 7893134 8089222
59938 8089222 8300190 8519596 8742104 8963889 9180394 9384819 9569459 9728216 9857659
59929 9857659 9956412 10024268 10061511 10068202 10043779 9987612 9900206 9783992 9643259 9483475 9310517
59918 9310517 9130386 8949575 8775238 8614064 8470521 8346493 8242818 8160709 8101551 8066154
59908 8066154 8054967 8068428 8106160 8166089 8245407 8342588 8457607 8589781 8735913 8890909
59898 8890909 9049857 9209257 9366670 9519740 9665796 9802427 9928358 10043439 10147633
59889 10147633 10240532 10322470 10395813 10464383 10531625 10599962 10671910 10750937 10841115 10946800 11072940
59878 11072940 11224750 11406314 11619980 11867601 12151645 12474390 12836499 13237044 13674052
59869 13674052 14143569 14638014 15146416 15656347 16154702 16626544 17054502 17420562 17708596
59860 17708596 17905479 18001460 17991509 17877092 17666182 17371070 17005943 16585907 16126770 15644141
59850 15644141 15151905 14661490 14182614 13724234 13294188 12897910 12538085 12216043 11933391
59841 11933391 11692177 11493893 11338865 11226558 11156017 11125890 11134402 11179552 11259172 11370495
59831 11370495 11509438 11669983 11844165 12022982 12197650 12359786 12500052 12607151 12669305
59822 12669305 12677418 12626935 12517143 12349747 12128554 11859559 11550158 11208017 10840894 10457100
59812 10457100 10065218 9672950 9286310 8909902 8547637 8203018 7878977 7577666 7300333
59803 7300333 7047169 6817153 6608354 6419038 6248912 6098990 5969732 5859382 5764576 5682395
59793 5682395 5611040 5548542 5491876 5438025 5385345 5333394 5282084 5231789 5183784 5139536 5099504
59782 5099504 5063209 5030300 5000869 4974686 4950628 4926782 4900645 4869530 4831632 4786904 4736525
59771 4736525 4681716 4623663 4564214 4505595 4449358 4396494 4348605 4307889 4275583 4251392 4234855
59760 4234855 4226228 4225312 4230394 4239528 4252540 4270893 4295735 4326899 4363832 4406878 4457358 4516521
59748 4516521 4584289 4658799 4737275 4817414 4897753 4976965 5053619 5126882 5196602 5262179 5322077
59737 5322077 5375209 5422225 5464548 5502576 5535900 5565402 5594334 5627036 5666822 5714982 5771411
59726 5771411 5836196 5910857 5998029 6100035 6218362 6354774 6512092 6693154 6899577 7132381
59716 7132381 7393435 7685350 8010034 8367954 8758468 9179875 9628721 10098611 10578134
59707 10578134 11048384 11482931 11852306 12130575 12300009 12353455 12295935 12144189 11921829 11652468
59697 11652468 11356160 11049899 10748009 10460783 10194388 9953146 9740823 9559330 9408187
59688 9408187 9286883 9196803 9139662 9115101 9121325 9157470 9223838 9320038 9444226 9594434 9770020
59677 9770020 9971941 10202125 10462328 10753185 11074618 11427361 11813351 12234340 12691197
59668 12691197 13185395 13720132 14298750 14922634 15591825 16307097 17070031 17881223 18739489
59659 18739489 19642465 20586339 21564521 22567377 23583445 24600342 25605041 26585181 27531603
59650 27531603 28440009 29310772 30148006 30958791 31752125 32537452 33323315 34116033 34918197
59641 34918197 35727931 36539527 37343987 38128060 38873650 39560291 40169452 40686778 41101554
59632 41101554 41406391 41598735 41682283 41666722 41566669 41400620 41189169 40952641 40709913 40478851
59622 40478851 40276596 40118773 40019093 39990046 40043230 40188382 40432470 40780141 41234604 41797716
59612 41797716 42469443 43247108 44124022 45087767 46119539 47194727 48282968 49346845 50341224
59603 50341224 51215426 51917766 52400531 52624523 52563336 52206974 51563666 50658875 49531291
59594 49531291 48226974 46793963 45278928 43725165 42170416 40644945 39171359 37765695
59586 37765695 36437504 35188301 34010246 32886694 31794491 30707813 29603570 28466745
59578 28466745 27293074 26088400 24866303 23645059 22443810 21279013 20163103 19105142
59570 19105142 18111021 17182841 16319512 15518924 14779162 14097680 13470698 12894329 12365706
59561 12365706 11882460 11441884 11041167 10677601 10347902 10048073 9774690 9525799 9300056
59552 9300056 9095615 8910227 8741423 8585747 8438687 8296337 8156723 8018886 7881453
59543 7881453 7742899 7602382 7459316 7312763 7162438 7009971 6858186 6709325 6564620
59534 6564620 6425110 6292004 6166662 6050807 5946116 5852795 5769321 5694467 5628863 5573676
59524 5573676 5528871 5494046 5469887 5456887 5453346 5456655 5466217 5483110 5507127 5536454 5570510 5610681
59512 5610681 5657423 5708557 5761521 5815848 5872553 5932610 5997095 6067435 6144306 6227311 6316735
59501 6316735 6414491 6522361 6640641 6769775 6911982 7069552 7242602 7430438 7634391 7857106
59491 7857106 8099224 8359057 8635975 8932023 9249180 9586517 9941148 10310649 10693011
59482 10693011 11084933 11481832 11879506 12274500 12662552 13037824 13394520 13728717 14037868
59473 14037868 14318777 14567004 14778744 14953088 15092261 15199974 15279813 15335003 15369183 15387088
59463 15387088 15394430 15397211 15401303 15412837 15438627 15485365 15557780 15657661 15784578 15936617 16109502
59452 16109502 16295300 16482932 16660013 16813731 16930482 16996455 16999820 16932420 16789530 16569096
59442 16569096 16272157 15903824 15473226 14992410 14474941 13934470 13383496 12833222 12294287
59433 12294287 11776629 11287660 10830811 10406706 10015774 9659256 9337987 9051357 8798079
59424 8798079 8577439 8389291 8233149 8107872 8012264 7945437 7906443 7893943 7906627 7943778
59414 7943778 8005121 8090347 8199311 8332596 8491005 8673945 8878809 9102548 9343507 9600993
59404 9600993 9873116 10155588 10442299 10726072 10998600 11250488 11472004 11653767 11787018
59395 11787018 11864441 11881631 11837630 11733747 11572281 11356883 11093770 10791722 10460390 10108409
59385 10108409 9742768 9369513 8994761 8624766 8264825 7918319 7587173 7273119 6977972
59376 6977972 6702722 6447134 6210552 5992681 5793298 5611707 5446905 5297957 5163975
59367 5163975 5044185 4938355 4846685 4768737 4702709 4646312 4598317 4559045 4529547 4510582 4502111
59356 4502111 4503312 4512980 4530033 4553744 4583863 4620901 4665857 4718529 4775700 4831924 4882861 4927690
59344 4927690 4968349 5007701 5049236 5097322 5155856 5226517 5309353 5404908 5514267 5636447 5766992
59333 5766992 5900467 6034536 6171500 6316372 6474032 6647952 6840665 7054592 7292119
59324 7292119 7555135 7845062 8163548 8512906 8895654 9313921 9769604 10264782 10801507
59315 10801507 11381189 12004372 12670692 13378320 14123224 14898997 15696974 16505948 17312205
59306 17312205 18101126 18859727 19577827 20247271 20861228 21415232 21908727 22344710 22727243
59297 22727243 23059023 23340948 23573195 23755922 23888618 23969083 23993345 23956395 23852854 23677684
59287 23677684 23427825 23104217 22712165 22259412 21753830 21202579 20612240 19988786 19337784
59278 19337784 18665415 17979083 17286311 16593311 15905366 15228456 14569494 13934717 13328501
59269 13328501 12753771 12212734 11706885 11237075 10804105 10408709 10050454 9727210 9436335
59260 9436335 9176094 8945353 8742309 8564433 8409795 8277791 8168218 8080051 8011473 7960847
59250 7960847 7927350 7910844 7911371 7928522 7960752 8005285 8059292 8121440 8191735 8269332 8351038 8432829
59238 8432829 8512708 8590968 8667310 8738582 8800100 8848735 8884161 8907658 8920711 8924743 8921394 8912707
59226 8912707 8901292 8890276 8882777 8881467 8888811 8907376 8939339 8985779 9046943 9123208 9215428 9324328
59214 9324328 9449860 9590896 9745130 9909401 10080521 10255422 10429771 10596566 10746911
59205 10746911 10872532 10967581 11028891 11055877 11050460 11016169 10956852 10876667 10780958 10675705 10565466
59194 10565466 10452706 10339670 10229931 10127254 10033642 9949309 9873828 9806140 9743900 9684235
59184 9684235 9625510 9567624 9510493 9453039 9393897 9332599 9269827 9207015 9145879 9088030 9035030
59173 9035030 8989225 8954360 8934562 8932513 8949265 8986159 9046166 9132825 9248575 9394947 9573955
59162 9573955 9788217 10039613 10328548 10654438 11015842 11409520 11829960 12270034 12720934
59153 12720934 13170441 13602128 13997985 14342279 14622182 14825307 14939008 14953694 14866257 14679560
59143 14679560 14399769 14035657 13599748 13107832 12576274 12020157 11453520 10889369 10338143
59134 10338143 9806820 9300232 8822562 8376795 7963504 7581518 7229781 6907746 6614154
59125 6614154 6346636 6103022 5882412 5684446 5507762 5349624 5207055 5078253 4962985
59116 4962985 4861590 4773543 4697171 4631089 4575604 4532061 4500657 4479450 4465827 4458491 4457555 4463202
59104 4463202 4475155 4493569 4519637 4554559 4597990 4647937 4702395 4760919 4824625 4894935 4972558
59093 4972558 5057417 5149075 5246968 5350526 5459377 5573399 5692282 5814961 5939662 6064571
59083 6064571 6188338 6309889 6427948 6540725 6645705 6739711 6819786 6884705 6935485 6973831
59073 6973831 7000205 7014080 7016013 7008513 6994484 6975723 6953607 6930492 6909493 6893390 6884660 6886041
59061 6886041 6899698 6925958 6964302 7015821 7083362 7168742 7271144 7388975 7521979 7670438
59051 7670438 7833460 8009671 8199079 8402718 8620611 8851504 9094600 9350059 9617226
59042 9617226 9893417 10175062 10459283 10743572 11024077 11294486 11546294 11770172 11957654
59033 11957654 12101965 12197441 12238818 12222126 12146471 12014360 11830265 11599471 11328224 11023774
59023 11023774 10693410 10343611 9980152 9608398 9233252 8859317 8491115 8132199 7783788
59014 7783788 7445344 7117146 6801540 6501038 6216179 5946218 5691091 5451293 5226235
59005 5226235 5014369 4815239 4630107 4459839 4302984 4156762 4019555 3891738 3774187
58996 3774187 3666627 3567620 3475830 3390815 3312491 3240108 3172230 3107812 3046883 2989869 2936584
58985 2936584 2886351 2838890 2794412 2752760 2713110 2674950 2639060 2607024 2579827 2557256 2538638
58974 2538638 2523679 2512249 2503710 2497105 2492167 2489570 2489720 2491641 2493760 2495726 2498765 2503923 2510526 2516846
58960 2516846 2521912 2526109 2530096 2533761 2536359 2537283 2536371 2533711 2529547 2524515 2519743 2516427 2515302 2516611
58946 2516611 2520419 2526511 2533913 2541092 2547154 2552542 2558008 2563089 2566294 2566720 2564750 2560940 2554926 2545888
58932 2545888 2533760 2519659 2505424 2492973 2483542 2477002 2472133 2468005 2465138 2465099 2469114 2477224 2488506
58919 2488506 2501806 2516365 2532055 2549105 2567715 2588174 2611236 2637837 2668225 2701840 2738271
58908 2738271 2777831 2820758 2866303 2913145 2960512 3008532 3057768 3108859 3162309 3218023 3275160
58897 3275160 3332901 3391420 3451733 3514786 3581023 3650579 3723255 3798428 3875745 3956185 4041808
58886 4041808 4134041 4232442 4335482 4442330 4553594 4670542 4794161 4925159 5064571 5213832
58876 5213832 5374118 5545875 5729213 5924518 6132316 6352788 6586103 6833364 7096590
58867 7096590 7377493 7676799 7995187 8334404 8696884 9084709 9499598 9943576 10418767
58858 10418767 10926500 11467436 12042880 12655451 13308161 14003124 14741170 15521958 16343731
58849 16343731 17202953 18094430 19011609 19946335 20887957 21822406 22731819 23595005 24388608
58840 24388608 25088525 25671226 26115354 26404112 26527703 26484169 26278145 25919195 25421309
58831 25421309 24802876 24085299 23290360 22438531 21549308 20641785 19733398 18837669 17963686
58822 17963686 17117983 16306460 15534265 14804441 14117429 13471994 12866517 12299721 11770606
58813 11770606 11277754 10818647 10389988 9989004 9614181 9264508 8938376 8633700 8348807
58804 8348807 8082698 7834702 7604405 7391595 7195541 7014504 6846775 6692112 6551274
58795 6551274 6424059 6308700 6203605 6108944 6026053 5955625 5896836 5847968 5807839 5777004 5757584
58784 5757584 5751348 5757892 5775118 5801347 5836429 5881232 5937180 6006201 6089685 6187012 6296218
58773 6296218 6416511 6549055 6694949 6853988 7026288 7213694 7418248 7640163 7878714
58764 7878714 8134430 8409055 8703766 9018773 9354583 9712673 10095138 10504548 10943830
58755 10943830 11415367 11920493 12460653 13038409 13656191 14314542 15012841 15751244 16530156
58746 16530156 17347531 18197862 19073637 19965893 20862433 21746598 22598612 23397530 24121493
58737 24121493 24747270 25251337 25612665 25815862 25853253 25724949 25437051 24999982 24428679
58728 24428679 23743344 22967872 22126093 21238901 20323988 19396712 18470569 17557361 16667158
58719 16667158 15807572 14983245 14196880 13450920 12747418 12086549 11466689 10886339 10344619
58710 10344619 9839298 9365934 8920376 8501294 8108975 7742336 7398738 7076472 6775646
58701 6775646 6496017 6235277 5990472 5760451 5545931 5347400 5163865 4993759 4836306
58692 4836306 4691591 4559695 4440249 4332413 4234750 4145284 4062374 3985588 3915230 3851070
58682 3851070 3792246 3738521 3690670 3649158 3613052 3580631 3550240 3520018 3487700 3451770 3412396
58671 3412396 3370395 3325807 3278448 3229358 3180380 3132301 3084309 3035287 2984805 2932913 2879756
58660 2879756 2825361 2769204 2710464 2649583 2589039 2531185 2475558 2419673 2362394 2304984 2248782
58649 2248782 2193644 2139345 2086891 2037382 1990632 1945940 1903474 1863960 1827517 1793488 1760909
58638 1760909 1728693 1696091 1663661 1633136 1605629 1580452 1556178 1532271 1509106 1487080 1466414
58627 1466414 1447369 1429983 1413987 1399554 1387522 1378227 1370665 1363721 1357987 1355514 1357747 1364242 1373315
58614 1373315 1383316 1393286 1402953 1412521 1422431 1433129 1444767 1456797 1467935 1477001 1483902 1489485 1494399
58601 1494399 1498497 1501320 1502719 1502921 1502365 1501347 1499384 1495292 1488782 1481749 1476877 1474897 1474350 1474258 1475706
58586 1475706 1480174 1487602 1497066 1508478 1522622 1540053 1560767 1584505 1610717 1638803 1669090 1703040
58574 1703040 1741724 1784513 1829983 1877623 1928097 1982366 2041277 2105471 2174862 2248632 2326639
58563 2326639 2410457 2502126 2602134 2709610 2824453 2948249 3082989 3229741 3389024 3561739
58553 3561739 3749058 3951457 4168372 4399021 4643286 4901044 5170134 5445303 5719677
58544 5719677 5986843 6240497 6472266 6671533 6828466 6936885 6994048 6999039 6952578 6857964
58534 6857964 6721112 6549471 6351004 6133474 5903789 5667878 5431204 5198741 4973998
58525 4973998 4758554 4553040 4358285 4175442 4005839 3851049 3712211 3588665 3478067
58516 3478067 3378469 3289529 3211191 3142311 3081497 3028093 2981030 2937748 2896033 2856516 2821730
58505 2821730 2792823 2768673 2747966 2730356 2715242 2701038 2686214 2669649 2649131 2620917 2582185
58494 2582185 2533456 2477645 2417226 2353388 2287590 2222346 2159684 2099647 2041214 1984467 1930950
58483 1930950 1881874 1836949 1795492 1757874 1724845 1695778 1668710 1642337 1617192 1594673 1575601
58472 1575601 1559805 1546253 1533226 1519123 1503606 1487580 1471881 1456510 1441101 1425205 1407970
58461 1407970 1388628 1367720 1346802 1326418 1305517 1283580 1262244 1243799 1228834 1216259 1204849
58450 1204849 1193730 1182179 1170375 1160103 1153505 1150981 1150942 1151458 1151628 1151684 1152551 1155163 1159689 1165538 1172402
58435 1172402 1180789 1191226 1203595 1217786 1234272 1253300 1274006 1295033 1315579 1335349 1354017
58424 1354017 1371185 1386301 1398269 1406048 1410136 1412401 1413671 1412498 1407160 1397945 1386489 1373774 1359883
58411 1359883 1344980 1329486 1313938 1299543 1287885 1279014 1270722 1260843 1249326 1236906 1222960 1206437
58399 1206437 1188078 1169953 1153218 1137850 1124042 1112281 1102447 1094375 1088818 1086301 1085488 1084409 1083024
58386 1083024 1082822 1084194 1086034 1088011 1091345 1096930 1104142 1111897 1119713 1127463 1135191 1143432 1152895 1163785
58372 1163785 1176051 1189831 1204649 1218825 1230948 1241349 1250564 1256956 1257821 1252820 1244619 1236130 1228847
58359 1228847 1223867 1222394 1224395 1228248 1232574 1237554 1244065 1252531 1262947 1275119 1288469 1302391 1317021
58346 1317021 1333072 1350908 1370238 1390376 1410152 1428114 1443658 1457354 1469352 1478339 1483229 1484871
58334 1484871 1484662 1482485 1477717 1471428 1465536 1460362 1454989 1449607 1445576 1443510 1443067 1443873 1444440 1440833 1429249
58319 1429249 1410203 1388042 1366419 1346400 1328538 1313887 1302577 1294056 1289237 1289840 1294981 1300980
58307 1300980 1305525 1309927 1316542 1326178 1338797 1354319 1371459 1387817 1402471 1416939 1432621 1448920
58295 1448920 1464831 1480724 1497551 1515678 1535278 1556423 1577997 1597948 1615310 1630679 1644266
58284 1644266 1655050 1662489 1667585 1671720 1675642 1679786 1684147 1687768 1689937 1691848 1695352 1700370 1705670 1711947
58270 1711947 1721485 1734570 1748939 1763279 1778807 1796804 1817126 1839622 1864465 1890463 1915723
58259 1915723 1940691 1967969 1998438 2030302 2062547 2096218 2131327 2165734 2198542 2231708 2266737
58248 2266737 2302493 2337603 2372127 2405386 2435163 2461042 2485935 2512402 2539852 2567005 2594433
58237 2594433 2622772 2651103 2679306 2709706 2744145 2781404 2819519 2858687 2900106 2943915 2990158
58226 2990158 3039867 3093433 3149556 3207172 3266759 3328860 3393532 3462112 3536996 3618555 3704813
58215 3704813 3795144 3891503 3995119 4105005 4220588 4342282 4468240 4594317 4718921 4844392
58205 4844392 4972167 5100495 5228651 5359298 5494700 5634755 5780942 5937949 6108849
58196 6108849 6292676 6489059 6700779 6929058 7170871 7424082 7691022 7974022 8271849
58187 8271849 8583699 8912283 9259605 9624198 10005836 10408471 10835216 11285328 11759518
58178 11759518 12262870 12798605 13364414 13959234 14588299 15257059 15965614 16713661 17505103
58169 17505103 18342899 19225487 20153827 21136205 22180607 23288328 24460619 25705225 27030525
58160 27030525 28440041 29939327 31541638 33260050 35100316 37067500 39172289 41425100
58152 41425100 43833523 46413733 49195998 52211731 55484584 59040969 62917151 67147713
58144 67147713 71761438 76800140 82329704 88425903 95171573 102685820 111141066 120738293
58136 120738293 131684095 144198250 158501965 174767932 193121295 213746451 237002964
58129 237002964 263448037 293772853 328564112 367616248 408849904 447714162 478144253
58122 478144253 494966165 496145175 483250594 460077944 430768791 398652854 365993028
58115 365993028 334177980 304002365 275911434 250143051 226757412 205654479 186654404
58108 186654404 169582848 154290744 140645846 128548714 117939499 108760553 100924661
58101 100924661 94332825 88895399 84513378 81065819 78445925 76599308 75522912 75264196
58093 75264196 75921822 77535595 79837762 82099325 83340303 82820050 80398253 76484953
58085 76484953 71706260 66604970 61534596 56686801 52149417 47955237 44114167 40622957
58077 40622957 37461504 34594663 31982888 29591593 27396006 25383884 23552834 21900464
58069 21900464 20416255 19082818 17881517 16794778 15806342 14902614 14072928 13307633 12597953
58060 12597953 11938352 11326523 10760316 10236739 9753750 9309733 8900596 8520154 8163819
58051 8163819 7829339 7513820 7213092 6924299 6646131 6376194 6111269 5850778 5597207
58042 5597207 5352552 5116942 4890987 4676483 4474031 4282645 4102511 3935663 3782810
58033 3782810 3641345 3507354 3378286 3253480 3133611 3019714 2911436 2806556 2703606
58024 2703606 2604190 2510893 2423720 2340492 2259827 2181525 2105049 2030353 1959517 1894771 1835233
58013 1835233 1778184 1723021 1671231 1622990 1576927 1533134 1493202 1457012 1422573 1389573 1360143
58002 1360143 1335206 1312707 1290539 1268901 1248669 1229449 1210472 1191912 1174210 1157184 1140450
57991 1140450 1123843 1107238 1091005 1076485 1064709 1054832 1045097 1034965 1024825 1014336 1002997 991905
57979 991905 982685 974891 966675 957929 950372 944423 938510 932055 926724 923722 921640 918064 912066 904517
57965 904517 897130 891498 887883 884874 881427 878875 879227 881816 883787 883899 883640 884426 885962 887820 890232
57950 890232 892519 892877 890817 888051 886131 884960 884342 884920 886437 887078 885951 884638 884754 885396 884527 881678
57934 881678 877570 871936 863360 850822 834011 812357 785114 752713 717447 682701 651572 625815
57922 625815 605753 591228 582312 578512 577799 577750 577785 579151 582581 587195 591939 596686 601349 605275 608309
57907 608309 611422 615486 620274 625319 630810 636834 642624 647426 651406 654912 657415 658006 656419 652927
57893 652927 647702 641034 633855 627281 621662 616414 610748 604486 598425 593920 591738 591356 591758 592663 594241
57878 594241 595896 596558 596358 596907 599378 603106 606568 608962 610279 610400 608852 605134 598933 590244 579513
57863 579513 567441 554571 541270 527980 515064 502678 491192 481355 473347 466238 459409 454086
57851 454086 452118 453405 455913 458285 460997 464752 469283 474314 480271 487237 494326 500871 507250 513872
57837 513872 520408 526774 533817 542014 550270 556936 561372 563670 563674 561406 557960 554777 552090 548952 544681
57822 544681 539579 534254 528896 523324 517411 511424 506080 502038 499117 496338 492919 489061 485606 483319
57808 483319 482567 483240 484787 486704 489156 492727 497564 503287 509640 516459 522998 528245 532279 536347 541143
57793 541143 545827 549330 551709 553409 553900 552165 548365 544090 540847 538715 536555 533221 528620 523684
57779 523684 519272 515221 510860 506246 502097 498382 493894 487744 480474 473074 465517 457038 447479 437573
57765 437573 428155 419760 412756 406981 401227 393901 384588 374483 364864 355585 345710 335467 326562 320049
57751 320049 314667 308386 301226 295155 291048 287463 283232 279635 278357 278477 277601 275465 274259 275408 278150
57736 278150 281716 286737 293573 301072 308260 315775 324221 332328 338392 342856 347919 354902 363249 371908
57722 371908 380387 388352 395224 400565 404378 406896 408370 409005 408828 407750 405939 403770 401167 397460 392282
57707 392282 386265 380435 375163 370042 364540 358579 352780 348235 345671 344855 345349 347639 352460 358828 364118
57692 364118 366888 368723 372308 378264 384748 389763 392996 395620 398978 403420 408133 412308 416433 421789
57678 421789 428643 435999 443493 452324 463551 476479 489632 502353 514388 524851 533068 540016 547679
57665 547679 557166 568306 580623 593671 606836 620042 634420 651177 670000 689584 709508 730514
57653 730514 753202 777563 803623 831384 860154 889045 918143 948161 979177 1010912 1044190
57642 1044190 1080767 1121596 1166473 1215419 1268905 1326404 1386201 1447287 1510247 1575757 1643480
57631 1643480 1713153 1785614 1862027 1943216 2030501 2126002 2231194 2346300 2472064 2610791
57621 2610791 2764346 2932405 3114426 3312315 3528951 3764484 4016231 4281949 4560716
57612 4560716 4849883 5143246 5433171 5712662 5974188 6208516 6406836 6563074 6671898
57603 6671898 6724912 6711409 6624346 6465584 6245972 5981738 5690494 5388024 5086237 4793125
57593 4793125 4514247 4253690 4013702 3794547 3595461 3415495 3253391 3107607 2977041
57584 2977041 2861209 2759372 2670212 2592863 2527425 2473768 2430631 2396709 2371826 2355978 2347853
57573 2347853 2345717 2349460 2360520 2379911 2407603 2443720 2488769 2542342 2603055 2670475 2746126 2831942
57561 2831942 2928764 3036977 3157501 3291053 3437047 3594111 3761097 3936627 4118070 4301891
57551 4301891 4484527 4661759 4827185 4972307 5088485 5168653 5207786 5203155 5154924 5066153
57541 5066153 4941876 4788180 4611805 4419712 4218347 4013148 3808525 3607783 3412841
57532 3412841 3224376 3042679 2868579 2703596 2549371 2406906 2276161 2156247 2045944
57523 2045944 1944087 1849580 1761471 1679323 1603376 1534027 1471051 1413587 1360991 1313519 1271777
57512 1271777 1235443 1202760 1171652 1141349 1112726 1087081 1064907 1045938 1029810 1016225 1004734
57501 1004734 994934 986868 980815 976649 973709 971355 969490 968691 970074 974797 983195 994315 1006566 1018943
57487 1018943 1031687 1046058 1063556 1084923 1109470 1135587 1162153 1189308 1218045 1249820 1286555
57476 1286555 1329592 1377846 1428264 1479322 1533052 1592277 1657111 1726195 1800484 1883056 1975135
57465 1975135 2075013 2181638 2296764 2422090 2556011 2694827 2835997 2978801 3122526 3264986
57455 3264986 3401906 3526831 3632502 3713331 3766142 3788502 3778192 3735470 3664358 3570252 3457362
57444 3457362 3329690 3192812 3052289 2910942 2769710 2630836 2498064 2373725 2257618
57435 2257618 2149213 2049267 1958591 1876602 1802052 1734410 1673917 1620793 1574816 1535325 1501450
57424 1501450 1472783 1449764 1432936 1421966 1416127 1415680 1421883 1435310 1454705 1477880 1503493 1531838
57412 1531838 1564229 1601803 1644879 1693450 1748000 1809279 1877287 1951264 2031086 2117864 2212634
57401 2212634 2315138 2424450 2539949 2660729 2784650 2908841 3030357 3145102 3246649
57392 3246649 3327666 3382701 3408775 3403893 3366865 3299105 3205185 3090564 2959270 2814348 2659849
57381 2659849 2501357 2344234 2191553 2043893 1901122 1764148 1634698 1513753 1401004
57372 1401004 1295928 1198500 1108446 1024701 946303 873228 805770 743761 687058 635938 590172
57361 590172 548279 508591 470588 434610 401018 370392 343515 320045 297993 275749 253862
57350 253862 233550 214350 194900 175348 157138 140735 125388 110947 98016 86283 74589
57339 74589 62922 52493 43427 34209 24144 14702 7394 1544 -4771 -12498 -21140 -29765 -37678 -44670
57325 -44670 -51083 -57273 -62842 -67141 -70576 -74430 -79166 -83939 -88063 -91844 -95482 -98351 -100046 -101162
57311 -101162 -102281 -103028 -102946 -102519 -102472 -102699 -102768 -103009 -104201 -106417 -108971 -111455 -114169 -117467 -121107 -124398 -126804
57294 -126804 -128322 -129274 -129762 -129476 -128097 -125616 -122124 -117654 -112519 -107231 -101598 -94430 -84858 -73513 -61695
57279 -61695 -49913 -38179 -27274 -18466 -12123 -7596 -4256 -1472 2242 8673 18115 29144 40382
57266 40382 51684 63549 76323 90082 104394 118179 130731 142797 155694 169501 183275 196890
57254 196890 211284 226805 242620 258003 272988 287694 302239 317288 333104 348067 360042
57243 360042 369667 380407 394521 410651 426308 441001 455733 470951 486649 503498 522289 542634
57231 542634 563345 583653 603374 622552 641856 662697 686005 711221 737138 763306 790226
57220 790226 818758 849799 883788 920157 958095 998209 1042302 1090847 1141730 1192183 1240843
57209 1240843 1286965 1328801 1364245 1392573 1414359 1429969 1439108 1441695 1438393 1430414 1419300 1406666
57197 1406666 1393787 1381677 1371453 1363834 1358088 1352637 1347181 1343330 1342628 1345111 1350506 1359559 1372949
57184 1372949 1389808 1408587 1428791 1450713 1474014 1497903 1522539 1549118 1578392 1609839 1642254
57173 1642254 1674664 1706759 1739034 1772506 1807967 1845583 1885253 1926918 1970322 2014900 2060113
57162 2060113 2105376 2149547 2191324 2230738 2269619 2309948 2351875 2393645 2433321 2470648 2507705
57151 2507705 2547739 2592851 2642939 2697261 2756370 2821365 2891688 2965290 3041115 3119965 3202627
57140 3202627 3288659 3377371 3468429 3560633 3651486 3739115 3823824 3907014 3989344 4070491 4149764
57129 4149764 4226241 4299057 4368197 4434496 4498634 4560947 4622352 4684192 4746602 4807878 4865935
57118 4865935 4919676 4968845 5013608 5054501 5091925 5125618 5155666 5183902 5212889 5243454 5274532
57107 5274532 5305357 5336230 5367053 5396827 5424864 5450981 5474372 5494013 5510402 5525339 5539936
57096 5539936 5554483 5569958 5587484 5606441 5625486 5645409 5668136 5692537 5713924 5728298 5734314
57085 5734314 5730473 5713410 5680298 5630513 5563859 5479496 5377446 5258731 5123001 4968203 4792975
57074 4792975 4596890 4378180 4134294 3864902 3570874 3249711 2895527 2504121 2074303
57065 2074303 1603810 1088351 525621 -84479 -745200 -1464098 -2247718 -3099648 -4025147 -5032558
57055 -5032558 -6128624 -7317854 -8608616 -10014784 -11549915 -13225864 -15059228 -17072938
57047 -17072938 -19289586 -21730220 -24422539 -27404006 -30715753 -34402482 -38521548 -43143430
57039 -43143430 -48339798 -54178682 -60730628 -68064820 -76233831 -85273948 -95223255 -106125443
57031 -106125443 -118014930 -130913512 -144829332 -159717764 -175447174 -191871602 -208950666
57024 -208950666 -226661509 -244626715 -261846948 -277012195 -289270300 -298726715 -306155566
57017 -306155566 -312223349 -316975296 -319945000 -320597110 -318636006 -314018624 -306813611 -297092006
57009 -297092006 -284927290 -270475308 -254044242 -236082134 -217100204 -197611271 -178115071
57002 -178115071 -159086567 -140934850 -123963494 -108367364 -94250682 -81638324 -70485812
56995 -70485812 -60702140 -52173413 -44771506 -38357608 -32794909 -27961960 -23753788 -20077918
56987 -20077918 -16856308 -14027069 -11537850 -9339093 -7386416 -5645034 -4087288 -2688945
56979 -2688945 -1431265 -302540 707129 1610583 2420913 3148143 3802129 4395356 4938760
56970 4938760 5436832 5889523 6296460 6657218 6971384 7242463 7479568 7691917 7883109
56961 7883109 8052652 8200472 8327513 8434711 8524625 8602339 8672193 8735065 8790367 8838140
56951 8838140 8877020 8902690 8911037 8901159 8873589 8828222 8766359 8692110 8608710 8515309 8410262
56940 8410262 8296014 8178043 8060162 7942835 7823709 7696004 7546898 7361010 7127297
56931 7127297 6843219 6514443 6152376 5770373 5379466 4987024 4599414 4224105 3867846
56922 3867846 3534230 3224399 2938710 2676394 2435320 2214064 2013283 1833755 1674293
56913 1674293 1532955 1408852 1301095 1207156 1124053 1050513 986809 933330 890217 857254 833046
56902 833046 815442 803587 798181 798988 803934 811677 822938 837549 851953 861488 863893 859099 847416
56889 847416 829955 809490 788651 768049 747781 729572 715447 705223 697417 691939 689913 691281
56877 691281 694622 699400 706883 718700 735461 756559 780445 805204 829331 851472 869221 879367
56865 879367 880041 871754 855966 834050 808246 781782 756659 732483 708459 685180 663495 643270
56853 643270 624579 608525 595467 583991 573112 563803 556615 549519 540307 529810 520557 513343 507354
56840 507354 502575 499667 498072 496546 495192 494931 495452 495655 495642 496170 496613 495749 494483 495600 500541 508242
56824 508242 517307 527463 538487 549220 558274 564764 568319 569406 569552 570166 571341 572931 576305 583484
56810 583484 594666 608076 622286 637435 654257 673297 695133 720117 747780 777475 809412
56799 809412 843837 879268 912737 941635 964155 978284 982180 976046 962533 944957 925836 906955
56787 906955 889547 874108 860914 850830 844923 843518 846561 854672 868734 888700 913904 944449
56775 944449 981227 1024859 1075657 1133794 1197277 1259342 1309787 1340322 1348496 1336959 1310475 1274090
56763 1274090 1232477 1189463 1147964 1110253 1077555 1049430 1024688 1003351 987016 977083 973552 975876
56751 975876 984107 998655 1019726 1047601 1082882 1125392 1172506 1218606 1256381 1279299 1283897 1270517
56739 1270517 1242234 1203267 1158017 1110404 1063114 1017522 974705 936120 902831 874655 850834
56728 850834 831335 816775 807275 802022 799978 800806 805335 815155 830947 850693 870144 885372 894101
56715 894101 894605 885184 866120 840813 813231 784730 754681 723375 692584 663650 636761 612058
56703 612058 590064 570959 554483 540423 528266 516895 505850 496355 489679 484929 480063 474813
56691 474813 470808 468848 467795 466406 464668 462944 461236 459732 458876 458524 458035 457353 456863 456202 454590 452500
56675 452500 451544 452246 453210 452966 451491 449561 447772 446605 446355 446528 446284 445761 445831 446309 445716 443369 440546
56658 440546 438917 438789 439402 439945 439709 438239 436030 434352 433809 433703 433214 432459 432064 432410 433622 435536 437505
56641 437505 438968 440329 442354 444732 446404 447420 449117 452073 455256 457715 459727 461499 462053 460491
56627 460491 457453 454254 451248 447881 443843 439420 435200 431967 430287 429729 429054 427549 425497 423135 420247
56612 420247 417234 415370 415106 415153 414218 412801 412312 413082 414331 415521 416555 417108 416903 416514 416827 417623 417545
56595 417545 415703 412646 409655 407556 406501 406510 407774 410222 412857 414002 412680 409711 406989 405700 405587
56580 405587 405710 405327 404173 402567 401205 400236 398744 396069 393381 392746 394603 397334 399444 400762 401186
56565 401186 399942 397073 394436 393962 395602 397840 399504 400211 399826 398637 397652 397745 398679 399584 400048 400195 400161
56548 400161 400154 400629 401814 403416 405244 407497 409913 411318 410832 408994 406921 404858 402458 400047 398582
56533 398582 398428 399026 399765 400557 401597 403058 404952 406731 407237 405718 402956 400893 400976 403069 405940 408577
56517 408577 411084 414429 419208 424631 429027 431468 432605 433851 436160 439762 444483 449948 455754 461708
56503 461708 467673 473187 477828 482028 486920 493049 499877 506722 513524 520336 526852 533008 539411 546497
56489 546497 553773 560442 566344 571667 576172 579317 580872 580884 579434 576973 574544 573027 572268 571379 569666
56474 569666 566852 562749 557312 550910 544056 536904 529387 521752 514579 508156 502064 495540 488389 481547
56460 481547 476419 473340 471024 468033 464453 461386 459070 456552 453288 450022 447715 446503 446080 446235 446496
56445 446496 446017 444402 442131 439767 437391 435111 433353 432170 431030 429851 429426 430164 431185 431493 431471 432275
56429 432275 434112 436031 437263 437998 438818 439878 440771 440921 440181 439208 439142 440743 443817 447314 449897 450933
56413 450933 451526 453997 459411 465974 471061 474611 479083 486016 494310 502309 509869 517529 525215 533016
56399 533016 541990 552789 564246 574607 583619 592268 600947 609028 615946 621774 626854 631473 635617
56386 635617 638584 639372 637962 635635 633464 631168 628104 624660 621901 620381 619966 620231 620328 619085 615987
56371 615987 611593 606520 600701 594051 586919 579239 570369 560710 552375 547027 543801 540507 536142 531084
56357 531084 525647 519906 514482 509996 505975 501536 496921 493160 490326 487332 483535 479512 476175 473904
56343 473904 472688 472401 472837 473788 474970 475673 475098 473449 472017 471629 471725 471549 471375 471642 471748 470870 469418
56326 469418 468563 468698 469285 469757 469706 468692 466847 465212 464535 464234 463390 462207 461534 461563 462054 463316 465846
56309 465846 469432 473562 478211 483371 488457 493168 498134 503632 508549 511940 514708 518222 522099 525103
56295 525103 527640 531316 536275 540895 544232 547047 550216 553675 557218 560946 564633 567828 570891 574917
56281 574917 580425 587000 594134 601545 608805 615648 622331 628672 633294 635161 635591 637253 641271 646676
56267 646676 652468 658661 665368 672418 680003 688308 696472 703473 710113 718522 729433 741463 753416
56254 753416 765611 778288 790258 800305 809110 818912 831533 846864 862768 876568 887390 896915
56242 896915 907047 917249 925360 930646 934522 938409 942587 947362 953551 961113 968638 975008 980633 986563
56228 986563 993305 1000989 1009753 1019510 1030189 1042530 1057779 1076157 1096441 1117495 1139631 1164189
56216 1164189 1192299 1224147 1258872 1295219 1332860 1372917 1416639 1463970 1514264 1567949 1626472
56205 1626472 1690920 1761721 1839287 1923817 2014839 2112170 2216938 2330335 2451778 2579840
56195 2579840 2714825 2858814 3013087 3176797 3348056 3524899 3705170 3886783 4067976
56186 4067976 4246123 4416747 4575401 4720265 4851124 4965920 5060162 5129993 5174275 5193821
56176 5193821 5190433 5166874 5125954 5069268 4998218 4916056 4827009 4733275 4634753 4531814 4426311
56165 4426311 4319640 4211897 4103358 3994814 3885918 3775095 3661579 3545943 3428587
56156 3428587 3309812 3191504 3076265 2964241 2853296 2743064 2636292 2535031 2438002 2343316
56146 2343316 2251755 2165628 2085958 2012380 1944487 1881902 1824149 1771509 1724839 1683707 1645998
56135 1645998 1610186 1576537 1545337 1515641 1486827 1459807 1435484 1413315 1392553 1373793 1358238
56124 1358238 1346333 1337721 1331470 1325998 1320211 1315128 1312916 1314008 1316966 1321356 1328502 1338746 1350380
56111 1350380 1362331 1375758 1391811 1409926 1429604 1451757 1476842 1503451 1530191 1557263 1584973
56100 1584973 1612519 1639536 1666981 1695086 1722306 1747724 1772604 1798031 1822940 1846252 1869185
56089 1869185 1893555 1919248 1945282 1972073 2000974 2032585 2066901 2103829 2142301 2180340 2217602
56078 2217602 2256796 2301617 2354749 2418848 2497360 2592576 2704158 2830764 2971358 3123481
56068 3123481 3281977 3441069 3596568 3745163 3883841 4011737 4130816 4242846 4346864
56059 4346864 4440291 4520263 4582415 4620970 4632583 4619018 4584900 4534706 4472896 4403722 4328084
56048 4328084 4242332 4142390 4027650 3899646 3759779 3610831 3458397 3308019 3162472 3023827
56038 3023827 2895700 2780676 2677546 2584074 2500955 2430421 2372459 2324937 2285904 2253377 2224621
56027 2224621 2198275 2175619 2157394 2141199 2124520 2108223 2094194 2081567 2068475 2055844 2046111
56016 2046111 2039501 2034671 2031805 2032092 2035241 2040292 2047677 2057819 2069127 2080174 2092531 2108750 2128851
56003 2128851 2151232 2175354 2200881 2226056 2249936 2274545 2301963 2331063 2359980 2389651 2421656
55992 2421656 2454657 2486579 2518489 2552805 2589493 2627594 2668586 2714296 2763114 2812123 2861433
55981 2861433 2912809 2965821 3019315 3074964 3135305 3199687 3266117 3335516 3410154 3489468 3571517
55970 3571517 3656970 3747540 3842090 3938508 4038006 4143577 4255836 4374296 4500815 4637610
55960 4637610 4783988 4939137 5105683 5286070 5478205 5679549 5892572 6120842 6362656
55951 6362656 6614311 6876683 7152382 7439412 7734671 8041325 8365520 8707809 9065022
55942 9065022 9438650 9833942 10252193 10691340 11152675 11639731 12152293 12689105 13254814
55933 13254814 13856441 14494732 15166689 15874444 16623152 17412568 18240121 19110463 20032441
55924 20032441 21008376 22036368 23121654 24275560 25504971 26813523 28211422 29712551
55916 29712551 31323056 33044096 34884290 36858078 38974986 41244631 43690753 46346176
55908 46346176 49235618 52377905 55802697 59549358 63652967 68150427 73099442 78575409
55900 78575409 84657276 91442488 99075491 107739422 117624337 128928663 141882234 156734386
55892 156734386 173731393 193151405 215353238 240735443 269640967 302288597 338550822
55885 338550822 377294377 415563931 448573582 471136155 479817068 474247818 456751272
55878 456751272 430888433 400127903 367232145 334178908 302273213 272308406 244726279
55871 244726279 219716772 197264854 177213367 159349780 143459066 129332445 116778899
55864 116778899 105646311 95813441 87156713 79540549 72837876 66938441 61734477 57117816
55856 57117816 52996757 49302276 45975626 42963804 40228778 37746696 35493687 33441760
55848 33441760 31567869 29854014 28276696 26807951 25428923 24132427 22911439 21755896
55840 21755896 20661928 19632855 18667974 17759082 16899305 16085856 15312472 14569014 13851619
55831 13851619 13165137 12513293 11894084 11306349 10752077 10229589 9732481 9258550 8812781
55822 8812781 8398742 8013703 7654744 7322688 7016970 6733024 6468083 6223741 5999634
55813 5999634 5790077 5590208 5400535 5222435 5053942 4892935 4739857 4593984 4450924
55804 4450924 4306894 4162322 4019098 3877748 3739356 3606569 3480357 3359007 3242316
55795 3242316 3133407 3034291 2942675 2855083 2770032 2686234 2600765 2511447 2418985 2325347 2232342
55784 2232342 2142783 2060194 1985781 1917998 1856089 1801575 1755365 1716111 1682310 1653298 1627457
55773 1627457 1602539 1578864 1559142 1543962 1530463 1516637 1503663 1492314 1480246 1465012 1447248
55762 1447248 1428678 1408972 1386553 1360835 1331987 1299964 1265266 1229485 1194218 1160663 1130539
55751 1130539 1105478 1084857 1066120 1047816 1030553 1014787 1000077 987060 977600 971937 967782 963173
55739 963173 958392 954535 952218 952117 954457 957327 957817 955425 952156 948907 944357 937889 930676 923029 913611
55724 913611 902383 891413 881439 870512 857642 845145 835568 828699 823312 819331 816198 811343 802584
55711 802584 790445 776312 760174 742131 724299 708829 695234 681643 667678 654307 641812
55700 641812 629586 617190 604338 590724 576872 564045 552279 539625 524297 506281 485955
55689 485955 462758 436355 407676 377737 347100 317528 292247 272979 258405 247044 239709 237187
55677 237187 237349 237129 236296 236856 239454 242712 245874 249898 255668 262453 268308 271245 270450 267274 264485
55662 264485 263665 263954 264015 264102 264994 266016 265731 264032 262122 260786 259945 259553 259756 260313 260801 261235 261934 263207
55644 263207 265624 269806 275310 280554 284615 288104 291487 293647 293316 291087 288767 287367 286870 287358 289118
55629 289118 291965 295467 299567 304319 309567 315505 322854 331647 340555 348238 354692 360561 366013 371030
55615 371030 375733 379428 380431 378187 374662 372203 370711 368312 364157 359053 353926 349359 346403 346073
55601 346073 347749 349412 349828 349575 349781 350822 352511 354724 357443 360584 363972 367217 369794 371516 372653
55586 372653 373362 373465 373099 372786 372242 369946 364882 358196 352034 347017 341849 335228 327169 318449 309664
55571 309664 301078 292806 284904 277462 270597 264154 257662 250859 244014 237537 231613 226372 221906 217826
55557 217826 213365 208282 203208 198808 195121 191947 189157 186269 182491 177741 173064 169628 167814 167544
55543 167544 168638 170442 171965 172878 173649 174314 174139 172946 171731 171275 171195 171057 171208 171694 171613 170615 169889 170339
55525 170339 170926 170304 169141 169102 170369 172144 175140 181271 190503 199863 206448 210339 213947 219316 226661
55510 226661 235042 243937 254130 266906 282283 298591 314236 329196 343952 357618 368336 375285
55498 375285 379084 380120 377557 370392 358779 343986 327474 310295 293103 276573 261587 248634
55486 248634 237056 225694 214595 205252 198511 193112 187198 180698 175152 171584 169596 168355 167505 167102
55472 167102 167410 168820 171439 174773 178037 180508 181508 180871 179823 180415 183349 187167 190351 193127 196139
55457 196139 198563 199255 199026 199775 201541 202249 200600 197551 194404 190832 185577 178253 169771 161400 153812
55442 153812 146752 139570 132292 125839 120750 116221 111207 106019 101792 98695 95817 92702 89785 87293
55428 87293 84915 82668 80996 79683 77793 75178 73171 73093 74573 75863 75551 73709 71661 70751 71124 71721
55412 71721 71516 70413 68607 65745 61457 56389 51859 48672 46872 46355 46916 47935 48775 49279 49336 48572
55396 48572 47339 47245 49321 52066 52827 51034 48642 47468 47675 48994 51558 54767 56861 56764 55414 54387
55380 54387 53990 53560 52846 52107 51307 50214 49198 49186 50600 52611 53652 52748 50483 48477 47789 48184 49285
55363 49285 51619 55601 59906 62187 61539 59279 57286 56573 57490 59916 62727 64196 63715 62548 62423 64011
55347 64011 67089 71226 75638 79150 81186 82395 83644 84667 84317 81997 78405 74951 72662 71536 70831
55332 70831 70053 69558 69960 71298 73153 75247 77159 77819 76387 73649 71497 70857 71125 71795 73375 76133
55316 76133 79096 81119 82108 82390 81620 79285 75765 71964 68228 64467 61063 58692 57267 55918 54209
55301 54209 52785 52469 53197 54233 55258 56771 59214 62005 63880 64167 63212 61426 58588 54676 50767
55286 50767 48134 46634 45008 42859 41363 41604 42944 43588 42402 39891 37653 37080 38314 40314 42076
55271 42076 43624 45496 47623 49419 50785 52115 53291 53570 52721 51530 50836 50681 50668 50602 50482 50310 50162
55254 50162 50146 50275 50656 51538 52606 52651 50880 48336 46897 46956 47275 47160 47321 48202 48897 48494 47360 46379
55236 46379 45957 46564 49048 53302 57460 59649 60016 60047 60429 60606 59946 58296 55719 52720 50459 49704 49738
55219 49738 49367 48860 49711 52337 55112 56238 55750 55061 55104 55645 56135 56434 56482 55811 53938 51203 48780 47617
55201 47617 47615 47997 48226 48249 48156 48115 48458 49284 49983 49687 48227 46257 44496 43254 42553 42125 41450 40356 39455
55182 39455 39369 39791 40151 40858 42711 45174 46633 46648 46578 47535 49053 50452 52140 54485 56502 56983 56248
55165 56248 55575 55368 55040 54337 53639 53113 52639 52562 53539 55453 57249 58194 58767 59921 61748 63244 63381 62267
55147 62267 60981 60295 59905 59228 58472 58282 58757 59577 60793 62398 63355 62457 60328 59117 59663 60348 59489
55130 59489 57646 56548 56814 57829 59054 60248 60976 60949 60531 60244 60140 60156 60382 60445 59526 57679 56175 55720
55112 55720 55387 54268 53037 52617 52439 51568 50642 50863 51735 51687 50687 50346 51420 52984 54234 55449 56759
55095 56759 57503 57387 57108 57274 57621 57695 57403 56603 55117 53399 52282 51735 50843 49350 48278 48566 49909
55078 49909 51405 52596 53470 54110 54761 55634 56391 56435 55972 56011 57004 58258 59146 60112 61817 63939 65646 66915
55060 66915 68510 70608 72217 72411 71834 72330 74872 78348 80941 82341 83611 84981 85114 83205 80557
55045 80557 78980 78550 78197 77816 78313 79891 81686 83005 83801 84095 84076 84445 85400 85617 83819 81116 80033
55028 80033 81190 82778 83504 83989 84753 84995 84528 84960 87405 90402 91748 91269 90377 89880 89910 91149 94285
55011 94285 98457 101771 103343 103815 104098 104660 105630 106348 105243 101595 97320 95401 96338 97608 97046 95375
54995 95375 94576 95022 95430 95057 94641 95155 96488 97582 97444 95855 93477 91518 91067 92326 94367 95832
54979 95832 96139 95943 96231 97061 97556 97199 96664 97037 98476 100049 100777 100611 100445 101369 103792 107067 110002
54962 110002 111830 112494 112074 110468 108030 105977 105457 106248 106968 106621 105442 104214 103354 103070 103894 106367
54946 106367 110176 114067 116852 118360 119253 120203 121433 122843 124092 124564 123698 121645 119285 117333 115704
54931 115704 114061 112696 112352 113268 114846 116271 117090 117267 117143 117371 118405 119868 120814 120767 120137 119531 119108
54914 119108 118822 118863 119474 120557 121841 123259 124909 126778 128827 131252 134304 137717 140593 142154 142704
54899 142704 143568 145817 149153 152423 155123 157819 160922 163881 166290 169182 174173 181435 189527 197416
54885 197416 205781 215902 227980 241158 254772 268922 283870 299375 314646 328720 340713 349737
54873 349737 354811 355265 351400 344386 335202 323947 310532 295604 280235 265127 250824 238351 228596
54860 228596 221049 214087 206674 199067 191886 185394 179907 175986 173807 173101 173874 176401 180277 184392 188155
54845 188155 191778 195171 197832 200396 204899 212479 221986 232011 243211 257090 273257 289589 304688
54832 304688 318400 329951 337408 339586 337175 331312 322120 309384 293889 277306 261160 246344
54820 246344 233100 220901 208887 197041 186664 179073 174016 169849 165215 160091 155247 151222 148045
54807 148045 145578 143632 141707 139014 135270 131451 129294 129666 131671 133652 134796 135283 135220 134462 133710 134712
54791 134712 138377 143088 145959 145907 144581 143852 143278 140935 136260 130825 126155 121993 117459 113044 110229
54776 110229 109316 108762 107036 104348 102107 101221 101487 102269 103072 103464 103084 102084 101297 101544 102718 103913 104652
54759 104652 105599 107550 109985 111484 111643 111609 112280 112997 112894 112673 113676 115696 117311 118382 120711 125721
54743 125721 132662 139655 145511 150012 153513 157099 162257 169384 177056 183602 188985 194530 201299 209447
54729 209447 218844 229546 241740 255631 271184 287729 304271 320438 336424 351566 363835 371487
54717 371487 374569 374002 369937 362123 351446 339885 328952 318991 309810 301068 292192 282920 273934 266173
54703 266173 259576 253471 248211 245264 245342 247337 249679 252094 255571 260982 268136 275858 282847 288925 295638
54688 295638 305124 318058 333069 348412 363750 379959 397508 415551 432536 447316 459545 469091
54676 469091 475272 476909 473282 464881 452960 438441 421542 402463 382087 361779 342564 324579
54664 324579 307362 290682 274940 260638 247695 235694 224708 215313 207709 201442 196146 191901
54652 191901 188587 185624 182757 180323 178246 175612 172036 168725 167119 166982 166940 166486 166264 166561 166809 166725
54636 166725 166805 167411 168262 169108 170081 171053 171486 171301 171209 171735 172484 172791 172618 172401 172311 172018 171031 169194 167065
54617 167065 165756 166095 167933 170555 173548 176829 180087 182916 185485 188545 192675 197897 203769 209345
54603 209345 213472 215906 217907 220894 224793 228639 232387 236729 241276 244576 246373 248322 251737 255910
54589 255910 259566 262864 266856 271728 276675 281175 285624 291060 298785 309625 322905 336720 349845
54576 349845 362908 377074 392334 407825 422978 437201 448965 456633 460126 460658 458667 453069 442887
54563 442887 428858 412923 396498 379754 362492 345423 330131 317429 306024 293719 280270
54552 280270 268167 259940 255410 252458 249722 247336 245342 242923 239565 235887 232742 230172 227685 225025
54538 225025 222218 219238 216004 212514 208812 205087 201805 199334 197319 194869 191532 187652 183596 179149
54524 179149 174039 168629 163624 159390 155998 153663 152480 151765 150352 147856 145113 143012 141383 139570
54510 139570 137750 136729 136415 135640 134051 133209 134722 137839 140214 140928 141367 142734 144084 143838 142385 141887
54494 141887 143674 146837 149557 151167 152530 154652 157234 158834 158606 157570 157555 158987 160575 161372 162011
54479 162011 163255 164397 164406 164100 165737 170436 177066 183793 189729 194896 199615 204407 209830 215881 222026
54464 222026 228067 234427 241233 247641 252446 254999 255326 253833 251265 248420 245391 241268 235076 226905
54450 226905 218000 210002 204109 200395 197474 193335 187244 180744 176223 174467 174042 172969 170451 166939
54436 166939 163203 159813 157187 155595 155036 155376 156563 158437 160415 161731 162228 162616 163609 164869 165158 163610
54420 163610 160632 157478 155227 154305 154763 156645 159938 164186 168290 171011 172073 172672 174356 177281 180008
54405 180008 181293 181519 181988 183311 185112 186805 187750 186875 183394 178284 174160 172923 173909 174886 174572 173592
54389 173592 173137 173330 173099 171329 168025 164374 161725 160459 159954 159596 159475 159856 160379 160368 159833 159547 159928
54372 159928 160364 160134 159638 159996 161333 162133 160757 157276 153383 150731 149944 150997 153590 156773 159022 159501
54356 159501 158998 159018 160091 161502 162420 162599 162186 161689 162181 164615 168581 172519 175515 178174 181262 184327
54340 184327 186549 188396 191395 196323 202437 208453 213574 217565 220617 223354 226421 229851 233238 236410
54326 236410 239320 241371 241807 240880 239670 238333 235626 230847 225287 220742 217329 213951 210424 207773 206585
54311 206585 206365 206541 206748 205965 202843 197639 192600 189478 187540 185086 182167 180470 180836 182116 182651 181911
54295 181911 180400 178728 177258 176285 176160 177250 179701 183127 186668 189744 192600 195873 199807 204232 209066
54280 209066 214271 219342 223325 225501 225893 225221 224513 224487 224977 225194 224807 224288 223767 222165 218352 212842 207405
54263 207405 203138 199697 196242 192210 187303 181777 176840 173713 172067 170302 167453 163821 159586 154208
54249 154208 147786 141875 138077 136551 136381 136509 135735 133033 128890 125546 124883 126582 129003 130950 131713
54234 131713 130492 127259 123510 120732 118566 115910 113243 112082 112308 111893 109691 106854 104953 104138 103842
54219 103842 103991 104545 104900 104805 105157 106761 108793 109529 108474 106878 106228 106978 108834 111457 114403 116771
54203 116771 117618 116933 115895 115732 116404 116881 116835 117267 118965 120991 121681 120838 119893 120007 121146 123228 126740
54186 126740 131410 135304 136501 135343 134064 134255 135555 136811 137575 137983 137805 136466 134059 131723 130536
54171 130536 130212 129492 127897 126491 126463 127480 128172 127898 127114 126036 124088 121196 118796 118671 121019 124189
54155 124189 126157 125916 123787 121009 118968 118329 118654 118898 118252 116583 114400 112662 112268 113308 114846 115716
54139 115716 115653 115491 116314 118415 121014 122879 123374 123043 123176 124764 127737 130935 132680 131878 129058 126159
54123 126159 124617 123708 121405 116958 111915 108447 107363 108097 109740 111384 112001 110998 108862 106712 105275
54108 105275 104638 104708 105309 105916 105957 105501 105220 105477 105797 105420 104282 103300 103659 105690 108401 110288 110677 110106
54090 110106 109445 109084 109075 109394 109600 108814 106738 104384 103114 103214 104083 105442 107312 108904 108877 107217 105776
54073 105776 106105 107455 107904 107028 106332 107062 108503 108884 107405 104966 103148 102741 103147 103069 101833 100035 98713
54056 98713 98132 97800 97547 97902 99189 100908 102455 103911 105622 107456 109134 110893 112967 114677 115051 114365
54040 114365 113972 114293 114075 112222 109496 107566 107064 107485 108502 110315 112835 115403 117381 118425 118353 117474
54024 117474 116914 117783 119927 122067 123133 122887 121479 119338 117424 116590 116518 116146 115401 115435 116892 118944 120592
54007 120592 121994 123725 125523 126575 126576 125803 124614 123546 123427 124704 126995 129769 132935 136144 138274
53992 138274 138600 138058 138360 140139 142906 146441 150875 155422 158448 159417 159846 161705 165466 170259 175258
53977 175258 180248 185144 189764 194213 199106 205111 212216 219589 226401 232884 240159 248718 257386 264427
53963 264427 269476 273770 278574 284073 289839 295527 300793 305221 308871 312413 316209 319629 321846 323012
53949 323012 324042 325244 325690 324130 320309 315275 310497 306767 303849 301107 298278 295451 292495 288973
53935 288973 284786 280470 276466 272417 267707 262578 258091 254774 251805 247994 243409 239514 237661 237787
53921 237787 238666 239018 238107 235765 232559 229851 228983 229988 231497 232184 232008 231814 232098 232633 233007 233042 232780
53904 232780 232582 233206 235251 238336 241164 242685 243002 242981 243119 243056 242264 241049 240522 241371 242884 243729 243742 244282
53886 244282 246462 249637 252294 253994 255622 257918 260808 264282 268933 274952 281208 286165 289626 293029
53872 293029 297962 304754 312569 320470 327977 334695 339849 342723 343550 343508 343550 343461 342419 340313 338195 337569
53856 337569 339458 343860 349701 355444 360236 364483 369114 374604 381015 388436 396535 404110 410205 415630
53842 415630 422126 429752 436378 440418 442925 445963 449739 452550 453071 451449 448401 444415 440093 436147
53828 436147 432607 428746 424090 418953 413710 408123 401739 394362 385838 376065 365784 356688 349763 343756
53814 343756 336316 326820 317235 309781 304487 299711 294495 289423 285167 281243 276767 271862 267591 264599
53800 264599 262387 259966 256752 252707 248022 243005 238091 233631 229640 225890 222310 219246 217258 216633
53786 216633 217010 217542 217438 216225 213511 208929 202736 196308 191439 188969 188316 188329 188188 187510 186246 184866
53770 184866 184235 184842 186316 187960 189441 190690 191517 191880 192296 193433 195323 197344 198794 199155 198204 196609
53754 196609 196202 198650 203641 209140 213580 216967 219608 221067 221288 221715 223887 227324 230200 232007 234103
53739 234103 237405 241024 243879 246469 250008 254629 259652 265069 271570 279323 287780 296620 305723 314200
53725 314200 320627 324698 327671 330692 333540 335661 337592 340388 344056 347511 349952 351519 352598 353192
53711 353192 353134 352396 350946 348697 345826 342968 340871 339812 339355 338761 337755 336825 336505 336387 335262 332371
53695 332371 328062 323128 318117 313518 309822 306702 302771 297069 290430 284552 279985 275882 271539 267172
53681 267172 263180 259651 256803 254991 253982 252905 251189 248950 246367 243462 240665 238717 237702 237089
53667 237089 237075 238754 242179 245255 245672 243455 240618 238786 238191 238579 239897 241995 244651 248058 252400
53652 252400 256847 259960 261581 263571 267917 274524 281450 287089 291477 295555 299860 304272 308580 312716
53638 312716 316486 319713 322936 327440 333923 341250 347190 350563 352205 353747 356040 359002 362313 365674
53624 365674 368835 371898 375295 378997 382123 383860 384503 385079 386199 387816 389699 391431 392253 391774 390790
53609 390790 390579 391419 392604 393854 395696 398311 401058 403566 406255 409130 410943 410510 408349 406067 404471
53594 404471 403146 401601 399864 397981 395909 394122 393416 393680 393599 392200 390244 389431 390400 392128 393227 393264
53578 393264 392748 392290 392139 392311 392771 393497 394519 395956 397960 400653 404097 408178 412411 416043 418585 420232
53562 420232 421624 423310 425632 428989 433713 439438 445043 449754 454235 460114 468208 477434 485736 492017
53548 492017 497022 502377 509002 516570 524290 531865 539541 547552 555938 564882 574756 585464 595996 605144
53534 605144 612788 620178 628601 637840 646268 652602 657330 662128 667961 674226 679878 684946 690442 696962
53520 696962 703961 710553 716574 722527 728641 734234 738154 739872 740125 740339 741325 742805 744345 746318 749520
53505 749520 754092 759372 764501 768467 769854 767696 762850 757622 753681 751043 749297 748714 749448 750715 751731
53490 751731 752804 754494 756321 757407 757950 758855 760190 761226 761938 763254 765674 768800 772446 777125 782957
53475 782957 789031 794467 799516 805232 812522 821697 832252 842923 852718 862163 872822 885444 899491
53462 899491 914632 931400 949793 968640 987448 1007755 1031260 1057365 1084030 1110616 1138271
53451 1138271 1167667 1198049 1228915 1261199 1295980 1332984 1371165 1410092 1449965 1490749 1532143
53440 1532143 1574285 1617901 1663687 1711877 1762286 1814336 1867031 1919369 1971125 2023162 2076691
53429 2076691 2132054 2188210 2243476 2296816 2348453 2399518 2451389 2505093 2560560 2616162 2669638
53418 2669638 2720206 2769542 2819986 2871888 2923296 2972203 3018269 3062186 3104210 3144086 3181962
53407 3181962 3218449 3253460 3285521 3312778 3334773 3352986 3369464 3385106 3399448 3411841 3422135
53396 3422135 3430017 3434393 3434129 3429192 3420525 3408904 3394440 3377036 3356679 3333191 3306396 3276699
53384 3276699 3244896 3211073 3174283 3133874 3090786 3046941 3003348 2959237 2913223 2865192 2816943
53373 2816943 2770855 2727787 2686362 2644560 2601940 2559933 2520158 2483110 2448693 2417079 2388271
53362 2388271 2361327 2335101 2309803 2287064 2268229 2253291 2241871 2234546 2232396 2235493 2242695 2253115
53350 2253115 2267104 2285321 2307429 2332501 2360444 2392050 2427366 2465018 2503873 2544769 2589681
53339 2589681 2639427 2693103 2749679 2809099 2871597 2937019 3005329 3076931 3151778 3228915 3307872
53328 3307872 3390040 3477598 3571125 3669131 3769892 3872840 3977989 4084981 4193224 4302467
53318 4302467 4412672 4523697 4635511 4748317 4861853 4974646 5084527 5190119 5291662
53309 5291662 5390351 5486996 5581204 5671390 5755289 5830766 5896777 5953949 6003977 6048036 6085743
53298 6085743 6115936 6138281 6153523 6161982 6162583 6153930 6136003 6110118 6077412 6037953 5991085 5935792
53286 5935792 5870650 5794361 5707013 5610596 5508083 5402192 5294805 5186690 5077359 4965766
53276 4965766 4851846 4737181 4623841 4512896 4404267 4297551 4192377 4088340 3985332
53267 3985332 3883942 3785086 3689349 3597110 3508981 3425331 3345356 3267429 3190806 3116674 3047324
53256 3047324 2984548 2928763 2878986 2833293 2789886 2748407 2710111 2676430 2647482 2622290 2600082
53245 2600082 2580748 2564032 2549126 2535532 2524002 2515991 2512113 2511515 2513011 2516437 2522543 2531610 2542741
53232 2542741 2554785 2567645 2582300 2599701 2620008 2642919 2668274 2696131 2726579 2759789 2796107
53221 2796107 2835765 2878476 2923436 2969711 3016599 3063826 3111601 3160299 3209706 3258597 3305438
53210 3305438 3349519 3390983 3429593 3464101 3493466 3518372 3540682 3561279 3579239 3593467 3604384
53199 3604384 3613242 3620256 3624408 3624933 3621955 3615431 3604534 3588748 3568794 3545555 3518453 3485871 3447141
53186 3447141 3403341 3356058 3306079 3253487 3198332 3140731 3080835 3019147 2956609 2894018 2831627
53175 2831627 2769677 2708957 2650304 2593667 2538189 2483225 2428886 2375583 2323578 2273054 2224111
53164 2224111 2176352 2128864 2081076 2033478 1987148 1942690 1900057 1859251 1820574 1784044 1749110
53153 1749110 1715228 1682369 1650592 1619529 1588813 1558767 1530046 1502630 1475706 1448611 1421409
53142 1421409 1394524 1368342 1343210 1319225 1295848 1272407 1249210 1227334 1206810 1185873 1162863
53131 1162863 1138219 1113676 1089995 1066752 1044032 1022747 1002824 982410 959714 934994 910012
53120 910012 886094 863388 841610 820806 801413 783863 767927 752400 735994 718840 702430
53109 702430 687594 673313 658293 643005 629025 616679 604590 591648 578277 565463 553573
53098 553573 542723 533447 526116 520058 513970 507080 499465 491452 483188 474734 466260 458197 451369 446568
53084 446568 443576 440919 437141 432157 426740 420959 414117 406421 399647 395334 392980 390898 388488 386649
53070 386649 385931 385312 383252 379294 374275 369533 366344 365477 366525 367928 368305 367651 366734 365701 364059 361839
53054 361839 359741 357973 355911 353390 351497 351372 352746 354373 355577 356579 357418 357368 355754 352970 350397
53039 350397 349348 350022 351386 352238 352560 353604 356418 360586 364736 367975 370278 371655 371733 370387 368202
53024 368202 366001 364245 363094 362569 362253 361191 358673 355069 351483 348576 346085 343508 340754 337926 334911
53009 334911 331575 328150 324864 321261 316465 310397 304312 299691 296806 294686 292302 289364 286085 282756
52995 282756 279738 277460 276089 275387 274953 274404 273247 270977 267631 264057 261331 259890 259261 258493 256826
52980 256826 254266 251686 250156 249829 249667 248438 245963 243200 241192 240155 239517 238591 237062 234937 232368
52965 232368 229818 228201 228217 229221 229354 227475 224637 222851 222597 222485 221330 219429 217520 215679 213947
52950 213947 213103 213813 215515 216973 217533 217143 215752 213643 211965 211817 212935 214228 215470 217348 219788
52935 219788 221435 221317 220181 219496 219691 220082 220257 220839 222701 225718 228612 230109 230152 229704 229466 229305 229035
52918 229035 229053 229633 230287 230579 231135 232774 234877 235755 234872 233757 234307 236834 240224 243449 246397 249426
52902 249426 252561 255222 256739 257126 257054 256983 256834 256859 258094 261061 264583 267024 268555 270887 274652 278380
52886 278380 280661 282318 285646 291941 300347 308833 315903 321544 326649 331471 335046 336563 336690 336606 336161
52871 336161 334326 331321 328749 327395 326406 325068 323805 322659 320390 316271 311542 307857 305202 302558
52857 302558 299697 297039 294561 292233 290911 291292 292386 292368 290712 288250 285537 282676 280552 280593 282887
52842 282887 285780 287779 288949 290123 291549 292561 291906 288503 282798 277423 275379 277223 280806 283883
52828 283883 285974 287548 288742 289588 290461 291420 291771 291114 290284 290455 291662 292981 293843 294358 294382 293080 289850
52811 289850 285462 281944 281140 283211 286565 289322 290780 291405 291778 292138 292776 294105 296072 298029 299438
52796 299438 300369 301107 301731 302270 302809 303103 302504 300721 298452 296908 296875 298389 301026 304059 306550 307859
52780 307859 308333 309307 312106 316758 321717 325121 326578 327474 329243 331614 333044 332687 331319 330373 330706 332408
52764 332408 335075 337952 340432 342777 345886 349932 353756 356038 356601 356061 354656 352184 348837 345263 341714
52749 341714 337781 333201 328424 324089 320204 316128 311327 306074 301488 298709 297734 297064 294854 290629 285666
52734 285666 281586 278737 276107 272619 268297 264225 261564 260550 260244 259199 256530 252487 248025 243867
52720 243867 239991 235968 231682 227714 224983 223841 223451 222247 219320 215247 211362 208411 206349 205184
52706 205184 205102 205610 205512 204363 203157 202792 202571 201277 199183 197558 196345 193868 189202 183519 178536 174816
52690 174816 172175 170541 169425 167639 164679 161656 159781 158617 157021 155148 154076 153744 152783 150510 147903
52675 147903 146364 146474 148048 150365 152142 152282 151013 149582 148633 147699 146397 145112 144220 143502 142712 141911
52659 141911 140882 139126 136953 135658 135891 136552 136116 134579 133344 133525 134995 136822 138011 138011 137086 136113
52643 136113 135608 135109 133889 132053 130473 129776 129818 130144 130548 131078 131734 132295 132490 132402 132779 134611 138207 142742
52625 142742 146942 150218 152961 155722 158335 160145 161128 162367 165012 169070 173776 178826 184245 189058
52611 189058 191586 191726 191571 192627 193628 192640 190269 188728 188288 187009 184119 181342 180201 180075 179864 179699
52595 179699 179697 178633 175507 171370 167946 165204 161791 157408 153311 150682 149640 149681 150025 149690 148154 146016
52579 146016 144417 143954 144521 145619 146219 145079 142126 139055 137647 137949 138999 140641 143323 146475 148481
52564 148481 148452 147019 145309 143961 143123 142644 142169 141601 141231 140945 139910 138006 136898 138322 141487 143576
52548 143576 142972 140811 139275 139476 141199 143515 145236 145689 145389 145283 145313 144651 143347 142473 142504 142871 143520
52531 143520 145515 149374 153950 157853 160967 163785 166198 168013 169880 172494 175296 177067 177572 177684 177975
52516 177975 178114 177879 178097 180111 184245 188839 191136 189795 186642 185268 187646 192745 198527 204112 209340
52501 209340 213428 215508 216010 216187 216442 216203 215345 214554 214158 213726 213129 212995 213620 214284 214282 214022 214431 215759
52483 215759 217557 219512 221579 223527 225084 226489 228326 230692 233009 234757 235873 236265 235580 233842 231901
52468 231901 230637 230016 229474 229021 229243 230231 231350 232319 233770 236216 239034 241134 242205 242664 242641 241821 240227
52451 240227 238461 237000 235789 234608 233371 231922 230065 228000 226392 225734 225803 225871 225337 224218 223180 222940
52435 222940 223421 223844 223967 224661 226557 228601 229135 228304 228068 229548 231669 233013 233792 235007 236689 238257
52419 238257 240018 242812 246322 249028 250103 250287 250569 250898 250688 249887 248955 248277 248219 249489 252727 257614
52403 257614 262719 266446 268094 268051 267068 265408 262770 259104 255309 252772 252079 252505 252994 253456 254677 256998
52387 256998 259546 261066 261234 260743 260159 259299 258002 257083 257783 260181 262703 263531 262305 260153 258354 257404
52371 257404 257322 258189 259934 261838 262886 262876 262883 264306 267507 271584 275337 278098 279670 279937 278906 276943
52355 276943 274769 273202 272807 273489 274391 274642 274328 274310 274897 275324 274856 273830 272991 272403 271790 271498 272170 273589
52337 273589 274778 275241 275264 275023 274341 273519 273458 274581 276419 278551 281105 283894 285968 286772 287121 288261 290350
52320 290350 292567 294400 296143 298204 300520 302618 304095 305218 307193 311225 316889 321918 324353 324650
52306 324650 325165 327802 332736 339053 345799 352315 358117 362792 365996 367838 369424 372441 377528 383349
52292 383349 387944 390840 393199 396063 399218 401823 403451 404338 405112 406559 409295 413515 419072 425483 431629
52277 431629 436099 438725 441342 445900 451850 456637 459021 460647 463835 469047 475307 481859 488089 492780
52263 492780 495294 497321 501712 509126 517177 523376 527741 531764 536153 540867 546611 554572 564653 575181
52249 575181 584786 593725 603057 613392 624871 637623 651589 666328 681576 697642 714852 733097
52237 733097 752433 773550 796775 820986 844463 866809 889125 912212 935467 957907 979513
52226 979513 1001071 1023161 1045725 1068330 1090537 1112267 1134015 1156415 1179451 1202444 1224891
52215 1224891 1246837 1268221 1288329 1306204 1321215 1333123 1342145 1349338 1356297 1363926 1371799 1379066
52203 1379066 1385532 1391369 1396250 1399562 1401320 1402273 1403127 1404114 1405224 1406333 1407062 1406943 1405891 1404343 1402829
52188 1402829 1401487 1400046 1398365 1397159 1397906 1401457 1406816 1412086 1416850 1422832 1431823 1443760 1457469 1472360
52174 1472360 1488342 1504626 1519873 1533460 1545761 1557258 1568265 1579333 1590860 1602283 1612588
52163 1612588 1621729 1630503 1638842 1645385 1649401 1652169 1655519 1659474 1662200 1662050 1658969 1653979 1647948 1641100
52149 1641100 1633349 1624838 1616060 1607468 1598920 1589682 1579078 1567158 1554634 1542216 1530033 1517782
52137 1517782 1505516 1494136 1484745 1477490 1471442 1465705 1460104 1454530 1448401 1441507 1434893 1429890 1426342
52124 1426342 1422652 1417672 1411820 1406193 1401338 1397260 1394081 1392246 1392162 1393678 1395672 1396442 1395063 1392299 1389585
52109 1389585 1387205 1384241 1380206 1375805 1371861 1368400 1365182 1362246 1359448 1356301 1352900 1350289 1349041 1347951
52095 1347951 1345013 1339480 1332314 1324916 1318152 1312495 1308239 1305266 1302973 1300598 1297485 1293267 1288253 1283547
52081 1283547 1280164 1277792 1274847 1270105 1264116 1258622 1254542 1250842 1245676 1238506 1230671 1223825 1218410 1214051
52067 1214051 1210717 1208556 1206834 1204136 1199842 1194567 1188923 1182812 1176458 1171178 1168164 1167020 1166319 1165336
52053 1165336 1164501 1164363 1164939 1166082 1167948 1171045 1176136 1183852 1193953 1205142 1216212 1227327 1239730
52040 1239730 1254339 1271107 1289544 1309219 1329711 1350722 1372390 1395137 1419088 1443991 1469644
52029 1469644 1495885 1522200 1547918 1573061 1598491 1624901 1651968 1678721 1704394 1728625 1751058
52018 1751058 1771205 1788786 1803990 1817244 1828674 1837917 1844639 1849255 1852843 1856172 1859056 1860813 1860959
52005 1860959 1859140 1854855 1847932 1839167 1829905 1820992 1812587 1804750 1797478 1790289 1782668 1775037 1768364 1762561
51991 1762561 1756366 1749368 1743129 1739332 1737671 1736772 1736550 1737981 1740658 1742411 1742124 1741541 1743194 1747420 1752588
51976 1752588 1757619 1762863 1768686 1774696 1780696 1787316 1794996 1802986 1809860 1814574 1816703 1816372 1814544 1812689
51962 1812689 1811345 1809422 1805650 1800349 1794779 1788999 1781530 1771368 1759357 1747097 1735156 1722746 1708588
51949 1708588 1691733 1672099 1650733 1629075 1607592 1585470 1561903 1537118 1511734 1485778 1459038
51938 1459038 1431917 1405067 1378372 1350953 1322051 1291404 1259075 1225731 1192955 1162299 1133817
51927 1133817 1106193 1078525 1051375 1025772 1001743 978128 953443 926769 898463 870340 844574
51916 844574 821805 800637 779376 757894 737235 717840 699052 680296 661927 644651 628811
51905 628811 614562 602090 590965 579794 567354 554077 541621 530829 520918 511081 502068 495308
51893 495308 490885 487352 483380 478655 473124 466545 459327 452885 448274 444920 441418 437192 432622 428015
51879 428015 423390 419175 415984 413473 410322 405798 400735 396467 393208 389957 385702 380353 374639 369516
51865 369516 365585 362816 360703 358734 356739 354926 353722 353448 353828 353901 352771 350510 348061 346328 345622
51850 345622 345787 346349 346595 346133 345479 345448 345851 345413 343215 339535 335026 329969 324970 321500 320638 321610 322566
51833 322566 322607 322118 321264 319452 316685 314316 313619 314161 314472 314052 313825 314436 314856 313347 309616 305411 302763
51816 302763 302108 302534 303415 304839 306506 307348 306956 306449 306913 307588 306892 305005 303940 304771 306245 306793 306649
51799 306649 306936 307674 308099 308451 309999 313259 317331 321196 324703 327992 330814 332794 333807 333743 332487 330409
51783 330409 328336 326762 325570 324681 324312 324355 324307 324311 325393 327927 330551 331635 331412 331592 333107 335361 337663
51766 337663 340221 343326 346542 349268 351488 353427 355007 356141 357136 358347 359814 361586 363889 366375
51752 366375 367701 366672 363733 360645 358675 357699 356998 356184 355092 353479 351541 350426 351533 355051 359529
51737 359529 363163 365370 366895 368522 370106 371003 370968 370226 369089 368236 369133 373016 379041 384383 387018 387916
51721 387916 389618 393137 397315 400992 404402 408051 411403 413516 414300 414329 413939 413411 413730 416167 420919 426812
51705 426812 432492 437346 441267 444248 446637 449208 452472 456156 459775 463437 467590 472232 477061 482287
51691 482287 488530 495545 501768 505805 508081 510296 513156 515214 514340 510056 504235 499590 497607 497699 498044
51676 498044 497213 495093 492447 489780 486936 483789 480823 478651 477116 475378 473009 470654 469353 469370 469940
51661 469940 470078 469357 467786 465281 461764 457857 454974 454137 454684 454610 452426 448428 444010 440118 436794 433953
51645 433953 431957 431246 431727 432728 433376 433111 432120 431350 431648 432718 433309 432765 431943 432092 433168 434071 434581
51628 434581 436133 440149 446157 452299 457468 462280 467972 475009 482961 491252 499623 508044 516378 523954
51614 523954 529346 531007 528485 522920 516121 509285 502686 496165 489467 482230 474065 464736 454273 443252
51600 443252 433076 425281 419874 414772 407853 399458 391896 386383 381661 376188 370584 366777 365224 364221
51586 364221 362066 358921 356101 354146 352284 349583 346102 342735 340224 338726 338359 339578 342377 345248
51572 345248 345831 343217 339209 336567 336143 336355 335501 333758 332390 331618 330274 327603 324508 322446 321603 320899
51556 320899 319693 318616 318575 319702 321704 324662 328760 333565 338159 341702 343405 342561 339699 337403 338542
51541 338542 343213 348378 351088 351440 351992 354999 360724 367731 374035 378344 380893 383029 385892 389778 394702
51526 394702 400671 407098 412929 418008 423382 429437 434578 436898 436624 435768 435691 436091 436043 434875 432227 428517
51510 428517 425371 424363 425181 426087 426349 426975 428786 431080 432953 434876 437927 442128 446610 451098 456236
51495 456236 462312 468406 473229 476553 479442 482940 486792 489822 491556 492745 493905 494093 492124 488617
51481 488617 485704 484711 485184 486213 487567 489145 490466 491380 492435 493919 495212 495758 495926 496179 496073 494999
51465 494999 493490 492780 493215 493889 493759 492384 489670 485825 481791 479027 478339 479113 479887 479479 477554 474522
51449 474522 471221 468524 466800 465606 464081 461900 459783 458782 459035 459609 459708 459510 459449 459277 458542 457580 457073
51432 457073 456834 456036 454712 453886 453894 453724 452647 451591 452087 454556 458376 462918 467568 471342 473684 475511
51416 475511 478484 483193 488902 495037 501980 510094 518696 526546 532999 538364 543415 548803 554640 560250
51402 560250 564474 566608 567162 567471 568447 569823 570787 571039 570792 569851 567556 564037 560812 559401 559784 560959
51386 560959 562484 564333 565593 564801 561731 557488 552433 545486 536162 525994 516867 509038 501810 495208
51372 495208 489542 484060 477643 470718 465202 462365 461620 461327 459971 456719 451786 446378 441639 437762 434667
51357 434667 433002 433450 435315 437056 438207 439639 441778 443812 445100 446310 448396 451146 453418 454399 453963
51342 453963 452054 448353 442805 436175 429793 424460 419669 414274 407915 401205 394440 387053 378877 370950
51328 370950 364099 357605 350557 343880 339385 337028 334736 331141 327001 323509 320550 317213 313108 308649
51314 308649 304902 303263 304150 305671 304920 301134 296281 291947 287141 280365 272557 266341 262971 261458 260360
51299 260360 259151 257857 256589 255634 255221 254977 254124 252306 249905 247714 246622 247250 249356 251811 253638
51284 253638 254800 255608 255838 255123 253833 252784 252354 252645 254191 257527 262063 266373 269859 273374 277896
51269 277896 283275 288684 293769 298789 303855 308563 312381 315157 317217 319180 321699 325051 328652 330923
51255 330923 330198 326206 320528 315097 310330 305188 298925 291964 284982 278047 271132 264735 259319 254632
51241 254632 250196 246007 242261 238872 235923 234054 233565 233513 232563 230570 228569 227331 226763 226646 227057 227854
51225 227854 228434 228261 227254 225588 223551 221560 219906 218557 217573 217413 218201 219015 218776 217693 216904 216705
51209 216705 216197 214929 213755 213528 213836 213847 213738 214452 216343 218693 220413 220686 219189 216332 213343 211671
51193 211671 212027 213960 216219 217536 217375 216145 214591 212890 210645 207795 205166 203872 204389 206305 208666
51178 208666 210450 211059 210676 210041 209812 210334 211850 214398 217401 219942 221660 222961 224187 225217 226123 227424
51162 227424 229161 230330 229900 228063 225846 223953 222607 222126 222728 223928 224958 225737 226728 227911 228781 229461
51146 229461 230938 233762 237078 239514 240660 241336 242570 244613 246800 248141 248071 246638 244050 240449 236511
51131 236511 233787 233652 235837 238631 240690 242013 243098 244013 244763 245899 248031 251013 254013 256160 256799
51116 256799 255628 253151 250700 249474 249583 250197 250223 248646 244971 240065 236123 234841 235661 236451 235684 233325
51100 233325 229943 226047 222317 219468 217568 216251 215707 216537 218395 219838 220066 219849 220093 220412 220109 219687
51084 219687 220101 220991 220989 219801 218715 218856 220000 221432 222982 224586 225639 225600 224935 224786 225772 227470 228855
51067 228855 229076 228100 226949 226882 227908 228439 227042 224309 222283 222032 222441 221559 218609 214439 210695 208959
51051 208959 210078 213436 216916 218325 217185 214889 213161 212735 213460 214835 216141 216708 216722 217339 219378 222189
51035 222189 224469 225951 227463 229481 231583 233476 235603 238292 241128 243612 245733 247324 247665 246583
51021 246583 245364 245564 247187 248968 250254 251615 253609 255905 257905 259463 260763 262112 264017 266731
51007 266731 269449 270690 270009 268771 268748 270367 272775 275109 277051 278478 279360 280142 281601 283996 286538
50992 286538 288027 288115 287786 288380 290070 291597 291739 290683 289558 288932 288580 288572 289581 291691 293725 294348 293361
50975 293361 291433 289160 287071 285970 286283 287266 287812 288079 289433 292461 295861 297897 298488 299166 301107 303819
50959 303819 305931 306817 307125 307879 309383 311171 312782 314375 316536 319614 323396 327448 331667 336248 340983
50944 340983 344935 347326 348831 351449 356679 364091 372026 379410 386465 393918 402141 411056 420357 429697
50930 429697 439010 448698 459239 470828 483701 498464 515346 533242 550317 565763 580477 596083
50918 596083 613892 634645 658300 683866 710353 738121 768411 801396 835909 871616 910294
50907 910294 953999 1002834 1055408 1110693 1168446 1228562 1291327 1357945 1429565 1505785 1584843
50896 1584843 1664936 1744429 1821411 1894581 1964654 2033305 2100109 2161607 2214256 2257623 2293901
50885 2293901 2324752 2349605 2367183 2377962 2384392 2388487 2389806 2386515 2378407 2367974 2358004 2348967 2339408
50872 2339408 2328249 2315630 2301824 2286349 2268169 2246006 2218642 2185814 2148738 2108909 2066295
50861 2066295 2019503 1967739 1911786 1853027 1792391 1730437 1667746 1605028 1543383 1484385 1429117
50850 1429117 1377193 1327626 1280623 1237487 1198671 1163230 1130563 1101451 1076697 1055755 1037488
50839 1037488 1021367 1007165 994310 982520 972511 965177 960492 957886 957176 958261 960338 962395 964297
50826 964297 966695 970003 974172 979226 985272 992093 999504 1008067 1018657 1031079 1043699 1054794 1064080
50813 1064080 1072787 1082409 1093578 1106184 1120450 1137350 1157402 1179397 1201449 1223616 1248411 1278112
50801 1278112 1312449 1349745 1389428 1432210 1478517 1528365 1582632 1642952 1710088 1783713 1864066
50790 1864066 1952467 2049546 2154174 2265194 2383359 2510383 2646494 2790118 2939895 3095857
50780 3095857 3258284 3426080 3596747 3767506 3935949 4099703 4255841 4400791 4530897
50771 4530897 4643250 4736243 4809557 4863716 4899750 4919144 4923947 4916796 4900669 4878370 4852128
50760 4852128 4823857 4795852 4770749 4750100 4732975 4716589 4698656 4678651 4656365 4629810 4595367
50749 4595367 4549899 4491996 4421290 4337658 4241512 4134015 4016452 3890071 3757074 3621003
50739 3621003 3485154 3351107 3219681 3092803 2973238 2862706 2761591 2670571 2591088 2523748
50729 2523748 2467464 2420883 2383726 2356076 2337221 2326079 2322000 2324389 2332222 2344788 2362204 2383993
50717 2383993 2407624 2429722 2448666 2464936 2479004 2490098 2497274 2500364 2499276 2493329 2482202 2466951
50705 2466951 2449107 2428922 2405343 2377829 2347508 2316244 2284931 2253087 2219926 2185391 2150275
50694 2150275 2115804 2083220 2053244 2025509 1998931 1973257 1950072 1931583 1918411 1909292 1903080 1900158
50682 1900158 1901582 1907730 1918532 1934458 1956350 1984468 2018342 2057511 2102010 2152391 2209714 2275179
50670 2275179 2349161 2430695 2518376 2611424 2709384 2811202 2915370 3020691 3125946 3228908
50660 3228908 3326741 3417608 3501075 3576629 3642494 3696331 3736538 3762520 3774218 3771851 3755991
50649 3755991 3727766 3689335 3644158 3596199 3548553 3503044 3460992 3423537 3390945 3362497 3337637
50638 3337637 3316597 3299167 3283437 3266703 3247476 3225694 3200909 3171139 3133896 3087857 3033299
50627 3033299 2971560 2904723 2835632 2767408 2702533 2642334 2587393 2538255 2495827 2461204 2435127
50616 2435127 2417399 2406847 2402321 2404058 2413802 2433177 2462174 2499715 2545566 2600838 2666376 2741454
50604 2741454 2824553 2914631 3010578 3109753 3208303 3303362 3394201 3480785 3561803 3634877 3698650
50593 3698650 3754128 3803750 3849304 3890759 3926844 3956351 3978834 3994432 4003636 4007291 4006420 4001777
50581 4001777 3993984 3984346 3975100 3968240 3964335 3963067 3964816 3971047 3982921 4000022 4020678 4043215 4066623
50568 4066623 4090200 4112906 4133216 4149668 4161480 4168491 4170560 4167487 4159685 4148319 4134315 4117652
50556 4117652 4098368 4077981 4059179 4044225 4034329 4030323 4032752 4040915 4052794 4066545 4081464 4096964
50544 4096964 4111225 4121762 4127097 4127104 4121613 4109211 4087600 4054810 4009889 3952637 3883145 3801920
50532 3801920 3710415 3610985 3505887 3396555 3284245 3171080 3059581 2951038 2845232 2742348
50522 2742348 2644388 2553732 2470592 2392964 2319403 2251020 2190209 2137840 2092495 2052373 2017182
50511 2017182 1987815 1964766 1947482 1934996 1926508 1921413 1919532 1921562 1928687 1941478 1959653 1983049
50499 1983049 2011969 2046128 2084268 2125639 2171036 2221343 2275929 2333945 2396680 2466742 2544808
50488 2544808 2628907 2717431 2811155 2911370 3017290 3126394 3236281 3345067 3450939 3552803
50478 3552803 3651015 3746263 3837998 3925083 4007815 4088106 4167536 4246282 4324202 4402067 4481230
50467 4481230 4562760 4647451 4736194 4829794 4928570 5032489 5141631 5256129 5375636 5499032
50457 5499032 5624738 5751283 5877439 6001764 6122004 6234923 6336677 6423575 6492909 6543271
50447 6543271 6573889 6583593 6570910 6535456 6478736 6403080 6310392 6202805 6083837 5957529 5826623
50436 5826623 5693276 5561854 5439217 5331064 5239106 5162810 5102729 5060509 5036147 5026842 5028661
50425 5028661 5038250 5052823 5069258 5083276 5089104 5080337 5052120 5002530 4931425 4838558 4723912 4589645
50413 4589645 4440337 4280873 4114822 3944981 3774452 3606393 3443054 3285486 3134127
50404 3134127 2989635 2853406 2727117 2611552 2506068 2409607 2321887 2243131 2173133 2111337
50394 2111337 2057439 2010995 1970694 1935137 1904264 1879032 1859731 1845726 1836752 1833084 1834167 1838573
50382 1838573 1845871 1857150 1872752 1890779 1909173 1928468 1951114 1978421 2009443 2042683 2077705
50371 2077705 2114954 2154956 2197963 2243707 2291253 2339654 2388878 2439591 2491879 2544773 2597370
50360 2597370 2649935 2703318 2757532 2811493 2864414 2917050 2971119 3027509 3085496 3143931 3202805
50349 3202805 3263213 3326097 3391585 3459454 3529441 3600937 3672953 3744629 3815256 3883567 3947717
50338 3947717 4006413 4059501 4106668 4145941 4174301 4189897 4193095 4185209 4166446 4135227 4089425 4028231
50326 4028231 3952819 3865250 3767184 3660373 3548171 3435327 3325570 3220132 3119407 3025222
50316 3025222 2940249 2865648 2800796 2745487 2700990 2668297 2646470 2633562 2628379 2630237 2637249 2645820
50304 2645820 2651952 2652553 2645678 2630219 2605592 2571344 2527107 2473433 2412550 2347530 2280356 2211405
50292 2211405 2141187 2071875 2006204 1945050 1886870 1829651 1772838 1717313 1664319 1614822 1569406
50281 1569406 1528107 1490493 1456280 1425750 1399228 1376328 1356138 1338056 1322087 1308451 1297362
50270 1297362 1289192 1284386 1282961 1284268 1287336 1291442 1296626 1303856 1314370 1328368 1344508 1361192 1378182
50257 1378182 1396400 1416458 1438253 1461830 1487423 1514249 1540431 1564973 1589133 1615042 1643505
50246 1643505 1673900 1705513 1737713 1769081 1797815 1823430 1847185 1870305 1892324 1911528 1926541
50235 1926541 1937122 1943812 1947326 1948124 1946295 1941836 1935010 1926181 1915341 1902204 1886842 1869704 1850800
50222 1850800 1829393 1804892 1777628 1748305 1717166 1684391 1651028 1618584 1587496 1556807 1525796
50211 1525796 1495388 1467387 1442525 1419746 1397241 1373772 1349261 1324770 1302098 1282807 1267168
50200 1267168 1254104 1242261 1230888 1219703 1208571 1197901 1189075 1183594 1181477 1180833 1179464 1176895 1174701
50187 1174701 1174833 1177701 1181786 1184975 1186161 1185650 1184369 1183010 1181912 1181219 1180757 1179926 1178076 1174948 1170612
50172 1170612 1165099 1158456 1151104 1143798 1137126 1131141 1125507 1119837 1114006 1108307 1103227 1098942 1095182 1091677
50158 1091677 1088350 1084793 1080181 1074398 1068898 1065501 1064375 1064133 1064069 1065168 1068405 1072990 1077199 1080359 1083036
50143 1083036 1085479 1086855 1086199 1083455 1079248 1074043 1067899 1060898 1053546 1046590 1040506 1035235 1030487 1026080
50129 1026080 1021817 1017188 1011648 1005124 997899 989975 981090 971536 962453 954942 949088 944038 938755 932567
50115 932567 925389 917708 910144 902972 896271 890406 885688 881535 876818 871465 867010 865015 865491 867321
50101 867321 869559 871583 872611 872009 869834 866320 861079 853635 844659 835828 828395 822384 817216 812614
50087 812614 808863 806463 805354 804310 801640 797070 792437 789796 789257 789396 789240 788818 788268 787789 788422 791374
50071 791374 796201 800787 803710 805723 808439 812343 816651 820543 824090 828455 835336 845528 857743 869548
50057 869548 879682 888816 897874 906720 915006 923245 932129 941407 950221 958129 965130 971212 976553 981821
50043 981821 987569 993589 999324 1004636 1009792 1015250 1021815 1030223 1039802 1048329 1054413 1059579 1066831 1077302
50029 1077302 1089504 1101949 1115170 1130540 1148003 1165891 1182754 1198690 1214879 1232181 1250425
50018 1250425 1269044 1288167 1308726 1331362 1355599 1380417 1405431 1431167 1458430 1487711 1519020
50007 1519020 1551894 1585703 1620271 1656042 1693263 1731320 1769388 1807617 1847165 1889275 1934785
49996 1934785 1984369 2038464 2096862 2159114 2225713 2298343 2378479 2465935 2559193 2657055 2759564
49985 2759564 2867138 2978921 3092176 3203338 3309444 3408414 3498380 3577508 3644601 3699372
49975 3699372 3742050 3773509 3796163 3813882 3829941 3845117 3858154 3867493 3871616 3867951 3852655 3821968
49963 3821968 3773501 3706433 3621395 3520729 3408417 3289069 3166546 3043214 2920335 2799393
49953 2799393 2683050 2574296 2474416 2382457 2297214 2219044 2148959 2086624 2030443 1979268 1932779
49942 1932779 1890315 1850655 1813164 1778123 1745650 1715238 1686504 1659353 1633237 1607335 1581658
49931 1581658 1556849 1532660 1508030 1483094 1459591 1438445 1418460 1398550 1379800 1363708 1349499
49920 1349499 1335094 1320166 1306324 1294478 1283951 1274421 1266951 1262400 1260163 1259306 1259899 1262361 1266309
49907 1266309 1271051 1276794 1284501 1294617 1306589 1319573 1333149 1347234 1361817 1376993 1393059 1410245
49895 1410245 1428414 1447338 1467418 1489639 1514341 1540330 1566085 1591935 1620114 1652364 1688371
49884 1688371 1727172 1769130 1815477 1866538 1921659 1980810 2045243 2116530 2195713 2283373 2379902
49873 2379902 2485892 2602799 2732621 2875888 3030495 3193715 3364708 3543080 3725098
49864 3725098 3903658 4072963 4231540 4379957 4517630 4643572 4758749 4865495 4965205 5058258
49854 5058258 5145569 5228036 5304137 5369489 5419129 5449224 5456714 5438866 5394071 5322526 5225958
49843 5225958 5107372 4970918 4820834 4659965 4489893 4312641 4131378 3949220 3768246
49834 3768246 3590043 3416343 3248562 3087443 2933665 2788198 2651584 2523512 2403678
49825 2403678 2292458 2190154 2096142 2009550 1930397 1859319 1796246 1739881 1688356 1640134 1594619
49814 1594619 1552201 1513405 1477761 1443919 1411029 1379161 1348064 1316738 1285267 1255956 1230989
49803 1230989 1209396 1188083 1165816 1144507 1126277 1110962 1097373 1085435 1075716 1067617 1059506 1050545
49791 1050545 1041526 1034001 1029145 1027161 1027173 1027870 1028707 1030192 1032532 1034617 1035186 1034626 1034558 1035808 1037837 1040344
49775 1040344 1044343 1051012 1060130 1070261 1080167 1089661 1099432 1110509 1123701 1139057 1155808 1173066
49763 1173066 1190752 1209958 1232530 1260077 1292909 1329760 1369069 1410976 1457813 1512197 1574694
49752 1574694 1643852 1718555 1799657 1888879 1986623 2091746 2203403 2321913 2446906 2575172
49742 2575172 2701412 2821002 2931111 3029369 3113267 3182068 3238282 3285870 3327201 3362758 3393297
49731 3393297 3420698 3446375 3469855 3489080 3500803 3500064 3480616 3437416 3369060 3277720 3167313
49720 3167313 3042251 2907161 2766524 2624097 2482876 2345602 2214993 2093376 1981959
49711 1981959 1880343 1786960 1700542 1621223 1549740 1485736 1427774 1375168 1328605 1288319 1252649
49700 1252649 1219448 1188276 1160221 1136058 1115541 1098096 1082970 1068848 1054544 1040212 1026914
49689 1026914 1014898 1003357 992076 982230 975058 970501 967527 964990 961717 956734 950324 944347 940633
49676 940633 939277 939085 939260 939822 940608 940927 940583 940536 941914 944631 947456 949426 950745 952112 953544 954295
49660 954295 953845 952410 950324 947513 943990 940411 937572 935620 934374 934097 935141 936906 938078 938101 937525
49645 937525 936625 934675 931281 927669 925652 925615 926347 926707 926625 926507 926643 927578 930293 935292 941723 947961 952953
49628 952953 956588 958944 960003 960423 961819 965347 970237 974539 977326 979228 980652 980644 978268 974285 970435
49613 970435 967590 965595 964427 964220 964368 963956 963273 963642 965402 967257 968099 968376 968936 969615 969940 970517 972512
49596 972512 975915 979123 980365 979184 976757 975020 975204 976906 978787 980191 981457 982745 983598 984036 984917
49581 984917 986381 986934 985230 982121 979786 979300 980181 981907 984524 987739 990733 993214 995780 998865 1002019
49566 1002019 1004588 1006638 1008826 1011527 1014220 1015790 1015776 1015458 1017112 1021712 1027887 1033744 1039125 1045349 1053245
49551 1053245 1062351 1071660 1080254 1087545 1093866 1100539 1108379 1116612 1124456 1133271 1145519 1161584 1179220
49538 1179220 1196523 1213935 1232745 1253006 1273837 1294819 1316169 1338139 1360921 1384753 1409776
49527 1409776 1436254 1464957 1496524 1530315 1564854 1599619 1635420 1672818 1711401 1751096 1792920
49516 1792920 1837646 1884795 1933627 1984220 2036843 2091354 2147931 2207280 2269149 2331773 2394008
49505 2394008 2457066 2522929 2591942 2663245 2736586 2811999 2888289 2963775 3038533 3114301 3191921
49494 3191921 3270087 3346774 3420795 3491861 3560251 3626527 3690614 3751131 3806696 3857714 3905513
49483 3905513 3949463 3986471 4013948 4032220 4043431 4049169 4049952 4046055 4037772 4025233 4008810 3989494
49471 3989494 3968492 3946759 3925252 3905171 3887375 3871859 3858218 3846470 3837162 3830954 3828267 3828985
49459 3828985 3832311 3837383 3844472 3855273 3871666 3894215 3921880 3952786 3985177 4018165 4051907 4086804
49447 4086804 4122375 4157413 4191432 4225360 4260088 4294506 4325431 4349598 4365710 4374786 4378660 4377869
49435 4377869 4370832 4355279 4330381 4297116 4256611 4208977 4154200 4093353 4027967 3958377 3883501
49424 3883501 3802533 3716457 3627735 3538663 3450112 3361732 3273217 3185224 3098908 3014751 2932282
49413 2932282 2850997 2771120 2693310 2618128 2546227 2478599 2415995 2358020 2303195 2250012 2197865
49402 2197865 2147200 2099082 2054504 2013718 1976138 1940998 1907989 1877073 1847934 1820037 1793331
49391 1793331 1768452 1746040 1725937 1707296 1689443 1672462 1656920 1643182 1631174 1620797 1612240
49380 1612240 1605598 1600253 1594926 1588499 1580869 1573188 1567355 1564862 1565638 1567994 1570128 1571770 1574152 1578491
49366 1578491 1584940 1592905 1601770 1611143 1620965 1631765 1644395 1659152 1675524 1693133 1712406 1733643
49354 1733643 1755593 1775777 1792528 1806395 1819284 1832454 1845636 1858053 1869913 1882568 1897244
49343 1897244 1914020 1932366 1952311 1974475 1998966 2024899 2051240 2077619 2104047 2130428 2156938
49332 2156938 2184458 2213848 2244646 2275063 2303533 2330062 2355865 2381853 2407751 2432747 2456790
49321 2456790 2480856 2505830 2531437 2556673 2581147 2605539 2630750 2657105 2684493 2712762 2741787
49310 2741787 2771660 2803079 2837057 2873709 2911624 2948896 2984741 3019861 3055593 3092988 3132450
49299 3132450 3173798 3216774 3261688 3309261 3359539 3411385 3463493 3515591 3568200 3621646 3676147
49288 3676147 3732577 3792123 3854944 3919936 3986177 4054095 4124900 4199391 4277670 4359547 4444572
49277 4444572 4531978 4621344 4713396 4809597 4910601 5015443 5122600 5231529 5342702 5456315
49267 5456315 5571799 5688795 5807809 5929223 6052191 6175348 6298249 6421118 6543342
49258 6543342 6663314 6779698 6891522 6996822 7092933 7179109 7257486 7329993 7395251 7450021
49248 7450021 7492999 7525531 7549028 7563647 7569511 7567305 7557120 7538339 7511664 7480086 7446952 7413716
49236 7413716 7380060 7345278 7308994 7271628 7235091 7202189 7174481 7151354 7131834 7116344 7105685
49225 7105685 7099383 7096505 7097503 7103633 7114769 7129341 7146498 7166940 7191322 7219205 7249986 7283635
49213 7283635 7319745 7356826 7393334 7428608 7462059 7492123 7517026 7536110 7549432 7556194 7554544 7542983
49201 7542983 7521263 7489792 7448876 7398873 7340447 7274211 7200379 7119156 7031305 6937976 6840092
49190 6840092 6738238 6633178 6526145 6418553 6311689 6206815 6105213 6007551 5913118 5820231
49180 5820231 5727865 5636876 5549325 5466638 5388636 5314141 5241980 5171340 5101825 5033688 4967790
49169 4967790 4904717 4843971 4784444 4725798 4668956 4614995 4563857 4514488 4466148 4419231 4374749
49158 4374749 4333216 4294195 4256914 4221227 4187931 4158025 4131556 4107216 4083246 4058851 4034827
49147 4034827 4012777 3993709 3977358 3962809 3949670 3938559 3930393 3925341 3922617 3921241 3920709 3920789 3921061
49134 3921061 3921155 3921418 3922893 3926414 3932082 3939846 3950244 3964018 3981069 4000228 4020167 4040239 4060462
49121 4060462 4081246 4103462 4128221 4155926 4185606 4215676 4245485 4275712 4307209 4340031 4373902
49110 4373902 4409083 4446122 4484879 4524508 4564562 4605524 4647902 4691134 4733931 4775585 4816505
49099 4816505 4857391 4898307 4938797 4978669 5018276 5058033 5098061 5138492 5179864 5222713 5266725
49088 5266725 5310804 5354367 5398201 5443480 5490076 5536591 5582058 5626737 5670866 5713540 5753692
49077 5753692 5791616 5828459 5864582 5899559 5933695 5968154 6003210 6037658 6070717 6103464 6137246
49066 6137246 6171442 6204200 6235158 6266114 6298731 6332646 6366233 6398423 6429166 6458664 6486766
49055 6486766 6512963 6536706 6558018 6577916 6597742 6617663 6636150 6651371 6662920 6671976 6680221 6689052
49043 6689052 6699340 6710984 6722625 6732576 6740472 6747651 6755675 6764884 6774647 6784547 6794746 6805478 6816768
49030 6816768 6828629 6840961 6853295 6865226 6877310 6890766 6905851 6921057 6934718 6947111 6960154
49019 6960154 6974983 6990603 7005212 7018171 7030241 7042456 7055299 7068634 7081740 7093472 7102928
49008 7102928 7109997 7114921 7117417 7116808 7113186 7107918 7102569 7097460 7091546 7083572 7073018 7059917 7044302
48995 7044302 7026283 7006452 6985510 6963279 6938710 6911480 6883033 6855182 6827886 6799538 6769470
48984 6769470 6738939 6709173 6679768 6649992 6620511 6592265 6564428 6535396 6505842 6478920 6456812
48973 6456812 6438372 6420970 6403523 6386795 6371644 6358212 6346428 6336195 6327140 6318962 6312065 6307316
48961 6307316 6305153 6305320 6307241 6310135 6313060 6315552 6318191 6321977 6327089 6332842 6338839 6345453 6352889 6360360
48947 6360360 6366700 6371505 6375378 6379293 6384045 6390028 6396949 6403661 6408680 6411303 6412060 6411785 6410274 6406253
48933 6406253 6398948 6389391 6379610 6370551 6361215 6349987 6336316 6320854 6304535 6288163 6272552 6258019
48921 6258019 6243380 6226218 6204865 6180008 6153853 6127807 6101505 6074124 6045956 6018083 5990876
48910 5990876 5963575 5935496 5906978 5878651 5850227 5820748 5789940 5758682 5728040 5698418 5669880
48899 5669880 5642779 5617569 5594364 5573202 5554605 5539333 5527534 5518565 5511724 5506736 5503415 5501302
48887 5501302 5500236 5501137 5505615 5514584 5527666 5544311 5565058 5590924 5621480 5654346 5687131 5719471
$$ [...]
##END NTUPLES=NMR SPECTRUM
##END=
