##TITLE=coffee_type TOSA02-ROVE100A_90-10%
COFFEE_meoh_noesyp64 COFFEE_meoh {C:\Bruker\TOPSPIN} Administrator 14
##JCAMPDX= 6.0         $$ Bruker NMR JCAMP-DX V2.0
##DATA TYPE= NMR SPECTRUM
##DATA CLASS= NTUPLES
##ORIGIN= Bruker BioSpin GmbH
##OWNER= Administrator
$$ 1.72 TOPSPIN		Version 2.1
$$ 2012-05-18 15:42:04.995 -0700  Administrator@X
$$ Compression mode = diff/dup
##.OBSERVE FREQUENCY= 400.13188235
##.OBSERVE NUCLEUS= ^1H
##.ACQUISITION MODE= SIMULTANEOUS (DQD)
##.ACQUISITION SCHEME= undefined
##.AVERAGES= 64
##.DIGITISER RES= 22
##SPECTROMETER/DATA SYSTEM= spect
##.PULSE SEQUENCE= noesygpps1d.comp
##.SOLVENT NAME= COFFEE_meoh
##.SHIFT REFERENCE= INTERNAL, COFFEE_meoh, 1, 14.98061
##AUDIT TRAIL= $$ (NUMBER, WHEN, WHO, WHERE, PROCESS, VERSION, WHAT)
$$ ##TITLE= Audit trail, TOPSPIN		Version 2.1
$$ ##JCAMPDX= 5.01
$$ ##ORIGIN= Bruker BioSpin GmbH
$$ ##OWNER= Administrator
$$ $$ C:\Bruker\TOPSPIN/data/Administrator/nmr/12-COFFEE-2002/142/pdata/1/auditp.txt
$$ ##AUDIT TRAIL=  $$ (NUMBER, WHEN, WHO, WHERE, PROCESS, VERSION, WHAT)
(   1,<2012-02-21 01:34:05.766 -0500>,<Administrator>,<TOPSPIN>,<go>,<TOPSPIN 2.1>,
      <created by zg
	started at 2012-02-21 01:22:35.234 -0500,
	POWCHK enabled, PULCHK disabled,
       configuration hash MD5:
       B0 76 FB 9C 50 81 44 7D 18 B3 26 32 4E 60 AD 96
       data hash MD5: 64K
       94 62 5D FE 30 12 FA 2C 63 94 64 C3 64 0E DC E5>)
(   2,<2012-02-21 01:34:08.391 -0500>,<Administrator>,<TOPSPIN>,<proc1d>,<TOPSPIN 2.1>,
      <Start of raw data processing
       efp LB = 0.3 FT_mod = 6 PKNL = 1 PHC0 = 0 PHC1 = 0 SI = 128K 
       data hash MD5: 128K
       90 F0 9D CD 4B 1A 9D 93 F2 D8 56 34 C8 5A 3F 75>)
(   3,<2012-02-21 01:34:09.750 -0500>,<Administrator>,<TOPSPIN>,<proc1d>,<TOPSPIN 2.1>,
      <pk PHC0 = 24.68628 PHC1 = 0 
       data hash MD5: 128K
       4A 72 2A 84 F3 1B 0D 48 65 FD D1 F4 B9 CE 81 E2>)
(   4,<2012-02-21 01:34:10.172 -0500>,<Administrator>,<TOPSPIN>,<proc1d>,<TOPSPIN 2.1>,
      <abs ABSG = 1 
       data hash MD5: 128K
       57 D7 66 BC 0F 30 A7 D0 40 58 C2 5E 8A CF 4D 0E>)
(   5,<2012-02-21 01:34:10.266 -0500>,<Administrator>,<TOPSPIN>,<proc1d>,<TOPSPIN 2.1>,
      <abs ABSG = 2 
       data hash MD5: 128K
       D0 A3 AB B6 50 B8 33 24 3B F9 01 9A F0 92 FF 7C>)
(   6,<2012-02-21 01:34:10.313 -0500>,<Administrator>,<TOPSPIN>,<proc1d>,<TOPSPIN 2.1>,
      <abs ABSG = 3 
       data hash MD5: 128K
       75 9D EA F6 15 F9 A5 B7 9A 0D 14 2C DB EF 8F 9E>)
(   7,<2012-02-21 01:34:10.391 -0500>,<Administrator>,<TOPSPIN>,<proc1d>,<TOPSPIN 2.1>,
      <abs ABSG = 4 
       data hash MD5: 128K
       70 80 BE 85 1A 49 77 6C 08 16 7E BF FF DB A8 B1>)
(   8,<2012-02-21 01:34:10.438 -0500>,<Administrator>,<TOPSPIN>,<proc1d>,<TOPSPIN 2.1>,
      <abs ABSG = 5 
       data hash MD5: 128K
       EF 91 AF B8 DC A8 48 99 47 95 EF 3E E0 D3 99 33>)
(   9,<2012-02-21 01:34:10.578 -0500>,<Administrator>,<TOPSPIN>,<audit>,<TOPSPIN 2.1>,
      <user comment:
       ICON-NMR User ID: Administrator
$$ [...]
150 150 150 150 150 150 150 150
##$TP07= 0
##$TPNAME0= <>
##$TPNAME1= <>
##$TPNAME2= <>
##$TPNAME3= <>
##$TPNAME4= <>
##$TPNAME5= <>
##$TPNAME6= <>
##$TPNAME7= <>
##$TPOAL= (0..7)
0.5 0.5 0.5 0.5 0.5 0.5 0.5 0.5
##$TPOFFS= (0..7)
0 0 0 0 0 0 0 0
##$TUNHIN= 0
##$TUNHOUT= 0
##$TUNXOUT= 0
##$USERA1= <user>
##$USERA2= <user>
##$USERA3= <user>
##$USERA4= <user>
##$USERA5= <user>
##$V9= 5
##$VALIST= <valist>
##$VCLIST= <CCCCCCCCCCCCCCC>
##$VD= 0
##$VDLIST= <DDDDDDDDDDDDDDD>
##$VPLIST= <PPPPPPPPPPPPPPP>
##$VTLIST= <TTTTTTTTTTTTTTT>
##$WBST= 1024
##$WBSW= 4
##$XGAIN= (0..3)
0 0 0 0
##$XL= 0
##$YL= 0
##$YMAX_a= 14422393
##$YMIN_a= -6795582
##$ZGOPTNS= <>
##$ZL1= 120
##$ZL2= 120
##$ZL3= 120
##$ZL4= 120
##$ABSF1= 14.98061
##$ABSF2= -5.57192
##$ABSG= 5
##$ABSL= 3
##$ALPHA= 0
##$AQORDER= 0
##$ASSFAC= 0
##$ASSFACI= 0
##$ASSFACX= 0
##$ASSWID= 0
##$AUNMP= <proc_prof1d_extract>
##$AXLEFT= 0
##$AXNAME= <>
##$AXNUC= <1H>
##$AXRIGHT= 0
##$AXTYPE= 0
##$AXUNIT= <>
##$AZFE= 0.1
##$AZFW= 0.1
##$BCFW= 0
##$BC_mod= 0
##$BYTORDP= 0
##$COROFFS= 0
##$CY= 15
##$DATMOD= 1
##$DC= 0
##$DFILT= <>
##$DTYPP= 0
##$F1P= 0
##$F2P= 0
##$FCOR= 0.5
##$FTSIZE= 131072
##$FT_mod= 6
##$GAMMA= 0
##$GB= 0
##$INTBC= 1
##$INTSCL= 1
##$ISEN= 128
##$LB= 0.3
##$LEV0= 0
##$LPBIN= 0
##$MAXI= 10000
##$MC2= 0
##$MEAN= 0
##$ME_mod= 0
##$MI= 0
##$NCOEF= 0
##$NC_proc= -3
##$NLEV= 6
##$NOISF1= 0
##$NOISF2= 0
##$NSP= 0
##$NTH_PI= 0
##$NZP= 0
##$OFFSET= 14.98061
##$PC= 1
##$PHC0= 24.68628
##$PHC1= 0
##$PH_mod= 1
##$PKNL= yes
##$PPARMOD= 0
##$PPDIAG= 0
##$PPIPTYP= 0
##$PPMPNUM= 2147483647
##$PPRESOL= 1
##$PSCAL= 4
##$PSIGN= 0
##$PYNMP= <proc.py>
##$REVERSE= no
##$SF= 400.13
##$SI= 131072
##$SIGF1= 0
##$SIGF2= 0
##$SINO= 400
##$SIOLD= 131072
##$SPECTYP= <>
##$SREGLST= <1H.CDCl3>
##$SSB= 0
##$STSI= 131072
##$STSR= 0
##$SW_p= 8223.68421052632
##$SYMM= 0
##$S_DEV= 0
##$TDeff= 65536
##$TDoff= 0
##$TI= <>
##$TILT= no
##$TM1= 0
##$TM2= 0
##$TOPLEV= 0
##$USERP1= <user>
##$USERP2= <user>
##$USERP3= <user>
##$USERP4= <user>
##$USERP5= <user>
##$WDW= 1
##$XDIM= 131072
##$YMAX_p= 507450139
##$YMIN_p= -278941502
##$CURPLOT= <Network HP LaserJet P1505>
##$CURPRIN= <$Network HP LaserJet P1505>
##$DFORMAT= <normdp>
##$LAYOUT= <+/1D_H.xwp>
##$LFORMAT= <normlp>
##$PFORMAT= <normpl>
##$SURQMSG= 1
$$ End of Bruker specific parameters
$$ ---------------------------------
##NTUPLES= NMR SPECTRUM
##VAR_NAME=  FREQUENCY,     SPECTRUM/REAL,   SPECTRUM/IMAG
##SYMBOL=    X,             R,               I
##VAR_TYPE=  INDEPENDENT,   DEPENDENT,       DEPENDENT
##VAR_FORM=  AFFN,          ASDF,            ASDF
##VAR_DIM=   131072,        131072,          131072
##UNITS=     HZ,            ARBITRARY UNITS, ARBITRARY UNITS
##FACTOR=    0.0627417313425165, 1,          1
##FIRST=     8223.62146879498, 3452,         -97429
##LAST=      0,             6100,            -96567
##MIN=       0,             -278941502,      0
##MAX=       8223.62146879498, 507450139,    0
$$ Real data points
##PAGE= N=1
##DATA TABLE= (X++(R..R)), XYDATA
$$ [...]
62976C007493N6642N5851N4711N3332N2106N1446N0575M7414M0821L2396K4644
62965C527431J7703R338j790j4508k7007l8641m9163n7574o3069o6292o8476o9683
62953C098269o8936o5877o1331n6228n0755m4798l8429l1613k4014j5713p837
62942B632738j697K895P705J3891K0309K4860K7333K9692L3305L6978L8486L7201
62930B903696L4366L1440K9087K7409K6101K4532K2327J9589J6051J0670K960
62919C148228n912j4518k3155l3006m3744n3550o1481o8262p4443p9439q2786
62908B607932q4969q6306q6272q4588q1780p8097p3114o7153o1806n8097n5235
62897A790515n2070m8729m5664m2334l8120l3712l0198k7467k4869k2718k1569
$$ plain form
62976 3007493 3064135 3119986 3174697 3228029 3280135 3331581 3382156 3429570 3470391 3502787 3527431
62965 3527431 3545134 3554472 3552682 3538174 3511167 3472526 3423363 3365789 3302720 3236428 3167952 3098269
62953 3098269 3029333 2963456 2902125 2845897 2795142 2750344 2711915 2680302 2656288 2640575 2632738
62942 2632738 2631041 2633936 2641641 2655532 2675841 2700701 2728034 2757726 2791031 2828009 2866495 2903696
62930 2903696 2938062 2969502 2998589 3025998 3052099 3076631 3098958 3118547 3134598 3145268 3148228
62919 3148228 3142316 3127798 3104643 3071637 3027893 2974343 2912862 2844600 2770157 2690718 2607932
62908 2607932 2522963 2436657 2350385 2265797 2184017 2105920 2032806 1965653 1903847 1845750 1790515
62897 1790515 1738445 1689716 1644052 1601718 1563598 1529886 1499688 1472221 1447352 1424634 1403065
62886A403065k0642j8700j6207j4773j4494j3729j1847j0375j0625j1744j2199
62875A247730j2005j2227j3138j4085j4820j5610j6211j5763j4045j2078j1038
62864A096710j0868j0390q765o681n802o873q682r273q156o620n898n877o067
62851I96758o789q292r356q246n189k581k200l218l643k795j433k06P63J124N27
62836I45224l21r9J238K067J130j009l078m558n280m643k630q14p84j813j731
62821I22899j95P01k87j438n32J720K583J249j8Q90K960L533J865j65r28j111
62805I33726k161l695l912k359p71p10j693k527l257m401n106l913j299L12l95
62790H97839j958k225q96Q80K434L851M924N047M204L085K215J578J179J177J263
$$ plain form
62886 1403065 1382423 1363723 1347516 1332743 1318249 1304520 1292673 1282298 1271673 1259929 1247730
62875 1247730 1235725 1223498 1210360 1196275 1181455 1165845 1149634 1133871 1119826 1107748 1096710
62864 1096710 1085842 1075452 1066687 1060006 1054204 1047331 1038649 1029376 1021220 1014600 1008702 1002825 996758
62851 996758 989969 981677 972321 964075 958886 956305 954105 950887 947244 944449 943016 942810 943573 944697 945224
62836 945224 944903 944804 946042 948109 949239 948230 945152 940594 935314 930671 928041 927227 926443 924630 922899
62821 922899 922704 923405 923118 921680 921148 922868 925451 926700 926682 927572 930532 934065 935930 935765 934837 933726
62805 933726 931565 927870 923958 921599 920828 920118 918425 915898 912641 908240 903134 899221 897922 898234 897839
62790 897839 895881 893656 892760 893640 896074 899925 904849 909896 914100 917185 919400 920978 922157 923334 924597
62775I24597N96j095k625k263K72L141M163L144J884J837K530K715K324K252K615
62760I46087K468J418M02L38Q63J002N05r6l00M8Q99J928K596K727K748L010L255
62743I69898L199L346M612P179J0181J2562J4012J5076J6471J8322K0059K1234
62731A116151K2338K4342K7450L0852L3903L6952M0489M4027M6608M8391N0922
62720A522425N5462O1369O6747P0736P4594P9976Q6527R2020R5016R6273R7125
62709B398270R7547R6832R5071R2466Q7700P8836O5876N0852L5247J8867J650
62698C119214j5240l0867m5610n9735p2136q1621q8484r3821r8015j00806j02014
62687B330865j01371r8495r3852q8908q4494q0086p5364p1060o7144o1888n4622
$$ plain form
62775 924597 925193 924098 921473 919210 919482 922623 926786 929930 931814 933651 936181 938896 941220 943472 946087
62760 946087 948555 949973 950375 950713 951576 952578 953083 952987 952687 952735 953634 955562 958158 960885 963633 966643 969898
62743 969898 973097 976443 981055 988234 998415 1010977 1024989 1040065 1056536 1074858 1094917 1116151
62731 1116151 1138489 1162831 1190281 1221133 1255036 1291988 1332477 1376504 1423112 1471503 1522425
62720 1522425 1577887 1639256 1706003 1776739 1851333 1931309 2017836 2109856 2204872 2301145 2398270
62709 2398270 2495817 2592649 2687720 2780186 2867886 2946722 3012598 3063450 3098697 3117564 3119214
62698 3119214 3103974 3073107 3027497 2967762 2895626 2814005 2725521 2631700 2533685 2432879 2330865
62687 2330865 2229494 2130999 2037147 1948239 1863745 1783659 1708295 1637235 1570091 1508203 1453581
62676A453581m7984m5040m4967m4082m0766l6771l3585l0345k6169k2162j9590
62665A062120j7821j5625j3212j1555j0431q748o376m366l308k377k66L322P247
62652I78604R975J1157J2032J3904J6509J8655K0267K2643K6424L0535L3755L6320
62640A230780L9166M2413M5621M9043N3418N8662O3655O7460P0126P2224P4107
62629A866675P5803P7185P7984P7724P5738P1240O3690N3225M0639K6725J1806
62618B518434l785j8979l2260m2851n1481n9672o8194p6141q1715q3961q3755
62607A915640q2914q2412q1682p9586p5774p0912o5925o1235n6707n2092m7509
62596A158892m3500m0608l8759l7051l4348l0293k5878k2776k1819k2190k2198
$$ plain form
62676 1453581 1405597 1360557 1315590 1271508 1230742 1193971 1160386 1130041 1103872 1081710 1062120
62665 1062120 1044299 1028674 1015462 1003907 993476 984728 978352 973986 970678 968301 968035 971357 978604
62652 978604 988579 999736 1011768 1025672 1042181 1060836 1081103 1103746 1130170 1160705 1194460 1230780
62640 1230780 1269946 1312359 1357980 1407023 1460441 1519103 1582758 1650218 1720344 1792568 1866675
62629 1866675 1942478 2019663 2097647 2175371 2251109 2322349 2386039 2439264 2479903 2506628 2518434
62618 2518434 2514649 2495670 2463410 2420559 2369078 2309406 2241212 2165071 2083356 1999395 1915640
62607 1915640 1832726 1750314 1668632 1589046 1513272 1442360 1376435 1315200 1258493 1206401 1158892
62596 1158892 1115392 1074784 1036025 998974 964626 934333 908455 885679 863860 841670 819472
62585H19472k0867j8539j6176j4431j3350j2447j1186r785r412j0727j2303j1650
62573F58599q248m496k962l615m686n165n122m311k304R8J262R61P58J596K335
62558F24700J624J97J0J651L826N348O486P976R596J0515J0719J1304J3057J5314
62544G22323J6625J6431J5623J5584J7115K0106K3700K6744K8798L0772L3781
62533I67602L7348L9736M0504M1441M4168M7794N0155N0665N0520N0528N0142
62522A470603M8500M5191L9863L2351K3467J4697O751r61r247j8133k6878l4269
62510A591935l9168m1574m3006m4930m6995m7883m7570m7202m6826m4950m0973
62499A100858l6415l2892l0209k7523k5180k4045k3736k3047k1785k0942k0941
$$ plain form
62585 819472 798605 780066 763890 749459 736109 723662 712476 702691 693279 682552 670249 658599
62573 658599 650351 645855 642893 639278 634592 629427 624305 619994 617690 617788 619050 620011 620769 622365 624700
62558 624700 626324 626521 626531 628182 632008 637356 643842 651818 661414 671929 682648 693952 707009 722323
62544 722323 738948 755379 771002 786586 803701 823807 847507 874251 903049 933821 967602
62533 967602 1004950 1044686 1085190 1126631 1170799 1218593 1268748 1319413 1369933 1420461 1470603
62522 1470603 1519103 1564294 1604157 1636508 1659975 1674672 1681423 1680462 1671215 1653082 1626204 1591935
62510 1591935 1552767 1511193 1468187 1423257 1376262 1328379 1280809 1233607 1186781 1141831 1100858
62499 1100858 1064443 1031551 1001342 973819 948639 924594 900858 877811 856026 835084 814143
62488H14143k0802j9403j6903j4429j2686j1341r905q728q571r172r049p358n183
62475F60613m102l971l358j776qJ665L862O280P265O163M795N366P830J0456J2189
62460G13269J3226J3984J4842J6590J9815K3746K6775K8274K9185L0665L2838
62449I63209L5025L6726L8055L9506M1431M3592M5102M4908M2375L7673L1820
62438A399422K6070K0775J4963P544j138r590j6786k2712k7402l0650l2894l5219
62426A292383l7878l9797m0138l9339l8015l5848l2546k9010k6390k4499k2325
62415I26598j9701j7444j6037j5057j3872j2151r850p336n373m413l956l087j517
62402G96804K28J354J253k7j379j259P81L581N689O664O824O623O807Q155J0303
$$ plain form
62488 814143 793341 773938 757035 742606 729920 718579 708674 699946 691375 682203 673154 665796 660613
62475 660613 656511 652540 649182 647406 647398 649063 652925 659205 666470 672633 677428 682794 690624 701080 713269
62460 713269 726495 740479 755321 771911 791726 815472 842247 870521 899706 930371 963209
62449 963209 998234 1034960 1073015 1112521 1153952 1197544 1242646 1287554 1329929 1367602 1399422
62438 1399422 1425492 1446267 1461230 1468774 1467636 1458046 1441260 1418548 1391146 1360496 1327602 1292383
62426 1292383 1254505 1214708 1174570 1135231 1097216 1061368 1028822 999812 973422 948923 926598
62415 926598 906897 889453 873416 858359 844487 832336 822486 815150 809777 805364 801408 798321 796804
62402 796804 797032 798386 799639 799612 798233 796974 797755 801336 807025 813689 820513 827136 833943 842098 852401
62387H52401J1703J1547J0902J0927J1013R796P229M267J336j499l611m638n745
62374I15628q336j1882j4674j6342j7779j8816j8193j6045j4215j3380j2003r083
62362G44880o117m968n156m762l049r07N81R24J72q09o28J157L356M855O130Q095
62346G43754J0102J0746J0312J0782J3046J5441J5812J4156J2442J2201J3091
62335H81885J3694J3119J1606R952Q674P687O503M651K175j18j186q04QL5p98
62320I57083j435q54J188M348P940J1045J3095J4613J6836K0402K4819K9286L3400
62307A131766L7040M0324M3894M8481N3766N8458O2071O5806P0932P6868Q1686
62296A771092Q4078Q3927Q1451P6838P0638O3370N4621M3501L0359J7099N357
$$ plain form
62387 852401 864104 875651 886553 897480 908493 918289 925518 929785 931121 929622 926011 921373 915628
62374 915628 907292 895410 880736 864394 846615 827799 809606 793561 779346 765966 753963 744880
62362 744880 738763 733795 728639 723877 720828 719921 720502 721426 721598 720789 720161 721318 724674 729529 735659 743754
62346 743754 753856 764602 774914 785696 798742 814183 829995 844151 856593 868794 881885
62335 881885 895579 908698 920304 930256 938930 946617 953120 957771 959946 959828 958642 957838 957846 957881 957083
62320 957083 955648 954794 955982 960330 968270 979315 992410 1007023 1023859 1044261 1069080 1098366 1131766
62307 1131766 1168806 1209130 1253024 1301505 1355271 1413729 1475800 1541606 1612538 1689406 1771092
62296 1771092 1855170 1939097 2020548 2097386 2168024 2231394 2286015 2329516 2359875 2376974 2382331
62285B382331m956j4814k4555l3888m2713n0950n7842o2473o5038o6697o7920
62274A890485o7937o6222o3613o1146n8476n4571m9675m5364m2513m0333l7786
62263A302849l4966l2351k9622k6260k2814k0391j8979j7369j4954j2587j1158
62252A061398j0141q279n314k248r9R23R46l7j771l309l755l338l174l832m629
62237A013341m598l685k598j937k013k941m202m461k904n09J138K190M294P699
62223I98814J0292J0424R295R224J0583J1957J2665J3437J4895J6821J9037K1634
62211A159078K4203K5921K6698K7405K8811L1044L4096L7947M2310M6975N2195
62200A536683N7812O2525O5518O8303P2947P8444Q1004P8718P3680O8396O2115
$$ plain form
62285 2382331 2377375 2362561 2338006 2304118 2261405 2210455 2152613 2090140 2025102 1958405 1890485
62274 1890485 1822548 1756326 1692713 1631567 1573091 1518520 1468845 1423481 1380968 1340635 1302849
62263 1302849 1267883 1235532 1205910 1179650 1156836 1136445 1117466 1100097 1085143 1072556 1061398
62252 1061398 1051257 1042978 1037664 1035416 1035317 1036240 1037186 1037149 1035378 1032069 1028314 1024976 1021802 1017970 1013341
62237 1013341 1008743 1005058 1002460 1000523 998510 995569 991367 986906 984002 983493 984631 986821 991115 998814
62223 998814 1009106 1019530 1028825 1038049 1048632 1060589 1073254 1086691 1101586 1118407 1137444 1159078
62211 1159078 1183281 1209202 1235900 1263305 1292116 1323160 1357256 1395203 1437513 1484488 1536683
62200 1536683 1594495 1657020 1722538 1790841 1863788 1942232 2023236 2101954 2175634 2244030 2306145
62189B306145N2625M0075K6784J4071J521j0962k2416l2397m1535n0070n7185
62178B226656o2245o5628o7818o8630o7808o5609o2361n8173n3493m9158m5387
62167A560346m1345l6320l0893k6320k3056k0433j7640j4483j1248q264n726l727
62155A320891k331j553j158n79O30K152L115L191L102L705M915N973O570P089
62141A355712P856Q941J0605J3153J5965J7688J8107J8999K2027K6267K9190K9987
62129A574497L0458L2372L5366L8054L9775M0244L8884L5849L2805L1101K9840
62118A959245K7368K4085K1958K1559K1648K1758K3101K6367L0582L4936L9837
62107B252444M5107M9012N0534N0992N1734N1611M8669M3262L7300L1203K3899
$$ plain form
62189 2306145 2358770 2398845 2425629 2439700 2441221 2430259 2407843 2375446 2333911 2283841 2226656
62178 2226656 2164411 2098783 2030965 1962335 1894527 1828918 1766557 1708384 1654891 1605733 1560346
62167 1560346 1519001 1482681 1451788 1425468 1402412 1381979 1364339 1349856 1338608 1330344 1324618 1320891
62155 1320891 1318560 1317007 1315849 1315270 1315900 1318052 1321167 1324358 1327460 1331165 1336080 1342053 1348623 1355712
62141 1355712 1363568 1372509 1383114 1396267 1412232 1429920 1448027 1467026 1489053 1515320 1544510 1574497
62129 1574497 1604955 1637327 1672693 1710747 1750522 1790766 1829650 1865499 1898304 1929405 1959245
62118 1959245 1986613 2010698 2032656 2054215 2075863 2097621 2120722 2147089 2177671 2212607 2252444
62107 2252444 2297551 2346563 2397097 2448089 2499823 2551434 2600103 2643365 2680665 2711868 2735767
62096B735767J5660Q519L467q19n795j1223j6257k0960k5856l0795l4898l7032
62084B579778l6132l2143k6917k2997k1021j9326j6515j3124j0154p387m280j384
62072B368398M96J722L122M458N048N488P223J0413J3563J5578J7057J9150K2032
62059B493748K5003K7561K9813L2184L4944L7801L9895M0555M0126L9805M0548
62048B881983M2406M4775M6893M8270M9172N0665N3713N8090O2478O5646O7274
62037C471365O8048O9359P2497P7247Q1463Q2995Q1938Q0061P8293P6152P3835
62026D313253P3073P4926P8053Q0407Q1811Q3327Q4778Q4546Q1983P8573P6296
62015E191026P5642P5668P5399P4737P4329P4798P6013P7232P8114P9177Q0798
$$ plain form
62096 2735767 2751427 2759946 2763413 2762594 2756799 2745576 2729319 2708359 2682503 2651708 2616810 2579778
62084 2579778 2543646 2511503 2484586 2461589 2440568 2421242 2404727 2391603 2381449 2374062 2369782 2368398
62072 2368398 2368894 2370616 2373738 2378196 2383244 2388732 2395955 2406368 2419931 2435509 2452566 2471716 2493748
62059 2493748 2518751 2546312 2576125 2608309 2643253 2681054 2720949 2761504 2801630 2841435 2881983
62048 2881983 2924389 2969164 3016057 3064327 3113499 3164164 3217877 3275967 3338445 3404091 3471365
62037 3471365 3539413 3608772 3681269 3758516 3839979 3922974 4004912 4084973 4163266 4239418 4313253
62026 4313253 4386326 4461252 4539305 4619712 4701523 4784850 4869628 4954174 5036157 5114730 5191026
62015 5191026 5266668 5342336 5417735 5492472 5566801 5641599 5717612 5794844 5872958 5952135 6032933
62004F032933Q2253Q2397Q0966P8429P4875P0089O4597N9477N4927N0031M4226
61993F775200L8129L2526K7469K2858J9082J6331J3764J0119N044l68m215n083
61981F950856l304j111p40k199l652m051m268n250o397o674o328o272o554o770
61967F887286p452r551j2642j4991j5687j5627j6014j6810j7120j6432j4961j3179
61955F716820j1531j0356r679r042p705n163j523K534O196Q963J0652J1338J1721
61942F713225J3194J6613K0853K3437K3090K0900J8482J5809J1572N076l074j1754
61930F867423k0043k7447l4021m0034m5274m9202n2025n4570n6742n7352n6346
61919F374367n5665n6514n7219n5783n3484n3375n5684n7423n6847n5670n5941
$$ plain form
62004 6032933 6115186 6197583 6278549 6356978 6431853 6501942 6566539 6626016 6680943 6730974 6775200
61993 6775200 6813329 6845855 6873324 6896182 6915264 6931595 6945359 6955478 6960522 6960154 6955939 6950856
61981 6950856 6947552 6946441 6945701 6943502 6939850 6935799 6931531 6926281 6919884 6913210 6906882 6900610 6894056 6887286
61967 6887286 6879834 6870283 6857641 6842650 6826963 6811336 6795322 6778512 6761392 6744960 6729999 6716820
61955 6716820 6705289 6694933 6685254 6676212 6668507 6663344 6661821 6664355 6670551 6679514 6690166 6701504 6713225
61942 6713225 6726419 6743032 6763885 6787322 6810412 6831312 6849794 6865603 6877175 6882251 6879177 6867423
61930 6867423 6847380 6819933 6785912 6745878 6700604 6651402 6599377 6544807 6488065 6430713 6374367
61919 6374367 6318702 6262188 6204969 6149186 6095702 6042327 5986643 5929220 5872373 5816703 5760762
61908E760762n6886n6316n3676n0257m7379m5535m4633m4043m2858m0733l8091
61897E240355l5251l2148k9111k6877k5395k3734k1588j9697j8037j4979r423
61886D984115k824K245N044P084R948J3774J7808K1543K5070K8596L1842L4071
61874E178316L5090L5982L8043M1038M3466M4632M5417M6803M8808N1396N5102
61863E664093O0157O5949P2078P9041Q7357R7084J08736J23274J40494J58679
61853F656942J76850J96175K18200K42907K69581K98179L28583L59832L91637
61844I138886M25489M62627N02085N42401N84058O27978O72234P12253P43533
61835A4411544P61806P60897P32997O71694N73735M38919K71454Q2063j13514
$$ plain form
61908 5760762 5703876 5647560 5593884 5543627 5496248 5450713 5406080 5362037 5319179 5278446 5240355
61897 5240355 5205104 5172956 5143845 5116968 5091573 5067839 5046251 5026554 5008517 4993538 4984115
61886 4984115 4981291 4983536 4988580 4995664 5005612 5019386 5037194 5058737 5083807 5112403 5144245 5178316
61874 5178316 5213406 5249388 5287431 5328469 5371935 5416567 5461984 5508787 5557595 5608991 5664093
61863 5664093 5724250 5790199 5862277 5941318 6028675 6125759 6234495 6357769 6498263 6656942
61853 6656942 6833792 7029967 7248167 7491074 7760655 8058834 8387417 8747249 9138886
61844 9138886 9564375 10027002 10529087 11071488 11655546 12283524 12955758 13668011 14411544
61835 14411544 15173350 15934247 16667244 17338938 17912673 18351592 18623046 18705109 18591595
61826A8591595k99798m65270o02412p07275p79936q23454q41191q36135q12677
61817A2423447p76759p33251o84783o33698n83130n35109m89381m45433m04317
61808G137586l67301l34110l03761k75849k49846k24552j99734j77152j58347
61799D846934j42358j27109j12089r8031q4762p1361n8149m6702l7868l1063k5513
61788D011929k0873j6679j2526r007p431q370j1215j5074j9278k3131k6041k7836
61776C814468k8237k6425k2167j6985j2860r818o167j154L996P896J0435J1896
61764C724878J1967J0436P749M124r08p182j3004j6731j8497j9331j9097j6706
61752C647698j2206p257l026J395P833J6845K7272L7632M7296N6339O4953P3485
$$ plain form
61826 18591595 18291797 17826527 17224115 16516840 15736904 14913450 14072259 13236124 12423447
61817 12423447 11646688 10913437 10228654 9594956 9011826 8476717 7987336 7541903 7137586
61808 7137586 6770285 6436175 6132414 5856565 5606719 5382167 5182433 5005281 4846934
61799 4846934 4704576 4577467 4465378 4367347 4282585 4211224 4153075 4106373 4068505 4037442 4011929
61788 4011929 3991056 3974377 3961851 3952844 3945413 3937043 3925828 3910754 3891476 3868345 3842304 3814468
61776 3814468 3786231 3759806 3737639 3720654 3707794 3697976 3691809 3690655 3694651 3702547 3712982 3724878
61764 3724878 3736845 3747281 3755030 3759154 3758246 3751064 3738060 3721329 3702832 3683501 3664404 3647698
61752 3647698 3635492 3628235 3625209 3626604 3634437 3651282 3678554 3716186 3763482 3819821 3884774 3958259
61740C958259Q2675R3115J04361J15321J25978J37979J52526J68160J82122J94028
61730E314524K06698K22683K41409K60916K81195L03965L29811L57533L86577
61721G905311M18291M54143M94187N38042N86206O39346O97264P59715Q27445
61712A3319950R01166R79799J060806J142003J221872J297982J365687J418000
61704B2707265J445539J436517J378171J259688J075020Q25055N19509J77405
61696C0824169j75839n14000q15091j063958j253240j382895j457871j485109
61688B2676166j472543j429651j366339j290022j204830j114401j023939r38181
61680A2836260q58651p84660p16298o54500n98640n46356m96512m50647m10650
$$ plain form
61740 3958259 4040934 4134049 4238410 4353731 4479709 4617688 4770214 4938374 5120496 5314524
61730 5314524 5521222 5743905 5985314 6246230 6527425 6831390 7161201 7518734 7905311
61721 7905311 8323602 8777745 9271932 9809974 10396180 11035526 11732790 12492505 13319950
61712 13319950 14221116 15200915 16261721 17403724 18625596 19923578 21289265 22707265
61704 22707265 24152804 25589321 26967492 28227180 29302200 30127255 30646764 30824169
61696 30824169 30648330 30134330 29319239 28255281 27002041 25619146 24161275 22676166
61688 22676166 21203623 19773972 18407633 17117611 15912781 14798380 13774441 12836260
61680 12836260 11977609 11192949 10476651 9822151 9223511 8677155 8180643 7729996 7319346
61671G319346l76088l44763l15177k87428k62172k39639k19659k02005j86418
61662D885997j72650j60672j50748j43125j37413j32375j26710j20267j14143
61653C627894j09272j05272j01017r5959r0293q4200p7797p1813o7342o4535o2163
61642B698231n8975n5165n2045n0418m9615m8306m5998m3476m1741m0731l9552
61631B172209l7752l5810l4269l3046l1839l0574k9119k7323k5678k5072k5341
61620A836386k5009k3355k1701k1419k1551k0081j7034j4452j3398j2837j1798
61609A633751j0820j0596j0715j0740j1221j2583j3901j3759j1837q988o385n130
61597A507076n804p553q287o733l873j704j036j094q03L29K144L895M579L880
$$ plain form
61671 7319346 6943258 6598495 6283318 5995890 5733718 5494079 5274420 5072415 4885997
61662 4885997 4713347 4552675 4401927 4258802 4121389 3989014 3862304 3742037 3627894
61653 3627894 3518622 3413350 3312333 3216374 3126081 3041881 2964084 2892271 2824929 2760394 2698231
61642 2698231 2639256 2584091 2532046 2481628 2432013 2383707 2337709 2294233 2252492 2211761 2172209
61631 2172209 2134457 2098647 2064378 2031332 1999493 1968919 1939800 1912477 1886799 1861727 1836386
61620 1836386 1811377 1788022 1766321 1744902 1723351 1703270 1686236 1671784 1658386 1645549 1633751
61609 1633751 1622931 1612335 1601620 1590880 1579659 1567076 1553175 1539416 1527579 1518591 1512206 1507076
61597 1507076 1501272 1493719 1485432 1478699 1474826 1473122 1472086 1470992 1470189 1470518 1472662 1476557 1481136 1485016
61583A485016K616J945K336L524M852N353M298K261J004J572L125M239M782N707
61569A532630P562J0049J2521J4117J3992J2318J0478R269P538L860r66m652o427
61556A622289p721r683j1717j3022j4116j5869j7955j9266j9237j8137j6609j5523
61544A443434j5556j6267j6117j4153j1288r143q084p262o213n406n079m560l197
61531A321109j349J09R29J685K856M166N065N647O700Q704J1097J2931J4258J6207
61517A410114J9458K3096K5627K6860K8100L0344L3082L5243L6806L8705M1357
61506A748792M4009M5745M6533M6915M7087M6765M5801M4481M3129M1784M0269
61495B241310L8460L6414L4429L2882L1794L0600K8631K5782K2445J8944J5433
$$ plain form
61583 1485016 1487632 1489577 1491913 1495437 1500289 1505642 1509940 1512201 1513205 1514777 1517902 1522141 1526923 1532630
61569 1532630 1540192 1550241 1562762 1576879 1590871 1603189 1613667 1622936 1630474 1634334 1633368 1628716 1622289
61556 1622289 1614568 1604885 1593168 1580146 1566030 1550161 1532206 1512940 1493703 1475566 1458957 1443434
61544 1443434 1427878 1411611 1395494 1381341 1370053 1360910 1352826 1345564 1339351 1333945 1328866 1324306 1321109
61531 1321109 1319760 1319869 1320798 1322483 1325339 1329505 1334570 1340217 1346917 1355621 1366718 1379649 1393907 1410114
61517 1410114 1429572 1452668 1478295 1505155 1533255 1563599 1596681 1631924 1668730 1707435 1748792
61506 1748792 1792801 1838546 1885079 1931994 1979081 2025846 2071647 2116128 2159257 2201041 2241310
61495 2241310 2279770 2316184 2350613 2383495 2415289 2445889 2474520 2500302 2522747 2541691 2557124
61484B557124J2197R456O797L463m24l626n283o264q255j1621j4842j6085j4819
61471B507818j1797q093m501j440J210M191Q329J3664J9211K3894K7744L1988
61459B612218L7784M4929N2191N8943O6108P5113Q6081R7636J08544J19079J30427
61448C489053J43115J56620J70439J84882K00485K17143K34272K51517K68572
61439E316098K84349K96895L04456L06164L01532K89588K68915K38441J98213
61430G804651J49822R6253M0958j3183o3859j08550j44762j71550j90129k02335
61420G197316k09010k10369k07109k00141j89780j76291j60905j45099j29079
61411E569533j12238r4926p8385o2863m7367l1712j7192m460P768K0727L3407
$$ plain form
61484 2557124 2569321 2578777 2585574 2589037 2588613 2584987 2579704 2573440 2565185 2553564 2538722 2522637 2507818
61471 2507818 2496021 2487928 2483427 2481987 2483197 2487388 2495717 2509381 2528592 2552486 2580230 2612218
61459 2612218 2650002 2694931 2747122 2806065 2872173 2947286 3033367 3131003 3239547 3358626 3489053
61448 3489053 3632168 3788788 3959227 4144109 4344594 4561737 4796009 5047526 5316098
61439 5316098 5600447 5897342 6201798 6507962 6809494 7099082 7367997 7606438 7804651
61430 7804651 7954473 8050726 8091684 8078501 8014642 7906092 7761330 7589780 7399651 7197316
61420 7197316 6988306 6777937 6570828 6370687 6180907 6004616 5843711 5698612 5569533
61411 5569533 5457295 5362369 5283984 5221121 5173754 5142042 5124850 5120390 5128158 5148885 5182292
61400E182292M3832N1820N8994O6334P3041P7860Q0486Q1460Q1503Q1227Q0859
61389E959708P9993P7996P4877P1539O9206O8640O9599P0750P0426O7908O3886
61378F744528N9400N4733M9698M4472L9481L4635K9384K3517J7391J1351N418
61367G114008m35o115j1557j6834k2052k7211l1983l5643l7701l8685l9607m0361
61355F805824l9560l6568l2773k9734k6843k2349j6417j1492r402r459r993j0460
61343F550774j1313j2730j4585j6927j9491k1050k0260j7092j2681p709j549O862
61331F402249J7878L1090M6004O2447Q0425R9816J20215J41099J62214J83786
61321G347223K06191K29279K52060K73163K91595L06889L18521L25451L26312
$$ plain form
61400 5182292 5226124 5277944 5336938 5403272 5476313 5554173 5634659 5716119 5797622 5878849 5959708
61389 5959708 6039701 6117697 6192574 6264113 6333319 6401959 6471558 6542308 6612734 6680642 6744528
61378 6744528 6803928 6858661 6908359 6952831 6992312 7026947 7056331 7079848 7097239 7108590 7114008
61367 7114008 7113573 7107458 7095901 7079067 7057015 7029804 6997821 6962178 6924477 6885792 6846185 6805824
61355 6805824 6766264 6729696 6696923 6667189 6640346 6617997 6601580 6590088 6580686 6571227 6561234 6550774
61343 6550774 6539461 6526731 6512146 6495219 6475728 6454678 6434418 6417326 6404645 6396936 6395387 6402249
61331 6402249 6420127 6451217 6497221 6559668 6640093 6739909 6860124 7001223 7163437 7347223
61321 7347223 7553414 7782693 8034753 8307916 8599511 8906400 9224921 9550372 9876684
61312I876684L19747L04081K77181K37821J87742J31609P4059J7161l8583r1498
61302A1296004j38622j78481k12456k42453k68213k88137l02013l11308l16715
61293I037606l17095l11670l02132k91307k80191k67555k52552k36455k21164
61284F557485k06820j91848j75133j57356j40098j24322j09885r5999q1762o6651
61274E207611n1068l6316k3539j2601k289Q260J8619K7773L5363M1843M7576N2416
61262E313648N6173N8801N9758N8097N4026M9782M7548M6554M3594L6993K8817
61251E853791K2430J8842J6459J3561R664M934l07n527j0494j5898k2571l0137
61239E854747l7380m3829m9899n5500n9759o2450o4557o6868o8896o9706o9169
$$ plain form
61312 9876684 10196431 10500512 10777693 11015514 11203256 11334865 11408924 11426085 11387502 11296004
61302 11296004 11157382 10978901 10766445 10523992 10255779 9967642 9665629 9354321 9037606
61293 9037606 8720511 8408841 8106709 7815402 7535211 7267656 7015104 6778649 6557485
61284 6557485 6350665 6158817 5983684 5826328 5686230 5561908 5452023 5356024 5274262 5207611
61274 5207611 5156543 5120227 5096688 5084087 5081798 5090058 5108677 5136450 5171813 5213656 5261232 5313648
61262 5313648 5369821 5428622 5488380 5546477 5600503 5650285 5697833 5744387 5787981 5824974 5853791
61251 5853791 5876221 5895063 5911522 5925083 5934747 5939681 5939374 5933847 5923353 5907455 5884884 5854747
61239 5854747 5817367 5773538 5723639 5668139 5608380 5545930 5481373 5414505 5345609 5275903 5206734
61228E206734o7841o6228o4391o1891n8013n2644m6864m1765l6941l1286k5299
61217D653571k1007j9179j8187j6357j4083j2687j2441j2872j3882j5215j5638
61206D482023j4078j1011p618m059K59N223J0086J4711J9448K4048K7862L1185
61194D578079L5429M1790N0437O0893P2545Q4710R6756J08111J17920J25062J28863
61183E500595J29253J25693J16737J01336P9957N3556K2202j4103n3478r2036
61173E969712j25820j52580j72171j85873j94778j98476j95984j88310j78702
61164D377018j69509j60177j49566j38660j29085j20242j10291r9387q9522q1372
61154C129207p3622o5489n7743n0899m4417l8176l2835k8276k3413j8062j3185
$$ plain form
61228 5206734 5138893 5072665 5008274 4946383 4888370 4835726 4788862 4747097 4710156 4678870 4653571
61217 4653571 4632564 4613385 4595198 4578841 4564758 4552071 4539630 4526758 4512876 4497661 4482023
61206 4482023 4467945 4456934 4449316 4445257 4445516 4450739 4460825 4475536 4494984 4519032 4546894 4578079
61194 4578079 4613508 4655298 4705735 4766628 4839173 4923883 5020639 5128750 5246670 5371732 5500595
61183 5500595 5629848 5755541 5872278 5973614 6053571 6107127 6129329 6115226 6061748 5969712
61173 5969712 5843892 5691312 5519141 5333268 5138490 4940014 4744030 4555720 4377018
61164 4377018 4207509 4047332 3897766 3759106 3630021 3509779 3399488 3300101 3210579 3129207
61154 3129207 3055585 2990096 2932353 2881454 2837037 2798861 2766026 2737750 2714337 2696275 2683090
61143B683090q769l382L303R362J3030J4737J5777J6471J6711J6863J6791J5261
61131B809245J1678P408M201K187N12j140k918n586r421j3199j5799j8140k1815
61118B747213k6288k9338l0226l0694l2470l5303l8021m0183m1885m2838m2777
61107B357190m2331m2615m3958m5591m6654m6966m6710m5832m4349m2868m2028
61096A867288m1263l8984l4660k9988k7200k6580k6681k6670k7070k8150k8944
61085A531098k8560k7519k6946k7040k6975k5899k3563k0306j6922j4167j2163
61074A281038j0571r398q967q930q093n649j995K000N830R093J1254J2318J3095
61061A281025J4129J4789J4214J2784J1919J2468J3870J4876J4849J4239J3964
$$ plain form
61143 2683090 2674321 2670939 2674242 2683604 2696634 2711371 2727148 2743619 2760330 2777193 2793984 2809245
61131 2809245 2820923 2828331 2832532 2834719 2835231 2834091 2831173 2825587 2816166 2802967 2787168 2769028 2747213
61118 2747213 2720925 2691587 2661361 2630667 2598197 2562894 2524873 2484690 2442805 2399967 2357190
61107 2357190 2314859 2272244 2228286 2182695 2136041 2089075 2042365 1996533 1952184 1909316 1867288
61096 1867288 1826025 1787041 1752381 1722393 1695193 1668613 1641932 1615262 1588192 1560042 1531098
61085 1531098 1502538 1475019 1448073 1421033 1394058 1368159 1344596 1324290 1307368 1293201 1281038
61074 1281038 1270467 1261069 1252102 1243172 1235079 1229430 1227435 1229435 1235265 1244358 1255612 1267930 1281025
61061 1281025 1295154 1309943 1324157 1336941 1348860 1361328 1375198 1390074 1404923 1419162 1433126
61050A433126J4273J4478J4075J3741J4464J5708J5424J2258P097K103j240k847
61038A552660l568m441n996p870r401j0494j1385j1637j0464q305o994p745r635
61025A444725j0709j0049q320o952p143r120j1717j3194j2917j1864j1317j1552
61013A319871j1967j1800j0567q554p027p044p873p509n181k226p8J316K405K755
60999A246521K061J479K463M690O260N897M163K744L037N120P579Q851R104J0072
60985A320041J2533J5020J5894J5808J6744J9156K1446K2262K2105K2381K3742
60974A527132K5779K7924L0067L2356L4651L6572L8315M0896M5012M9952N4348
60963A943004N7689O0221O1774O2133O2480O4731O9066P3658P7411Q1396Q6800
$$ plain form
61050 1433126 1447399 1461877 1475952 1489693 1504157 1519865 1535289 1547547 1554644 1556747 1555507 1552660
61038 1552660 1549092 1544651 1538655 1530785 1521384 1510890 1499505 1487868 1477404 1469099 1462105 1454360 1444725
61025 1444725 1434016 1423967 1415647 1408695 1401552 1392432 1380715 1367521 1354604 1342740 1331423 1319871
61013 1319871 1307904 1296104 1285537 1276983 1269956 1262912 1255039 1247530 1242349 1240123 1240045 1241361 1243766 1246521
60999 1246521 1248582 1250061 1252524 1257214 1263474 1269371 1273534 1276278 1279315 1284435 1292014 1300865 1309969 1320041
60985 1320041 1332574 1347594 1363488 1379296 1396040 1415196 1436642 1458904 1481009 1503390 1527132
60974 1527132 1552911 1580835 1610902 1643258 1677909 1714481 1752796 1793692 1838704 1888656 1943004
60963 1943004 2000693 2060914 2122688 2184821 2247301 2312032 2381098 2454756 2532167 2613563 2700363
60952B700363R3024R8923J04689J11289J18962J27336J36295J46000J56676J68787
60942C962344J82298J95671K07224K17888K30837K47777K67759K90373L17350
60933F119521L49438L84355M20003M57546M99348N46330N99951O64217P42437
60924A0783146Q33938R37080J053364J185236J332972J498724J690801J918119
60916B1233380K183386K488285K835018L196058L470235L494631L144369K445447
60908D4490809J584213P94154K28928o8776j17736L0838K62411L84227K04496
60899D7793564l38417j124411j934263k585033l000158l187939l191486l063124
60891B9368733k856899k617007k367473k117273j873245j643711j433567j243598
$$ plain form
60952 2700363 2793387 2892310 2996999 3108288 3227250 3354586 3490881 3636881 3793557 3962344
60942 3962344 4144642 4340313 4547537 4765425 4996262 5244039 5511798 5802171 6119521
60933 6119521 6468959 6853314 7273317 7730863 8230211 8776541 9376492 10040709 10783146
60924 10783146 11617084 12554164 13607528 14792764 16125736 17624460 19315261 21233380
60916 21233380 23416766 25905051 28740069 31936127 35406362 38900993 42045362 44490809
60908 44490809 46075022 46869176 47098104 47029328 46911592 46942430 47204841 47589068 47793564
60899 47793564 47455147 46330736 44396473 41811440 38811282 35623343 32431857 29368733
60891 29368733 26511834 23894827 21527354 19410081 17536836 15893125 14459558 13215960
60883A3215960j075270r31806q14091p19044o42431n80640n29630m85120m44787
60874F993141m08413l75570l44751l15167k87604k62956k41215k22271k06573
60865D328621j94438j85362j78223j71604j64136j55475j46813j39487j33080
60856B860003j25815j16929j07698r9803r3426q7425q0996p4596o9186o4938o1114
60845A878077n7297n4069n1802m9328m5049l9344l4505l1937l0709k9309k7530
60834A427198k5822k4112k2310k0854j9635j7441j3854j0759j0270j1693j2246
60823A238202j0475p458m824l307l326n133p667q739p491n709n667p315q691q850
60809A143550q993j0423j2399j2948j1404r151p766p422p448p548p582o916n215
$$ plain form
60883 13215960 12140690 11208884 10394793 9675749 9033318 8452678 7923048 7437928 6993141
60874 6993141 6584728 6209158 5864407 5549240 5261636 4998680 4757465 4535194 4328621
60865 4328621 4134183 3948821 3770598 3598994 3434858 3279383 3132570 2993083 2860003
60856 2860003 2734188 2617259 2509561 2409758 2316332 2228907 2147911 2073315 2004129 1939191 1878077
60845 1878077 1820780 1766711 1714909 1665581 1620532 1581188 1546683 1514746 1484037 1454728 1427198
60834 1427198 1401376 1377264 1354954 1334100 1314465 1297024 1283170 1272411 1262141 1250448 1238202
60823 1238202 1227727 1220269 1215445 1212138 1208812 1203679 1196012 1187273 1179782 1174073 1168406 1161091 1152400 1143550
60809 1143550 1134557 1124134 1111735 1098787 1087383 1078232 1070466 1063044 1055596 1048048 1040466 1033550 1028335
60796A028335l440k832k896j875P37L488N167O320P951R937J1598J2827J3947
60783A089264J5251J7241K0282K3284K4052K1831J8489J6134J4684J2934J0891
60772A284337R518Q984Q676Q355P929O741M490K247J016k2k066m148m101j926
60758A330030M6L95n6n09j536l232m198l725l457n285q650j1434j2709j3151j3252
60743A249277j2744j1665j0819j0828j1502j2243j2579j2233j1242r948q574o857
60731A118043m525k003k15L77L29P37K307M689O715P607P956R065J1175J2973
60717A175230J3349J2876J2778J3075J2906J2473J3199J5568J7991J8612J7418
60706A335475J5663J4052J2586J1673J1838J2275J1304Q808O846O955P967P783
$$ plain form
60796 1028335 1024895 1022063 1019167 1017292 1018029 1021517 1026684 1033004 1040955 1050892 1062490 1075317 1089264
60783 1089264 1104515 1121756 1142038 1165322 1189374 1211205 1229694 1245828 1260512 1273446 1284337
60772 1284337 1293855 1302839 1311515 1319870 1327799 1334540 1339030 1341277 1342293 1342271 1340205 1336057 1331956 1330030
60758 1330030 1330076 1330471 1330415 1329906 1328370 1325138 1320940 1317215 1313758 1308473 1299823 1288389 1275680 1262529 1249277
60743 1249277 1236533 1224868 1214049 1203221 1191719 1179476 1166897 1154664 1143422 1133474 1124900 1118043
60731 1118043 1113518 1111515 1111300 1111677 1112006 1112743 1115050 1119739 1126454 1134061 1142017 1151082 1162257 1175230
60717 1175230 1188579 1201455 1214233 1227308 1240214 1252687 1265886 1281454 1299445 1318057 1335475
60706 1335475 1351138 1365190 1377776 1389449 1401287 1413562 1424866 1433674 1440520 1447475 1455442 1463225
60694A463225O463N917O858P758P082N144L182J844J255J489K060J705k60k889
60680A510833m707n507o116o816p079o811o786p626r024j0326j1238j1699j1545
60667A405553j0742r675q813q277p907p611p367o987o184m956l725k907k383j676
60653A316343o96j03o71k423m593o277o907o428n375m632m580m677m342l942m106
60638A256591m311l316j134N88P03j1l22m24j295k936m398n325o224p337q369
60623A212480r381j1031j3509j5957j7305j7230j6089j4463j2995j2146j1736
60612A060638j1008r544p817o592n945n281m137k503m59J918L916M216K386K13
60598A020001M16L590P290Q806Q029O703N774M943M382M975O522P456P154O979
$$ plain form
60694 1463225 1469688 1475605 1482463 1490221 1497303 1502447 1505629 1507473 1508728 1510217 1512277 1513982 1513722 1510833
60680 1510833 1506126 1500619 1494503 1487687 1480608 1473797 1467011 1459385 1450361 1440035 1428797 1417098 1405553
60667 1405553 1394811 1385136 1376323 1368046 1360139 1352528 1345161 1338174 1331990 1327034 1323309 1320402 1318019 1316343
60653 1316343 1315647 1315544 1314873 1312450 1307857 1301580 1294673 1288245 1282870 1278238 1273658 1268981 1264639 1260697 1256591
60638 1256591 1252280 1248964 1247830 1248418 1249121 1249110 1248788 1248364 1247069 1244133 1239735 1234410 1228186 1220849 1212480
60623 1212480 1203099 1192068 1178559 1162602 1145297 1128067 1111978 1097515 1084520 1072374 1060638
60612 1060638 1049630 1040086 1032269 1025677 1019732 1014451 1010314 1007811 1007352 1009270 1013186 1017402 1019788 1020001
60598 1020001 1020417 1024007 1031297 1040103 1048132 1054835 1060609 1065552 1069934 1074909 1081431 1088887 1096041 1103020
60584A103020P944Q718P472M912L707N018P105P634O277M621M281N604P786R769
60570A193868J1082J1875J2448J3036J4007J5631J7370J8119J7640J7109J7537
60559A359722J8282J8018J6743J5759J5672J5468J3877J1017Q230O556N585L853
60547A508782M52l709o627p311o779o726p782r439j1065j2354j3227j3941j4980
60534A395294j6271j6885j6127j4483j2862j1276r051o058k993n51J014J854K528
60521A294133L662M983N245L977K720L351N505O867N989L704J812J441K717M864
60507A350970O343N999M482L784M973P073Q377Q140O848N579N306O093O798O331
60493A437096N311N462P172Q805Q989Q527R162J1316J3977J6306J8401K0767K3929
$$ plain form
60584 1103020 1110964 1119682 1127154 1132066 1135773 1140791 1147896 1155530 1161807 1166428 1170709 1176313 1184099 1193868
60570 1193868 1204950 1216825 1229273 1242309 1256316 1271947 1289317 1307436 1325076 1342185 1359722
60559 1359722 1378004 1396022 1412765 1428524 1444196 1459664 1473541 1484558 1492788 1499344 1504929 1508782
60547 1508782 1509234 1505525 1498898 1491587 1484808 1478082 1470300 1460861 1449796 1437442 1424215 1410274 1395294
60534 1395294 1379023 1362138 1346011 1331528 1318666 1307390 1298339 1292281 1289288 1288737 1289751 1291605 1294133
60521 1294133 1297795 1302778 1308023 1312000 1314720 1318071 1323576 1330443 1336432 1340136 1341948 1343389 1346106 1350970
60507 1350970 1357313 1363312 1367794 1371578 1376551 1383624 1392001 1400141 1406989 1412568 1417874 1423967 1430765 1437096
60493 1437096 1442407 1447869 1455041 1463846 1472835 1481362 1490524 1501840 1515817 1532123 1550524 1571291 1595220
60480A595220K8356L4055M0229M5907N0780N4880N7600N7793N4886M9248M1408
60469B110362L1653K0678R825r0r534j8839k6316k9169k6727k1513j6353j1416
60457B012561n301J967Q779J4418J9659K4615K7952K9153K9934L2162L5534L8517
60445B269950M0699M3009M6432N1682N9301O8804P8615Q8157R9187J13439J29878
60434C089153J46172J62184J79592J98287K15816K31041K46093K63541K83481
60425E015360L04704L27362L52760L80926M09102M31842M41743M31062L94299
60416H489160L29999K40421J30413P197j19458k38197l38527m13747m62683m88493
60406G136085m95085m84891m60560m27495l92368l58871l26652k94681k63935
$$ plain form
60480 1595220 1623576 1657631 1697860 1743767 1794547 1849427 1907027 1964820 2019706 2068954 2110362
60469 2110362 2142015 2162693 2172518 2172428 2162894 2144055 2117739 2088570 2061843 2040330 2023977 2012561
60457 2012561 2007260 2009227 2018006 2032424 2052083 2076698 2104650 2133803 2163737 2195899 2231433 2269950
60445 2269950 2310649 2353658 2400090 2451772 2511073 2579877 2658492 2746649 2845836 2959275 3089153
60434 3089153 3235325 3397509 3577101 3775388 3991204 4222245 4468338 4731879 5015360
60425 5015360 5320064 5647426 6000186 6381112 6790214 7222056 7663799 8094861 8489160
60416 8489160 8819159 9059580 9189993 9197190 9077732 8839535 8501008 8087261 7624578 7136085
60406 7136085 6641000 6156109 5695549 5268054 4875686 4516815 4190163 3895482 3631547
60397C631547k36195k12172j91855j75088j60631j46100j30370j15062j02372
60388B161702r2310q3352p4822o7236o0895n5663n1636m8751m6057m2503l8183
60377A500294l3939l0283k7608k6590k7062k7172k5228k1951j9429j8217j7069
60366A225746j5316j3643j2444j1222j0027r754j0323j0137q251n852m555m299
60354A109923l928l052k169j578j126o49J64J780L808M640L317J382J412L664
60340A117588N645N463M290M527O431P952P619O261N499N582N507M843M378M834
60326A196419N710N869M984L816L050K432J282m57k092k944k916k312j585j241
60312A210015j523j950j640m24O87O43k33o23J91J606K635K993L149L765N188
$$ plain form
60397 3631547 3395352 3183180 2991325 2816237 2655606 2509506 2379136 2264074 2161702
60388 2161702 2069392 1986040 1911218 1843982 1783087 1727424 1675788 1627037 1580980 1538477 1500294
60377 1500294 1466355 1436072 1408464 1381874 1354812 1327640 1302412 1280461 1261032 1242815 1225746
60366 1225746 1210430 1196787 1184343 1173121 1163094 1153340 1143017 1132880 1124629 1118777 1114222 1109923
60354 1109923 1105995 1102943 1100774 1099196 1098070 1097421 1097585 1099365 1103173 1107813 1111130 1112512 1113924 1117588
60340 1117588 1123233 1128696 1132986 1137513 1143944 1151896 1159515 1165776 1171275 1176857 1182364 1187207 1191585 1196419
60326 1196419 1202129 1207998 1212982 1216798 1219848 1222280 1223562 1223105 1221013 1218069 1215153 1212841 1211256 1210015
60312 1210015 1208492 1206542 1204902 1204478 1205165 1205808 1205575 1204952 1205143 1206749 1209384 1212377 1215526 1219291 1224479
60297A224479P023Q297Q524Q523R331J0374R901P573N433N545P702J0266J2238
60284A335209J3362J3162J1515R634Q941R053Q337O342M259K959K060J197O22
60271A426652J86p84j885j366J501M899O466O077N421N453N345L837O62l335o821
60256A452308q741q965q263p433o748o201n764n089l668j810q21j455k768l186
60242A381396k321r86J72J002J174M11m62J06K305M179L794J716K88O48J577J541
60226A396540Q17Q06J927L335M454N604O956Q017Q545R045R832J0541J1148J2470
60212A490037J4760J6740J7082J6099J4926J3971J3451J4462J7640K1397K3564
60201A674129K4579K6917L1247L5289L7154L7781L9285M2598M7541N3562N9462
$$ plain form
60297 1224479 1231502 1239799 1248323 1256846 1266177 1276551 1286452 1294025 1299458 1305003 1312705 1322971 1335209
60284 1335209 1348571 1361733 1373248 1382882 1391823 1400876 1409213 1415555 1419814 1422773 1424833 1426030 1426652
60271 1426652 1426838 1426054 1424169 1422803 1424304 1429203 1435669 1441746 1447167 1452620 1457965 1461802 1462464 1459129 1452308
60256 1452308 1443567 1434602 1426339 1418906 1412158 1405957 1400193 1395104 1391436 1389626 1388805 1387350 1384582 1381396
60242 1381396 1379075 1378089 1378261 1379263 1380437 1380848 1380386 1380492 1382797 1386976 1390770 1392486 1392774 1393422 1394999 1396540
60226 1396540 1397357 1398163 1400090 1403425 1407879 1413483 1420439 1428456 1437001 1446046 1455878 1466419 1477567 1490037
60212 1490037 1504797 1521537 1538619 1554718 1569644 1583615 1597066 1611528 1629168 1650565 1674129
60201 1674129 1698708 1725625 1756872 1792161 1829315 1867096 1906381 1948979 1996520 2050082 2109544
60190B109544O3873O7130P1250P7168Q3551Q9382R5842J04061J12618J19382J24887
60179C118688J31619J40417J49505J56865J61891J64742J65569J64658J62201
60170D516155J57838J51113J42184J31244J17821J01694Q4067O6554M9365L1852
60160E549887J4588n90j2605k1882k8953l3608l5723l5668l3468k8565k0925j1449
60148E301039q84J0947K4344L8863N3660O8296Q2759R7110J11260J24865J37221
60137F049480J47576J55456J60371J61377J57611J49309J37697J23685J07148
60128G349710Q7718O5849M2834J9893k507k4512m6015o6022q2994r5825j04129
60117G144000j07788j06876j02169r4852q5268p2696n6928l9354k1762m680J2340
$$ plain form
60190 2109544 2173417 2240547 2311797 2388965 2472516 2561898 2657740 2761801 2874419 2993801 3118688
60179 3118688 3250307 3390724 3540229 3697094 3858985 4023727 4189296 4353954 4516155
60170 4516155 4673993 4825106 4967290 5098534 5216355 5318049 5402116 5468670 5518035 5549887
60160 5549887 5564475 5563885 5551280 5529398 5500445 5466837 5431114 5395446 5361978 5333413 5312488 5301039
60148 5301039 5300155 5311102 5335446 5374309 5427969 5496265 5579024 5676134 5787394 5912259 6049480
60137 6049480 6197056 6352512 6512883 6674260 6831871 6981180 7118877 7242562 7349710
60128 7349710 7437428 7503277 7546111 7566004 7563497 7538985 7492970 7426948 7343954 7248129 7144000
60117 7144000 7036212 6929336 6827167 6732315 6647047 6574351 6517423 6478069 6456307 6451627 6463967
60106F463967K9460M6373O2833P8283R1361J00804J06641J09530J09276J04973
60096G303501R6560Q5170P1926N7343M1940K6634J2444M37q073j2111j1959q806
60084G655006l399M594J5975L1309N0545P2736R6365J20577J45759J72310J99466
60073H561243K26278K53344K82262L13486L45651L76985M06449M33643M58502
60064A1657843M80918M99617N11801N15182N10208M98918M81638M56368M21606
60055A6034099L78071L27211K69735K06482J39301O9802j732p4944j47585k16178
60045A6984262k77935l31253l74848m07668m29463m40589m41186m31213m11323
60036A3438784l83237l49153l10936k69744k26279j81574j37390r5444n6250j9456
$$ plain form
60106 6463967 6493427 6539800 6602633 6680916 6772277 6873081 6979722 7089252 7198528 7303501
60096 7303501 7400061 7485231 7557157 7614500 7656440 7683074 7695518 7695955 7687882 7675771 7663812 7655006
60084 7655006 7651607 7656201 7672176 7703485 7754030 7826766 7923131 8043708 8189467 8361777 8561243
60073 8561243 8787521 9040865 9323127 9636613 9982264 10359249 10765698 11199341 11657843
60064 11657843 12138761 12638378 13150179 13665361 14175569 14674487 15156125 15612493 16034099
60055 16034099 16412170 16739381 17009116 17215598 17354899 17424701 17422969 17348025 17200440 16984262
60045 16984262 16706327 16375074 16000226 15592558 15163095 14722506 14281320 13850107 13438784
60036 13438784 13055547 12706394 12395458 12125714 11899435 11717861 11580471 11485027 11428777 11409321
60026A1409321J4452M3631O6485Q3015R3728R7904R4134Q2472O5011M4033K0407
60015A2114593n645l2929n9329q3428j05315j25602j44339j61331j76947j91644
60005A1028084k04864k15330k22621k27529k30572k30926k27384k19641k08064
59996I041153j92926j74667j54291j32760j10364q7274o3992m0676j6804P468
59986H074867L0608N1559P1426R1649J11117J27044J38375J46095J50036J47898
59976I140674J38455J23682J06225Q6279O2664L5749P433k1336n0974q0989j08882
59965I438980j32156j50546j65490j77602j85553j87559j83509j75056j63751
59956G917758j49754j32616j12652r1005o8690m6224k3884j755K0308M2296O3981
$$ plain form
60026 11409321 11423773 11467404 11533889 11616904 11710632 11808536 11902670 11985142 12050153 12094186 12114593
60015 12114593 12108948 12076019 12016690 11933262 11827947 11702345 11558006 11396675 11219728 11028084
60005 11028084 10823220 10607890 10385269 10157740 9927168 9696242 9468858 9249217 9041153
59996 9041153 8848227 8673560 8519269 8386509 8276145 8188871 8124879 8084203 8067399 8074867
59986 8074867 8105475 8157034 8228460 8320109 8431226 8558270 8696645 8842740 8992776 9140674
59976 9140674 9279129 9402811 9509036 9595315 9657979 9693728 9701161 9679825 9628851 9547862 9438980
59965 9438980 9306824 9156278 8990788 8813186 8627633 8440074 8256565 8081509 7917758
59956 7917758 7768004 7635388 7522736 7431731 7363041 7316817 7292933 7291178 7311486 7353782 7417763
59945G417763Q5648J08129J31338J53557J73273J90989K07710K22227K31680K34638
59935I156952K31568K22330K05533J81367J52970J23532R3300O0731K5505j1013
59925A0442775m7331q2329j14669j42869j65845j82623j92047j93643j88393j77915
59915H955111j63184j44632j22958r9019p3390m6795k0592M059K7278N0084P2939
59904H438901R5136J15323J32228J45261J54715J61184J64549J64140J60067J53571
59894I885075J45563J35801J24201J12050J00945R1165Q2180P4291O8687O6179
59884A0886137O6936P1341Q0154R3791J12226J35513J63687J96204K32029K70253
59874A2308271L10079L50433L90198M28544M64253M94913N17575N30065N30816
$$ plain form
59945 7417763 7503411 7611540 7742878 7896435 8069708 8260697 8468407 8690634 8922314 9156952
59935 9156952 9388520 9610850 9816383 9997750 10150720 10274252 10367552 10428283 10453788 10442775
59925 10442775 10395444 10313115 10198446 10055577 9889732 9707109 9515062 9321419 9133026 8955111
59915 8955111 8791927 8647295 8524337 8425318 8351928 8305133 8284541 8288600 8315878 8365962 8438901
59904 8438901 8534037 8649360 8781588 8926849 9081564 9242748 9407297 9571437 9731504 9885075
59894 9885075 10030638 10166439 10290640 10402690 10503635 10594800 10676980 10751271 10819958 10886137
59884 10886137 10953073 11024414 11104568 11198359 11310585 11446098 11609785 11805989 12038018 12308271
59874 12308271 12618350 12968783 13358981 13787525 14251778 14746691 15264266 15794331 16325147
59865A6325147N17513M87035M37243L68412K82907J84240P6841l3833j41786k41351
59855A8262368l28046l99189m53932m92450n15036n22166n15322m97158m70591
59846A4068478m37841m00394l59531l16629k72841k28610j83752j38344r3525
59837A1637011n0942j1244K6286O2244R5706J24923J48934J67579J79991J84115
59827A2564603J78130J61738J35554R9791N4324J21o0015j22368j83710k41526
59817A2586642k93253l36216l68839l91584m06084m13294m12930m04793l90095
59808I169554l71124l49793l26907l02660k77519k52515k28700k06419j85145
59799F668772j64183j43540j24082j06906r2632q1150p1963o4862o0251n8422
$$ plain form
59865 16325147 16842660 17329695 17766938 18135350 18418257 18602497 18679338 18645505 18503719 18262368
59855 18262368 17934322 17535133 17081201 16588751 16073715 15551549 15036227 14539069 14068478
59846 14068478 13630637 13230243 12870712 12554083 12281242 12052632 11868880 11730536 11637011
59837 11637011 11586069 11574825 11601111 11663355 11759061 11883984 12032918 12200497 12380488 12564603
59827 12564603 12742733 12904471 13040025 13139816 13194140 13194261 13134246 13011878 12828168 12586642
59817 12586642 12293389 11957173 11588334 11196750 10790666 10377372 9964442 9559649 9169554
59808 9169554 8798430 8448637 8121730 7819070 7541551 7289036 7060336 6853917 6668772
59799 6668772 6504589 6361049 6236967 6130061 6037429 5956279 5884316 5819454 5759203 5700781
59789E700781n8378n8020n6004n2915m9993m7176m3477l8962l5084l2800l1548
59778E196424l0643l0699l2836l7150m2783m9002n5212o0133o2094o0640n7155
59767D678077n3335m9252m3604l5843k7444k0525j5585j1362o652j409M093J0044
59755D427203J6572K3448L1039M0405N1205O0481O5343O6637O8197P2346P7685
59744E000561Q1586Q3118Q2659Q0135P5141O8292O1101N4569M8588M2815L7650
59733E716215L4084L2744L3404L5775M0567M8909O0435P3076Q5498R8885J15149
59722F374741J34334J55164J77412K01876K28465K56246K85279L16352L48925
59713H478794L81311M12986M44216M72485M91269M93164M72529M24982L47917
$$ plain form
59789 5700781 5642403 5584383 5528379 5475464 5425471 5378295 5334818 5295856 5260772 5227972 5196424
59778 5196424 5165781 5135082 5102246 5065096 5022313 4973311 4918099 4857966 4795872 4735232 4678077
59767 4678077 4624742 4575490 4531886 4496043 4468599 4448074 4432489 4421127 4414475 4413066 4417159 4427203
59755 4427203 4443775 4467223 4498262 4538667 4589872 4650353 4715696 4782333 4850530 4922876 5000561
59744 5000561 5082147 5165265 5247924 5328059 5403200 5471492 5532593 5587162 5635750 5678565 5716215
59733 5716215 5750299 5783043 5816447 5852222 5892789 5941698 6002133 6075209 6160707 6259592 6374741
59722 6374741 6509075 6664239 6841651 7043527 7271992 7528238 7813517 8129869 8478794
59713 8478794 8860105 9273091 9717307 10189792 10681061 11174225 11646754 12071736 12419653
59704A2419653K44380J25095M341j05991j98212k67690l12909l35953l40721l30661
59694A0901332l09117k80370k48161k13612j76518j38180j01147o6536l3558j705
59684I332428K8477N6997Q5076J13586J42123J70204J98257K26823K55713K84669
59674A0894353L14343L45882L79677M15139M51732M89909N30529N73486O17661
59665A5012711O62677P09806P60052Q11934Q62608R10645R55795R96116J027685
59656B2710029J047839J056582J053908J038346J009834R72145R30514Q88544
59648C0707741Q49450Q18408Q00387P95863Q00817Q10651Q22055Q31516Q34333
59639C8071221Q25684Q01463P58444O95216O13069N14888M03908K84854J65258
$$ plain form
59704 12419653 12664033 12789128 12793469 12687478 12489266 12221576 11908667 11572714 11231993 10901332
59694 10901332 10592215 10311845 10063684 9850072 9673554 9535374 9434227 9367691 9334133 9332428
59684 9332428 9360905 9417902 9502978 9616564 9758687 9928891 10127148 10353971 10609684 10894353
59674 10894353 11208696 11554578 11934255 12349394 12801126 13291035 13821564 14395050 15012711
59665 15012711 15675388 16385194 17145246 17957180 18819788 19730433 20686228 21682344 22710029
59656 22710029 23757868 24814450 25868358 26906704 27916538 28888683 29819197 30707741
59648 30707741 31557191 32375599 33175986 33971849 34772666 35583317 36405372 37236888 38071221
59639 38071221 38896905 39698368 40456812 41152028 41765097 42279985 42683893 42968747 43134005
59630D3134005N3351m5468j28624j93592k37247k57823k55589k31797j88738j30450
59620D1518028o0893J8812J09321K09257L14913M23847N35932O49758P60607Q63427
59610D5343009R55658J035038J096050J130409J130141J088567R99339Q57206
59602E3635417O60990M15756J32611j72885m82833p79366j046621j271917j446752
59593D9644400j567878j637366j660910j645462j597979j525753j437519j343736
59585C7227797j255182j180774j126941j098504j098248j123848j165834j210413
59577B7968053j245175j262518j259522j236866j197806j146303j085279j017208
59569A8517376r45704q74843q06750p41368o78803o20427n67293n18943m74451
$$ plain form
59630 43134005 43187356 43141888 43013264 42819672 42582425 42324602 42069013 41837216 41648478 41518028
59620 41518028 41457135 41475947 41585268 41794525 42109438 42533285 43069217 43718975 44479582 45343009
59610 45343009 46298667 47333705 48429755 49560164 50690305 51778872 52778211 53635417
59602 53635417 54296407 54712163 54844774 54671889 54189056 53409690 52363069 51091152 49644400
59593 49644400 48076522 46439156 44778246 43132784 41534805 40009052 38571533 37227797
59585 37227797 35972615 34791841 33664900 32566396 31468148 30344300 29178466 27968053
59577 27968053 26722878 25460360 24200838 22963972 21766166 20619863 19534584 18517376
59569 18517376 17571672 16696829 15890079 15148711 14469908 13849481 13282188 12763245 12288794
59560A2288794m33589l96339l62311l31125l02566k76014k50627k26503k04819
59551I504901j86535j71700j60160j52020j47054j44605j44296j46105j49518
59542H102908j53439j57049j60005j61755j61633j59674j56476j52238j46739
59533F693900j40049j32322j23198j12588j01588r1243q0789o8920n6442m5536
59523E741225l6232k6086j4026k386O184J2006J7325K3396K9904L6107M1260M4804
59511E873481M7174M9692N2949N6337N9760O4479P1286P9153Q6940R5319J05609
59500F642179J17535J29604J41244J53321J66813J82028J98905K17217K36552
59491H185398K56706K77797K99499L20640L40056L57528L73472L88081M00998
$$ plain form
59560 12288794 11855205 11458866 11096555 10765430 10462864 10186850 9936223 9709720 9504901
59551 9504901 9318366 9146666 8986506 8834486 8687432 8542827 8398531 8252426 8102908
59542 8102908 7949469 7792420 7632415 7470660 7309027 7149353 6992877 6840639 6693900
59533 6693900 6553851 6421529 6298331 6185743 6084155 5992912 5912123 5843203 5786761 5741225
59523 5741225 5704993 5678907 5664881 5662495 5668679 5680685 5698010 5721406 5751310 5787417 5828677 5873481
59511 5873481 5920655 5970347 6023296 6079633 6139393 6203872 6275158 6354311 6441251 6536570 6642179
59500 6642179 6759714 6889318 7030562 7183883 7350696 7532724 7731629 7948846 8185398
59491 8185398 8442104 8719901 9019400 9340040 9680096 10037624 10411096 10799177 11200175
59482A1200175M11193M16889M16358M09345L97145L81067L61411L37990L10587
59473A4642160K78627K41858K02094J63204J28287R7638P0175M5988K6551J3058
59463A5909640N616L778P249J6334L1982N4743Q3173J13793J43028J68554J88477
59452A6726367K00045J99992J85767J56303J12250N5769j0648q5273j66259k49778
59442A7124535l30426m03796m67376n18704n54685n73961n78536n71803n55922
59433A2569326n32105n02080m67680m29793l89274l48337l09586k73859k40127
59424I076485k07257j74985j43461j12937q3821n6277k9891m104K1367M6892P3035
59413H405046R9606J25334J49340J72437J95993K19709K41394K59065K72733K83735
$$ plain form
59482 11200175 11611368 12028257 12444615 12853960 13251105 13632172 13993583 14331573 14642160
59473 14642160 14920787 15162645 15364739 15527943 15656230 15753868 15824043 15870031 15896582 15909640
59463 15909640 15915256 15919034 15926283 15942617 15974599 16029342 16112515 16226308 16369336 16537890 16726367
59452 16726367 16926412 17126404 17312171 17468474 17580724 17636493 17625845 17540572 17374313 17124535
59442 17124535 16794109 16390313 15922937 15404233 14849548 14275587 13697051 13125248 12569326
59433 12569326 12037221 11535141 11067461 10637668 10248394 9900057 9590471 9316612 9076485
59424 9076485 8869228 8694243 8550782 8437845 8354024 8297747 8267856 8263752 8285119 8332011 8405046
59413 8405046 8504652 8629986 8779326 8951763 9147756 9367465 9608859 9867924 10140657 10424392
59403A0424392K92278K95794K90318K73892K47901K14349J72835J21802O2144
59394A2395705k449o8539j33985j95888k50322k95312l31892l60887l80849l90745
59384I984837l92680l89786l82932l71542l56305l38795l19386k97890k75712
59375F859809k55095k36384k17999j99151j80840j64150j48906j34369j20025
59366E202890j05638r1477p8429o7066n6745m6404l5914k5922j6749q294n54O561
59354D676259J3555K0908K8790L7403M6455N3738N5965N2345M6195M1739M0567
59343E113919M2394M7428N5772O5850P6051Q7147J00439J14018J23808J28664
59333E955490J32004J37676J46453J57340J70347J86528K06468K29835K55850
$$ plain form
59403 10424392 10716670 11012464 11302782 11576674 11824575 12038924 12211759 12333561 12395705
59394 12395705 12393256 12324717 12190732 11994844 11744522 11449210 11117318 10756431 10375582 9984837
59384 9984837 9592157 9202371 8819439 8447897 8091592 7752797 7433411 7135521 6859809
59375 6859809 6604714 6368330 6150331 5951180 5770340 5606190 5457284 5322915 5202890
59366 5202890 5097252 5005775 4927346 4860280 4803535 4757131 4721217 4695295 4678546 4670252 4669698 4676259
59354 4676259 4689814 4710722 4739512 4776915 4823370 4877108 4933073 4985418 5031613 5073352 5113919
59343 5113919 5156313 5203741 5259513 5325363 5401414 5488561 5589000 5703018 5826826 5955490
59333 5955490 6087494 6225170 6371623 6528963 6699310 6885838 7092306 7322141 7577991
59324G577991K83573L12365L42494L74787M09570M46571M85806N27646N71917
59315A1332720O17559O63184P07405P48674P85333Q15433Q36073Q43736Q36422
59306A8186539Q14934P81251P36390O81285O19036N54450M91297M31156L74516
59297B3670854L21289K70205K19310J67423J14100N8277j614o6050j34208k05328
59287B4414258k78900l53190m24881m90708n48622n97483o36971o68103o92611
59278A9722789p11252p23474p28823p27560p19678p04523o82091o53914o22109
59269A3449365n88041n52272n15326m78084m41523m05975l70707l34784k98764
59260I463889k64753k34298k07025j81966j59031j37939j17042r5071p3438n4729
$$ plain form
59324 7577991 7861564 8173929 8516423 8891210 9300780 9747351 10233157 10760803 11332720
59315 11332720 11950279 12613463 13320868 14069542 14854875 15670308 16506381 17350117 18186539
59306 18186539 19001473 19782724 20519114 21200399 21819435 22373885 22865182 23296338 23670854
59297 23670854 23992143 24262348 24481658 24649081 24763181 24821458 24819844 24753794 24619586 24414258
59287 24414258 24135358 23782168 23357287 22866579 22317957 21720474 21083503 20415400 19722789
59278 19722789 19011537 18288063 17559240 16831680 16112002 15407479 14725388 14071474 13449365
59269 13449365 12861324 12309052 11793726 11315642 10874119 10468144 10097437 9762653 9463889
59260 9463889 9199136 8964838 8757813 8575847 8416816 8278877 8161835 8066764 7993326 7938597
59250G938597l9148k4371q838O751K1335L4930M7646N9024O9137P8927Q8683R7229
59238H369902J03227J06342J06680J04167R9090R2400Q4799P6123O6046N4898
59228I263674M3622L3427K5507K0538J8352J8594K1469K7307L5744M6052N7878
59217I612164P1014Q4936R9362J14552J30077J43959J53943J58835J57573J48399
59207A0874814J30757J06999Q0187N1033J9223j3193m2436o6888q7619j05059
59197A0947818j17846j25306j28350j27293j21308j10976r8851q6428p2871n7956
59187I900633m4005l3278k5341j8680j3340j0271r346r707j1026j3074j4944j5936
59175I681685j6350j6226j4195q631P49J3371K8995M7618O9107R3730J22170J54200
$$ plain form
59250 7938597 7899449 7875078 7866240 7872991 7894326 7929256 7976902 8035926 8105063 8183990 8272673 8369902
59238 8369902 8473129 8579471 8686151 8790318 8889408 8981808 9066607 9142730 9208776 9263674
59228 9263674 9307296 9340723 9366230 9386768 9405120 9423714 9445183 9472490 9508234 9554286 9612164
59217 9612164 9683178 9768114 9867476 9982028 10112105 10256064 10410007 10568842 10726415 10874814
59207 10874814 11005571 11112570 11192757 11243790 11263013 11249820 11207384 11140496 11052877 10947818
59197 10947818 10829972 10704666 10576316 10449023 10327715 10216739 10117888 10031460 9958589 9900633
59187 9900633 9856628 9823350 9798009 9779329 9765989 9755718 9746372 9736665 9725639 9712565 9697621 9681685
59175 9681685 9665335 9649109 9634914 9626283 9627032 9640403 9669398 9717016 9786123 9879853 10002023 10156223
59163A0156223J88246K23086K59005K96495L34633L71349M04321M30918M48231
59154A3112507M54002M46750M24695L85808L29659K58086J73553P8173k4988j31049
59144A5507196k34734l31537m17139m87553n41007n78297o00271o06617n98235
59135A1111806n79014n53457n23730m90545m55401m20116l85272l51169l19490
59126G033612k91995k68086k45623k23759k03271j84457j66532j49157j33046
59117E167686j18811j06307r5151q4926p5012o4985n5023m5252l5347k5522j7005
59106D444345j0449m642J900Q970J5581K2054K9345L6994M3758N0015N7451O6213
59094D761535P4345Q0516Q5613R1026R6981J03267J10203J17791J24872J30169
$$ plain form
59163 10156223 10344469 10567555 10826560 11123055 11457688 11829037 12233358 12664276 13112507
59154 13112507 13566509 14013259 14437954 14823762 15153421 15411507 15585060 15663233 15638245 15507196
59144 15507196 15272462 14940925 14523786 14036233 13495226 12916929 12316658 11710041 11111806
59135 11111806 10532792 9979335 9455605 8965060 8509659 8089543 7704271 7353102 7033612
59126 7033612 6741617 6473531 6227908 6004149 5800878 5616421 5449889 5300732 5167686
59117 5167686 5048875 4942568 4847417 4762491 4687479 4622494 4567471 4522219 4486872 4461350 4444345
59106 4444345 4433896 4429254 4431154 4440124 4455705 4477759 4507104 4544098 4587856 4637871 4695322 4761535
59094 4761535 4835880 4916396 5002009 5093035 5190016 5293283 5403486 5521277 5646149 5776318
59084E776318J33654J36090J37736J38156J36858J33527J27940J20047J10010
59075F950336R7949Q4013O8834N3538L9015K5610J3669L849l409q170j0375r451
59063G305408n141J661R721J8890K9877M2688N6243P0022Q4936J01707J19106
59052G835118J35140J49757J64957J82000J99761K16287K30759K43318K54168
59043I611265K63758K72756K80595K84929K83638K76485K63622K43541K14297
59034A1994886J76186J31464Q1968K8833k5780p8892j28685j74542k15325k49617
59024A1540496k77634l00715l18763l30587l37069l41286l44482l44568l39979
59015H605413l32684l25497l18465l09875k99270k87446k74816k61706k49198
$$ plain form
59084 5776318 5909972 6046062 6183798 6321954 6458812 6592339 6720279 6840326 6950336
59075 6950336 7048285 7132298 7201132 7254670 7293685 7319295 7332964 7336813 7333404 7325234 7314859 7305408
59063 7305408 7300267 7301928 7311649 7330539 7360416 7403104 7459347 7529369 7614305 7716012 7835118
59052 7835118 7970258 8120015 8284972 8466972 8666733 8883020 9113779 9357097 9611265
59043 9611265 9875023 10147779 10428374 10713303 10996941 11273426 11537048 11780589 11994886
59034 11994886 12171072 12302536 12384504 12413337 12387557 12308665 12179980 12005438 11790113 11540496
59024 11540496 11262862 10962147 10643384 10312797 9975728 9634442 9289960 8945392 8605413
59015 8605413 8272729 7947232 7628767 7318892 7019622 6732176 6457360 6195654 5946456
59006E946456k37763k25998k12656j99011j87290j77384j67126j55423j43269
58997D240536j31884j21601j12616j05214r8993r3025q6953q1015p5157o9120
58987C264958o3340n8756n5709n3714n2157n0420m7764m3980l9985l6897l4591
58976B727645l1873k7890k2820j7451j2694r244p092n503l887k295q33P69K633
58963B589465M381N679O392O049M230J833O29R02Q90m80j826j563n87r41k627
58948B612426l555k290N54L478N391N921N488M995M795M321L117J470n84l629
58934B641898p374j0005j0323r502r314r594q933p008m548j711J649M681O302
58921B576218P050Q511J0991J3405J5396J7966K1651K5489K8192K9491L0045L0780
$$ plain form
59006 5946456 5708693 5482695 5270039 5071028 4883738 4706354 4539228 4383805 4240536
58997 4240536 4108652 3987051 3874435 3769221 3670228 3577203 3490250 3409235 3334078 3264958
58987 3264958 3201618 3142862 3087153 3033439 2981282 2930862 2883098 2839118 2799133 2762236 2727645
58976 2727645 2695772 2667882 2645062 2627611 2614917 2605673 2598581 2593078 2589191 2586896 2586063 2586832 2589465
58963 2589465 2593846 2599525 2605917 2611966 2616196 2618029 2618658 2619560 2620450 2619970 2618144 2616581 2615994 2615053 2612426
58948 2612426 2608871 2606581 2607135 2610613 2616004 2621925 2627413 2632408 2637203 2641524 2644641 2646111 2645527 2641898
58934 2641898 2634524 2624519 2614196 2604694 2595380 2585786 2576853 2569845 2565297 2563586 2565235 2569916 2576218
58921 2576218 2583268 2591779 2602770 2616175 2631571 2649537 2671188 2696677 2724869 2754360 2784405 2815185
58909B815185L2324L4594L7010L9463M2477M6002M8930N0595N1790N3397N5096
58898C306863N6469N8214O0870O3378O4568O5249O7138P0564P4809P9854Q5823
58887D053799R1497R5552R8898J03730J10587J18296J26377J35313J44611J53088
58877E231748J61333J71519J84229J97503K09649K21272K33896K48306K64904
58868G124359K83964L04723L25648L46447L68552L93076M19591M47627M77918
58859A0491905N11225N46986N84049O22115O61642P02924P45677P88988Q31409
58850A6486920Q71457R07989R39514R63385R76495R76383R60556R25323Q66875
58841B4874897P83686O76654N47333L97800K32496N8350j17408k88267m47445
$$ plain form
58909 2815185 2847509 2882103 2919113 2958576 3001053 3047055 3095985 3146580 3198370 3251767 3306863
58898 3306863 3363332 3421546 3482416 3545794 3610362 3675611 3742749 3813313 3888122 3967976 4053799
58887 4053799 4145296 4240848 4339746 4443476 4554063 4672359 4798736 4934049 5078660 5231748
58877 5231748 5393081 5564600 5748829 5946332 6155981 6377253 6611149 6859455 7124359
58868 7124359 7408323 7713046 8038694 8385141 8753693 9146769 9566360 10013987 10491905
58859 10491905 11003130 11550116 12134165 12756280 13417922 14120846 14866523 15655511 16486920
58850 16486920 17358377 18266366 19205880 20169265 21145760 22122143 23082699 24008022 24874897
58841 24874897 25658583 26335237 26882570 27280370 27512866 27571216 27453808 27165541 26718096
58832B6718096n88211p06432q01509q73964r23457r50139r56661r47527r26928
58823A9043268q97756q61874q20457p74704p26790o79574o35009n93449n54735
58814A2498920n18996m85971m54676m24535l96169l70493l47564l26791l07467
58805H866258k88631k69220k49158k29809k12709j98014j84623j71436j58199
58796F904459j45299j32990j20796j07892r4335q1339o9719n8558m6447l3713
58786F013371k2091j2187k673P837J9448L1987M5752O0333P3810Q4570R3564J03546
58774F497267J16065J30112J43851J56916J70468J85448K01608K18380K35851
58765H055966K54245K72977K91415L10452L32034L56751L83094M09765M37564
$$ plain form
58832 26718096 26129885 25423453 24621944 23747980 22824523 21874384 20917723 19970196 19043268
58823 19043268 18145512 17283638 16463181 15688477 14961687 14282113 13647104 13053655 12498920
58814 12498920 11979924 11493953 11039277 10614742 10218573 9848080 9500516 9173725 8866258
58805 8866258 8577627 8308407 8059249 7829440 7616731 7418717 7234094 7062658 6904459
58796 6904459 6759160 6626170 6505374 6397482 6303147 6221808 6152089 6093531 6047084 6013371
58786 6013371 5991280 5979093 5976420 5984257 6003705 6035692 6081444 6141777 6215587 6300157 6393721 6497267
58774 6497267 6613332 6743444 6887295 7044211 7214679 7400127 7601735 7820115 8055966
58765 8055966 8310211 8583188 8874603 9185055 9517089 9873840 10256934 10666699 11104263
58756A1104263M68161N02033N38628N77638O18849O61306P03755P45517P86066
58747A6706216Q24364Q59266Q89712R13471R26547R24924R05968Q67179Q05114
58738B4622761P17437O05177M71394L18775J50875k5088j99383l64136n14901
58729B5782911o48409p61078q50282r15343r56999r77221r79546r67974r45227
58720A7780832r13147q74394q32099p88074p43057o98424o55778o15128n75606
58711A1085125n38013n04377m74710m46449m17897l90217l65197l42775l21873
58702G283617l02161k83889k66811k50277k33881k17707k02290j88237j75271
58693E163093j62148j48356j35183j23970j14171j04697r6100q9415q3547p6384
$$ plain form
58756 11104263 11572424 12074457 12613085 13190723 13809572 14470878 15174633 15920150 16706216
58747 16706216 17530580 18389846 19279558 20193029 21119576 22044500 22950468 23817647 24622761
58738 24622761 25340198 25945375 26416769 26735544 26886419 26861331 26661948 26297812 25782911
58729 25782911 25134502 24373424 23523142 22607799 21650800 20673579 19694033 18726059 17780832
58720 17780832 16867685 15993291 15161192 14373118 13630061 12931637 12275859 11660731 11085125
58711 11085125 10547112 10042735 9568025 9121576 8703679 8313462 7948265 7605490 7283617
58702 7283617 6981456 6697567 6430756 6180479 5946598 5728891 5526601 5338364 5163093
58693 5163093 5000945 4852589 4717406 4593436 4479265 4374568 4278468 4189053 4105506 4029122
58683D029122o8115o0965n5738n1133m6517m2825m0387l8407l7067l7702m0282
58672C509984m2940m4683m6253m7902m8757m8993n0069n1898n2291n0426m8520
58661B977252m8827n1145n4363n8192o1886o3539o2441o0420n9308n8580n6937
58650B341614n4544n2239m9972m7514m5415m3906m2145l9680l7399l5926l4507
58639A858367l2605l1187l1093l1363l0541k8548k6243k4202k2841k2517k2594
58628A554633k1639j9438j7550j6978j6633j5085j2510r897p502n129k795l14
58616A409163K781O194Q745R797R849R393Q469P443O746N784L797J756J476K744
58602A494137L537L159K742K423Q44j995m307n532o924q298p516m337j489m36
$$ plain form
58683 4029122 3961007 3900042 3844304 3793171 3746654 3703829 3663442 3625035 3587968 3550266 3509984
58672 3509984 3467044 3422361 3376108 3328206 3279449 3230456 3180387 3128489 3076198 3025772 2977252
58661 2977252 2928425 2877280 2822917 2764725 2702839 2639300 2576859 2516439 2457131 2398551 2341614
58650 2341614 2287070 2234831 2184859 2137345 2091930 2048024 2005879 1966199 1928800 1892874 1858367
58639 1858367 1825762 1794575 1763482 1732119 1701578 1673030 1646787 1622585 1599744 1577227 1554633
58628 1554633 1532994 1513556 1496006 1479028 1462395 1447310 1434800 1424903 1417401 1412272 1409477 1409163
58616 1409163 1411944 1418138 1426883 1436680 1446529 1455922 1464391 1471834 1478580 1484364 1488161 1489917 1491393 1494137
58602 1494137 1497674 1500833 1503575 1505998 1506842 1504847 1500540 1495008 1488084 1479786 1472270 1467933 1466444 1466008
58588A466008P16L401O175Q080J1004J6041K0708K2749K3901K6747L0430L2845
58576A668805L4838L8621M3756M8169N1699N5441N8934O1329O4075O9175P5731
58565B270573Q1419Q6472R2952J00925J08629J15974J24682J35176J46313J58048
58555C421163J71516J86416K01067K15185K30028K45522K59662K71014K79421
58546E480994K83877K81919K71824K53634K27444J92412J48179R6172L9248j8972
58536G256731p4445j23794j65458j99164k24578k41323k49948k51710k47857k39893
58526E238561k29905k19397k08231j95713j82174j68530j54944j41092j27200
58517C611375j13811j01120q9429p9474p1442o4455n7865n2155m7671m3633l9407
$$ plain form
58588 1466008 1466724 1470125 1476300 1484380 1495384 1511425 1532133 1554882 1578783 1605530 1635960 1668805
58576 1668805 1703643 1742264 1786020 1834189 1885888 1941329 2000263 2061592 2125667 2194842 2270573
58565 2270573 2351992 2438464 2531416 2632341 2740970 2856944 2981626 3116802 3263115 3421163
58555 3421163 3592679 3779095 3980162 4195347 4425375 4670897 4930559 5201573 5480994
58546 5480994 5764871 6046790 6318614 6572248 6799692 6992104 7140283 7236455 7275703 7256731
58536 7256731 7182286 7058492 6893034 6693870 6469292 6227969 5978021 5726311 5478454 5238561
58526 5238561 5008656 4789259 4581028 4385315 4203141 4034611 3879667 3738575 3611375
58517 3611375 3497564 3396444 3307015 3227541 3156099 3091644 3033779 2981624 2933953 2890320 2850913
58506B850913l5611l2896l0660k8063k5294k2926k1151k0518k2067k5813l0497
58495B555417l5614m1961m9287n5320n8451n9576n9938n9147n6765n3909n1570
58484A973879m9118m6007m3084m0653l7307l2469k7964k5246k3119k0257j7705
58473A610950j6653j5903j4018j1994j1252j0937r840r120j0343j2525j3873j4863
58461A459629j6853j9132k0078j9886j9563j8759j7110j6019j6450j6742j5354
58450A263683j3926j4466j5415j3882j0329p547o219m874l135j809o73Q96K121
58437A174425K463L603O845J0196J1149J0706J1255J2264J1795J0651J0976J2086
58425A288414J1814J0717J0730J0801Q333M105J201l89l344p483r520q651p876
$$ plain form
58506 2850913 2815302 2782406 2751746 2723683 2698389 2675463 2654312 2633794 2611727 2585914 2555417
58495 2555417 2519803 2477842 2428555 2373235 2314784 2255208 2195270 2136123 2079358 2025449 1973879
58484 1973879 1924761 1878754 1835670 1795017 1757710 1725241 1697277 1672031 1648912 1628655 1610950
58473 1610950 1594297 1578394 1564376 1552382 1541130 1530193 1520353 1511233 1500890 1488365 1474492 1459629
58461 1459629 1442776 1423644 1403566 1383680 1364117 1345358 1328248 1312229 1295779 1279037 1263683
58450 1263683 1249757 1235291 1219876 1205994 1195665 1188118 1181899 1177025 1173890 1172081 1171408 1172304 1174425
58437 1174425 1176888 1180491 1187336 1197532 1208681 1219387 1230642 1242906 1254701 1265352 1276328 1288414
58425 1288414 1300228 1310945 1321675 1332476 1340809 1344914 1346115 1345726 1342382 1334899 1325379 1316728 1308852
58412A308852q922r855q897p117o250o529p441q179p371m736k665l651o698q917
58398A211624r646j0105j0252r410q785r652j0167p963m761m164n745n799l347
58385A111828q33N92J941K861J973N03J139L391M693N559Q576J2595J3465J0885
58371A179168Q919R016Q153N044K552K190J500j030l124k951j951j463n87Q65
58357A206301J290P83J738M406O000N827O934J0756J4416J5659J6360J8550K0699
58344A329719K0789J9841J9661J9611J8120J5231J1629P229K215k426o404j0151
58332A445064j2904j3194j1554j0060r084p380n254m172l463j243J292P77k679
58319A366146n122m683l584l426k927j497p58j101o21J282K918L863N663Q158
$$ plain form
58412 1308852 1299930 1290075 1281178 1274061 1267811 1261282 1253841 1245662 1238291 1233555 1230890 1227239 1220541 1211624
58398 1211624 1201978 1191873 1181621 1172211 1163426 1153774 1143607 1135644 1130883 1126719 1120974 1115175 1111828
58385 1111828 1110995 1111587 1113528 1116389 1118362 1118865 1120004 1123395 1128088 1133647 1142223 1154818 1168283 1179168
58371 1179168 1188087 1197103 1205256 1210300 1212852 1215042 1216542 1215512 1212388 1209437 1207486 1206023 1205436 1206301
58357 1206301 1207591 1208374 1210112 1214518 1220518 1226345 1233279 1244035 1258451 1274110 1290470 1309020 1329719
58344 1329719 1350508 1370349 1390010 1409621 1427741 1442972 1454601 1461830 1464045 1461619 1455215 1445064
58332 1445064 1432160 1418966 1407412 1397352 1388268 1380888 1375634 1371462 1367999 1366756 1368048 1368825 1366146
58319 1366146 1361024 1356341 1352757 1349331 1346404 1344907 1344149 1343048 1342427 1343709 1346627 1350490 1356153 1364311
58305A364311R152Q514Q652J0145J0995J0860J1790J4043J5521J5978J7351J9311
58293A516623J9262J7318J6579J7756J8334J7554J7148J6766J4076J0040Q420
58282A689876R333R074O993O387P649P124M154K660M037M960M050M300O828Q835
58268A776260R671J2373J7137K0029K0309K2055K6188K8161K6353K5430K8149
58257B012115L0920L0874L0390L1265L1206K9549K9608L1984L2443K9696K8028
58246B348078K8975K8112K3747K0932K2649K4917K4957K6255L0759L4067L3450
58235B646898L3095L6157L9194L9586M0797M5001M8233M8248M9439N4398N8543
58224C139589N8796N9418O3477O6935O7256O9272P5881Q1657Q2708Q4279R1067
$$ plain form
58305 1364311 1373463 1381977 1390629 1400774 1411769 1422629 1434419 1448462 1463983 1479961 1497312 1516623
58293 1516623 1535885 1553203 1569782 1587538 1605872 1623426 1640574 1657340 1671416 1681456 1689876
58282 1689876 1699209 1708283 1715276 1721663 1729312 1736436 1740590 1743250 1747287 1752247 1756297 1760597 1767425 1776260
58268 1776260 1785931 1798304 1815441 1835470 1855779 1877834 1904022 1932183 1958536 1983966 2012115
58257 2012115 2043035 2073909 2104299 2135564 2166770 2196319 2225927 2257911 2290354 2320050 2348078
58246 2348078 2377053 2405165 2428912 2449844 2472493 2497410 2522367 2548622 2579381 2613448 2646898
58235 2646898 2679993 2716150 2755344 2794930 2835727 2880728 2928961 2977209 3026648 3081046 3139589
58224 3139589 3198385 3257803 3321280 3388215 3455471 3524743 3600624 3682281 3764989 3849268 3940335
58213C940335R8514J01517J03418J08316J12659J12702J12449J15793J18669J17321
58203E041693J16430J20634J25932J27941J30671J38609J48176J55580J64831
58194F270497J79322J94152K05379K17989K35982K54162K68747K85726L09102
58185H421058L31709L48200L65951L91723M18753M39201M58231M82993N08986
58176A2166805N30789N55243N90026O30070O69241P14129P71638Q34509Q94009
58167A8356459R55147J024343J095060J161627J233484J318519J406660J488641
58159B8039940J576644J686789J815603J953103K102667K266749K430928K586382
58151D4458805K751311K946515L169027L414525L701948M046048M430785M845229
$$ plain form
58213 3940335 4038849 4140366 4243784 4352100 4464759 4577461 4689910 4805703 4924372 5041693
58203 5041693 5158123 5278757 5404689 5532630 5663301 5801910 5950086 6105666 6270497
58194 6270497 6449819 6643971 6849350 7067339 7303321 7557483 7826230 8111956 8421058
58185 8421058 8752767 9100967 9466918 9858641 10277394 10716595 11174826 11657819 12166805
58176 12166805 12697594 13252837 13842863 14472933 15142174 15856303 16627941 17462450 18356459
58167 18356459 19311606 20335949 21431009 22592636 23826120 25144639 26551299 28039940
58159 28039940 29616584 31303373 33118976 35072079 37174746 39441495 41872423 44458805
58151 44458805 47210116 50156631 53325658 56740183 60442131 64488179 68918964 73764193
58143G3764193N322001N903566O597042P401744Q348312R460534J0710635J2067621
58135A39575648J3554498J5198835J6982854J8940456K1266763K4220675K7927317
58128B77667046L2308681L6980933M0850230M1841662L7645686K7394972J2760929
58121E07450139k815838j6138074k5666649l1425667l4132043l4600947l3593097
58114C29077824l1731134k9395461k6767504k3981559k1183192j8482436j5947197
58107A61589341j3649445j1656330r971592q535320p287477o196233n229145m341615
58099I4722184l500452k677960j810702q17806K73556J208785J567015J028216
58091H9992836l55978k145163l784352m922552n507446n654122n497853n157192
$$ plain form
58143 73764193 79086194 84989760 91586802 98988546 107336858 116797392 127508027 139575648
58135 139575648 153130146 168328981 185311835 204252291 225519054 249739729 277667046
58128 277667046 309975727 346956660 387806890 429648552 467294238 494689210 507450139
58121 507450139 504634301 488496227 462829578 431403911 397271868 362670921 329077824
58114 329077824 297346690 267951229 241183725 217202166 196018974 177536538 161589341
58107 161589341 147939896 136283566 126311974 117776654 110489177 104292944 99063799 94722184
58099 94722184 91221732 88543772 86733070 85915264 86188820 87397605 88964620 89992836
58091 89992836 89636858 87491695 83707343 78784791 73277345 67623223 62125370 56968178
58083E6968178m741412m324049l921900l528124l151878k808905k497580k210868
58075B9783462j957319j747860j574549j422735j292557j189494j105068j025945
58067A8467935r52607q91369q37111p81049p27091o83745o47185o08079n68002
58058A1771697n33983n03696m70834m38671m13878l93140l69880l48160l35887
58049G963568l29716l20453l08410l00127k94612k85956k75251k67284k59371
58040E322388k45750k29225k16521k06008j91739j75729j64266j55601j43294
58031C594255j28742j18668j12893j06117r9184r7063r7770r4697q8562q5927
58021B564632q7004q5537q0129p5570p3300p0075o5727o3274o1692n7082n0465
$$ plain form
58083 56968178 52226766 47902717 43980817 40452693 37300815 34491910 31994330 29783462
58075 29783462 27826143 26078283 24503734 23080999 21788442 20598948 19493880 18467935
58067 18467935 17515328 16623959 15786848 15005799 14278708 13594963 12947778 12339699 11771697
58058 11771697 11237714 10734018 10263184 9824513 9410635 9017495 8647615 8299455 7963568
58049 7963568 7633852 7313399 7004989 6704862 6410250 6124294 5849043 5581759 5322388
58040 5322388 5076638 4847413 4630892 4424884 4233145 4057416 3893150 3737549 3594255
58031 3594255 3465513 3346845 3233952 3127835 3028651 2931588 2833818 2739121 2650559 2564632
58021 2564632 2477628 2392091 2311962 2236392 2163092 2093017 2027290 1964016 1902324 1845242 1794777
58010A794777m6324m4271m0225l4705l1805l1083k8656k5318k5276k7724k7884
57999A431506k5772k5783k8044k8137k5282k3180k2885k1997k0575k0725k0845
57988A168281j7450j2242j0161j1038j0355p715o998q386p903n169m293o329p739
57975A052503p048o566o915o114m587m989o662o173l614k460l219l184k310l036
57961I85626m378k685J464L589K849K814M267L882R74r51n89p28k499l614l588
57946I86433m859p484q395p209p078q435p764m225j661k055k533j184n46k756
57932I20249n883p778r430j2033j4379j5401j5944j6270j4956j1808q675o364
57920G81328l898j499p71j295p36R95J586Q12J112K947L722K379J066J199J641
$$ plain form
58010 1794777 1748453 1704182 1663957 1629252 1597447 1566364 1537708 1512390 1487114 1459390 1431506
57999 1431506 1405734 1379951 1351907 1323770 1298488 1275308 1252423 1230426 1209851 1189126 1168281
57988 1168281 1150831 1138589 1128428 1117390 1107035 1099320 1092322 1083936 1076033 1070864 1066571 1060242 1052503
57975 1052503 1045455 1038889 1031974 1025860 1021273 1016284 1009622 1003449 999835 997375 994156 990972 988662 985626
57961 985626 981248 978563 980027 983616 986465 989279 993546 997428 998402 997451 996862 996134 993635 990021 986433
57946 986433 981574 974090 965695 958486 951408 942973 935209 930984 929323 927268 924735 923551 923005 920249
57932 920249 914366 906588 897158 885125 870746 855345 839401 823131 808175 796367 787692 781328
57920 781328 777430 775931 775160 773865 773129 774124 775710 776522 777634 780581 784303 786682 787748 788947 790588
57905G90588J736K316K767R72k816n677o295n940m888k178O45J43l610o626o986
57890G54151o810p214o199l254j405k431m077m013k955j877O0K919M799N042N295
57875G32031N896M780J494j433k766m393p230r241r543j0540j3636j6494j6992
57862F51933j6426j6321j5492j2892j0206q857p305m168j204m43o27O18L151N320
57848E67081O708P598P486O341N628O204O833O436N984O581P460P492P012O651
57834F61495O060M975L908K806R44j158j921j524k052l972n261n048n162o694
57820F47396p965p582o719o612o368n115l890l595l377k670k515l117k616j19
57806E85136K426L238L249L873M606M823N519P104P797O485N080N574O582N494
$$ plain form
57905 790588 792324 794640 797407 798379 795563 789886 783591 777651 772763 770585 771230 771373 767763 761137 754151
57890 754151 747341 740127 733928 730674 729269 726838 722761 718748 715793 713916 713976 716895 721694 726736 732031
57875 732031 737927 742707 744201 742768 740002 735609 728379 719138 709595 699055 685419 668925 651933
57862 651933 635507 619186 603694 590802 580596 571739 564434 560266 559062 558619 557992 558610 561761 567081
57848 567081 573789 581387 588873 595214 600842 607046 613879 620315 626299 632880 640340 647832 654844 661495
57834 661495 667555 672530 676438 679244 680188 679030 677109 675585 673533 669561 664300 659252 654090 647396
57820 647396 639431 631849 625130 618518 612150 607035 603145 599550 596173 593503 590988 587871 585255 585136
57806 585136 587562 590800 594049 597922 602528 607351 612870 619974 627771 634256 639336 644910 651492 656986
57792F56986K510J4r96j615k717l994m830m943m536m431n272o327o372n766n905
57777F01806o521n806l574j867j916k887m193o246q282q483p232p192q981r945
57763E18681q520o632o181o473o792q164j0453j1003q663o108n706o024n050l806
57749D19106l818l856k424j003j473k516j942n17p5K88K539N687P138P067P911
57734D32112R985J0858R062N923L581K937L336L029P47k161k533M33L644M198
57720D85151K869J870J504J293J892L107K258k277p641r855r064q251q252p565
57706D47039o073n296n297m644l235k382k109j094P68K113K352K128J848J662
57692D27780K280L841M767L792K336K539L912M378L885M237N752O805O636O299
$$ plain form
57792 656986 659496 659510 658514 656899 654182 650188 645358 640415 635879 631448 626176 619849 613477 607711 601806
57777 601806 595285 589479 585905 584038 582122 579235 575042 568796 560514 552031 544799 537607 528626 518681
57763 518681 510161 503529 497348 490875 484083 475919 465466 454463 445800 439692 433986 427962 422912 419106
57749 419106 415288 411432 409008 408005 406532 404016 402074 401557 401482 401770 404309 409996 417134 424201 432112
57734 432112 442097 452955 462017 467940 471521 474458 477794 480823 481570 479409 476876 477309 480953 485151
57720 485151 488020 489890 491394 492687 494579 497686 499944 497667 490026 480171 471107 462856 454604 447039
57706 447039 440966 435670 430373 425729 422494 420112 418003 416909 417677 419790 422142 424270 426118 427780
57692 427780 430060 433901 438668 442460 444796 447335 451247 455625 459510 463747 469499 476304 482940 489239
57678D89239O758P994R862J2008J3247J2776J1621J1211J1226J0609R776R734
57666F16061R934R312Q602R257J0730J1413J1686J3418J6589J9139K0091K0647
57654G76879K1928K3735K5595K7150K7588K6595K5718K6968L0213L3602L6171
57643A082142L8339M0356M2238M4731M8437N2471N5767N8955O3017O7007O9545
57632A663005P1718P5827Q1769Q7499R2743R9378J08248J18331J29213J41629
57622B669360J55348J69186J83502K00074K18906K37571K54323K69538K83465
57613D641273K94745L01692L02926K96255K79521K53528K21720J85494J41438
57604F918592Q4715J4420o4613j43694k13353k66607l01169l18626l21732l13320
$$ plain form
57678 489239 495997 503991 513853 525861 539108 551884 563505 574716 585942 596551 606327 616061
57666 616061 625995 635307 643909 653166 663896 675309 686995 700413 717002 736141 756232 776879
57654 776879 798807 822542 848137 875287 902875 929470 955188 982156 1012369 1045971 1082142
57643 1082142 1120481 1160837 1203075 1247806 1296243 1348714 1404481 1463436 1526453 1593460 1663005
57632 1663005 1734723 1810550 1892319 1979818 2072561 2171939 2280187 2398518 2527731 2669360
57622 2669360 2824708 2993894 3177396 3377470 3596376 3833947 4088270 4357808 4641273
57613 4641273 4936018 5237710 5540636 5836891 6116412 6369940 6591660 6777154 6918592
57604 6918592 7003307 7017727 6953114 6809420 6596067 6329460 6028291 5709665 5387933 5074613
57594E074613k97044k76889k55178k32379k09072j86671j66034j46938j29370
57585C175038j13896j00377q7764p5589o4467n4717m5703l6891k8420k0375j2457
57574B534382m568L143J0808J8578K6099L3167M0417M8310N6244O3897P2670Q4033
57562B987180R7095J09698J21349J33167J45323J56709J67047J77085J86478J93219
57552D474350J95431J92170J82445J65079J39598J06186O5296J8796k9151p4293
57542E435907j14878j50452j79250j99199k10876k16872k18642k16419k11486
57533C717833k05463j97576j85928j71620j58477j48194j38835j28684j18502
57524B264554j09176j00226r1840q5591q1695p7910p2457o5945n9460n3065m7160
$$ plain form
57594 5074613 4777569 4500680 4245502 4013123 3804051 3617380 3451346 3304408 3175038
57585 3175038 3061142 2960765 2873001 2797412 2732945 2678228 2632525 2595634 2567214 2546839 2534382
57574 2534382 2529814 2532957 2543765 2562343 2588442 2621609 2662026 2710336 2766580 2830477 2903147 2987180
57562 2987180 3084275 3193973 3315322 3448489 3593812 3750521 3917568 4094653 4281131 4474350
57552 4474350 4669781 4861951 5044396 5209475 5349073 5455259 5520555 5539351 5510200 5435907
57542 5435907 5321029 5170577 4991327 4792128 4581252 4364380 4145738 3929319 3717833
57533 3717833 3512370 3314794 3128866 2957246 2798769 2650575 2511740 2383056 2264554
57524 2264554 2155378 2055152 1963312 1877721 1796026 1718116 1645659 1579714 1520254 1467189 1420029
57513A420029m2853l9839l6234l1675k8265k7174k6690k5056k2808k0773j8092
57502A100570j4235j0799r227q389o383l322n22J747L841N273N536N541O708R228
57488A085567J2301J5329J7905J9630K0799K2467K5161K8482L2268L6753M1257
57477A357919M4443M6467M9038N2629N5793N8172O1858O8295P5850Q2424Q8674
57466B041562R6595J06098J15080J22202J28006J33724J40205J47323J53293J55187
57456C339275J50942J40399J24004J01856P4624M4087J1873k1149n3547q2765
57446C829599j06781j25218j38205j45565j47877j46738j43160j37018j28770
57437B610267j19978j11405j02307r2563q3616p6191o9006o1023n3204m6692m0963
$$ plain form
57513 1420029 1377176 1337337 1301103 1269428 1241163 1213989 1187299 1162243 1139435 1118662 1100570
57502 1100570 1086335 1075536 1066309 1057920 1051537 1048215 1047693 1049440 1053281 1058554 1064090 1069631 1076339 1085567
57488 1085567 1097868 1113197 1131102 1150732 1171531 1193998 1219159 1247641 1279909 1316662 1357919
57477 1357919 1402362 1448829 1497867 1550496 1606289 1664461 1726319 1794614 1870464 1952888 2041562
57466 2041562 2138157 2244255 2359335 2481537 2609543 2743267 2883472 3030795 3184088 3339275
57456 3339275 3490217 3630616 3754620 3856476 3931100 3975187 3987060 3965911 3912364 3829599
57446 3829599 3722818 3597600 3459395 3313830 3165953 3019215 2876055 2739037 2610267
57437 2610267 2490289 2378884 2276577 2184014 2100398 2024207 1955201 1894178 1840974 1794282 1753319
57426A753319l5209k9889k5269k0080j3439o806k212O59M115R751J7098K4228
57414A676266K9209L1961L4984M0853M8804N5817O1240O7617P6254Q5056R2338
57403B300399R9718J09001J18674J26077J31025J34635J36324J34363J28047J17023
57393C535286R9972P6198M7340J5540j8523n3775q6700j13783j34748j51047j62575
57382C053185j68395j69414j67598j63394j56327j47256j37678j27704j16949
57373A698470j06598r8267r1677q5515p9565p3983o7949o1415n6665n5214n4461
57362H67161n0588m3945l8289l5306l3220l0630k8351k7054k5970k4605k3432
57351E05771k2461k1040j9261j7774j6414j4790j3746j4197j5051j4577j3275
$$ plain form
57426 1753319 1718110 1688221 1662952 1642872 1629433 1622627 1620415 1621074 1625189 1634940 1652038 1676266
57414 1676266 1705475 1737436 1772420 1813273 1862077 1917894 1979134 2046751 2123005 2208061 2300399
57403 2300399 2400117 2509118 2627792 2753869 2884894 3019529 3155853 3290216 3418263 3535286
57393 3535286 3635258 3711456 3758796 3774336 3755813 3702038 3615338 3501555 3366807 3215760 3053185
57382 3053185 2884790 2715376 2547778 2384384 2228057 2080801 1943123 1815419 1698470
57373 1698470 1591872 1493605 1401928 1316413 1236848 1162865 1094916 1033501 976836 921622 867161
57362 867161 816573 772628 734339 699033 665813 635183 606832 579778 553808 529203 505771
57351 505771 483310 462270 443009 425235 408821 394031 380285 366088 351037 336460 323185
57340C23185j2902j3286j2787j1542j1250j1874j1543r949q877q950q713p640
57328A93872p179p964q496p735o638o050n169l449k172k662m239n153m613l132
57314A19221j736j363k197l283l527l027k570k325k188k799m536o011n470l478
57300G4711k351k986m049m182l233j390R83K645K409Q54l65o88n46L11K258M045
57284F8426L919K411J755K674L858M526N142N661N440N046N688O795O618N374
57270A33333N157O396P078O173N161N330N911N947N899O354O893P058O983O613
57256B20286N869N561O381P200O499N218N625P583Q902R277J0502J2369J2144
57243C23416R258P013P858J0015J0722J0121R890J0316J0913J2083J4239J6692
$$ plain form
57340 323185 310283 296997 284210 272668 261418 249544 238001 228052 219175 210225 201512 193872
57328 193872 186693 178729 170233 162498 155860 149810 144641 141192 139020 136358 132119 126966 122353 119221
57314 119221 117485 116122 113925 110642 107115 104088 101518 99193 97005 94206 89670 83659 78189 74711
57300 74711 72360 69374 65325 61143 57910 56520 57503 60148 62557 63411 63046 62358 61812 62123 64381 68426
57284 68426 72345 74756 76511 79185 83043 87569 92711 98372 103812 108858 114546 121341 127959 133333
57270 133333 138490 144886 151964 158137 163298 168628 174539 180486 186385 192739 199632 206690 213673 220286
57256 220286 226155 231716 238097 245297 251796 257014 262639 270222 279124 288401 298903 311272 323416
57243 323416 332674 339687 347545 357560 368282 378403 388293 398609 409522 421605 435844 452536
57231D52536J8853K1127K3531K5216K6304K8336L1736L4835L6451L7563L9299
57220G75787M1226M2784M4304M5608M5599M4324M3262M2552M0256L5501K9958
57209A231161K4892J9276J2307N347l87n669j1075j5174j6683j6432j5568j3916
57197A198079j1595r930r083p246m031k007k751l868k450Q38L660N852Q633J1802
57183A175903J4569J7659K1984K6557L0207L3925L9119M4722M8513N0148N0615
57172A553921M9845M7114M2831L7855L1991K5146J8903J5249J4737J7421K4026
57161A879039L4425M6430N7913O8840P9635Q9363R7153J03565J08749J11216J10312
57150B786640J07707J04411R8737Q9610P9482P1072O3455N4366M4498L6369L0682
$$ plain form
57231 452536 471389 492516 516047 541263 567567 595903 627639 662474 698925 736488 775787
57220 775787 817013 859797 904101 949709 995308 1039632 1082894 1125446 1165702 1201203 1231161
57209 1231161 1256053 1275329 1287636 1292983 1292596 1286927 1275852 1260678 1243995 1227563 1211995 1198079
57197 1198079 1186484 1176554 1167471 1160225 1156194 1154187 1151436 1147568 1145118 1145956 1149616 1155468 1164101 1175903
57183 1175903 1190472 1208131 1230115 1256672 1286879 1320804 1359923 1404645 1453158 1503306 1553921
57172 1553921 1603766 1650880 1693711 1731566 1763557 1788703 1807606 1822855 1837592 1855013 1879039
57161 1879039 1913464 1959894 2017807 2086647 2166282 2255645 2352798 2456363 2565112 2676328 2786640
57150 2786640 2894347 2998758 3097495 3187105 3266587 3337659 3401114 3455480 3499978 3536347 3567029
57139C567029K6794K5106K5876K7337K8122L0066L5456M2995M9774N5626O2078
57128C976259O8331P2004P3015P3463P4259P4854P5253P5421P3909O9911O5363
57117D772042O1967N7960N1254M3959L9804L8462L6633L3600L1373L0041K7421
57106E224516K3124J8949J5414J1572Q034O481O446O095N843P645J1031J3483
57094E358633J4442J5531J7257J8902K0922K3909K5928K4494K0424J6063J0873
57083E567378K866o727j4756k1251k8861l7975m6893n6089o7755q2073r8486j19478
57071D989900j47841j81044k13476k43316k71823k97518l17504l33832l51832
57062B631714l72461l92794m13678m39989m73364B7705e28337o10602o76146p49934
$$ plain form
57139 3567029 3593823 3618929 3644805 3672142 3700264 3730330 3765786 3808781 3858555 3914181 3976259
57128 3976259 4044590 4116594 4189609 4263072 4337331 4412185 4487438 4562859 4636768 4706679 4772042
57117 4772042 4834009 4891969 4943223 4987182 5026986 5065448 5102081 5135681 5167054 5197095 5224516
57106 5224516 5247640 5266589 5282003 5293575 5301609 5308090 5314536 5320631 5326474 5334119 5345150 5358633
57094 5358633 5373075 5388606 5405863 5424765 5445687 5469596 5495524 5520018 5540442 5556505 5567378
57083 5567378 5570244 5563517 5548761 5527510 5498649 5460674 5413781 5357692 5289937 5207864 5109378 4989900
57071 4989900 4842059 4661015 4447539 4204223 3932400 3634882 3317378 2983546 2631714
57062 2631714 2259253 1866459 1452781 1012792 539428 27705 -528337 -1138939 -1815085 -2565019
57052b565019q32593r28018j037059j158822j297303j458347j641159j842222
57044a2760542k066255k323043k615127k941043l309912l739849m243255m828607
57036c8827633n514375o319946p237770q229646r250031j0257081j1215144j2125446
57028a08977072j3040621j3967054j4712476j4912268j4326039j3132309j1871650
57021b04939489j1063658j0870751j1063576j1188084j0735651r288827o684255
57014b75834291l107211J003930N185525R110132J2582887J5459136J7604429
57007b17995463J8920011J9388117J9096153J8219695J6965905J5512295J3983483
57000i5909804J2465918J1023363R695558Q497790P432422O497971N686818M983851
$$ plain form
57052 -2565019 -3397612 -4325630 -5362689 -6521511 -7818814 -9277161 -10918320 -12760542
57044 -12760542 -14826797 -17149840 -19764967 -22706010 -26015922 -29755771 -33999026 -38827633
57036 -38827633 -44342008 -50661954 -57899724 -66129370 -75379401 -85636482 -96851626 -108977072
57028 -108977072 -122017693 -135984747 -150697223 -165609491 -179935530 -193067839 -204939489
57021 -204939489 -216003147 -226873898 -237937474 -249125558 -259861209 -269150036 -275834291
57014 -275834291 -278941502 -277937572 -272752047 -263641915 -251059028 -235599892 -217995463
57007 -217995463 -199075452 -179687335 -160591182 -142371487 -125405582 -109893287 -95909804
57000 -95909804 -83443886 -72420523 -62724965 -54227175 -46794753 -40296782 -34609964 -29626113
56992b9626113M373505L844505L386277K986644K635953K329054K061241J826509
56984f182425J621202J444768J295053f54841C99630R56281Q68444P85954P06832
56975C717141O33346N67415N08201M55282M10179L73234L42451L16720K96676
56966G620645K80952K65176K46540K26406K06883J87975J69749J53920J40929
56957I499175J28009J12424R4535P6013N7436L9673K5105J4808O151m360j6989
56946A0031980k9452m0564n1362o3699p9466j00242j25821j53949j83410k17035
56936H986980k59615l12253l69232m20346m56165m72526m71599m58965m39267
56927E327012m14636l86603l57522l29158l01504k74587k50540k32015k18855
$$ plain form
56992 -29626113 -25252608 -21408103 -18021826 -15035182 -12399229 -10070175 -8008934 -6182425
56984 -6182425 -4561223 -3116455 -1821402 -654841 399630 1355911 2224355 3010309 3717141
56975 3717141 4350487 4917902 5426103 5881385 6291564 6664798 7007249 7323969 7620645
56966 7620645 7901597 8166773 8413313 8639719 8846602 9034577 9204326 9358246 9499175
56957 9499175 9627184 9739608 9834143 9910156 9967592 10007265 10032370 10047178 10053329 10048969 10031980
56946 10031980 10002528 9961964 9910602 9846903 9767437 9667195 9541374 9387425 9204015 8986980
56936 8986980 8727365 8415112 8045880 7625534 7169369 6696843 6225244 5766279 5327012
56927 5327012 4912376 4525773 4168251 3839093 3537589 3263002 3012462 2780447 2561592
56918B561592k08035j97126j86331j76728j67842j58087j46934j35455j24549
56909A060505j13621j01586q8596p5903o4114n2613m0937k9801k0066j1492l381
56898D58395M114J0254J4759J7412J7036J2260L629o137j4423k0462k4656k7141
56886D45040k7640k6320k4039k1598j8849j4780q980k957Q58J920K485M905Q935
56873C18980J2757J5704J8337K0347K0290J7532J2780O523j344r996j7421k2500
56861C91989k5984k8660k9846k8727k6142k3869k2683k2008k1012j9245j6674
56850A27139j3693j0944q690o758n177m133l094r95K139M671N222M412M068N318
56836I9485Q049J1544J4768J6669J7090J7208J8320K0471K2768K4592K5922K6827
$$ plain form
56918 2561592 2353557 2156431 1970100 1793372 1625530 1467443 1320509 1185054 1060505
56909 1060505 946884 845298 756702 680799 616685 564072 523135 493334 473268 461776 458395
56898 458395 462509 472763 487522 504934 521970 534230 537859 531722 517299 496837 472181 445040
56886 445040 417400 391080 367041 345443 326594 311814 302834 299877 300735 302655 305140 310045 318980
56873 318980 331737 347441 365778 386125 406415 423947 436727 443250 441906 431910 414489 391989
56861 391989 366005 337345 307499 278772 252630 228761 206078 184070 163058 143813 127139
56850 127139 113446 102502 93812 87054 81877 77744 74650 73655 75794 80465 85687 90099 94167 99485
56836 99485 107534 119078 133846 150515 167605 184813 203133 223604 246372 270964 296886 323713
56824C23713K7238K6872K5044K1197J6089J1703R142P411N094K477Q20L20K36
56811D77356O53K427N356P989R613J1098J3375J6210J9124K2386K6389L0823L5058
56798F77857L8530M0078L7809L0636J9647P266m461j4115k0228k1720j9203j4948
56786G57148j1124q260n464j742L038Q251J3396J8712K4712L1326L8190M5811
56774I13994N5397O6513P5354P6517O6847M7425K2339l588k6158m2497n1680n4807
56762A145656n4076n1460m7834m2938l6207k7922j9464j2145n998j03O276J3255
56750H67040K0565K7640L3901L9474M4730M7971M4708L1647J1411q950k4671l6301
56738A099165m5556n1275n1798m8864m5825m3060l8329l1294k4408j9078j4068
$$ plain form
56824 323713 350951 377823 402867 424064 440153 451856 460998 468409 473503 475980 476800 477120 477356
56811 477356 478009 480436 485792 493781 503394 514492 527867 544077 563201 585587 611976 642799 677857
56798 677857 716387 756465 794274 824910 844557 851823 847362 833247 813019 791299 772096 757148
56786 757148 746024 737764 732300 730558 733596 741847 755243 773955 798667 829993 868183 913994
56774 913994 969391 1035904 1111258 1187775 1254622 1302047 1324386 1320798 1294640 1252143 1200463 1145656
56762 1145656 1091580 1040120 992286 949348 913141 885219 865755 853610 847612 847509 853785 867040
56750 867040 887605 915245 949146 988620 1033350 1081321 1126029 1157676 1169087 1160137 1135466 1099165
56738 1099165 1053609 1002334 950536 901672 855847 812787 774458 743164 718756 699678 685610
56727F85610q637m317j984L57M912J1018J6620K1029K3884K2897J5756L932q055
56714G83022j7357k4543l0414l3759l3439l0763k8125k6343k4635k2354j9595
56703D91695j6651j3959j2132j1197j0294q903p732p436p198n828l774k576k574
56690C81441k715k645l223m486m902l636k111j987k689k533j423p07p28m49M08
56675C47615O79j72r25n21J50m27k133l457l579l054k618k369k207k262k596k954
56659C19170l030k713k093j428r76o65j72M51O20j4j041j920k686l517m018l699
56643B92269k870k370k511l026l743m633n361n521n280n014m463l136j367r5M08
56628B43287O26O04j16j120r51J066L813N804O685O716N782M098L079M097O517
$$ plain form
56727 685610 676973 672656 670672 671029 675941 686959 703579 724608 748492 771389 787145 791077 783022
56714 783022 765665 741122 710708 676949 643510 612747 584622 558279 533644 511290 491695
56703 491695 475044 461085 448953 437756 427462 418559 410827 403391 396193 390365 386591 384015 381441
56690 381441 378726 376081 372858 368372 363470 359834 357723 355736 353047 350514 349091 348384 347656 347207 347615
56675 347615 348294 348122 347197 346676 346826 346399 344266 340809 337230 334176 331558 329189 326982 324720 322124 319170
56659 319170 316140 313427 311334 309906 308930 308265 308093 308544 309164 309150 308109 306189 303503 299986 295968 292269
56643 292269 289399 287029 284518 281492 277749 273116 267755 262234 256954 251940 247477 244341 242974 242879 243287
56628 243287 243913 244517 244401 243281 242330 243396 247209 253013 259698 266414 272196 276294 279373 283470 289987
56613B89987Q139P686N938M297L191K337J818K066K922L327K256r7k252k703j315
56598C27597N20J201K97j291k350k469k175k189k586k899k840k599k278j483K7
56583C04483J583K077J147n15k004k826k764j843o85l52j381l144m369m248l088
56568B82071j919j393r61M41K708M187L643J970R96J080J164R63J414K622L071
56553C02057J829L11M98K151L073J978j01j328j118m35m21j153j662j123J75J249
56537C05980J537J140J96j119j936j026J663M499N711M954L014P54j039j469j79
56522C22680J995L673M123L569K606J851J854K799M252N440N734N009L818L124
56508C72527L339L742L565L343M132N443N561M247L522M733O523P017O715P502
$$ plain form
56613 289987 298126 305812 311750 316047 319238 321575 323393 325459 328381 331708 333964 333867 331615 328912 327597
56598 327597 328117 329318 329615 328324 325974 323505 321330 319141 316555 313656 310816 308217 305939 304456 304483
56583 304483 306066 308143 309290 308775 306771 303945 301181 299338 298653 298301 296920 293776 289407 285159 282071
56568 282071 280152 278759 277798 278239 280947 285134 288777 290747 291743 292823 293987 294950 296364 298986 302057
56553 302057 303886 304197 304695 306846 309919 311897 311796 310468 309350 308915 308494 307341 305679 304556 304731 305980
56537 305980 307517 308657 308853 307734 305798 304772 306435 310934 316645 321599 324613 325367 324328 322859 322680
56522 322680 324675 328348 332471 336040 338646 340497 342351 345150 349402 354842 360576 365585 369403 372527
56508 372527 375866 379608 383173 386516 390648 396091 401652 405899 409421 414154 420677 427694 434409 441911
56494D41911R637J1552J2144J1510R801P206M940M402N018M665K689Q01L42K04
56480E26822j280l699n154m943m276m545n824p104p394o539n317m678m696m618
56466D56755m146m054m932n953n758m319k977k569k553k215j859k125k849l347
56452D07099l472l462l093j909m23l4j230k636k530q96P21J113N53J58N95J495
56436C92049J897J342N34N06J127J135k0j219j228l51L22M76L39l30j547k026
56420C93006m42K395M332M829N395O878Q130Q036P142O385N683M691L880L764
56406D64104M106M689N966P981R617R886R208Q579Q201P762P361P246P281P291
56392E69278P268O738M892J998l34j100r82o81M25K666M410L752J287n56o71l19
$$ plain form
56494 441911 451548 463100 475244 486754 496555 503761 508701 513103 518121 522786 525475 526276 526618 526822
56480 526822 525542 521843 516689 511746 507470 502925 497101 489997 482603 476064 470747 466069 461373 456755
56466 456755 452609 448555 443623 437670 431912 427593 424616 422047 419494 417279 415420 413295 410446 407099
56452 407099 403627 400165 397072 395163 394740 394706 393476 390840 388310 387414 388135 389248 389801 389959 390554 392049
56436 392049 393946 395288 395822 396328 397455 398590 398570 397351 396123 395772 396094 396570 396909 396579 395032 393006
56420 393006 392564 394959 399291 404120 409515 416393 424523 432559 439701 446086 451769 456460 460340 464104
56406 464104 468210 472899 478865 486846 496463 506349 515557 524136 532337 540099 547460 554706 561987 569278
56392 569278 576546 583284 588176 590174 589840 588740 587758 587077 587502 590168 594578 598330 599617 599061 598390 598071
56376E98071j115l089m902n240m037k742l044m967o868p605p667p703p376o644
56362E25072o640p869q723p556n197l588k910k073j453k582n157o667n699l822
56348D55136l376m617n863n588l746j572m13n36j070j260j258j239o08R52K380
56333D27322K427J532J316K431L966M794M477L128J332Q0j30J88L79N37Q63R35
56317D55577N59L80O24L09j067k213j879r24o78l91J476M178N436M884M354M679
56301D75304M661L602K541K356K560K807L777N679P189O861M770K301J007J602
56287E27017L233L945K939J973L036N172N491L288R89O69J649K307K424K684L196
56272E70012L631M069M887O207P753Q880Q975Q399Q490R722J0674J0082R072R509
$$ plain form
56376 598071 596956 593867 588965 583725 579688 576946 573902 568935 562067 554462 546795 539092 531716 525072
56362 525072 518432 510563 501840 494284 489087 485499 482589 480516 479063 476481 471324 464657 458958 455136
56348 455136 451760 447143 441280 435692 431946 430374 429961 429425 428355 427095 425837 424598 423990 424942 427322
56333 427322 429749 431281 432597 435028 438994 443788 448265 451393 452725 452805 452675 452863 453242 453779 454642 455577
56317 455577 456136 456516 457140 457449 456382 454169 452290 451366 450688 450297 451773 455951 461387 466271 470625 475304
56301 475304 479965 483567 486108 488464 491024 493831 497608 503287 510476 517337 522107 524408 525415 527017
56287 527017 530250 534195 537134 539107 542143 547315 552806 556094 557083 557752 559401 561708 564132 566816 570012
56272 570012 573643 577712 582599 588806 596559 605439 614414 622813 631303 641025 651699 661781 670853 680362
56258F80362J0875J0922R228P838Q275R949J1710J2994J3205J2018J0615J0700
56246H08691J1943J2321J1322J0680J1443J2402J2192J0970R332P448O034O256
56234I31034P685Q144O656M946N008O705Q767J0685J2609J4592J6901J9966K3236
56221A076934K5212K5301K4712K5013K6778K9724L3063L5650L7194L9256M3528
56210A422365M9257N4186N7920O2151O7520P2730P7247Q2414Q9065R6275J03441
56199B234571J11475J20959J30972J40668J50234J59657J68326J76444J84678
56190C577984J91929J95713J95374J92410J87015J77176J62316J44857J26520
56181E151294J05833Q1269N4408K7950K734k1205m2551n9872p3363q3828r1511
$$ plain form
56258 680362 691237 702159 711387 719225 727500 737449 749159 762153 775358 787376 797991 808691
56246 808691 820634 832955 844277 854957 866400 878802 890994 901964 911296 918744 924778 931034
56234 931034 938719 946863 953519 958465 963473 970178 978945 989630 1002239 1016831 1033732 1053698 1076934
56221 1076934 1102146 1127447 1152159 1177172 1203950 1233674 1266737 1302387 1339581 1378837 1422365
56210 1422365 1471622 1525808 1583728 1645879 1713399 1786129 1863376 1945790 2034855 2131130 2234571
56199 2234571 2346046 2467005 2597977 2738645 2888879 3048536 3216862 3393306 3577984
56190 3577984 3769913 3965626 4161000 4353410 4540425 4717601 4879917 5024774 5151294
56181 5151294 5257127 5338396 5392804 5420754 5423488 5402283 5359732 5299860 5226497 5142669 5051158
56170E051158r7338j03283j09635j13942j14585j13586j13805j15295j16618j17962
56160C935109j20319j22927j24079j23733j23052j22175j20416j17977j15633
56151B844798j13161j09800j05701j01548r7257r2270q6579q0551p4378o8402
56141A915151o3066n8030n2550m7076m3030m0561l8235l5378l2666k9963k6068
56130A448528k1432j8407j7622j6866j4847j3100j2501j0992p129l081j415j368
56118A309768r70m78o99J2L609Q703J2110J3137J3510J4172J4829J5887J8134
56105A421724K0999K3290K5134K7317K9398L0294L0083K9593K8903K7631K5945
56094A720311K4125K2076K0114J9107J9137J9559K0679K3365K6643K8581L0106
$$ plain form
56170 5051158 4953820 4850537 4740902 4626960 4512375 4398789 4284984 4169689 4053071 3935109
56160 3935109 3814790 3691863 3567784 3444051 3320999 3198824 3078408 2960431 2844798
56151 2844798 2731637 2621837 2516136 2414588 2317331 2225061 2138482 2057931 1983553 1915151
56141 1915151 1852085 1794055 1741505 1694429 1651399 1610838 1572603 1537225 1504559 1474596 1448528
56130 1448528 1427096 1408689 1391067 1374201 1359354 1346254 1333753 1322761 1315632 1312551 1311136 1309768
56118 1309768 1308798 1308320 1307621 1307633 1311242 1319945 1332055 1345192 1358702 1372874 1387703 1403590 1421724
56105 1421724 1442723 1466013 1491147 1518464 1547862 1578156 1608239 1637832 1666735 1694366 1720311
56094 1720311 1744436 1766512 1786626 1805733 1824870 1844429 1865108 1888473 1915116 1943697 1973803
56083A973803L4550M2226M9313N3933N9395O8830Q0450R1289J02024J14425J27107
56072B797345J37714J46676J54744J59079J55998J46038J32760J18349J03859
56063D052562R1772Q4076P8751P1553O0370M5363K6818O100j3009k7480l8278
56052D438598m8004n7328o6590p8301r4218j11795j26940j38414j46416j49342
56042C421250j45886j38276j29556j19556j07131r4030q2615p1963o0384m9547
56032B422306m1847l5863k8953k2315j8800j7611j5851j3622j2885j2918j1645
56021B189996r864r532r452p295m368l631m553m449l186k079j41L725P072P552
56007B149795P957J2200J8371K1534K1466K1836K3587K5127K7309L1889L6598
$$ plain form
56083 1973803 2008353 2050579 2099892 2153825 2213220 2282050 2362500 2453789 2555813 2670238 2797345
56072 2797345 2935059 3081735 3236479 3395558 3551556 3697594 3830354 3948703 4052562
56063 4052562 4144334 4228410 4307161 4378714 4439084 4484447 4511265 4517365 4504356 4476876 4438598
56052 4438598 4390594 4333266 4266676 4188375 4094157 3982362 3855422 3717008 3570592 3421250
56042 3421250 3275364 3137088 3007532 2887976 2780845 2686815 2604200 2532237 2471853 2422306
56032 2422306 2380459 2344596 2315643 2293328 2274528 2256917 2241066 2227444 2214559 2201641 2189996
56021 2189996 2180132 2170600 2161148 2153853 2149485 2145854 2141301 2136852 2133666 2131587 2131446 2135171 2142243 2149795
56007 2149795 2157752 2169952 2188323 2209857 2231323 2253159 2276746 2301873 2329182 2361071 2397669
55996B397669L7849L6957L7705L9537L9524L9093M1741M5814M6840M5656M6769
55985B855154M9757N0099M7938M8095N1563N4613N6401N9909O4959O7673O7525
55974C473686O8143P0702P2963P4998P9233Q4857Q8621R0956R5031J00568J05027
55963D404785J09544J16766J24605J29586J34419J44100J56571J66091J73772
55954E660239J85275J99865K11950K21947K35082K50483K62489K72118K86074
55945G785522L04694L22092L37883L57306L79950M00138M18351M40259M64789
55936A1210984M85680N04687N30294N63623N98981O37671O86471P42652P96041
55927A6757084Q46395R02992R66719J029389J091345J161693J239963J316442
$$ plain form
55996 2397669 2435518 2472475 2510180 2549717 2589241 2628334 2670075 2715889 2762729 2808385 2855154
55985 2855154 2904911 2955010 3002948 3051043 3102606 3157219 3213620 3273529 3338488 3406161 3473686
55974 3473686 3541829 3612531 3685494 3760492 3839725 3924582 4013203 4104159 4199190 4299758 4404785
55963 4404785 4514329 4631095 4755700 4885286 5019705 5163805 5320376 5486467 5660239
55954 5660239 5845514 6045379 6257329 6479276 6714358 6964841 7227330 7499448 7785522
55945 7785522 8090216 8412308 8750191 9107497 9487447 9887585 10305936 10746195 11210984
55936 11210984 11696664 12201351 12731645 13295268 13894249 14531920 15218391 15961043 16757084
55927 16757084 17603479 18506471 19473190 20502579 21593924 22755617 23995580 25312022
55919B5312022J392963J484016J594484J715224J842514J981293K127515K270276
55911C9720307K414906K581401K777602K998023L249956L552138L905027M294199
55903F5493559M728329N241672N854681O567340P394178Q363505R476859J0717259
55895A23837382J2105243J3693607J5500876J7516420J9780663K2378250K5337182
55888B50149623K8621433L2165449L5600161L7727208L6538015L0336727J9199127
55881D70337743N289730q373241j9521840k7285732l1812514l3679100l3588667
55874C21366379l2224830l0109104k7558472k4781963k1963065j9245012j6714136
55867A48769797j4437762j2479990j0860574r536760q446111p541311o778021
$$ plain form
55919 25312022 26704985 28189001 29783485 31498709 33341223 35322516 37450031 39720307
55911 39720307 42135213 44716614 47494216 50492239 53742195 57294333 61199360 65493559
55903 65493559 70221888 75463560 81318241 87885581 95279759 103643264 113120123 123837382
55895 123837382 135942625 149636232 165137108 182653528 202434191 224812441 250149623
55888 250149623 278771056 310936505 346536666 384263874 420801889 451138616 470337743
55881 470337743 475627473 467254232 447732392 420446660 388634146 354955046 321366379
55874 321366379 289141549 259032445 231473973 206692010 184728945 165483933 148769797
55867 148769797 134332035 121852045 110991471 101454711 93008600 85467289 78689268
55860G8689268o107712n501796m958738m475757m036037l631055l270472k959792
55852D3747909k689198k451856k252004k086675j939168j799099j671651j560347
55844B7297911j457889j360645j275153j203122j135056j065367r99527r40362
55836A7860790q81479q20184p63544p15752o71879o29294n92999n64542n37530
55827A1683587n08981m83704m63033m40822m15143l92459l75469l57959l36660
55818G909357l17222l03215k89575k72467k55893k43199k31098k17331k05494
55809E573863j97369j88887j78601j71900j72030j74485j74603j73302j71353
55800C971333j65761j56019j46534j39049j29919j18424j09927j07046j05360
$$ plain form
55860 78689268 72581556 67079760 62121022 57645265 53609228 49978173 46707701 43747909
55852 43747909 41058711 38606855 36354851 34268176 32329008 30529909 28858258 27297911
55844 27297911 25840022 24479377 23204224 22001102 20866046 19800679 18801152 17860790
55836 17860790 16979311 16159127 15395583 14679831 14007952 13378658 12785659 12221117 11683587
55827 11683587 11174606 10690902 10227869 9787047 9371904 8979445 8603976 8246017 7909357
55818 7909357 7592135 7288920 6999345 6726878 6470985 6227786 5996688 5779357 5573863
55809 5573863 5376494 5187607 5009006 4837106 4665076 4490591 4315988 4142686 3971333
55800 3971333 3805572 3649553 3503019 3363970 3234051 3115627 3005700 2898654 2793294
55791B793294j01826r9541j00031r8800r3419q8439q7056q5001p8112o9454o3315
55780A828300n8221n1424m4775m0603l6598l0187k3630k0044j8317j6092j3869
55769A474540j2490j0701q607r129j2969j6606j8282k0910k5974l0018l0938l2124
55757A245792l6043l8989l7145l3159l1578l1753l0370k7592k5672k4163k1083
55746I08245j6840j3163j0254p831o687o613n526l008j587k245k202L16K873L119
55732H38597K418K217P01l482p754r415r685j0651j1434j0860j0651j2289j3540
55719G44172j1809q481o516o101n994o729r114j1556j2186j1932j2683j4121j4863
55706F12087j4950j4916j4248j2798j1752j1487j0712r372r654j2332j4826j4943
$$ plain form
55791 2793294 2691468 2591927 2491896 2393096 2299677 2211238 2124182 2039181 1961069 1891615 1828300
55780 1828300 1770079 1718655 1673880 1633277 1596679 1566492 1542862 1522818 1504501 1488409 1474540
55769 1474540 1462050 1451349 1442742 1433613 1420644 1404038 1385756 1364846 1338872 1308854 1277916 1245792
55757 1245792 1209749 1170760 1133615 1100456 1068878 1037125 1006755 979163 953491 929328 908245
55746 908245 891405 878242 867988 860157 853470 846857 841331 838323 836736 834491 832289 832605 835478 838597
55732 838597 841015 843232 843933 840451 832697 823282 813597 802946 791512 780652 770001 757712 744172
55719 744172 732363 723882 717366 711265 705271 698542 689428 677872 665686 653754 641071 626950 612087
55706 612087 597137 582221 567973 555175 543423 531936 521224 511852 502198 489866 475040 460097
55694D60097j3784j3127j2903j3092j4892j7798j8826j6948j5066j5197j5055
55683B93409j2167q119n640m398k865j567j460j480o46j58p78p28J173K876K339
55668B59791P85Kp98k626l873k992j513j462k075j951j938k995l720k902k016
55653B29717k302k072J0J724Q71o40N0J886K073J090J594L820N734O423O110M262
55637B60350R23j597j509n41j124k205j138J715L633L611K859K321K397L847O372
55622B79914P769O990O303P743R366Q058M273P85j498l396m637m542m118m471
55608C08539m458k756o05K96Q05K202L154K139Q96J752L461L497K727L511M797
55593C29957L642N73j072n30n7m02p1J026J228M71K46K08j493m464o270o539p345
$$ plain form
55694 460097 446313 433186 420283 407191 392299 374501 355675 338727 323661 308464 293409
55683 293409 281242 273123 267483 263085 260220 258653 257193 255713 255067 254909 254131 253403 254576 257452 259791
55668 259791 260576 260578 259780 257154 253281 250289 248776 247314 245239 243288 241350 238355 234635 231733 229717
55653 229717 227415 225343 225353 227077 227948 227308 227358 229244 231317 232407 234001 237821 243555 249978 256088 260350
55637 260350 261273 259676 258167 257626 256502 254297 253159 254874 258507 262118 264977 267298 269695 273542 279914
55622 279914 287683 294673 300976 308719 318085 326143 330416 331201 329703 326307 321670 317128 313010 308539
55608 308539 304081 301325 300720 301016 301821 304023 307177 309316 310212 311964 315425 318922 321649 325160 329957
55593 329957 333599 334172 333100 332570 332513 332111 332040 333066 334294 334765 335011 335219 333726 329262 322992 316453 309108
55576C09108r202j0096r134p957p917q475q928r244r053q128p663q685r683q577
55562A86366o427o085p597q243p019n623m923l897k495k263l324l690k401q62
55548A21517l48m88p66j322j913k046k144k656k480o46J083L08j892k071M09K693
55532A07238L059K722K613J729k19j582j411p66m65J04J191J997K482L529M830
55517A27051M991M225M438O072P382P413P100O854N907M772N598Q834J2143J3726
55503B26506J4243J4298J2691Q917M922K539Q31k153o379j0064j1922j1982j1129
55490B31318j0597j1093j1878j1743j0799j0060r417p873n737m550m608m646m112
55477A24205l645l103j508O23J319J98q05m07O03J498K638L536K607J8j623p66
$$ plain form
55576 309108 299906 289810 280676 272719 264802 256327 247399 238155 229102 220974 213311 204626 194943 186366
55562 186366 179939 173854 166257 158014 150995 145372 140449 136552 134057 131794 128470 124780 122379 121517
55548 121517 121169 120681 119915 118593 116680 114634 112490 109834 107354 106708 107791 108099 106207 104136 104545 107238
55532 107238 110297 113019 115632 117361 117142 115560 114149 113383 112918 113022 114213 116210 118692 122221 127051
55517 127051 132042 136267 140705 146777 154159 161572 168672 175526 181433 186205 191803 200637 212780 226506
55503 226506 240749 255047 267738 276655 281577 284116 284947 282794 276415 266351 254429 242447 231318
55490 231318 220721 209628 197750 186007 175208 165148 155731 147858 142121 137571 132963 128317 124205
55477 124205 120560 117457 115949 116572 117891 118089 117284 116877 117480 118978 121616 125152 127759 127777 126154 125388
55461A25388J091K218L096M473N268M274K239M35j333l533n225n350m645m528
55447A23868n061n351n145m846m658m768n503o488o587n400l815k572j458n00
55433F1716n17j650k705k733k109j406p16n52j669l227l033p77R09j2k205l281
55417C6033l185l268l396k371n39K78n23j485j136L96K007K913L031K636K011
55402C3402J321P81O41P12K50r49j779j206m8l9j213j840j105j68q4k82J60J040
55384B9594J606J513O96p10j892j980j379j386k213k809k693k366j712L5K259
55369A6563K914J380n29j303j546j936j460O82L071L827L090K195J475O15J45
55354B9183O64J277N84j044j796r07N19J229J181J066J299J720J878J463P19K79
$$ plain form
55461 125388 126479 128697 131793 136266 141534 145808 148047 148482 147149 143616 138391 133041 128396 123868
55447 123868 118807 113456 108311 103465 98807 94039 88536 82048 75461 70061 66246 63674 62216 61716
55433 61716 61199 59549 56844 54111 52002 50596 49880 49328 47659 44432 41399 40622 41531 41519 39314 36033
55417 36033 32848 29580 26184 23813 23274 23552 23029 21544 20408 20804 22811 25724 28755 31391 33402
55402 33402 34723 35504 36145 36857 37107 36158 34379 33173 33125 33086 31873 30033 28928 28760 28676 28394 28554 29594
55384 29594 31200 32713 33409 32699 30807 28827 27448 26062 23849 21040 18347 15981 14269 14304 16563
55369 16563 19477 20857 20328 19025 17479 15543 14083 14765 17836 21663 24753 26948 28423 29038 29183
55354 29183 29847 31124 31708 30664 28868 27961 28480 29709 30890 31956 33255 34975 36853 38316 39035 39314
55338C9314M73R41R55l4j910l588l596j716L61Q87K19J03J179K388K573J425p22
55321C9252k770k975q40J450J296r02k499k391j718j045L56K027J959k14k091
55306B8895j823m61J42k17q91j753k514k348j381r32j392j582r30l97l13L81J685
55289A4169J742r3j722j473n18l99m35L23P96q7r96l64O92L54m98L22K461L371
55271A7645K041j01j596k095j453J90J593J524M95j20k13o24j300j493j360j630
55255A1503k029j663o83l0J83N70J087J093N23j14n83o56K16J878K886K232Q76
55238A7289K31Q9m25q82l49O46Q99P39J393K595K804J756Q79R78J254P78k75j192
55220B9207j485j120p69j487l227m216k953k13K055L109L280K317k27l168m166
$$ plain form
55338 39314 39787 40728 41683 41649 39739 36151 32555 30839 31200 32087 32306 32409 33588 35976 38549 39974 39252
55321 39252 36482 33507 32667 34117 35413 34511 32012 29621 27903 26858 27214 29241 31200 30986 28895
55306 28895 27072 26611 26753 26536 25645 23892 21378 19030 17649 16717 15325 13743 12813 12416 12103 12484 14169
55289 14169 15911 15818 14096 12623 12105 11706 11271 11594 12390 12303 11307 10943 11635 11989 11491 11813 14274 17645
55271 17645 19686 19585 17989 15894 14441 14631 16224 17748 18243 18123 17910 17286 15986 14493 13133 11503
55255 11503 9474 7811 7128 7098 7281 7851 8938 10031 10554 10440 9857 9201 9417 11295 14181 16413 17289
55238 17289 17520 17609 17184 16302 15953 16599 17498 18237 19630 22225 25029 26785 27664 28642 29896 30674 30399 29207
55220 29207 27722 26602 25833 24346 21119 16903 13950 13737 15792 18901 22181 24498 24271 21103 16937
55205A6937k345P45K957L393K483J256N16J89k72o37l4J193J272k71j259Q1K172
55188B8376K169k5k065k698k693k643k152j207l80K94J015J061k56j794j804p50
55172A4448p77k252l040j696O23K173K815L352L971M232L667K039k67j951j828
55157B5509k37J357K035J807P31j079k667k825j575j46M39k9j251k330j939J98
55141A7998K544L548L454L155K401Q77j49N32J581Q50j037j606p26q07k501l399
55125B6715j933J67P61K51J11K71k71j475k406k498j751n25K47k78j421j463o8
55108A4434J099Q74J97L83J140J417J107Q22Q15J036J495J799J200k51j410j509
55092B4648j111r23o90l9M64J34o18p73q7P87J224J068L81o70j658j920r42J041
$$ plain form
55205 16937 14592 15337 18294 21687 24170 25426 25942 26131 25859 25222 25188 26381 27653 27382 26123 26204 28376
55188 28376 30545 30520 28455 25757 23064 20421 18269 17062 16682 16976 17991 19052 18796 17002 15198 14448
55172 14448 13671 11419 8379 6683 7306 9479 12294 15646 19617 23849 27516 29555 29288 27337 25509
55157 25509 25272 26629 28664 30471 31202 30123 27456 24631 23056 22910 23349 23320 22069 19739 17800 17998
55141 17998 20542 24090 27544 30699 33100 33977 33828 34360 35941 36791 35754 34148 33422 32615 30114 26715
55125 26715 24782 24949 25710 25961 26072 26343 26072 24597 22191 19693 17942 17417 17664 17386 15965 14502 14434
55108 14434 15533 16407 16604 16987 18127 19544 20651 21473 22288 23324 24819 26618 27818 27567 26157 24648
55092 24648 23537 22614 21924 21885 22349 22483 21865 21092 21005 21792 23016 24084 24465 23795 22137 20217 19275 20316
55074B0316K811L054J840O49M65P22O44N24O31Q8j467k308p44J911K915K110J784
55057C5945K621K811J622R29J936K967K179L93n53n83o29n87J49J031J024K95
55041E1550j75j77k06k91n6M58J005J650K317K335J346O4o77j130j878k448j722
55024E1965L51K396L113K605J996K044K325J899P25j08R2N53L01j05O25K280L124
55007G6181K174K31j515k579k713j647J27J404J471N09j152l033l861k487K98
54992F3408K270K367J487N67l81j129r75k09o5o27n46N13J070L71l51j63J7m71
54974F7153m01J110K512J978L16l40L36J050J291J559J693R32n92j866k269j661
54958G2801J94K882M603L721R50j335j755p68O21J761K151J645Q63M88L60O2p6
$$ plain form
55074 20316 23127 26181 28021 28670 29135 29857 30501 31025 31656 31744 30277 27969 27225 29136 32051 34161 35945
55057 35945 38566 41377 42999 43928 45864 48831 51010 51403 50850 50267 49638 49051 49200 50231 51255 51550
55041 51550 51375 51198 50992 50701 50645 51103 52108 53758 56075 58410 59756 59820 59143 58013 56135 53687 51965
55024 51965 52316 54712 57825 60430 62426 64470 66795 68694 69419 69311 69403 69956 70257 70152 70777 73057 76181
55007 76181 78355 78586 77071 74492 71779 70132 70259 71663 73134 73643 72491 69458 65597 63110 63408
54992 63408 65678 68045 69532 70099 69718 68589 67614 67405 67340 66713 66167 66680 67750 68121 67770 67607 67624 67153
54974 67153 66752 67862 70374 72352 72668 72328 72664 73714 75005 76564 78257 79189 78597 76731 74462 72801
54958 72801 72995 75877 80480 84201 85151 83816 82061 81293 81914 83675 85826 87471 88334 88822 89182 89244 89168
54941H9168M90J272J223K28q39j335j323j054p92r32j442j509m74J046J685Q86
54925H6298n65j466j286n72m40j192j599l04K076L485L161K352K040J750J272
54910I5010J621L033L807K757J230J047J812K129K094K536K963K465J777K208
54896A26489L270L555L401M259N821O275N348M724N351O449P414Q520R547R811
54882B10234R972J1525J4058J5211J4101J2598J2178J1568Q838M126j096o017
54870C17296j0321j3224j4263j4230j4114j3775j2761j1592j1014j0588r262p087
54858A75065n330m949n656o362o004m232j758J48R11J122J577K389L290M242N316
54843A59769O470P771R275J0494J0753J0476J1142J3261J5258J5282J3402J0931
$$ plain form
54941 89168 89658 90930 92153 92381 91542 90207 88884 87830 87038 86106 84664 83155 82681 83727 85412 86298
54925 86298 85733 84267 82981 82409 81969 80777 79178 78874 80950 84435 87596 89948 91988 93738 95010
54910 95010 96631 99664 103471 106228 107458 108505 110317 112446 114540 117076 120039 122504 124281 126489
54896 126489 129759 133314 136715 140974 146795 153070 158418 163142 168493 174942 182356 190876 200423 210234
54882 210234 220206 231731 245789 261000 275101 287699 299877 311445 320283 324409 323313 317296
54870 317296 306975 293751 279488 265258 251144 237369 224608 213016 202002 191414 182152 175065
54858 175065 169735 164786 159130 152768 146764 142532 140774 140922 141833 142955 144532 146921 150211 154453 159769
54843 159769 166239 174010 183285 193779 204532 215008 226150 239411 254669 269951 283353 294284
54831B94284Q210M489j38m249o985r284j2383j5748j7493j6661j4343j2433j1794
54818A85472j1882j1759j1048r976q837p615o074m197k520j796k152k773k676
54805A02167j627J6J977L916M856L849J447m40p02j93j63m64k87Q6l80j646k520
54788A09892k484k418l062l825l748k960k366k246j958j035j2K74j17k38L48O93
54772H4738l69k405l653l155j753n39O21K181L422L187J699M50J34o6r74k155
54756H1363k565j757o7J877L413M103M153M191M406M225L148J643P93J202K475
54741A12603L759M582N085N606O159O454O280N774N410N829P507J0151J2618J3937
54727B11754J4369J4925J5910J6733J7095J7267J6827J4284Q974K549k352m677
$$ plain form
54831 294284 302494 306983 306845 302596 295611 286327 273944 258196 240703 224042 209699 197266 185472
54818 185472 173590 161831 150783 140807 131970 124355 118281 114084 111564 109768 107616 104843 102167
54805 102167 100540 100556 102533 106449 111305 115154 116601 116161 115459 115266 115103 114639 114352 114438 114058 112412 109892
54788 109892 107408 104990 101928 98103 94355 91395 89029 86783 84825 83790 83778 84052 83935 83697 84045 84738
54772 84738 84369 81964 78311 75156 73403 72864 73485 75666 79088 82275 83974 84424 84558 84492 83518 81363
54756 81363 78798 77041 76974 78851 82264 86367 90520 94711 99117 103342 106490 108133 108926 110128 112603
54741 112603 116362 120944 126029 131635 137794 144248 150528 156302 161712 167541 175048 185199 197817 211754
54727 211754 226123 241048 256958 273691 290786 308053 324880 339164 348138 350687 348335 343658
54715C43658n475o355q080j0301j1828j1551r697p855p151o980o204m917l970
54702B43294l349k395j333j122j668j613k06J719L201M558O640R312J1474J2337
54688B80849J2211J2191J3220J5315J7483J8616J8510J7774J6751J4988J1999
54677D49907Q110M116J83m348r793j5047j8377j9411j9615k0351k1144k0674j8807
54664B94749j6532j4364j2269j0893j1014j1643j0678q073o404p222q706q334
54652A68617o272m380l293k432j906k267k977k989k407j967j435j50J363K090
54638A39595K270K701K836J605l25j153o55j94k80k13j40j035k435k575j222j68
54622A38612k61j74J104K692L646M235M449L392J321K42J029J853J136J51Q40
$$ plain form
54715 343658 338183 331828 323748 313447 301619 290068 280371 272516 265365 258385 252181 247264 243294
54702 243294 239945 237550 236217 235095 233427 231814 231608 233327 236528 241086 247726 257038 268512 280849
54688 280849 293060 305251 318471 333786 351269 369885 388395 406169 422920 437908 449907
54677 449907 458017 462133 462316 457968 448175 433128 414751 395340 375725 355374 334230 313556 294749
54664 294749 278217 263853 251584 240691 229677 218034 207356 199283 192879 185657 176951 168617
54652 168617 162345 157965 154672 152240 150334 148067 145090 142101 139694 137727 136292 136142 137505 139595
54638 139595 141865 144566 147402 149007 148682 147529 146874 146680 146400 146187 146047 145012 142577 140002 138780 138612
54622 138612 138351 138177 139281 141973 145619 149854 154303 157695 159016 159258 160287 162140 163276 163427 164267
54607A64267K604L469L254L323L987M264L886L546L386K938K474K780L607L767
54593B11552K914J968J637J761K225L272M628N372N294N507P104R611J1304J0962
54579B85111R095P519P683R384J1284J2676J4124J5973J6998J5514J1618P311
54567D24290M045J052l271q772j3312j5263j5402j5570j6054j5478j3383j1424
54555C01458j1045j1184r812p128n369n548o125n447l936k940k726k683k755l468
54541B21292m820n943n889m528k790k113l106m713n215m239l134l268m570n897
54527A61067o138m849k607q63p45j862k965l540l809l552k368j066j066k105k247
54512A21285q05M58j61k005l253l088j745K70K001K291J275M59M17j07j795l090
$$ plain form
54607 164267 166871 170340 173594 176917 180904 185168 189054 192600 195986 198924 201398 204178 207785 211552
54593 211552 214466 216434 218071 219832 222057 225329 229957 235329 240623 246130 253234 262845 274149 285111
54579 285111 294206 301725 309408 318792 330076 342752 356876 372849 389847 405361 416979 424290
54567 424290 428335 429387 426116 417344 404032 388769 373367 357797 341743 326265 312882 301458
54555 301458 290413 279229 269417 262289 256920 251372 245247 239800 235864 232924 230198 227515 224760 221292
54541 221292 216472 210529 204640 200112 197322 195209 192103 187390 182175 177936 174802 171534 166964 161067
54527 161067 154929 150080 147473 146610 145865 144003 141038 137498 133689 130137 127769 126703 125637 123532 121285
54512 121285 120480 120938 120777 118772 115519 112431 110686 110956 112957 115248 116523 116982 117399 117292 115497 112407
54496A12407k442p65J95O69K014L940M732L793K143O49n07r04j25J170J870J934
54480A30773K019K041J569J225J948L232L750L572L980N118N732N413N288O175
54466A81835P590R002J0337J0892R500O417L579K104J018q32l028m748o263q002
54452B19401r153q675p149o342p038q200q231o537l988k241k313l455l770k277
54438A40032rJ210P06o53j605j633j179r44r84o78J80O81l7j334j744j052m20
54421A30537l67J18J748L449L620K090j6j681k438j969l35J552K575K538K193
54406A43614K207K562K863K769K174J246K78n64j147j048Q1J700K584K170J056
54391A62545j75j697l448m346l646k358k060k566k278p74M66L17m50o46m55o83
$$ plain form
54496 112407 109965 109200 109395 110064 112078 116018 120750 124543 126686 127335 126828 125924 125799 126969 128839 130773
54480 130773 132792 134833 136402 137627 139575 142807 146557 150129 154109 159227 164959 170372 175660 181835
54466 181835 189425 198427 208764 219656 229156 235573 239152 241256 242274 241442 238414 233666 227403 219401
54452 219401 210248 201573 194424 188082 181044 172844 164613 158076 154088 151847 149534 146079 142309 140032
54438 140032 140023 141233 141939 141286 139681 138048 136869 135925 134941 134263 134443 135124 135087 133753 132009 130957 130537
54421 130537 130170 130288 132036 135485 139105 141195 141179 139498 137060 135091 134756 136308 138883 141421 143614
54406 143614 145821 148383 151246 154015 156189 157435 157713 157149 156002 154954 155035 156735 159319 161489 162545
54391 162545 162370 160673 157225 152879 149233 146875 144815 142249 139971 139197 139663 139980 139530 138884 138429 137746
54375A37746j111r19k79j87q45j301r38k54O6M6r4m57j056j418j177n90k7M82
54357A27687Q07N17k28k68J132K895L251J957M87Q3O86J680K603K975K597K238
54341A51099K995M539N143L916K130J610K672M302N595O219O061N330M606M195
54327B10412L731K795J412l54k508m419m942l954k834k612k696k314k125k986
54313A86606m058l792k317j185j082j386j855k946m300m680l764k658k121j614
54299A48848o96K0Pj67K24J063J956K916L760L732K608J478J482K357L010K989
54283A75587K548J760O13k16L09K324M698O061N757L974J571k40p52n94j280l405
54267A98715n631n969m129k001j457k276k917k970l480m649m832k844k53K64j686
$$ plain form
54375 137746 136635 135716 135437 135250 134405 133104 132166 131912 131978 132024 131930 131473 130417 128999 127822 127232 127205 127687
54357 127687 128494 129011 128783 128515 129647 132542 135793 137750 138237 138320 139006 140686 143289 146264 148861 151099
54341 151099 154094 158633 163776 167692 169822 171432 174104 178406 184001 190220 196281 201611 206217 210412
54327 210412 214143 216938 218350 217996 215488 211069 206127 202173 199339 196727 194031 191717 189592 186606
54313 186606 182548 178756 176439 175254 174172 172786 170931 167985 163685 159005 155241 152583 150462 148848
54299 148848 148152 148172 148179 148012 148236 149299 151255 154171 157931 161663 164271 165749 167231 169588 172598 175587
54283 175587 178135 179895 180508 180292 180601 182925 187623 193684 199441 203415 204986 204746 203994 203400 202120 198715
54267 198715 193084 187115 182986 180985 179528 177252 174335 171365 167885 163236 158404 155560 155307 155571 153885
54252A53885m035n143n176m583l238j703j490k971m345l949k484j712j914k165
54238A08977k264k668k809j396J358L338K891O34j595k687k674k033j177k94O54
54223I8255J499J538K39j616k411j582k74K47l2m72p76o69M02K185L041J848j02
54206A01320n89M32R71K55j53Q29J763Q98j023j961j581j221j362j115k13L65
54190I7615J36j47%j7l87j27J233K374J880L34n41k51K49K97K26K96J03o85j621
54171A00967j796o36J513L310L398J887M14K83J132J971K640L233K902Q33j900
54156A20151l098k252j101j095j722j954j975k422k952k713j743p72K0J020K040
54141I9432K177J134r2l12M58J129Q95Mp69j043r54p31m38j51L3J22K8o67k245
$$ plain form
54252 153885 149850 144707 139531 134948 131710 130007 128517 125546 121201 117252 114768 113056 111142 108977
54238 108977 106713 104045 101236 99840 101198 104536 107427 108061 106466 103779 101105 99072 97895 97601 98255
54223 98255 99754 101292 101531 99915 97504 95922 95648 95895 95863 95391 94615 93946 94348 96533 99574 101422 101320
54206 101320 100731 101163 102134 102389 102236 103065 104828 105726 104703 102742 101161 99940 98578 97463 97250 97615
54190 97615 97751 97604 97604 97587 97200 97073 98306 100680 102560 102894 102353 102102 102351 102648 102874 103170 103273 102588 100967
54171 100967 99171 98535 100048 103358 106756 108643 109057 109340 110472 112443 115083 118316 121218 122051 120151
54156 120151 117053 114801 113700 112605 110883 108929 106954 104532 101580 98867 97124 96352 96372 97392 99432
54141 99432 101609 102743 102651 102339 102797 103926 104821 104825 104056 103013 102059 101328 100890 100739 100772 100894 100922 100255 98010
54122I8010l997m492l066o65J174J809J567Q54j64j192j827j986j946j907j796
54107H0376j407o87J9Q3o02j021LK102L473L088J851J065Q04N98O52J195J477
54090I3069P93m4K79J525K210J753R24L28j33l65j9L74k65j805k693k037p98l12
54072I2784n41n20J26P02L09j104k462k537j459o74q94r83J78J545J365M9l17
54055H5567P25J291J84j321j524n74K61L97Q5l12m75l03l16j075k063k189j484
54038G6874r43o48K89J718K251J660J404K089K365J500Q16J158J055o35k196j461
54022H7296O17J398N63J25R90K097K777L513M145L589J860N42M54M53p43k704
54006A06972m077m159l067j260N22J468J423J056J004J248J481J678K115L063
$$ plain form
54122 98010 94013 89521 86455 85790 86964 88773 90340 91194 91030 89838 88011 86025 84079 82172 80376
54107 80376 78969 78282 78301 78384 77782 76761 76764 78866 82339 85427 87278 88343 89147 89745 90397 91592 93069
54090 93069 93862 93818 94097 95622 97832 99585 100509 100837 100704 100339 100320 100694 100429 98624 95931 93894 93096 92784
54072 92784 92243 91723 91849 92551 92860 91756 89294 86757 85298 84624 83730 82747 82925 84470 85835 85884 85567
54055 85567 86292 87583 87767 86446 84922 84348 84609 85006 85091 84779 84304 84001 83685 82610 80547 78358 76874
54038 76874 75931 75283 75572 77290 79541 81201 82605 84694 87059 88559 89375 90533 91588 90953 88757 87296
54022 87296 87913 89311 89874 89999 90989 93086 95863 99376 103521 107110 108970 109512 109966 110419 109676 106972
54006 106972 102895 98736 95669 94409 94931 96399 97822 98878 99882 101130 102611 104289 106404 109467
53992A09467M348N150M669L322K583L082L706L379K880L549M994N607N095M685
53978A66516M832M509L226K228K773M408N831O638P400Q532R777J0511J0167Q670
53964B56018O725N360N051N530O332O918O469M514J918L16K67O72M11l92j162
53949C04947k027l276m130l267o97J591J461j044l617m173l198k981m591o444
53935B68554o480m854l500l498m210m810n261n384m490k638j281j572k689k934
53921B14953k000j151j255j740j744j390j335j525j202q6J076J408J034Q07J062
53906B06912J182O12j51j37P69J709K051K065K114J756M37j163j483k29P08m74
53890B16678k757l216p87K291L545L265L170L474L269L063M388O762P608O015
$$ plain form
53992 109467 113815 118965 123634 126956 129539 132621 136327 139706 142586 146135 151129 156736 161831 166516
53978 166516 171348 175857 179083 181311 184084 188492 194323 200961 208361 216893 226670 237181 247348 256018
53964 256018 262743 268103 273154 278684 285016 291934 298403 302917 304835 305151 305418 306090 306501 306109 304947
53949 304947 302920 299644 295514 292247 291550 293141 294602 293558 289941 285768 282570 279589 274998 268554
53935 268554 262074 257220 253720 250222 246012 241202 235941 230557 226067 223429 222148 220576 217887 214953
53921 214953 212953 211802 210547 208807 207063 205673 204338 202813 201611 201525 202601 204009 205043 205850 206912
53906 206912 208094 208706 208555 208418 209187 210896 212947 215012 217126 218882 219319 218156 216673 216444 217152 216678
53890 216678 213921 210705 209918 212209 215754 219019 222189 225663 228932 231995 236383 243145 250753 256768
53876B56768M378N027P068Q191P939P349O511M694K280O57M04J012K067L332M024
53861C21701L556K675K471K645K251J653J965K968L516L895N488P972R161Q265
53847C80182P140P295P775P269O463O623P220O813N338L812K375L06k325m407
53833D41879n185m799l668k403k096l504n822p320p362o982p194p707p746p406
53819C62685p481q221q961r059q639q167p604o587n369m895n604o684p123p048
53805B61243p242p667p467o398n288m727m327l648l059l104l664m308m880n192
53791A90272m727l379k048j637j776j321r0P01Jj641k681k385j603j503j888j291
53775A63004R01L023K618n65l846m348k037N02J111K58l2J082K260J930M67l33
$$ plain form
53876 256768 261146 266173 273241 281432 289371 296720 303231 307925 310205 310862 311266 312278 314345 317677 321701
53861 321701 325257 327932 330403 333048 335299 336952 338917 341885 345401 349296 354784 362756 371917 380182
53847 380182 387322 394617 402392 409661 416124 422747 429967 436780 442118 445930 448305 448611 446286 441879
53833 441879 436694 431895 428227 425824 423728 420224 414402 407082 399720 392738 385544 377837 370091 362685
53819 362685 355204 346983 338022 328963 320324 312157 304553 297966 292597 287702 282098 275414 268291 261243
53805 261243 254001 246334 238867 232469 227181 222454 218127 214479 211420 208316 204652 200344 195464 190272
53791 190272 185545 182166 180118 178481 176705 175384 175294 175995 175996 174355 171674 169289 167686 166183 164295 163004
53775 163004 163905 166928 169546 168981 165135 160787 158750 159252 160363 160621 160589 161671 163931 165861 166328 165995
53759A65995K73J223J562J767K438K857K268J629K456M204M747L526K438K969
53745B00352M066L849K286J060J439L197N216O469O709O542O545O293M992L083
53731B62098K198L123M899O305P059P052N816L698K352K726L525L042J659J004
53717C16556J272J166K19n56n65n60j219k028k303k295k555k874k614j755r77
53702B98912q51j300j832k118k304k794l634m306m278l581k638j838j604k444
53688B63390m219n557m839k077P89J724M01j934l866m746m628l877k884j953j282
53673B24442j053j339j804j724o68P68J335N43n22l62J035K101J703N47N8N62
53657B25622J360K062K866L616L720L090K300J742J467J819L248N305O853P496
$$ plain form
53759 165995 166268 167491 169053 170820 173258 176115 178383 180012 182468 186672 191419 194945 197383 200352
53745 200352 204418 208267 210553 211613 213052 216249 221465 227934 234643 241185 247730 254023 259015 262098
53731 262098 264296 267419 272318 278623 285682 292734 298550 302248 304600 307326 310851 313893 315552 316556
53717 316556 317828 318994 319213 318657 318092 317532 316313 314285 311982 309687 307132 304258 301644 299889 298912
53702 298912 298061 296761 294929 292811 290507 287713 284079 279773 275495 271914 269276 267438 265834 263390
53688 263390 259171 253614 248775 246698 247487 249211 249612 247678 243812 239066 234438 230561 227677 225724 224442
53673 224442 223389 222050 220246 218522 217854 218622 219957 220500 219978 219616 220651 222752 224455 225002 225060 225622
53657 225622 226982 229044 231910 235526 239246 242336 244636 246378 247845 249664 252912 258217 265070 272566
53643B72566P678P258N470K838J423K172L434L416K804L343M819N523N062M710
53629C32516M995M916L885K740K266K186K274L047M526N405M599K791J467R51
53615C78564M77j79l13M38J390J756J625J496J274M42q54j561j046k12n63k248
53599C80486l772l751k356o88M44P46K01o05o19L39Q88k72k326l113j846O8R63
53582C64787N75m55j560k234j951p83M96J342J958K508K554J893J283J584K665
53567C74662L750M438M695M363L528L143M144N923O692N711M305M163N177N841
53553D40535N391M723M955N843O160N440M745N433P496R490J0110R531Q983R245
53539E38080R953J0290R982R346Q753Q333Q084P917P675P370P337P707P946P461
$$ plain form
53643 272566 280244 287502 292972 295810 297233 299405 302839 306255 309059 312402 317221 322744 327806 332516
53629 332516 337511 342427 346312 349052 351318 353504 355778 358825 363351 368756 373355 376146 377613 378564
53615 378564 379041 378862 378549 378987 380377 382133 383758 385254 386528 386970 386116 384555 383509 383297 382734 380486
53599 380486 376714 372963 370607 369919 370363 371109 371310 370705 370086 370425 371313 371041 368715 365602 363756 363824 364787
53582 364787 365362 364907 363347 361113 359162 358379 358875 360217 362175 364683 367237 369130 370413 371997 374662
53567 374662 378412 382850 387545 391908 395436 398579 402723 408646 415338 421049 425354 429517 434694 440535
53553 440535 445926 450649 455604 461447 467607 473047 477792 483225 490721 500211 510321 519852 528835 538080
53539 538080 548033 558323 568305 577651 586404 594737 602821 610738 618413 625783 633120 640827 648773 656234
53525F56234O640O547P356P814O783M714K980K339K663L653M799N139M004K043
53511G23708N19k03n76n91J58J170J303N73K76Q77J258Q90J127L006N067M916
53495G43478K405k97j385q59L89J520J847J181K83J20O20J016J143J456J915K045
53479G56877K071K849M409N660N922N755N890O225O444O802P679Q937J0325J1944
53465H47789J3776J5249J5867J5951J6224J6976J8124J9705K1646K3299K4023
53454A048629K4217K5064K6973K8922K9805L0018L0952L3167L5794L7987M0054
53443A391582M2536M4855M5940M5991M6454M8056M9854N0677N0657N0752N1416
53432A918770N2413N3388N4004N3861N3024N2218N1990N2009N1697N1157N0934
$$ plain form
53525 656234 662874 669421 676777 684591 691374 696088 699068 701407 704070 707723 712522 717661 721665 723708
53511 723708 724227 724024 723448 722857 723015 724185 725488 726061 726337 727214 728472 729362 730489 733495 738562 743478
53495 743478 745883 745586 744201 743342 743731 745251 747098 748279 748562 748682 749302 750318 751461 752917 754832 756877
53479 756877 758948 761797 766206 771866 777788 783543 789433 795658 802102 808904 816583 825520 835845 847789
53465 847789 861565 876814 892681 908632 924856 941832 959956 979661 1001307 1024606 1048629
53454 1048629 1072846 1097910 1124883 1153805 1183610 1213628 1244580 1277747 1313541 1351528 1391582
53443 1391582 1434118 1478973 1524913 1570904 1617358 1665414 1715268 1765945 1816602 1867354 1918770
53432 1918770 1971183 2024571 2078575 2132436 2185460 2237678 2289668 2341677 2393374 2444531 2495465
53421B495465N1274N2086N3125N3725N2970N0828M8445M6665M4992M2876M1045
53410C033496M0307L9670L7311L3140K8930K5966K3933K2168K0596J9036J6926
53399C341479J4133J1131Q088M709J109k191n330r152j3792j8293k1865k4679
53387C285347k7168k9519l2133l5404l8732m0795m1244m1212m1665m2357m2833
53376B872285m3424m4553m5922m6960m7311m6527m4203m0862l7709l5127l2487
53365B407200k9770k7945k7006k5175k1302j6835j3957j2609j0924p997m786k256
53353B206638N2L422Q530J4665K0099K3542K5507K7642L0657L3792L6603L9843
53341B470992M3834M7394M9629N1632N4974N9441O3689O7339P0825P3902P6030
$$ plain form
53421 2495465 2546739 2598825 2651950 2705675 2758645 2809473 2857918 2904583 2949575 2992451 3033496
53410 3033496 3073803 3113473 3150784 3183924 3212854 3238820 3262753 3284921 3305517 3324553 3341479
53399 3341479 3355612 3366743 3374831 3379540 3380649 3378458 3373128 3363976 3350184 3331891 3310026 3285347
53387 3285347 3258179 3228660 3196527 3161123 3122391 3081596 3040352 2999140 2957475 2915118 2872285
53376 2872285 2828861 2784308 2738386 2691426 2644115 2597588 2553385 2512523 2474814 2439687 2407200
53365 2407200 2377430 2349485 2322479 2297304 2276002 2259167 2245210 2232601 2221677 2213680 2208894 2206638
53353 2206638 2206690 2210112 2218642 2233307 2253406 2276948 2302455 2330097 2360754 2394546 2431149 2470992
53341 2470992 2514826 2562220 2611849 2663481 2718455 2777896 2841585 2908924 2979749 3053651 3129681
53330C129681P7787Q0298Q3529Q6699R0018R4257R8919J02582J04966J06857J08113
53319D163706J07915J07068J07740J10058J11237J09325J05899J03488J01940
53310E128376R9305R5148R0802Q6645Q1311P3953O5801N8574N2292M5519L7504
53299E915230K9189K1820J4979O911k999j2860k0262k5181k9886l6067m3465n1363
53287E766046n9928o9289p8500q6444r2971r8306j02148j04382j05914j07480
53277D860684j08207j06801j03892j01663j00949j00285r8379r6250r5717r6522
53267C852019r6365r3771q9836q6644q4644q2320p8212p2494o6446o1112n6900
53256B983275n3906n1606m8579m3694l7833l3397l1590l0954k9293k6280k3236
$$ plain form
53330 3129681 3207468 3287766 3371295 3457994 3548012 3642269 3741188 3843770 3948736 4055593 4163706
53319 4163706 4271621 4378689 4486429 4596487 4707724 4817049 4922948 5026436 5128376
53310 5128376 5227681 5322829 5413631 5500276 5581587 5655540 5721341 5779915 5832207 5877726 5915230
53299 5915230 5944419 5966239 5981218 5988129 5985130 5972270 5952008 5926827 5896941 5860874 5817409 5766046
53287 5766046 5706118 5636829 5558329 5471885 5378914 5280608 5178460 5074078 4968164 4860684
53277 4860684 4752477 4645676 4541784 4440121 4339172 4238887 4140508 4044258 3948541 3852019
53267 3852019 3755654 3661883 3572047 3485403 3400759 3318439 3240227 3167733 3101287 3040175 2983275
53256 2983275 2929369 2877763 2829184 2785490 2747657 2714260 2682670 2651716 2622423 2596143 2572907
53245B572907k0971j8852j5905j1840p061k425J024K843L874N412P722J0000J1730
53232B538458J3224J4699J5883J6863J8430K1034K4159K7290L0732L4752L8731
53221B794255M1981M4783M7565M9442M8946M6237M3446M2451M2994M3274M1757
53210C287131L8238L3788L0040K7901K6624K4641K1494J8235J5641J2907Q895
53199C545535M012j91l014n316q202j1817j5602j9156k2611k6446l0937l5605
53187C370650l9447m2192m5009m9129n3861n6974n7388n6508n6336n7081n7442
53176B799283n6727n5596n4833n4367n3784n3104n2538n1899n0751m8968m6912
53165B219804m5077m3791m3154m2867m2206m0549l8174l6164l5116l4248l2418
$$ plain form
53245 2572907 2551936 2533084 2517179 2505339 2498278 2495853 2496877 2499720 2503594 2509006 2516728 2526728 2538458
53232 2538458 2551682 2566381 2582264 2599127 2617557 2638591 2662750 2690040 2720772 2755524 2794255
53221 2794255 2836236 2881019 2928584 2978026 3026972 3073209 3116655 3159106 3202100 3245374 3287131
53210 3287131 3325369 3359157 3389197 3417098 3443722 3468363 3489857 3508092 3523733 3536640 3545535
53199 3545535 3549547 3549356 3546342 3541026 3532824 3521007 3505405 3486249 3463638 3437192 3406255 3370650
53187 3370650 3331203 3289011 3244002 3194873 3141012 3084038 3026650 2970142 2913806 2856725 2799283
53176 2799283 2742556 2686960 2632127 2577760 2523976 2470872 2418334 2366435 2315684 2266716 2219804
53165 2219804 2174727 2130936 2087782 2044915 2002709 1962160 1923986 1887822 1852706 1818458 1786040
53154A786040k9933k8440k8667k9125k7960k5519k3989k4565k6122k6872k6276
53143A488572k4822k3055k1726k2037k4469k7567k9032k8172k6414k5265k4651
53132A211362k3739k2592k2175k2883k3845k3965k3298k2967k3792k5278k6225
53121I50603k6032k5119k4173k3468k2937k2322k1040j8599j5579j3682j4065
53110G23587j5916j7358j7414j6397j4757j2790j1387j1582j2797j2737j0170
53099E70282o981o151q050j0103j0174q929q361r035r809r699q904q050p405p058
53085D51573p167p431o902n032k746j712k409l545l784l376l444m063m106l125
53071C92731k280k661l489l120j567o81j447k348j397R73K280J040j705m011n052
$$ plain form
53154 1786040 1756107 1727667 1699000 1669875 1641915 1616396 1592407 1567842 1541720 1514848 1488572
53143 1488572 1463750 1440695 1418969 1396932 1372463 1344896 1315864 1287692 1261278 1236013 1211362
53132 1211362 1187623 1165031 1142856 1119973 1096128 1072163 1048865 1025898 1002106 976828 950603
53121 950603 924571 899452 875279 851811 828874 806552 785512 766913 751334 737652 723587
53110 723587 707671 690313 672899 656502 641745 628955 617568 605986 593189 580452 570282
53099 570282 563301 557150 549100 538997 528823 519894 511533 502498 492689 482990 474086 466036 458631 451573
53085 451573 444406 436975 430073 425041 422295 420583 418174 414629 410845 407469 404025 399962 395856 392731
53071 392731 390451 387790 384301 381181 379614 378933 377486 375138 373741 374714 376994 378034 376329 372318 367266
53056C67266n052m294l024j836j225j002p87p77j287j806j396o2J035R40j11j183
53040C45399j502q42L22R27L75m71j74J167J819R47P0R58K969L810K543M98p02
53023C58113p70k86K37M07n9r66j780k399l182m123m706m781m717m510l630k279
53007C20569j717k568l714l804l164l058l675m113m127m391m993n103m480l978
52993B67684l971l532j979k56L36k3k46j79m91j025p35M74J143J51j644k454j778
52976B51475q05q22j848k866l057k517j877j436r96n29m91j092j714j672j300
52961B28453j401j780j299K87J576J085r78l048l809l166k177k255l800n351m817
52946A97520j991R86K090J439L63k95o4J605M159N267L214m16k278j325L46P01
$$ plain form
53056 367266 362214 357920 354896 353060 351835 350833 350046 349269 347982 346176 344780 344718 345753 346693 346582 345399
53040 345399 343897 343055 343377 344304 344679 344208 344034 345201 347020 347967 348037 348995 351964 355774 358317 358815 358113
53023 358113 357343 357057 357294 357701 357642 356676 354896 352497 349315 345192 340486 335705 330988 326478 322848 320569
53007 320569 318852 316284 312570 308766 305602 302544 298869 294756 290629 286238 281245 276142 271662 267684
52993 267684 263713 260181 258202 257946 258282 258259 258013 257834 257343 256318 255583 256057 257200 257351 255707 253253 251475
52976 251475 250670 249848 248000 245134 242077 239560 237683 236247 235251 234722 234231 233139 231425 229753 228453
52961 228453 227052 225272 223973 224260 225836 226921 225943 222895 219086 215920 213743 211488 207688 202337 197520
52946 197520 195529 196515 198605 200044 200407 200112 200048 201653 205812 211079 214293 213877 211599 210274 210620 211321
52930B11321M6k64K73J284K149K104R42j08M48K034K414R92j74M87J785K027J660
52913B29420J843J834K83j709j460J354L956M070K473J223J008J248J631K428
52899B49602L736N126N746M719K069n92j241K97K108K657K632L571N400O482N777
52884B98089M002K567K152K569L374M179M707M836M631M078L013J365n29k096
52870C36937k915k934k400j784j592j941k285k003j299j064j608k129j856j191
52856C09936j007j266j205p51o70j324k204k796l048k764j552K28J430J411O04
52841B95022n92k263l937m336l053j424p18m91K15J065J298J426K427L740L834
52826B92213K525J173O41N92O47N97l96k900n279m787j258K086K604J224K61M5
$$ plain form
52930 211321 211367 211103 211376 212660 214809 216913 217855 217747 218195 220229 222643 223635 223461 223948 225733 227760 229420
52913 229420 231263 233097 233380 231671 230211 231565 235521 239591 242064 243287 244295 245543 247174 249602
52899 249602 253338 258464 264210 268929 270998 270406 269165 269462 271570 274227 276859 280430 285830 292312 298089
52884 298089 302091 304658 306810 309379 312753 316932 321639 326475 331106 335184 338197 339562 339033 336937
52870 336937 334022 331088 328688 326904 325312 323371 321086 319083 317784 316720 315112 312983 311127 309936
52856 309936 308929 307663 306458 305707 305037 303713 301509 298713 295665 292901 291349 291577 293007 294418 295022
52841 295022 294430 292167 288230 283894 280841 279417 278699 278208 278423 279488 280786 282212 284639 288379 292213
52826 292213 294738 295911 296552 297144 297791 298388 297992 295092 289813 285026 283768 285854 288458 289682 289943 289988
52810B89988m34r04j85J237J424L0q38L78K352K745J356P0J9K57m11j435j250
52793B94399M22J972J843L29r65j051k97N17J157J772K298K416J991J291Q03Q76
52777C09773J487K337L175L855M033L262J650K07m9Q08J830K376K553K452J686
52762C41435J10j383j434L02K481L290K329R79N99O67n54l496o399p346o429n126
52746C20025m184l141j803r90j469k855m047m487m615n080n689n487m064k453
52732B69661k124l174m347m797m705m058k330r7N96j175l481l976k967k277k058
52717B28691r45R42J647K18k111l948n105n467m588l110k761l838m336k710j77
52702A92402J023M90n19j217j805k440k843k813k414j898j848k769m190m822m119
$$ plain form
52810 289988 289554 288650 288465 289702 291126 291156 290318 290696 293048 295793 297149 297219 297238 297495 297084 295649 294399
52793 294399 294821 296793 298636 298965 298000 296949 296652 297169 298326 300098 302396 304812 306803 308094 308897 309773
52777 309773 311260 313597 316772 320627 324660 327922 329572 329779 329730 330538 332368 334744 337297 339749 341435
52762 341435 341545 340162 338728 339030 341511 344801 347130 348109 348708 349375 348821 345325 338926 331580 325151 320025
52746 320025 315841 312700 310897 309907 308438 305583 301536 297049 292434 287354 281665 276178 272114 269661
52732 269661 267537 264363 260016 255219 250514 246456 244126 244029 244625 243450 239969 235993 233026 230749 228691
52717 228691 227746 228688 230335 230553 228442 224494 219389 213922 209334 206224 203463 199625 195289 192579 192402
52702 192402 193425 193915 193396 192179 190374 187934 185091 182278 179864 177966 176118 173349 169159 164337 160218
52687A60218k912k183k037k200k531k563j676l03K12m10q03j27N71J23q90j338
52671A41151j392j755k093j664q00k56J62R07J280L05j419k253j653n21K64M22
52655A30685j85j311j952j502q13q71r95J2J460J440k83j956k469k432k325j575
52639A14928r0R73R53P42J218J766J407M38j49j54q4NO88K261M132N173M753L542
52621A42502L101M086N193M736L013J941K410L310L492L294L497L848L553K437
52607A90413Q98p59k236l122l361l452l642l521k889k361k580l319l824l680k967
52592A49598k108j820k509l312k650k72J997K361J074l68j290j973k305j646j00
52577A34677J177J255L01q73j571j462o81J59N69P97J403K176K101P17j045j775
$$ plain form
52687 160218 157306 155123 153086 150886 148355 145792 144116 143813 144025 143615 142812 142685 143256 143379 142489 141151
52671 141151 139759 138004 135911 134247 133447 133191 133353 134260 135540 135845 134426 132173 130520 129999 130263 130685
52655 130685 130500 129189 127237 125735 124922 124051 123056 123068 124528 125968 125685 123729 121260 118828 116503 114928
52639 114928 114838 115811 116764 117506 118724 120490 121897 122335 122186 122032 121948 121953 122641 124902 129034 134207 138960 142502
52621 142502 145603 149689 154882 159618 162631 164572 166982 170292 173784 177078 180575 184423 187976 190413
52607 190413 191311 190552 188316 185194 181833 178381 174739 171218 168329 165968 163388 160069 156245 152565 149598
52592 149598 147490 145670 143161 139849 137199 136927 138924 141285 142359 141991 140701 138728 136423 134777 134677
52577 134677 135854 137109 137410 136537 134966 133504 132823 132982 133551 134348 135751 137927 140028 140745 139700 137925
52561A37925j144j72M5m23n44K97J329J164n96k737l680k990j493k20M04M45O0
52544A27670n81j146j161l37R08J559J023Q9K44J802L241L000J489N29R54J721
52528A41004J605Q48N48R74J399J357J263J514J740J382O70L55O45R62Q25N48
52512A57639Q04J802L061L877L864L230K683K861L648M142L545K037O89M34J212
52497A95528K126K387K048J724J668J521J091Q91J463K463L017K800K223J618
52483B22568R62K22o60k094m196n862n494l018k10J341J720J742J680J519J511
52468B11731J647J438R19R58J869K740K958L117L420K618J64j988j750j52J07
52453B29796j279k139j502p59p53l71J037K180J959J210R45M71j092k747k767
$$ plain form
52561 137925 136781 136609 136654 136231 135687 135984 137313 138477 137881 135144 131464 128474 126981 126761 127165 127610 127670
52544 127670 127089 125943 124782 124445 125353 126912 127935 128024 128268 130070 133311 136311 137800 138329 139283 141004
52528 141004 142609 143457 144005 144979 146378 147735 148998 150512 152252 153634 154304 154659 155304 156266 157091 157639
52512 157639 158443 160245 163306 167183 171047 174277 176960 179821 183469 187611 191156 193193 193882 194316 195528
52497 195528 197654 200041 202089 203813 205481 207002 208093 208984 210447 212910 215927 218727 220950 222568
52483 222568 223530 223752 223092 220998 216802 210940 205446 202428 202218 203559 205279 207021 208701 210220 211731
52468 211731 213378 214816 215735 216693 218562 221302 224260 227377 230797 233415 233579 231591 229841 229689 229796
52453 229796 228517 226378 224876 224117 223364 222993 224030 226210 228169 229379 230324 230795 229703 226956 224189
52438B24189j227J45K44m37q16k64J042K151J990O35n10k59J008J983J890R50
52422B32714Pk0J091K312K333J201J31m00j029j735j350K72J306L68j314j638
52406B34249l66J260K579L485L265J408p68j185L00J769J774O74m80r72l27J348
52390B48013K688K080k74k299k400q99R60K445L364L642L261K172J45k581m676
52375B55641m670k664k99J087J395R89R4q61j241r38l74M26J821L496M288L580
52359B61770K071Q75N25J023K070K880K601J272j80j112j584j714j451j173j415
52344B66458j833j504n59j43m26r7J402K571J941K42q08q89p85o09J41J258K061
$$ plain form
52438 224189 222962 223107 223351 222914 222098 221834 222876 225027 227017 227652 227142 226883 227891 229874 231764 232714
52422 232714 232721 232701 233792 236104 238437 239638 239769 239369 238340 236605 235255 235527 236833 237201 235887 234249
52406 234249 233883 235143 237722 241207 244472 245880 245112 243927 244227 245996 247770 248444 247964 246992 246665 248013
52390 248013 250701 252781 252507 250208 247808 246909 247869 250314 253678 257320 260581 262753 262898 260317 255641
52375 255641 250971 248307 248008 249095 250490 251479 251573 250712 249471 248533 248159 248585 250406 253902 258190 261770
52359 261770 263841 264716 265241 266264 268334 271214 273815 275087 274907 273795 272211 270497 269046 267873 266458
52344 266458 264625 263121 262562 262419 261993 261896 263298 265869 267810 268052 267244 266355 265570 264961 265102 266360 268421
$$ [...]
##END NTUPLES=NMR SPECTRUM
##END=
