##TITLE=coffee_type TOSA02-ROVE100A_95-5%
COFFEE_meoh_noesyp64 COFFEE_meoh {C:\Bruker\TOPSPIN} Administrator 9
##JCAMPDX= 6.0         $$ Bruker NMR JCAMP-DX V2.0
##DATA TYPE= NMR SPECTRUM
##DATA CLASS= NTUPLES
##ORIGIN= Bruker BioSpin GmbH
##OWNER= Administrator
$$ 1.72 TOPSPIN		Version 2.1
$$ 2012-05-18 15:41:02.682 -0700  Administrator@X
$$ Compression mode = diff/dup
##.OBSERVE FREQUENCY= 400.13188235
##.OBSERVE NUCLEUS= ^1H
##.ACQUISITION MODE= SIMULTANEOUS (DQD)
##.ACQUISITION SCHEME= undefined
##.AVERAGES= 64
##.DIGITISER RES= 22
##SPECTROMETER/DATA SYSTEM= spect
##.PULSE SEQUENCE= noesygpps1d.comp
##.SOLVENT NAME= COFFEE_meoh
##.SHIFT REFERENCE= INTERNAL, COFFEE_meoh, 1, 14.98061
##AUDIT TRAIL= $$ (NUMBER, WHEN, WHO, WHERE, PROCESS, VERSION, WHAT)
$$ ##TITLE= Audit trail, TOPSPIN		Version 2.1
$$ ##JCAMPDX= 5.01
$$ ##ORIGIN= Bruker BioSpin GmbH
$$ ##OWNER= Administrator
$$ $$ C:\Bruker\TOPSPIN/data/Administrator/nmr/12-COFFEE-2002/92/pdata/1/auditp.txt
$$ ##AUDIT TRAIL=  $$ (NUMBER, WHEN, WHO, WHERE, PROCESS, VERSION, WHAT)
(   1,<2012-02-20 23:37:42.641 -0500>,<Administrator>,<TOPSPIN>,<go>,<TOPSPIN 2.1>,
      <created by zg
	started at 2012-02-20 23:26:12.406 -0500,
	POWCHK enabled, PULCHK disabled,
       configuration hash MD5:
       B0 76 FB 9C 50 81 44 7D 18 B3 26 32 4E 60 AD 96
       data hash MD5: 64K
       C2 70 3C 8F F9 A3 5E EF 82 C7 C0 62 A2 26 3A DF>)
(   2,<2012-02-20 23:37:45.313 -0500>,<Administrator>,<TOPSPIN>,<proc1d>,<TOPSPIN 2.1>,
      <Start of raw data processing
       efp LB = 0.3 FT_mod = 6 PKNL = 1 PHC0 = 0 PHC1 = 0 SI = 128K 
       data hash MD5: 128K
       44 84 B9 FC A3 AC B2 11 6B C3 4F 99 23 10 AA 5C>)
(   3,<2012-02-20 23:37:46.719 -0500>,<Administrator>,<TOPSPIN>,<proc1d>,<TOPSPIN 2.1>,
      <pk PHC0 = 23.31299 PHC1 = 0 
       data hash MD5: 128K
       66 29 BB 48 1C 7F F7 B9 90 3F 27 3D 94 A8 32 36>)
(   4,<2012-02-20 23:37:47.000 -0500>,<Administrator>,<TOPSPIN>,<proc1d>,<TOPSPIN 2.1>,
      <abs ABSG = 1 
       data hash MD5: 128K
       58 B1 18 CD F5 34 6E D0 97 03 D4 6A D9 EF B7 D7>)
(   5,<2012-02-20 23:37:47.094 -0500>,<Administrator>,<TOPSPIN>,<proc1d>,<TOPSPIN 2.1>,
      <abs ABSG = 2 
       data hash MD5: 128K
       7D F2 D9 C0 BB BB D9 9C 1E 61 7A 78 7C 43 4E 3C>)
(   6,<2012-02-20 23:37:47.141 -0500>,<Administrator>,<TOPSPIN>,<proc1d>,<TOPSPIN 2.1>,
      <abs ABSG = 3 
       data hash MD5: 128K
       2B 45 9D BD 0E B4 43 A6 F2 7E AB 19 FB 7A 0A 48>)
(   7,<2012-02-20 23:37:47.219 -0500>,<Administrator>,<TOPSPIN>,<proc1d>,<TOPSPIN 2.1>,
      <abs ABSG = 4 
       data hash MD5: 128K
       A8 3E 6F 99 D6 C2 FD 5C 61 85 0A 6C 92 39 45 EE>)
(   8,<2012-02-20 23:37:47.266 -0500>,<Administrator>,<TOPSPIN>,<proc1d>,<TOPSPIN 2.1>,
      <abs ABSG = 5 
       data hash MD5: 128K
       D7 EE D3 C4 98 90 1F EB 52 4B DD E6 4B 41 4E F9>)
(   9,<2012-02-20 23:37:47.453 -0500>,<Administrator>,<TOPSPIN>,<audit>,<TOPSPIN 2.1>,
      <user comment:
       ICON-NMR User ID: Administrator
$$ [...]
150 150 150 150 150 150 150 150
##$TP07= 0
##$TPNAME0= <>
##$TPNAME1= <>
##$TPNAME2= <>
##$TPNAME3= <>
##$TPNAME4= <>
##$TPNAME5= <>
##$TPNAME6= <>
##$TPNAME7= <>
##$TPOAL= (0..7)
0.5 0.5 0.5 0.5 0.5 0.5 0.5 0.5
##$TPOFFS= (0..7)
0 0 0 0 0 0 0 0
##$TUNHIN= 0
##$TUNHOUT= 0
##$TUNXOUT= 0
##$USERA1= <user>
##$USERA2= <user>
##$USERA3= <user>
##$USERA4= <user>
##$USERA5= <user>
##$V9= 5
##$VALIST= <valist>
##$VCLIST= <CCCCCCCCCCCCCCC>
##$VD= 0
##$VDLIST= <DDDDDDDDDDDDDDD>
##$VPLIST= <PPPPPPPPPPPPPPP>
##$VTLIST= <TTTTTTTTTTTTTTT>
##$WBST= 1024
##$WBSW= 4
##$XGAIN= (0..3)
0 0 0 0
##$XL= 0
##$YL= 0
##$YMAX_a= 14350968
##$YMIN_a= -6696354
##$ZGOPTNS= <>
##$ZL1= 120
##$ZL2= 120
##$ZL3= 120
##$ZL4= 120
##$ABSF1= 14.98061
##$ABSF2= -5.57192
##$ABSG= 5
##$ABSL= 3
##$ALPHA= 0
##$AQORDER= 0
##$ASSFAC= 0
##$ASSFACI= 0
##$ASSFACX= 0
##$ASSWID= 0
##$AUNMP= <proc_prof1d_extract>
##$AXLEFT= 0
##$AXNAME= <>
##$AXNUC= <1H>
##$AXRIGHT= 0
##$AXTYPE= 0
##$AXUNIT= <>
##$AZFE= 0.1
##$AZFW= 0.1
##$BCFW= 0
##$BC_mod= 0
##$BYTORDP= 0
##$COROFFS= 0
##$CY= 15
##$DATMOD= 1
##$DC= 0
##$DFILT= <>
##$DTYPP= 0
##$F1P= 0
##$F2P= 0
##$FCOR= 0.5
##$FTSIZE= 131072
##$FT_mod= 6
##$GAMMA= 0
##$GB= 0
##$INTBC= 1
##$INTSCL= 1
##$ISEN= 128
##$LB= 0.3
##$LEV0= 0
##$LPBIN= 0
##$MAXI= 10000
##$MC2= 0
##$MEAN= 0
##$ME_mod= 0
##$MI= 0
##$NCOEF= 0
##$NC_proc= -3
##$NLEV= 6
##$NOISF1= 0
##$NOISF2= 0
##$NSP= 0
##$NTH_PI= 0
##$NZP= 0
##$OFFSET= 14.98061
##$PC= 1
##$PHC0= 23.31299
##$PHC1= 0
##$PH_mod= 1
##$PKNL= yes
##$PPARMOD= 0
##$PPDIAG= 0
##$PPIPTYP= 0
##$PPMPNUM= 2147483647
##$PPRESOL= 1
##$PSCAL= 4
##$PSIGN= 0
##$PYNMP= <proc.py>
##$REVERSE= no
##$SF= 400.13
##$SI= 131072
##$SIGF1= 0
##$SIGF2= 0
##$SINO= 400
##$SIOLD= 131072
##$SPECTYP= <>
##$SREGLST= <1H.CDCl3>
##$SSB= 0
##$STSI= 131072
##$STSR= 0
##$SW_p= 8223.68421052632
##$SYMM= 0
##$S_DEV= 0
##$TDeff= 65536
##$TDoff= 0
##$TI= <>
##$TILT= no
##$TM1= 0
##$TM2= 0
##$TOPLEV= 0
##$USERP1= <user>
##$USERP2= <user>
##$USERP3= <user>
##$USERP4= <user>
##$USERP5= <user>
##$WDW= 1
##$XDIM= 131072
##$YMAX_p= 497545561
##$YMIN_p= -244899858
##$CURPLOT= <Network HP LaserJet P1505>
##$CURPRIN= <$Network HP LaserJet P1505>
##$DFORMAT= <normdp>
##$LAYOUT= <+/1D_H.xwp>
##$LFORMAT= <normlp>
##$PFORMAT= <normpl>
##$SURQMSG= 1
$$ End of Bruker specific parameters
$$ ---------------------------------
##NTUPLES= NMR SPECTRUM
##VAR_NAME=  FREQUENCY,     SPECTRUM/REAL,   SPECTRUM/IMAG
##SYMBOL=    X,             R,               I
##VAR_TYPE=  INDEPENDENT,   DEPENDENT,       DEPENDENT
##VAR_FORM=  AFFN,          ASDF,            ASDF
##VAR_DIM=   131072,        131072,          131072
##UNITS=     HZ,            ARBITRARY UNITS, ARBITRARY UNITS
##FACTOR=    0.0627417313425165, 1,          1
##FIRST=     8223.62146879498, -4636,        -91370
##LAST=      0,             -360,            -93914
##MIN=       0,             -244899858,      0
##MAX=       8223.62146879498, 497545561,    0
$$ Real data points
##PAGE= N=1
##DATA TABLE= (X++(R..R)), XYDATA
$$ [...]
62957C446585o7005p0945p2029p1623p1041p0338o8172o3298n5982m7499l8741
62946B749912l0181k2654j6661j1047m038M097J1121J6059K0505K5703L0278L2622
62934B805716L3769L5611L7334L6439L2988L0113K9813L0601L0097K7847K4416
62923C154744J9676J3561P127J118n635j4741k5745l6641m6435n5643o4533p2534
62911B874319p9402q5359q9762r1241q9815q7456q5598q3275p8977p3363o8575
62900A961496o5236o1787n6953n1360m6246m1837l7869l4774l3119l2233l0443
62889A469639k6874k2332j8392j6107j5551j5996j6258j5437j3694j2114j1622
62878A285262j2117j2830j3214j3370j3682j4171j4333j3712j2662j2140j2468
$$ plain form
62957 3446585 3379580 3308635 3236606 3164983 3093942 3023604 2955432 2892134 2836152 2788653 2749912
62946 2749912 2719731 2697077 2680416 2669369 2665331 2669428 2680549 2696608 2717113 2742816 2773094 2805716
62934 2805716 2839485 2875096 2912430 2948869 2981857 3011970 3041783 3072384 3102481 3130328 3154744
62923 3154744 3174420 3187981 3195108 3196226 3190591 3175850 3150105 3113464 3067029 3011386 2946853 2874319
62911 2874319 2794917 2709558 2619796 2528555 2438740 2351284 2265686 2182411 2103434 2030071 1961496
62900 1961496 1896260 1834473 1777520 1726160 1679914 1638077 1600208 1565434 1532315 1500082 1469639
62889 1469639 1442765 1420433 1402041 1385934 1370383 1354387 1338129 1322692 1308998 1296884 1285262
62878 1285262 1273145 1260315 1247101 1233731 1220049 1205878 1191545 1177833 1165171 1153031 1140563
62867A140563j2765j2086j0708r611r023q464q037q507r779j0465r576p773o334
62854A017435n592n091m618m223l722l004k470k494k838l271m146n527o251n048
62840I59140k384j24N73P0q78j909k632k578k010j810k216k452j998j309r11o73
62824I35899n12r41k145l238l390l057l151l363k469l12J602J886Q84l2k10j35
62808I17316k92m05o1M69M31m17j577k499l184l858m465m729m511l915l210k837
62792H82256l035l290k659j026N12J064J158J797K792L105K630K466L241M139
62778H95150L975K550O84n36m44O69J654J730J571K341L898N022N364N743O248
62763I35619N673L593J561J068J507J502J235J868L190L600K480J168J213K647
$$ plain form
62867 1140563 1127798 1115712 1105004 1095393 1086370 1077906 1069869 1061362 1051583 1041118 1031542 1023769 1017435
62854 1017435 1011843 1006752 1002134 997911 994189 991185 988715 986221 983383 980112 975966 970439 964188 959140
62840 959140 956756 956632 957205 957275 956397 954488 951856 949278 947268 945458 943242 940790 938792 937483 936572 935899
62824 935899 935387 934446 932301 929063 925673 922616 919465 916102 913633 913321 914923 916809 917693 917661 917451 917316
62808 917316 917024 916619 916558 917027 917458 917041 915464 912965 909781 905923 901458 896729 892218 888303 885093 882256
62792 882256 879221 875931 873272 872246 872758 873822 874980 876777 879569 882674 885304 887770 891011 895150
62778 895150 899125 901675 902359 901823 901379 902048 903702 905432 907003 909344 913242 918264 923628 929371 935619
62763 935619 941292 944885 946446 947514 949021 950523 951758 953626 956816 960416 962896 964064 965277 967924
62749I67924M325N281N387N286N846P405R436J1188J2409J3175J3376J2937J2309
62736A086284J2204J3070J5208J8850K3396K7186K9101L0235L2742L6972M0900
62725A366148M2808M3540M5408M9435N4463N8783O2159O5896P1088P7090Q2276
62714B019094Q6171Q9974R4615R9160J01950J02511J01224R7720R1195Q2121P2144
62703C037879O1931N0382L6371K0127K546j5773l4066n1098o6002p8730q9183
62692B874384r6755j01386j04147j05947j06445j05111j02528r9531r5672q9901
62682A866961q2587p5617p0334o6290o2225n7416n1902m6206m1166l7509l5204
62671A240505l3437l1348k8513k4876k0825j7431j5795j5701j5319j2929q704
$$ plain form
62749 967924 972249 977530 982917 988203 994049 1001454 1010890 1022078 1034487 1047662 1061038 1073975 1086284
62736 1086284 1098488 1111558 1126766 1145616 1169012 1196198 1225299 1255534 1288276 1325248 1366148
62725 1366148 1408956 1452496 1497904 1547339 1601802 1660585 1722744 1788640 1859728 1936818 2019094
62714 2019094 2105265 2195239 2289854 2389014 2490964 2593475 2694699 2792419 2883614 2965735 3037879
62703 3037879 3099810 3150192 3186563 3206690 3209236 3193463 3159397 3108299 3042297 2963567 2874384
62692 2874384 2777629 2676243 2572096 2466149 2359704 2254593 2152065 2052534 1956862 1866961
62682 1866961 1784374 1708757 1638423 1572133 1509908 1452492 1400590 1354384 1313218 1275709 1240505
62671 1240505 1207068 1175720 1147207 1122331 1101506 1084075 1068280 1052579 1037260 1024331 1015627
62660A015627m413j459K31J411K349K935L541N001P617J0751J3662J6240J8629
62647A092122K0641K2160K3748K6127K9208L2381L5645L9590M4160M8422N1861
62636A466065N5098N8793O2618O5915O8837P2097P5867P9407Q1486Q0921P7313
62625B244417P1604O5256N8276M8875L5916K0955O724n893j8104l0792m3383n5085
62613B398766o5669p4503q0294q2806q3855q5447q7431q7899q5596q1048p5632
62602A508586p0467o6273o3254o0655n7016n1531m5045l9346l5541l3394l2006
62591I54058l0595k8581k5628k2155j9389j8202j7997j7404j6027j4681j3869
62580G29530j3057j1949j1373j1971j2710j1901r364o516m523l397k879k990l542
$$ plain form
62660 1015627 1011214 1009755 1009986 1011397 1013746 1016681 1020222 1025223 1032840 1043591 1057253 1073493 1092122
62647 1092122 1112763 1134923 1158671 1184798 1214006 1246387 1282032 1321622 1365782 1414204 1466065
62636 1466065 1521163 1579956 1642574 1708489 1777326 1849423 1925290 2004697 2086183 2167104 2244417
62625 2244417 2316021 2381277 2439553 2488428 2524344 2545299 2552023 2546130 2528026 2497234 2453851 2398766
62613 2398766 2333097 2258594 2178300 2095494 2011639 1926192 1838761 1750862 1665266 1584218 1508586
62602 1508586 1438119 1371846 1308592 1247937 1190921 1139390 1094345 1054999 1019458 986064 954058
62591 954058 923463 894882 869254 847099 827710 809508 791511 774107 758080 743399 729530
62580 729530 716473 704524 693151 681180 668470 656569 647205 640689 636166 632769 629890 626900 623358
62567F23358l990m098l965l236j262J585L746M159L377K577K219K264K865M102
62553F33701N508O700P996R723J1308J1925J1809J2133J3519J5291J6325J6312
62541G72250J6095J6914J9278K2501K5552K8260L1173L4292L6721L7971L8904
62530A079911M0850M4286M8660N2817N5176N4537N1552M8555M6859M5010M0823
62519A609036L4290K6879J8667Q290m062j5614k3858k9077l3239l7511m1733m5335
62507A466733m7835m8925m8933m8728m8579m7660m5244m1814l8453l5582l2956
62496I82024l0393k7813k5032k2134j9731j8209j7161j6107j5350j5412j5944
62485G58738j6020j5259j4064j2860j1734j0609r316p618n611l766k196n02J190
$$ plain form
62567 623358 619368 615270 611305 608069 606807 608392 612138 616297 619674 622251 624470 626734 629599 633701
62553 633701 639209 645909 653905 663628 674936 686861 698670 710803 724322 739613 755938 772250
62541 772250 788345 805259 824537 847038 872590 900850 932023 966315 1003036 1041007 1079911
62530 1079911 1120761 1165047 1213707 1266524 1321700 1376237 1427789 1476344 1523203 1568213 1609036
62519 1609036 1643326 1670205 1688872 1697162 1693100 1677486 1653628 1624551 1591312 1553801 1512068 1466733
62507 1466733 1418898 1369973 1321040 1272312 1223733 1176073 1130829 1089015 1050562 1014980 982024
62496 982024 951631 923818 898786 876652 856921 838712 821551 805444 790094 774682 758738
62485 758738 742718 727459 713395 700535 688801 678192 668876 661258 655647 651881 649685 649183 650373
62472F50373J840J140P44K371N204O839O682O610P936R708J0836J2140J4864J8394
62458G55681K1076K2546K3718K4920K5702K6321K7874L0619L3399L5227L6524
62447A063607L8315M0871M3568M5403M5387M3035L8934L4338K9908K5285J9981
62436A468632J3966P119q74r525j7272k3130k7945l3005l7901m0929m1418m0482
62424A217236l9426l8506l7461l6102l3965l0475k6108k2571k0942k0322j9154
62413H92204j7256j5522j4075j1968q910o137n070n599o235n669l928k101j138
62400G88596q70l33R73K488L577M531N907P212P304O214N576O750R207J1197J1564
62385H69893J0439Q773P643P610Q114P692N371J645k228n539q312j0623j2396
$$ plain form
62472 650373 652213 653353 654097 656468 661672 668511 675193 681803 689739 699447 710283 722423 737287 755681
62458 755681 776757 799303 823021 847941 873643 899964 927838 958457 991856 1027083 1063607
62447 1063607 1101922 1142793 1186361 1231764 1277151 1320186 1359120 1393458 1423366 1448651 1468632
62436 1468632 1482598 1489717 1488843 1479318 1462046 1438916 1410971 1377966 1340065 1299136 1257718 1217236
62424 1217236 1177810 1139304 1101843 1065741 1031776 1001301 975193 952622 931680 911358 892204
62413 892204 874948 859426 845351 833383 824473 818336 813266 807667 801432 795763 791835 789734 788596
62400 788596 787726 787393 788366 790854 794431 798962 804869 812081 819385 825599 831175 837925 847132 858329 869893
62385 869893 880332 889105 896748 904358 912472 920164 925535 927180 924952 919413 911101 900478 888082
62372H88082j3766j4929j5745j6019j6133j6698j7475j7312j5464j2576r945q214
62360G13806p028n746m192k618j240M8J401K628L409L955M961O523P701P819P871
62345G39298R482J2477J4617J4328J2684J1879J2398J2886J2462J1828J1891J2328
62333H88558J2222J1384J0247Q914P130N197M010L900L951L002J084n77r81m22
62319I57619M8P5O48L084P404J2034J5387J7492J9580K2276K5089K7855L1575
62306A140166L6848M2405M6509M9564N3707N9546O4913O7778O9031P1083P4453
62295A776003P7240P7625P5357P0797O3944N4992M4663L3341K0714P046n946j6470
62283B279306k4560l1778l9204m6456n2646n7460o1041o3513o4970o5569o5134
$$ plain form
62372 888082 874316 859387 843642 827623 811490 794792 777317 760005 744541 731965 722020 713806
62360 713806 706778 701032 696840 694222 692982 693030 694431 697059 700468 704423 709384 715907 723608 731427 739298
62345 739298 748780 761257 775874 790202 802886 814765 827163 840049 852511 864339 876230 888558
62333 888558 900780 912164 922411 931325 938455 943652 947662 951562 955513 958515 959599 959022 958041 957619
62319 957619 957667 957742 958390 961474 968878 980912 996299 1013791 1033371 1055647 1080736 1108591 1140166
62306 1140166 1177014 1219419 1265928 1315492 1369199 1428745 1493658 1561436 1630467 1701550 1776003
62295 1776003 1853243 1930868 2006225 2077022 2140966 2195958 2240621 2273962 2294676 2301722 2295776 2279306
62283 2279306 2254746 2222968 2183764 2137308 2084662 2027202 1966161 1902648 1837678 1772109 1706975
62272A706975o3070n9197n4558n0806m8559m6798m4177m0645l7265l4663l2278
62261A194959k9341k6018k3109k0986j9335j7784j6153j4021j0754o448k518o58
62249A007834j067k137k158j146n30j178k269k459j684j113j457k113k270k135
62235I84118k496l471m266m072k698m37K126M211N174N053M592M687N826P854
62221A006201J0005J1391J1827J2088J3062J4689J6191J7216J8290J9962K2017
62210A172939K3836K5295K6966K9430L2555L5595L7997M0057M2575M5976N0120
62199A563341N4889O0312O5817O9995P1747P1314O9640O7089O3351N8100N0941
62188B266536M1057K8139J3637M1j1430k1596l1593m1332m9978n7057o2426o5852
$$ plain form
62272 1706975 1643905 1584708 1530150 1479344 1430785 1383987 1339810 1299165 1261900 1227237 1194959
62261 1194959 1165618 1139600 1116491 1095505 1076170 1058386 1042233 1028212 1017458 1011010 1008492 1007834
62249 1007834 1006767 1004630 1002472 1001326 1000796 999618 997349 994890 993206 992093 990636 988523 986253 984118
62235 984118 981622 978151 973885 969813 967115 966678 968804 973015 978189 983242 987834 992521 998347 1006201
62221 1006201 1016206 1027597 1039424 1051512 1064574 1079263 1095454 1112670 1130960 1150922 1172939
62210 1172939 1196775 1222070 1249036 1278466 1311021 1346616 1384613 1424670 1467245 1513221 1563341
62199 1563341 1618230 1678542 1744359 1814354 1886101 1957415 2027055 2094144 2157495 2215595 2266536
62188 2266536 2307593 2335732 2349369 2349410 2337980 2316384 2284791 2243459 2193481 2136424 2073998 2008146
62176B008146o7381o7646o7136o5525o2280n7667n2546m7377m2029l6533l1411
62165A410615k7161k3713k0624j7653j5044j3128j1705j0003p510m723k723k023
62153A254605k132k171j524J22K730N650P785Q374P577O274N400N390O046P070
62139A311196Q764J1705J5380J8036J8758J9007K0798K3758K5772K6444K7959
62128A527577L1775L6310L9044L9532L8959L7868L5979L3585L1390K9137K5922
62117A907078K2015J9155J8610J9772K1092K1866K2811K5058K8903L3569L8197
62106B178126M2670M7031N0446N1733N0916M8999M5930M0287L1709K2205J3994
62095B624046P184R23m449q129j0855j4198j8296k2099k5535k9410l3195l4855
$$ plain form
62176 2008146 1940765 1873119 1805983 1740458 1678178 1620511 1567965 1520588 1478559 1442026 1410615
62165 1410615 1383454 1359741 1339117 1321464 1306420 1293292 1281587 1271584 1264074 1259351 1256628 1254605
62153 1254605 1252473 1250302 1248778 1248900 1251630 1257280 1265065 1273439 1281016 1287290 1292690 1298080 1304126 1311196
62139 1311196 1319960 1331665 1347045 1365081 1383839 1402846 1423644 1447402 1473174 1499618 1527577
62128 1527577 1559352 1595662 1634706 1674238 1713197 1751065 1787044 1820629 1852019 1881156 1907078
62117 1907078 1929093 1948248 1966858 1986630 2007722 2029588 2052399 2077457 2106360 2139929 2178126
62106 2178126 2220796 2267827 2318273 2370006 2420922 2469921 2515851 2556138 2587847 2610052 2624046
62095 2624046 2631230 2632153 2627704 2619575 2608720 2594522 2576226 2554127 2528592 2499182 2465987 2431132
62083B431132l3465l0302k6895k3500k0035j7034j4709j2335r498o936n293l926
62071B227204j925M21K120K987L795N247P498J0439J3731J6688J8656J9712K0768
62058B347341K2825K6017K9282L1273L1825L2191L3522L5590L7568L9487M1957
62047B708878M4895M7579M9723N1424N2342N2294N2447N4359N7732O0686O2656
62036C295015O5272O9658P4363P7088P7296P6029P4125P1881O9945O9406P1042
62025D091120P4755P9332Q2678Q3157Q1172P8616P6641P4961P3387P2443P1958
62014D940220P0824O9146O8901P1109P3890P4962P4805P5469P7240P8489P8172
62003E753227P6626P4272P1338O8555O6441O4000N9758N3939M8109M2976L8170
$$ plain form
62083 2431132 2397667 2367365 2340470 2316970 2296935 2279901 2265192 2252857 2243359 2236423 2231130 2227204
62071 2227204 2225279 2225700 2227820 2230807 2234602 2239849 2247347 2257786 2271517 2288205 2306861 2326573 2347341
62058 2347341 2370166 2396183 2425465 2456738 2488563 2520754 2554276 2589866 2627434 2666921 2708878
62047 2708878 2753773 2801352 2851075 2902499 2954841 3007135 3059582 3113941 3171673 3232359 3295015
62036 3295015 3360287 3429945 3504308 3581396 3658692 3734721 3808846 3880727 3950672 4020078 4091120
62025 4091120 4165875 4245207 4327885 4411042 4492214 4570830 4647471 4722432 4795819 4868262 4940220
62014 4940220 5011044 5080190 5149091 5220200 5294090 5369052 5443857 5519326 5596566 5675055 5753227
62003 5753227 5829853 5904125 5975463 6044018 6110459 6174459 6234217 6288156 6336265 6379241 6417411
61992F417411L3893L0830K8394K5082K0831J7222J4940J2979J0812R429R321R344
61980F640488Q706Q484R740J1439J1767J0650R601R601J0319J0966J0878R716
61968F762355P794N818L743O68l417o799q036p947q403r781j1006j1636j2344
61955F701009j3354j3834j3106j1380r078o331l537j395lJ476L909P369J1376
61942F653121J5354J8633K0579K0989K0138J8451J6490J4958J3841J1619O452
61931F830625j434r449j5290j9183k2886k7171l1227l4185l6114l7570l8910m0281
61919F516925m1657m2697m3027m2927m3307m4701m6533m7734m7877m7479m7273
61908F021713m7382m7374m6963m6535m6709m7357m7377m5854m3276m1028l9618
$$ plain form
61992 6417411 6451304 6482134 6510528 6535610 6556441 6573663 6588603 6601582 6612394 6621823 6631144 6640488
61980 6640488 6649194 6657678 6667418 6678857 6690624 6701274 6710875 6720476 6730795 6741761 6752639 6762355
61968 6762355 6770149 6775967 6779710 6780378 6776961 6770162 6762126 6754179 6745776 6735995 6724989 6713353 6701009
61955 6701009 6687655 6673821 6660715 6649335 6640257 6633926 6630389 6628994 6628991 6630467 6634376 6641745 6653121
61942 6653121 6668475 6687108 6707687 6728676 6748814 6767265 6783755 6798713 6812554 6824173 6830625
61931 6830625 6829191 6819742 6804452 6785269 6762383 6735212 6703985 6669800 6633686 6596116 6557206 6516925
61919 6516925 6475268 6432571 6389544 6346617 6303310 6258609 6212076 6164342 6116465 6068986 6021713
61908 6021713 5974331 5926957 5879994 5833459 5786750 5739393 5692016 5646162 5602886 5561858 5522240
61897E522240l8079l5504l2532l0604k9905k8803k5608k0393j4854j0651q004
61886E247303n747k529J907O693J1049J5172J9473K3353K5710K6737K8186L1263
61874E428570L5125L8241M0459M2670M4977M6676M7985N0246N3898N7543N9943
61863E946333O2021O5750P1734P9051Q7178R6659J07670J19369J31360J44865
61853F911990J61336J80350J99991K19352K39706K62903K89391L18408L49504
61844I132931L82978M18920M56828M96484N38536N83345O29440O73495P11575
61835A4024532P39653P52722P44138P06617O34353N24827L79832K06015J4588
61826A8727277j80332l64383n25486o55526p51129q13306q45886q53509q40672
$$ plain form
61897 5522240 5484161 5448657 5416125 5385521 5355616 5326813 5301205 5280812 5265958 5255307 5247303
61886 5247303 5241556 5239027 5240934 5247627 5258676 5273848 5293321 5316674 5342384 5369121 5397307 5428570
61874 5428570 5463695 5501936 5542395 5585065 5630042 5676718 5724703 5774949 5828847 5886390 5946333
61863 5946333 6008354 6074104 6145838 6224889 6312067 6408726 6516396 6635765 6767125 6911990
61853 6911990 7073326 7253676 7453667 7673019 7912725 8175628 8465019 8783427 9132931
61844 9132931 9515909 9934829 10391657 10888141 11426677 12010022 12639462 13312957 14024532
61835 14024532 14764185 15516907 16261045 16967662 17602015 18126842 18506674 18712689 18727277
61826 18727277 18546945 18182562 17657076 17001550 16250421 15437115 14591229 13737720 12897048
61817A2897048q11979p72258p25711o75221o22952n71233n22169m76431m33336
61808G285758l92431l54416l20129k89332k61162k35365k12290j91818j73053
61799D855762j55170j37966j21471j05624r0655p7246o5841n6066m7202l9068
61789C959453l2167k6931k3059j9702j6346j3674j3170j5487j9275k2224k3343
61778C734075k3557k3925k4020k2661j9590j5650j1593p415k839K162P260J1718
61766C603965J4521J5169J4306J3051J1649R433O226L076J179M96K2p75j227j19
61752C690972L181Q354J4568K1143K7887L5007M2754N1194O0162O9351P8564Q7951
61740D191088R7857J08231J18510J28380J38530J50016J62761J75377J86992J98781
$$ plain form
61817 12897048 12085069 11312811 10587100 9911879 9288927 8717694 8195525 7719094 7285758
61808 7285758 6893327 6538911 6218782 5929450 5668288 5432923 5220633 5028815 4855762
61799 4855762 4700592 4562626 4441155 4335531 4244876 4167630 4101789 4045723 3998521 3959453
61789 3959453 3927286 3900355 3877296 3857594 3841248 3827574 3814404 3798917 3779642 3757418 3734075
61778 3734075 3710518 3686593 3662573 3639912 3620322 3604672 3593079 3585664 3582825 3584987 3592247 3603965
61766 3603965 3618486 3633655 3647961 3661012 3672661 3682094 3688320 3691396 3692575 3693071 3693093 3692318 3691091 3690972
61752 3690972 3694153 3702507 3717075 3738218 3766105 3801112 3843866 3895060 3955222 4024573 4103137 4191088
61740 4191088 4288945 4397176 4515686 4644066 4782596 4932612 5095373 5270750 5457742 5656523
61730E656523K12768K29192K46033K61662K77218K95374L17123L41014L65751
61721H202658L92381M23004M58265M97231N39486N86082O38215O96000P58879
61712A3192201Q26597Q99268R76855J058683J142794J225485J301822J366352
61704B1990057J412286J429723J405966J328734J189324R83830P14544L93025
61696C0847489M1261l12931o43814r32514j166723j339332j449151j501832j508075
61687B2034378j479620j426051j354409j270772j181361j091590j004330r20056
61679A2306189q39202p63456o94244o31074n72793n19672m72652m30900l92125
61670F990071l55527l22620k94541k70144k47664k26799k08090j91405j76381
$$ plain form
61730 5656523 5869291 6098483 6344516 6606178 6883396 7178770 7495893 7836907 8202658
61721 8202658 8595039 9018043 9476308 9973539 10513025 11099107 11737322 12433322 13192201
61712 13192201 14018798 14918066 15894921 16953604 18096398 19321883 20623705 21990057
61704 21990057 23402343 24832066 26238032 27566766 28756090 29739920 30454464 30847489
61696 30847489 30888750 30575819 29932005 28999491 27832768 26493436 25044285 23542453 22034378
61687 22034378 20554758 19128707 17774298 16503526 15322165 14230575 13226245 12306189
61679 12306189 11466987 10703531 10009287 9378213 8805420 8285748 7813096 7382196 6990071
61670 6990071 6634544 6311924 6017383 5747239 5499575 5272776 5064686 4873281 4696900
61661D696900j63471j53101j44325j35709j27331j20603j16065j12464j08189
61652C515642j02724r6510r0144q4172p9035p4736p0785o6745o2719n9176n6431
61641B672465n4363n2530n0558m8419m6283m4232m2310m0818m0074l9781l9124
61630B173973l7719l6052l4695l3594l2493l1463l0463k8873k6316k3671k2410
61619A836224k2828k3545k2934k0646j7618j4993j3208j1903j0644r644r495j0088
61607A648678j0389r773r039r333j0355j0608r404p676o615o386o577p051p682
61594A537790p806o767m846l043j979j486j235j294j818k451k396j172P62K368
61580A504627L084L253L295K860J575L67J000L786O780Q034P967Q504J0277J2053
$$ plain form
61661 4696900 4533429 4380328 4236003 4100294 3972963 3852360 3736295 3623831 3515642
61652 3515642 3412918 3316408 3226264 3142092 3063057 2988321 2917536 2850791 2788072 2728896 2672465
61641 2672465 2618102 2565572 2515014 2466595 2420312 2376080 2333770 2292952 2252878 2213097 2173973
61630 2173973 2136254 2100202 2065507 2031913 1999420 1967957 1937494 1908621 1882305 1858634 1836224
61619 1836224 1813396 1789851 1766917 1746271 1728653 1713660 1700452 1688549 1677905 1668261 1658766 1648678
61607 1648678 1638289 1628516 1619477 1610144 1599789 1589181 1579777 1572101 1565486 1559100 1552523 1545472 1537790
61594 1537790 1529984 1523217 1518371 1515328 1513349 1511863 1510628 1509334 1507516 1505065 1502669 1501497 1502259 1504627
61580 1504627 1507711 1510964 1514259 1517119 1518694 1519061 1520061 1523847 1530627 1538661 1546628 1555132 1565409 1577462
61566A577462J2825J3026J3184J2699J0890Q315N945L586L86l405o473q308r830
61553A630302j1839j3909j5336j6218j6835j6730j5348j3316j2097j2358j3324
61542A472992j3748j3123j1858j0643r779r033q111p202o663o226n108l071p74
61529A367653J250L217N204O520O757O751P470Q585R392J0611J3640J8069K1542
61516A486661K2667K2751K3935K6602K9465L1474L2832L4478L7108M0457M3318
61505A831748M4679M4932M5338M6274M6831M6345M5326M4443M3591M2539M1550
61494B323596M0592L8928L6380L4172L3274L2598L0191K5977K1895J9260J7260
61483B654123J4519J1039P828N206K375j339n498r045j1450j2929j3575j2895
$$ plain form
61566 1577462 1590287 1603313 1616497 1629196 1640086 1648401 1654346 1657932 1658318 1654913 1648440 1640132 1630302
61553 1630302 1618463 1604554 1589218 1573000 1556165 1539435 1524087 1510771 1498674 1486316 1472992
61542 1472992 1459244 1446121 1434263 1423620 1413841 1404808 1396697 1389495 1382832 1376606 1371498 1368427 1367653
61529 1367653 1368903 1372120 1377324 1383844 1390601 1397352 1404822 1413407 1422799 1433410 1447050 1465119 1486661
61516 1486661 1509328 1532079 1556014 1582616 1612081 1643555 1676387 1710865 1747973 1788430 1831748
61505 1831748 1876427 1921359 1966697 2012971 2059802 2106147 2151473 2195916 2239507 2282046 2323596
61494 2323596 2364188 2403116 2439496 2473668 2506942 2539540 2569731 2595708 2617603 2636863 2654123
61483 2654123 2668642 2679681 2687509 2692715 2695090 2693751 2688253 2679208 2667758 2654829 2641254 2628359
61471B628359j0614p468m505j781J565N922J0726J5358J9741K3944K8052L2633
61459B741932L8437M5317N2312N9048O6106P3897Q2319R1808J03131J15530J26801
61448C596638J36294J46303J59080J73951J89026K04253K20656K37675K53774
61439E317650K68908K83753K96635L03839L03177K94845K78376K51495K13292
61430G811970J66419J14836O1033O692m5529r2573j32425j63990j86670k01218
61420G338545k09754k13523k11691k03717j91821j79289j67000j53411j37537
61411E670802j20165j02240q4034o6190m9918l5456k1603p569N821J7604K8318
61400E235370L9125M9799N8915O5911P1853P7694Q2574Q4693Q3656Q1191P9369
$$ plain form
61471 2628359 2617745 2610277 2605772 2603991 2605556 2611478 2622204 2637562 2657303 2681247 2709299 2741932
61459 2741932 2780369 2825686 2877998 2937046 3003152 3077049 3159368 3251176 3354307 3469837 3596638
61448 3596638 3732932 3879235 4038315 4212266 4401292 4605545 4826201 5063876 5317650
61439 5317650 5586558 5870311 6166946 6470785 6773962 7068807 7347183 7598678 7811970
61430 7811970 7978389 8093225 8154258 8160950 8115421 8022848 7890423 7726433 7539763 7338545
61420 7338545 7128791 6915268 6703577 6499860 6308039 6128750 5961750 5808339 5670802
61411 5670802 5550637 5448397 5364363 5298173 5248255 5212799 5191196 5183627 5189448 5207052 5235370
61400 5235370 5274495 5324294 5383209 5449120 5520973 5598667 5681241 5765934 5849590 5930781 6010150
61389F010150P8668P8188P7192P5745P4068P2203P0438O9242O8239O5997O1555
61378F801685N5915N1295M8829M7363M4475L8551L0044K1137J4097R537O130K192
61366G171250k607p411j1794j6522k2305k8284l2658l4854l6235l8066l9400l8099
61354F863015l3836k8768k4745k1195j6827j2318r599q892q355o959n993o946
61342F678582r294j1463j2980j4380j5642j5972j4961j2791r248l496M891J5331
61330F578577K6995L9700N3816O9566Q6763J05183J24931J46253J68835J91555
61320G592174K13318K34107K54703K75122K93782L08441L17573L20386L15990
61311A0125596L03049K80277K47056K03907J52849R7012L9502j7439p2023j22165
$$ plain form
61389 6010150 6088818 6167006 6244198 6319943 6394011 6466214 6536652 6605894 6674133 6740130 6801685
61378 6801685 6857600 6908895 6957724 7005087 7049562 7088113 7118157 7139294 7153391 7162928 7169058 7171250
61366 7171250 7168643 7161232 7149438 7132916 7110611 7082327 7049669 7014815 6978580 6940514 6901114 6863015
61354 6863015 6829179 6800411 6775666 6754471 6737644 6725326 6715727 6706835 6698480 6691521 6685528 6678582
61342 6678582 6669288 6657825 6644845 6630465 6614823 6598851 6583890 6571099 6561851 6558355 6563246 6578577
61330 6578577 6605572 6645272 6699088 6768654 6855417 6960600 7085531 7231784 7400619 7592174
61320 7592174 7805492 8039599 8294302 8569424 8863206 9171647 9489220 9809606 10125596
61311 10125596 10428645 10708922 10955978 11159885 11312734 11409746 11449248 11431809 11359786 11237621
61301A1237621j65883k02570k33425k60138k83108l01051l12500l17629l18267
61292H843050l16075l11104l02578k90637k76513k61209k45006k28363k12274
61283F399291j97149j82098j65932j48511j30664j13293r6910q1603o6969n2519
61273E163643l8380k5184j3067j522R514J9286K7549L5213M2862M9501N3879N6418
61261E379712N8612O0889O2219O1605N8865N4148M7905M1294L5558L0764K6147
61250E917718K1438J6864J2039O334M50l991p039j1062j7743k5724l2502l7648
61238E839134m2656m8095n2805n5945n8326o1064o3999o6273o7669o8527o8765
61227E185010o7827o5487o2017n7538n1983m5812m0048l5284l1189k7376k4100
$$ plain form
61301 11237621 11071738 10869168 10635743 10375605 10092497 9791446 9478946 9161317 8843050
61292 8843050 8526975 8215871 7913293 7622656 7346143 7084934 6839928 6611565 6399291
61283 6399291 6202142 6020044 5854112 5705601 5574937 5461644 5364734 5283131 5216162 5163643
61273 5163643 5125263 5100079 5087012 5085490 5095004 5114290 5141839 5177052 5219914 5269415 5323294 5379712
61261 5379712 5438324 5499213 5561432 5623037 5681902 5736050 5783955 5825249 5860807 5891571 5917718
61250 5917718 5939156 5956020 5968059 5974393 5974843 5970852 5963813 5952751 5935008 5909284 5876782 5839134
61238 5839134 5796478 5748383 5695578 5639633 5581307 5520243 5456244 5389971 5322302 5253775 5185010
61227 5185010 5117183 5051696 4989679 4932141 4880158 4834346 4794298 4759014 4727825 4700449 4676349
61216D676349k1537j9021j6065j3738j3727j5905j8046j8475j7891j7804j8074
61205D486066j7084j3871r054l842R62N105Q945J3345J8799K4582K9536L3825
61193D577314L9139M6921N6962O8039P9302R0514J01325J10970J18813J24704
61183E414003J28372J28490J22791J09694Q9693O4613L5455J822l6084p5617j12575
61172E870657j43668j67613j84455j94795j99523j99405j94882j86799j77045
61163D222472j67456j58092j47542j35241j22535j11131j01263r2004q2835p4177
61153C030196o6569n9844n3223m6104l8757l2215k7341k3915k0784j6796j1526
61142B633122n399O41N690R512J2504J4926J6495J7009J6798J6031J4058J0311
$$ plain form
61216 4676349 4654812 4635791 4619726 4605988 4592261 4576356 4558310 4539835 4521944 4504140 4486066
61205 4486066 4468982 4455111 4446057 4442215 4443177 4448282 4457227 4470572 4489371 4513953 4543489 4577314
61193 4577314 4616453 4663374 4720336 4788375 4867677 4958191 5059516 5170486 5289299 5414003
61183 5414003 5542375 5670865 5793656 5903350 5993043 6057656 6093111 6094933 6058849 5983232 5870657
61172 5870657 5726989 5559376 5374921 5180126 4980603 4781198 4586316 4399517 4222472
61163 4222472 4055016 3896924 3749382 3614141 3491606 3380475 3279212 3187208 3104373 3030196
61153 3030196 2963627 2903783 2850560 2804456 2765699 2733484 2706143 2682228 2661444 2644648 2633122
61142 2633122 2627723 2628364 2634054 2643566 2656070 2670996 2687491 2704500 2721298 2737329 2751387 2761698
61130B761698N553J509q16j827k661m435p692j1805j5174j6987j8383k0796k3580
61117B644604k4877k4695k5327k8199l1909l4320l5175l5687l6689l8337m0737
61106B288652m3541m5486m5514m4196m3073m2950m3441m3846m3552m2012l9265
61095A811776l6422l4701l4026l3189l1463k9420k8131k7997k8479k8731k8483
61084A470734k8332k8819k9301k8412k5923k3288k1620k0019j6914j2537q782
61073A226787o771n695m291k367m56J144K368L005K965K836L590N646Q461J1125
61059A248347J3175J4593J5211J4675J3325J2527J3286J4746J5166J4450J4486
61048A403987J6328J8336J8177J5805J3012J0517P213K546j934m259m469m454
$$ plain form
61130 2761698 2767251 2768760 2767944 2766117 2763456 2759021 2751329 2739524 2724350 2707363 2688980 2668184 2644604
61117 2644604 2619727 2595032 2569705 2541506 2509597 2475277 2440102 2404415 2367726 2329389 2288652
61106 2288652 2245111 2199625 2154111 2109915 2066842 2023892 1980451 1936605 1893053 1851041 1811776
61095 1811776 1775354 1740653 1706627 1673438 1641975 1612555 1584424 1556427 1527948 1499217 1470734
61084 1470734 1442402 1413583 1384282 1355870 1329947 1306659 1285039 1265020 1248106 1235569 1226787
61073 1226787 1220016 1214321 1210030 1207663 1207207 1208351 1210719 1213724 1216689 1219525 1223115 1228761 1237222 1248347
61059 1248347 1261522 1276115 1291326 1306001 1319326 1331853 1345139 1359885 1375051 1389501 1403987
61048 1403987 1420315 1438651 1456828 1472633 1485645 1496162 1503375 1505921 1503987 1499728 1495259 1490805
61036A490805n623p513q734q749q297q130p935p016n691n094n450n589m842m407
61022A397735n812q585j0764j1435j1515j1966j2550j2736j2674j2574j1979j0530
61010A264615q850p888p611p115n924m483l235j868Q5K283L805M332M512M946
60996A237604N297N016M524M840O115P472Q444R559J1102J2381J2989J3864J6092
60983A355299J9272K2061K3818K4706K4768K4262K4501K6818L0625L3873L5737
60972A645740L7493M0419M4082M7390N0220N3264N7011O1501O6482P1269P5119
60961B249990P8281Q1914Q6476R0920R4215R6910J00392J05232J11127J17975
60951C213432J25882J34353J42493J50147J58135J67184J77174J87470J97572
$$ plain form
61036 1490805 1485182 1477669 1468935 1460186 1451889 1443759 1435824 1428808 1423117 1418023 1412573 1406984 1402142 1397735
61022 1397735 1391923 1383338 1372574 1361139 1349624 1337658 1325108 1312372 1299698 1287124 1275145 1264615
61010 1264615 1255765 1247877 1240266 1233151 1227227 1222744 1219509 1217641 1217726 1220009 1223814 1228146 1232658 1237604
60996 1237604 1242901 1247917 1252441 1257281 1263396 1270868 1279312 1288871 1299973 1312354 1325343 1339207 1355299
60983 1355299 1374571 1396632 1420450 1445156 1469924 1494186 1518687 1545505 1576130 1610003 1645740
60972 1645740 1683233 1723652 1767734 1815124 1865344 1918608 1975619 2037120 2103602 2174871 2249990
60961 2249990 2328271 2410185 2496661 2587581 2681796 2778706 2879098 2984330 3095457 3213432
60951 3213432 3339314 3473667 3616160 3766307 3924442 4091626 4268800 4456270 4653842
60942D653842K07408K17455K28691K42142K58435K77919L00916L27293L55844
60933G069945L84788M13237M42302M74787N14066N63191O24659P00524P92029
60924A1979528Q98852J019438J153443J304131J477193J677201J907263K172481
60916B3589530K475852K797161L067549L172555L002073K521411J809035J028935
60908D3464101L58848p5659k31292j48203O0954K35303K14004r9412o90155j435383
60898D1653106k159770k711508l016295l084729k980086k775157k525051k262786
60890B0137724k006794j767730j550983j357731j186624j035619r03090p88022
60882I541131o89451o06041n36350m79198m33033l95206l62750l33982l08497
$$ plain form
60942 4653842 4861250 5078705 5307396 5549538 5807973 6085892 6386808 6714101 7069945
60933 7069945 7454733 7867970 8310272 8785059 9299125 9862316 10486975 11187499 11979528
60924 11979528 12878380 13897818 15051261 16355392 17832585 19509786 21417049 23589530
60916 23589530 26065382 28862543 31930092 35102647 38104720 40626131 42435166 43464101
60908 43464101 43822949 43747290 43515998 43367795 43428749 43664052 43878056 43778644 43088489 41653106
60898 41653106 39493336 36781828 33765533 30680804 27700718 24925561 22400510 20137724
60890 20137724 18130930 16363200 14812217 13454486 12267862 11232243 10329153 9541131
60882 9541131 8851680 8245639 7709289 7230091 6797058 6401852 6039102 5705120 5396623
60873E396623k85566k63686k42009k21185k02258j85704j72110j62460j56655
60864C504990j52464j47158j39903j31774j23943j16779j10208j03933r7418r0556
60854B290854q4132p8991p4918p1037o6825o2077n6536n0625m6000m3949m3430
60843A612334m2049l9027l5715l3064l0286k6810k3930k3145k3675k3167k0640
60832A290826j7492j5484j4721j4093j2917j1461j0069q589o834n166m097l420
60820A166483k374p43O71R91K77q03j829k738l453m003m790o042p133p108o003
60805A121403n120n768p975j0430j1432j0164p449n132m224l864k546j46J993
60792A049146K880K967L242M014M934N775O818Q687J1751J5414J8084J8445J6853
$$ plain form
60873 5396623 5111057 4847371 4605362 4384177 4181919 3996215 3824105 3661645 3504990
60864 3504990 3352526 3205368 3065465 2933691 2809748 2692969 2582761 2478828 2381410 2290854
60854 2290854 2206722 2127731 2052813 1981776 1914951 1852874 1796338 1745713 1699713 1655764 1612334
60843 1612334 1570285 1531258 1495543 1462479 1432193 1405383 1381453 1358308 1334633 1311466 1290826
60832 1290826 1273334 1257850 1243129 1229036 1216119 1204658 1194589 1186000 1179166 1174000 1169903 1166483
60820 1166483 1164109 1163366 1164037 1165028 1165305 1164502 1162673 1159935 1156482 1152479 1147689 1141647 1134514 1127406 1121403
60805 1121403 1116283 1110515 1102540 1092110 1080678 1070514 1063065 1057933 1053709 1049845 1047299 1047153 1049146
60792 1049146 1052026 1054993 1058235 1062249 1067183 1072958 1079776 1088463 1100214 1115628 1133712 1152157 1169010
60779A169010J4984J4054J3818J3411J2502J1444J0727J0591J0895J1137J0820
60768A303393R856Q421O614M628L102K716L245L573K780J056m90p32M67J898J997
60753A352524N97p25o63j5o42l000n779p868r563j1684j4368j6880j8047j7093
60739A246794j4792j3252j3559j4121j2786j0049q292q025p289n148l309l228
60727A132944l692k787n71J769L939O035P281P062O344O476P373Q389R936J2570
60713A203068J5238J6360J6072J5705J5599J5200J4728J4767J4706J3695J2801
60702A367939J3807J5862J5910J3009R871R068R798R696Q157O367N301N077N458
60689A495320N846N525M744M721N697N953L918M51k170k980k954l316m334n642
$$ plain form
60779 1169010 1183994 1198048 1211866 1225277 1237779 1249223 1259950 1270541 1281436 1292573 1303393
60768 1303393 1313249 1321670 1328284 1332912 1336014 1338730 1341975 1345548 1348328 1349384 1348894 1348162 1348629 1350527 1352524
60753 1352524 1353121 1352396 1351733 1351718 1351076 1348076 1342297 1334429 1324866 1313182 1298814 1281934 1263887 1246794
60739 1246794 1232002 1218750 1205191 1191070 1178284 1168235 1159943 1151918 1144629 1139481 1136172 1132944
60727 1132944 1129252 1126465 1125894 1127663 1131602 1137637 1144918 1151980 1158324 1164800 1172173 1180562 1190498 1203068
60713 1203068 1218306 1234666 1250738 1266443 1282042 1297242 1311970 1326737 1341443 1355138 1367939
60702 1367939 1381746 1397608 1413518 1426527 1436398 1445466 1455264 1464960 1473117 1479484 1484785 1489862 1495320
60689 1495320 1501166 1506691 1511435 1516156 1521853 1527806 1531724 1532175 1530005 1527025 1524071 1520755 1516421 1510779
60675A510779o769p360p484p738q599r820j0774j1225j1372j1521j1907j2454
60663A393756j2470j1200q955p070o209n481l789j451K23M94l27j451k072j729
60649A332269r15r26k435m617o259p123p537p334o305n236n198n902n916m600
60635A261966k824j605j013o47l43L3O16J008L45j582l900n822p703j0314j3373
60620A214842j5618j6263j5845j5486j5688j6041j5851j4847j3361j1955j0895
60609A052992r807p979n252k617j503k114k791j607J379M049M509L061J614J686
60595A035620L291N369O761O942O311N848O254P350Q316Q380P325N706M530M416
60581A122419M786M401K866J213P32J650L223M626N393N522N628O589Q516J0465
$$ plain form
60675 1510779 1504010 1496650 1489166 1481428 1472829 1463009 1452235 1441010 1429638 1418117 1406210 1393756
60663 1393756 1381286 1370086 1361131 1354061 1347852 1342371 1338582 1337131 1337354 1337848 1337521 1336070 1333998 1332269
60649 1332269 1331354 1330428 1327993 1323376 1317117 1309994 1302457 1295123 1288818 1283582 1278384 1272482 1266566 1261966
60635 1261966 1259142 1257537 1256524 1255877 1255534 1255567 1256183 1257191 1257536 1255954 1252054 1246232 1238529 1228215 1214842
60620 1214842 1199224 1182961 1167116 1151630 1135942 1119901 1104050 1089203 1075842 1063887 1052992
60609 1052992 1043185 1035206 1029954 1027337 1025834 1023720 1020929 1019322 1020701 1024750 1029259 1032320 1033934 1035620
60595 1035620 1038911 1044280 1051041 1057983 1064294 1070142 1076396 1083746 1092062 1100442 1107767 1113473 1118003 1122419
60581 1122419 1127205 1131606 1134472 1135685 1136417 1138067 1141290 1145916 1151309 1156831 1162459 1169048 1177564 1188029
60567A188029J1712J2785J4536J6609J7824J7953J8127J9252K0810K1600K1138
60556A380375J9969J8864J8036J7078J5494J3369J1385J0131R423Q473O481L207
60544A532285o86l866n458o313q431j2638j7359k0340k1036k0550j9814j8856
60532A376938j7630j6463j5416j3993j1782q904n849l221j467l50J032L112N075
60519A291082N931N911N867N723M769L312K510K491K133J171R69K402M258M936
60505A343465M740N187O707Q287R125R456R709R788R459Q936Q742R127R618R266
60491A461612P758O291O643R035J1628J2732J2887J3996J6956K1119K5734L0748
60479A637139L6092M1050M4875M7457M9010M9345M7785M3792L7587L0073K1929
$$ plain form
60567 1188029 1199741 1212526 1227062 1243671 1261495 1279448 1297575 1316827 1337637 1359237 1380375
60556 1380375 1400344 1419208 1437244 1454322 1469816 1483185 1494570 1504701 1514124 1522597 1529078 1532285
60544 1532285 1531599 1527733 1522275 1515962 1507531 1494893 1477534 1457194 1436158 1415608 1395794 1376938
60532 1376938 1359308 1342845 1327429 1313436 1301654 1292750 1286901 1283680 1282213 1281863 1282895 1286007 1291082
60519 1291082 1297013 1302924 1308791 1314514 1319283 1322595 1325105 1327596 1329729 1330900 1331869 1334271 1338529 1343465
60505 1343465 1348205 1353392 1360099 1368386 1377511 1386967 1396676 1406464 1415923 1424859 1433601 1442728 1452346 1461612
60491 1461612 1469370 1475661 1482304 1491339 1502967 1515699 1528586 1542582 1559538 1580657 1606391 1637139
60479 1637139 1673231 1714281 1759156 1806613 1855623 1904968 1952753 1996545 2034132 2064205 2086134
60468B086134J2923K583q140j6671k0957k1490k0399j8729j5594j0112l158L485
60456A969875R069J4223J9592K4930K9628L3524L6657L8613L8792L7649L7148
60445B289700L9458M5050N2503O0097O7405P5233Q4434R5066J06528J18239J30281
60434C163994J43459J58596J75648J93718K11878K29809K47692K66008K85550
60425E076352L07161L30996L55914L79148L95874L99132L81518L38387K69793
60416H234275J79543P3181m2412j58341k64327l51202m13323m49510m62513m57459
60406E887912m39672m13299l81651l48100l15571k85202k56469k29030k03830
60397C015088j82048j63666j47691j33352j20496j09053r8718q9119p9932p0981
$$ plain form
60468 2086134 2099057 2101640 2093500 2076829 2055872 2034382 2013983 1995254 1979660 1969548 1966390 1969875
60456 1969875 1978944 1993167 2012759 2037689 2067317 2100841 2137498 2176111 2214903 2252552 2289700
60445 2289700 2329158 2374208 2426711 2486808 2554213 2629446 2713880 2808946 2915474 3033713 3163994
60434 3163994 3307453 3466049 3641697 3835415 4047293 4277102 4524794 4790802 5076352
60425 5076352 5383513 5714509 6070423 6449571 6845445 7244577 7626095 7964482 8234275
60416 8234275 8413818 8486999 8444587 8286246 8021919 7670717 7257394 6807884 6345371 5887912
60406 5887912 5448240 5034941 4653290 4305190 3989619 3704417 3447948 3218918 3015088
60397 3015088 2833040 2669374 2521683 2388331 2267835 2158782 2060064 1970945 1891013 1820032
60387A820032o2677n6060n1733m8733m5273m0913l7213l5474l4515l1855k6980
60376A348606k2168j9610j8863j8074j6760j5961j6035j5866j4606j2829j1392
60365A166442j0164q807p920q292r409r873r186q142p331o126l745p06J381J502
60351A079624N00L70K247N157P033O939N878N282N316N141M453L952M382N622
60337A141896O807P046O063M481L394L376L992M483M623M671M891N575O984Q579
60323A216861Q777O481K738j82j317j627k066k354k111j963k483k872j940j7J230
60308A217155R88K93N32J628K295J858J177J633L441N407O380O464O523O900P295
60293A269969P661Q385R448J0235J0519J0878J1695J2508J2877J3191J3763J3809
$$ plain form
60387 1820032 1757355 1701295 1649562 1600829 1555556 1514643 1477430 1441956 1407441 1375586 1348606
60376 1348606 1326438 1306828 1287965 1269891 1253131 1237170 1221135 1205269 1190663 1177834 1166442
60365 1166442 1156278 1147471 1139551 1131259 1121850 1111977 1102791 1094649 1087318 1081192 1077447 1076741 1078122 1079624
60351 1079624 1080124 1080494 1082741 1087898 1094931 1101870 1107748 1113030 1118346 1123487 1127940 1131892 1136274 1141896
60337 1141896 1148703 1155749 1161812 1166293 1169687 1173063 1177055 1181538 1186161 1190832 1195723 1201298 1208282 1216861
60323 1216861 1225638 1232119 1234857 1234675 1233358 1231731 1229665 1227311 1225200 1223237 1220754 1217882 1215942 1215925 1217155
60308 1217155 1218143 1218436 1218968 1220596 1222891 1224749 1225926 1227559 1231000 1236407 1242787 1249251 1255774 1262674 1269969
60293 1269969 1277630 1286015 1295463 1305698 1316217 1327095 1338790 1351298 1364175 1377366 1391129 1404938
60281A404938J2412J0137Q481P823P026N277L169J518Q2j801l924n217m746k337
60267A442838J273M547N969N445M426M146M231L597K092K38k028n121q338j0022
60253A453293r566q243p523p460p239o546n631m730l948l252k100K11L172M837
60239A395275L936J631R4m8L63J059K623M580N120L488J379Q54J816K573K304
60224A427047J845K261L635N336O790P861Q907J0542J3027J5857J8118J9240J9307
60211A559773J8752J7911J6866J5825J5632J7433K1212K5091K7018K7139K7385
60200A790037K8747L0332L1621L3940L8443M3891M8064N0748N3575N7330O1292
60189B268020O5334P0729P8104Q6010R2549R7615J02595J08540J15510J23320
$$ plain form
60281 1404938 1417350 1427487 1435968 1443791 1450817 1456094 1459263 1460781 1460863 1459062 1455138 1449921 1445175 1442838
60267 1442838 1444111 1448658 1454627 1460072 1464498 1468644 1472875 1476472 1478564 1478802 1476774 1471653 1463315 1453293
60253 1453293 1443727 1435484 1427961 1420501 1413262 1406716 1401085 1396355 1392407 1389155 1387055 1387266 1390438 1395275
60239 1395275 1399211 1400842 1400936 1400888 1401251 1402310 1404933 1409513 1414633 1418121 1419500 1420354 1422170 1424743 1427047
60224 1427047 1428892 1431153 1434788 1440124 1446914 1454775 1463682 1474224 1487251 1503108 1521226 1540466 1559773
60211 1559773 1578525 1596436 1613302 1629127 1644759 1662192 1683404 1708495 1735513 1762652 1790037
60200 1790037 1818784 1849116 1880737 1914677 1953120 1997011 2045075 2095823 2149398 2206728 2268020
60189 2268020 2333354 2404083 2482187 2568197 2660746 2758361 2860956 2969496 3085006 3208326
60179C208326J31893J40832J49186J55923J60500J63124J64545J65408J65481
60170D605218J63594J58430J49454J37181J22706J06972R0340P2918N5183L7963
60160E699959K1650O041q651k1221l0606l6923m0599m1015l7390l0696k3089j5207
60148E442253n588O717K0456L3933M7111O0833P5095Q9405J03870J18436J31703
60137F124224J42170J50192J56828J60983J59777J52296J40956J28151J13349
60128G428926R5012P3874N2215L0585P565j7050m0820o1149p7685r1258j01691
60117G298524j07984j09966j08328j03256r4272q1525o6216m9540l1934j3536
60107F531967N402K4732M4208O2729P8707R1640J02539J12004J18562J19887J15472
$$ plain form
60179 3208326 3340219 3481051 3630237 3786160 3946660 4109784 4274329 4439737 4605218
60170 4605218 4768812 4927242 5076696 5213877 5336583 5443555 5533895 5606813 5661996 5699959
60160 5699959 5721609 5727650 5718999 5697778 5667172 5630249 5589650 5548635 5511245 5480549 5457460 5442253
60148 5442253 5436665 5443382 5463838 5497771 5544882 5605715 5680810 5770215 5874085 5992521 6124224
60137 6124224 6266394 6416586 6573414 6734397 6894174 7046470 7187426 7315577 7428926
60128 7428926 7523938 7597812 7650027 7680612 7688177 7671127 7630307 7569158 7491473 7400215 7298524
60117 7298524 7190540 7080574 6972246 6868990 6774718 6693193 6626977 6577437 6545503 6531967
60107 6531967 6537369 6562101 6606309 6669038 6747745 6839385 6941924 7053928 7172490 7292377 7407849
60096G407849J07178R7132Q5919P3009N8385M3234K9233J7490Q362K075q23QM082
60083G933133J0705K0098L3162M9931O9238R0207J13050J37808J63370J88927
60073H809629K15427K44180K74496L04261L32688L60913L89658M17736M43393
60064A1792381M65872M84889M99381N07699N08607N01526M86125M61974M28551
60055A6137005L85738L34815K78564K19357J57016Q9679J7111n7885j31699k02237
60045A7227464k68180l27041l75513m11618m35587m48568m51212m43570m25883
60036A3640292l99349l66202l28883k88901k46689k02621j57804j13800p2097
60027A1463946l4020n64K8040N2171P1783Q5887R3219R3142Q5810P2040N3226
$$ plain form
60096 7407849 7515027 7612159 7698078 7771087 7829472 7872706 7901939 7919429 7927791 7929866 7929043 7929051 7933133
60083 7933133 7943838 7963936 7997098 8047029 8116267 8206474 8319524 8457332 8620702 8809629
60073 8809629 9025056 9269236 9543732 9847993 10180681 10541594 10931252 11348988 11792381
60064 11792381 12258253 12743142 13242523 13750222 14258829 14760355 15246480 15708454 16137005
60055 16137005 16522743 16857558 17136122 17355479 17512495 17602174 17619285 17561400 17429701 17227464
60045 17227464 16959284 16632243 16256730 15845112 15409525 14960957 14509745 14066175 13640292
60036 13640292 13240943 12874741 12545858 12256957 12010268 11807647 11649843 11536043 11463946
60027 11463946 11429926 11429362 11457402 11509573 11581356 11667243 11760462 11853604 11939414 12011454 12064680
60016A2064680L0830N787k1056m8084p3469r6678j18314j38249j55395j69877
60006A1280175j83765j98342k11920k21765k27174k29023k27414k21809k13041
59997I345922k02849j91376j77080j59451j39871j19377r7469p4001n0250k6900
59987H107298k677K3261M8825P0955Q9378J06383J22928J36979J46161J50218
59977H999709J49992J45256J34895J18617R7325P2265M4683J6136j2093l9937
59967I726848o7997r5827j21574j43629j61695j75751j84835j87805j84804j77069
59957H225862j65608j51033j34316j16464r7330p5972n2589k9145p343J3209L4191
59946G443462N6449P9427J02269J24686J46712J68097J88023K05275K18841K28349
$$ plain form
60016 12064680 12095510 12101297 12080241 12032157 11958688 11862010 11743696 11605447 11450052 11280175
60006 11280175 11096410 10898068 10686148 10464383 10237209 10008186 9780772 9558963 9345922
59997 9345922 9143073 8951697 8774617 8615166 8475295 8355918 8258449 8184448 8134198 8107298
59987 8107298 8104621 8127882 8176707 8247662 8337040 8443423 8566351 8703330 8849491 8999709
59977 8999709 9149701 9294957 9429852 9548469 9645794 9718059 9762742 9778878 9766785 9726848
59967 9726848 9658851 9563024 9441450 9297821 9136126 8960375 8775540 8587735 8402931 8225862
59957 8225862 8060254 7909221 7774905 7658441 7561111 7485139 7432550 7403405 7396062 7409271 7443462
59946 7443462 7499911 7579338 7681607 7806293 7953005 8121102 8309125 8514400 8733241 8961590
59936H961590K33603K33784K27589K14327J94407J68814J38812J06025P1831L6357
59926A0587139q20l8669p4531j06448j34302j57866j75286j84925j87481j84700
59916I342111j76893j63610j45905j25756j03507p8220n0679k3710J075K4821
59906H499727M8842P2294R3697J13036J30832J46254J57796J65146J69024J69772
59896I766420J67457J62765J56373J47761J36230J23050J11015J01454R3046Q4234
59886A1049805P5736O9821O7952P0230P6766Q8334J05292J26787J51647J79828
59876A2062198K12341K49544K89944L30905L70351M07549M42374M74051N00394
59867A5339651N17853N22429N11138M82888M37853L76190K98072K05074J00947
$$ plain form
59936 8961590 9195193 9428977 9656566 9870893 10065300 10234114 10372926 10478951 10550782 10587139
59926 10587139 10586319 10547650 10473119 10366671 10232369 10074503 9899217 9714292 9526811 9342111
59916 9342111 9165218 9001608 8855703 8729947 8626440 8548220 8497541 8473831 8474906 8499727
59906 8499727 8548569 8620863 8714560 8827596 8958428 9104682 9262478 9427624 9596648 9766420
59896 9766420 9933877 10096642 10253015 10400776 10537006 10660056 10771071 10872525 10965571 11049805
59886 11049805 11125541 11195362 11263314 11333544 11410310 11498644 11603936 11730723 11882370 12062198
59876 12062198 12274539 12524083 12814027 13144932 13515283 13922832 14365206 14839257 15339651
59867 15339651 15857504 16379933 16891071 17373959 17811812 18188002 18486074 18691148 18792095
59858A8792095r189j19796k24834l17982l94396m52415m92945n17360n26785n22963
59848A5213430n08353m84821m53268m15239l73837l31848k89385k44807j97939
59839A1913933j51235j07379o6741k7841J0376M7518Q2383J13669J40090J60599
59829A2115372J74660J81754J80476J68551J44123J07184O0013O327n0542j09155
59819A2978763j69387k29762k85860l32506l67486l92116m08165m15734m14682
59810I963065m06586l93702l76807l55646l31280l06364k82626k59312k34910
59801G015832k09641j85475j63957j44816j26678j08786r1949p7962o8003o1474
59791E777091n6660n2717n0585n1247n3323n3563n0214m4969m0620l7444l3491
$$ plain form
59858 18792095 18782906 18663110 18438276 18120294 17725898 17273483 16780538 16263178 15736393 15213430
59848 15213430 14705077 14220256 13766988 13351749 12977912 12646064 12356679 12111872 11913933
59839 11913933 11762698 11655319 11588578 11560737 11571113 11618631 11701014 11814683 11954773 12115372
59829 12115372 12290032 12471786 12652262 12820813 12964936 13072120 13132133 13138460 13087918 12978763
59819 12978763 12809376 12579614 12293754 11961248 11593762 11201646 10793481 10377747 9963065
59810 9963065 9556479 9162777 8785970 8430324 8099044 7792680 7510054 7250742 7015832
59801 7015832 6806191 6620716 6456759 6311943 6185265 6076479 5984530 5906568 5838565 5777091
59791 5777091 5720431 5667714 5617129 5565882 5512559 5458996 5408782 5363813 5323193 5285749 5252258
59780E252258k8256k4084k3192k4945k7531l1039l6859m4560n1513n5819n7845
59769D846615n8377n6903n2648m6101l8632l1388k5166k0457j6880j3306r107
59758D477650m443R70Q242J7640K7672L6647M4286N0896N6113N9665O2609O6465
59746D904412P1619P7396Q3031Q7591Q9806Q9151Q6497Q2586P6735O8395N9143
59735E776362N1421M5876M1605L8605L8171M0834M5680N1873N9405O8237P8154
59724F336223Q9784J04334J21988J41659J62614J85185K09776K36261K64673K95330
59714H147827L27982L61749L95844M29295M59775M83556M96190M92088M64184
59705A2058490M06807L20184K11492R1611k7987j36103k23245k84515l20405l34117
$$ plain form
59780 5252258 5224002 5199918 5176726 5151781 5124250 5093211 5056352 5011792 4960279 4904460 4846615
59769 4846615 4788238 4731335 4678687 4632586 4593954 4562566 4537400 4516943 4500063 4486757 4477650
59758 4477650 4473207 4474177 4482419 4500059 4527731 4564378 4608664 4659560 4715673 4775338 4837947 4904412
59746 4904412 4976031 5053427 5136458 5224049 5313855 5403006 5489503 5572089 5648824 5717219 5776362
59735 5776362 5827783 5873659 5915264 5953869 5992040 6032874 6078554 6130427 6189832 6258069 6336223
59724 6336223 6426007 6530341 6652329 6793988 6956602 7141787 7351563 7587824 7852497 8147827
59714 8147827 8475809 8837558 9233402 9662697 10122472 10606028 11102218 11594306 12058490
59705 12058490 12465297 12785481 12996973 13088584 13060597 12924494 12701249 12416734 12096329 11762212
59695A1762212l29256l10258k82504k50113k14562j76578j38124j01278o6285
59686I893254l2201J328L4058O6012R7046J26345J53619J80170K07556K35819
59676A0963006K64184K92801L22438L52998L83930M15851M50331M87936N27794
59667A4461269N69191O12494O58094P05485P53863Q02995Q52743R02019R48568
59658B1266721R89876J024073J049823J065423J068473J057156J032052R96512
59650B9550109R55373R13505Q75017Q42717Q18026Q01867P95316P98362Q07942
59641C7158234Q18403Q24059Q20416Q03132P67854P12254O37235N45459M39829
59632D3526875L24220K04423Q7084k1807j16873j93094k47013k77720k86025k73343
$$ plain form
59695 11762212 11432956 11122698 10840194 10590081 10375519 10198941 10060817 9959539 9893254
59686 9893254 9861053 9862381 9896439 9962451 10059497 10185842 10339461 10519631 10727187 10963006
59676 10963006 11227190 11519991 11842429 12195427 12579357 12995208 13445539 13933475 14461269
59667 14461269 15030460 15642954 16301048 17006533 17760396 18563391 19416134 20318153 21266721
59658 21266721 22256597 23280670 24330493 25395916 26464389 27521545 28553597 29550109
59650 29550109 30505482 31418987 32294004 33136721 33954747 34756614 35551930 36350292 37158234
59641 37158234 37976637 38800696 39621112 40424244 41192098 41904352 42541587 43087046 43526875
59632 43526875 43851095 44055518 44142602 44120795 44003922 43810828 43563815 43286095 43000070 42726727
59622D2726727k41828j94162j32074n6067L2290J29052K30452L35726M45693N59079
59612D3834888O71887P79940Q80136R68980J041204J090042J107773J086127J017477
59603E2478454Q96668P22182M96893K28942o8442l79009o85611r70851j218367
59594E1500859j416389j560441j651583j692888j689067j648415j581978j499541
59586C8760557j407805j312905j223353j149553j100857j082549j093691j126735
59578B9263109j169956j211406j241363j252833j242279j210673j162628j103389
59570A9668582j036909r66336q94761q24562p56836o92249o31907n76852n27146
59561A2761024m82002m40539m02112l66210l32531l01178k72642k47437k25489
$$ plain form
59622 42726727 42484899 42290737 42158663 42102596 42134886 42263938 42494390 42830116 43275809 43834888
59612 43834888 44506775 45286715 46166851 47135831 48177035 49267077 50374850 51460977 52478454
59603 52478454 53375122 54097304 54594197 54823139 54754697 54375688 53690077 52719226 51500859
59594 51500859 50084470 48524029 46872446 45179558 43490491 41842076 40260098 38760557
59586 38760557 37352752 36039847 34816494 33666941 32566084 31483535 30389844 29263109
59578 29263109 28093153 26881747 25640384 24387551 23145272 21934599 20771971 19668582
59570 19668582 18631673 17665337 16770576 15946014 15189178 14496929 13865022 13288170 12761024
59561 12761024 12279022 11838483 11436371 11070161 10737630 10436452 10163810 9916373 9690884
59552I690884k05900j87750j71289j57720j47666j40649j36383j35279j36943
59543H271305j39451j41396j43604j47261j51265j53261j52703j50869j48078
59534F943417j43106j35527j26599j17271j07037r5554q3796p2791o2285n1559
59524E947892m0579k9836j9783j0854l089M442J2807K1584K9243L5354M1078M7139
59512F035398N2711N6954O0318O3636O7238P1575P7301Q3893Q9635R4112R9493
59501F852264J07981J19053J30593J41926J54235J68475J84276K00703K17096
59492H276602K33378K50320K69106K89882L11132L31230L49902L67258L82322
59483A1061132L93840M01994M07642M10027M06984L97541L82869L64071L40529
$$ plain form
59552 9690884 9484984 9297234 9125945 8968225 8820559 8679910 8543527 8408248 8271305
59543 8271305 8131854 7990458 7846854 7699593 7548328 7395067 7242364 7091495 6943417
59534 6943417 6800311 6664784 6538185 6420914 6313877 6218323 6134527 6061736 5999451 5947892
59524 5947892 5907313 5877477 5857694 5846840 5843751 5848193 5861000 5882584 5911827 5947181 5988259 6035398
59512 6035398 6088109 6145063 6205381 6269017 6336255 6407830 6485131 6569024 6658659 6752771 6852264
59501 6852264 6960245 7079298 7209891 7351817 7506052 7674527 7858803 8059506 8276602
59492 8276602 8509980 8760300 9029406 9319288 9630420 9961650 10311552 10678810 11061132
59483 11061132 11454972 11856966 12264608 12674635 13081619 13479160 13862029 14226100 14566629
59474A4566629L11270K77030K39819K01238J62373J25036R1730O3868M0837K1382
59464A6101212N478n632j0798r695k316J1445L1417N6800Q6304J18008J48864
59453A6531087J74971J92842J99967J94011J72564J34695Q2191J8331n4075j32525
59443A7514059k13571k93241l68558m37214m95832n40260n68176n80364n79040
59434A3437803n66116n43450n13453m78490m40403m01077l62482l25480k89427
59425I517425k53694k18875j85843j54398j23694r3529o4518l7195j1467J3424
59415H387636L8630O4850R1299J16160J38515J59437J80814K03534K26918K49191
59405I856984K68089K81742K89490K91463K87193K75238K54201K23406J82586
$$ plain form
59474 14566629 14877899 15154929 15394748 15595986 15758359 15883395 15975125 16038993 16079830 16101212
59464 16101212 16106690 16101058 16090260 16080565 16078249 16089694 16121111 16177911 16264215 16382223 16531087
59453 16531087 16706058 16898900 17098867 17292878 17465442 17600137 17682328 17700659 17646584 17514059
59443 17514059 17300488 17007247 16638689 16201475 15705643 15165383 14597207 14016843 13437803
59434 13437803 12871687 12328237 11814784 11336294 10895891 10494814 10132332 9806852 9517425
59425 9517425 9263731 9044856 8859013 8704615 8580921 8487392 8422874 8385679 8374212 8387636
59415 8387636 8426266 8491116 8582415 8698575 8837090 8996527 9177341 9380875 9607793 9856984
59405 9856984 10125073 10406815 10696305 10987768 11274961 11550199 11804400 12027806 12210392
59396A2210392J32197P4425J2714n0278j13343j74989k32451k83116l25655l58907
59386A0890989l81209l92406l95382l93772l88612l78641l63377l44364l23541
59377G529685l01996k80390k59322k38822k18551j98746j80290j63623j48211
59368E539734j33357j18873j04856r1306p8166o5502n3456m2165l1502k0946j0079
59357D789526O50J0114J7868K4733L1763L9131M6400N3236N9125O2949O3573O0888
59345E259956N6204N2067N1592N6717O6448P7716Q8589R9711J11950J23974J33431
59334F178355J39592J43621J47057J51562J59393J72216J89499K09330K30679
59325G721304K53668K78099L03476L30437L60434L93655M28738M64969N03330
$$ plain form
59396 12210392 12342589 12417014 12429728 12379450 12266107 12091118 11858667 11575551 11249896 10890989
59386 10890989 10509780 10117374 9721992 9328220 8939608 8560967 8197590 7853226 7529685
59377 7529685 7227689 6947299 6687977 6449155 6230604 6031858 5851568 5687945 5539734
59368 5539734 5406377 5287504 5182648 5091342 5013176 4947674 4894218 4852053 4820551 4799605 4789526
59357 4789526 4790176 4800290 4818158 4842891 4874654 4913785 4960185 5013421 5072546 5135495 5199068 5259956
59345 5259956 5316160 5368227 5419819 5476536 5542984 5620700 5709289 5809000 5920950 6044924 6178355
59334 6178355 6317947 6461568 6608625 6760187 6919580 7091796 7281295 7490625 7721304
59325 7721304 7974972 8253071 8556547 8886984 9247418 9641073 10069811 10534780 11038110
59316A1038110N44755N88551O33188O77503P20140P58616P89952Q11925Q23053
59307A7385793Q21881Q07120P78608P37748O87007O29203N67053N03048M39498
59298B3356959L78396L21045K67664K17298J67861J16591O1369K032o0199j24876
59288B4704140j93134k65550l40012m12648m80426n41857n95808o41020o76944
59279B0556741p03989p22893p34538p40101p40219p34128p20689p00339o74952
59270A4084893o45727o12433n75044n35052m94738m55807m18907l83614l48750
59261I614821l13703k79644k48483k20536j94332j69020j45541j24698j05386
59252G813478q5874o6080m7502l1333j7506n168O810J9532L3409M7671O1041P2927
$$ plain form
59316 11038110 11582865 12171416 12804604 13482107 14202247 14960863 15750815 16562740 17385793
59307 17385793 18207674 19014794 19793402 20531150 21218157 21847360 22414413 22917461 23356959
59298 23356959 23735355 24056400 24324064 24541362 24709223 24825814 24887183 24889215 24829016 24704140
59288 24704140 24511006 24245456 23905444 23492796 23012370 22470513 21874705 21233685 20556741
59279 20556741 19852752 19129859 18395321 17655220 16915001 16180873 15460184 14759845 14084893
59270 14084893 13439166 12826733 12251689 11716637 11221899 10766092 10347185 9963571 9614821
59261 9614821 9301118 9021474 8772991 8552455 8358123 8189103 8043562 7918864 7813478
59252 7813478 7727604 7661524 7614022 7582689 7565183 7560015 7566825 7586357 7619766 7667437 7728478 7801405
59240G801405Q3726R4090J04146J13216J20244J24762J27514J29544J30609J29222
59230H958478J24467J17083J08242R8181Q6813P5131O4972N7571N3073N1241N1926
59219I847178N4853N9665O6284P4869Q5371R7345J09726J20295J25950J24659
59209A0766195J17209J06119R2640P5827N4826L0923O376j8073m3186o8927r3238
59198A1026691j13402j27912j36761j40604j40071j35425j26458j13077r6301
59189I896680p8272o0869m4578k9008j4039k3J2580K3175L1042L6000L8663L9512
59177I850863L8279L5161L1906L0353L0396L0865L2180L6248M3682N3146O4284
59166A0277363P9276J00190J26248J55181J86078K19297K54459K90290L25922
$$ plain form
59240 7801405 7885131 7979221 8083367 8196583 8316827 8441589 8569103 8698647 8829256 8958478
59230 8958478 9082945 9200028 9308270 9406451 9493264 9568395 9633367 9690938 9744011 9795252 9847178
59219 9847178 9902031 9961696 10027980 10102849 10188220 10285565 10395291 10515586 10641536 10766195
59209 10766195 10883404 10989523 11082163 11157990 11212816 11243739 11250115 11232042 11188856 11119929 11026691
59198 11026691 10913289 10785377 10648616 10508012 10367941 10232516 10106058 9992981 9896680
59189 9896680 9818408 9757539 9712961 9683953 9669914 9669891 9682471 9705646 9736688 9772688 9811351 9850863
59177 9850863 9889142 9924303 9956209 9986562 10016958 10047823 10080003 10116251 10159933 10213079 10277363
59166 10277363 10356639 10456829 10583077 10738258 10924336 11143633 11398092 11688382 12014304
59157A2014304L60621L92196M16909M30954M31315M15766L83380L34950K71977
59148A5452372J95424J06419P799r6035k00480l00978l92645m71219n34386n81145
59138A3185126o10407o21837o17760o02389n78913n48752n13746m77064m41150
59129H173108m06248l71917l38843l08234k80354k54717k31173k09959j91052
59120E580611j74003j58213j43140j28477j14365j01110q8818p7610o7816n9269
59110D467790n0887m1922l3193k5889j9546j2679n177J708P848J4721K2820L0509
59098D356103L6461M1582M7349N3623N9542O5413P2152P9581Q6702R3225R9611
59087E091344J06041J12393J18915J25843J32540J37905J41602J44179J46167
$$ plain form
59157 12014304 12374925 12767121 13184030 13614984 14046299 14462065 14845445 15180395 15452372
59148 15452372 15647796 15754215 15762014 15665979 15465499 15164521 14771876 14300657 13766271 13185126
59138 13185126 12574719 11952882 11335122 10732733 10153820 9605068 9091322 8614258 8173108
59129 8173108 7766860 7394943 7056100 6747866 6467512 6212795 5981622 5771663 5580611
59120 5580611 5406608 5248395 5105255 4976778 4862413 4761303 4672485 4594875 4527059 4467790
59110 4467790 4416903 4374981 4341788 4315899 4296353 4283674 4278497 4280205 4288053 4302774 4325594 4356103
59098 4356103 4392564 4434146 4481495 4535118 4594660 4660073 4732225 4811806 4898508 4991733 5091344
59087 5091344 5197385 5309778 5428693 5554536 5687076 5824981 5966583 6110762 6256929
59078F256929J47514J47609J45441J40249J32458J23369J13444J01653Q7294P1632
59068G467592N6813M3847L2691K3679J7585J4442J3418J3914J5976J9787K5613
59057G745357L4004M5187N8397P2527Q7251J02672J18265J33302J48131J63742
59047H708835J79960J95264K08798K21319K33597K44850K53571K58941K60342
59038A0765477K56034K43737K22677J94109J59495J19091P2981K2943k7637p5715
59028A1953192j19720j58876j92375k19824k41685k58537k70301k77126k80626
59019I934122k83186k85864k87936k88541k87866k86470k84498k82029k79272
59010G368460k75859k70748k63457k54777k45684k36252k26270k16095k06037
$$ plain form
59078 6256929 6404443 6552052 6697493 6837742 6970200 7093569 7207013 7308666 7395960 7467592
59068 7467592 7524405 7568252 7600943 7624622 7642207 7656649 7670067 7683981 7699957 7719744 7745357
59057 7745357 7779361 7824548 7882945 7955472 8042723 8145395 8263660 8396962 8545093 8708835
59047 8708835 8888795 9084059 9292857 9514176 9747773 9992623 10246194 10505135 10765477
59038 10765477 11021511 11265248 11487925 11682034 11841529 11960620 12033601 12056544 12028907 11953192
59028 11953192 11833472 11674596 11482221 11262397 11020712 10762175 10491874 10214748 9934122
59019 9934122 9650936 9365072 9077136 8788595 8500729 8214259 7929761 7647732 7368460
59010 7368460 7092601 6821853 6558396 6303619 6057935 5821683 5595413 5379318 5173281
59001E173281j95595j84262j72626j61605j51044j40215j29451j19957j12036
58992C806490j04607r6760q8844q1701p5668p0756o6986o4086o1355n8346n5208
58981B982173n2070m8556m4412m0158l6670l4191l2126k9583k5867k0847j5363
58970B602330j1014q814q006o673l764j86K357L234L276L542M104M066K587o3
58956B586976k415k971j780n43p14j751j957p57Q11J988L369N493P614Q782R292
58941B611437R820R753P884M533J446m89k037l819n155n356n157n801p243q008
58927B601808o759l553L06L566O277R543J3693J7130J8082J7191J7146J9523K3137
58914B737090K6002K7711K9211L1246L4009L7589M1796M5919M9265N1735N3480
$$ plain form
59001 5173281 4977686 4793424 4620798 4459193 4308149 4167934 4038483 3918526 3806490
58992 3806490 3701883 3605123 3516279 3434578 3358910 3288154 3221168 3157082 3095727 3037381 2982173
58981 2982173 2930103 2881547 2837135 2796977 2760307 2726116 2693990 2664407 2638540 2617693 2602330
58970 2602330 2591316 2582502 2574496 2567823 2564059 2563873 2566230 2569464 2572740 2576282 2580386 2584452 2587039 2586976
58956 2586976 2584561 2581590 2579810 2579267 2578553 2576802 2574845 2574088 2574899 2576887 2580256 2585749 2593363 2602145 2611437
58941 2611437 2621257 2631010 2638894 2643427 2644873 2644384 2642347 2638528 2633373 2628017 2622860 2617059 2609816 2601808
58927 2601808 2595049 2591496 2591802 2595368 2601645 2611188 2624881 2642011 2660093 2677284 2694430 2713953 2737090
58914 2737090 2763092 2790803 2820014 2851260 2885269 2922858 2964654 3010573 3059838 3111573 3165053
58903C165053N4568N5364N6636N8709O1028O3053O4966O7163O9739P2941P7220
58892C866440Q2166Q6330Q9038R1710R6275J02800J09662J15635J20777J25678
58882D886511J31109J38192J47583J58185J67752J75324J82447J91538K03467
58873F382108K17089K30885K44545K58955K74930K92267L10309L28975L48812
58864H888875L70079L92609M16610M42851M71654N02401N34431N67870O03218
58855A3190598O40692O80368P22135P64964Q06820Q45863Q81144R11652R35445
58846B0379681R50203R53518R41757R09761Q53356P71978O67675N42027L95705
58837B7365661K31300N5323j23220k95741m55545n97658p18371q15264q87630
$$ plain form
58903 3165053 3219621 3274985 3331621 3390330 3451358 3514411 3579377 3646540 3716279 3789220 3866440
58892 3866440 3948606 4034936 4123974 4215684 4311959 4414759 4524421 4640056 4760833 4886511
58882 4886511 5017620 5155812 5303395 5461580 5629332 5804656 5987103 6178641 6382108
58873 6382108 6599197 6830082 7074627 7333582 7608512 7900779 8211088 8540063 8888875
58864 8888875 9258954 9651563 10068173 10511024 10982678 11485079 12019510 12587380 13190598
58855 13190598 13831290 14511658 15233793 15998757 16805577 17651440 18532584 19444236 20379681
58846 20379681 21329884 22283402 23225159 24134920 24988276 25760254 26427929 26969956 27365661
58837 27365661 27596961 27652284 27529064 27233323 26777778 26180120 25461749 24646485 23758855
58828B3758855r36587r64333r73037r64769r42580r10624q72425q29499p82460
58819A5582541p33096o84371o38484n95747n55462n17279m81591m48963m19344
58810A0508204l91722l64927l38943l14960k93866k75119k57485k40207k23061
58801G807914k06001j89337j73643j58774j43766j28361j13908j01696r1141q0565
58791F420722o9139n7001m4295l1433j9668r689l3J1514K4927L8069M9760O0955
58779F374689P2516Q3748R4051J04477J16341J29287J42005J54317J67294J81465
58769G620190J96053K10168K24043K38728K54913K72499K91247L11353L32969
58760I952163L55475L78088M01409M27415M57223M89548N22316N55268N89914
$$ plain form
58828 23758855 22822268 21857935 20884898 19920129 18977549 18066925 17194500 16365001 15582541
58819 15582541 14849445 14165074 13526590 12930843 12375381 11858102 11376511 10927548 10508204
58810 10508204 10116482 9751555 9412612 9097652 8803786 8528667 8271182 8030975 7807914
58801 7807914 7601913 7412576 7238933 7080159 6936393 6808032 6694124 6592428 6501287 6420722
58791 6420722 6351583 6294582 6250287 6218854 6199186 6189497 6189464 6200978 6225905 6263974 6313734 6374689
58779 6374689 6447205 6530953 6625004 6729481 6845822 6975109 7117114 7271431 7438725 7620190
58769 7620190 7816243 8026411 8250454 8489182 8744095 9016594 9307841 9619194 9952163
58760 9952163 10307638 10685726 11087135 11514550 11971773 12461321 12983637 13538905 14128819
58751A4128819O27311O67194P09059P52358P95015Q33135Q63401Q85064Q98516
58742B1159872R01982Q90537Q58484Q02351P21525O16693M88655L39146J72714
58733B6951959k988j79163l48171n04097o42129p58446q50875r19156r64451r88709
58723B0793774r94382r84397r62154r31198q94270q52599q06803p58621p10972
58714A2898378o65856o23091n81880n42874n07585m76263m47594m20343l94274
58705H238618l69426l45543l22616l01241k81857k64048k46947k30331k14935
58696E661674k01398j89002j75951j61477j47187j35435j26472j18349j09621
58687D296782j00799r2688q4892p6992o9917o4703o0646n6042n0436m5095m1493
$$ plain form
58751 14128819 14756130 15423324 16132383 16884741 17679756 18512891 19376292 20261356 21159872
58742 21159872 22061854 22952391 23810875 24613226 25334751 25951444 26440099 26779245 26951959
58733 26951959 26948971 26769808 26421637 25917540 25275411 24516965 23666090 22746934 21782483 20793774
58723 20793774 19799392 18814995 17852841 16921643 16027373 15174774 14367971 13609350 12898378
58714 12898378 12232522 11609431 11027551 10484677 9977092 9500829 9053235 8632892 8238618
58705 8238618 7869192 7523649 7201033 6899792 6617935 6353887 6106940 5876609 5661674
58696 5661674 5460276 5271274 5095323 4933846 4786659 4651224 4524752 4406403 4296782
58687 4296782 4195983 4103295 4018403 3941411 3871494 3806791 3746145 3690103 3639667 3594572 3553079
58676C553079m0152m0583m1728m2775m3840m5250m6113m4992m2461m1248m2720
58665C081217m4897m5446m4977m5447m6824m7757m8540n0741n4177n6715n7153
58654B538543n6288n5037n3507n1911n0647m9304m7297m5414m4863m4847m3113
58643A996315l9233l5364l3324l2645l1913l0460k8250k5727k4173k4738k6656
58632A663832k7764k7051k5313k3385k1365j9723j9198j9179j8005j5353j2615
58621A434881j0485q061m889k013j27J592L921O341Q125R226R620R178Q728R340
58607A475377J0085Q597M789J970K841O179Q786R114P544M682J214j592k887l201
58593A533498l380l289k474j071P46L299O609J0016J3208J6501J9678K2045K4169
$$ plain form
58676 3553079 3512927 3472344 3430616 3387841 3344001 3298751 3252638 3207646 3165185 3123937 3081217
58665 3081217 3036320 2990874 2945897 2900450 2853626 2805869 2757329 2706588 2652411 2595696 2538543
58654 2538543 2482255 2427218 2373711 2321800 2271153 2221849 2174552 2129138 2084275 2039428 1996315
58643 1996315 1957082 1921718 1888394 1855749 1823836 1793376 1765126 1739399 1715226 1690488 1663832
58632 1663832 1636068 1609017 1583704 1560319 1538954 1519231 1500033 1480854 1462849 1447496 1434881
58621 1434881 1424396 1416335 1411446 1409433 1409306 1410898 1414819 1421160 1429285 1438511 1448131 1457309 1466037 1475377
58607 1475377 1485462 1494059 1498848 1500818 1503659 1509838 1518624 1527738 1535282 1539964 1541178 1539586 1536699 1533498
58593 1533498 1530118 1526829 1524355 1523284 1524030 1527329 1533938 1543954 1557162 1573663 1593341 1615386 1639555
58580A639555K7685L2457L6061L7339L8480M1769M6079M8720M9458N0553N3638
58569B101794N8501O4260O9898P4272P7341Q1044Q7377R5969J04867J13219J21852
58558C050394J31669J42818J55009J67577J79678J91528K04668K19850K35490
58549D678681K49441K61262K71090K77132K76385K67568K51444K28185J96191
58540F957379J54212J03515M7536r890o5661j17409j62955k00049k27215k44837
58530F234626k54588k57617k54314k45947k34959k22848k09197j93697j77634
58521D183825j62369j47871j34081j22032j12002j02136r0985q0142p2192o7122
58511C092893o2894n8666n5049n1964m8740m5953m4619m3832m1648l8286l5916
$$ plain form
58580 1639555 1667240 1699697 1735758 1773097 1811577 1853346 1899425 1948145 1997603 2048156 2101794
58569 2101794 2160295 2224555 2294453 2368725 2446066 2527110 2614487 2710456 2815323 2928542 3050394
58558 3050394 3182063 3324881 3479890 3647467 3827145 4018673 4223341 4443191 4678681
58549 4678681 4928122 5189384 5460474 5737606 6013991 6281559 6533003 6761188 6957379
58540 6957379 7111591 7215106 7262642 7252752 7187091 7069682 6906727 6706678 6479463 6234626
58530 6234626 5980038 5722421 5468107 5222160 4987201 4764353 4555156 4361459 4183825
58521 4183825 4021456 3873585 3739504 3617472 3505470 3403334 3312349 3232207 3160015 3092893
58511 3092893 3029999 2971333 2916284 2864320 2815580 2769627 2725008 2681176 2639528 2601242 2565326
58500B565326l5079l3907l1473k9550l0093l2858l6606m0886m5485m9369n1369
58489B148651n1309m9923m8317m7471m7200m5728m1639l6173l2004k9746k7651
58478A691490k4929k3028k2650k1916j9122j5477j3188j2171j0780q857p788p807
58466A503777p477o220n563o991r750j1778j2235j2162j2864j4415j5881j6591
58454A371850j6814j7254j8032j8397j7563j5718j4003j3230j2891j1794r623
58443A206531p338n794m627l048j159L57J442K501L276L192K809L505N284O400
58429A213331N966N511O687Q597Q893O914M190K170R32O8n76j305k628m425n838
58414A248487o382o613p320q397q837p827n671l586k427j859j112l63m46j208
$$ plain form
58500 2565326 2530247 2496340 2464867 2435317 2405224 2372366 2335760 2294874 2249389 2200020 2148651
58489 2148651 2097342 2047419 1999102 1951631 1904431 1858703 1817064 1780891 1748887 1719141 1691490
58478 1691490 1666561 1643533 1620883 1598967 1579845 1564368 1551180 1539009 1528229 1519372 1511584 1503777
58466 1503777 1496300 1490080 1484517 1477526 1467776 1455998 1443763 1431601 1418737 1404322 1388441 1371850
58454 1371850 1355036 1337782 1319750 1301353 1283790 1268072 1254069 1240839 1227948 1216154 1206531
58443 1206531 1199193 1193399 1188772 1185724 1184565 1184922 1186364 1188865 1192141 1195333 1198142 1201647 1206931 1213331
58429 1213331 1219297 1224808 1231495 1240092 1248985 1255899 1260089 1262259 1263191 1263259 1262683 1261378 1258750 1254325 1248487
58414 1248487 1242105 1235492 1228172 1219775 1210938 1203111 1197440 1193854 1191427 1189568 1188456 1188093 1187647 1186439
58400A186439j262J50K015L004L050K597J199j755n351p492p115n184l436k804
58386A164055l085l560l640l215k433j224O28K878M862O356P735Q997R364Q492
58372A196210P415P529Q786R502P980M190q7k754l320l207l838m920n198m331
58358A213957k890j036J346L474M262M242N203P696J0421J2414J4146J6010J7537
58345A306782J8718K0354K2438K3789K3919K3519K2497J9582J4778J0184P154
58334A513714M648J536j385l112m213n377n880n170m226l731k591J4K597L172
58320A489996J673r21m335q105j0515j0327q457o455m547k556r71K89K383N317
58306A442469P198P298P670R816J2099J2674J2594J3480J4436J4122J3731J4780
$$ plain form
58400 1186439 1185177 1185327 1187342 1190346 1193396 1195993 1197192 1195437 1190086 1182594 1175479 1170295 1166859 1164055
58386 1164055 1160970 1157410 1153770 1150555 1148122 1146898 1147526 1150404 1155266 1161622 1169357 1178354 1187718 1196210
58372 1196210 1203625 1211154 1219940 1229442 1237422 1241612 1241525 1238771 1235451 1232244 1228406 1223486 1218288 1213957
58358 1213957 1211067 1210031 1211377 1214851 1219113 1223355 1228558 1236254 1246675 1259089 1273235 1289245 1306782
58345 1306782 1325500 1345854 1368292 1392081 1416000 1439519 1462016 1481598 1496376 1506560 1513714
58334 1513714 1518362 1519898 1518513 1515401 1511188 1505811 1499931 1494761 1490535 1486804 1484213 1484227 1486824 1489996
58320 1489996 1491669 1490748 1486413 1478308 1467793 1457466 1449009 1442554 1438007 1435451 1434480 1434769 1437152 1442469
58306 1442469 1449667 1456965 1464635 1474451 1486550 1499224 1511818 1525298 1539734 1553856 1567587 1582367
58294A582367J5978J5520J4684J5619J7220J6862J5066J4569J5721J6283J5288
58283A755177J3628J1494Q488N789N005N254M368K401J265J557K672N030R086
58270A831214J3003J4627J4879J5974J7497J7776J7973K0511K4142K5145K3355
58259B036096K2657K5157K8823L1463L3280L4705L5203L5001L5088L5109L3975
58248B386557L2474L2201L2273L0507K7603K6391K7120K7325K6530K6981K9231
58237B705193L0959L1034L1054L2074L3160L4122L6411M0460M4964M9357N4144
58226C122932N8723O1849O4283O7821P1911P4521P6098P8979Q3126Q6357Q8623
58215C935223R2111R7083J01655J05686J10805J16607J20939J24007J28002J32826
$$ plain form
58294 1582367 1598345 1613865 1628549 1644168 1661388 1678250 1693316 1707885 1723606 1739889 1755177
58283 1755177 1768805 1780299 1788787 1794576 1799581 1804835 1809203 1811604 1812869 1814426 1817098 1822128 1831214
58270 1831214 1844217 1858844 1873723 1889697 1907194 1924970 1942943 1963454 1987596 2012741 2036096
58259 2036096 2058753 2083910 2112733 2144196 2177476 2212181 2247384 2282385 2317473 2352582 2386557
58248 2386557 2419031 2451232 2483505 2514012 2541615 2568006 2595126 2622451 2648981 2675962 2705193
58237 2705193 2736152 2767186 2798240 2830314 2863474 2897596 2934007 2974467 3019431 3068788 3122932
58226 3122932 3181655 3243504 3307787 3375608 3447519 3522040 3598138 3677117 3760243 3846600 3935223
58215 3935223 4027334 4124417 4226072 4331758 4442563 4559170 4680109 4804116 4932118 5064944
58205E064944J36511J39641J44645J50884J55510J59360J66807J79223J93522
58196F491047K07629K22666K39298K56949K76853L00828L26905L51221L74164
58187I047560L99175M25840M50289M72398M96084N22350N48706N75871O08062
58178A3546335O46095O87150P31858P83788Q40821Q94851R41914R85564J029234
58169B1087610J073001J119221J173079J235267J301370J369876J443683J523416
58161C1326523J607799J700922J809663J932816K061887K192760K326704K461270
58153D7420344K593225K731208K891829L081595L295649L534479L806214M111358
58145G3465901M443213M806900N221525N702403O261250O926027P737070Q718277
$$ plain form
58205 5064944 5201455 5341096 5485741 5636625 5792135 5951495 6118302 6297525 6491047
58196 6491047 6698676 6921342 7160640 7417589 7694442 7995270 8322175 8673396 9047560
58187 9047560 9446735 9872575 10322864 10795262 11291346 11813696 12362402 12938273 13546335
58178 13546335 14192430 14879580 15611438 16395226 17236047 18130898 19072812 20058376 21087610
58169 21087610 22160611 23279832 24452911 25688178 26989548 28359424 29803107 31326523
58161 31326523 32934322 34635244 36444907 38377723 40439610 42632370 44959074 47420344
58153 47420344 50013569 52744777 55636606 58718201 62013850 65548329 69354543 73465901
58145 73465901 77909114 82716014 87937539 93639942 99901192 106827219 114564289 123282566
58137A23282566R874023J1215047J2757036J4490678J6393055J8486664K0863953
58130B27363022K3657837K7014969L1006842L5312832L8797929L9528096L5597877
58123D58279404K6336016J2930141k037760j5741305k6152277l2505484l5175473
58116C85933262l5177137l3586774l1184316k8426614k5584770k2828692k0236004
58109A88908955j7819838j5582113j3527373j1644478r914518q334889o911042
58102A05174704n635800m500724l504303k609439j720242p78752Q7762N66169
58094H7079375L60508n80045k008173l514220m722991n433559n650086n508477
58086F0022332n162661m717947m237505l768800l344094k971942k647218k365739
$$ plain form
58137 123282566 133156589 144371636 157128672 171619350 188012405 206499069 227363022
58130 227363022 251020859 278035828 309042670 344355502 383153431 422681527 458279404
58123 458279404 484615420 497545561 495507801 479766496 453614219 421108735 385933262
58116 385933262 350756125 317169351 285985035 257558421 231973651 209144959 188908955
58109 188908955 171089117 155507004 141979631 130335153 120420635 112085746 105174704
58102 105174704 99538904 95038180 91533877 88924438 87204196 86425444 86513206 87079375
58094 87079375 87439883 86859838 84851665 81337445 76614454 71180895 65530809 60022332
58086 60022332 54859671 50141724 45904219 42135419 38791325 35819383 33172165 30806426
58078C0806426k122780j907843j712120j535879j381847j247633j130496j032243
58070A8735585r52890q85776q24839p70955p25885o85984o47136o10239n76897
58061A2054984n45002n13139m83891m58461m33455m07293l84190l67192l52624
58052H109737l36306l20207l07958k98194k87460k75895k65327k55103k44171
58043E519116k34096k25975k17332k05861j93468j83048j74038j64342j54017
58034C766939j44028j34075j24370j16781j11580j06004r8531r1588q7446q4629
58024B667907q1084p7626p5487p3443p0449o8154o7822o7435o4893o1562n9727
58013A900225n8795n6803n3491m9460m4605l9712l6924l6289l4636l0420k6629
$$ plain form
58078 30806426 28683646 26775803 25063683 23527804 22145957 20898324 19767828 18735585
58070 18735585 17782695 16896919 16072080 15301125 14575240 13889256 13242120 12631881 12054984
58061 12054984 11509982 10996843 10512952 10054491 9621036 9213743 8829553 8462361 8109737
58052 8109737 7773431 7453224 7145266 6847072 6559612 6283717 6018390 5763287 5519116
58043 5519116 5285020 5059045 4841713 4635852 4442384 4259336 4085298 3920956 3766939
58034 3766939 3622911 3488836 3364466 3247685 3136105 3030101 2931570 2839982 2752536 2667907
58024 2667907 2586823 2509197 2433710 2360267 2289818 2221664 2153842 2086407 2021514 1959952 1900225
58013 1900225 1841430 1784627 1731136 1681676 1637071 1597359 1560435 1524146 1489510 1459090 1432461
58002A432461k5947k6150k3906k0404j9149k0133k0326j8669j6841j5876j5437
57991A209623j5694j6831j7366j5820j3493j2786j3333j2591r927p402o478o427
57979A061475o323o466p309q429r055q660p060m796l186l045l650l695k896k000
57965I84905j699k073k600k396j207j75n33j519j320j88n34l125n499n535m585
57950I51917n212p385q914q669p591o986p205p691p435n998m567n035p411r373
57936H52445r139p476o167n896o711r012j2682j6226j8133j8311j7306j4988j1076
57923F99322o090j084K901M814M295K835K836M777O757P282O905O460N679M537
57909G52226M007M239L753J850O6k85k75j347k809l326l451m485n727n242k885
$$ plain form
58002 1432461 1406514 1380364 1356458 1336054 1316905 1296772 1276446 1257777 1240936 1225060 1209623
57991 1209623 1193929 1177098 1159732 1143912 1130419 1117633 1104300 1091709 1081782 1074380 1067902 1061475
57979 1061475 1055152 1048686 1041377 1032948 1023893 1015233 1008173 1003377 1000191 997146 993496 989801 986905 984905
57965 984905 983206 981133 978533 976137 974930 974755 974222 972703 971383 971195 970661 967536 962037 956502 951917
57950 951917 946705 939320 930406 921737 914146 907160 899955 892264 884829 878831 874264 869229 861818 852445
57936 852445 843306 835830 829663 823767 817056 808044 795362 779136 761003 742692 725386 710398 699322
57923 699322 693232 692148 695049 699863 704158 706993 709829 714606 721363 728645 735550 742010 747689 752226
57909 752226 756233 760472 764225 766075 766141 765856 765581 764234 761425 758099 754648 750163 744436 739194 736309
57894G36309o20m4j036k685m178m982n195n482n859n210k849J57K267L249L693
57879G07535L522K231J43j671k401j856l43J153J389J09j875m065o748r602j1407
57864F76114j1863j2256j3314j3903j3001j1450j0312q910o195l006j118p10l35
57851E69741J012L075N076O241O186N734O520Q745J0379R743P798O482N917M873
57837F57522L313K513L068M174M744M162K286k59k278l300m082n118n821o048
57823F54876p049r346j1009j0023p393n855o149o591o006m926l979k961j820q45
57809E70924K07J865L675M582M647N002O008O741O632O313O484O933P070O552
57795F43635N205L040N97j383k648l287l174k326j577j954l327m447m437l652
$$ plain form
57894 736309 735689 735645 734609 731924 727746 722764 717569 712087 706228 701018 698169 698326 700593 703842 707535
57879 707535 711057 713288 713431 711760 709359 707503 707160 708313 709702 709811 707936 703871 697123 687521 676114
57864 676114 664251 651995 638681 624778 611777 600327 590015 581105 574910 571904 570786 570076 569741
57851 569741 570753 573828 578904 585145 591331 597065 603585 612330 622709 632452 640250 646732 652649 657522
57837 657522 660835 663348 666416 670590 675334 679496 681782 681523 679245 675945 671863 666745 660924 654876
57823 654876 647827 638481 627472 617449 610056 604201 598052 591461 585455 580529 576550 573589 571769 570924
57809 570924 571131 572996 576671 581253 585900 590902 596910 603651 610283 616596 623080 630013 637083 643635
57795 643635 648840 651880 652477 651094 648446 645159 641985 639659 638082 636128 632801 628354 623917 620265
57781F20265l106l540m870o146o299n372m623n040o318p586q436q627p829o493
57767E35980o051p158q433q089o247m599m390n728q130j0543j1460j0360q498
57754D36294p244o348n052l958m028m560m077k823k309k585k072l28J135J360
57740C93405J435K615M443N674N990N873N549M888L872K683J574Q90Q32J277K209
57725D43209L868N885O890O045M481L866L885K810L90j527j691j088j247k258
57711D73518l306m078m740n224n300m866l861k414j218r11j024m31R35J964K216
57696D41260K607L699M628M659M598N475O664O736N697N101N950P543Q625Q774
57682E22016Q405Q008P810P878Q191Q622Q985R111Q928Q532Q123P887P965Q406
$$ plain form
57781 620265 617159 613619 608749 602603 596304 590932 586309 581269 574951 567365 558929 550302 542473 535980
57767 535980 529929 522771 514338 506249 500002 495403 491013 485285 477155 466612 455152 444792 436294
57754 436294 429050 422702 417650 413692 409664 405104 401027 398204 395895 393310 391238 390910 392045 393405
57740 393405 394840 397455 401898 407572 413562 419435 424984 429872 433744 436427 438001 438891 439723 441000 443209
57725 443209 447077 452962 459852 465897 470378 474244 478129 480939 481329 479802 478111 477023 475776 473518
57711 473518 470212 466134 461394 456170 450870 446004 442143 439729 438511 437600 436576 436145 437080 439044 441260
57696 441260 443867 447566 452194 456853 461451 466926 473590 480326 486023 491124 497074 504617 513242 522016
57682 522016 530421 538429 546239 554117 562308 570930 579915 589026 597954 606486 614609 622496 630461 638867
57668F38867R165J0161J1420J2909J4215J4746J4542J4537J5566J7401J9149K0349
57656H13027K1137K1681K2132K3051K4999K7714L0221L1893L2948L3827L4700
57645A117330L5727L7331L9901M3438M7469N1127N3548N4695N5709N7947O1652
57634A655874O5916O9851P3279P6514Q0103Q4717R0678R7621J05116J13566J23773
57623B637008J35697J48478J61776J76221J92257K09371K26797K44209K61157
57614D392971K76377K88438K96684L00772K99325K89741K69774K39115J98951
57605F852148J49796R0258J9014o1326j42660k14557k69348l04505l21410l23344
57595E474066l14374k98369k77921k54519k30043k07036j86937j68849j51073
$$ plain form
57668 638867 648032 658193 669613 682522 696737 711483 726025 740562 756128 773529 792678 813027
57656 813027 834164 855845 877977 901028 926027 953741 983962 1015855 1048803 1082630 1117330
57645 1117330 1153057 1190388 1230289 1273727 1321196 1372323 1425871 1480566 1536275 1594222 1655874
57634 1655874 1721790 1791641 1864920 1941434 2021537 2106254 2196932 2294553 2399669 2513235 2637008
57623 2637008 2772705 2921183 3082959 3259180 3451437 3660808 3887605 4131814 4392971
57614 4392971 4669348 4957786 5254470 5555242 5854567 6144308 6414082 6653197 6852148
57605 6852148 7001944 7092202 7111216 7049890 6907230 6692673 6423325 6118820 5797410 5474066
57595 5474066 5159692 4861323 4583402 4328883 4098840 3891804 3704867 3536018 3384945
57586C384945j33392j16917j02153q8368p5014o2679n2124m3112l4759k6573j8535
57575B631319j0432j928O671J4336K0481K5828L1665L8364M5180N1640N8607O7456
57563B979187P8424R0234J01492J12135J23222J35513J48520J60940J71634J80081
57553D281382J86131J89481J89305J84019J71545J50137J19264P9926L4507j3451
57543E572246n9903j01741j37891j68501j93091k10307k19790k23186k22615k18801
57533C816420k11571k01475j89767j77210j64106j51389j40386j31145j22191
57524B327180j12368j02314r3515q6428q0003p2902o5037n7880n3059n0430m8064
57513A505180m4482m0133l6050l2095k7795k4091k2377k1986k0604j7402j4035
$$ plain form
57586 3384945 3251553 3134636 3032483 2944115 2869101 2806422 2754298 2711186 2676427 2649854 2631319
57575 2631319 2620887 2618959 2625630 2639966 2660447 2686275 2717940 2756304 2801484 2853124 2911731 2979187
57563 2979187 3057611 3147845 3249337 3361472 3484694 3620207 3768727 3929667 4101301 4281382
57553 4281382 4467513 4656994 4846299 5030318 5201863 5352000 5471264 5551190 5585697 5572246
57543 5572246 5512343 5410602 5272711 5104210 4911119 4700812 4481022 4257836 4035221 3816420
57533 3816420 3604849 3403374 3213607 3036397 2872291 2720902 2580516 2449371 2327180
57524 2327180 2214812 2112498 2018983 1932555 1852552 1779650 1714613 1656733 1603674 1553244 1505180
57513 1505180 1460698 1420565 1384515 1352420 1324625 1300534 1278157 1256171 1235567 1218165 1204130
57502A204130j2057j1003r768q260o706m681j909R14L114N037P301R856J2427
57489A188395J5041J7468J9071J9883K0894K2629K4592K6653K9680L3891L7957
57478A456154M0927M3729M7436N1217N3703N5523N8665O3748O9520P4921Q0167
57467B095710Q5883R2368R9820J08282J17285J26103J34219J41087J45839J47852
57457C294448J47101J43336J35574J22890J04968Q1376N1583J6870j8874n1669
57447D027603q0081j04354j23991j37912j46266j50268j50520j47021j40601j32828
57437B713761j24605j16124j07820r9890r1120q0085o7693n6886m9420m4171l9085
57426A836862l3516k8050k3042j8178j3031p542k073K893P229J1247J5171J8925
$$ plain form
57502 1204130 1192073 1181070 1171302 1163042 1156336 1151655 1149746 1150660 1153774 1158811 1166112 1175968 1188395
57489 1188395 1203436 1220904 1239975 1259858 1280752 1303381 1327973 1354626 1384306 1418197 1456154
57478 1456154 1497081 1540810 1588246 1639463 1693166 1748689 1807354 1871102 1940622 2015543 2095710
57467 2095710 2181593 2273961 2373781 2482063 2599348 2725451 2859670 3000757 3146596 3294448
57457 3294448 3441549 3584885 3720459 3843349 3948317 4029693 4081276 4098146 4079272 4027603
57447 4027603 3947522 3843168 3719177 3581265 3434999 3284731 3134211 2987190 2846589 2713761
57437 2713761 2589156 2473032 2365212 2265322 2174202 2094117 2026424 1969538 1920118 1875947 1836862
57426 1836862 1803346 1775296 1752254 1734076 1721045 1713503 1711430 1714323 1721552 1732799 1747970 1766895
57414A766895K2642K6801L1533L6482M1604M7261N3185N8783O4931P3651Q4776
57403B308544R4845J01212J05745J12120J20538J27651J30962J30494J26321J17305
57393C475737J02808Q3296N8643K8023p536m4244p8142j07382j31532j50211j63255
57382C066205j70955j73508j71163j65126j57096j47763j37225j26923j19147
57373A697299j13953j08419j00067q9590p9372p0788o4062n9289n6054n2939m8853
57362H53913m4361m0727l8218l6268l4585l3076l1205k8543k5724k3872k3148
57351D94186k2524k1011j8552j5926j4109j3648j4052j4003j2549j0140q251p957
57339C21464q983j0091j0227r402q490q285q767r225q838p307n240l918m072m953
$$ plain form
57414 1766895 1789537 1816338 1847871 1884353 1925957 1973218 2026403 2085186 2150117 2223768 2308544
57403 2308544 2403389 2504601 2610346 2722466 2843004 2970655 3101617 3232111 3358432 3475737
57393 3475737 3578545 3661841 3720484 3748507 3740971 3696727 3618585 3511203 3379671 3229460 3066205
57382 3066205 2895250 2721742 2550579 2385453 2228357 2080594 1943369 1816446 1697299
57373 1697299 1583346 1474927 1374860 1285270 1205898 1135110 1071048 1011759 955705 902766 853913
57362 853913 809552 768825 730607 694339 659754 626678 595473 566930 541206 517334 494186
57351 494186 471662 450651 432099 416173 402064 388416 374364 360361 347812 337672 329421 321464
57339 321464 312481 302390 292163 282761 274271 265986 257219 247994 239156 231849 226609 222691 218619 213666
57325B13666n208m682m360m520m174k808j405r87j355k093l505n460o561n895
57311A60653m526l863l615k961k535l310m450m420l659l846m953n247m176k969
57297A06123k342j768j229j535k468k661j952j871k994l653k329J74J953K289
57283H5737J751J107R45J611K843L863M236M126L765L280K993K989K700J756R84
57268A24686J405K632L457L707M169N017N740O256O719O494N090L639L706M867
57254A87584N394N021N000N513N467M979N734Q223J0703J1633J1414J1143J1268
57241B89076J1888J2790J2955J1764J0731J2060J5421J8421K0417K3210K7399
57230D66132L0944L2496L3635L6262L9866M2962M5329M7369M8884M9988N1665
$$ plain form
57325 213666 208458 203776 199416 194896 190722 187914 186509 185522 184167 182074 178569 173109 166548 160653
57311 160653 156127 152264 148649 145688 143153 139843 135393 130973 127314 123468 118515 113268 109092 106123
57297 106123 103781 102013 100784 99249 96781 94120 92168 90297 87303 83650 81321 81495 83448 85737
57283 85737 87488 88595 89540 91151 93994 97857 102093 106219 109984 113264 116257 119246 121946 123702 124686
57268 124686 126091 128723 132180 135887 140056 145073 150813 157069 163788 170282 175372 179011 182717 187584
57254 187584 192978 197999 202999 208512 213979 218958 224692 232915 243618 255251 266665 277808 289076
57241 289076 300964 313754 326709 338473 349204 361264 376685 395106 415523 438733 466132
57230 466132 497076 529572 563207 599469 639335 682297 727626 774995 823879 873867 925532
57219I25532N4020N5414N4723N3147N2377N2204N1260M9027M5882M1996L7384
57208A472966L2370K7134K1533J5646R672L182m181j1137j5629j7582j9011k0896
57196A494067k1879k0831j8574j6077j2802q273l686n46J179K504M078O142Q661
57183A413963J0839J1769J2075J3521J6585J9937K2604K4865K6626K7148K7037
57172A626969K8362L1714L5234L7466L9137M0860M1339L9433L6244L3485L1283
57161B021526K9094K7464K7379K8969L1977L6422M1800M6887N1303N5984O1257
57150B460062O5742O8133O8878O9216O9688P0352P1348P2542P3448P3884P3959
57139C237252P3680P3658P5645Q0683Q7411R3943J00606J08471J16109J20877
$$ plain form
57219 925532 979552 1034966 1089689 1142836 1195213 1247417 1298677 1347704 1393586 1435582 1472966
57208 1472966 1505336 1532470 1554003 1569649 1579321 1582503 1578322 1567185 1551556 1533974 1514963 1494067
57196 1494067 1472188 1451357 1432783 1416706 1403904 1395631 1391945 1391399 1392578 1395082 1399160 1405302 1413963
57183 1413963 1424802 1436571 1448646 1462167 1478752 1498689 1521293 1546158 1572784 1599932 1626969
57172 1626969 1655331 1687045 1722279 1759745 1798882 1839742 1881081 1920514 1956758 1990243 2021526
57161 2021526 2050620 2078084 2105463 2134432 2166409 2202831 2244631 2291518 2342821 2398805 2460062
57150 2460062 2525804 2593937 2662815 2732031 2801719 2872071 2943419 3015961 3089409 3163293 3237252
57139 3237252 3310932 3384590 3460235 3540918 3628329 3722272 3822878 3931349 4047458 4168335
57129D168335J22909J24696J26969J28313J28658J29423J30045J28127J23640
57120E311115J19357J16555J13865J10868J09007J08193J06371J03273J00761
57111F299365R8757R5013Q9617Q5472Q3365Q1131P8688P8807Q1478Q2709Q0879
57100G235281P9172P9470P9026P5950P3121P3455P5621P7491P9824Q3843Q8949
57089H101203R5313J04797J17179J29598J41314J54111J66177J71146J65673J52783
57079I499294J35567J13524Q7589O2354L9850J6928q112l2357n4581p8446j06536
57068I675074j38000j74858k22718k81638l43999m05253m68544n35162o00084
57059F504818o61895p27643q02287q83025r69582j069605B03441a114083j457465
$$ plain form
57129 4168335 4291244 4415940 4542909 4671222 4799880 4929303 5059348 5187475 5311115
57120 5311115 5430472 5547027 5660892 5771760 5880767 5988960 6095331 6198604 6299365
57111 6299365 6398122 6493135 6582752 6668224 6751589 6832720 6911408 6990215 7071693 7154402 7235281
57100 7235281 7314453 7393923 7472949 7548899 7622020 7695475 7771096 7848587 7928411 8012254 8101203
57089 8101203 8196516 8301313 8418492 8548090 8689404 8843515 9009692 9180838 9346511 9499294
57079 9499294 9634861 9748385 9835974 9898328 9938178 9955106 9946994 9914637 9860056 9781610 9675074
57068 9675074 9537074 9362216 9139498 8857860 8513861 8108608 7640064 7104902 6504818
57059 6504818 5842923 5115280 4312993 3429968 2460386 1390781 203441 -1114083 -2571548
57050b571548j614075j792036j986821k197308k432513k697396k985932l297454
57042b1575083l644636m034742m459509m915361n415629n969751o570420p216049
57034f3801180p922959q697863r523010j0384860j1282404j2185090j3029222
57027a36826588j3785074j4445424j4858221j4645555j3468348j1422040r047957
57020b28499207o871727m998641l207995j322288O50648K672860M788503P027334
57012b29760513R295279J1422245J3267875J4741904J5771851J6306882J6340373
57005a32614104J5901057J5039057J3841935J2443082J0984048R569394Q262587
56998d6572944P102691O104190N253667M527660L911062L391115K947186K560728
$$ plain form
57050 -2571548 -4185623 -5977659 -7964480 -10161788 -12594301 -15291697 -18277629 -21575083
57042 -21575083 -25219719 -29254461 -33713970 -38629331 -44044960 -50014711 -56585131 -63801180
57034 -63801180 -71724139 -80422002 -89945012 -100329872 -111612276 -123797366 -136826588
57027 -136826588 -150611662 -165057086 -179915307 -194560862 -208029210 -219451250 -228499207
57020 -228499207 -235370934 -240369575 -243577570 -244899858 -244249210 -241576350 -236787847 -229760513
57012 -229760513 -220465234 -209042989 -195775114 -181033210 -165261359 -148954477 -132614104
57005 -132614104 -116713047 -101673990 -87832055 -75388973 -64404925 -54835531 -46572944
56998 -46572944 -39470253 -33366063 -28112396 -23584736 -19673674 -16282559 -13335373 -10774645
56990a0774645K226859J944668J704558J495710J317303i14463A35333R43062
56982A078395Q48298P66750O94685O27436N66536N14704M68982M26061L88877
56973F380724L60613L37561L14816K93779K77114K61722K43764K25869K12325
56964H908287K01557J90013J78884J70128J59911J43088J20911R7936P4585M8816
56954A0294116K2083k573k5554m8103o7328p9478q5712q9398r0364q7351q3541
56943I656797q3590q6791q9200r1961j02494j27413j67545k18591k72744l20754
56933H095714l56487l79765l93156l97712l94059l84817l72375l56040l34593
56924D726710l09992k85650k62849k41587k23043k08297j96443j86460j78944
$$ plain form
56990 -10774645 -8547786 -6603118 -4898560 -3402850 -2085547 -914463 135333 1078395
56982 1078395 1926693 2693443 3388128 4015564 4582100 5096804 5565786 5991847 6380724
56973 6380724 6741337 7078898 7393714 7687493 7964607 8226329 8470093 8695962 8908287
56964 8908287 9109844 9299857 9478741 9648869 9808780 9951868 10072779 10170715 10245300 10294116
56954 10294116 10316199 10313626 10288072 10239969 10172641 10093163 10007451 9918053 9827689 9740338 9656797
56943 9656797 9573207 9486416 9397216 9305255 9202761 9075348 8907803 8689212 8416468 8095714
56933 8095714 7739227 7359462 6966306 6568594 6174535 5789718 5417343 5061303 4726710
56924 4726710 4416718 4131068 3868219 3626632 3403589 3195292 2998849 2812389 2633445
56915B633445j73640j67818j59866j51936j46081j40363j31939j21506j11358
56906A328938j01407r0496p9440o9300n8833m7072l6284k8776k2901j5905q824
56895G69700m758m219o045j0976j9885k9754l5934l7847l8580l9431l8728l5665
56883D67878l1544k7251k2718j8793j6569j4941j1717o956k494J419O011J0886
56871C33211J4073J5275J6149J6955J5500J0116J774p061j4035j7555j7758j6894
56859C49750j7178j8292j8346j6732j4477j2375j0520r148q316p195n146k832
56847B09193r42J218M301P184Q464Q687R293J0303J0945J1541J2683J3541J3151
56834C19562J2586J3681J6164J8249J9413K0537K1805K2474K2352K1641J9838
$$ plain form
56915 2633445 2459805 2291987 2132121 1980185 1834104 1693741 1561802 1440296 1328938
56906 1328938 1227531 1137035 1057595 988295 929462 882390 846106 817330 794429 778524 769700
56895 769700 764942 760723 754678 743702 723817 694063 658129 620282 581702 542271 503543 467878
56883 467878 436334 409083 386365 367572 351003 336062 324345 317389 314895 316314 322325 333211
56871 333211 347284 362559 378708 395663 411163 421279 423053 415992 401957 384402 366644 349750
56859 349750 332572 314280 295934 279202 264725 252350 241830 232682 224366 217171 212025 209193
56847 209193 208251 209469 213770 220954 229418 238105 247398 257701 268646 280187 292870 306411 319562
56834 319562 332148 345829 361993 380242 399655 420192 441997 464471 486823 508464 528302
56823E28302J6529J2680R266N363k86o464j0412j1331j0917j0679j0555j0037
56811E01459q839o499k810J484N558R660J4166J8220K0766K2388K4730K8610L3577
56798F62470L8285M0217L6528K6986J4974M052n219j3553j9944k2724k2301k0395
56786G19376j7534j3502r060m782O17Q184J6010K1453K5136K9937L6864M4908
56774H57607N4021O4451P3245P5024O7131N1328L0412O256j8182l8366n1477n8188
56762A113262o0240n8290n2965m5975l8798l1664k4534j7714j0935l373M794J2240
56750G85808J8478K4725L2235M0651M7970N1065M6715L3964J5683l529k0886l5601
56738A037278m6493n1846n1806m8673m4340l9208l3815k9372k6081k2644j8107
$$ plain form
56823 528302 544831 557511 566777 572140 571854 565390 554978 543647 532730 522051 511496 501459
56811 501459 492620 486121 483311 484795 490353 500013 514179 532399 553165 575553 600283 628893 662470
56798 662470 700755 740972 777500 804486 819460 823512 818293 804740 784796 762072 739771 719376
56786 719376 701842 688340 679280 674498 675115 683299 699309 720762 745898 775835 812699 857607
56774 857607 911628 976079 1049324 1124348 1191479 1242807 1273219 1279475 1261293 1222927 1171450 1113262
56762 1113262 1053022 994732 941767 895792 856994 825330 800796 783082 772147 768774 773568 785808
56750 785808 804286 829011 861246 901897 949867 1000932 1047647 1081611 1097294 1093765 1072879 1037278
56738 1037278 990785 938939 887133 838460 794120 754912 721097 691725 665644 643000 624893
56727F24893j2798p118r61N339J0934J5594J9619K2525K3258K1541J7444J0088
56715G50358j050j3554k3255k8410l0744l2023l2022l0418k8263k6301k3860k0533
56703D59925j7356j5209j3569j1812j0355r533q746p592o607o019n105l487j885
56690C42650q95j97L98M62K8j37P9j00p13p67j58j59j199j802q67N59Q12l50k270
56671C35374m565o622p265o112m366l235k615k144k200k855l157k660k403l089
56657B82086l566k703j597k059l620l983k291k06M93lk21O99K232L118K621J286
56641B72286L38K21K17k67p79p08m43r09k190l331l388k280o95N22J044J230J472
56624B62340J537J034M55Q50K287L428L166J974J149J194J574J713J610J449J083
$$ plain form
56727 624893 612095 604977 604016 609355 620289 635883 655502 678027 701285 722826 740270 750358
56715 750358 749308 735754 712499 684089 653345 621322 589300 558882 530619 504318 480458 459925
56703 459925 442569 427360 413791 401979 391624 382091 373345 365753 359146 353127 348022 344535 342650
56690 342650 341755 341558 341956 342418 342446 342309 342388 342288 341575 340808 340650 340491 339292 337490 336623 337182 337994 337644 335374
56671 335374 330809 324187 316922 310810 306444 303209 300594 298450 296250 293395 290238 287578 285175 282086
56657 282086 278520 275817 274220 272161 268541 264558 262267 262061 262554 262551 262330 263029 265261 268379 271000 272286
56641 272286 272624 272845 273062 272795 272016 271308 270865 269956 267766 264435 261047 258767 258072 258594 259638 260868 262340
56624 262340 263877 264911 265366 266216 268503 271931 275097 277071 278220 279414 280988 282701 284311 285760 286843
56609B86843K39q04j140k62R58J103O4q64r31q20j049r30j23K15n72r85L51J894
56591B83187J117j479k954k291j354j444j756j800k454l605l398j333K33n86k397
56576B57686k894k267k104k367j709j52P29R2j255k222k524k523k694l105l019
56561B29672j675K71J055R0j163j352r79j102j585j899k422l488m100l173j376
56546B06774j90K21O86J158Q96K96P10K297L546L355K383J906K241K866L391L866
56530B36402M426N067N655O111O507O802O439M783K216K48J5R38J423O91m27l58
56514B86938J674M668O322N175K503J344L142O085P312O125M225L306L492M007
56500C46318M454N004N762O427O648O615O877P425P373O132M495L819M291M899
$$ plain form
56609 286843 287082 286278 285138 284876 285834 286937 287001 286137 285206 284386 283337 282407 282284 282499 281927 280942 281293 283187
56591 283187 284304 282825 279871 277580 276226 274782 273026 271226 268772 265167 261769 260436 260669 260083 257686
56576 257686 254792 252525 250421 248054 246345 246193 246922 247014 245759 243537 241013 238490 235796 232691 229672
56561 229672 227997 228268 229323 229413 228250 226898 225919 224817 223232 221333 218911 215423 211323 208150 206774
56546 206774 206584 206805 207491 208649 209545 209841 210551 212848 216394 219749 222132 224038 226279 229145 232536 236402
56530 236402 240828 245895 251550 257661 264168 270970 277409 282192 284408 284656 284671 285609 287032 287723 287296 286938
56514 286938 288612 293280 299602 304777 307280 308624 311766 317851 325163 331288 335513 338819 342311 346318
56500 346318 350772 355776 361538 367965 374613 381228 388105 395530 402903 409035 413530 417349 421640 426539
56486D26539N036N024N047M613L451K009O69p21k182l321l981m420m691m751n188
56471D23133o653q285q121n722l130k453l516m708n077m664l681k455j606j347
56457C61715j139o74n72j397k647l430l663l876m282m575m341l346j895r84j299
56442C23595k039j759n36lq38j711j420o20l98m25J62J007J032J96l76J65J551
56425C17583K646K292N65p17K08K526L577K510J440K117L392L448K796L092M244
56410C51719M815M613M869O110P597Q687R311R256Q330P229O967P542Q109Q364
56396D53518Q706R219R386Q757P262N154L184K305K517K577J525j36j405k080
56382E10489k311j851p04K91N24M55L78n05k599m513m662l573l045l759n013o209
$$ plain form
56486 426539 431575 436599 441646 446259 449710 451719 452388 451667 449485 446164 442183 437763 433072 428321 423133
56471 423133 416480 408195 400074 394352 391222 388769 385253 380545 375468 370804 367123 364668 363062 361715
56457 361715 360576 359902 359330 357933 355286 351856 348193 344317 340035 335460 331119 327773 325878 324894 323595
56442 323595 321556 319797 319261 319258 318420 316709 315289 314669 314271 313846 314008 315015 316047 316243 315867 316032 317583
56425 317583 320229 322521 323086 322369 322577 325103 328680 331190 332630 334747 338139 341587 344383 347475 351719
56410 351719 356534 361147 366016 372126 379723 388410 397721 406977 415307 422536 429503 437045 445154 453518
56396 453518 462224 471443 480829 489586 496848 502002 505186 507491 510008 512585 514110 513974 512569 510489
56382 510489 508178 506327 505623 505914 506438 506893 507271 506766 504167 499654 494992 491419 488374 484615 479602 473393
56366D73393p083p038n751m219l751m229m387l563k159r31p16k038m009m634l376
56351D15509k252k950m267m181l057k540k433j408j17o43k928m519m173l172k630
56336C74239j934o53K47J25j56K73J006J394J525J654J770K067K613K459N90k049
56320C85170l141j964j36R76J776K772L272K710J858J664J966K174K210K109J749
56305D05165J470J922K895L474L666M507O017O709N799M428L839L772L572L440
56291D60675L465K820J299M57J667L875M853M166L370L532M010L827L074K601
56277E03691K922L782M553M889N068N551O288O801O947P213Q029R260J0407J0993
56263E96394J0724R759Q730Q090P587O942O755P843R846J1392J1756J1471J1242
$$ plain form
56366 473393 466310 459272 453521 449302 445551 441322 436935 433372 431213 430282 429566 427528 423519 418885 415509
56351 415509 413257 410307 406040 401859 398802 396262 393829 392421 392304 391661 388733 384214 380041 376869 374239
56336 374239 372305 371652 371899 372024 371868 372141 373147 374541 376066 377720 379490 381557 384170 386629 387219 385170
56320 385170 382029 380065 379929 380905 382681 385453 388725 391435 393293 394957 396923 399097 401307 403416 405165
56305 405165 406635 408557 411452 414926 418592 423099 429116 435825 441624 446052 449891 453663 457235 460675
56291 460675 464140 466960 468259 468716 470383 474258 479111 483277 486647 490179 494189 498016 501090 503691
56277 503691 506613 510395 514948 519837 524905 530456 536744 543545 550492 557705 565734 574994 585401 596394
56263 596394 607118 616877 625607 633697 641284 648226 654981 662824 672670 684062 695818 707289 718531
56250G18531J1201J1293J1650J2285J3116J4246J5553J6108J4980J2560J0267
56239H61790Q958Q439Q326Q377Q263P955Q128R048R646R136Q922J0968J4541J6906
56225I99403J7356J8135K0713K3615K5082K5717K6929K8619L0197L2357L5993
56214A284116M0254M3599M6084M8989N2656N6231N9273O2292O5872P0423P6595
56203A906384Q4585R3133J00349J05972J11851J19811J29565J39279J47861J56056
56193C094846J65070J74605J82986J89097J93044J94521J91899J84239J73140
56184D743447J60786J46645J28249J05135P9818N4455K8767K355k2973m4777o2659
56173E319248p7877r1000j01374j08405j12406j14409j15757j17533j19839j22028
$$ plain form
56250 718531 729732 741025 752675 764960 778076 792322 807875 823983 838963 851523 861790
56239 861790 870748 879187 887513 895890 904153 912108 920236 929284 938930 948066 956988 967956 982497 999403
56225 999403 1016759 1034894 1055607 1079222 1104304 1130021 1156950 1185569 1215766 1248123 1284116
56214 1284116 1324370 1367969 1414053 1463042 1515698 1571929 1631202 1693494 1759366 1829789 1906384
56203 1906384 1990969 2084102 2184451 2290423 2402274 2522085 2651650 2790929 2938790 3094846
56193 3094846 3259916 3434521 3617507 3806604 3999648 4194169 4386068 4570307 4743447
56184 4743447 4904233 5050878 5179127 5284262 5364080 5418535 5447302 5449657 5426684 5381907 5319248
56173 5319248 5241371 5150371 5048997 4940592 4828186 4713777 4598020 4480487 4360648 4238620
56163D238620j23805j25403j26617j26776j25998j25400j25520j25598j24924
56154C108579j23764j22259j19630j15411j10595j06511j03123r9166r3596q6464
56144B028060p8904p2465o7791o3770n8842n3072m7906m3842l9898l5589l1774
56133A434207k9002k6606k4128k2094k0567j8529j5703j3509j2896j2608j0899
56122A227666p858m871k642r39O02K422M944P728R629J0525J1773J4082J6298
56109A289359J7301J7893J9509K2105K4563K6347K7658K8700K9642L0611L1152
56098A564840L0642K9619K9375K9794K9304K7540K6082K5699K5121K3706K3150
56087A864872K4902K8063L1529L5944M1471M5931M7826M9355N3606O0345O7537
$$ plain form
56163 4238620 4114815 3989412 3862795 3736019 3610021 3484621 3359101 3233503 3108579
56154 3108579 2984815 2862556 2742926 2627515 2516920 2410409 2307286 2208120 2114524 2028060
56144 2028060 1949156 1876691 1808900 1745130 1686288 1633216 1585310 1541468 1501570 1465981 1434207
56133 1434207 1405205 1378599 1354471 1332377 1311810 1293281 1277578 1264069 1251173 1238565 1227666
56122 1227666 1219808 1214937 1212295 1211356 1211958 1214380 1219324 1227052 1236681 1247206 1258979 1273061 1289359
56109 1289359 1306660 1324553 1344062 1366167 1390730 1417077 1444735 1473435 1503077 1533688 1564840
56098 1564840 1595482 1625101 1654476 1684270 1713574 1741114 1767196 1792895 1818016 1841722 1864872
56087 1864872 1889774 1917837 1949366 1985310 2026781 2072712 2120538 2169893 2223499 2283844 2351381
56076B351381P5451Q5856R8194J09988J20514J30472J38175J39698J33538J22237
56066C505504J08814R4467Q0659P0237O4483O0846N5323M5963L3006J7245j21
56055D136426j6802l0388m0308m8376n7220o8313q1348r5225j09275j22915j34314
56044C331942j40713j40767j35727j27652j17435j05306r2133p9074o6785n5823
56034B270527m6993m0303l4578k8917k3563j8631j3612r005o591o712p167o386
56022B028069n691o524p464o512m463l208k281j03K516L482L262M529Q117J2173
56008B025902J5113J6983J8127J8976K0709K3744K6146K6004K4788K5598K8560
55997B270650L0899L1238L0967L1420L2565L4489L7433M0260M1529M2130M4280
$$ plain form
56076 2351381 2426832 2512688 2610882 2720870 2841384 2971856 3110031 3249729 3383267 3505504
56066 3505504 3614318 3708785 3789444 3859681 3924164 3985010 4040333 4086296 4119302 4136547 4136426
56055 4136426 4119624 4089236 4048928 4000552 3943332 3875019 3793671 3698446 3589171 3466256 3331942
56044 3331942 3191229 3050462 2914735 2787083 2669648 2564342 2472209 2393135 2326350 2270527
56034 2270527 2223534 2183231 2148653 2119736 2096173 2077542 2063930 2054925 2048334 2041622 2034455 2028069
56022 2028069 2022378 2015854 2008390 2001878 1997415 1994207 1991926 1991823 1994339 1997821 2001083 2005612 2013729 2025902
56008 2025902 2041015 2057998 2076125 2095101 2115810 2139554 2165700 2191704 2216492 2242090 2270650
55997 2270650 2301549 2332787 2363754 2395174 2427739 2462228 2499661 2539921 2581450 2623580 2667860
55986B667860M8054N1455N3787N6172N8856O0806O2055O3848O6413O9058P2113
55975C330477P6199Q0100Q2303Q4106Q7988R3385R7640J00746J05431J12556J20112
55964D371043J26938J33778J40674J47100J54672J65745J79055J90896K00811
55955E810712K11945K25569K39832K54464K71713K91765L12042L32249L54978
55946H305269L79822M02091M19644M36240M55833M78062N01842N28936N61187
55937A2468926N98004O38939O84901P34417P82483Q25556Q64396R00682R35151
55928A9433455R70734J012735J063281J119564J179242J243303J312416J386017
55920B8720747J466740J559915J666086J779381J895146K013495K134235K256068
$$ plain form
55986 2667860 2715914 2767369 2821156 2877328 2936184 2996990 3059045 3122893 3189306 3258364 3330477
55975 3330477 3406676 3486776 3569079 3653185 3741173 3834558 3932198 4032944 4138375 4250931 4371043
55964 4371043 4497981 4631759 4772433 4919533 5074205 5239950 5419005 5609901 5810712
55955 5810712 6022657 6248226 6488058 6742522 7014235 7306000 7618042 7950291 8305269
55946 8305269 8685091 9087182 9506826 9943066 10398899 10876961 11378803 11907739 12468926
55937 12468926 13066930 13705869 14390770 15125187 15907670 16733226 17597622 18498304 19433455
55928 19433455 20404189 21416924 22480205 23599769 24779011 26022314 27334730 28720747
55920 28720747 30187487 31747402 33413488 35192869 37088015 39101510 41235745 43491813
55912D3491813K383616K527496K694252K883537L097357L342335L619230L920955
55904F7960591M246869M610186N027984N516715O103197O824767P707947Q758767
55896A16757023R981624J1391963J3003029J4824741J6892518J9269909K1994609
55889B24115416K5040972K8341698L1740971L4752245L6301457L4871468K9206118
55882D44370345J9168960O102802p617254j9557849k8133398l2972953l4666607
55875C46694046l4186693l2402602k9912282k7103839k4240179k1482873j8907865
55868A58457713j6548384j4427039j2552172j0911096r484994q262435p231168
55861G9040425o367473n642407n031749m514402m068919l678529l334518l030285
$$ plain form
55912 43491813 45875429 48402925 51097177 53980714 57078071 60420406 64039636 67960591
55904 67960591 72207460 76817646 81845630 87362345 93465542 100290309 107998256 116757023
55896 116757023 126738647 138130610 151133639 165958380 182850898 202120807 224115416
55889 224115416 249156388 277498086 309239057 343991302 380292759 415164227 444370345
55882 444370345 463539305 469642107 462024853 442467004 414333606 381360653 346694046
55875 346694046 312507353 280104751 250192469 223088630 198848451 177365578 158457713
55868 158457713 141909329 127482290 114930118 104019022 94534028 86271593 79040425
55861 79040425 72672952 67030545 61998796 57484394 53415475 49736946 46402428 43372143
55853D3372143k757251k510008k289438k096560j927915j779783j651279j539977
55845B6819932j439664j345825j258719j178189j100800j025335r55789q94813
55837A7620798q38825p83780p31577o86273o47425o11494n77012n44317n12798
55828A1687297m82294m55028m32466m12214l91376l71053l54017l39767l25559
55819H123523l11039k98282k87826k77829k66919k55345k43392k30904k18370
55810E733617k06857j96863j88252j80767j73783j66479j59248j53859j51104
55801D156405j49252j45904j40333j33272j25792j19449j15965j15374j15509
55792B995555j14441j12195j09133j04379r7323q9284q1926p5175o8254o1697
$$ plain form
55853 43372143 40614892 38104884 35815446 33718886 31790971 30011188 28359909 26819932
55845 26819932 25380268 24034443 22775724 21597535 20496735 19471400 18515611 17620798
55837 17620798 16781973 15998193 15266616 14580343 13932918 13321424 12744412 12200095 11687297
55828 11687297 11205003 10749975 10317509 9905295 9513919 9142866 8788849 8449082 8123523
55819 8123523 7812484 7514202 7226376 6948547 6681628 6426283 6182891 5951987 5733617
55810 5733617 5526760 5329897 5141645 4960878 4787095 4620616 4461368 4307509 4156405
55801 4156405 4007153 3861249 3720916 3587644 3461852 3342403 3226438 3111064 2995555
55792 2995555 2881114 2768919 2659786 2555407 2458084 2368800 2286874 2211699 2143445 2081748
55782B081748n6515n2241m7620m2799l9158l7211l5941l4234l1964k9586k7355
55771A647124k5066k2425j9828j8424j8598j8899j7795j6388j7486k1777k6737
55760A423701k9868l1100l1408l1111l0723l1294l2568l2506l0123k7060k5008
55749A090932k3397k1262j9346j8231j6293j2209q114p194q823r090o116k149
55737I38708%J91j75n09j184k581m845p828j0694j2218j1969j0791r985j0252
55723H55868j1270j1948j1348r754q412q004q054q152q734j0080j1640j3127j5089
55710G20256j7407j8476j7380j5688j5355j5774j4868j2493j0689j0674j1591
55699E59861j2367j3094j4134j5293j6302j7110j7504j7429j7626j8853k0562
$$ plain form
55782 2081748 2025233 1972992 1925372 1882573 1843415 1806204 1770263 1736029 1704065 1674479 1647124
55771 1647124 1622058 1599633 1579805 1561381 1542783 1523884 1506089 1489701 1472215 1450438 1423701
55760 1423701 1393833 1362733 1331325 1300214 1269491 1238197 1205629 1173123 1143000 1115940 1090932
55749 1090932 1067535 1046273 1026927 1008696 992403 980194 972080 964886 956063 946973 940857 938708
55737 938708 938708 938899 938724 938215 937031 934450 929605 921777 911083 898865 886896 876105 866120 855868
55723 855868 844598 832650 821302 811548 803136 795132 787078 778926 770192 760112 748472 735345 720256
55710 720256 702849 684373 666993 651305 635950 620176 605308 592815 582126 571452 559861
55699 559861 547494 534400 520266 504973 488671 471561 454057 436628 419002 400149 379587
55688C79587k1454k1075j9667j6871j2241o970l206j393J8J865L087K861K183
55675B86724K286K949L400L766M437M924M502L335K009N62j099k462k977k983
55661C09373l171l560l726l649l502k919j433M67J579J343M34j92k48K6N28J391
55645B92741K518L422L698L573L684M182M409L705K181K95j840m011n071l762
55631C09724n77K155K667J667J334K822N331P211P448O231M676M100N123P128
55617C67040Q595Q116N449J856p52j400r26r99k339m166n329n432m737l558k131
55602C59287q36m5K29L41O85J420K373L082K981J768j71j727j774l61J009Q32
55586C69093o10j673j694j885l359n273o085n870o009o868p381p078o994p978
$$ plain form
55688 379587 358133 337058 317391 300520 288279 281309 278103 276710 276728 278593 281680 284541 286724
55675 286724 289010 291959 295359 299125 303562 308486 312988 316323 318332 318894 317795 315333 312356 309373
55661 309373 306202 302642 298916 295267 291765 288846 287413 287880 289459 290802 291236 291044 290796 290822 291350 292741
55645 292741 295259 298681 302379 305952 309636 313818 318227 321932 324113 324408 322568 318557 313486 309724
55631 309724 309147 311302 313969 315636 316970 319792 325123 332334 339782 346013 350689 354789 359912 367040
55617 367040 375635 383751 389200 391056 390304 388904 387978 386979 384640 380474 375145 369713 364976 361418 359287
55602 359287 358451 358406 358635 358976 359661 361081 363454 366536 369517 371285 371114 369387 367613 367252 368261 369093
55586 369093 368483 366810 365116 363231 359872 354599 348514 342644 336635 329767 322386 315308 308314 300336
55572C00336r333r880r497q766p903o876o032n665n321m411l285k882l439m192
55558B12854m515m613m928n344n386m914m251l663l176k926l232l947m067k769
55544A55123q31k7p37j214j31J162M01k089l494k280j35N39m44j571j921j684
55528A40667j198p15o18p72j72J681L443L289J372m17j087j437j957j455J088
55513A41712M368N901N038L613L478M438N123N115N307O339P492P529O195M285
55499B15933K416M05j881l776m548m543m817n604o025n522m869n088n988o570
55485A59523o469o075n416m046k300j411j772k079j135K88O84J87K16R83J208
55470A32386N85O35K213L772L533K255K161L734N224N165L888K422J334Q62J068
$$ plain form
55572 300336 291003 281123 271626 262860 254957 248081 242049 236384 231063 226652 223367 220485 217046 212854
55558 212854 208339 203726 198798 193454 188068 183154 178903 175240 172064 169138 165906 161959 157892 155123
55544 155123 154292 154265 153528 152314 152183 153345 153746 151657 148163 145883 145748 146287 145843 144272 142351 140667
55528 140667 139469 138754 138136 137364 137192 138873 142316 145605 146977 146560 145473 144036 142079 140624 141712
55513 141712 146080 151981 157019 160632 164110 168548 173671 178786 184093 190432 197924 205453 211648 215933
55499 215933 218349 218754 216873 213097 208549 204006 199189 193585 187560 182038 177169 172081 166093 159523
55485 159523 153054 146979 141563 137517 135217 133806 132034 129955 128820 129108 129792 129979 130195 131178 132386
55470 132386 132971 133606 135819 139591 143124 145379 147540 151274 156498 161663 165551 167973 169307 170169 171237
55455A71237J360Q29n31j685j954j863k286l391m764n921o425o081n335m949n087
55440A23154n184m889m397l778k834j946k094l426m580m195k632j493j659k406
55426G7641k416j289j17o02l227o340p537o089l447j313j25M05L65L2K54J337
55410D7532K051Q64j962m387m764l313j237Q24L004N105O068N004K527L49o73
55395E6992j376k579l494l007j809j579k230j948k86Q79L01o75m55K17j45r81
55379C7825o09P62J194k6j580k314k450k296j447Q0J250J256N62J67N35J541K648
55362C7098K903J678j84q45L83K046K256P89r25j451m71J316K864L442K974J874
55346E5747O04m25q68o96l40j73p6J29J42l32q52q25n28o96j245j377j007j005
$$ plain form
55455 171237 172597 173426 172895 171210 169256 167393 165107 161716 156952 151031 144606 138525 133190 128241 123154
55440 123154 117970 113081 108684 104906 102072 100126 98032 94606 90026 85831 83199 81706 80047 77641
55426 77641 75225 73936 73819 73217 69990 63650 56113 50024 46577 45264 45139 45544 45909 45941 46195 47532
55410 47532 49583 50447 48485 44098 39334 36021 34784 35608 38612 43717 49785 54789 57316 57665 56992
55395 56992 55616 53037 49543 46536 44727 43148 40918 38970 38684 39563 39864 39189 38734 38951 38806 37825
55379 37825 37216 37978 39172 39146 37566 35252 32802 30506 29059 29139 30389 31645 32207 32374 32909 34450 37098
55362 37098 40001 41679 41495 40650 41033 43079 45335 46124 45199 43748 43277 44593 47457 50899 53873 55747
55346 55747 56351 55926 55058 54362 54022 53849 53773 53902 54044 53712 52860 52035 51507 50811 49566 48189 47182 46177
55328D6177j728k194j319O00K090J928J44k076l367l337k654j832m70J693L487
55313C7142L221Q54j756k895k436j204M4Q05R04P10O52M33m61j537j663p03K55
55296C2365N35N23N43L83K01M93P48k87k283l044j555K96M13n83q59m66q23j836
55278B4764j833l01J290J660J203R09J091J520J802J450M89j13M12J237R16m19
55262C6077j311j406j734k391j864K33J719O11j900l057k213j134j028j199p04
55247A8699K47J100J813K267J862M78p98q19K82J483K280K852L127K657J510N02
55231C9542J31k8n07j068j152r00r06j151q96J50J233J476R69M64K93R8m58j281
55213C6009k163k983l358k627o91J335K022J306O38J061J721J086p06j778r68
$$ plain form
55328 46177 44449 42255 40936 41536 43626 45554 45698 43622 40255 36918 34264 32432 31962 33655 37142
55313 37142 40363 41217 39461 36566 34130 32926 32970 33775 34679 35389 36041 36474 36013 34476 32813 32110 32365
55296 32365 32900 33423 33966 34349 34550 35043 35791 35504 33221 30177 28622 28918 29331 28748 27889 27423 26600 24764
55278 24764 22931 22630 23920 25580 26783 27692 28783 30303 32105 33555 34044 33931 34343 35580 36496 36077
55262 36077 34766 33360 31626 29235 27371 27604 29323 29934 28034 24977 22764 21630 20602 19403 18699
55247 18699 18946 20046 21859 24126 25988 26466 25668 24849 25131 26614 28894 31746 34873 37530 39040 39542
55231 39542 39673 39645 39138 38070 36918 36018 35112 33961 33065 33215 34448 35924 36893 37357 37650 37748 37290 36009
55213 36009 33846 30863 27505 24878 24187 25522 27544 28850 29488 30549 32270 33356 32650 30872 29904
55198B9904P13J634J606J465J387Q83J53J3M23M32j34k17O68J380Q21l35p32l87
55180C9677n25j625k827l176k554j321L6Q49O38j83o46m12m9n5k36k28j5L28R05
55161B8581J598J980J875J639J515J176L73l55j83Q44J707J534N45k70k46K87
55145D2600M42j41q07p14r5j26j328k601k439q09Q77J564J505J269P16l13r91
55128C8609k19J699L067K755J403L87J37L5m72j275j894j945j283j28J103K111
55112D4090K731K598J353n45j842j872j339j137j128q79q52j486j668O8K885M017
55096D4994K378nj037j343k547m151m170k377r04j335k740l147j895J39J883K863
55080B6606L020K435J371L12j96J29J068J997K377K167J783J666J945K313K325
$$ plain form
55198 29904 30617 32251 33857 35322 36709 37592 37745 37758 38181 38613 38479 38262 38930 40310 41131 40796 40064 39677
55180 39677 39152 37527 34700 31524 28970 27649 27685 28534 29172 28989 28343 27931 27882 27827 27591 27363 27348 27676 28581
55161 28581 30179 32159 34034 35673 37188 38364 38737 38382 38199 39043 40750 42284 42829 42559 42313 42600
55145 42600 43042 42901 42094 41380 41285 41159 39831 37230 34791 33982 34859 36423 37928 39197 39913 39600 38609
55128 38609 38390 40089 43156 45911 47314 47701 47838 47873 47401 46126 44232 42287 41004 40876 41979 44090
55112 44090 46821 49419 50772 50227 48385 46513 45174 44037 42909 42030 41178 39692 38024 38092 40977 44994
55096 44994 47372 47367 46330 44987 42440 38289 34119 31742 30838 29503 26763 23616 21721 21860 23743 26606
55080 26606 29626 32061 33432 33744 33548 33677 34745 36742 39119 41286 43069 44735 46680 48993 51318
55065E1318J924J507J230O85k54p63k02M66k15j609j248J609M358M240J906J94
55049F5146K27O34L36Q9Q12J881J950P27p91j467j034j39M04N11P83J389J606
55032G3064Q48l25r83j103j269j545j573j396j174l79J510L626M260K952J006
55017G7519k43o88q04o82j47Q65K147L058K622O54j489k196j518p47l39L33J263
55000G9608J472P75K66M32L19o30j311o72N30Q64K72k84m92p79j188j257p94J1
54982G7142R63J638J292j46j424j190L13J558J550O58j14n5R14K196K925K838
54966I1058K450K077J294j39j407j591r53n39p24j060j207j150p15K92J488K184
54950I1358K234K006J680J290J176J577J827Q92j132k816k933j668j10R04J216
$$ plain form
55065 51318 53242 54749 55979 56664 56410 55647 55445 55911 55696 54087 52839 54448 58806 63046 64952 65146
55049 65146 65373 66007 66343 66432 67244 69125 71075 71802 71011 69544 68510 68371 68775 69286 70069 71458 73064
55032 73064 73912 73587 72604 71501 70232 68687 67114 65718 64544 64165 65675 69301 73561 76513 77519
55017 77519 77276 76588 75784 75102 74955 75820 77967 81025 83647 84301 82812 80616 79098 78351 78012 78345 79608
55000 79608 81080 81855 82121 82553 82872 82242 80931 80259 80789 81653 81925 81641 81149 80370 79182 77925 77131 77142
54982 77142 78105 79743 81035 80889 79465 78275 78588 80146 81696 82354 82240 82185 83099 85295 88220 91058
54966 91058 93508 95585 96879 96740 95333 93742 92789 92250 91526 90466 89259 88109 87394 87686 89174 91358
54950 91358 93592 95598 97278 98568 99744 101321 103148 104040 102908 100092 97159 95491 95381 96285 97501
54935I7501J059O55J2q22j324p78N87J270J02k051l070k018qJ280J196J53j031
54918I2713j487q26L32R35R51J505L140M661M518K830J259R73J645K417L009L447
54902A22022L418K567J258M23N67J379K306L031L238K605J572J560L492O350Q093
54887A63881Q121P922Q943J0768J2008J2341J2744J3926J5262J5419J3732J0856
54875C05923Q211O632N508L426l44n264j0278j4501j7116j7446j5590j2564r515
54862B27082p291o610p705r394r688q054o105n279m918l747k181j613k017j975
54848A50505q31P67K462M652P142Q818R200R040Q913Q447P694P998J0257J3096
54834B48160J4113J2604J0057P899N820K732j414n472q590j1078j3450j5236j5540
$$ plain form
54935 97501 98560 99215 99227 98405 97081 96303 96890 98160 98262 96211 93141 91123 91115 92395 93591 93744 92713
54918 92713 91226 90400 90732 91667 92618 94123 97263 101924 106442 109272 110531 111504 113149 115566 118575 122022
54902 122022 125440 128007 129265 129688 130255 131634 133940 136971 140209 142814 144386 145946 149438 155788 163881
54887 163881 172002 179924 188867 199635 211643 223984 236728 250654 265916 281335 295067 305923
54875 305923 314134 320766 326274 329700 329356 324092 313814 299313 282197 264751 249161 236597 227082
54862 227082 219791 213181 205476 196082 186394 178340 172235 166956 162038 158291 156110 154497 152480 150505
54848 150505 149674 150441 152903 157555 164697 173515 182715 191755 200668 209115 216809 224807 235064 248160
54834 248160 262273 274877 284934 292833 298653 301385 299971 294499 285909 274831 261381 246145 230605
54821B30605j4485j3214j2329j1370j0134r325r181q655o981n159m467m361l518
54808A17426k306k286l348l384j238J726L546L692K597O74j307k189j692q96p39
54793A10276j005j315j940k861l260k894k725l213l197j785j92k8o87m20O19M99
54777H5872j286k877k774j764j205q84J90J759K525K081J421J387J480P43o81
54762H5987j485p75Q65K103K316J960J629J401J122Q17N83M83P46J629K870L733
54746A05984L824L478L175L058L181L671M357M793M935N107N132M392L248L360
54732A61695N721R139J1642J2743J3293J3761J3950J4128J4985J6326J6922J5921
54720C20226J3535J0211O015J239l119o040p316p560p676q250r129r675r689r702
$$ plain form
54821 230605 216120 202906 190577 179207 169073 159748 150567 141912 134931 129772 125305 120944 117426
54808 117426 115120 112834 109486 106102 104864 106590 110136 113828 116425 117099 115792 113603 111911 111015 110276
54793 110276 109271 107956 106016 103155 99895 97001 94276 91063 87866 86081 85889 85861 85174 84754 85373 85872
54777 85872 84586 81709 78935 77171 75966 75082 75272 77031 79556 81637 83058 84445 85925 86668 85987
54762 85987 84502 83727 84592 86695 89011 90971 92600 94001 95123 95940 96523 97006 97752 99381 102251 105984
54746 105984 109808 113286 116461 119519 122700 126371 130728 135521 140456 145563 150695 155087 158335 161695
54732 161695 167416 176555 188197 200940 214233 227994 241944 256072 271057 287383 304305 320226
54720 320226 333761 343972 349987 351226 348107 342067 334751 327191 319515 311265 302136 292461 282772 273070
54706B73070r858r170o845l933k430k704l091k255o97N62J551K680L514L390K910
54691B46694L650O290R670J1948J2348J1660J1281J1954J3407J5085J6777J8232
54679C88996J8508J6481J2167O937K123k110o330j0705j4762j7904j9763k0224
54667C53414j9591j8632j8099j8044j7724j6369j4049j1688j0136r334q602p720
54655A83426p147p028o666n467l845k514j407k10M47l67k122k898j641O68K455
54640A45684L246L388L015K074Q13m16j390j655o43J227K236J147j166k672k481
54625A52407j364k68O59J531K126K168J608M83r22j660o63J710L376K608K49r63
54609A63085M80L129M476L909K916K702K898K965L450M781N774M957K975J999
$$ plain form
54706 273070 263212 254042 247197 243264 240834 238130 235039 232784 232087 232649 234200 236880 240394 243784 246694
54691 246694 250344 256634 266304 278252 290600 302260 313541 325495 338902 353987 370764 388996
54679 388996 407504 423985 436152 443089 445212 443102 436772 426067 411305 393401 373638 353414
54667 353414 333823 315191 297092 279048 261324 244955 230906 219218 209082 199748 191146 183426
54655 183426 176279 169251 162585 157118 153273 150759 149352 149142 149589 149222 147100 144202 142561 143229 145684
54640 145684 148930 152318 155333 157407 158220 157804 156414 154759 154116 155343 157579 158726 157560 154888 152407
54625 152407 151043 150775 151434 152965 155091 157259 158867 159350 158428 156768 156105 157815 161191 163799 164048 163085
54609 163085 163565 166694 171170 175079 177995 180697 183595 186560 190010 194791 200565 205522 208497 210496
54595B10496K700L518L303K932L384L772K830J225Q26K139M023N499O480O874
54581B60001O478N815N877O792P800Q585R496J0448J0883J1134J2274J4083J4489
54568C84155J1949P299K398k010o011r174j0952j1883j2951j4012j4169j3476
54556C11163j2858j2385j1178r380q492q941q754o118k288l59j370l232l572k397
54542B19839j382j704l287n339o739o370m043j130M27j84k165m090m929m437l241
54527A71226k504k884l821m339m376m594m976m693l616k852l134l587l000j664
54513A21186r44j380k160k437k174j611p21N26J824K622K436J207l02q50J0J253
54497A18485J604J025K58n89j792k557j413J428L600L290J443K29K22K81l10r00
$$ plain form
54595 210496 213196 216714 220017 222949 226333 230105 232935 234160 234986 237125 241148 246647 253127 260001
54581 260001 266479 272294 278171 284963 292763 301348 310844 321292 332175 343309 355583 369666 384155
54568 384155 396104 403403 405801 403791 397780 388606 377654 365771 352820 338808 324639 311163
54556 311163 298305 285920 274742 265362 256870 247929 239175 233057 230769 230410 229040 225808 222236 219839
54542 219839 218457 216753 213466 208127 201388 195018 190975 189845 190272 190088 187923 183833 178904 174467 171226
54527 171226 168722 165838 162017 157678 153302 148708 143732 139039 135423 132571 129437 125850 122850 121186
54513 121186 120242 118862 116702 114265 112091 110480 109759 110285 112109 114731 117167 118374 118072 117222 117232 118485
54497 118485 120089 121114 121372 120783 118991 116434 115021 116449 120049 123339 124782 125011 125233 125514 125204 124304
54481A24304o86L05J547K614L229L263K988K872L028L207L342L639M110M473M655
54466A66890M959N582O243O571O550O445O375O150N439M010J935m12k628m570
54452B19539o306p769q653q816q636q768r321r453q125n390k580q96j91M41J125
54437A36201J050j68j831l034l534l385k498j146k05j86m32QJ043J771J760J323
54421A26737P38M2m09lJ242K444K683J883P59J74M98J277J721J671J788K337K366
54404A47948R55j152k067q87J476L447M033L106J469N45R15J257r8k619l983l236
54388A51109j958j621j569p18K48l2j235j801j246m94k89o51j726l627n280m960
54372A24150k439M66J903J697P00n22j648k081j349J17J349J814J742J566J433
$$ plain form
54481 124304 123618 123923 125470 128084 131313 134576 137564 140436 143464 146671 150013 153652 157762 162235 166890
54466 166890 171849 177431 183674 190245 196795 203240 209615 215765 221204 225214 227149 226737 224109 219539
54452 219539 213233 205464 196811 187995 179359 170591 161270 151817 143692 138302 135722 134826 134635 135076 136201
54437 136201 137251 137083 135252 132218 128684 125299 122801 121655 121450 121264 120832 120840 121883 123654 125414 126737
54421 126737 127475 127517 127108 127105 128347 130791 133474 135357 136116 136290 136788 138065 139786 141457 143245 145582 147948
54404 147948 148903 147751 145684 144797 146273 149720 153753 156859 158328 158873 159788 161045 160947 158328 154345 151109
54388 151109 149151 147530 145961 145243 145491 145459 144224 142423 141177 140683 140394 139743 138017 134390 129110 124150
54372 124150 121711 122177 124080 125777 126477 125955 124307 122226 120877 120994 122343 124157 125899 127465 128898
54357A28898J274J155J364J974K359J651J1j030j34K052L505L205K177J925K546
54342A52932K855K042O70J13J290L826O315P517P338O547N751M997M315M000M082
54327B14590L851K467N1k157l012k713k598l503m691m820l758k696k541l033l670
54312A81767m441n053m578k840j289j226j842j364K27J265R06n4r20j912k826
54297A55820k697j538q22j208j178P33L429M544L482J771P56L85J92K42P87J791
54281A66489L059M258M856M578L930L697L883L544J823j071l869n202m774l608
54267A81593k826k397j716j185j945l755m639l490j768j450k393l110l265l694
54253A43960m466m731m267l650k937j819r97j682l435m253l375k324k356k515
$$ plain form
54357 128898 130172 131327 132691 134665 137024 138675 138686 137656 137522 139574 143079 146284 148461 150386 152932
54342 152932 155787 157829 158499 158612 159902 163728 170043 177560 184898 191445 197196 202193 206508 210508 214590
54327 214590 218441 220908 220959 218802 215790 213077 210479 206976 202285 197465 193707 191011 188470 185437 181767
54312 181767 177326 172273 167695 164855 163566 162340 160498 159134 159361 160626 161532 161478 160558 158646 155820
54297 155820 153123 151585 150763 149555 148377 149110 152539 157083 160565 162336 163092 163477 163669 163911 164698 166489
54281 166489 169548 173806 178662 183240 187170 190867 194750 198294 200117 199046 195177 189975 185201 181593
54267 181593 178767 176370 174654 173469 171524 167769 163130 159640 157872 156422 154029 150919 147654 143960
54253 143960 139494 134763 130496 126846 123909 122090 121093 119411 115976 111723 108348 106024 103668 101153
54239A01153j390M32J230O74%p3j67r20j779j664m05R01J055K63M0J234K578K120
54221A05282L6j280l96J212J252l59j717j561l92P52J418J520J049L10j39r8J67
54204A07056M31P04Q47N53j31o96q23p60q32p99j07J304K619K797J582k22j589
54187A11934k213k393k220j467k75O86J086J408K120K751K420R93p37j957k350
54172A09786j935q67M82J639K291K285J587N05k33j34M63Q15O70L13p4n03o48
54155A16442k0J075J539Q42j38k70K12P7j008j817j118O84K006J826M56j100j990
54138A17698j937j502j926l708n278m228n04K778K793M72r67l68M02k32j294j208
54122A00991k84J18j94l35q8j08o27j163j401j342p06Q11K550L174K165L60j100
$$ plain form
54239 101153 99763 100195 101425 102099 102099 102026 101859 100939 99160 97496 97091 97992 99047 99310 99350 100584 103162 105282
54221 105282 105318 104038 103642 104854 106106 105747 104030 102469 102077 102829 104247 105767 106816 107126 106987 106889 107056
54204 107056 107487 108191 109038 109591 109460 108764 107941 107181 106349 105550 105443 106747 109366 112163 113745 113523 111934
54187 111934 109721 107328 105108 103641 103366 104052 105138 106546 108666 111417 113837 114830 114093 112136 109786
54172 109786 107851 106984 107466 109105 111396 113681 115268 115773 115540 115406 115869 116684 117354 117667 117593 117090 116442
54155 116442 116422 117497 119036 119878 119740 119470 119682 119759 118751 116934 115816 116500 118506 120332 120788 119688 117698
54138 117698 115761 114259 112333 108625 103347 99119 98615 101393 104186 104658 103691 103323 103725 103493 102199 100991
54122 100991 100707 100825 100631 100296 100208 100100 99473 98310 96909 95567 94861 95672 98222 101396 103561 103921 102821
54105A02821j680j316j91J049J517R61q3j079j940k586k688k126j203k06P00J081
54089I3031M81n99q21L25J604J611O77L67J231K131J950J021L66P9o64k178l547
54072I7065l755k982k245j869j014Q77K751K770N44k104k969j750o7O10N50J027
54056H7439K356L322K696Q22q26j478j730k307k905k730j769p89k64R0O35J177
54040H3739J246P48J47J5M62R92J025N82K72N91J379K075K234J838J331J383K068
54023A02127K353J162r14j859p77P66P85n28j388j026l27j25j68J7L76P94J429
54006A02697K132K368J960J443J349J655J962J858J168L90N26J676K326J120r25
53991A23705j464l9J436J669J677K704M113M592M198L883L837L664L515L838M351
$$ plain form
54105 102821 101141 99825 99634 100683 102200 103161 103078 101999 100059 97473 94785 92659 91456 91250 91950 93031
54089 93031 93512 92913 92092 92417 94021 95632 96309 96676 97907 100038 101988 103009 103375 103454 102790 100612 97065
54072 97065 93310 90328 88083 86214 85200 86077 88828 91598 92142 90038 87069 85319 85252 85862 86412 87439
54056 87439 89795 93117 95813 96635 95809 94331 92601 90294 87389 84659 82890 82101 81837 81927 82562 83739
54040 83739 84985 85733 85880 85895 86357 87349 88374 88956 89228 89819 91198 93273 95507 97345 98676 100059 102127
54023 102127 104480 105642 104728 102869 102092 102858 103643 103115 101727 100701 100374 100249 100081 100098 100474 101268 102697
54006 102697 104829 107197 109157 110600 111949 113604 115566 117424 118592 118982 119508 121184 123510 124630 123705
53991 123705 122241 122202 123638 125307 126984 129688 133801 138393 142591 146474 150311 153975 157490 161328 165679
53976A65679M435M235M492N522O995Q331Q772P759N996N286O414P964Q232P426
53962B57538O710O031M617L075K798L443L022J094j90Q40K786L021J142p58r82
53947B94187q5K35p55k266l245l612m032m790n507n913o117n837m390k199j201
53932B44473k605m899n508l944j904n79L45R98N48j248l215m243m522m501l813
53917B05383k078k1J130R83K20k0J126L395N159M969L425K359K069J056j072k446
53901B25637j803o20p18j274l81J422J685k05k166k500j768r83J43K088M039M798
53885B27394M440M010L973L869L297K568K248K532L222M145N299O551P350P222
53871B88120O539O214O360N948M360K625K239L134L795L277K106J164P06P60J550
$$ plain form
53976 165679 170114 174349 178841 184363 191358 199689 208461 216220 222216 227502 233916 241880 250112 257538
53962 257538 264248 270279 274896 277971 280769 284212 287234 288328 288138 288978 291764 294785 295927 295169 294187
53947 294187 294102 294337 293582 291316 288071 284459 280427 275637 270130 264217 258100 252263 247873 245674 244473
53932 244473 241868 236969 231461 227517 225613 225034 225379 226377 226925 225677 222462 218219 213697 209196 205383
53917 205383 203305 203284 204414 205397 205617 205597 206723 210118 215277 220246 223671 226030 228099 229155 228083 225637
53901 225637 223834 223214 222496 221222 220841 222263 223948 223743 221577 219077 217309 216326 216469 218557 222596 227394
53885 227394 231834 235844 239817 243686 246983 249551 251799 254331 257553 261698 266997 273548 280898 288120
53871 288120 294659 300873 307233 313181 317541 320166 322405 325539 329334 332611 334717 335881 336587 337347 338897
53856C38897L019M463N148M980M346L692L386L609M195M879N791P253R001J0076
53842D12735R718P993N402K359o88l020m040l842l189k884l148l632m007m450
53828D05307n237n947n774m810m343n238o719p551p788q305r128r508r409r457
53814C06093r370q018n468l518l526m764n760o114o155n786m869m038m083m857
53800B29767n647o081n997n046l476k678l668n377n815m716l612l226k409l56
53786A71663J540J299q86k698k391m93J141J289Q6j529k566k433j223L43J418
53771A64560J677J383Q20k2j022j603j269l58K81L68M01P75J181J176Q10M10J39
53754A69707O6L59J063J982K892L589L764L401L305M315N799O019M564L213L489
$$ plain form
53856 338897 341916 346379 351527 356507 360853 364545 367931 371540 375735 380614 386405 393658 402659 412735
53842 412735 422453 430446 435848 438207 437519 434499 430459 426617 423428 420544 417396 413764 409757 405307
53828 405307 400070 394123 388349 383539 379196 373958 367239 359688 351900 343595 334467 324959 315550 306093
53814 306093 296723 288705 283237 279719 276193 271429 265669 259555 253400 247614 242745 238707 234624 229767
53800 229767 224120 218039 212042 206996 203520 200842 197174 191797 185982 181266 177654 174428 172019 171663
53786 171663 173203 174502 173616 170918 168527 168034 169175 170464 170550 169021 166455 164022 162799 163142 164560
53771 164560 166237 167620 168440 168418 167396 165793 164524 164166 164447 164815 165216 165991 167172 168348 169158 169568 169707
53754 169707 169773 170132 171195 173177 176069 179658 183422 186823 190128 194443 200242 206261 210825 214038 217527
53739B17527M578M929M897N868P474P853O754O092O798P243N927M032L576M284
53725B97832M212K977K310L290M616M407K648R75N30P80M60p92j990j981q94j15
53709C19265p54k507m164m835m369l027j397l79n93j724k968m018n032n696n163
53694B72639l322j489j161k194k823j739K67J073k57k186k328l68J447J033j009
53679B57583k375k040j087o43n58o03j529l661n376m697k097k16n37j764k042
53664B28358j457j304j826j896p12J262K949L517K689J049J2O43K376L589L662
53649B42911L593M290N134N004M105L707M294M920M686M031L974M481M461L450
53635C03041K576L227N169O746P058O911P121O830M798J944R83L019N814O344
$$ plain form
53739 217527 222105 227034 231931 237799 245273 253126 259880 265972 272770 280013 285940 289972 293548 297832
53725 297832 302044 305021 307331 310621 315237 319644 322292 323267 323797 324577 325037 324245 322255 320274 319380 319265
53709 319265 318511 316004 311840 307005 302636 299609 298212 297833 297240 295516 292548 288530 283498 277802 272639
53694 272639 269317 267828 266667 264473 261650 259911 260178 261251 260994 258808 256480 256112 257559 258592 257583
53679 257583 255208 253168 252081 251438 250880 250277 248748 245087 239711 235014 232917 232701 232164 230400 228358
53664 228358 226901 225597 223771 221875 221163 222425 225374 228891 231580 232629 232641 233284 235660 239249 242911
53649 242911 246504 250794 255928 260932 265037 268744 273038 277958 282644 286675 290649 295130 299591 303041
53635 303041 305617 308844 314013 320759 327817 334728 341849 348679 353477 355421 356404 359423 365237 371581
53621C71581M297J920R18Q06L40o15j202q96l4P08R16N69m9m72l60R9J90o32j963
53602C76121k641k071j055q27j356j305J35K049K809J846Rj497k081j954j718
53587C66464j721j639r71J28R82J434J957K508K225R28o2M69J859K490J991J403
53571C80445J546K353L517M562M498K775O08k8J072K142K016J508J788K806M032
53556D15640N391O562O561N229M166M907O850Q210Q379Q101P733O974O139O149
53542E06991O988P417O839O371P309R245J0531J0285R167Q305Q070Q118Q138Q127
53528F21901Q000P449O480N781N975O674O883O429O189O551O523N132L140K258
53514G05365K788L162K085K82m94L56J638J897J007J47L72J486K475K811K983
$$ plain form
53621 371581 375878 377798 378716 379522 379862 379247 378045 377149 377115 377823 378739 379308 379259 378787 378427 378526 378716 378084 376121
53602 376121 373480 371409 370354 369527 368171 366866 367001 369050 371859 373705 373714 372217 370136 368182 366464
53587 366464 364743 363104 362133 362261 363243 364677 366634 369142 371367 372295 372233 372702 374561 377051 379042 380445
53571 380445 381991 384344 387861 392423 396921 399696 400304 400276 401348 403490 405506 407014 408802 411608 415640
53556 415640 421031 427593 434154 439383 443549 448456 455306 463516 471895 479996 487729 494703 500842 506991
53542 506991 513979 521396 528235 534606 541915 551160 561691 571976 581143 589448 597518 605636 613774 621901
53528 621901 629901 637350 643830 649611 655586 662260 669143 675572 681761 688312 694835 699967 703107 705365
53514 705365 708153 711315 713400 713682 713188 713544 715182 717079 718086 718233 718605 720091 722566 725377 728360
53499G28360L546M133L837K463Q94J12K24O05P46P22Q87J352J910K333K588K774
53483G57486L065L693M721N584N491M623M402N798P740Q331P507P225Q612J0301
53469H44579J0414R170Q405R141J0847J2670J4237J5334J5934J6683J8396K0840
53457A006650K2788K3633K4252K5804K8225L0370L1366L1402L1253L1461L2028
53446A319232L2829L3957L5492L7146L8660M0464M3242M6556M8781M8943M8037
53435A773339M7782M8546M9389M9703M9899N0432N1137N1653N1795N1408N0387
53424B325470M8901M7278M5740M4728M5009M6657M8274M8241M6695M5217M4505
53413B836715M3539M1285L8227L5626L4035L3041L1849K9741K6544K3044K0275
$$ plain form
53499 728360 731906 736039 739876 742339 743233 743345 743569 744174 744920 745642 746529 747881 749791 752124 754712 757486
53483 757486 760551 764244 768965 774549 780040 784663 789065 794863 802603 810934 818441 825666 834278 844579
53469 844579 854993 864163 872568 881709 892556 905226 919463 934797 950731 967414 985810 1006650
53457 1006650 1029438 1053071 1077323 1103127 1131352 1161722 1193088 1224490 1255743 1287204 1319232
53446 1319232 1352061 1386018 1421510 1458656 1497316 1537780 1581022 1627578 1676359 1725302 1773339
53435 1773339 1821121 1869667 1919056 1968759 2018658 2069090 2120227 2171880 2223675 2275083 2325470
53424 2325470 2374371 2421649 2467389 2512117 2557126 2603783 2652057 2700298 2746993 2792210 2836715
53413 2836715 2880254 2921539 2959766 2995392 3029427 3062468 3094317 3124058 3150602 3173646 3193921
53402C193921J8186J5682J2298Q887O271M070J524j373m350p776j2076j6677k0433
53389C198154k2903k4544k5917k7426k9511l2293l5194l7622l9760m2010m3848
53378B837126m4292m3480m2727m2748m2815m2076m0832l9747l8530l6363l3377
53367B390139l0698k8881k7190k4713k1559j8460j5665j2920j0182p681n238k295
53355B184657J227M660P483R894J2299J4786J7486K0820K4853K8970L2695L6226
53343B396056L9575M2087M3766M6143N0321N4824N7202N7670N9069O2892O7323
53332B976928P0098P1427P2908P5071P7638Q0900Q5028Q8791R0844R1961R4179
53321C875773R7785J00863J02005J01890J01679J01209R9736R7441R5261R3553
$$ plain form
53402 3193921 3212107 3227789 3240087 3248974 3255245 3259315 3260839 3259466 3255116 3247340 3235264 3218587 3198154
53389 3198154 3175251 3150707 3124790 3097364 3067853 3035560 3000366 2962744 2922984 2880974 2837126
53378 2837126 2792834 2749354 2706627 2663879 2621064 2578988 2538156 2498409 2459879 2423516 2390139
53367 2390139 2359441 2330560 2303370 2278657 2257098 2238638 2222973 2210053 2199871 2192190 2186952 2184657
53355 2184657 2185884 2190544 2198027 2207921 2220220 2235006 2252492 2273312 2298165 2327135 2359830 2396056
53343 2396056 2435631 2477718 2521484 2567627 2617948 2672772 2729974 2787644 2846713 2909605 2976928
53332 2976928 3047026 3118453 3191361 3266432 3344070 3424970 3509998 3598789 3689633 3781594 3875773
53321 3875773 3973558 4074421 4176426 4278316 4379995 4481204 4580940 4678381 4773642 4867195
53311D867195R1564Q8221Q3192P7248P1588O6504O1073N4521M7513M1187L5318
53300E585124K8584K0701J2965O205n31q355j6671k3979l0019l6021m2920n0301
53288E444782n7134o2975o8341p4284q1464q9178r5404r8449r8533r7437r6701
53277D524882r6593r6659r6499r5931r4996r3972r2894r1024q7533q2933p9055
53266C516793p7136p6504p5636p3829p1161o7551o2930n7975n3532m9459m5133
53255B805947m0915l7860l5910l3889l1577l0060k9271k7057k2222j6896j3865
53244B486425j2574j0238o370l435k764k467m84K601N318P906J1224J4406J5963
53231B505511J6570J8503K2242K5537K6432K5772K5981K8309L2006L5538L7895
$$ plain form
53311 4867195 4958759 5046980 5130172 5207420 5279008 5345512 5406585 5461106 5508619 5549806 5585124
53300 5585124 5613708 5634409 5647374 5653579 5653048 5644693 5628022 5604043 5574024 5538003 5495083 5444782
53288 5444782 5387648 5324673 5256332 5182048 5100584 5011406 4916002 4817553 4719020 4621583 4524882
53277 4524882 4428289 4331630 4235131 4139200 4044204 3950232 3857338 3766314 3678781 3595848 3516793
53266 3516793 3439657 3363153 3287517 3213688 3142527 3074976 3012046 2954071 2900539 2851080 2805947
53255 2805947 2765032 2727172 2691262 2657373 2625796 2595736 2566465 2539408 2517186 2500290 2486425
53244 2486425 2473851 2463613 2457243 2453808 2451044 2448577 2448093 2450694 2456012 2463918 2475142 2489548 2505511
53231 2505511 2522081 2540584 2562826 2588363 2614795 2640567 2666548 2694857 2726863 2762401 2800296
53220B800296L9027L9612M0352M1236M1508M0462L8244L5856L4331L3808L3464
53209C218196L2446L0684K8369K5080K0328J4903J0529P745N310K286n76k478
53197C392822m357p450j1092j3749j5725j8848k3582k8464l2667l7124m2338m6887
53185C110539m9258m9894n0234n0791n1329n2135n3690n5494n6242n5153n2511
53174B533808m9265m6653m5639m5955m6140m5217m3769m2646m1456l9444l7254
53163B050370l6287l6527l6512l5593l4700l4415l3737l1716k9206k7781k7574
53152A686322k7318k6254k4920k3993k3396k2724k2009k1655k1998k3088k4524
53141A424443k5481k5266k4094k2936k2522k2808k3473k4398k5362k5813k5427
$$ plain form
53220 2800296 2839323 2878935 2919287 2960523 3002031 3042493 3080737 3116593 3150924 3184732 3218196
53209 3218196 3250642 3281326 3309695 3334775 3355103 3370006 3380535 3388280 3393590 3395876 3395300 3392822
53197 3392822 3388465 3381015 3369923 3356174 3340449 3321601 3298019 3269555 3236888 3199764 3157426 3110539
53185 3110539 3061281 3011387 2961153 2910362 2859033 2806898 2753208 2697714 2641472 2586319 2533808
53174 2533808 2484543 2437890 2392251 2346296 2300156 2254939 2211170 2168524 2127068 2087624 2050370
53163 2050370 2014083 1977556 1941044 1905451 1870751 1836336 1802599 1770883 1741677 1713896 1686322
53152 1686322 1659004 1632750 1607830 1583837 1560441 1537717 1515708 1494053 1472055 1448967 1424443
53141 1424443 1398962 1373696 1349602 1326666 1304144 1281336 1257863 1233465 1208103 1182290 1156863
53130A156863k4505k3452k2281k1159k0852k1876k3430k4212k4113k4076k4218
53119I02689k3400k1174j9011j8638j9840k0929k0872j9956j8590j6685j4403
53108F89191j2610j2040j2372j2606j2218j1685j1801j2585j3106j2614j1637
53097E53917j1304j1704j1706j0630r156q098p292o509o474p723r090q784o801
53084D38646m918m381m769n224n445n208m203k830k145k489l000l007k897l086
53070C85044l112k512j925k357l778n089n261m099k274r30p75j244j116k71j4
53055C50287j183k782l296k697k202k406k674k270j275k74L88P61J038J117N69
53040C33101p63k175k745k498k189j854o20J629L586M257M205M180L598J768k98
$$ plain form
53130 1156863 1132358 1108906 1086625 1065466 1044614 1022738 999308 975096 950983 926907 902689
53119 902689 879289 858115 839104 820466 800626 779697 758825 738869 720279 703594 689191
53108 689191 676581 664541 652169 639563 627345 615660 603859 591274 578168 565554 553917
53097 553917 542613 530909 519203 508573 499417 491319 484027 477518 471044 463321 454231 445447 438646
53084 438646 433728 429347 424578 419354 413909 408701 404498 401668 399523 397034 394034 391027 388130 385044
53070 385044 381932 379420 377495 375138 371360 366271 361010 356911 354637 353707 352932 351688 350572 350301 350287
53055 350287 349104 346322 343026 340329 338127 335721 333047 330777 329502 329228 329616 330377 331415 332532 333101
53040 333101 332338 330163 327418 324920 322731 320877 320257 321886 325472 329729 333934 338114 341712 343480 343182
53025C43182r62l49J21J91R37K247K170l80l773n561n237m092l186k607k280k406
53009C18015l002l697m119m137l776l188k716k763l492m569n162m570l134k244
52995B67446k796l925l984k677j302p64n02K19J048J261R54N78j5j069j961j849
52979B50662j142j144k188k999k336n45Q66P05j114l691n618n666l641n61K089
52964B23677L384L251K120M96j218k650l443l506l217l081k977k178m52J257J806
52949B13269J230N31L60O12J033J263M94j512l108k105Q66K250J13k858k856k37
52933B09345J274J41j104m1K197L046K049O49j53k41M61J602J994J146N61J796
52917B24722L799M084K266N03J97L16m72j622j742n36J166K505K921K209J009
$$ plain form
53025 343182 342220 341871 341992 342183 343120 345367 347537 347157 343384 337823 332586 328494 325308 322701 320421 318015
53009 318015 315013 311316 307197 303060 299284 296096 293380 290617 287125 282556 277394 272824 269690 267446
52995 267446 264650 260725 256741 254064 252762 251998 251496 251715 252763 254024 254978 255556 255541 254472 252511 250662
52979 250662 249520 248376 246188 243189 240853 240308 241174 241879 240765 237074 231456 225790 222149 221588 223677
52964 223677 227061 230312 232432 232928 231710 229060 225617 222111 218894 215813 212836 210658 210206 211463 213269
52949 213269 214499 215030 215390 216002 217035 218298 218792 217280 214172 212067 212933 215183 215296 212438 209582 209345
52933 209345 210619 210760 209656 209615 211812 214858 216907 217556 217403 217162 217623 219225 221219 222365 222926 224722
52917 224722 228521 232605 234871 235374 235571 235887 235415 233793 232051 231515 232681 235186 238107 240316 241325
52902B41325O07J546K939L598L277K358J286Q42K005M493O216N319K507K94J63
52887B78775J469K964M260N459O167N801M611L842M457N814O118M566K542K042
52873C38887L097L745K555K08j726k498k275j591j323k229l681l854k085j49j49
52858C26932j851l403l883l793l521k924k324k434l189l713l485k537p59J623
52844B90739L085K104m03j595l01J479J450l9j067q77k03L57Q44J245J419J544
52828B99781J664J104o15k411k388j83K326L059J885L38l12j58nj99l58j7P91
52811C04302J675K235K041P34j345k875k701j308l01k23J32J707L454L575J922
52796C13024O9o88m44J23N82O36J15n66p45n50q45j742k062r64O83J470J417J681
$$ plain form
52902 241325 241932 243478 246417 250015 253292 255650 256936 257778 259783 264276 270492 275811 278318 278612 278775
52887 278775 280244 283208 287468 292927 299094 304895 309506 313348 317805 323619 329737 334303 336845 338887
52873 338887 341984 345729 348284 348492 346766 344268 341993 340402 339079 336850 333169 329315 327230 327081 326932
52858 326932 325081 321678 317795 314002 310481 307557 305233 302799 299610 295897 292412 289875 289116 290739
52844 290739 293824 295928 295525 293930 293629 295108 296558 296519 295452 294575 294372 294729 295573 296818 298237 299781
52828 299781 301445 302549 301934 299523 297135 296952 299278 302337 304222 304560 304248 304090 304085 303886 303528 303511 304302
52811 304302 305977 308212 310253 310987 309642 306767 304066 302758 302457 302234 302366 304073 307527 311102 313024
52796 313024 313093 312405 311961 312084 312666 313302 313417 312851 312106 311556 310711 308969 306907 305943 306626 308096 309513 311194
52778C11194K648L468L559L322L103K534J476O63O55Q79O22L04Q41K087K909K686
52762C42950J747N31o95j262m71J191K127J519L65Q7O36O70p52l047m625m381
52746C36590k889k041l030m883n661m846l681l175l128l212l734m664n193m998
52732B81455m848n171n185m381l637l769m092l797l586m323m961l766j130O96
52718B29505N72o32j934l230m258m274l316k377j928j563j299j825l018l592k799
52703A94032j258K49J513J959N35k567n333o105n417m731m372l700k566j461p28
52688A60050n40j174k338k770j498N93J395r1k598l984l478k341k315l499m145
52673A31267k848l87J219J099J00o86q95n85j06l02j563k726k148n8J591J724
$$ plain form
52778 311194 313842 317310 320869 324191 327294 329828 331304 331967 332622 333501 334123 334427 335268 337355 340264 342950
52762 342950 344697 345228 344533 343271 342800 343991 346118 347637 348002 348089 348725 349395 348643 345596 340971 336590
52746 336590 333701 331660 328630 323747 318086 313240 309559 306384 303256 300044 296310 291646 286453 281455
52732 281455 276607 271436 266251 261870 258233 254464 250372 246575 242989 238666 233705 229939 228809 229505
52718 229505 230077 229445 227511 224281 220023 215749 212433 210056 208128 206565 205266 203441 200423 196831 194032
52703 194032 192774 193023 194536 196495 197030 194463 189130 183025 177608 172877 168505 164805 162239 160778 160050
52688 160050 159510 158336 155998 153228 151730 152323 153718 153627 151029 147045 143567 141226 138911 135412 131267
52673 131267 128419 128032 129251 130350 130450 129764 128869 128284 128178 127876 126313 123587 121439 121381 122972 124696
52657A24696J125N84j39r13p23M87J119K48q84r42n76j004j764j647q13l82n67
52640A17905p32o41m13J35R09J150P32Q33J977K743K007J198K169L991M287K980
52624A41230J998J707P06q41p65J359K914K019K34q3Q96J578J780K422L445L925
52608A64524L822L926M252L905K506P43o25j494k060k419k606k750l046l660m470
52593A60548m912m428l252k222j732j388q82n70p19q93o35l00n62j318j710j264
52577A33761m12J68L92N86P42M60j64j61J091K482K046m94l080l768k860j818
52561A28971j071k04N08M06o1K20J025R62j57o54N77K399L046K359J465R48M46
52544A41185k78o70N3J861L435L031M04k443l219j828J7J338K632L981M180K542
$$ plain form
52657 124696 125821 126405 126266 125353 124630 125117 126236 126484 125600 124658 124082 123078 121314 119667 118854 118472 117905
52640 117905 117173 116532 116119 116254 117163 118313 119045 119878 121855 124598 126605 127803 129972 133963 138250 141230
52624 141230 143228 144935 145641 144800 144035 145394 148308 150327 150561 150478 151374 152952 154732 157154 160599 164524
52608 164524 168346 172272 176524 180429 182935 183678 183053 181559 179499 177080 174474 171724 168678 165018 160548
52593 160548 155636 151208 147956 145734 144002 142614 141732 141162 140443 139550 138915 138615 138053 136735 135025 133761
52577 133761 133349 133517 133909 134495 135237 135697 135533 135372 136463 138945 140991 140497 137417 133649 130789 128971
52561 128971 127900 127696 128204 128610 128549 128769 129794 130756 130599 129945 130522 132921 135967 138326 139791 140739 141185
52544 141185 140907 140237 140290 142151 145586 148617 149021 146578 143359 141531 141548 142886 145518 149499 153679 156221
52528A56221L10q23o95k55N8M53Q32P03J2o26o14P6R15J394J663K335L301L355
52510A68615J915N16J084L112M202L502K509K161J407k27r61O12K877L266J854
52495A96444Q60J312K159K280J705R93Q22J906L968N286M545K700J575J235M35
52480B28225q23j179l70J97k92r92r43l08M68J313J860J470M44k3M52R27Q32Q21
52462B32079J394J936J941J976K541L058K886K327J660L13j872l504l288k100
52448B41347j927l040l815l238k095j353q26j28K16l56j124p86O09J450O22r10
52432B24646j232N3J329J043l58j187o86L69J099J538J989K231K036J948K653
52417B37471L784M053K693M23j238j345j93J102J555J040K15j83J15R42J978K803
$$ plain form
52528 156221 156531 155708 155013 154758 154816 155269 156101 156804 156816 156190 155576 155652 156567 157961 159624 161959 165260 168615
52510 168615 170530 171046 172130 175242 179444 182946 185455 187616 189023 188796 187835 188447 191324 194590 196444
52495 196444 197304 198616 200775 203055 204760 205753 206575 208481 212449 217735 222280 224980 226555 227790 228225
52480 228225 227402 226223 225853 226050 225758 224766 223823 223515 223983 225296 227156 228626 229070 229047 229499 230426 231258 232079
52462 232079 233473 235409 237350 239326 241867 244925 247811 250138 251798 252111 250239 246735 243447 241347
52448 241347 239420 236380 232565 229327 227232 225879 225053 224925 225141 224785 223661 222875 223484 224934 225556 224646
52432 224646 223414 223467 224796 225839 225481 224294 223608 223977 225076 226614 228603 230834 232870 234818 237471
52417 237471 241255 245308 248001 248424 247186 245841 245648 246750 248305 249345 249560 249377 249492 250434 252412 255215
52401B55215K977K339J238K23m38q03q84n75jL40J38k14l8O07P91Pq23l48J256
52382B61007K221J424j08o37K3N60K16m16o60p74j217j692j564p92O3N17M22j45
52364B58448q53j093m63P86J935K405K103J334N61R9k9J22O64J556K168J772O66
52347B72181J67J009K293K614J908J355J542J579L63j736l127k726j063M74J226
52332B78059J652K220K436J512k66j598j767j374j049k49J727L996M543K701J23
52317B92666j035k85J422L216M800N764N515M141K641J961K187K831L477L840
$$ plain form
52401 255215 258192 260531 261769 261992 261554 260751 259867 259292 259291 259631 259769 259555 259517 260124 260915 260922 260099 259751 261007
52382 261007 263228 264652 264544 263907 263930 264490 264706 264290 263630 262856 261639 259947 258383 257591 257654 258171 258593 258448
52364 258448 257595 256502 256039 256825 258760 261165 263268 264602 265163 265262 265233 265355 266019 267575 269743 271515 272181
52347 272181 272348 273357 275650 278264 280172 281527 283069 284648 285011 283275 280148 277422 276359 276833 278059
52332 278059 279711 281931 284367 285879 285613 284015 282248 280874 279825 279576 281303 285299 289842 292543 292666
52317 292666 291631 291346 292768 295984 300784 306548 312063 316204 318845 320806 322993 325824 329301 333141
$$ [...]
##END NTUPLES=NMR SPECTRUM
##END=
