##TITLE=coffee_type TOSA02-ROVE100B_80-20%
COFFEE_meoh_noesyp64 COFFEE_meoh {C:\Bruker\TOPSPIN} Administrator 7
##JCAMPDX= 6.0         $$ Bruker NMR JCAMP-DX V2.0
##DATA TYPE= NMR SPECTRUM
##DATA CLASS= NTUPLES
##ORIGIN= Bruker BioSpin GmbH
##OWNER= Administrator
$$ 1.72 TOPSPIN		Version 2.1
$$ 2012-05-18 15:44:39.057 -0700  Administrator@X
$$ Compression mode = diff/dup
##.OBSERVE FREQUENCY= 400.13188235
##.OBSERVE NUCLEUS= ^1H
##.ACQUISITION MODE= SIMULTANEOUS (DQD)
##.ACQUISITION SCHEME= undefined
##.AVERAGES= 64
##.DIGITISER RES= 22
##SPECTROMETER/DATA SYSTEM= spect
##.PULSE SEQUENCE= noesygpps1d.comp
##.SOLVENT NAME= COFFEE_meoh
##.SHIFT REFERENCE= INTERNAL, COFFEE_meoh, 1, 14.98061
##AUDIT TRAIL= $$ (NUMBER, WHEN, WHO, WHERE, PROCESS, VERSION, WHAT)
$$ ##TITLE= Audit trail, TOPSPIN		Version 2.1
$$ ##JCAMPDX= 5.01
$$ ##ORIGIN= Bruker BioSpin GmbH
$$ ##OWNER= Administrator
$$ $$ C:\Bruker\TOPSPIN/data/Administrator/nmr/12-COFFEE-2302/82/pdata/1/auditp.txt
$$ ##AUDIT TRAIL=  $$ (NUMBER, WHEN, WHO, WHERE, PROCESS, VERSION, WHAT)
(   1,<2012-02-23 21:35:56.094 -0500>,<Administrator>,<TOPSPIN>,<go>,<TOPSPIN 2.1>,
      <created by zg
	started at 2012-02-23 21:24:25.562 -0500,
	POWCHK enabled, PULCHK disabled,
       configuration hash MD5:
       B0 76 FB 9C 50 81 44 7D 18 B3 26 32 4E 60 AD 96
       data hash MD5: 64K
       D3 9A D8 F3 47 53 70 04 84 4A E5 EA 54 F2 DE B2>)
(   2,<2012-02-23 21:35:58.844 -0500>,<Administrator>,<TOPSPIN>,<proc1d>,<TOPSPIN 2.1>,
      <Start of raw data processing
       efp LB = 0.3 FT_mod = 6 PKNL = 1 PHC0 = 0 PHC1 = 0 SI = 128K 
       data hash MD5: 128K
       30 26 3B 69 2E 4A B2 3E 0B 29 F9 EE 1E 01 D2 5B>)
(   3,<2012-02-23 21:36:00.156 -0500>,<Administrator>,<TOPSPIN>,<proc1d>,<TOPSPIN 2.1>,
      <pk PHC0 = 25.48279 PHC1 = 0 
       data hash MD5: 128K
       5A 84 07 3B B9 A2 ED CF 50 E0 98 78 FE 47 E5 9B>)
(   4,<2012-02-23 21:36:00.422 -0500>,<Administrator>,<TOPSPIN>,<proc1d>,<TOPSPIN 2.1>,
      <abs ABSG = 1 
       data hash MD5: 128K
       E3 A8 DB CD 85 11 7B AE DE C7 9D 15 C0 B4 71 6A>)
(   5,<2012-02-23 21:36:00.500 -0500>,<Administrator>,<TOPSPIN>,<proc1d>,<TOPSPIN 2.1>,
      <abs ABSG = 2 
       data hash MD5: 128K
       15 F2 FA 62 AC A3 5D 00 16 22 7C EB 46 E1 95 49>)
(   6,<2012-02-23 21:36:00.547 -0500>,<Administrator>,<TOPSPIN>,<proc1d>,<TOPSPIN 2.1>,
      <abs ABSG = 3 
       data hash MD5: 128K
       BA 93 2A E0 B6 C4 DD 60 D1 0D 2F 16 5C 94 A3 F1>)
(   7,<2012-02-23 21:36:00.625 -0500>,<Administrator>,<TOPSPIN>,<proc1d>,<TOPSPIN 2.1>,
      <abs ABSG = 4 
       data hash MD5: 128K
       25 46 3A 4F D2 66 22 D8 46 A4 BD 12 B9 DC 9B 1C>)
(   8,<2012-02-23 21:36:00.687 -0500>,<Administrator>,<TOPSPIN>,<proc1d>,<TOPSPIN 2.1>,
      <abs ABSG = 5 
       data hash MD5: 128K
       0D DC BB DA 5F B4 34 85 2A 35 25 AF 3E A8 C1 93>)
(   9,<2012-02-23 21:36:01.016 -0500>,<Administrator>,<TOPSPIN>,<audit>,<TOPSPIN 2.1>,
      <user comment:
       ICON-NMR User ID: Administrator
$$ [...]
150 150 150 150 150 150 150 150
##$TP07= 0
##$TPNAME0= <>
##$TPNAME1= <>
##$TPNAME2= <>
##$TPNAME3= <>
##$TPNAME4= <>
##$TPNAME5= <>
##$TPNAME6= <>
##$TPNAME7= <>
##$TPOAL= (0..7)
0.5 0.5 0.5 0.5 0.5 0.5 0.5 0.5
##$TPOFFS= (0..7)
0 0 0 0 0 0 0 0
##$TUNHIN= 0
##$TUNHOUT= 0
##$TUNXOUT= 0
##$USERA1= <user>
##$USERA2= <user>
##$USERA3= <user>
##$USERA4= <user>
##$USERA5= <user>
##$V9= 5
##$VALIST= <valist>
##$VCLIST= <CCCCCCCCCCCCCCC>
##$VD= 0
##$VDLIST= <DDDDDDDDDDDDDDD>
##$VPLIST= <PPPPPPPPPPPPPPP>
##$VTLIST= <TTTTTTTTTTTTTTT>
##$WBST= 1024
##$WBSW= 4
##$XGAIN= (0..3)
0 0 0 0
##$XL= 0
##$YL= 0
##$YMAX_a= 14241149
##$YMIN_a= -7719725
##$ZGOPTNS= <>
##$ZL1= 120
##$ZL2= 120
##$ZL3= 120
##$ZL4= 120
##$ABSF1= 14.98061
##$ABSF2= -5.57192
##$ABSG= 5
##$ABSL= 3
##$ALPHA= 0
##$AQORDER= 0
##$ASSFAC= 0
##$ASSFACI= 0
##$ASSFACX= 0
##$ASSWID= 0
##$AUNMP= <proc_prof1d_extract>
##$AXLEFT= 0
##$AXNAME= <>
##$AXNUC= <1H>
##$AXRIGHT= 0
##$AXTYPE= 0
##$AXUNIT= <>
##$AZFE= 0.1
##$AZFW= 0.1
##$BCFW= 0
##$BC_mod= 0
##$BYTORDP= 0
##$COROFFS= 0
##$CY= 15
##$DATMOD= 1
##$DC= 0
##$DFILT= <>
##$DTYPP= 0
##$F1P= 0
##$F2P= 0
##$FCOR= 0.5
##$FTSIZE= 131072
##$FT_mod= 6
##$GAMMA= 0
##$GB= 0
##$INTBC= 1
##$INTSCL= 1
##$ISEN= 128
##$LB= 0.3
##$LEV0= 0
##$LPBIN= 0
##$MAXI= 10000
##$MC2= 0
##$MEAN= 0
##$ME_mod= 0
##$MI= 0
##$NCOEF= 0
##$NC_proc= -3
##$NLEV= 6
##$NOISF1= 0
##$NOISF2= 0
##$NSP= 0
##$NTH_PI= 0
##$NZP= 0
##$OFFSET= 14.98061
##$PC= 1
##$PHC0= 25.48279
##$PHC1= 0
##$PH_mod= 1
##$PKNL= yes
##$PPARMOD= 0
##$PPDIAG= 0
##$PPIPTYP= 0
##$PPMPNUM= 2147483647
##$PPRESOL= 1
##$PSCAL= 4
##$PSIGN= 0
##$PYNMP= <proc.py>
##$REVERSE= no
##$SF= 400.13
##$SI= 131072
##$SIGF1= 0
##$SIGF2= 0
##$SINO= 400
##$SIOLD= 131072
##$SPECTYP= <>
##$SREGLST= <1H.CDCl3>
##$SSB= 0
##$STSI= 131072
##$STSR= 0
##$SW_p= 8223.68421052632
##$SYMM= 0
##$S_DEV= 0
##$TDeff= 65536
##$TDoff= 0
##$TI= <>
##$TILT= no
##$TM1= 0
##$TM2= 0
##$TOPLEV= 0
##$USERP1= <user>
##$USERP2= <user>
##$USERP3= <user>
##$USERP4= <user>
##$USERP5= <user>
##$WDW= 1
##$XDIM= 131072
##$YMAX_p= 523214754
##$YMIN_p= -252932737
##$CURPLOT= <Network HP LaserJet P1505>
##$CURPRIN= <$Network HP LaserJet P1505>
##$DFORMAT= <normdp>
##$LAYOUT= <+/1D_H.xwp>
##$LFORMAT= <normlp>
##$PFORMAT= <normpl>
##$SURQMSG= 1
$$ End of Bruker specific parameters
$$ ---------------------------------
##NTUPLES= NMR SPECTRUM
##VAR_NAME=  FREQUENCY,     SPECTRUM/REAL,   SPECTRUM/IMAG
##SYMBOL=    X,             R,               I
##VAR_TYPE=  INDEPENDENT,   DEPENDENT,       DEPENDENT
##VAR_FORM=  AFFN,          ASDF,            ASDF
##VAR_DIM=   131072,        131072,          131072
##UNITS=     HZ,            ARBITRARY UNITS, ARBITRARY UNITS
##FACTOR=    0.0627417313425165, 1,          1
##FIRST=     8223.62146879498, 3431,         -109510
##LAST=      0,             5855,            -109735
##MIN=       0,             -252932737,      0
##MAX=       8223.62146879498, 523214754,    0
$$ Real data points
##PAGE= N=1
##DATA TABLE= (X++(R..R)), XYDATA
$$ [...]
60805A900848n8370n4511n1333m8239m4505m1863m2213m3701m2790l9344l6128
60794A397851l4006l1499k8487k6501k5435k3543k0852j9177j8663j7437j4965
60783A137286j2849j1965j1474j0913j0645j0171q488o293n451o096o557o100
60771A030284n563n256m584l730l530l537k325K85L158N749Q082R307Q438O392
60757A043170N038M540L763K957L539N478P264Q409R425R592P511M060K023K233
60743A119002K663K017J614K615L803L515K087Q53J6j259l359n688p117o744n018
60728A109000m026n616r044j1547j1423r597q111q023q885r534r307q891r429
60715I95567j0521j0199p698m850l509l015j892n99m63r69o41J34l02j734k024
$$ plain form
60805 1900848 1842478 1787967 1736634 1688395 1643890 1602027 1559814 1516113 1473323 1433979 1397851
60794 1397851 1363845 1332346 1303859 1277358 1251923 1228380 1207528 1188351 1169688 1152251 1137286
60783 1137286 1124437 1112472 1100998 1090085 1079440 1069269 1060781 1054488 1049037 1042941 1036384 1030284
60771 1030284 1024721 1019465 1014881 1011151 1007621 1004084 1001759 1002044 1005202 1010951 1019033 1028340 1036778 1043170
60757 1043170 1048208 1052748 1056511 1059468 1063007 1068485 1075749 1084158 1093583 1103175 1110686 1114746 1116769 1119002
60743 1119002 1121665 1123682 1125296 1127911 1131714 1135229 1137316 1138169 1138185 1136926 1133567 1127879 1120762 1114018 1109000
60728 1109000 1104974 1099358 1090314 1078767 1067344 1057747 1049636 1041613 1032728 1023194 1013887 1004996 995567
60715 995567 985046 974847 967149 962299 958790 955775 953883 953284 952821 951852 951211 951345 951043 949309 947285
60700I47285k47K266M028M730M547M092M819P476J0361J1123J0094R702J0780
60687A031056J1826J1883J1640J1390J0314Q290O280M423J811j380l639m685o153
60674A093056q991j2060j4125j5435j6475j6872j6578j6622j7603j8563j8252
60663I21480j6710j5085j4585j5677j7369j7611j5556j3025j2137j2018j0021
60652G61686o119l500m158o275o916n590l982l598m689o432p478p161o377o237
60638F83174o130m730k595j653k035j860o60l63j784k656q64K202L450K043j21
60623F65418r88P2K487M935N993N335M125L670M220N335O707Q080R123R816J0422
60608G44750J0891J0937J0749J0815J1073J1056J0796J0667J0581J0489J1275
$$ plain form
60700 947285 947038 949304 953332 958062 962609 966701 971520 978996 989357 1000480 1010574 1020276 1031056
60687 1031056 1042882 1054765 1066405 1077795 1088109 1096399 1102679 1107102 1108913 1107533 1103894 1099209 1093056
60674 1093056 1084065 1072005 1057880 1042445 1025970 1009098 992520 975898 958295 939732 921480
60663 921480 904770 889685 875100 859423 842054 824443 808887 795862 783725 771707 761686
60652 761686 755567 752067 747909 741634 734718 729128 725146 721548 716859 710427 702949 695788 689411 683174
60638 683174 677044 672314 669719 668066 666031 664171 663511 663148 661364 658708 657844 660046 663496 665539 665418
60623 665418 664430 664502 666989 671924 677917 683252 687377 691047 695267 700602 707309 715389 724512 734328 744750
60608 744750 755641 766578 777327 788142 799215 810271 821067 831734 842315 852804 864079
60597H64079J3736J6783J8211J7241J5080J3173J2373J3360J5966J8180J7896
60586A036078J5772J4376J4362J3713J1093P643M711J941j434n059q126j0132
60574A094938j0527r206p619p613q882r505r130r193r660q463n164k317j742j935
60560I93982r64M71Q98R32J997L624M218L563K761K527K958M107N499O010N343
60545A037926M788N609P817J1128J5564K0179K3023K3621K3901K5374K7112K7942
60533A253984K8753L0707L2560L1890K8093K2519J6527J0838N884J337l877r823
60521A449392j4849j7720j9302k0910k2321k2824k2870k3136k3062k1866j9969
60510A220563j8094j6072j3839j2270j1637j0727q976p820q115p980n442j769
$$ plain form
60597 864079 877815 894598 912809 930050 945130 958303 970676 984036 1000002 1018182 1036078
60586 1036078 1051850 1066226 1080588 1094301 1105394 1113037 1117748 1119689 1118255 1113196 1105070 1094938
60574 1094938 1084411 1075205 1067586 1059973 1051091 1041586 1032456 1023263 1013603 1005140 999976 997659 995917 993982
60560 993982 993018 993489 994387 995319 997316 1000940 1005158 1008721 1011482 1014009 1016967 1021074 1026573 1032583 1037926
60545 1037926 1042714 1048323 1056140 1067268 1082832 1103011 1126034 1149655 1173556 1198930 1226042 1253984
60533 1253984 1282737 1313444 1346004 1377894 1405987 1428506 1445033 1455871 1461755 1463092 1459215 1449392
60521 1449392 1434543 1416823 1397521 1376611 1354290 1331466 1308596 1285460 1262398 1240532 1220563
60510 1220563 1202469 1186397 1172558 1160288 1148651 1137924 1128948 1121128 1113013 1105033 1099591 1097822
60498A097822K41J60l34n92j208j743q94J144K783L470M174N408O611P352P701
60483A132095P603P320P954J0062J2288J3004J2689J3060J4565J6387J8238K0244
60471A285509K1896K3072K5364L0019L5370L8842M1029M4907N1134N7146O1417
60460A715705O5705P2110Q0358Q9304R9086J10233J22178J34058J45887J57852
60450B792476J69117J77963J82383J80199J69879J51966J28948J03237P6000M8102
60440D180270K0913m369k7421m8225o6471q1720r3487j01002j03662j01862r6645
60429C476319q8647p8128o5872n2824l8794k2817m958J3311L0864M7926O4828
60418C281208Q0537R3017J00412J01645R6520Q5742P0660N2952L4680J8252N577
$$ plain form
60498 1097822 1098063 1098223 1097889 1097297 1096089 1094346 1093452 1094596 1097379 1100849 1105023 1110431 1117042 1124394 1132095
60483 1132095 1139698 1147018 1154972 1165034 1177322 1190326 1203015 1216075 1230640 1247027 1265265 1285509
60471 1285509 1307405 1330477 1355841 1385860 1421230 1460072 1501101 1546008 1597142 1654288 1715705
60460 1715705 1781410 1853520 1933878 2023182 2122268 2232501 2354679 2488737 2634624 2792476
60450 2792476 2961593 3139556 3321939 3502138 3672017 3823983 3952931 4056168 4132168 4180270
60440 4180270 4201183 4196814 4169393 4121168 4054697 3972977 3879490 3778488 3674826 3572964 3476319
60429 3476319 3387672 3309544 3243672 3190848 3152054 3129237 3124279 3137590 3168454 3216380 3281208
60418 3281208 3361745 3454762 3555174 3656819 3753339 3839081 3909741 3962693 3997373 4015625 4021202
60407D021202k631o330n512p75O173J3763K2022L1913M3648N6757P1449Q8387
60395D340066J07333J27479J49206J74231K03613K36795K72858L11772L54198
60386F277551M01057M53370N11350N73298O36176O97453P55105Q05082Q39352
60377A1949794Q47074Q17919P45178O27663M70093K82042P6451j31384l25351
60368A5359479m91687o22196p14747p71353p96357p95749p76254p43940p03469
60359H943727o58244o10513n61630n12966m66484m23788l84910l48854l15134
60350D661204k84052k55857k30578k08354j89004j71500j54831j39273j25899
60341B901856j15118j06479r9515r3676q7866q1376p5021p0102o6297o1973n6579
$$ plain form
60407 4021202 4018571 4012241 4006729 4005954 4012127 4025890 4047912 4079825 4123473 4180230 4251679 4340066
60395 4340066 4447399 4574878 4724084 4898315 5101928 5338723 5611581 5923353 6277551
60386 6277551 6678608 7131978 7643328 8216626 8852802 9550255 10305360 11110442 11949794
60377 11949794 12796868 13614787 14359965 14987628 15457721 15739763 15816214 15684830 15359479
60368 15359479 14867792 14245596 13530849 12759496 11963139 11167390 10391136 9647196 8943727
60359 8943727 8285483 7674970 7113340 6600374 6133890 5710102 5325192 4976338 4661204
60350 4661204 4377152 4121295 3890717 3682363 3493359 3321859 3167028 3027755 2901856
60341 2901856 2786738 2680259 2580744 2487068 2399202 2317826 2242805 2172703 2106406 2044433 1987854
60330A987854n1402m7670m5166m3108m1323l9931l8708l7258l5442l3357l1325
60319A543164k9901k9395k9383k9022k7752k5443k2312j9193j7262j6853j7038
60308A279610j6895j6509j6027j4829j2679j0764j0294j0771j0983j0853j0905
60297A138101j0837j0377j0740j3081j6006j6808j5175j3456j3159j3306j2736
60286I92420j1929j1618j1367j0495r209p959o684n432m807n078n531n176l627
60273H93508j251J040K189J967J337J148J009L54p0P76K408L539M222N445O960
60258I24581P534P234P361Q029P916O854O432P311P913O738M397K433J498J467
60244A007698K042K568K544K784M661P687R583R350Q627R080J0227J0836J0872
$$ plain form
60330 1987854 1936452 1888782 1843616 1800508 1759185 1719254 1680546 1643288 1607846 1574489 1543164
60319 1543164 1513263 1483868 1454485 1425463 1397711 1372268 1349956 1330763 1313501 1296648 1279610
60308 1279610 1262715 1246206 1230179 1215350 1202671 1191907 1181613 1170842 1159859 1149006 1138101
60297 1138101 1127264 1116887 1106147 1093066 1077060 1060252 1045077 1031621 1018462 1005156 992420
60286 992420 980491 968873 957506 947011 937802 929843 923159 917727 912920 907842 902311 897135 893508
60273 893508 892257 893297 895486 897453 898790 899938 900947 901301 901231 902007 904415 907954 912176 917621 924581
60258 924581 932115 939349 946710 954739 962655 969509 975941 983252 991165 997903 1002300 1004733 1006231 1007698
60244 1007698 1009740 1012308 1014852 1017636 1022297 1029984 1039567 1048917 1057544 1066624 1076851 1087687 1098559
60231A098559J0678R679P387M682K507J69l676q771j3289j5900j6814j6905j6595
60218A041711j5702j4013j1910j0171q924p233m537j948r37j039m29J286K598
60205I68752K756L024M487O166O453N386M502N035O959R220J0545J0725J1163
60192A055173J3286J6509J8942K0029K0943K2360K3662K4826K7164L1207L5478
60181A309579L8451M0480M2720M5314M7773N0219N3134N6392N9145O0343N9265
60170A862815N6410N3664N2360N1236M7917M2463L7405L3957L0383K5065J8927
60159B312602J3513Q542L162j876n096o435o913o788n436k663Q78M305P076R513
60145B324384J2930J8264K4429K9312L2537L5694L9598M3231M5964M8666N1612
$$ plain form
60231 1098559 1109237 1118916 1126303 1130985 1133492 1133661 1129985 1121214 1107925 1092025 1075211 1058306 1041711
60218 1041711 1026009 1011996 1000086 989915 980991 973758 969221 967273 966336 965297 964868 966154 968752
60205 968752 971508 974532 979019 985185 991638 997024 1001526 1006561 1013520 1022740 1033285 1044010 1055173
60192 1055173 1068459 1084968 1103910 1123939 1144882 1167242 1190904 1215730 1242894 1274101 1309579
60181 1309579 1348030 1388510 1431230 1476544 1524317 1574536 1627670 1684062 1743207 1803550 1862815
60170 1862815 1919225 1972889 2025249 2076485 2124402 2166865 2204270 2238227 2268610 2293675 2312602
60159 2312602 2326115 2334657 2337819 2335943 2330847 2324412 2317499 2310711 2305275 2302612 2303490 2307795 2314871 2324384
60145 2324384 2337314 2355578 2380007 2409319 2441856 2477550 2517148 2560379 2606343 2655009 2706621
60134B706621N3481N3689N3707N4515N4586N2137M7601M2135L5357K6829J8365
60123C199023J2369Q503M146k261r913j7100k2243k4097k2732k0138j8272j6684
60111C070601j3227o931R32Q462J4968K1480K9841M0781N2641O2943P1374P9689
60099C433554Q8441R5893J00921J04495J06742J05017R7168Q4807P0743N4843
60089D342624L5374J3341p554k4796l8227m7738n2776n4269n4414n3811n0811
60078D006943m4229l5130k5323j5637o080L513J3488K4157L5364M6921N9138P2158
60066D135283Q5346R8296J11659J25646J38489J48057J54515J59659J63926J65805
60056E486681J64012J58703J50544J40144J28281J15287J00236Q2161O1862M1049
$$ plain form
60134 2706621 2760102 2813791 2867498 2922013 2976599 3028736 3076337 3118472 3153829 3180658 3199023
60123 3199023 3211392 3219895 3224041 3221780 3211867 3194767 3172524 3148427 3125695 3105557 3087285 3070601
60111 3070601 3057374 3050443 3051375 3059837 3074805 3096285 3126126 3166907 3219548 3282491 3353865 3433554
60099 3433554 3521995 3617888 3718809 3823304 3930046 4035063 4132231 4217038 4287781 4342624
60089 4342624 4377998 4391339 4383785 4358989 4320762 4273024 4220248 4165979 4111565 4057754 4006943
60078 4006943 3962714 3927584 3902261 3886624 3880544 3884057 3897545 3921702 3957066 4003987 4063125 4135283
60066 4135283 4220629 4318925 4430584 4556230 4694719 4842776 4997291 5156950 5320876 5486681
60056 5486681 5650693 5809396 5959940 6100084 6228365 6343652 6443888 6526049 6587911 6628960
60046F628960J9881k806k6806m9824p0002q7737j04278j19629j32379j40898j44361
60035E770121j43196j38768j32222j23783j13462j01840q9500p6276o1850m6566
60025D742658l0952j5303n75J1348J9458K4792K8686L0901L0857K9355K7237K3432
60013D921894J6539P654n73p174j2987j8141k2021k5513l0489l6562m0767m1298
60001D710562l9518l7509l5537l2875k9373k5032j9237j1503k182Q074J8740K9089
59989D533699L8531M7578N7341O7700P7058Q4146Q8825R0869Q9245Q3257P3498
59978E331747O1114M6960L1839J6805K734j0068k1887l3497m5522n7253o6936
59967E256036p4251q1512r0762j00446j07020j09538j10448j11734j12523j11011
$$ plain form
60046 6628960 6648841 6646035 6619229 6569405 6499403 6411666 6307388 6187759 6055380 5914482 5770121
60035 5770121 5626925 5488157 5355935 5232152 5118690 5016850 4927350 4851074 4789224 4742658
60025 4742658 4711706 4696403 4695828 4707176 4726634 4751426 4780112 4811013 4841870 4871225 4898462 4921894
60013 4921894 4938433 4946087 4945514 4938340 4925353 4907212 4885191 4859678 4829189 4792627 4751860 4710562
60001 4710562 4671044 4633535 4597998 4565123 4535750 4510718 4491481 4479978 4477796 4485870 4504610 4533699
59989 4533699 4572230 4619808 4677149 4744849 4821907 4906053 4994878 5085747 5174992 5258249 5331747
59978 5331747 5392861 5439821 5471660 5488465 5491199 5481131 5459244 5425747 5380225 5322972 5256036
59967 5256036 5181785 5100273 5009511 4909065 4802045 4692507 4582059 4470325 4357802 4246791
59957D246791j06840j00724r3329q5395p7659o9969o1485n2232m3214l4690k5662
59946C495592j5612n429L958J2696K1193K9333L7097M4844N2476N9255O4790O9170
59934C869363P1685P0837O6188N9134N1263M2880L3703K3917J3806L181q118j9692
59922D278147l0911m1241n0001n6568o0956o3435o3609o0835n5656m9669m3697
59911C701569l7021k8804j9393r948j479N611J1806J8308K5854L3699M0516M5893
59899C786611M9994N2258N1818M9029M5265M1476L8113L5918L4998L3506K9223
59888D248209K2545J6060J1224P420M270K510K266K823M857J0498K0184L1494
59876D384360M2234N2835O4547P7306R0682J05124J20655J35845J49515J62007
$$ plain form
59957 4246791 4139951 4039227 3945898 3860503 3782844 3712875 3651390 3599158 3555944 3521254 3495592
59946 3495592 3479980 3474551 3478509 3491205 3512398 3541731 3578828 3623672 3676148 3735403 3800193 3869363
59934 3869363 3941048 4011885 4078073 4137207 4188470 4231350 4265053 4288970 4302776 4305957 4297839 4278147
59922 4278147 4247236 4205995 4155994 4099426 4038470 3975035 3911426 3850591 3794935 3745266 3701569
59911 3701569 3664548 3635744 3616351 3606403 3604924 3610535 3622341 3640649 3666503 3700202 3740718 3786611
59899 3786611 3836605 3888863 3940681 3989710 4034975 4076451 4114564 4150482 4185480 4218986 4248209
59888 4248209 4270754 4286814 4298038 4305458 4309728 4312238 4314504 4317327 4322184 4332682 4352866 4384360
59876 4384360 4426594 4479429 4543976 4621282 4711964 4817088 4937743 5073588 5223103 5385110
59866E385110J73256J81169J83596J80697J73422J60825J40917J13619Q0989M5020
59856F818620P054l0820o5732r5864j21132j41737j57097j66641j70913j71195
59846E704543j68288j62039j52125j39205j24975j10943r7449q4046p0356n6035
59836D539082m0725k4871r960L198J5798K9207M2416N3012O0274O5260O8034O7171
59824D867896O2327N4778M4720L0379J1165j0386l1169n0354o8353q4778r9090
59813D727135j11714j22557j29625j31131j28516j25573j24690j25037j24213
59804C604079j20754j15227j09441j04381r8916r1413q2414p4067o6789n8664
59794B682013m8979m0002l3688k8637k2510j5778j0682p567m811j885j8K38J2
$$ plain form
59866 5385110 5558366 5739535 5923131 6103828 6277250 6438075 6578992 6692611 6773600 6818620
59856 6818620 6825674 6794854 6729122 6633258 6512126 6370389 6213292 6046651 5875738 5704543
59846 5704543 5536255 5374216 5222091 5082886 4957911 4846968 4749519 4665473 4595117 4539082
59836 4539082 4498357 4473486 4463526 4466724 4482522 4511729 4554145 4607157 4667431 4732691 4800725 4867896
59824 4867896 4930223 4985001 5029721 5060100 5071265 5060879 5029710 4979356 4911003 4826225 4727135
59813 4727135 4615421 4492864 4363239 4232108 4103592 3978019 3853329 3728292 3604079
59804 3604079 3483325 3368098 3258657 3154276 3055360 2963947 2881533 2807466 2740677 2682013
59794 2682013 2633034 2593032 2559344 2530707 2508197 2492419 2481737 2474170 2469359 2467474 2467456 2467694 2467706
59781B467706M64J779M033P473J1453J4334J5075J4184J2842J1590R951O801J295
59768B578980n996j3025j8004k1009k3387k5896k8120k9397k9618k9108k8180
59757B327240k6848k4902k2569k0942k0929k1581k0461j6256j0119l937J781P581
59745B148058J3610J9570K5445L1332L6926M1934M6665N1469N5841N8450N7744
59734B587044N2542M3010L1307K0509J2552P924P021J0068J5197J8583J7871J4382
59722B838010J0993R109Q791J0446J4753K1636L0442M0582N1218O1456P1757Q3797
59710C252990R7864J11689J23395J34076J45563J56572J63044J61480J50125J27906
59700D624704R5064N5035J3579k4610n7251q2716r9239j06659j07461j04874j00542
$$ plain form
59781 2467706 2468170 2469949 2473982 2481455 2492908 2507242 2522317 2536501 2549343 2560933 2570884 2577685 2578980
59768 2578980 2572984 2559959 2541955 2520946 2497559 2471663 2443543 2414146 2384528 2355420 2327240
59757 2327240 2300392 2275490 2252921 2231979 2211050 2189469 2169008 2152752 2142633 2138696 2140477 2148058
59745 2148058 2161668 2181238 2206683 2238015 2274941 2316875 2363540 2415009 2470850 2529300 2587044
59734 2587044 2639586 2682596 2713903 2734412 2746964 2754888 2761909 2771977 2787174 2805757 2823628 2838010
59722 2838010 2849003 2858112 2866903 2877349 2892102 2913738 2944180 2984762 3035980 3097436 3169193 3252990
59710 3252990 3350854 3462543 3585938 3720014 3865577 4022149 4185193 4346673 4496798 4624704
59700 4624704 4719768 4774803 4788382 4763772 4706521 4623805 4524566 4417907 4310446 4205572 4105030
59689D105030r4616q7316p9472p1608o3081n2659m0251k7737j7266q677L18J0997
59677C573662K1846L0672L7463M4052N1843O1025P1409Q2774R4592J06391J18199
59666D293928J30106J41949J54025J67409J82672J98993K15399K32158K50060
59657E966699K68897K87543L04950L20333L33054L43048L50547L54689L53500
59648H883260L46312L35146L22693L10069K97736K87341K80816K78386K78805
59639A1620564K80814K82996K83158K79541K71996K60530K43717K20169J90721
59630A3934206J57291J20632Q1330M2212P077k2787m8509p0077q5285r2407r1660
59619A3932023q3709o9003m9187k6920l103K3910N5448R0399J26928J64512K02959
$$ plain form
59689 4105030 4010414 3923098 3843626 3772018 3708937 3656278 3616027 3588290 3571024 3562347 3562665 3573662
59677 3573662 3595508 3626180 3663643 3707695 3759538 3820563 3891972 3974746 4069338 4175729 4293928
59666 4293928 4424034 4565983 4720008 4887417 5070089 5269082 5484481 5716639 5966699
59657 5966699 6235596 6523139 6828089 7148422 7481476 7824524 8175071 8529760 8883260
59648 8883260 9229572 9564718 9887411 10197480 10495216 10782557 11063373 11341759 11620564
59639 11620564 11901378 12184374 12467532 12747073 13019069 13279599 13523316 13743485 13934206
59630 13934206 14091497 14212129 14293459 14335671 14342748 14319961 14271452 14201375 14116090 14023683 13932023
59619 13932023 13848314 13779311 13730124 13703204 13700101 13724011 13779459 13869858 13996786 14161298 14364257
59608A4364257K40816K76384L09338L39471L64143L78500L78527L62963L31987
59599A7346386K84986K20605J39150M4505n6623j57269k51805l35659m04946m57271
59589A6372059m92486n12010n17726n11842m97011m75669m49575m20668l92027
59580A2103045l67349l49701l41108l42459l52772l68688l85432l98523m04910
59571H792103m03534l95462l82747l66703l47807l27253l07061k87901k68231
59562E705404k46614k23882k02049j82442j65779j52466j41241j29146j14787
59553D146998j00524q9472q1351p3482o4979n7514n2230m8360m5088m2786m1919
59542C449293m2231m3379m5223m7438m9760n2357n5104n6963n7164n6231n4841
$$ plain form
59608 14364257 14605073 14881457 15190795 15530266 15894409 16272909 16651436 17014399 17346386
59599 17346386 17631372 17851977 17991127 18035632 17979009 17821740 17569935 17234276 16829330 16372059
59589 16372059 15879573 15367563 14849837 14337995 13840984 13365315 12915740 12495072 12103045
59580 12103045 11735696 11385995 11044887 10702428 10349656 9980968 9595536 9197013 8792103
59571 8792103 8388569 7993107 7610360 7243657 6895850 6568597 6261536 5973635 5705404
59562 5705404 5458790 5234908 5032859 4850417 4684638 4532172 4390931 4261785 4146998
59553 4146998 4046474 3957002 3875651 3802169 3737190 3679676 3627446 3579086 3533998 3491212 3449293
59542 3449293 3407062 3363683 3318460 3271022 3221262 3168905 3113801 3056838 2999674 2943443 2888602
59531B888602n2695m9841m7741m7122m6011m2290l7218l3794l2253l0061k6087
59520B443489k1936j8972j6748j4742j3122j1206p610k653J615M348O674R144
59508B358281J0883J2048J4463J8529K1906K2891K2982K4418K6947K8950L0367
59497B592665L2541L6014M0194M4581M8933N2817N6262O0375O6208P3426Q0940
59486C184956Q8230R5184J01329J06431J11458J17680J24799J30891J34526J36270
59476D331754J37536J38217J36348J30706J23148J16804J11506J02643Q6109O3591
59466E478362M1275K3663J0372j182j2060k1515k8846l4219l7962l9712l8378
59455E339798l3123k4609j4651m107Q214K3633M1292N8758P4223Q6847R5651R9637
$$ plain form
59531 2888602 2835907 2786066 2738325 2691203 2645192 2602902 2565684 2531890 2499637 2469576 2443489
59520 2443489 2421553 2402581 2385833 2371091 2357969 2346763 2339153 2336500 2338115 2342463 2349137 2358281
59508 2358281 2369164 2381212 2395675 2414204 2436110 2459001 2481983 2506401 2533348 2562298 2592665
59497 2592665 2625206 2661220 2701414 2745995 2794928 2847745 2904007 2964382 3030590 3104016 3184956
59486 3184956 3273186 3368370 3469699 3576130 3687588 3805268 3930067 4060958 4195484 4331754
59476 4331754 4469290 4607507 4743855 4874561 4997709 5114513 5226019 5328662 5414771 5478362
59466 5478362 5519637 5543300 5553672 5552490 5540430 5518915 5490069 5455850 5417888 5378176 5339798
59455 5339798 5306675 5282066 5267415 5263308 5271522 5295155 5336447 5395205 5469428 5556275 5651926 5751563
59443E751563R8620R2675Q1206O3954M2287J7790r734m0971p4125j05379j32089
59432E785797j53709j69832j79726j83891j83892j80194j72223j60816j48535
59423D252979j36928j25401j13357j01525r0378p9103o7065n4860m3188l2019
59413C409155k1371j1578k273P453J7534K6979L5694M4693N4197O3215P1425P9626
59401C774749Q7825R4519R8543J00021R9019R4875Q7377P7042O3754M6884K7117
59390D651725O386j4482l6035n7545p6293r0532j01222j09850j16364j20492j23119
59379C812177j24827j24467j20831j14680j07797j00989r4114q7183q0372p3478
59369B783439o6208n8594n0938m3925l8558l4840l0791k4444j6746j0753p636
$$ plain form
59443 5751563 5850183 5942858 6024064 6088018 6130305 6148095 6138361 6097390 6023265 5917886 5785797
59432 5785797 5632088 5462256 5282530 5098639 4914747 4734553 4562330 4401514 4252979
59423 4252979 4116051 3990650 3877293 3775768 3685390 3606287 3539222 3484362 3441174 3409155
59413 3409155 3387784 3376206 3373933 3381386 3398920 3425899 3461593 3506286 3560483 3623698 3695123 3774749
59401 3774749 3862574 3957093 4055636 4155657 4254676 4349551 4436928 4513970 4577724 4624608 4651725
59390 4651725 4658111 4643629 4607594 4550049 4473756 4383224 4282002 4172152 4055788 3935296 3812177
59379 3812177 3687350 3562883 3442052 3327372 3219575 3118586 3024472 2937289 2856917 2783439
59369 2783439 2717231 2658637 2607699 2563774 2525216 2490376 2459585 2435141 2418395 2407642 2400006
59358B400006n312j453L937R481J4307J8386K2252K6791L2224L7633M2602M8126
59346B648980N3699N4969M8105L6205K7363K5762K8458L1652L5654M1927M9532
59335C082306N7283O5976P5208Q0905P9538P3079O6873O4100O4836O8738P5616
59324C854458Q4229R2973J01284J09003J15656J21804J29401J39087J48998J57955
59314E054848J67664J79544J91648K01737K11688K25474K43614K62701K80116
59305G019034K96423L12919L29031L42623L51496L54416L51562L43766L31123
59296A0032393L13360K91803K69158K46538K22698J97332J72763J50756J29758
59287A2026559J07233Q2834N7294L0177Q72l0070o2659r8526j37769j76693k11325
$$ plain form
59358 2400006 2394694 2393241 2397178 2406659 2420966 2439352 2461604 2488395 2520619 2558252 2600854 2648980
59346 2648980 2702679 2757648 2805753 2841958 2869321 2895083 2923541 2955193 2990847 3032774 3082306
59335 3082306 3139589 3205565 3280773 3361678 3441216 3514295 3581168 3645268 3710104 3778842 3854458
59324 3854458 3938687 4031660 4132944 4241947 4357603 4479407 4608808 4747895 4896893 5054848
59314 5054848 5222512 5402056 5593704 5795441 6007129 6232603 6476217 6738918 7019034
59305 7019034 7315457 7628376 7957407 8300030 8651526 9005942 9357504 9701270 10032393
59296 10032393 10345753 10637556 10906714 11153252 11375950 11573282 11746045 11896801 12026559
59287 12026559 12133792 12216626 12273920 12304097 12304969 12274899 12212240 12113714 11975945 11799252 11587927
59276A1587927k41415k68237k90313l04788l11799l14184l13487l09182l01101
59267H933421k89865k75564k58647k41430k26057k11780j96834j81988j69287
59258F881969j58127j45851j31820j17825j04864r2592q1798p4111o8944o3677
59248E842360n7354n1633m7639m4566m1873m0516m1253m3639m7162n1621n6171
59237E318933n9681o2180o4432o6368o7576o8748p0667p2493p3185p3755p5466
59226D564382p6547p3813o7291o0111n3933m7673m0957l5154l0209k3773j4890
59215D040031n602K496J0555J9599K7989L3824L7946M2243M6225M7423M4475L8346
59203D385550L0781K2791J4303M634o687j9223l1951m3900n3887o0317o2532o1942
$$ plain form
59276 11587927 11346512 11078275 10787962 10483174 10171375 9857191 9543704 9234522 8933421
59267 8933421 8643556 8367992 8109345 7867915 7641858 7430078 7233244 7051256 6881969
59258 6881969 6723842 6577991 6446171 6328346 6223482 6130890 6049092 5974981 5906037 5842360
59248 5842360 5785006 5733373 5685734 5641168 5599295 5558779 5517526 5473887 5426725 5375104 5318933
59237 5318933 5259252 5197072 5132640 5066272 4998696 4929948 4859281 4786788 4713603 4639848 4564382
59226 4564382 4487835 4414022 4346731 4286620 4232687 4185014 4144057 4108903 4078694 4054921 4040031
59215 4040031 4034429 4036925 4047480 4067079 4095068 4128892 4166838 4209081 4255306 4302729 4347204 4385550
59203 4385550 4416331 4439122 4453425 4458059 4451372 4432149 4400198 4356298 4302411 4242094 4179562 4117620
59191D117620o0361n7675n2684m5818l8845l1982k3591j3124k111Q457J9462L1008
59179C850356M0157M2911L7832K6911J4063L559j297K74O148J3194J9757K6306
59167D080171L4060M3385N3449O3265P2795Q2604R2720J02778J13152J24527J36105
59156D999011J46179J55227J66430J81576J98271K13000K25201K36174K45586
59147F766655K51613K53403K50721K42120K26056K03145J74833J40759J00242
59138H609547N5630J1001l1892p3219j11104j41854j64590j81979j95566k03662
59128G572312k05154k02312j97993j92527j85053j76002j66548j57141j47945
59119E941637j39474j31672j23620j14983j06563r8814r1093q3017p5224o8304
$$ plain form
59191 4117620 4057259 3999584 3946900 3901082 3862237 3830255 3806664 3793540 3791429 3799886 3819348 3850356
59179 3850356 3890513 3933424 3971256 3998167 4012230 4015789 4014492 4014766 4020914 4034108 4053865 4080171
59167 4080171 4114231 4157616 4211065 4274330 4347125 4429729 4522449 4625227 4738379 4862906 4999011
59156 4999011 5145190 5300417 5466847 5648423 5846694 6059694 6284895 6521069 6766655
59147 6766655 7018268 7271671 7522392 7764512 7990568 8193713 8368546 8509305 8609547
59138 8609547 8665177 8676178 8644286 8571067 8459963 8318109 8153519 7971540 7775974 7572312
59128 7572312 7367158 7164846 6966853 6774326 6589273 6413271 6246723 6089582 5941637
59119 5941637 5802163 5670491 5546871 5431888 5325325 5226511 5135418 5052401 4977177 4908873
59109D908873o2095n6494n1649m7096m1992l6339l0805k5387j9772j4796j1756
59098D510692j0224q376n573k872j000L20R59K49j582l609n825q764j1812j4008
59084D438575j6235k0161k5235k9386l2588l6708m1555m4266m3562m1684m1002
59073D066193m1291m1505m1761m2216m2032m0684l8646l6068l2534k8491k4735
59062C656230k0299j3421n002J797O024J0104J5701K1601K6663L1565L6238L8885
59050C806086L9369M0334M2914M4447M2747L9473L6638L2789K5983J8018J2147
59039D180945Q388M778J938K741Q002J5623K3662L1282L6929L8391L5141K8410
59027D416230J8722N192j2369l2325n2597p1989q9922j05842j19115j28897j34280
$$ plain form
59109 4908873 4846778 4790284 4738635 4691539 4649547 4613208 4582403 4557016 4537244 4522448 4510692
59098 4510692 4500468 4492092 4486519 4483647 4482647 4482967 4483926 4484175 4482593 4478984 4473159 4464395 4452583 4438575
59084 4438575 4422340 4402179 4376944 4347558 4314970 4278262 4236707 4192441 4148879 4107195 4066193
59073 4066193 4024902 3983397 3941636 3899420 3857388 3816704 3778058 3741990 3709456 3680965 3656230
59062 3656230 3635931 3622510 3617508 3619305 3625329 3635433 3651134 3672735 3699398 3730963 3767201 3806086
59050 3806086 3845455 3885789 3928703 3973150 4015897 4055370 4092008 4124797 4150780 4168798 4180945
59039 4180945 4189333 4194111 4196049 4198790 4206792 4222415 4246077 4277359 4314288 4352679 4387820 4416230
59027 4416230 4434952 4440144 4427775 4395450 4342853 4270864 4180942 4075100 3955985 3827088 3692808
59016C692808j35197j32932j29112j24485j19049j12882j06323r9763r3474q7124
59006B552467p9627p0415o0841n3164m8031m4198m0502l6585l1844k5742j9430
58995B042088j4857j1804p957k522K586O057R101J2716J5523J6097J5401J4965
58983B097394J4467J3140J2110J3193J6502K1039K6654L3634M1259M8494N5400
58972B393286O2460O9023P3509P4461P0613O1082M6698L0260J4528P64j0311j7733
58960B868640k1635k3945k6473k9145l0935l1307k9875k6061k0270j4294r605
58949B605095o275m018k867k185p48J257J937J71l195p394j2944j9897k6919l3279
58935B488739l9793m6574n1760n3984n4309n4357n4159n3117n1268m8328m3307
$$ plain form
59016 3692808 3557611 3424679 3295567 3171082 3052033 2939151 2832828 2733065 2639591 2552467
59006 2552467 2472840 2402425 2341584 2288420 2240389 2196191 2155689 2119104 2087260 2061518 2042088
58995 2042088 2027231 2015427 2007470 2004948 2007534 2013591 2022692 2035408 2050931 2067028 2082429 2097394
58983 2097394 2111861 2125001 2137111 2150304 2166806 2187845 2214499 2248133 2289392 2337886 2393286
58972 2393286 2455746 2524769 2598278 2672739 2743352 2804434 2851132 2881392 2895920 2896684 2886373 2868640
58960 2868640 2847005 2823060 2796587 2767442 2736507 2705200 2675325 2649264 2628994 2614700 2605095
58949 2605095 2598820 2594802 2591935 2589750 2589002 2590259 2592196 2592367 2589172 2581778 2568834 2548937 2522018 2488739
58935 2488739 2448946 2402372 2350612 2296628 2242319 2187962 2133803 2080686 2029418 1981090 1937783
58924A937783l6411k9637k4341k0028j6376j4020j2210q536k735K075L904N010
58912A784478Q227J2850J6891K0904K6386L2221L5960L7422L8301L9250L9831
58901B092721M0110L9851L7405L1828K5007J9516J5613J2503J0914J1854J4270
58890B351592J6692J9971K5545L2062L6563L8334L8868L8695L6820L2976K8094
58879B696212K2948J8174J4907J3572J2919J2080J2518J5901K1321K6700L1685
58868B898937L6815M1248M3929M5911M8878N2267N4680N7068O1698O8438P4948
58857C484817Q0300Q5875R2910J01442J11547J23414J36271J48960J61304J73641
58847D700481J85972J99088K15071K34575K54781K72280K86806L00118L12573
$$ plain form
58924 1937783 1901372 1871735 1847394 1827366 1810990 1796970 1784760 1776224 1773489 1775564 1779468 1784478
58912 1784478 1792705 1805555 1822446 1843350 1869736 1901957 1937917 1975339 2013640 2052890 2092721
58901 2092721 2132831 2172682 2210087 2241915 2266922 2286438 2302051 2314554 2325468 2337322 2351592
58890 2351592 2368284 2388255 2413800 2445862 2482425 2520759 2559627 2598322 2635142 2668118 2696212
58879 2696212 2719160 2737334 2752241 2765813 2778732 2790812 2803330 2819231 2840552 2867252 2898937
58868 2898937 2935752 2977000 3020929 3066840 3115718 3167985 3222665 3279733 3341431 3409869 3484817
58857 3484817 3565117 3650992 3743902 3845344 3956891 4080305 4216576 4365536 4526840 4700481
58847 4700481 4886453 5085541 5300612 5535187 5789968 6062248 6349054 6649172 6961745
58838F961745L23240L31689L36845L35221L23346L01319K71391K34246J89403
58829I608445J38100Q2670K4130l6421r4893j46235j88921k24422k52869k72650
58819H636934k83945k89246k90333k87582k81993k74841k65621k53428k39981
58810F169964k28075k17296k04935j90981j78534j68768j59267j48156j36650
58801D537302j26482j17834j10860j06523j04777j04178j04020j04611j04960
58792C553057j02829r7822r1971q6557q0745p3998o7326o1287n5090m8665m3392
58781B743375l9699l5808l0023k2743j5552r603n392k645j04L406P638J1823J6383
58768B621056K2130K8393L3911L9017M4857N1028N6367O1413O7599P4334P9734
$$ plain form
58838 6961745 7284985 7616674 7953519 8288740 8612086 8913405 9184796 9419042 9608445
58829 9608445 9746545 9829215 9853345 9816924 9722031 9575796 9386875 9162453 8909584 8636934
58819 8636934 8352989 8063743 7773410 7485828 7203835 6928994 6663373 6409945 6169964
58810 6169964 5941889 5724593 5519658 5328677 5150143 4981375 4822108 4673952 4537302
58801 4537302 4410820 4292986 4182126 4075603 3970826 3866648 3762628 3658017 3553057
58792 3553057 3450228 3352406 3260435 3173878 3093133 3019135 2951809 2890522 2835432 2786767 2743375
58781 2743375 2703676 2667868 2637845 2615102 2599550 2589947 2584555 2581910 2581806 2585212 2592850 2604673 2621056
58768 2621056 2643186 2671579 2705490 2744507 2789364 2840392 2896759 2958172 3025771 3100105 3179839
58757C179839Q4010Q9359R6529J04181J11650J19544J27674J35151J42651J51786
58747D342374J62237J72431J83081J96756K13547K30377K45308K59436K73656
58738F279203K86586K96783L04248L08489L07513K99779K84998K62371K30538
58729H860508J90028J43387R2167L6432k1985p8490j29327j73932k12719k44804
58719H461265k69096k85646k94853k97229k94609k89584k83071k74298k63656
58710E909223k53085k43101k31888k18290k03525j89020j74837j61081j48727
58701D085669j37930j27344j16095j04766r3988q3666p3981o5169n6218m5766
58691C180746l4492k4397j5721o906K470J1515K0767L2006M4895N6952O7473P8402
$$ plain form
58757 3179839 3263849 3353208 3449737 3553918 3665568 3785112 3912786 4047937 4190588 4342374
58747 4342374 4504611 4677042 4860123 5056879 5270426 5500803 5746111 6005547 6279203
58738 6279203 6565789 6862572 7166820 7475309 7782822 8082601 8367599 8629970 8860508
58729 8860508 9050536 9193923 9286090 9322522 9300537 9222047 9092720 8918788 8706069 8461265
58719 8461265 8192169 7906523 7611670 7314441 7019832 6730248 6447177 6172879 5909223
58710 5909223 5656138 5413037 5181149 4962859 4759334 4570314 4395477 4234396 4085669
58701 4085669 3947739 3820395 3704300 3599534 3505546 3421880 3347899 3282730 3226512 3180746
58691 3180746 3146254 3121857 3106136 3099230 3101700 3113215 3133982 3165988 3210883 3267835 3335308 3413710
58679C413710R0364J00790J06847J07238J00249Q3461N7151K5545o731l7062o3060
58668C978502q1732r2245r7035r8661r7743r5056r2726r1700r0612q8845q8226
58657B963921q9961r2257r2963r2402r1765r0669q8355q5545q3228q0839p7269
58646A998668p2534o7264o1634n5827n0459m5738m1287l7091l3366k9565k5095
58635A478808k0874j8180j6262j3398j0106q620r305j0340j0921j1624j1673r415
58623A328090n911m304m905m509j540J966M643Q092J3209J8036K1335K5030L0760
58610A429992L7028M1949M6189N0881N5005N6758N5491N0956M2957L3001K3803
58599A924010J5878P251k488j0880j6550k1279k6794l2604l8349m4690n0501n2749
$$ plain form
58679 3413710 3504074 3604864 3711711 3818949 3919198 4002659 4059810 4085355 4078624 4041562 3978502
58668 3978502 3896770 3804525 3707490 3608829 3511086 3416030 3323304 3231604 3140992 3052147 2963921
58657 2963921 2873960 2781703 2688740 2596338 2504573 2413904 2325549 2240004 2156776 2075937 1998668
58646 1998668 1926134 1858870 1797236 1741409 1690950 1645212 1603925 1566834 1533468 1503903 1478808
58635 1478808 1457934 1439754 1423492 1410094 1399988 1391368 1382063 1371723 1360802 1349178 1337505 1328090
58623 1328090 1322179 1317875 1312970 1308461 1306921 1308887 1313530 1321622 1334831 1352867 1374202 1399232 1429992
58610 1429992 1467020 1508969 1555158 1606039 1661044 1717802 1773293 1824249 1867206 1900207 1924010
58599 1924010 1939888 1947139 1944651 1933771 1917221 1895942 1869148 1836544 1798195 1753505 1703004 1650255
58587A650255n1082m8914m8090m6245m1567l6239l2477k8857k3604j8175j4421
58576A260584j1274p526m906n001n701m127r05J613L286N282P155P941Q539J0334
58562A265294J2906J5347J8072K1326K3901K5439K7766L1914L6148L9105M2290
58551A559508M7105N2036N5491N8922O4264P0510P5754Q0597Q6557R2829R7445
58540B341018J00289J02605J04748J06208J06319J03377R5052Q1258O4728M7653
58530C253255L0090J2551k992j6155k8608l9950m6795m7963m6742m5680m2967
58519B978044l6579k8051j9273r409J891J2236K0737L0482M3198N5446O4175P2098
58507C184995Q3054R5676J06522J16250J27537J39441J48687J54051J54480J45140
$$ plain form
58587 1650255 1599173 1550259 1502169 1455924 1414357 1378118 1345641 1316784 1293180 1275005 1260584
58576 1260584 1249310 1241784 1236878 1231877 1226176 1222049 1221144 1222757 1226043 1231325 1238480 1246421 1254960 1265294
58562 1265294 1278200 1293547 1311619 1332945 1356846 1382285 1410051 1441965 1478113 1517218 1559508
58551 1559508 1606613 1658649 1714140 1773062 1837326 1907836 1983590 2064187 2150744 2243573 2341018
58540 2341018 2441307 2543912 2648660 2754868 2861187 2964564 3059616 3140874 3205602 3253255
58530 3253255 3283345 3295896 3292904 3276749 3248141 3208191 3161396 3113433 3066691 3021011 2978044
58519 2978044 2941465 2913414 2894141 2884732 2886623 2898859 2919596 2950078 2993276 3048722 3112897 3184995
58507 3184995 3268049 3363725 3470247 3586497 3714034 3853475 4002162 4156213 4310693 4455833
58497D455833J20807Q2082L4252j8139p1279j18933j54806j77697j90769j96713
58487C764638j96855j93048j86600j76865j64138j51753j41895j32021j19356
58478B302107j06226r6436q8997q0432p1078o3872n8612n2751m6543m2310l9612
58467A555238l5884l1125k7295k4055j9673j5195j3204j3119j2177j0262r388
58456A343861r119p041l360p56J65J344L489N453P107R504J2523J5262J7923K0712
58442A417067K2323K2333K3155K6536L0384L2598L5351M1499M9311N5553O1482
58431A817592P0476Q1464R0158R5699J00783J05865J08134J05818R9137Q7640
58421B762766P1018N1924L3807J6549k100k2048m1648o1134q0739r7000j05798
$$ plain form
58497 4455833 4576640 4658722 4692974 4674835 4603556 4484623 4329817 4152120 3961351 3764638
58487 3764638 3567783 3374735 3188135 3011270 2847132 2695379 2553484 2421463 2302107
58478 2302107 2195881 2099445 2010448 1930016 1858938 1795066 1736454 1683703 1637160 1594850 1555238
58467 1555238 1519354 1488229 1460934 1436879 1417206 1402011 1388807 1375688 1363511 1353249 1343861
58456 1343861 1334742 1327701 1324341 1323585 1323750 1325094 1328583 1334036 1341143 1350647 1363170 1378432 1396355 1417067
58442 1417067 1439390 1461723 1484878 1511414 1541798 1574396 1609747 1651246 1700557 1756110 1817592
58431 1817592 1888068 1969532 2059690 2155389 2256172 2362037 2470171 2575989 2675126 2762766
58421 2762766 2833784 2885708 2919515 2936064 2933964 2911916 2870268 2809134 2728395 2631395 2525597
58410B525597j08128j08288j07588j04381r8976r3560q7970q0299p1107o2842
58400A602458n5859m8968m2732l8275l4251k8998k4003k1190j8811j4397r534
58389A265440p103o182m500l343m589n527k512K480M937N247O919R661J0728J1327
58375A282983J4757J9679K1957K1909K3037K4721K3090J8254J3922J0564N460
58364A480333j243o902j1833j7916k2906k2888j9321j7004j6190j3577r732q117
58352A312704p879n096l52K460L898P847J3463J6173J6004J7043J9349J9529J8410
58339A433553J9533K0636J5845O244r16l782p352j2901j5632j4299j3818j6306
58327A410805j8113j7554j7447j8180j6233j1034n607L18R729K0576K7454L1216
$$ plain form
58410 2525597 2417469 2309181 2201593 2097212 1998236 1904676 1816706 1736407 1665300 1602458
58400 1602458 1546599 1497631 1454899 1416624 1382373 1353375 1329372 1308182 1289371 1274974 1265440
58389 1265440 1258337 1252155 1247655 1244312 1239723 1234196 1231684 1234164 1239101 1244348 1251267 1260928 1271656 1282983
58375 1282983 1297740 1317419 1339376 1361285 1384322 1409043 1432133 1450387 1464309 1474873 1480333
58364 1480333 1479090 1472188 1460355 1442439 1419533 1396645 1377324 1360320 1344130 1330553 1320821 1312704
58352 1312704 1304825 1299729 1299377 1301837 1305735 1313582 1327045 1343218 1359222 1376265 1395614 1415143 1433553
58339 1433553 1453086 1473722 1489567 1495811 1494895 1491113 1483761 1470860 1455228 1440929 1427111 1410805
58327 1410805 1392692 1375138 1357691 1339511 1323278 1312244 1306637 1306955 1316684 1337260 1364714 1395930
58315A395930L7326M3963M2304L0436J6801P571O14n608p631m971k899l535k886
58302A547415M60K696L341O853J2920J5035J2020J1040J5559K0168K1193K2456
58290A691156K6201K8183K6587K6518L0619L4009L3087L0717K8523K3036J3911
58279A992547P052N069L301p05k918j860k262n301m959J117O761Q057R433J4251
58265B029583J8843K0805K3575K8016K9210K6507K6749L2632L7901L8919M0577
58254B353317M5599M8954M8332M9306N4205N6763N3654N0490N0436M8190M1375
58243B900621L6495L7064L7216L3500L1448L3994L5367L3191L4192M0887M5367
58232C299342M3808M4185N1640N9297O2009O5808P4914Q2588Q4244Q6604R4538
$$ plain form
58315 1395930 1433256 1477219 1519523 1549959 1566760 1574331 1574945 1569337 1561706 1556735 1553836 1550301 1547415
58302 1547415 1547875 1550571 1553912 1560765 1573685 1588720 1600740 1611780 1627339 1647507 1668700 1691156
58290 1691156 1717357 1745540 1772127 1798645 1829264 1863273 1896360 1927077 1955600 1978636 1992547
58279 1992547 1999599 2004668 2007969 2007264 2004346 2002486 2000224 1994923 1989964 1991081 1997842 2005899 2015332 2029583
58265 2029583 2048426 2069231 2092806 2120822 2150032 2176539 2203288 2235920 2273821 2312740 2353317
58254 2353317 2398916 2447870 2496202 2545508 2599713 2656476 2710130 2760620 2811056 2859246 2900621
58243 2900621 2937116 2974180 3011396 3044896 3076344 3110338 3145705 3178896 3213088 3253975 3299342
58232 3299342 3343150 3387335 3438975 3498272 3560281 3626089 3701003 3783591 3867835 3954439 4048977
58221D048977J02124J06106J14320J30880J46908J56322J66795J84520K02467
58212E359419K14639K27202K43795K54578K51914K42338K30995K09534J72316
58203G406730J29558R1517N4982J8201p445j4806j3775j2856m667J6151L8585
58192G702175N4141P1882R8951J24907J41992J61383J91679K21382K41277K63338
58182I273107K97531L31204L52655L73783M07225M42910M70298N01130N45844
58173A2995687N90843O24769O63288P21097P84724Q41401R08112J000834J101864
58164B0232619J190294J277077J375547J467104J534440J599222J686895J784548
58156C2147746J874982J978767K116625K265399K401640K552511K749483K970011
$$ plain form
58221 4048977 4151101 4257207 4371527 4502407 4649315 4805637 4972432 5156952 5359419
58212 5359419 5574058 5801260 6045055 6299633 6551547 6793885 7024880 7234414 7406730
58203 7406730 7536288 7627805 7682787 7700988 7693543 7678737 7664962 7652106 7647439 7663590 7702175
58192 7702175 7756316 7828198 7927149 8052056 8194048 8355431 8547110 8768492 9009769 9273107
58182 9273107 9570638 9901842 10254497 10628280 11035505 11478415 11948713 12449843 12995687
58173 12995687 13586530 14211299 14874587 15595684 16380408 17221809 18129921 19130755 20232619
58164 20232619 21422913 22699990 24075537 25542641 27077081 28676303 30363198 32147746
58156 32147746 34022728 36001495 38118120 40383519 42785159 45337670 48087153 51057164
58148E1057164L184209L418823L710797M041851M391322M807534N346820N991323
58140H5949843O716392P585618Q678190R980066J1459429J3179719J5202330J7458839
58132A76210426J9892123K2649367K5951723K9885402L4516152L9845736M4912175
58125C93863104M6897702M2177348K9301731J0974869p448031k1573997l0102139
58118D64090587l4055147l4960922l4012922l2136168k9985527k7802284k5573031
58111B45564586k3336241k1193264j9142285j7122101j5177813j3421260j1870980
58104A24300642j0471518r225240q170533p268178o437232n676214n036049m502046
58096F7513632m011341l560702l190602k884109k583439k288312k040070j825544
$$ plain form
58148 51057164 54241373 57660196 61370993 65412844 69804166 74611700 79958520 85949843
58140 85949843 92666235 100251853 108930043 118910109 130369538 143549257 158751587 176210426
58132 176210426 196102549 218751916 244703639 274589041 309105193 348950929 393863104
58125 393863104 440760806 482938154 512239885 523214754 515766723 494192726 464090587
58118 464090587 430035440 395074518 361061596 328925428 298939901 271137617 245564586
58111 245564586 222228345 201035081 181892796 164770695 149592882 136171622 124300642
58104 124300642 113829124 104603884 96433351 89165173 82727941 77051727 72015678 67513632
58096 67513632 63502291 59941589 56750987 53866878 51283439 48995127 46955057 45129513
58088D5129513j593432j351753j154204j001908q51241p05171n99902n11165l73585
58079C6987152j87718p973J70785M09071P07235J006533J310065J685575K142325
58070D4223050K636276L205718L940233M786459N584922O370338P364881Q432812
58062H6544689Q730287P284196M006713o5635l608635n941891p146909p577747
58054H2225068p503581p111895o572117n990932n392457m790444m229764l740879
58046C6892999l309043k913769k560801k256904j987476j739887j523731j349492
58038A9251896j207078j081426r72806q86250q14396p45648o79571o21604n70605
58029A1672512n23144m83024m55047m34274m11727l87182l67596l56092l50621
$$ plain form
58088 45129513 43536081 42184328 41030124 40028216 39176975 38471804 37871902 37360737 36987152
58079 36987152 36799434 36791461 36962246 37371317 38078552 39085085 40395150 42080725 44223050
58070 44223050 46859326 50065044 54005277 58791736 64376658 70746996 78111877 86544689
58062 86544689 95274976 102559172 106565885 106500250 102891615 96949724 89802815 82225068
58054 82225068 74721487 67609592 61037475 55046543 49654086 44863642 40633878 36892999
58046 36892999 33583956 30670187 28109386 25852482 23865006 22125119 20601388 19251896
58038 19251896 18044818 16963392 15990586 15104336 14289940 13544292 12864721 12243117 11672512
58029 11672512 11149368 10666344 10211297 9777023 9365296 8978114 8610518 8254426 7903805
58020G903805l50060l53064l53257l44123l27558l10396k93926k74321k52113
58011E044987k32928k18557k04905j89792j75874j64578j53679j42491j33454
58002C428729j26854j19657j11252j04831j01315r7479r1892q7242q4695q1376
57992B422136p5769p0419o6887o3079n8028n4213n2676n0834m7682m5956m6515
57981A790078m5933m2596l9784l9518l8826l5666l3058l3190l2786k8807k3934
57970A395980k1749k0993j9168j7421j7098j5844j2015q779q912r685p962o130
57958A230224p435r427q086m967m092m730l518j143o92j303M70M601Q377J1802
57944A210081J6932K3213K8560L3634M0328M7429N2385N5622N8571N9397N5471
$$ plain form
58020 7903805 7553745 7200681 6847424 6503301 6175743 5865347 5571421 5297100 5044987
58011 5044987 4812059 4593502 4388597 4198805 4022931 3858353 3704674 3562183 3428729
58002 3428729 3301875 3182218 3070966 2966135 2864820 2767341 2675449 2588207 2503512 2422136
57992 2422136 2346367 2275948 2209061 2145982 2087954 2033741 1981065 1930231 1882549 1836593 1790078
57981 1790078 1744145 1701549 1661765 1622247 1583421 1547755 1514697 1481507 1448721 1419914 1395980
57970 1395980 1374231 1353238 1334070 1316649 1299551 1283707 1271692 1262913 1254001 1244316 1236354 1230224
57958 1230224 1222789 1213362 1205276 1200309 1196217 1191487 1187969 1186826 1186134 1184831 1185301 1189902 1198279 1210081
57944 1210081 1227013 1250226 1278786 1312420 1352748 1400177 1452562 1508184 1566755 1626152 1681623
57933A681623M8109M0123L0849J8729O318l018j1209k2181l4236m2271m6265n0779
57921A615792n6523n9308n7643n5002n3508n1205m6837m2144l8150l3747k9152
57910A092573k6340k5138k2912j9029j5702j3705j1239p674m570k337L38L061
57898I47326L585J858M81K60j139n051r627j2793j4616j5836j6587j7141j7578
57885H43142j6685j3563r939q255p926o486l900k385k309j686L57K862N560Q943
57871G87730J2051J3444J3981J5458J7077J6797J5355J4978J4766J1865O891L417
57859I43810J825j369p257j2403j4388j5011j6261j7275j7346j8222k0905k3232
57847G81966k2968k1021j9577j9112j8813j8108j6524j3785j0864r257q818q259
$$ plain form
57933 1681623 1729732 1769855 1800704 1819433 1825751 1822733 1811524 1789343 1755107 1712836 1666571 1615792
57921 1615792 1559269 1499961 1442318 1387316 1333808 1282603 1235766 1193622 1155472 1121725 1092573
57910 1092573 1066233 1041095 1018183 999154 983452 969747 958508 950834 946264 943927 944265 947326
57898 947326 950911 952769 953250 953510 952371 947320 937693 924900 910284 894448 877861 860720 843142
57885 843142 826457 812894 802955 794700 786774 780288 776388 774003 771694 770008 770365 773227 778787 787730
57871 787730 799781 813225 827206 842664 859741 876538 891893 906871 921637 933502 940393 943810
57859 943810 945635 944266 937009 924606 910218 895207 878946 861671 844325 826103 805198 781966
57847 781966 758998 737977 718400 699288 680475 662367 645843 632058 621194 611937 603119 594860
57835E94860p804q669r932q948n571k727j965j422N92K878L772L770M214N272
57821E68320O480P547P721O291M330M010N516O697O290N259M321K567n51l931
57807F30867o451q044q555p500n643m725m998m909l723k552k191k061j703j375
57793E66437n75J869N570Q442R452R713J0341J1132J1732J2255J2305J1245R711
57780F79629Q980Q684P188M373J835J30j829m282n914o203o277o889p487p787
57766F64151q211q501p902o939o886p315o493m418k968k729k230q89m2l62o22
57751E97644j0N57K09o87j897l912o562q749r937j0186q930n864k903k617m462
57736E31694n163l223m52J324K400L376L913M125M924O199O800O804P493Q819
$$ plain form
57835 594860 587056 578387 568455 559507 553936 551209 549244 547822 548414 551292 555064 558834 563048 568320
57821 568320 574800 582347 590068 596359 600689 604699 610215 616912 623202 628461 632782 635349 634798 630867
57807 630867 624416 616372 607817 600317 594674 589949 584951 580042 576319 573767 571576 569515 567812 566437
57793 566437 565862 567731 573301 581743 591195 600908 611249 622381 634113 646368 658673 669918 679629
57780 679629 688609 697293 704481 708854 710689 710819 708990 704708 698794 692591 686314 679425 671938 664151
57766 664151 655940 647439 639537 632598 625712 618397 611904 607486 604518 601789 599559 598670 598628 598266 597644
57751 597644 597634 598191 598400 597713 595816 591904 585342 576593 566656 556470 547540 541676 538773 536156 531694
57736 531694 526531 523308 522856 524180 526580 529956 533869 537994 542918 549117 555917 562721 570214 579033
57722E79033R288Q711Q481Q807Q383P217P044Q408J0025J1383J3063J4209J2919
57709G06971R773P567O828N040J309j769k374k194l311n339p229r017j0332j0116
57695F85807r124r766j2088j3171j1806j0235r772q545n740m121n520p354o709
57682E71856m917m671n350m661k708j129J3J353J892N01j562k236j432o5J936
57667E48820M450N857N377M812N621O272N170M035N286P890R101Q843R058R888
57653F40480R936R500J0215J1848J2474J1666J0932J1177J2045J3474J5651J7731
57641G87129J8763J9548K1695K5258K9081L2676L5912L7919L8382L8863M0254
57630A125480L9937L4443K4691J5616J0536Q467P117N875N116M972N841Q519J2982
$$ plain form
57722 579033 588321 597032 605513 614320 622703 629920 636964 645372 655397 666780 679843 694052 706971
57709 706971 716744 724311 731139 736179 737488 735719 733345 731151 727840 722501 715272 706255 695923 685807
57695 685807 676683 666917 654829 641658 629852 619617 609845 601300 595560 591439 585919 578565 571856
57682 571856 566939 562268 556918 552257 549549 548420 548433 549786 551678 552179 550617 548381 546949 546884 548820
57667 548820 553270 559127 564504 569316 574937 581209 586379 590414 595700 603590 612691 621534 630592 640480
57653 640480 650416 659916 670131 681979 694453 706119 717051 728228 740273 753747 769398 787129
57641 787129 805892 825440 847135 872393 901474 934150 970062 1007981 1046363 1085226 1125480
57630 1125480 1165417 1199860 1224551 1240167 1250703 1259170 1266287 1272162 1277278 1282250 1288091 1296610 1309592
57617A309592J8295K4220L1703M1287N2221O3601P5430Q8096J01626J15833J30715
57606B052619J46484J63527J82131K01208K16564K20500K04252J63054J00953
57597C651292L0590l3759q4073j19883j43459j56436j60923j60279j56756j50263
57587B516051j40850j30552j21240j12624j03926r5668q8061p9596o9524o0017
57577A513993n3489m9057m4072l8057l2659k8517k4639k0510j6631j3177r918
57566A183267p223n480l894j296K167N482Q299J0731J2433J3274J4305J6656K0072
57553A268793K3679K7353L1230L4915L8394M2477M7185N1057N3491N6089N9883
57542A734546O2941O2788N9701N5209M8731L8401K4359Q618p595k3944l9031n0903
$$ plain form
57617 1309592 1327887 1352107 1383810 1425097 1477318 1540919 1616349 1704445 1806071 1921904 2052619
57606 2052619 2199103 2362630 2544761 2745969 2962533 3183033 3387285 3550339 3651292
57597 3651292 3681882 3648123 3564050 3444167 3300708 3144272 2983349 2823070 2666314 2516051
57587 2516051 2375201 2244649 2123409 2010785 1906859 1811191 1723130 1643534 1574010 1513993
57577 1513993 1460504 1411447 1367375 1329318 1296659 1268142 1243503 1222993 1206362 1193185 1183267
57566 1183267 1176044 1170564 1166670 1165374 1167541 1173023 1181322 1192053 1204486 1217760 1232065 1248721 1268793
57553 1268793 1292472 1319825 1351055 1385970 1424364 1466841 1514026 1565083 1618574 1674663 1734546
57542 1734546 1797487 1860275 1919976 1975185 2023916 2062317 2086676 2095294 2087699 2063755 2024724 1973821
57530A973821n9255o5139o9005p1026p2425p4070p4332p1081o5406o0701n8136
57519A233245n5613n1398m6337m1965l8550l5672l3197l1099k9399k8310k7547
57508H14158k6060k3597k1579k0884j9888j6681j2256r185p952p095o256o447
57496F36278p496p840o877n230k937J83K656K553O69j01J304L327M972O887Q876
57481F37224R315Q059P445R137J1919J3694J3790J2611J0763R366R527J0755J1467
57468G75072J1446J1993J3309J3897J3247J3011J4510J6919J8918K0477K2034
57457I44833K3457K4819K6843K9745L2922L6266M0265M4289M6523M6407M5512
57446A341881M4991M3548L8970L0683K0090R365K32p269j4973k4266l3539l9627
$$ plain form
57530 1973821 1914566 1849427 1780422 1709396 1636971 1562901 1488569 1417488 1352082 1291381 1233245
57519 1233245 1177632 1126234 1079897 1037932 999382 963710 930513 899414 870015 841705 814158
57508 814158 788098 764501 742922 722038 702150 685469 673213 664028 656076 648981 642725 636278
57496 636278 628782 620942 614065 608835 605898 606081 608737 611290 611959 611858 613162 616489 621461 628348 637224
57481 637224 646539 654598 662043 671180 683099 696793 710583 723194 733957 743323 752850 763605 775072
57468 775072 786518 798511 811820 825717 838964 851975 866485 883404 902322 922799 944833
57457 944833 968290 993109 1019952 1049697 1082619 1118885 1159150 1203439 1249962 1296369 1341881
57446 1341881 1386872 1430420 1469390 1500073 1520163 1529528 1529760 1522491 1507518 1483252 1449713 1410086
57434A410086m1855m2581m3504m3764m2412m0348l8507l6275l3188l0371k8782
57423I88499k7461k5113k2081j9304j6488j2852q786n411l206k031j799k166k358
57410H39443k043j602j024L86K719N126P289R769J2295J3485J3224J3587J6131
57397I28785J9870K3245K6506L0454L4315L6851L8530M0687M3238M5083M6128
57386A313692M7027M7204M4929L9474L1836K3179J3674L088q318j9527k9054l5786
57374A471418l9981m2883m5021m5688m4663m3202m2317m1101l8127l3793k9945
57363A024697k7598k6224k4864k2969k0543j8417j7718j8212j7899j5475j2334
57352H02444j0557r817q149n326l258k999l436l447l412l658l144r58J923L707
$$ plain form
57434 1410086 1368231 1325650 1282146 1238382 1195970 1155622 1117115 1080840 1047652 1017281 988499
57423 988499 961038 935925 913844 894540 878052 865200 856414 851003 847797 845766 843967 841801 839443
57410 839443 837400 835798 834774 835160 837879 843005 850294 860063 872358 885843 899067 912654 928785
57397 928785 948655 971900 998406 1028860 1063175 1100026 1138556 1179243 1222481 1267564 1313692
57386 1313692 1360719 1407923 1452852 1492326 1524162 1547341 1561015 1564103 1555785 1536258 1507204 1471418
57374 1471418 1431437 1388554 1343533 1297845 1253182 1209980 1167663 1126562 1088435 1054642 1024697
57363 1024697 997099 970875 946011 923042 902499 884082 866364 848152 830253 814778 802444
57352 802444 791887 782070 773921 768595 765337 762338 758902 755455 752043 748385 745241 744283 746206 749913
57338G49913L949L579L293K971K503K298K748L766M964O107P301Q739J0190J0958
57324H23279J0694J0137J0456J1681J2544J2079J0778R629Q813P912O965O379
57312I41346O113N838N760O394P448P857P195O251N819N656N172M425L841L441
57298A022556L153L380M457N875O874P614Q899J0813J2501J3329J3471J3373J3382
57285A139677J3912J5174J6610J7382J7422J7265J7026J6559J6507J7784J9803
57274A325121K0750K0211J9985K1362K3039K3035K1664K0988K1867K3008K2892
57263A563922K1492J9937J9232J9529K0230K0708K1032K1660K2525K3055K3143
57252A796465K3333K3788K4043K4065K4523K5636K6810K7883K9390L0969L1017
$$ plain form
57338 749913 753862 757441 760734 763705 766208 768506 771254 775020 779984 786091 793392 802131 812321 823279
57324 823279 833973 844110 854566 866247 878791 890870 901648 911277 920090 928002 934967 941346
57312 941346 947459 953297 959057 965451 972899 980756 987951 994202 1000021 1005677 1010849 1015274 1019115 1022556
57298 1022556 1025709 1029089 1033546 1039421 1046295 1053909 1062808 1073621 1086122 1099451 1112922 1126295 1139677
57285 1139677 1153589 1168763 1185373 1202755 1220177 1237442 1254468 1271027 1287534 1305318 1325121
57274 1325121 1345871 1366082 1386067 1407429 1430468 1453503 1475167 1496155 1518022 1541030 1563922
57263 1563922 1585414 1605351 1624583 1644112 1664342 1685050 1706082 1727742 1750267 1773322 1796465
57252 1796465 1819798 1843586 1867629 1891694 1916217 1941853 1968663 1996546 2025936 2056905 2087922
57241B087922K9064K7122K7293K9162L0941L2171L3602L5123L5657L4932L3867
57230B436856L3315L3619L5224L8403M2316M5321M6618M7045M8268N1315N5502
57219B913802N8586N8790N7008N6057N7241N8862N8788N7081N5043N2914M9991
57208C534163M6260M2605L9826L8326L8060L8243L8008L7837L8954M0780M0872
57197C973934L8446L5961L5659L6468L6122L4456L2458K9767K5690K1484J9065
57186D319510J8303J7850J7673J8459J9543J9993K1079K5051L1928L9747M7379
57175D596515N4684O0608O3892O5385O7004O8426O7312O2864N6753N0318M3134
57164E256895L4858K6497J9354J4161J1446J1355J3186J6328K1468K9683M0939
$$ plain form
57241 2087922 2116986 2144108 2171401 2200563 2231504 2263675 2297277 2332400 2368057 2402989 2436856
57230 2436856 2470171 2503790 2539014 2577417 2619733 2665054 2711672 2758717 2806985 2858300 2913802
57219 2913802 2972388 3031178 3088186 3144243 3201484 3260346 3319134 3376215 3431258 3484172 3534163
57208 3534163 3580423 3623028 3662854 3701180 3739240 3777483 3815491 3853328 3892282 3933062 3973934
57197 3973934 4012380 4048341 4084000 4120468 4156590 4191046 4223504 4253271 4278961 4300445 4319510
57186 4319510 4337813 4355663 4373336 4391795 4411338 4431331 4452410 4477461 4509389 4549136 4596515
57175 4596515 4651199 4711807 4775699 4841084 4908088 4976514 5043826 5106690 5163443 5213761 5256895
57164 5256895 5291753 5318250 5337604 5351765 5363211 5374566 5387752 5404080 5425548 5455231 5496170
57153E496170N4578P0408Q7867J05286J21576J37388J52883J65710J73375J76197
57143F741438J75696J71681J63649J53708J44895J37308J28728J18289J06823
57134H042215R4563Q1518O9367N9977N2676M5728L9538L5212L1014K3792J3443
57123H589043K578p748j8506k9301l8095m4406m9532n3678n5980n7358o0241o5200
57111H111576p0659p5979q2345r0704j01012j12957j25193j34943j40735j44357
57101G032692j47775j49908j49101j46590j44241j41099j35817j30233j26722
57092E761206j24381j21751j20470j21662j21678j16685j08712j01456r3008p9196
57082D652207o1751m6399l4677k4467j6772j4948j8656k5367l6101n2684p1407
$$ plain form
57153 5496170 5550748 5621156 5709023 5814309 5935885 6073273 6226156 6391866 6565241 6741438
57143 6741438 6917134 7088815 7252464 7406172 7551067 7688375 7817103 7935392 8042215
57134 8042215 8136778 8218296 8287663 8347640 8400316 8446044 8485582 8520794 8551808 8575600 8589043
57123 8589043 8591621 8583873 8565367 8536066 8497971 8453565 8404033 8350355 8294375 8237017 8176776 8111576
57111 8111576 8040917 7964938 7882593 7791889 7690877 7577920 7452727 7317784 7177049 7032692
57101 7032692 6884917 6735009 6585908 6439318 6295077 6153978 6018161 5887928 5761206
57092 5761206 5636825 5515074 5394604 5272942 5151264 5034579 4925867 4824411 4731403 4652207
57082 4652207 4590456 4544057 4509380 4484913 4468141 4453193 4434537 4409170 4373069 4320385 4248978
57071D248978q7078j01505j20061j41905j62000j80831k03053k28123k51495k73597
57061B499330k98539l26080l54800l91025m43954A71066d24529o90348q01639
57052a916516r23168j044945j169466j307634j461690j628113j813979k031641
57044a3297152k278573k541824k821824l133043l483986l878611m333652m867335
57036d0636000n471871o125636o831277p610730q467156r390610j0392639j1476845
57028a06402764j2572978j3571683j4433383j5154818j5565734j5273237j3962867
57021b06937464j1757142r186784o815434m964566l736612l090885k783642k349576
57013b51622105j310632N53031L145526O198104R393295J2395383J4888336J6656428
$$ plain form
57071 4248978 4161900 4060395 3940334 3798429 3636429 3455598 3252545 3024422 2772927 2499330
57061 2499330 2200791 1874711 1519911 1128886 684932 171066 -424529 -1114877 -1916516
57052 -1916516 -2839684 -3884629 -5054095 -6361729 -7823419 -9451532 -11265511 -13297152
57044 -13297152 -15575725 -18117549 -20939373 -24072416 -27556402 -31435013 -35768665 -40636000
57036 -40636000 -46107871 -52233507 -59064784 -66675514 -75142670 -84533280 -94925919 -106402764
57028 -106402764 -118975742 -132547425 -146980808 -162135626 -177701360 -192974597 -206937464
57021 -206937464 -218694606 -227881390 -234696824 -239661390 -243398002 -246488887 -249272529 -251622105
57013 -251622105 -252932737 -252379706 -249234180 -243036076 -233642781 -221247398 -206359062 -189702634
57005a89702634J7623997J7822273J7349564J6358556J5032894J3542559J2019456
56998g9953335J0562445R236527Q062113P027267O118988N332725M656892M070045
56990b4886333L557500L115514K737547K411448K131620J899312J708547J545031
56982e779814J400704J276991J172066h52769A35438R07847Q36732P70170P06857
56973C357044O50253N99686N49478M98301M50634M07981L67277L28728K96534
56964G505916K70748K46568K22451K01093J82055J61470J39632J20924J05543
56955I156400Q9004P0386N3420L8773K2759M575j2366k7212m2912n9854p4894
56944I218079q7444j00283j13843j26024j37846j53028j71556j89853k07495k27502
$$ plain form
57005 -189702634 -172078637 -154256364 -136906800 -120548244 -105515350 -91972791 -79953335
56998 -79953335 -69390890 -60154363 -52092250 -45064983 -38945995 -33613270 -28956378 -24886333
56990 -24886333 -21328833 -18213319 -15475772 -13064324 -10932704 -9033392 -7324845 -5779814
56982 -5779814 -4379110 -3102119 -1930053 -852769 135438 1043285 1880017 2650187 3357044
56973 3357044 4007297 4606983 5156461 5654762 6105396 6513377 6880654 7209382 7505916
56964 7505916 7776664 8023232 8245683 8446776 8628831 8790301 8929933 9050857 9156400
56955 9156400 9245404 9315790 9369210 9407983 9430742 9435317 9422951 9395739 9352827 9292973 9218079
56944 9218079 9130635 9030352 8916509 8790485 8652639 8499611 8328055 8138202 7930707 7703205
56934G703205k49785k70585k88742l06401l23082l34985l40639l41475l36467
56925D911044l21775k96460k63719k26494j86330j45954j08026p1591l3503P766
56915C264958N2812J02808J57662K18016K91220L82357M67654M88741L96082K01552
56905F023862k5402k15108l40204m06379m25626m10030l75925l37245k97871k57943
56895B932129k22524j97317j81085j68775j58228j48804j38004j24634j11513
56886A481245j00937r1290q1417p3691o9217o4747n8144n2148m8810m4952l7407
56875G58485k8534k2068j7264j1401m994n53J035l48n635j4189k2603k8423l2378
56862E71130l4976l4536l0867k7067k5069k2967j9136j5363j3333j1798r781q831
$$ plain form
56934 7703205 7453420 7182835 6894093 6587692 6264610 5929625 5588986 5247511 4911044
56925 4911044 4589269 4292809 4029090 3802596 3616266 3470312 3362286 3290695 3257192 3264958
56915 3264958 3317770 3420578 3578240 3796256 4087476 4469833 4937487 5426228 5822310 6023862
56905 6023862 5998460 5783352 5443148 5036769 4611143 4201113 3825188 3487943 3190072 2932129
56895 2932129 2709605 2512288 2331203 2162428 2004200 1855396 1717392 1592758 1481245
56886 1481245 1380308 1289018 1207601 1133910 1064693 999946 941802 889654 840844 795892 758485
56875 758485 729951 707883 690619 679218 674224 673671 674706 674358 668723 654534 631931 603508 571130
56862 571130 536154 501618 470751 443684 418615 395648 376512 361149 347816 336018 326237 317406
56850C17406r468r168o619m314m159m129k257l31n91j978k558k637k892k368q42
56835B63095j79r71r52J232L814N387P062R372J0802J1301J3126J5995J5700J0233
56821C65017L146j848n497r408j2211j2593j2210j2248j0811o910l190j425R09
56808B80721O050J1811J5568J8739K3489K8470L1766L4898M0008M5707M9001M8470
56796F34698M2869L0495J3452j257q845j1727j4080j5550j4309j2152j1465j0399
56784F21730o089J04N242R911J6144K3039K9087L5962M5315N4675O1605O8675
56772I65400P8246Q4713P8509N7116K7059l642k9705m7174n4635n6065n7146n8212
56760I84464n5240m7378l8556l1476k4895j7518j0043k583N930J4756K1510K6445
$$ plain form
56850 317406 307938 298770 292151 287837 283678 279549 277292 276961 276370 274392 271834 269197 266305 263937 263095
56835 263095 262916 261945 260993 262225 266039 271426 278488 287860 298662 309963 323089 339084 354784 365017
56821 365017 368163 366315 360818 351410 339199 326606 314396 302148 291337 284427 281237 279812 280721
56808 280721 286771 298582 314150 332889 356378 384848 416614 451512 491520 537227 586228 634698
56796 634698 677567 708062 721514 720257 711412 699685 685605 670055 655746 643594 632129 621730
56784 621730 615641 615745 620987 630898 647042 670081 699168 735130 780445 835120 896725 965400
56772 965400 1043646 1128359 1206868 1263984 1291043 1287401 1257696 1210522 1155887 1099822 1042676 984464
56760 984464 929224 881846 843290 811814 786919 769401 759358 756775 762705 777461 798971 825416
56748H25416L3249M3990N5402O1079N5986L9265J5042r406k8339m0819m8571n2267
56736I50027n1912m9065m5682m1573l5691k9110k4041k0609j7093j2588p288j114
56724F14261N644J1431J5390J8934K3064K5566K3331J6022N286p671k1043l1161
56712F99054l5584l6148l6063l5643l3686l0936k8811k6500k2817j9209j7430
56701C76227j6084j3219j0495j0647j2429j2371j0341q964q542p074m573l092
56689B58396k882k540k492m174o310o086l775k218k020j306P2K57p65j105q20
56674B22232j798l671l833j894l45l11l28K53J72r43j893k422l285l764k455n18
56658A95197o54k702l794l142k937m023m353k689n65M53O84P24L56m29j513l486
$$ plain form
56748 825416 858665 902655 958057 1019136 1075122 1114387 1129429 1120023 1091684 1050865 1002294 950027
56736 950027 898115 849050 803368 761795 726104 696994 672953 652344 635251 622663 615375 614261
56724 614261 619905 631336 646726 665660 688724 714290 737621 753643 758929 751258 730215 699054
56712 699054 663470 627322 591259 555616 521930 490994 462183 435683 412866 393657 376227
56701 376227 360143 346924 336429 325782 313353 300982 290641 281677 273135 266061 261488 258396
56689 258396 255514 252974 250482 246308 239998 233912 230137 227919 225899 224593 224665 224922 224157 223052 222232
56674 222232 220434 216763 212930 211036 210691 210380 210052 210305 210477 209534 207641 205219 201934 198170 195715 195197
56658 195197 194543 191841 188047 184905 181968 177945 173592 170903 170338 170791 171475 172199 172555 172126 170613 167127
56642A67127o112o881m067m21j16k688l943k534j168j177n15J870L958M326M220
56627A51879M551M225K813J863K193K599K372K408K977L071K746L308M492M341
56613A95838K791K542N075Q261R079O894L333O29L70K195L778L648L161L773M043
56598B55410K164k04l20P29k45k831l611k043j067j882k746l240m916p130o942
56583B21126m164k038j862j363L80R93o69k266j955r04l11L92J103N31o64o9K025
56566B10285K431M96n83P06J819J149Q47K397L584K357J3j886l991o279o469l894
56550B02982j478j303j538k24J375J729J895K736K589N86q33L07K158K334J738
56535B15053K266L269L241K736K927L329L332L788M910N089L828L288M652N772
$$ plain form
56642 167127 161015 154134 150067 149646 149530 146842 142899 140365 139197 138020 137505 139375 143333 147659 151879
56627 151879 156430 160655 163468 165331 167524 170123 172495 174903 177880 180951 183697 187005 191497 195838
56613 195838 198629 201171 206246 214507 223586 230480 233813 234442 234812 237007 240785 244433 247594 251367 255410
56598 255410 257574 257370 257050 257779 257534 254703 251092 249049 247982 246100 243354 240114 235198 228068 221126
56583 221126 216962 214924 213062 211699 212079 213072 212403 210137 208182 207278 206967 207359 208462 208993 208329 208260 210285
56566 210285 212716 213212 212629 213335 215154 216303 217150 219547 223131 225488 225501 223615 219624 213345 206876 202982
56550 202982 201504 200201 198663 198439 199814 201543 203438 206174 208763 209349 208516 208823 210981 213315 215053
56535 215053 217319 220588 223829 226565 229492 232821 236153 239941 244851 249940 253768 257056 261708 267480
56521B67480M855L643M176N129M392K930K940M034M349L904M127N258O506P533
56507C31256Q019P254N781N744P998J0620J1723J1775J1867J1879J1802J2536
56495D48254J4055J4976J5129J5936J7301J7288J6046J6415J8974K0126J7398
56484F31898J3047J0058Q064N950M988O140P172N770L064J132n71l432o703r100
56470F77477j1185j3594j5107j4901j4409j4721j4587j3320j2892j4661j6697
56459E21403j6792j5545j4121j2016r428q626j0158j0910q847o385o053o281m951
56446C91290l677m587n940n032k901k069k165j662j513l045m586m182l342l992
56432C42597m156j177K831L466N39k277l125l189l251k996k819l083k576o97M78
$$ plain form
56521 267480 272335 275978 280154 285283 289675 292605 295545 299579 303928 307832 311959 317217 323723 331256
56507 331256 339275 346529 352310 358054 366052 376672 388395 400170 412037 423916 435718 448254
56495 448254 462309 477285 492414 508350 525651 542939 558985 575400 594374 614500 631898
56484 631898 644945 655003 663067 669017 674005 680145 687317 693087 696151 697283 696712 693280 686577 677477
56470 677477 666292 652698 637591 622690 608281 593560 578973 565653 552761 538100 521403
56459 521403 504611 489066 474945 462929 453501 444875 434717 423807 414960 408575 402522 396241 391290
56446 391290 387613 383026 377086 372054 369153 367084 364919 363257 361744 358699 354113 349931 346589 342597
56432 342597 338441 337264 340095 343561 344100 341823 338698 335509 332258 329262 326443 323360 320784 320087 320565
56417C20565o85k174j531p3k80j197m38J244J561J112J897L102K673J638K430
56402C29844M205M260L058L407N339O224N426M835N119N106M515M022L340K327
56388C91027K807N910Q921Q492N633L907M028M166M142N125O267N854M866N279
56374D66424N923M330J597Q79J835J331q20j550J55K023K658K686J784j221m970
56359D83064o346n073l995m571n511n989o675p265o392m264k621k084k149l173
56345D16956n331o513m631j348n0q44j056J05J006J101J184P72j083k943k650
56330C94675j297j798m030n243m751m479n135n560n379m870k967Q64L828K933
56316C56791O6m14J625K403O41j030j036n47L0J820M247N044L927K790K180J059
$$ plain form
56417 320565 319880 317706 316175 316102 315822 314625 314187 315431 316992 318104 320001 323103 325776 327414 329844
56402 329844 334049 338309 341367 344774 350113 356337 361763 366598 371717 376823 381338 385360 388700 391027
56388 391027 393834 399744 408665 417157 422790 426697 430725 434891 439033 444158 450425 456279 461145 466424
56374 466424 472347 476677 478274 479153 480988 482319 481499 479949 480104 482127 484785 487471 489255 488034 483064
56359 483064 476718 471645 467650 463079 457568 451579 444904 437639 431247 426983 424362 422278 420129 416956
56345 416956 411625 405112 400481 399133 399083 398239 397183 397288 398294 399395 400579 401351 400268 397325 394675
56330 394675 393378 391580 387550 382307 377556 373077 367942 362382 357003 352133 349166 350030 353858 356791
56316 356791 356857 356443 358068 360471 361112 360082 359046 358499 358529 360349 364596 369640 373567 376357 378537 379596
56300C79596j81j63L98k36j208l53J546J838P50P91K129K823L055M591O535O255
56284D08166M114K701K005J04j943j105J947L413K648K696M592O152O655P479
56270D49624Q062O482M180M627P025P107M659M261P465J0309J0056Q791Q420P569
56256E48637N534M427N154N741N471O361Q725R687P969O094O003O330N701N149
56242F36983N610O348O876P442P117M750J888J038J384K57j622j213R91J336o98
56227F78487j902j204q31j282n97J019J244P10K305N172N348K884K165M312N598
56212G03428M454L740M778N443N521P645J1482J3339J3008J4454J8103J9397J7007
56199H41799J5614J7967K0850K1604K2301K4574K6559K7667L0340L4433L6065
$$ plain form
56300 379596 379415 379252 379650 379414 378206 377853 379399 381237 381987 382778 384907 387730 390785 395376 401911 408166
56284 408166 412280 414981 416986 417090 415147 414042 415989 419402 422050 424746 429338 435490 442145 449624
56270 449624 457686 464168 468348 472975 480000 487107 491766 496027 503492 513801 523857 532648 541068 548637
56256 548637 554171 558598 563752 569493 574964 581325 590050 599737 607706 613800 619803 626133 631834 636983
56242 636983 642593 648941 655817 663259 670376 675126 677014 678052 679436 679693 678071 676858 677849 679185 678487
56227 678487 676585 675381 674550 673268 672671 673690 674934 675644 677949 683121 688469 691353 693518 697830 703428
56212 703428 707882 711622 716400 721843 727364 735009 746491 759830 772838 787292 805395 824792 841799
56199 841799 857413 875380 896230 917834 940135 964709 991268 1018935 1049275 1083708 1119773
56188A119773L4615L4565L7636L9624L7909L5550L4707L2665K7830K3350K1019
56177A479243J7880J2432Q015O287L670j740n893n623l967m480n918o488p685
56164A485733r905r908o865n368q318j2222j3397j3299j3881j3558j1857j2241
56152A354914j6014j9076j8750j8136j9617k0180j7611j5238j5827j6595j4944
56141A162926j3375j3943j3781j0958q956j0300j1546r608p365p848q580o888
56129A039778n278o272p337o039m797n638n834l668k537m318m865j473J569N15
56115I83806j083Q13L428K990J880L510N682N437N051P017Q543P126N986P877
56101A048063R400P596O123Q454J1164J0713J0498J4091J7765J7253J5844J8026
$$ plain form
56188 1119773 1154388 1188953 1226589 1266213 1304122 1339672 1374379 1407044 1434874 1458224 1479243
56177 1479243 1497123 1509555 1517570 1523857 1527527 1525787 1519894 1514271 1510304 1505824 1499906 1493418 1485733
56164 1485733 1475828 1465920 1459055 1453687 1445369 1433147 1419750 1406451 1392570 1379012 1367155 1354914
56152 1354914 1338900 1319824 1301074 1282938 1263321 1243141 1225530 1210292 1194465 1177870 1162926
56141 1162926 1149551 1135608 1121827 1110869 1101913 1091613 1080067 1070459 1063094 1055246 1046666 1039778
56129 1039778 1034500 1028228 1020891 1014852 1010055 1004417 998583 994915 992378 988060 983195 981722 983291 983806
56115 983806 982723 983536 986964 989954 991834 995344 1001026 1006463 1011514 1018531 1027074 1034200 1040186 1048063
56101 1048063 1057463 1065059 1071182 1079636 1090800 1101513 1112011 1126102 1143867 1161120 1176964 1194990
56089A194990K1070K0910K0482K3852K7606K6711K4030K5472L0255L4279L8656
56078A488313M6451N5117O0457O4360P0944P8841Q4635Q9908R7725J06377J13599
56067B356727J22457J36306J52816J69690J90631K18325K47133K70071K87036
56058D151192K98561K98200K80408K50460K18083J86747J57319J35359J24618
56049F100947J18450J07245Q9818O9533M5726J8317n449j9308k7908l9359n3971
56038F404041o9890r2773j28237j69876k05704k31806k50003k58161k53898k42399
56028D501294k29705k13399j90094j65760j47722j32836j14986r7627q6914p9104
56018C043147o7489n5617n0576m9235m4290l7998l6387l5808k9276k0664j8352
$$ plain form
56089 1194990 1216060 1236970 1257452 1281304 1308910 1335621 1359651 1385123 1415378 1449657 1488313
56078 1488313 1534764 1589881 1650338 1714698 1785642 1864483 1949118 2039026 2136751 2243128 2356727
56067 2356727 2479184 2615490 2768306 2937996 3128627 3346952 3594085 3864156 4151192
56058 4151192 4449753 4747953 5028361 5278821 5496904 5683651 5840970 5976329 6100947
56049 6100947 6219397 6326642 6416460 6485993 6531719 6550036 6544587 6525279 6497371 6458012 6404041
56038 6404041 6334151 6241378 6113141 5943265 5737561 5505755 5255752 4997591 4743693 4501294
56028 4501294 4271589 4058190 3868096 3702336 3554614 3421778 3306792 3209165 3122251 3043147
56018 3043147 2975658 2920041 2869465 2820230 2775940 2737942 2701555 2665747 2636471 2615807 2597455
56007B597455j9893j7037j0960q410p750k966L435N595O946J3666K1231K1892
55995B603204J9491K2148K6819K6476K5520L1504L8690L7361L2690L6092M4257
55984B944252M5889M3126M6339N3118N2997M8518N0850N8328O0076N7320O0450
55973C521263O8251P0817O9776P4738Q3123Q4655Q2301Q7267R6844R9261R6751
55962D435047J00970J09442J10240J06549J12168J25560J33184J35612J45206
55953E513978J60667J69777J74636J87836K06382K16462K21321K36434K59798
55944G347291K75779K85632L04324L29901L47127L59097L83133M17496M45017
55935A0494797M67494N02093N46069N80976O09985O53784P11406P63902Q14887
$$ plain form
56007 2597455 2577562 2560525 2549565 2541155 2533405 2530439 2533874 2539469 2546415 2560081 2581312 2603204
55995 2603204 2622695 2644843 2671662 2698138 2723658 2755162 2793852 2831213 2863903 2899995 2944252
55984 2944252 2990141 3033267 3079606 3132724 3185721 3234239 3285089 3343417 3403493 3460813 3521263
55973 3521263 3589514 3660331 3730107 3804845 3887968 3972623 4054924 4142191 4239035 4338296 4435047
55962 4435047 4536017 4645459 4755699 4862248 4974416 5099976 5233160 5368772 5513978
55953 5513978 5674645 5844422 6019058 6206894 6413276 6629738 6851059 7087493 7347291
55944 7347291 7623070 7908702 8213026 8542927 8890054 9249151 9632284 10049780 10494797
55935 10494797 10962291 11464384 12010453 12591429 13201414 13855198 14566604 15330506 16145393
55926A6145393Q86284R75130J056965J130683J215513J305446J374932J429497
55918B5519843J500760J591212J676309J760359J873314K011595K143118K272817
55910D0349327K438598K639862K839613L041463L290334L592414L915709M276266
55902F6383586M736118N308874N964804O737929P717672Q920562J0290921J1843473
55894A27903939J3669626J5794556J8201397K1012090K4417438K8375729L2629077
55887B82003852L7000983M1105997M3388017M1036962L1902162J6846458k16912
55880D93067519j4928509k5055393l0764032l3222243l3505599l2450896l0725927
55873B92414920k8707490k6490230k4127580k1747587j9439306j7207452j5088448
$$ plain form
55926 16145393 17031677 18006807 19063772 20194455 21409968 22715414 24090346 25519843
55918 25519843 27020603 28611815 30288124 32048483 33921797 35933392 38076510 40349327
55910 40349327 42787925 45427787 48267400 51308863 54599197 58191611 62107320 66383586
55902 66383586 71119704 76428578 82393382 89131311 96848983 105769545 116060466 127903939
55894 127903939 141573565 157368121 175569518 196581608 220999046 249374775 282003852
55887 282003852 319004835 360110832 403498849 444535811 476437973 493284431 493067519
55880 493067519 478139010 453083617 422319585 389097342 355591743 323140847 292414920
55873 292414920 263707430 237217200 213089620 191342033 171902727 154695275 139606827
55866A39606827j3183943j1544562j0127482q893828p851066o980137o215973
55859G4809836n527578m939579m454571m027212l633306l295267l020161k775481
55851D3136681k543921k343683k177794k017820j853782j709382j593291j483537
55843B7413471j372982j282896j217735j151599j073521j003948r53002r03103
55835A8454685q46053p97953p63862p25157o75510o33791o08001n80655n43047
55826A2280656n10854m92232m72100m41919m15199l99798l83082l57740l35459
55817H472273l22231l05830k80204k57597k44604k29942k07305j87214j75095
55808F262251j60158j36985j16391j04704r3667q0915p8897r2822j10367j23384
$$ plain form
55866 139606827 126422884 114878322 104750840 95857012 88005946 81025809 74809836
55859 74809836 69282258 64342679 59888108 55860896 52227590 48932323 45912162 43136681
55851 43136681 40592760 38249077 36071283 34053463 32199681 30490299 28897008 27413471
55843 27413471 26040489 24757593 23539858 22388259 21314738 20310790 19357788 18454685
55835 18454685 17608632 16810679 16046817 15321660 14646150 14012359 13404358 12823703 12280656
55826 12280656 11769802 11277570 10805470 10363551 9948352 9548554 9165472 8807732 8472273
55817 8472273 8150042 7844212 7564008 7306411 7061807 6831865 6624560 6437346 6262251
55808 6262251 6102093 5965108 5848717 5744013 5650346 5569431 5490534 5397712 5287345 5163961
55798E163961j39728j63452j83493j92809j99631k09006k11753k02450j90543
55789C471096j82931j72667j55261j39492j31530j24100j11388r9399r2148q2845
55779B179335o8184n6373n1771m6317l5108k5704k2851j8622p246M410J0587J7081
55767A879237K8446L7664L7912L2421K4398R936j0639k7208l4339l9222m7222
55756A891384n2349n0515m9013n3311n6713n3019m7881m7676m8041m3298l7189
55745A352379l4673l2522k7124k2431k1577j9637j2856o175l859j757L575P380
55733A180723O038M597P267R376O509K856K858L283Q91o67J104J506k204m459
55719A219678j427J624K41r68K250N063K163l347p409j2807k1678k8576k9231
$$ plain form
55798 5163961 5024233 4860781 4677288 4484479 4284848 4075842 3864089 3661639 3471096
55789 3471096 3288165 3115498 2960237 2820745 2689215 2565115 2453727 2354328 2262180 2179335
55779 2179335 2111151 2054778 2003007 1956690 1921582 1895878 1873027 1854405 1847159 1851569 1862156 1879237
55767 1879237 1907683 1945347 1983259 2015680 2040078 2050014 2039375 2012167 1977828 1938606 1891384
55756 1891384 1839035 1788520 1739507 1686196 1629483 1576464 1528583 1480907 1432866 1389568 1352379
55745 1352379 1317706 1285184 1258060 1235629 1214052 1194415 1181559 1175384 1171525 1169768 1173343 1180723
55733 1180723 1186761 1191358 1198625 1208001 1214510 1217366 1220224 1223507 1224398 1223731 1224835 1226341 1224137 1219678
55719 1219678 1218251 1219875 1220116 1219148 1221398 1226461 1228624 1225277 1217868 1205061 1183383 1154807 1125576
55706A125576k8258l0332l1729k8555k5218k6231k7385k3627j8394j6741j6276
55695H52830j3377j1293j3495j5654j2853q456p501p610m855k483n202j0445j3365
55682G26241j5109j8330k0335j8669j7590k0886k3803k0614j4788j3140j4775
55671E28202j4362j1912j1027j1354j0624j0397j2460j3491j0338o555o849r263
55659C99570r599r042j0407j1428q965n645n377o427n625m848o476p280m014l57
55645C04080q27k494m18L218L400J432J520K175n96m856n790m363m903o709n873
55630B78996l148k393l267k628j060j102j229J549N373O468O084P773J0246R710
55616C11372P201O720Q080Q050O608N782M388K84m255n762n920q415j1763j1756
$$ plain form
55706 1125576 1097318 1066986 1035257 1006702 981484 955253 927868 904241 885847 869106 852830
55695 852830 839453 828160 814665 799011 786158 777702 770201 762591 757736 755253 750051 739606 726241
55682 726241 711132 692802 672467 653798 636208 615322 591519 570905 556117 542977 528202
55671 528202 513840 501928 490901 479547 468923 458526 446066 432575 422237 415682 408833 399570
55659 399570 389971 380929 370522 359094 350129 344484 339107 332680 327055 322207 315731 308451 304437 304080
55645 304080 303253 300759 300341 303559 306959 308391 309911 312086 311490 306634 300844 296481 291578 284869 278996
55630 278996 275848 273455 270188 267560 266500 265398 264169 265718 271091 277559 283643 291416 301662 311372
55616 311372 318573 325293 333373 341423 348031 353813 358201 358485 354230 348468 342548 334133 322370 310614
55602C10614q992p432p400o443n241o251q113p651n844n823o592m763r24J566
55588B30711K445L599M223K518K52M8M29j039k381q44J175J76j550k0K348L28
55572B42418m717o841n216m122m660m164k889l563m814k555K215M171K133L5m18
55557B07013j274k674k476j677l503o881p332m631l048l660l042k68J345N36M7
55542A68475J119J719J300J803L087K718J089J387L701M632L484L389N290O301
55528B09494N213M404M972N038M142M417O083O527N308N521Q603J2084J3908J5014
55514C10728J6359J7343J8371K1255K5865K9898L2851L6824M2568M8196N2399
55503F52657N5601N7437N6492N2883M7918M1086L0644J7178L179j0579k4695l7591
$$ plain form
55602 310614 301622 294190 286790 280347 275106 268855 260742 253091 247247 241424 234832 230069 229145 230711
55588 230711 233156 236755 240978 243496 243748 243796 244225 243186 240805 239961 241136 241312 239762 239742 242090 242418
55572 242418 237701 230860 225644 221522 216862 212698 209809 206246 201432 198877 201092 205263 207396 207431 207013
55557 207013 205739 203065 200589 198912 195409 188528 181196 176565 173517 169857 166815 166547 167892 168428 168475
55542 168475 169594 171313 172613 174416 177503 180221 181310 182697 186398 191030 194514 197903 203193 209494
55528 209494 214707 219111 224083 229121 233263 237680 243763 250290 255598 261119 269722 281806 295714 310728
55514 310728 327087 344430 362801 384056 409921 439819 472670 509494 552062 600258 652657
55503 652657 708258 765695 822187 875070 922988 964074 994718 1011896 1015075 1004496 979801 942210
55491I42210m6289n0696n3383n5260n5051n2742m9818m6406m1768l7081l4051
55480D19665l1699k8171k4635k3127k2048j8628j4535j3600j4964j4281j1292
55469B02685j0039j1448j1772r331o950o433n936m436l798m742n150m009l101
55456A15540l529m238m772n750o157m065m40J667J836K249L129K741J682K237
55442A02130L504K297r59k409j178j92k53R43L120K761n45k853k512k414l907
55427I7533m226k214j040k650m502m395l838m151l874k507k248l551l527j248
55413E3562J1j493k664j036Q70nk304l169k585j742k99J686K291R77K89J637K573
55396D8599R97j173j423p91j444k665k368n90J236K613L507L301K121J342J364
$$ plain form
55491 942210 895921 845225 791842 736582 681531 628789 578971 532565 490797 453716 419665
55480 419665 387966 359795 335160 312033 289985 271357 256822 243222 228258 213977 202685
55469 202685 192646 181198 169426 160095 153145 146712 140776 136340 132542 127800 122650 118641 115540
55456 115540 112011 107773 103001 97251 91094 87029 86589 88256 90092 92341 95470 98211 99893 102130
55442 102130 105634 107931 106972 104563 103385 103193 102940 103883 107003 109764 109219 106366 103854 101440 97533
55427 97533 93307 91093 90053 87403 82901 78506 74668 70517 66643 64136 61888 58337 54810 53562
55413 53562 53573 52080 49416 48380 49250 49245 46941 43772 41187 39445 39146 40832 43123 44100 44389 46026 48599
55396 48599 49596 48423 47000 46209 44765 42100 39732 39142 40378 42991 46498 49799 51920 53262 54626
55381E4626Q43p15j939k217k697l602l368j563J38R58J931L011K529O29k31O26
55365D8959J051K23K1Q73L59k219l871k616n00K34L71J096J607J503K069L229
55349E2389K723K63j153l6J388J741K981N860P206M901J672O69R17K72n77n04
55333H0712r09k839m172l122j610j817k397j488n60j584l025k486r92j046k395
55318E0270l095k933k606j488P14K049J063n33p45o29j813k911j783M77J032o22
55302C6447k795m245m272k136J217K849J661K57O39Q36j272l636l141o85N54k7
55286B2251q60j713l104l669j779J322L025L059K847K573J728J189J836K356J223
55271C2284m14n39M19P29L78K70r4j287j851l63J638J618l00k162l160l299j831
$$ plain form
55381 54626 55469 54754 52815 50598 47901 44299 40931 39368 39506 40464 42395 45406 47935 48564 48333 48959
55365 48959 50010 50233 50254 51127 51486 49267 45396 42780 42280 42514 42885 43981 45588 47091 49160 52389
55349 52389 55112 55375 54222 54186 55574 57315 60296 66156 73362 78263 79935 80604 81521 81793 81216 80712
55333 80712 79803 76964 72792 69670 68060 66243 63846 62358 61798 60214 57189 54703 53711 52665 50270
55318 50270 47175 44242 41636 40148 40862 42911 43974 43441 42696 42067 40254 37343 35560 36037 37069 36447
55302 36447 33652 29407 25135 22999 24216 27065 28726 28983 29622 30458 29186 25550 22409 21724 22278 22251
55286 22251 21391 19678 16574 12905 11126 12448 15473 18532 21379 23952 25680 26869 28705 31061 32284
55271 32284 31870 31331 31750 32479 32857 33127 33033 31746 29895 29532 31170 32788 32488 30326 27166 23867 22036
55254B2036J109K968J884j12N0J901K669J718O85M22O82J670L048K834J33k501
55238D1196k334n63o5p34n40L38J28q37q34k39o08j026P01L678M519K415R6m62
55220D4829j38j47l83o76j197j345l98P04L14j310k427k458k113j509l67M58M2
55203C1879n58L39K082K454J028n13j057r41n87k12m19j195j135M83J873J204
55187C4725m51r54o34j173k069j411L93R06m25j536j083lM90L40j39o64o37J26
55169B5801P02L80r0O0K08j11J43J383J823M16n42J347M333M768K289m98k339
55152D0073l732l909j369K702M997M361K662J392K17j056j756j806j664r75N89
55137D0726J787J399N26Q92J764J327J68K29J167J044J2j31M03k38j688j588J95
$$ plain form
55254 22036 23145 26113 27997 27885 27935 29836 32505 34223 34908 35330 36012 37682 40730 43564 43697 41196
55238 41196 38862 38299 38234 37500 36960 37298 37426 36589 35755 35516 34908 33882 34583 38261 42780 45195 45291 44829
55220 44829 44691 44544 44161 43485 42288 40943 40545 41249 41563 40253 37826 35368 33255 31746 31379 31837 31879
55203 31879 31321 31660 33742 36196 37224 36711 35654 34713 34126 33914 33495 32300 31165 31648 33521 34725
55187 34725 34274 33320 32686 31513 29444 28033 28426 29332 28907 27371 26288 26285 26775 27115 26976 26312 25675 25801
55169 25801 26503 26883 26793 26853 27061 26950 27093 28476 30299 30715 30173 31520 35853 40621 42910 42412 40073
55152 40073 36341 32432 31063 33765 38762 43123 45785 47177 47394 46338 44582 42776 41112 40137 40726
55137 40726 42513 43912 44438 45330 47094 48421 48589 48818 49985 51029 51041 50910 51313 51075 49387 47799 47994
55120D7994J067k9j182r64l09k21l05l36q13j447j237l85j2m1M02Q68K96m75K98
55101D3169K020K323P10j094k117k682k420q00O14k92k570l319k194j378j379
55086B8591m84J464K559K361K219J856m31l637m303j750Q75J732K350L463L216
55071D0081J334P31K642M036K483R2k95M01n9r67k33J713K802K704K617K699K196
55054F4977J274Q09Q66R27R26R24Q57J339L368O319P763O471M030K513K038J807
55038A07208J783J930J172j209m003n213m200k107o44p95j904k164r29mj158l099
55022H4664l228j789j335k186j818N91K372J510l68r08m16m54j114j503j358o82
55006G1978P34K266K455J101k41n94n78m39O71K425K817J188m21m27L4l90q01
$$ plain form
55120 47994 49061 49032 47850 46886 46577 46356 46051 45715 44902 43455 42218 41833 41821 41780 42182 43050 43346 42871 43169
55101 43169 45189 47512 48222 47128 45011 42329 39909 39109 39723 39431 36861 33542 31348 29970 28591
55086 28591 28107 29571 32130 34491 36710 38566 38135 34498 30195 28445 29320 31052 33402 36865 40081
55071 40081 41415 42146 44788 48824 51307 51399 51104 51505 51446 50479 50246 51959 54761 57465 60082 62781 64977
55054 64977 66251 67060 67926 68853 69779 70703 71560 72899 76267 82586 90349 96820 100850 103363 105401 107208
55038 107208 108991 110921 112093 110884 106881 101668 97468 95361 94717 93922 92018 89854 88925 88921 87763 84664
55022 84664 81436 79647 78312 76126 74308 74899 77271 78781 78413 77505 77089 76635 75521 74018 72660 71978
55006 71978 72712 74978 77433 78534 78293 77699 77121 76682 77353 79778 82595 83783 83362 82935 82969 82579 81778
54989H1778nJ013P42j90j46Q60J530J457J228J047O29L8l71l88J59J241K155K215
54971I4992J955K319K765K010N45K50J267J603L76r62j166n09J076M345Q233R803
54955A28902Q037N173L142J414l42o30Q92J711J32j876j902p25k97l85N3J85r49
54938A42535j720o7K729L498J676l35q96p11r03j595k493l237l347k900k835l486
54922A25913l654k246k8J394J515Q49j00p47l91O93J226O96q1o60j422j737j00
54905A21120K709L308L99k695k497p4J291J128J309K144K230J535J564K599L418
54890A39488L581L849M408M672M690N003N363N288N531P144R424J0523J0055R468
54876B28487R991J1483J3236J4652J5269J5131J4785J4292J2834J0079O941M015
$$ plain form
54989 81778 81773 82786 83528 83338 83192 84052 85582 87039 88267 89314 89943 89981 89610 89222 89381 90622 92777 94992
54971 94992 96947 99266 102031 104041 104586 104836 106103 107706 108082 107120 105954 105445 106521 110866 119099 128902
54955 128902 136939 142112 145254 146668 146326 145696 146588 148299 148431 146555 144653 143928 143631 143246 143299 143484 142535
54938 142535 140815 140748 143477 146975 148651 148316 147420 146709 145806 144211 141718 138481 135134 132234 129399 125913
54922 125913 122259 120013 119985 121379 122894 123743 123643 122896 122505 123198 124424 125120 125039 124379 122957 121220 121120
54905 121120 123829 127137 127536 124841 122344 122270 123561 124689 125998 128142 130372 131907 133471 136070 139488
54890 139488 143069 146918 151326 155998 160688 165691 171054 176342 181873 189017 198441 208964 219019 228487
54876 228487 238478 249961 263197 277849 293118 308249 323034 337326 350160 360239 367180 371195
54864C71195M84m182q609j1153j2158j3125j4441j5382j5589j5137j3972j2506
54852B35425j1857j2148j1737r540p000o005n944m760k142J93J016O84J23J69
54838A66477J441L608N257N598N680O884R090J1290J2970J3856J3483J2301J1841
54825B79776J2531J2657J0830P933N154J844k699o926q891r186r928j1668j3309
54812B68118j4035j3496j1311q299o825p768q625o926l951k407j986n65J440J578
54798A84942j89j227m54M60M47N36J345J830J423J040J163R44j18j374k345l211
54782A85212l763l620l551m693o383o747n587m634m730m824m094l171k737k630
54768A24048k699k940k748j734j173k548m628m444j620P32K75j562k072q79K65
$$ plain form
54864 371195 371679 367497 358888 347735 335577 322452 308011 292629 277040 261903 247931 235425
54852 235425 223568 211420 199683 190143 183143 177138 171194 166434 164292 164485 165501 166185 166308 166477
54838 166477 167918 171526 176783 182381 188061 194945 204035 215325 228295 242151 255634 267935 279776
54825 279776 292307 304964 315794 323727 328881 330725 328026 321100 312209 303023 293095 281427 268118
54812 268118 254083 240587 229276 220977 214152 206384 197759 190833 186882 184475 182489 181924 183364 184942
54798 184942 184753 183526 183072 183532 183979 184515 185860 187690 189113 190153 191316 192260 192142 190768 188423 185212
54782 185212 181449 177829 174278 169585 163202 156455 150868 146234 141504 136680 132586 129415 126678 124048
54768 124048 121349 118409 115661 113927 112754 110206 105578 101134 99514 100246 100521 98959 96887 96008 96273
54753I6273Q9j056j830j052J105K860K663J152J99K51K38j23J95J566L082M134
54737A09746M877M980L888K661L295N614O949N922M375M437N618O395O937Q390
54723A84084J0573J2252J3165J4205J5884J7705J8948J9244J8608J7452J6307
54712C58427J5159J3392J0697P536M406J239k118n308p696q758q165o044l325
54699C69442j311n77n81l42Q55L218O261Q989J0674J1357J1221J0098Q169O469
54685D43942N687N029L269N20k050l754m577m375l185j862j068j09J743L363L006
54670D45579J087k57n20j669n130r798j3765j6444j8132j8801j8456j7803j7451
54657C08440j6979j5513j3152j1231j1047j2311j2946j0989o998l759l149m186
$$ plain form
54753 96273 96362 95306 93476 92424 93529 96389 99052 100204 100403 100654 100892 100769 100964 102530 105612 109746
54737 109746 114623 119603 123491 126152 129447 135061 142010 147932 152307 156744 162362 168757 175694 184084
54723 184084 194657 206909 220074 234279 250163 267868 286816 306060 324668 342120 358427
54712 358427 373586 386978 397675 405211 409617 410856 408738 403430 395734 386976 378811 372767 369442
54699 369442 368131 367554 366973 366631 367486 370704 376965 385954 396628 407985 419206 429304 437473 443942
54685 443942 449629 454658 457927 458447 456397 452643 448066 443691 440506 438644 437576 437467 439210 442573 445579
54670 445579 446666 446409 445889 444220 439090 429292 415527 399083 380951 362150 343694 325891 308440
54657 308440 291461 275948 262796 251565 240518 228207 215261 204272 197274 193515 190366 186180
54645A86180m944n153n605n975n091k921o31J015J966K032J276P50J221J748J160
54630A67028M09J263L140L587J926N4o09o00l94P16K729M072L823L197L684N067
54614A99092O324P194P805P764O716N113L769L218L671M858N819N834N569O086
54600B78832O776N860L246J254J815M254O453P253P149P515R416J2416J4659J5082
54586C81980J5174J7000K0022K1905K2435K4024K7748L1296L2224L1020K9316
54575F54144K6714K1458J3337M149m344j1495j7075k0909k3396k5453k7416k8282
54563E61432k6559k2246j7735j5803j6408j6604j4422j1505j0559j1414j1675
54552C86502j0491r269q905q668q169q083q432q162p176o869p875q932q850q124
$$ plain form
54645 186180 181236 176083 170478 164503 159412 156491 155860 156875 158841 160873 162149 162899 164120 165868 167028
54630 167028 167437 168700 171840 175427 177353 177407 176798 176198 175804 176520 179249 183321 187144 190341 194025 199092
54614 199092 205416 212610 220415 228179 234895 240008 243777 246995 250666 255524 261343 267177 272746 278832
54600 278832 285608 291468 294714 295968 297783 302037 308490 315743 322892 330407 339823 352239 366898 381980
54586 381980 397154 414154 434176 456081 478516 502540 530288 561584 593808 624828 654144
54575 654144 680858 702316 715653 719802 715458 703963 686888 665979 642583 617130 589714 561432
54563 561432 534873 512627 494892 479089 462681 446077 431655 420150 409591 398177 386502
54552 386502 376011 366742 357837 349169 341000 332917 324485 316323 309147 302278 294403 285471 276621 268497
54538B68497p833q136q549q486p166m384j686j263l139m925m817l415k062j043
54524B01593p6P63J345J590J094k42j288r35j15p05k384k809j088J110K310K676
54508B02839K243L87k049k699j034N27J62r41j000j61R57K791N050N616L406N88
54492B16682k28N90J139J297K229L715M434M318M544N498O438O822O683O158N741
54477B76060O374Q147R739J0162J0210J1152J2899J4459J5264J5061J3607J1419
54465D14553R680Q369N909J656k668n319o842q650j0779j2592j4276j5871j6092
54452C47078j4076j1309r939r984r824q757p297n718l941k449j835j937k387l243
54438B54382m092l731j942k70L05R91K821M330L695J883J293K183K879K782K733
$$ plain form
54538 268497 260664 252528 243979 235493 228327 223943 222257 220994 217855 212930 208113 204698 202636 201593
54524 201593 201517 202280 203625 205215 206309 206067 204779 203844 203729 203024 200640 197831 196743 197853 200163 202839
54508 202839 205082 205469 203420 200721 199687 200214 200376 199435 198435 198274 199231 202022 207072 212688 216094 216682
54492 216682 216454 217044 218183 219480 221709 225424 229858 234176 238720 244218 250656 257478 264161 270319 276060
54477 276060 282434 290581 300320 310482 320692 331844 344743 359202 374466 389527 403134 414553
54465 414553 424233 432602 438511 440167 437499 432180 425338 416688 405909 393317 379041 363170 347078
54452 347078 333002 321693 311754 301770 291946 283189 275892 270174 266233 263784 261949 260012 257625 254382
54438 254382 250290 246559 244617 244347 244652 245643 248464 252794 256489 258372 259665 261848 264727 267509 270242
54423B70242K745J822N8j076o76Q66K893M602M618K302o52j715n38J101K031K604
54407B91227L094L090K681K543K600J982N27r51j905k346j968m01J552K325J407
54392C05457k05j461k111k174j649q68k48J94M78J24j174k763l689l669k815j204
54376B82223M81R58J72j56Q51J342o27l692m722l049r10n0k69j151k743m196l951
54359B60511j924J82J231J669J927J557N91J93J195L041M726N677N538M298K961
54344B93373K856L911M756M690M438M644M925M740M036K763Q83q25j196k66N38
54329C34266J45j171k736m218n168n034m093l346l113k684j788j295j838k734
54315B95193k946k445j930j650j130NJ313J627J72k202l430k445n16L65n6m52
$$ plain form
54423 270242 272987 274809 274867 273791 273115 273981 276874 281476 286094 288396 287744 286029 285491 286592 288623 291227
54407 291227 294321 297411 300092 302635 305235 307217 307744 306793 304888 302542 300574 300173 301725 304050 305457
54392 305457 305252 303791 301680 299506 297857 296989 296741 296935 297413 297537 296363 293600 289911 286242 283427 282223
54376 282223 282704 283662 283834 283678 284529 285871 285244 281552 276830 273781 272871 272821 272552 271401 268658 264462 260511
54359 260511 258587 258769 260000 261669 263596 265153 265744 265937 267132 270173 274899 280576 286114 290412 293373
54344 293373 296229 300140 304896 309586 314024 318668 323593 328333 332369 335132 336015 335190 333994 333728 334266
54329 334266 334411 333240 330504 326286 321118 316084 311991 308645 305532 302848 301060 299765 297927 295193
54315 295193 292247 289802 287872 286222 285092 285097 286410 288037 288209 286007 282577 280132 279616 279981 279925 279473
54299B79473l2Q27J771K902L839L741K638J714J834K637L420M056M623M853M468
54284C22764L556K339R06n81j772k345k214j698j581k623m576o163o422n668m776
54269B89146m167m025m595n547n854n215m787n452o205n538l751k526k618l400
54255B25466m198m713m491l384k412k710l828m460m536n092o124o315n131l731
54241A64341l179k958j929l8J454J187r62l522m698m213l306k708j798m16J15
54226A37370q77j703o55J013O36j935m144m170k501l41J431J748J7k429l402k574
54210A17484j463p29M06J837J966J82j871k390j346K44J580K119J663R48R50J391
54194A22971J283Q80J357K439K326O38o63j18J207J523P02k46o64k44J245L194
$$ plain form
54299 279473 279441 280268 282039 284941 288780 292521 295159 296873 298707 301344 304764 308820 313443 318296 322764
54284 322764 326320 328659 329565 328984 327212 324867 322653 320955 319374 316751 312175 306012 299590 293922 289146
54269 289146 284979 280954 276359 270812 264958 259743 254956 249504 243299 237761 234010 231484 228866 225466
54255 225466 221268 216555 212064 208680 206268 203558 199730 195270 190734 185642 179518 173203 168072 164341
54241 164341 161162 158204 156275 156237 157691 158878 157916 154394 149696 145483 142177 139469 137671 137255 137370
54226 137370 136493 134790 134135 135148 135784 133849 129705 125535 123034 122693 124124 125872 125889 123460 120058 117484
54210 117484 116021 115292 115698 117535 119501 119683 117812 115422 114076 114320 115900 118019 119682 120630 121580 122971
54194 122971 124254 125134 126491 128930 131256 131894 131231 131113 132320 133843 134545 134299 133635 133391 134636 137830
54178A37830M051L001R77n54r78m11O67J249M64j159k207k460l035m101m136k284
54162A26914K8Q91O9j477k951l706l105j490k98k54m06J67Q23N25m21j012j124
54145A13173j287j551j674j898k497k939k449j187m2M92O64Q17R74R04L06q11
54129A00995j766j662n57K81l06k012l313l038j577n37j031k344k722j540Q0R96
54113G9947J281J170J46j729k823j875mP83L04k72p54j686k461j858k84O89P18
54096G1292O74N14n02j662j290N60K153K788L100K905J467p6M26K468L208K049
54080I0074J580L032M150L138J449Q12M03q63j847j298k35l8k11J3k07j499k569
54063I5884k321j705j592j013M23P89r53k368j065J253J489J5n70k5n3m09P11
$$ plain form
54178 137830 141881 144882 145859 145305 144327 143916 144583 145832 146296 145137 142930 140470 137435 133334 129198 126914
54162 126914 126942 127833 127902 126425 123474 119768 116663 115173 114875 114621 114215 114382 115205 115730 115309 114297 113173
54145 113173 111886 110335 108661 106763 104266 101327 98878 97691 97649 98141 98805 99622 100596 101500 101806 100995
54129 100995 99229 97567 97010 97291 96985 94973 91660 88622 87045 86508 85477 83133 80411 78871 78951 79947
54113 79947 81228 82398 82544 80815 77992 76117 76113 76896 77200 76928 76174 74488 72027 70169 69885 70574 71292
54096 71292 71966 72480 71978 70316 69026 69586 71739 74527 77627 80532 81999 81923 82349 84817 88025 90074
54080 90074 91654 94686 98836 101974 103423 104235 104638 103775 101928 100630 100395 100357 100146 100159 99952 98453 95884
54063 95884 93563 91858 90266 89253 89676 90465 89512 87144 86079 87332 88821 88836 88266 88241 88188 87779 88490
54046H8490K865L642K711K087K316J706k1p70L72J422O95p51j101l30N31J073
54030A04937J260Q61M8m21k91j80m54p69r08r62n91N62J725J761J278K079M126
54013A14061M947L054K46q36j32M26K8k47L95J096O40p99j872j841j442j819k852
53996A13053l167j925mJ046Q51L53M09R64J655K461L307L552K558Q89L26K046
53980A28374M895O361N491L892L233K927J616p5k28J330K860L599M606O240P067
53965A82188O355N605O317P787Q503Q256P583O532N465N628P426R226R457Q704
53951B85032Q229P641N880L516K113J986K292K740L455L714K553L72j583k919
53937C25021l988m572m252l728m178n456o150n423l828k614k935n100p749q644
$$ plain form
54046 88490 91355 94997 97708 99795 102111 103817 103796 103026 103398 104820 105515 104764 103663 103333 103864 104937
54030 104937 106197 107058 107106 106685 106394 106214 105760 104991 104083 103121 102530 103092 104817 106578 107856 109935 114061
54013 114061 119008 122062 122308 121472 121340 121766 121794 121547 121942 123038 123678 122879 121007 119166 117724 115905 113053
53996 113053 109886 107961 107957 109003 109854 110207 110616 111580 113235 115696 119003 122555 125113 126002 126328 128374
53980 128374 133269 139630 145121 149013 152246 155173 156789 156714 156486 157816 160676 164275 168881 175121 182188
53965 182188 188543 194148 200465 208252 216755 225011 232594 239126 244591 250219 257645 266871 276328 285032
53951 285032 293261 300902 306782 310298 312411 314397 316689 319429 322884 326598 329151 329523 327940 325021
53937 325021 321033 316461 312209 308481 304303 298847 292697 287274 283446 280832 277897 272797 265048 256404
53923B56404p189n251m512m346l543k666k904l790m094l966m253m550l947k885
53909A98508k337j920r20j78p64j596q99P58J506J651L018N005M635J088k677
53894B04878l768k495p68N01J349J938K664L734M265L329J990K345M305N522M993
53879B34782M422N236O442O695O476O778P176O720N660N012N213O039P178Q145
53865C21974Q397P912O985N428L055Q04K7O21J378K079L418M822M662L190K962
53850C77714N165P669Q049O807O009O226O594O856P605Q948J0292J1162J1327
53837D80423J0535Q832O885N485N006N396N990N450K973l77k644l308l353l192
53823E24101k291j111j299l255n342o452p504r355j1018j1389j1112j1204j1170
$$ plain form
53923 256404 249215 243964 239452 235106 231563 228897 225993 222203 218109 214143 209890 205340 201393 198508
53909 198508 196171 194251 193331 193153 192389 190793 189894 190652 192158 193809 196827 201832 206467 207555 204878
53894 204878 201110 198615 197847 198348 199697 201635 204299 208033 212298 215627 217617 219962 224267 229789 234782
53879 234782 239204 244440 250882 257577 264053 270831 278007 284727 290387 295399 300612 306651 313829 321974
53865 321974 330371 338283 345268 350696 353751 354555 354582 355203 356581 358660 362078 366900 371562 374752 377714
53850 377714 382879 390548 398597 405404 411413 417639 424233 431089 438694 447642 457934 469096 480423
53837 480423 490958 499790 506675 512160 517166 522562 528552 534002 536975 536598 533954 530646 527293 524101
53823 524101 521810 520699 519400 516145 510803 504351 496847 487492 476474 465085 453973 442769 431599
53810D31599j0055q261o874o152o092p261r491j0821r622p082n753o125o469n834
53796C25707n272n896p188p788p081n605m576m943o362p220o299m144k172q91
53782B50270L9M10n53k655m301m216k954k114k308k543j726l21J44p72j570p40
53766B24090J045J838J163N26J051J979K098J387M35o76j858k217j071O18R16
53751B31324q27l051l423r90K787N096M208J275q09m16J448K894L333L363L477
53736B49689L721M157M786N305N603O177P356Q413Q231O832N523N371O013O356
53722C33533O060N870O359O872O289M688L369L047L016K636K478K947K824Q78
53708C90866j723k494j145l1p76k247k682k197k065k610l135l177k914k689k857
$$ plain form
53810 431599 421544 413283 406409 400257 394165 386904 377413 366592 356970 349888 344135 338010 331541 325707
53796 325707 320435 314539 307351 299563 292482 286877 282301 277358 270996 263776 257477 253333 251161 250270
53782 250270 250309 250719 250166 247511 243210 238994 236040 233926 231618 229075 227349 227028 227172 226400 224830 224090
53766 224090 225135 226973 228136 228662 229713 231692 233790 235177 235612 234936 233078 230861 229790 230408 231324
53751 231324 230497 227446 224023 223033 225820 230916 235124 236399 235590 235174 236622 239516 242849 246212 249689
53736 249689 253410 257567 262353 267658 273261 279438 286794 295207 303438 310270 315793 321164 327177 333533
53722 333533 339593 345463 351822 358694 364983 369671 373040 376087 379103 381739 384217 387164 389988 390866
53708 390866 389143 386649 385504 385473 384697 382450 379768 377571 375506 372896 369761 366584 363670 360981 358124
53693C58124l669m772n302m916m223l791l336k323r72j89p79k751n026n975m874
53678C05226k807j480j313j558j942k897m235m950m592l609k234l00J576K233
53664B77118J789J788K761L149J607p99j883j127j54p53k964m964m740k266K44
53649B68806J031J066K352M524N156L363R43l76o39j96J194K859L055J615P61
53634B95514J950L756M406M441N164N998N541M030K885K720L274M396N627N897
53620C55599N002M280M493M428L060J574J372J719J543K010M567P540P751N101
53606D10039K581J876J740J072O79J197J597R56j18p71j086j079j04J723K859
53591D23161K250Q58J86J38l94j440j849j154m53r70k482l744m128m125m101l382
$$ plain form
53693 358124 354455 349683 344381 339465 335242 331451 328115 325792 324820 324631 323852 321101 316075 310100 305226
53678 305226 302419 300939 299626 298068 296126 293229 288994 284044 279452 275843 273609 273309 274885 277118
53664 277118 278907 280695 283456 286605 288212 287413 285530 284403 284249 283496 280532 275568 270828 268562 268806
53649 268806 269837 270903 273255 277779 282935 286298 287241 286865 286226 286030 287224 290083 293138 294753 295514
53634 295514 297464 301220 305626 310067 315231 321229 326770 330800 333685 336405 339679 344075 349702 355599
53620 355599 360601 364881 369374 373802 376862 378436 379808 381527 383070 385080 389647 397187 404938 410039
53606 410039 412620 414496 416236 417308 417987 419184 420781 421737 421619 420848 419762 418683 418579 420302 423161
53591 423161 425411 426269 426455 426593 426199 424759 422910 421756 421303 420333 417851 414107 409979 405854 401753 398371
53575C98371j294J366K875K507R84q53k642l705l132j182O23J489K185L306M058
53560D04956L760L113K893K579J622Q70J315K454L325M183N592O756O518N371
53546D55307M836N392O450P793R350J0194R581Q531Q701R917J0505R835Q880Q402
53532E73674Q196Q083Q119P938P276O848P313P804P189O307O940Q737R360P879
53518F81663N923M986M628L938L016K201J328N53M23N47l57k328l622l150k066
53503F97683j819j991j410l79k54j299k365k641k629l182m308n259n437m932m206
53488F55572l477k573j468n39j21r7q2K69J202K578L537L309K586L014M801O158
53472F74669N884N167N614O863P716Q418R919J1838J3253J4694J7088J9341J9591
$$ plain form
53575 398371 397077 398443 401318 403825 404809 403956 401314 397609 394477 393295 393918 395407 397592 400898 404956
53560 404956 408716 411829 414722 417301 418923 419793 421108 423562 426887 431070 436662 443418 449936 455307
53546 455307 460143 465535 471985 479778 489128 499322 508903 517434 526135 536052 546557 556392 565272 573674
53532 573674 581870 589953 598072 606010 613286 620134 627447 635251 642440 648747 655687 664424 673784 681663
53518 681663 687586 692572 697200 701138 704154 706355 707683 708236 708659 709206 708849 706521 702899 699749 697683
53503 697683 695864 693873 692463 692084 691830 690531 688166 685525 682896 679714 675406 670147 664710 659778 655572
53488 655572 652095 649522 648054 647515 647394 647297 647215 647484 648686 651264 654801 658110 660696 663710 668511 674669
53472 674669 680553 685720 691334 698197 705913 714331 724250 736088 749341 764035 781123 800464 820055
53459H20055J8658J9498K2888K6216K7330K7229K7868K9473L1335L3435L5834
53448A119819L7776L8911M0377M3359M7239N0319N1870N2680N3971N6315N9155
53437A651791O1110O1427O1185O2239O4854O7481O9021O9976P1038P1959P2461
53426B384542P3059P4167P5521P7115P9612Q3001Q5915Q7231Q7511Q7891Q8219
53415C283784Q7172Q3780P8238P1635O5443O0750N7424N4407N1066M7844M5507
53404C987050M4304M3894M3470M2080L9776L8152L8412L9054L7034L1505K4690
53393D409421J8664J3040O729J44n813j1599j8257k5552l2315l8110m3403m8420
53381D224529n2954n7009o0818o4411o7663p0404p2092p2060p0747o9914p0866
$$ plain form
53459 820055 838713 858211 881099 907315 934645 961874 989742 1019215 1050550 1083985 1119819
53448 1119819 1157595 1196506 1236883 1280242 1327481 1377800 1429670 1482350 1536321 1592636 1651791
53437 1651791 1712901 1774328 1835513 1897752 1962606 2030087 2099108 2169084 2240122 2312081 2384542
53426 2384542 2457601 2531768 2607289 2684404 2764016 2847017 2932932 3020163 3107674 3195565 3283784
53415 3283784 3370956 3454736 3532974 3604609 3670052 3730802 3788226 3842633 3893699 3941543 3987050
53404 3987050 4031354 4075248 4118718 4160798 4200574 4238726 4277138 4316192 4353226 4384731 4409421
53393 4409421 4428085 4441125 4447854 4447998 4442185 4430586 4412329 4386777 4354462 4316352 4272949 4224529
53381 4224529 4171575 4114566 4053748 3989337 3921674 3851270 3779178 3707118 3636371 3566457 3495591
53370C495591p2894p4216p4050p3028p1988p1016o9477o6544o1965n6599n1709
53359B752105m7497m2785l6544k9154k1871j5513r878l998L113J1405J9465K6041
53347B604889L1723L8086M5242N1591N6173N9718O2988O5778O8331P2088P7760
53336C234367Q3984Q9179R3546R7961J02071J05276J08715J14280J21853J29267
53326D280499J35069J39889J44859J50128J55368J60581J65683J70056J73200
53317E675332J75525J77809J80021J81223J80802J79352J77713J75333J70511
53308G273621J62752J53931J46186J39391J32103J24540J18660J14960J11167
53299H477311J05152R7710R1060Q5465P8753O8950N6246M2251K7826J1825q045
$$ plain form
53370 3495591 3422697 3348481 3274431 3201403 3129415 3058399 2988922 2922378 2860413 2803814 2752105
53359 2752105 2704608 2661823 2625279 2596125 2574254 2558741 2548863 2544865 2547978 2559383 2578848 2604889
53347 2604889 2636612 2674698 2719940 2771531 2827704 2887422 2950410 3016188 3084519 3156607 3234367
53336 3234367 3318351 3407530 3501076 3599037 3701108 3806384 3915099 4029379 4151232 4280499
53326 4280499 4415568 4555457 4700316 4850444 5005812 5166393 5332076 5502132 5675332
53317 5675332 5850857 6028666 6208687 6389910 6570712 6750064 6927777 7103110 7273621
53308 7273621 7436373 7590304 7736490 7875881 8007984 8132524 8251184 8366144 8477311
53299 8477311 8582463 8680173 8771233 8856698 8935451 9004401 9060647 9102898 9130724 9142549 9134504
53288I134504l2786o0550q7931j12625j34208j52687j67597j78846j87204j93655
53278G826415j98998k03999k08661k11370k10532k07256k04718k04253k04176
53269E972452k03138k02368k02961k03141k00336j94640j87999j81032j72900
53260D223937j63669j54578j46159j37846j29245j20255j10291r9072q7855p8187
53250B996780o9631o0551n0982m2772l6614l0930k4335j7542j1879p363l219O60
53238B641622L846O319Q381J0097J1621J3707J7128K1643K6157K9965L3595L8151
53226B862232M4028N0318N5683N9661O2873O5971O8816P0908P2230P3291P4568
53215C560579P6110P7626P8695P9120P9030P8508P7194P4774P1697O8877O6760
$$ plain form
53288 9134504 9101718 9041168 8953237 8840612 8706404 8553717 8386120 8207274 8020070 7826415
53278 7826415 7627417 7423418 7214757 7003387 6792855 6585599 6380881 6176628 5972452
53269 5972452 5769314 5566946 5363985 5160844 4960508 4765868 4577869 4396837 4223937
53260 4223937 4060268 3905690 3759531 3621685 3492440 3372185 3261894 3162822 3074967 2996780
53250 2996780 2927149 2866598 2815616 2772844 2736230 2705300 2680965 2663423 2651544 2644181 2640962 2641622
53238 2641622 2645468 2651787 2660168 2670265 2681886 2695593 2712721 2734364 2760521 2790486 2824081 2862232
53226 2862232 2906260 2956578 3012261 3071922 3134795 3200766 3269582 3340490 3412720 3486011 3560579
53215 3560579 3636689 3714315 3793010 3872130 3951160 4029668 4106862 4181636 4253333 4322210 4388970
53204D388970O5239O4338O3966O3063O0137N5028M9114M3396L7390L0246K1842
53193D942729J2289J526j0002k1334l2369m4098n6845o9354q0415r0119r8684
53182D453324j05480j10445j15075j20518j25628j28371j28215j25787j21282
53173C372523j15032j08831j04737j02814j01695j01057j01805j04026j06423
53164B426103j07919j08389j07754j05633j02097r7780r3137q8374q3798p9367
53154A451855p4261o7952o1328n5615n0766m6053m1680l8381l5907l3397l0870
53143I15645k8743k6403k3057j9749j8537j9468k0244j9174j6789j4201j1872
53132F97408j0560j1589j4900j8135j8868j7020j4330j2241j1105j0692j0597
$$ plain form
53204 4388970 4454209 4518547 4582513 4645576 4705713 4760741 4809855 4853251 4890641 4920887 4942729
53193 4942729 4955018 4956544 4946542 4925208 4892839 4848741 4791896 4722542 4642127 4552008 4453324
53182 4453324 4347844 4237399 4122324 4001806 3876178 3747807 3619592 3493805 3372523
53173 3372523 3257491 3148660 3043923 2941109 2839414 2738357 2636552 2532526 2426103
53164 2426103 2318184 2209795 2102041 1996408 1894311 1796531 1703394 1615020 1531222 1451855
53154 1451855 1377594 1309642 1248314 1192699 1141933 1095880 1054200 1015819 979912 946515 915645
53143 915645 886902 860499 837442 817693 799156 779688 759444 740270 723481 709280 697408
53132 697408 686848 675259 660359 642224 623356 606336 592006 579765 568660 557968 547371
53121E47371j0417j0080r796r592r284q970q956r176r238r027q646q012p122o459
53107D22596o309o091n282m614n096o232o628o184o110o623o356m582k580k027
53093C47882k970m004l801k117j22L51j387l811m944m801m795n061m333k534j392
53078C02161j877k821k976k620k326j835j288j781l283l593j142K321L689K419
53064B85048O50L0J54O4l56p09o37J67J600K809K954K288J703J332N61n96j131
53047B95931m88M37L46p61j586j216l13k50j327k491l011l669n487p784q551o850
53031B52930l949j800j168j441j520o24J109K464K262Q43k38j78K70K11n7L17
53015B49431J532L196M966O525P398P289O345M888L402K747L448M610M695L659
$$ plain form
53121 547371 536954 526874 517078 507486 498202 489232 480276 471100 461862 452835 444189 436177 429055 422596
53107 422596 416287 410196 404914 400300 395204 388972 382344 376160 370050 363427 357071 352489 349909 347882
53093 347882 344912 340908 337107 334990 334868 335219 333832 330021 325077 320276 315481 310420 306087 303553 302161
53078 302161 300284 297463 294487 291867 289541 287706 286418 284637 281354 277761 276619 278940 282629 285048
53064 285048 285698 285728 285882 285946 285590 284881 284244 284411 286011 288820 291774 294062 295765 297097 297658 297062 295931
53047 295931 295443 295880 296226 295465 293879 292663 292350 292100 290773 288282 285271 281602 276115 268331 259780 252930
53031 252930 248981 247181 246013 244572 243052 242428 243537 246001 248263 249106 248868 248690 248960 249171 249114 249431
53015 249431 250963 254159 259125 265650 273048 280337 286682 291570 294972 297719 301167 305777 310472 314131
53001C14131L044L366L015Q55j510j839o63n90k502m403m322k703j302j094k025
52986C01458l873o273q382r398r309q642p696o556n625n513o226o970o968o227
52972B03800n214m181l228k776l258m267m686l991k909k463k876l744m652n103
52958A50452m537l133k087k248k967l139k813k689k616j955j046p82q60q2J502
52943A21000K428K048J297P11m29k152k864j656j55m03j907k432j082Q89J923
52928A17216J529P9j464j873q13M10L09p20q51O99K644L323K531J332P26P79Q71
52911A26727N15O6M01J713K913K742J229l23p90k57J88m33j952l062k700j466
52895A25511r88j750k384j616m9O96L8j187j837j233O89L101M595M608M125M144
$$ plain form
53001 314131 317175 320541 323556 324411 322901 321062 320399 319809 317307 312904 308582 305879 304577 303483 301458
52986 301458 297585 291312 282930 273532 264223 255581 247885 241329 235704 230191 223965 216995 210027 203800
52972 203800 198586 194405 191177 188401 185143 180876 176190 172199 169290 166827 163951 160207 155555 150452
52958 150452 145915 142782 140695 138447 135480 132341 129528 126839 124223 122268 121222 120440 119580 119498 121000
52943 121000 123428 125476 126773 127484 127055 124903 122039 120383 120228 119825 117918 115486 114404 115293 117216
52928 117216 118745 118824 117360 115487 114674 115084 115393 114673 113822 114521 117165 120488 123019 124351 125077 125856 126727
52911 126727 127242 127308 127709 129422 132335 135077 136306 135983 135193 134936 135124 134691 132739 129677 126977 125511
52895 125511 124523 122773 120389 118773 118724 119420 119458 118271 116434 115201 115890 118991 123586 128194 132319 136463
52879A36463M038K630M47n33M73K022K484J864J147Q00P50J040J707K392K834
52864A60558L431M595N862O397O230O139O222N569L954K904L963O240P029N101
52850B34194K176M46j88j291l121m291m060l457l671m560n379o112p273q814r822
52835A74777r254o852l668j549j472k506l042k861k939l440l342k356j664k065
52821A27767k774k962l118l699l670j999K69J073J41q60p04K36J170J795J785
52806A14450P27j041k398k690k345k014j797j541j242q42j09R29J856K269K095
52791A06307J497Q08N01P91J255J289R16P64J184J780J943J523R32P10J029J551
52775A24780J827J835J887J996J877J601J663K014J695Q8j909k697j831m89j61
$$ plain form
52879 136463 140501 143131 143578 143045 143518 145540 148024 149888 151035 151835 152585 153625 155332 157724 160558
52864 160558 163989 168584 174446 180843 187073 193212 199434 205003 208957 211861 215824 222064 229093 234194
52850 234194 236370 236816 236628 235337 232216 227925 223865 220408 216737 212177 206798 200686 193413 184599 174777
52835 174777 165523 158671 155003 153454 151982 149476 146434 143573 140634 137194 133852 131496 129832 127767
52821 127767 124993 122031 118913 115214 111544 109545 109814 110887 111028 110168 109464 109700 110870 112665 114450
52806 114450 115177 114136 111738 109048 106703 104689 102892 101351 100109 99267 99158 100087 101943 104212 106307
52791 106307 107804 108612 109113 109904 111159 112448 113364 114128 115312 117092 119035 120558 121490 122200 123229 124780
52775 124780 126607 128442 130329 132325 134202 135803 137466 139480 141175 141263 139354 136657 134826 134337 134176
52760A34176j179k473k562j027R68J908J650J309J455J517J179J138J763K250
52746A42072K040J995K949M148M514M512N089N574M637K969K776M428N768N213
52732A98684L713K775K275J355K3j257k572l891m362l580k752l238m397m353k766
52717A75657j358j565k858l856m031l685l059k326j990k407l041k978k278j936
52703A38289k360k677k127j349j397j998k001j362j284k163k772k243j545j920
52689A11091k734k292l23J643K275J678O78l5M4J012K004J752Q8j740k567k600
52673A09974k743l217l310k249n5K399L904L817K575J269O00L25k44j285k076
52658A09684j604R8J533J207m25j326n49N55M62j87L11J954K936K268J013N74
$$ plain form
52760 134176 132997 130524 127962 126935 127903 129811 131461 132770 134225 135742 136921 138059 139822 142072
52746 142072 144112 146107 149056 153204 157718 162230 167319 172893 177530 180499 183275 187703 193471 198684
52732 198684 202397 205172 207447 208802 208825 207568 204996 201105 196743 193163 190411 187173 182776 178423 175657
52717 175657 174299 172734 169876 166020 161989 158304 155245 152919 150929 148522 145481 142503 140225 138289
52703 138289 135929 133252 131125 129776 128379 126381 124380 123018 121734 119571 116799 114556 113011 111091
52689 111091 108357 106065 105742 107385 109660 111338 112016 111981 112025 113037 115041 116793 116881 115141 112574 109974
52673 109974 107231 104014 100704 98455 98400 100799 104703 108520 111095 112364 112964 113289 113045 111760 109684
52658 109684 108080 108178 109711 110918 110493 109167 108618 109173 109635 109448 109759 111713 114649 116917 117930 118504
52642A18504R44J179O97n38k303l969m510l378j257N10J194J266J649K475K675
52627A15138J182j422l042k337k34J355J675J199K60j123k374k645j971j043P9
52612A04697J699L050K756J092J48J052K476K738K088J782K132K767L795N146
52598A37418N474L511L25j400n32J386K513K839L357M169M449L865L053K748K933
52583A76108L053K696J943J101L41l26p71p24j58N58J018J096O43o96k851m692
52567A78339m853l393j966j901k566k378j074j22p36k399l752m268m273l841k713
52552A38104j225l57m97r91j234j446j951k362k230j893j888j833r48M41R25j23
52536A20492j549j816r42l39r06j840j699l42P22J27j542k304j074J123K314J501
$$ plain form
52642 118504 119448 120627 121324 120786 118483 114514 110004 106626 105369 105879 107073 108339 109988 112463 115138
52627 115138 116320 114898 111856 109519 109285 110640 112315 113514 113774 112651 110277 107632 105661 104618 104697
52612 104697 106396 109446 112202 113294 113442 114494 116970 119708 121796 123578 125710 128477 132272 137418
52598 137418 142892 146403 146728 145328 144796 146182 148695 151534 154891 159060 163509 167374 170427 173175 176108
52583 176108 179161 181857 183800 184901 185242 184916 184145 183421 183263 183821 184839 185935 186578 185882 183031 178339
52567 178339 173486 170093 168127 166226 163660 161282 160208 160086 159350 156951 153199 148931 144658 140817 138104
52552 138104 136879 136522 136025 135034 133800 132354 130403 128041 125811 123918 122030 120197 119249 119690 120615 120492
52536 120492 118943 117127 116185 115846 114940 113100 111401 111059 111781 111908 110366 108062 106988 108111 110425 111926
52520A11926p90l129l981k594J11J970J628M4o81K47J725K438K296J959J713J328
52504A16210P56M00N53Q63P19J44j42J41J55q94k308k620j739j033j119r37L10
52487A09459J718K174K097K441K838K302J035J20j24o6M27J571K410J725J13n18
52471A29722K51P64j17j361j402j55J315K124J931Q40m37r91p75n21l91L95K037
52454A33229L270K829J236L25J124K694L122J586n98j325l76J05j544m029m786
52439A36862l430j760p20M85J998K411J156j13J13R90R31N5o27j354k959m563
52423A29475m005r20K241K923J353l5M81K140K767J172j677l747l878k473o57
52408A25160O57J086P76K24k08n31n99J01J530K474J881M05m74n26p03j193j165
$$ plain form
52520 111926 111136 108007 104026 101432 101543 103513 105141 105185 104504 104751 106476 108914 111210 113169 114882 116210
52504 116210 116966 117366 117919 118782 119501 119645 119503 119644 119799 118905 116597 113977 112238 111205 110086 109149 109459
52487 109459 111177 113351 115448 117889 120727 123029 124064 124184 124060 123994 124421 125992 128402 130127 130240 129722
52471 129722 129973 130737 130620 129259 127857 127702 129017 131141 133072 133912 133475 132484 131709 131188 130797 131192 133229
52454 133229 136499 139328 140564 140889 142013 144707 147829 149415 148817 147492 147116 147221 145677 141648 136862
52439 136862 133432 131672 130952 131437 133435 135846 137002 136889 137002 137992 138923 138978 138351 136997 134038 129475
52423 129475 125470 124550 126791 129714 131067 131032 131513 133653 136420 137592 135915 132168 128290 125817 125160
52408 125160 125817 126903 127679 127903 127695 127164 126565 126666 128196 130670 132551 132956 132482 131956 131253 130060 128895
52391A28895l95M03J064K172L441L657K725K019K009J425l17j697j512r22j443
52376A41524k340j914l50O78N40Ol86p03o47J71J254J804J948K158J841N8k633
52359A43009m414m330k989j282L31J311J043k25j372j526p51L04Q20K53r92j687
52343A27503j114J77J412K456K887J619j147k886j577J155K002M88q24m63L49
52328A32037N66J102K571L617L087K057J939K015Q34r84j468l15P74P84O23J255
52312A50494K220K696K793K834K271N23j447j722K11K598L473K829K065J872J680
52297A75390J110P48J104J671J669J217J037J298J426R71K20j62Q8M45J57o10
52281A87779o38P59K327K280J013Q52K606M007K792l4j545o54J128K191K301J707
$$ plain form
52391 128895 128500 128903 129967 132139 135580 139237 141962 143981 145990 147415 147098 145401 143889 142967 141524
52376 141524 139184 137270 136920 137598 138138 138144 137758 137055 136408 136579 137833 139637 141585 143743 145584 145642 143009
52359 143009 138595 134265 131276 129994 130325 131636 132679 132454 131082 129556 128805 129109 129929 130182 129190 127503
52343 127503 126389 126566 127978 130434 133321 134940 133793 130907 129330 130485 132487 132975 132151 131688 132037
52328 132037 132603 133705 136276 139893 142980 145037 146976 148991 149825 148841 147373 147058 147832 148616 149239 150494
52312 150494 152714 155410 158203 161037 163308 163831 162384 160662 160873 163471 166944 169773 171838 173710 175390
52297 175390 176500 177248 178352 180023 181692 182909 183946 185244 186670 187641 187861 187699 187787 188232 188389 187779
52281 187779 187141 187900 190227 192507 193520 194372 196978 200985 203777 203743 202198 201544 202672 204863 207164 208871
52265B08871L85j416k903l376k610p80J224J847L53j842k491j168M26R12P66J069
52249A99267J796J986J152J5j05J284L032L405K261J365K040L448M137M187M364
52234B33634M178K745J097J446M079O854P968P467N829L152L66o56O28K415K766
52219B83968J636J10r86r46Q46L625N232M536K918K213K333K052J120K04m31q12
52203C07618m83Q05K065K086J176P47J382K405L246M130N299O302O227M387J096
52188C48488j876k423k83K440L614L224K526K064J736K002L413N296O347O339
52174C82907N981N364M031K399J512J296P35n7L34K152L692L899L997N189O272
52159D29703N447L493K979M637O470O670N600M440L476K699K737L981N505N984
$$ plain form
52265 208871 209256 207840 204937 201561 198951 198171 199395 201242 201595 199753 197262 196094 196520 197432 198198 199267
52249 199267 201063 203049 204201 204216 204111 205395 208427 211832 214093 215458 217498 220946 225083 229270 233634
52234 233634 237812 240557 241654 243100 247179 254033 262001 269468 275297 278449 278815 278159 278787 281202 283968
52219 283968 285604 285714 284728 283782 284628 288253 293485 298021 300939 303152 305485 307537 308657 308861 308430 307618
52203 307618 307135 307940 310005 312091 313267 314014 315396 317801 321047 325177 330476 336778 343005 347392 348488
52188 348488 346612 344189 343906 346346 349960 353184 355710 357774 359510 361512 364925 370221 376568 382907
52174 382907 388888 394252 398283 400682 402194 403490 404225 404168 404502 406654 410346 414245 418242 423431 429703
52159 429703 435150 438643 441622 446259 452729 459399 464999 469439 472915 475614 478351 482332 487837 493821
52145D93821N338M555M281M431M814N101M513K716R72J074K982M783N343N539
52131E50263O127N993M000J494J015K806M435M072K586J816K105K457K319K178
52117E93666K753M086N288N029K795j07j474m49J618K772K288P00j180k501k501
52102F12783j248j2l2j047j764j495p56k34j5M3k32j103k415l588m059l699k864
52085E88263k017j342q08o07j072k011k571k132j144o32j081k065k797k763k039
52070E63182j340j526k595l427l142k406k633l892m617l768k268j524j344o24
52056E28076K68n26l450o021n483k310M12P95j47p92j184k056k900k584j401r15
52040D99782j628k062p12J967M108M517L657K719K277J974J399Q57R44J532J858
$$ plain form
52145 493821 499159 503714 507995 512426 517240 522341 526854 529570 530542 531616 534598 539381 544724 550263
52131 550263 556390 562383 566383 567877 568892 571698 576133 580205 582791 584607 586712 589169 591488 593666
52117 593666 596419 600505 605793 610822 613617 613510 612036 611587 613205 615977 618265 618965 617785 615284 612783
52102 612783 611535 611523 611491 610444 608680 607185 606429 606195 606180 606223 605991 604888 602473 598885 594826 591127 588263
52085 588263 586246 584904 584096 583489 582417 580406 577835 575703 574559 573927 572846 570781 567984 565221 563182
52070 563182 561842 560316 557721 554294 551152 548746 546113 542221 537604 533836 531568 530044 528700 528076
52056 528076 528344 527818 524368 518347 512864 510554 510966 511761 511614 510822 509638 507582 504682 502098 500697 499782
52040 499782 498154 496092 495380 497347 501455 505972 509629 512348 514625 516599 517998 518855 519799 521331 523189
52025E23189J811K268L589M695M539L803L863M580M536L322K001J238M88m78p35
52010E62709L36J967L209M167N177N717N137L744K344J335R60J546K637K912K066
51995F05963J791L433N506N372K985J058J352K584K652J361Lo19o64l87J84Q80
51979F33454J382J538J398J075P09K87o21k492m930o616o474m749k682j421j374
51964F08484k233l259l750l587l236l173l441l868m328m577m161k866j191l2R1
51949E64873o57j665k267k159j781k098l602n537o498n892m347k687j105K98P85
51934E25661l34k407l781l719l348m151o073p754q291q033p699p514p362p151
51920D48044o716n919n149n182o190p234p300o537n948o030o264o107n918o598
$$ plain form
52025 523189 525000 527268 530857 535552 540091 543894 547757 552337 556873 560195 562196 563434 563922 563444 562709
52010 562709 563045 565012 568221 572388 577565 583282 588419 592163 594507 595842 596802 598348 600985 603897 605963
51995 605963 607754 611187 616693 622065 625050 626108 627460 630044 632696 634057 634060 633441 632777 632390 632574 633454
51979 633454 634836 636374 637772 638847 639556 639843 639222 636730 631800 625184 618710 613961 611279 609858 608484
51964 608484 606251 602992 599242 595655 592419 589246 585805 581937 577609 573032 568871 566005 564814 564782 564873
51949 564873 564216 562551 560284 558125 556344 554246 550644 545107 538609 532717 528370 525683 524578 524876 525661
51934 525661 525327 522920 519139 515420 512072 507921 501848 494094 485803 477770 470071 462557 455195 448044
51920 448044 441328 435409 430260 425078 418888 411654 404354 397817 391869 385839 379575 373468 367550 360952
51906C60952q328j0054j0429r257p815p503q389r327r305q231o599n060m352m814
51892B51489n582n181l518k534l832o162o597m091o96J067P81l92j641k687k887
51877B07537j667J14N52j061l276m314m085l726l688l306k158r59p20j485k242
51862A75516j875k35J640K344J503J77l91j66Qj64k87l51q78j694j670l42J217
51845A74352J785J500J126P73L42M49J451K135R86j433k941k718k222k668l187
51830A69730k394o75L74Q0p67j291j510j851k287k198j005J024K721L091K452
51815A65494K013K287K483J693J73q89o30P14K004K126R92l97j164j590k348l133
51799A69828k862j308M60J395J429R14rj121j970k337k293j710n35M23J47q72
$$ plain form
51906 360952 352624 342570 332141 322884 315069 307566 299177 289850 280545 272314 265715 260655 256303 251489
51892 251489 245907 240726 237208 234674 230842 224680 218083 213992 213296 214363 215144 214752 213111 210424 207537
51877 207537 205870 205984 206536 205475 202199 197885 193800 190074 186386 183080 180922 179963 179243 177758 175516
51862 175516 173641 173406 175046 177390 178893 179070 178679 178513 178521 178357 178070 177719 176841 175147 173477 173135 174352
51845 174352 176137 177637 178763 179536 179878 180327 181778 183913 184899 183466 180525 177807 175585 172917 169730
51830 169730 167336 166661 167035 167115 166348 165057 163547 161696 159409 157211 156206 157230 159951 163042 165494
51815 165494 167507 169794 172277 173970 174143 173254 172624 173338 175342 177468 178460 178063 176899 175309 172961 169828
51799 169828 166966 165658 166118 167513 168942 169856 169847 168726 166756 164419 162126 160416 159881 160304 160451 159579
51783A59579q14J056L278M143L686K928K324J896J992K658L110K879K755L427
51769A94897L930K920R33j79J86Q71J046J244K032K946L332L349L581M270N272
51754B30630O220O541N998N341N698P095Q333Q658Q713R362J0393J1173J1867
51741C36022J2908J3647J2801J0383P944O272M119K89l836n621m846m172n432
51728C80478p327p967p952q956j0456j0354q480p002o979o810m984k397q41p35
51714B89238j457k488l100k299l88O12n51k573l515l397l358l413k860k163k454
51699B55834l470l721k615j105k37k96j063j806j530l30J86q53j822q81Q71Q38
51683B38000r09j687m60P16L09k63O43K055K077R00J12O8o9k89L37J698K343J396
$$ plain form
51783 159579 158765 159821 163099 167242 170928 173856 176180 178076 180068 182726 185836 188715 191470 194897
51769 194897 198827 201747 202680 202501 202687 203558 204604 205848 207880 210826 214158 217507 221088 225358 230630
51754 230630 236850 243391 249389 254730 260428 267523 275856 284514 293227 302589 312982 324155 336022
51741 336022 348930 362577 375378 385761 393705 399977 404096 404385 400549 394928 390082 385910 380478
51728 380478 373151 365184 357232 348276 337820 327466 318986 311984 305005 298195 293211 290814 289973 289238
51714 289238 287781 285293 282193 279894 279506 280118 279567 276994 273479 270082 266724 263311 260451 258288 255834
51699 255834 252364 248643 246028 244923 244686 244390 243327 241521 239991 239661 239847 238994 237172 236291 237162 238000
51683 238000 237091 235404 234944 235660 235969 235706 236349 238404 240481 241381 241493 241561 241492 241203 241540 243238 245581 246977
51665B46977l67j811k729l358l433k554j152j41L46J115K404L045J980R5o86m7
51649B39684L53m58j269p43L35K54j121k464k931k584j530j15M68n54k015k161
51633B23149j254j068j935k293j347j90K31L56M81j17j511k171r30J179K313K022
51617B16915J109J74o10r30o51j91M8J95L27Q8o11j134j022o50n18n48n30n33
51599B10928l98K69J189J347M21o01p53j78N59J215J393N82p09j086k74L24K5
51582B14253K09J900L455K637P5j447p73M70M61o93j626j250N50K762L770K992
51566B27745J691J335J533R32k55k78J542L778M825M479L201J169j148k542k244
51551B45763r35R6M31N70Q43Q89J54j239k243j667M22K418K775J691M77k99j014
$$ plain form
51665 246977 246610 244799 242070 238712 235279 232725 231573 231432 231778 232893 235297 238342 240322 240417 239731 239684
51649 239684 240037 239579 238310 237567 237902 238156 237035 234571 231640 229056 227526 227411 227879 227325 225310 223149
51633 223149 221895 220827 218892 216599 215252 215062 215293 215649 216130 216013 214502 212331 211401 212580 214893 216915
51617 216915 218024 218198 217588 216658 216007 215816 215864 216059 216386 216474 215863 214729 213707 213057 212539 211991 211461 210928
51599 210928 210530 210799 211988 213335 213756 213155 212402 212224 212783 213998 215391 215973 215264 214178 213904 214228 214253
51582 214253 214462 216362 219817 222454 222529 221082 220309 220779 221240 220547 218921 217671 218221 220983 224753 227745
51566 227745 229436 230771 232304 233236 232981 232703 234245 238023 242848 247327 250528 251697 250549 248007 245763
51551 245763 244828 244924 245355 245925 246768 247657 247811 246572 244329 242662 243084 245502 248277 249968 250445 250146 249132
51534B49132j550j136k4K06j132k438j888j21O30l03j248q28J77K06p91j578j469
51517B35845r01l53K00O33M28m68j294j526j602j912j743k04K068L261K542R25
51501B35899k00m91k49M75J709K893L162K132K30j490j855n31J226J470k89k336
51485B41755k741j487j22L03J13N8K68L60J97K00R18K185K965K439J132L59N09
51468B49411P78O75Q02J591K319K163J490J167J279J472K004L350N028N935N643
51453B85107M532K911R96m20n00M08J019P43K29J76N12Q59R81N36o84k041k375
51436B92989j423r5R07J747K339J749l32k435k869k035j811k722l141j755K61
51421B81374O45j053l028l646l200k820k587j645J25J548J511J93j401k576l226
$$ plain form
51534 249132 247582 246446 246422 246628 245496 243058 241170 241049 241679 241376 240128 239300 239477 239683 238892 237314 235845
51517 235845 234944 234591 234791 235424 235852 235384 234090 232564 230962 229050 227307 227103 229171 232432 234974 235899
51501 235899 235699 235208 234959 235434 237143 240036 243198 245330 245560 244070 242215 241684 242910 244380 244091 241755
51485 241755 239014 237527 237405 237708 237821 237879 238147 238507 238704 238904 239822 242007 244972 247411 248543 248902 249411
51468 249411 250189 250864 251666 253257 255576 257739 259229 260396 261675 263147 265151 268501 273529 279464 285107
51453 285107 289639 292550 293546 293126 292626 293034 294053 294796 295025 295201 295713 296572 297553 298089 297405 295364 292989
51436 292989 291566 291471 292378 294125 296464 298213 297881 295446 292577 290542 288731 286009 282868 281113 281374
51421 281374 282019 280966 277938 274292 271092 268272 265685 264040 264165 265713 267224 267417 266016 263440 260214
51406B60214l358k890j964j119j025j887l000l057j485N90J296J37j489k136j968
51391B36859k020k533k907k851k697k640k473k144j893j755j479j080r51j201
51377B08235j336q52N7O87O18J93J25O58J225J186P73Q49J720K692L037K767K207
51360B24841J398M34k67o09j085j802j849o96M18j71k100l234k537j265p79o38
51344B10059K18J440J720R17L76J054K279K760K132J018L7n93o76M2J326K335
51328B26444K507K256K314K559K187J111L64P53J753K332K382K550K919K707J463
51313B56601r0p97l99J55k96j928l798m993n624o311o814o050l839j794j551k688
51297B09784l430l174l082l871m367l053l93J530J460K02p07p76o12p98j371k184
$$ plain form
51406 260214 256856 253966 252002 250883 249858 247971 244971 241914 240429 241019 242315 242452 240963 238827 236859
51391 236859 234839 232306 229399 226548 223851 221211 218738 216594 214701 212946 211467 210387 209436 208235
51377 208235 206899 206047 206104 206791 207409 207602 207727 208385 209610 210796 211569 212418 214138 216830 219867 222634 224841
51360 224841 226239 226673 226406 225797 224712 222910 221061 220365 220783 220612 218512 215278 212741 211476 210697 210059
51344 210059 210277 211717 213437 214354 214730 215784 218063 220823 222955 223973 224010 223417 222741 222783 224109 226444
51328 226444 228951 231207 233521 236080 238267 239378 239742 240495 242248 244580 246962 249512 252431 255138 256601
51313 256601 256511 255714 255315 255470 255174 253246 249448 244455 238831 232520 225706 219656 215817 214023 212472 209784
51297 209784 206354 203180 200098 196227 191860 188807 188414 189944 191404 191606 190899 190123 189511 188713 187342 185158
51281A85158l052l473k906j621o42m40l00M82J383J462R32P79J055Q24q5n93p
51264A78956R45J264Q95J41j022k350k926k297j290q18n35K68J099P69p84k322
51248A69993k900k717k355j931j230j85Q53J266P67n7k63J92N05L95M69P38R6
51231A63636j773l117k173L84K309K595K022J535J473J890K270J383j013k898
51217A68523k173J94J256K31n96M73K198K621J806J056Q12O47M02J07o02j970
51201A74985l407l994l363j724L40J817J778N75k93P5R10R79N4j214k219k613
51185A62686k180j144o4Q44J746K395K152J139M68P17J161J074Q20R55J123Q17
51169A74709M67P69J470J712J215K71r81k428l496l575k722j292O02K545L427
$$ plain form
51281 185158 182106 178633 175727 174106 173464 173024 172724 173206 174589 176051 176983 177762 178817 179641 179556 178963 178956
51264 178956 179901 181165 182060 182201 181179 178829 175903 173606 172316 171498 170963 171231 172330 173099 172315 169993
51248 169993 167093 164376 162021 160090 158860 158675 159528 160794 161561 161504 161241 161433 161938 162333 162802 163540 163636
51231 163636 161863 158746 156573 156957 159266 161861 163883 165418 166891 168781 171051 172434 171421 168523
51217 168523 166350 166544 167800 168031 167435 167908 170106 172727 174533 175589 176401 177048 177450 177557 176955 174985
51201 174985 171578 167584 164221 162497 162837 164654 166432 167007 166714 166789 167699 168678 168732 167518 165299 162686
51185 162686 160506 159362 159298 160142 161888 164283 166435 167574 168042 168759 169920 170994 171814 172769 173892 174709
51169 174709 175176 175945 177415 179127 180342 180613 179632 177204 173708 170133 167411 166119 166721 169266 172693
51154A72693K494N48r17j449j614j623j123k66K70M83J224K748M012L951K746
51139A84177J376M61P2J03L25K31m78j341j474n68P49J684K141K585L113L096
51123A96252J950Q8j370j780j494j162j034j043j079q16O6J082Q99r72k948k928
51107A83711j068K38m73j829j719k53O72K21n06m65k2J52K06L58J89k68J58K026
51089A81328L595K627l86k532k094k29J201J762J799J398R18J232K214K377J204
51074A96414M98J848L896M055K201O15N03O59j55j194r49Q15K775L306J823m73
51058B16637j427j52J835K495J800J229J347J315O54r0n05p67q31m78j94o44j239
51041B20985p37O81J481J100N15K63l08j291j602q95l11m48l67L92O14l58r27
$$ plain form
51154 172693 175187 175735 174818 173369 171755 170132 169009 168743 169013 169496 170720 173468 177480 181431 184177
51139 184177 185553 186014 186086 186189 186514 186745 186267 184926 183452 182884 183633 185317 187458 190043 193156 196252
51123 196252 198202 198290 196920 195140 193646 192484 191450 190407 189328 188512 188578 189660 190559 189587 186639 183711
51107 183711 182643 182881 182408 180579 178860 178607 179279 179500 178994 178529 178507 178659 178865 179223 179412 179144 179302 181328
51089 181328 184923 187550 187164 184632 182538 182309 183510 185272 187071 188469 189387 190619 192833 195210 196414
51074 196414 196912 198760 202656 206711 208912 209527 210030 210689 210534 209340 208391 209206 211981 215287 217110 216637
51058 216637 215210 215058 216893 219388 221188 222417 223764 225079 225733 225643 225138 224371 223540 223062 222868 222224 220985
51041 220985 220248 220929 222410 223510 224025 224288 223980 222689 221087 220192 219881 219433 219066 219458 220072 219714 218787
51024B18787L77K210K138J82j414j568j457k121k810k319q65J99P5p11j151j074
51008B08478j183j731j748l83J425J818N46p31q85o14p41o86L62J912K838K813
50992B11490K219J382O70N94J079J370J116P49L94l50j100o70P66J246n8j093
50976B19804K44K826L826K553Q25J36L41R46J915L060L980M546M623L770K247
50961B55642J596K726M046L203L91j706j262R53L225M665N080M518L563L091L204
50946B92935L092K257J233Q71J419K458L362L753L741L532K865J380l50j133q08
50931C20607m82o84o33n1n8j113j738r09j68j214k720k026P13K583J882j76j701
50914C12112j891o48J478K819K071L69R5J553K885L271L859N171N991N661N294
$$ plain form
51024 218787 219164 221374 223512 223694 222280 220712 219255 217134 214324 212005 211140 211339 211414 210703 209552 208478
51008 208478 207295 205564 203816 203433 204858 206676 207222 206491 205606 204992 204251 203565 203927 205839 208677 211490
50992 211490 213709 215091 215761 216355 217434 218804 219920 220669 221063 220713 219613 218943 219709 220955 220897 219804
50976 219804 220048 222874 226700 229253 230078 230214 230555 231501 233416 236476 240456 245002 249625 253395 255642
50961 255642 257238 259964 264010 267213 267604 265898 264636 265589 268814 273479 278559 283077 286640 289731 292935
50946 292935 296027 298284 299517 300388 301807 304265 307627 311380 315121 318653 321518 322898 322548 321415 320607
50931 320607 320125 319441 318808 318757 318699 317586 315848 314939 314771 313557 310837 308811 309524 312107 313989 313813 312112
50914 312112 310221 309573 311051 313870 315941 316310 316405 317958 320843 324114 327973 333144 339135 344796 350090
50899C50090N713O124N884N775O348O748O432O504P840R264R189Q111P893R061
50885D50976J0343J0663J0443J0813J2191J3892J4980J5521J6596J8564J9909
50874F04891J8926J6230J4199J3950J4358J4080J3069J1686R986Q262O907N270
50862G51814K283j363l513l783m482p233j0516j2024j1944j2109j3115j4068j4355
50849F45592j3996j2668j0023o742m181l105l436m646n676n340l661j977r28N92
50835E69805L328N738N853M274L493M608O353P353P655P832P886P501O596N247
50821F53522L655K255J439J184J314J801K364K385J726J112R67N65p74k335k943
50806F68237k714k665k939k724j933j630k545m098n141m989l599j471N25J731
$$ plain form
50899 350090 355803 361927 367811 373586 379934 386682 393114 399618 407458 416722 425911 434022 441915 450976
50885 450976 461319 471982 482425 493238 505429 519321 534301 549822 566418 584982 604891
50874 604891 623817 640047 654246 668196 682554 696634 709703 721389 731375 739637 746544 751814
50862 751814 754097 752734 749221 745438 740956 733723 723207 711183 699239 687130 674015 659947 645592
50849 645592 631596 618928 608905 602163 597982 594877 591441 586795 581119 575779 572118 570141 569213 569805
50835 569805 573133 578871 584724 588998 592491 597099 603452 610805 618460 626292 634178 641679 648275 653522
50821 653522 657177 659432 660871 662055 663369 665170 667534 669919 671645 672757 673724 674289 673515 671180 668237
50806 668237 665523 662858 659919 657195 655262 653632 651087 646989 641848 636859 633260 631789 632314 634045
50792F34045K301K836L624M581N609O530P025P261Q073R830J1560J2195J2220
50779G27690J2927J4344J5245J5127J4986J5848J7755K0414K3676K6838K8649
50768I33499K8936K9384L1845L6143M0354M2965M4223M5484M7723N0683N3163
50757A384402N4219N4291N4923N7016N9549O0435N8623N4964N0886M6692M1593
50746A977593L5153K7934K0717J3714P159J909j325l032m305n238m923l019j65
50733B062172L422Q543J5370K2270K7382L0945L5092M1664N0911O1914P3254Q3345
50721B516284R1201R7204J02639J08238J13465J17063J17950J15679J10361J02211
50711C592295R1205P7527O2492M8239L6051K5315J4585L156q914k1565l4659m7622
$$ plain form
50792 634045 636346 639182 642806 647387 652996 659526 666551 673812 681885 691715 703275 715470 727690
50779 727690 740617 754961 770206 785333 800319 816167 833922 854336 878012 904850 933499
50768 933499 962435 991819 1023664 1059807 1100161 1143126 1187349 1232833 1280556 1331239 1384402
50757 1384402 1438621 1492912 1547835 1604851 1664400 1724835 1783458 1838422 1889308 1936000 1977593
50746 1977593 2012746 2040680 2061397 2075111 2082270 2084179 2082854 2079822 2075517 2070279 2065356 2062337 2062172
50733 2062172 2065594 2074137 2089507 2111777 2139159 2170104 2205196 2246860 2297771 2359685 2432939 2516284
50721 2516284 2607485 2704689 2807328 2915566 3029031 3146094 3264044 3379723 3490084 3592295
50711 3592295 3683500 3761027 3823519 3871758 3907809 3933124 3947709 3950865 3941951 3920386 3885727 3838105
50699C838105n9988p2042q4100r5432j04693j11297j15497j17408j16833j14027
50689B846788j09682j04141r7475r0333q3762p7993p2189o5654n8653n1748m5116
50678A990042l8799l3016k7784k2702j7492j2253o916j004N521J1518J5532J7441
50666A880088J8860K1607K5753K9401L0445K8504K5034K1764J9401J7837J6831
50655B135525J6088J5125J3786J2610J2222J2576J3218J3979J4878J5665J6125
50644B291797J6705J8042J9950K1525K2270K2525K2751K3031K3345K3783K4241
50633B529965K4410K4166K3600K2663K1232J9586J8364J8013J8652K0373K3140
50622B764164K6554L0375L5178M1657M9137N5741O0354O3808O7674P2676P8759
$$ plain form
50699 3838105 3778117 3706075 3621975 3526543 3421850 3310553 3195056 3077648 2960815 2846788
50689 2846788 2737106 2632965 2535490 2445157 2361395 2283402 2211213 2145559 2086906 2035158 1990042
50678 1990042 1951243 1918227 1890443 1867741 1850249 1837996 1831080 1830076 1835597 1847115 1862647 1880088
50666 1880088 1898948 1920555 1946308 1975709 2006154 2034658 2059692 2081456 2100857 2118694 2135525
50655 2135525 2151613 2166738 2180524 2193134 2205356 2217932 2231150 2245129 2260007 2275672 2291797
50644 2291797 2308502 2326544 2346494 2368019 2390289 2412814 2435565 2458596 2481941 2505724 2529965
50633 2529965 2554375 2578541 2602141 2624804 2646036 2665622 2683986 2701999 2720651 2741024 2764164
50622 2764164 2790718 2821093 2856271 2897928 2947065 3002806 3063160 3126968 3194642 3267318 3346077
50611C346077Q5992R4672J04898J16649J30007J44949J61276J78974J97938K16697
50601D778129K32282K42542K48041K50322K48482K39445K22334K01020J80832
50592F843429J63492J46657J27867J07250Q6255O5432M4288K2221j323k6726n3241
50581G525601p8559j00324j17904j32008j42932j50074j52941j51648j46521j38022
50571F214668j27226j15574j04064r3183q3430p5229o8428o2828n9051n7755n8128
50560E309772n8367n7877n7627n8085n8254n7402n6112n4566n1172m4367l4934
50549D721009k5039j5722o853J056O763J0043J1944J2957J2111Q262J376p854
50537D730053j8743l0497m2119n3153o4191p6056q8435r9667j08163j13923j18270
$$ plain form
50611 3346077 3432069 3526741 3631639 3748288 3878295 4023244 4184520 4363494 4561432 4778129
50601 4778129 5010411 5252953 5500994 5751316 5999798 6239243 6461577 6662597 6843429
50592 6843429 7006921 7153578 7281445 7388695 7474950 7540382 7584670 7606891 7605568 7578842 7525601
50581 7525601 7447042 7346718 7228814 7096806 6953874 6803800 6650859 6499211 6352690 6214668
50571 6214668 6087442 5971868 5867804 5774621 5691191 5615962 5547534 5484706 5425655 5367900 5309772
50560 5309772 5251405 5193528 5135901 5077816 5019562 4962160 4906048 4851482 4800310 4755943 4721009
50549 4721009 4695970 4680248 4673395 4674451 4681214 4691257 4703201 4716158 4728269 4736531 4737907 4730053
50537 4730053 4711310 4680813 4638694 4585541 4521350 4445294 4356859 4257192 4149029 4035106 3916836
50526C916836j21831j23408j21599j17170j12553j08853j04744r8802r1476q3830
50516B832570p5813o7096n8523n1011m3914l6194k8605k2711j8053j2403n095
50505B413152J956P061J0858J4864J9468K4247K8966L3248L6352L8359M0795M4988
50493B714314N0621N6834O4043P3308Q4449R6085J07561J19623J32852J46431
50483C646121J58955J69768J78764J85256J87916J86065J80490J72727J63779
50474E229841J53951J43599J33439J24155J16204J09920J05049J00067R2942Q3175
50464F392342P2444O2583N3742M5394L8397L4731L5192L8582M3234M8329N3357
50453F918327N7291N9028N8329N5557N0573M2236K9363J2240p217k7146m7320
$$ plain form
50526 3916836 3795005 3671597 3549998 3432828 3320275 3211422 3106678 3007876 2916400 2832570
50516 2832570 2756757 2689661 2631138 2580127 2536213 2500019 2471414 2448703 2430650 2418247 2413152
50505 2413152 2415108 2422169 2433027 2447891 2467359 2491606 2520572 2553820 2590172 2628531 2669326 2714314
50493 2714314 2764935 2821769 2885812 2959120 3043569 3139654 3247215 3366838 3499690 3646121
50483 3646121 3805076 3974844 4153608 4338864 4526780 4712845 4893335 5066062 5229841
50474 5229841 5383792 5527391 5660830 5784985 5901189 6011109 6116158 6216225 6309167 6392342
50464 6392342 6464786 6527369 6581111 6626505 6664902 6699633 6734825 6773407 6816641 6864970 6918327
50453 6918327 6975618 7034646 7092975 7148532 7199105 7241341 7270704 7282944 7275727 7248581 7201261
50442G201261o8303q9343j08288j23765j36028j45050j49409j48299j43280j36332
50432E953164j27039j13619r6174p7134n8640m1308k5531j2304k540K989L041
50421E404905l226j4678k9050m5588o5046q6860j08226j26702j41974j54269j62811
50410D466475j67111j68310j67759j65300j60335j53719j47134j41065j34609
50401C061133j27029j18541j09755j01194r3214q5802p8553p1201o4023n7375
50391B154446n1342m6049m1788l8471l5356l1618k6936k1547j6328j2639j1155
50380A821217j0757r481o642l161K16L698P360J0640J3386J6080J8676K0706K2976
50367A904914K7429L4445M1844M7647N2290N6908O1183O4541O7948P2498P7240
$$ plain form
50442 7201261 7132958 7043615 6935327 6811562 6675534 6530484 6381075 6232776 6089496 5953164
50432 5953164 5826125 5712506 5616332 5539198 5480558 5439250 5413719 5401415 5398875 5401864 5404905
50421 5404905 5401679 5387001 5357951 5312363 5247317 5160457 5052231 4925529 4783555 4629286 4466475
50410 4466475 4299364 4131054 3963295 3797995 3637660 3483941 3336807 3195742 3061133
50401 3061133 2934104 2815563 2705808 2604614 2511400 2425598 2347045 2275844 2211821 2154446
50391 2154446 2103104 2057055 2015267 1976796 1941440 1909822 1882886 1861339 1845011 1832372 1821217
50380 1821217 1810460 1800979 1794337 1791176 1791392 1795090 1802450 1813090 1826476 1842556 1861232 1881938 1904914
50367 1904914 1932343 1966788 2008632 2056279 2108569 2165477 2226660 2291201 2359149 2431647 2508887
50356B508887Q0535Q2810Q5723Q9041R0780R0503R0184R1236R2606R2785R2148
50345C487238R2082R2674R2633R1115Q8665Q6113Q3267P9147P3365O6684N9805
50334D392788N2122M2659L1965K1679J1878M24j4053k9885m4497n7730p1255q5171
50322D250924r7100j04832j08405j09250j08450j06239j02368r6486q8624p9353
50312C249817o9227n8321m6966l6456k8075k1708j6440j2411j1082j3461j8949
50301B916721k5991l3275m0301m7394n5013o2477o7797o9679o9237o8667o8483
50290B308407o7315o4370o0662n7526n5064n2613m9832m6807m3648m0422l7075
50279A733073l3418k9596k6378k4238k2482k0167j7750j6605j6835j6794j5189
$$ plain form
50356 2508887 2589422 2672232 2757955 2846996 2937776 3028279 3118463 3209699 3302305 3395090 3487238
50345 3487238 3579320 3671994 3764627 3855742 3944407 4030520 4113787 4192934 4266299 4332983 4392788
50334 4392788 4444910 4487569 4519534 4541213 4553091 4553515 4539462 4509577 4465080 4407350 4336095 4250924
50322 4250924 4153824 4048992 3940587 3831337 3722887 3616648 3514280 3417794 3329170 3249817
50312 3249817 3180590 3122269 3075303 3038847 3010772 2989064 2972624 2960213 2949131 2935670 2916721
50301 2916721 2890730 2857455 2817154 2769760 2714747 2652270 2584473 2514794 2445557 2376890 2308407
50290 2308407 2241092 2176722 2116060 2058534 2003470 1950857 1901025 1854218 1810570 1770148 1733073
50279 1733073 1699655 1670059 1643681 1619443 1596961 1576794 1559044 1542439 1525604 1508810 1493621
50268A493621j2576j0428r477r436r506q876p445o222o187o704o069l869j547
50255A395279k34O29J828K962L545M416O593R381J1174J1796J2777J5222J8754
50242A494122K2639K6817L1098L4321L5143L3556L0914K8505K6506K4367K1642
50231A809630J8214J4097R594N528K593L25k604o717j0922j3992j6308j9339k3702
50218A766397k8473l2264l4258l4414l3507l2873l3133l3181l1282k7312k2945
50207A422755j9649j7505j6206j5842j6029j5405j3132j0270q684q840r493r365
50195A262335q490p837q113r030r584r063p778o618o053n952o116o281n804m258
50181A161358k369j380j282q34L40J064O85M88J783L647M186L318K720L199L677
$$ plain form
50268 1493621 1481045 1470617 1461140 1451704 1442198 1433322 1425877 1419655 1413468 1406764 1400695 1396826 1395279
50255 1395279 1395045 1395674 1397502 1400464 1404009 1408425 1415018 1424399 1435573 1447369 1460146 1475368 1494122
50242 1494122 1516761 1543578 1574676 1608997 1644140 1677696 1708610 1737115 1763621 1787988 1809630
50231 1809630 1827844 1841941 1851535 1857063 1859656 1859981 1857377 1850660 1839738 1825746 1809438 1790099 1766397
50218 1766397 1737924 1705660 1671402 1636988 1603481 1570608 1537475 1504294 1473012 1445700 1422755
50207 1422755 1403106 1385601 1369395 1353553 1337524 1322119 1308987 1298717 1290033 1281193 1271700 1262335
50195 1262335 1253845 1246008 1237895 1228865 1219281 1210218 1202440 1195822 1189769 1183817 1177701 1171420 1165616 1161358
50181 1161358 1158989 1157609 1156327 1155493 1155833 1156897 1157582 1158070 1159853 1163500 1167686 1171004 1173724 1176923 1180600
50166A180600L074J851J214J691K824L590K989R58j062j357n8Q48l0j768k511
50151A192853j826q54n28m87K16J887L738M435L242R81l76M83K874M999N922O179
50135A223738O433O465N901N355N942P775R686J0654J0998J1799J3451J5223J6196
50122A349616J6291J6243J6757J7806J8787J9319J9672K0228K0780K0810K0463
50111A556772K0529K1287K1991K2100K2339K3776K6186K8407L0106L2246L5482
50100A841221L9037M1571M2502M2217M1651M2060M4456M8569N2845N6115N8886
50089B351130O2444O7130P2187P7034Q1877Q7160R3284J00789J10101J20826J31962
50078C355924J43167J55407J70022J87413K06854K27318K48135K68985K89344
$$ plain form
50166 1180600 1183674 1185525 1186739 1188430 1191254 1194844 1197833 1198791 1197729 1196372 1196314 1197162 1197132 1195364 1192853
50151 1192853 1191027 1190173 1189645 1189158 1189374 1191261 1194999 1199434 1202676 1203657 1203281 1203764 1206638 1211637 1217559 1223738
50135 1223738 1230171 1236636 1242537 1247892 1253834 1261609 1271295 1281949 1292947 1304746 1318197 1333420 1349616
50122 1349616 1365907 1382150 1398907 1416713 1435500 1454819 1474491 1494719 1515499 1536309 1556772
50111 1556772 1577301 1598588 1620579 1642679 1665018 1688794 1714980 1743387 1773493 1805739 1841221
50100 1841221 1880258 1921829 1964331 2006548 2048199 2090259 2134715 2183284 2236129 2292244 2351130
50089 2351130 2413574 2480704 2552891 2629925 2711802 2798962 2892246 2993035 3103136 3223962 3355924
50078 3355924 3499091 3654498 3824520 4011933 4218787 4446105 4694240 4963225 5252569
50069E252569L07827L22097L29724L29322L20850L04936K82503K55236K25985
50060G931049J97963J73395J52953J36133J21604J07143Q9792O6640L5661l892
50050I008441n1277j04037j58292k09760k54845k90997l16786l32235l38973l39127
50040F612112l33870l23369l08213k90048k70468k50013k28937k08309j89416
50031D209469j72333j56194j40770j26829j14744j03871r3678q4667p7426p1416
50021C067541o5447n8987n2409m6314m1132l7073l3791l0342k6205k2138j9380
50010B634323j7977j6666j4350j1063p354l515K70L601O167Q053R501J0703J2046
49997B613739J4106J6979K0079K3007K6152K9932L3831L7050L9876M3449M7922
$$ plain form
50069 5252569 5560396 5882493 6212217 6541539 6862389 7167325 7449828 7705064 7931049
50060 7931049 8129012 8302407 8455360 8591493 8713097 8820240 8910032 8976672 9012333 9008441
50050 9008441 8957164 8853127 8694835 8485075 8230230 7939233 7622447 7290212 6951239 6612112
50040 6612112 6278242 5954873 5646660 5356612 5086144 4836131 4607194 4398885 4209469
50031 4209469 4037136 3880942 3740172 3613343 3498599 3394728 3301050 3216383 3138957 3067541
50021 3067541 3002094 2943107 2890698 2844384 2803252 2766179 2732388 2702046 2675841 2653703 2634323
50010 2634323 2616346 2599680 2585330 2574267 2566913 2563398 2563668 2567269 2573436 2581489 2590990 2601693 2613739
49997 2613739 2627845 2644824 2664903 2687910 2714062 2743994 2777825 2814875 2854751 2898200 2946122
49986B946122N1915N4322N5945N8449O2135O5742O8547P1539P6011Q1730Q7334
49975C679791R2211R7048J02519J08394J14398J21215J29780J39931J50697J61898
49965D897882J74610J89713K06735K24723K43792K65133K89778L17942L49284
49956G159592L83079M18211M53505M87866N19310N44146N58454N60742N52329
49947A1637234N34990N09588M77738M43375M10991L82572L57103L32441L06389
49938A5392421K76249K38846J91350J31747N9202k4474j13925k02303k84718l58916
49928A5305479m23185m75644n16040n46211n67674n80057n83038n78348n68371
49919A0466911n53656n33350n07564m78014m46716m15353l85424l57618l31081
$$ plain form
49986 2946122 2998037 3052359 3108304 3166753 3228888 3294630 3363177 3434716 3510727 3592457 3679791
49975 3679791 3772002 3869050 3971569 4079963 4194361 4315576 4445356 4585287 4735984 4897882
49965 4897882 5072492 5262205 5468940 5693663 5937455 6202588 6492366 6810308 7159592
49956 7159592 7542671 7960882 8414387 8902253 9421563 9965709 10524163 11084905 11637234
49947 11637234 12172224 12681812 13159550 13602925 14013916 14396488 14753591 15086032 15392421
49938 15392421 15668670 15907516 16098866 16230613 16289815 16265341 16151416 15949113 15664395 15305479
49928 15305479 14882294 14406650 13890610 13344399 12776725 12196668 11613630 11035282 10466911
49919 10466911 9913255 9379905 8872341 8394327 7947611 7532258 7146834 6789216 6458135
49910F458135l04601k78626k55053k34889k17073j99908j82950j67133j53636
49901D464266j42848j34160j26672j20046j14436j09563j04627r9474r4989r1577
49891C325874q8155q3567p8262p3450o9242o4886o0263n5902n1861m7933m4523
49880B607830m1867l8924l4660l0053k6893k4884k2078j8120j4670j2168q877
49869B334636m224m11J039K102N445J0452J4381J6358J7759J9396K0874K2520
49857B460327K5582L0082L4490L7970M1351M5345M9455N3394N8213O5003P3447
$$ plain form
49910 6458135 6153534 5874908 5619855 5384966 5167893 4967985 4785035 4617902 4464266
49901 4464266 4321418 4187258 4060586 3940540 3826104 3716541 3611914 3512440 3417451 3325874
49891 3325874 3237719 3154152 3075890 3002440 2933198 2868312 2808049 2752147 2700286 2652353 2607830
49880 2607830 2565963 2527039 2492379 2462326 2435433 2410549 2388471 2370351 2355681 2343513 2334636
49869 2334636 2330412 2330001 2331040 2333142 2338587 2349039 2363420 2379778 2397537 2416933 2437807 2460327
49857 2460327 2485909 2515991 2550481 2588451 2629802 2675147 2724602 2777996 2836209 2901212 2974659
$$ [...]
##END NTUPLES=NMR SPECTRUM
##END=
