##TITLE=coffee_type TOSA02-feb23
COFFEE_meoh_noesyp64 COFFEE_meoh {C:\Bruker\TOPSPIN} Administrator 6
##JCAMPDX= 6.0         $$ Bruker NMR JCAMP-DX V2.0
##DATA TYPE= NMR SPECTRUM
##DATA CLASS= NTUPLES
##ORIGIN= Bruker BioSpin GmbH
##OWNER= Administrator
$$ 1.72 TOPSPIN		Version 2.1
$$ 2012-05-18 15:44:20.276 -0700  Administrator@X
$$ Compression mode = diff/dup
##.OBSERVE FREQUENCY= 400.13188235
##.OBSERVE NUCLEUS= ^1H
##.ACQUISITION MODE= SIMULTANEOUS (DQD)
##.ACQUISITION SCHEME= undefined
##.AVERAGES= 64
##.DIGITISER RES= 22
##SPECTROMETER/DATA SYSTEM= spect
##.PULSE SEQUENCE= noesygpps1d.comp
##.SOLVENT NAME= COFFEE_meoh
##.SHIFT REFERENCE= INTERNAL, COFFEE_meoh, 1, 14.98061
##AUDIT TRAIL= $$ (NUMBER, WHEN, WHO, WHERE, PROCESS, VERSION, WHAT)
$$ ##TITLE= Audit trail, TOPSPIN		Version 2.1
$$ ##JCAMPDX= 5.01
$$ ##ORIGIN= Bruker BioSpin GmbH
$$ ##OWNER= Administrator
$$ $$ C:\Bruker\TOPSPIN/data/Administrator/nmr/12-COFFEE-2302/72/pdata/1/auditp.txt
$$ ##AUDIT TRAIL=  $$ (NUMBER, WHEN, WHO, WHERE, PROCESS, VERSION, WHAT)
(   1,<2012-02-23 21:12:48.797 -0500>,<Administrator>,<TOPSPIN>,<go>,<TOPSPIN 2.1>,
      <created by zg
	started at 2012-02-23 21:01:18.672 -0500,
	POWCHK enabled, PULCHK disabled,
       configuration hash MD5:
       B0 76 FB 9C 50 81 44 7D 18 B3 26 32 4E 60 AD 96
       data hash MD5: 64K
       77 8F 29 62 65 FC D6 31 F4 F0 AD 69 84 C9 A6 58>)
(   2,<2012-02-23 21:12:51.531 -0500>,<Administrator>,<TOPSPIN>,<proc1d>,<TOPSPIN 2.1>,
      <Start of raw data processing
       efp LB = 0.3 FT_mod = 6 PKNL = 1 PHC0 = 0 PHC1 = 0 SI = 128K 
       data hash MD5: 128K
       A1 93 10 56 0B 1E 91 2D 1E 09 70 BE 87 07 6D 98>)
(   3,<2012-02-23 21:12:52.859 -0500>,<Administrator>,<TOPSPIN>,<proc1d>,<TOPSPIN 2.1>,
      <pk PHC0 = 24.71924 PHC1 = 0 
       data hash MD5: 128K
       D2 4E 75 24 34 E7 E9 16 0C 6B 1B 51 39 E1 50 48>)
(   4,<2012-02-23 21:12:53.297 -0500>,<Administrator>,<TOPSPIN>,<proc1d>,<TOPSPIN 2.1>,
      <abs ABSG = 1 
       data hash MD5: 128K
       F8 18 77 27 95 E1 13 76 33 05 A3 2A 81 7F 38 BB>)
(   5,<2012-02-23 21:12:53.375 -0500>,<Administrator>,<TOPSPIN>,<proc1d>,<TOPSPIN 2.1>,
      <abs ABSG = 2 
       data hash MD5: 128K
       36 5F 6C F7 59 8E 40 31 0A C6 88 43 05 7F 59 8D>)
(   6,<2012-02-23 21:12:53.437 -0500>,<Administrator>,<TOPSPIN>,<proc1d>,<TOPSPIN 2.1>,
      <abs ABSG = 3 
       data hash MD5: 128K
       C1 27 50 2D 84 6F E9 98 A5 7D 4C 37 F4 D7 48 F1>)
(   7,<2012-02-23 21:12:53.500 -0500>,<Administrator>,<TOPSPIN>,<proc1d>,<TOPSPIN 2.1>,
      <abs ABSG = 4 
       data hash MD5: 128K
       CC 99 D4 B9 4C A6 60 F2 C0 28 83 DD 87 AA 4C 93>)
(   8,<2012-02-23 21:12:53.547 -0500>,<Administrator>,<TOPSPIN>,<proc1d>,<TOPSPIN 2.1>,
      <abs ABSG = 5 
       data hash MD5: 128K
       50 C3 9C 57 8B B3 AD EB 15 AA 6B E6 65 6E 2D 21>)
(   9,<2012-02-23 21:12:53.672 -0500>,<Administrator>,<TOPSPIN>,<audit>,<TOPSPIN 2.1>,
      <user comment:
       ICON-NMR User ID: Administrator
$$ [...]
150 150 150 150 150 150 150 150
##$TP07= 0
##$TPNAME0= <>
##$TPNAME1= <>
##$TPNAME2= <>
##$TPNAME3= <>
##$TPNAME4= <>
##$TPNAME5= <>
##$TPNAME6= <>
##$TPNAME7= <>
##$TPOAL= (0..7)
0.5 0.5 0.5 0.5 0.5 0.5 0.5 0.5
##$TPOFFS= (0..7)
0 0 0 0 0 0 0 0
##$TUNHIN= 0
##$TUNHOUT= 0
##$TUNXOUT= 0
##$USERA1= <user>
##$USERA2= <user>
##$USERA3= <user>
##$USERA4= <user>
##$USERA5= <user>
##$V9= 5
##$VALIST= <valist>
##$VCLIST= <CCCCCCCCCCCCCCC>
##$VD= 0
##$VDLIST= <DDDDDDDDDDDDDDD>
##$VPLIST= <PPPPPPPPPPPPPPP>
##$VTLIST= <TTTTTTTTTTTTTTT>
##$WBST= 1024
##$WBSW= 4
##$XGAIN= (0..3)
0 0 0 0
##$XL= 0
##$YL= 0
##$YMAX_a= 14593947
##$YMIN_a= -6700362
##$ZGOPTNS= <>
##$ZL1= 120
##$ZL2= 120
##$ZL3= 120
##$ZL4= 120
##$ABSF1= 14.98061
##$ABSF2= -5.57192
##$ABSG= 5
##$ABSL= 3
##$ALPHA= 0
##$AQORDER= 0
##$ASSFAC= 0
##$ASSFACI= 0
##$ASSFACX= 0
##$ASSWID= 0
##$AUNMP= <proc_prof1d_extract>
##$AXLEFT= 0
##$AXNAME= <>
##$AXNUC= <1H>
##$AXRIGHT= 0
##$AXTYPE= 0
##$AXUNIT= <>
##$AZFE= 0.1
##$AZFW= 0.1
##$BCFW= 0
##$BC_mod= 0
##$BYTORDP= 0
##$COROFFS= 0
##$CY= 15
##$DATMOD= 1
##$DC= 0
##$DFILT= <>
##$DTYPP= 0
##$F1P= 0
##$F2P= 0
##$FCOR= 0.5
##$FTSIZE= 131072
##$FT_mod= 6
##$GAMMA= 0
##$GB= 0
##$INTBC= 1
##$INTSCL= 1
##$ISEN= 128
##$LB= 0.3
##$LEV0= 0
##$LPBIN= 0
##$MAXI= 10000
##$MC2= 0
##$MEAN= 0
##$ME_mod= 0
##$MI= 0
##$NCOEF= 0
##$NC_proc= -3
##$NLEV= 6
##$NOISF1= 0
##$NOISF2= 0
##$NSP= 0
##$NTH_PI= 0
##$NZP= 0
##$OFFSET= 14.98061
##$PC= 1
##$PHC0= 24.71924
##$PHC1= 0
##$PH_mod= 1
##$PKNL= yes
##$PPARMOD= 0
##$PPDIAG= 0
##$PPIPTYP= 0
##$PPMPNUM= 2147483647
##$PPRESOL= 1
##$PSCAL= 4
##$PSIGN= 0
##$PYNMP= <proc.py>
##$REVERSE= no
##$SF= 400.13
##$SI= 131072
##$SIGF1= 0
##$SIGF2= 0
##$SINO= 400
##$SIOLD= 131072
##$SPECTYP= <>
##$SREGLST= <1H.CDCl3>
##$SSB= 0
##$STSI= 131072
##$STSR= 0
##$SW_p= 8223.68421052632
##$SYMM= 0
##$S_DEV= 0
##$TDeff= 65536
##$TDoff= 0
##$TI= <>
##$TILT= no
##$TM1= 0
##$TM2= 0
##$TOPLEV= 0
##$USERP1= <user>
##$USERP2= <user>
##$USERP3= <user>
##$USERP4= <user>
##$USERP5= <user>
##$WDW= 1
##$XDIM= 131072
##$YMAX_p= 499043869
##$YMIN_p= -181215156
##$CURPLOT= <Network HP LaserJet P1505>
##$CURPRIN= <$Network HP LaserJet P1505>
##$DFORMAT= <normdp>
##$LAYOUT= <+/1D_H.xwp>
##$LFORMAT= <normlp>
##$PFORMAT= <normpl>
##$SURQMSG= 1
$$ End of Bruker specific parameters
$$ ---------------------------------
##NTUPLES= NMR SPECTRUM
##VAR_NAME=  FREQUENCY,     SPECTRUM/REAL,   SPECTRUM/IMAG
##SYMBOL=    X,             R,               I
##VAR_TYPE=  INDEPENDENT,   DEPENDENT,       DEPENDENT
##VAR_FORM=  AFFN,          ASDF,            ASDF
##VAR_DIM=   131072,        131072,          131072
##UNITS=     HZ,            ARBITRARY UNITS, ARBITRARY UNITS
##FACTOR=    0.0627417313425165, 1,          1
##FIRST=     8223.62146879498, 6029,         -91082
##LAST=      0,             9640,            -90935
##MIN=       0,             -181215156,      0
##MAX=       8223.62146879498, 499043869,    0
$$ Real data points
##PAGE= N=1
##DATA TABLE= (X++(R..R)), XYDATA
$$ [...]
60730A162050j0417r362p570m715j902o78j134j768j248M37K596M800O886Q594
60716A146569R686J0266J0810J1819J3365J4887J5567J5257J4825J5231J6321
60705A294603J6967J6519J5579J5062J4850J4036J2436J1105J0866J0959J0063
60694A443045Q364P449P911Q297P186N343M642N517O673P045O721O024M821L125
60680A532163J341l39k023l449m110m335n218o991q255p554n301l546m044o839
60666A471500j0337j2608j2938j2276j1904j1815j0957q974o808n379m536l787
60654A359181l257l332l870m339m370l881l087k656l316m894o225o500o176o018
60640A297260n808m741k877j408j281k107k656k262j390p56j58J286L552M993
$$ y = [1162050, 1151633, 1142271, 1134701, 1129986, 1128084, 1127406, 1126272, 1124504, 1123256, 1123693, 1126289, 1131089, 1137975, 1146569, 1156255, 1166521, 1177331, 1189150, 1202515, 1217402, 1232969, 1248226, 1263051, 1278282, 1294603, 1311570, 1328089, 1343668, 1358730, 1373580, 1387616, 1400052, 1411157, 1422023, 1432982, 1443045, 1451409, 1458858, 1466769, 1475066, 1482252, 1487595, 1492237, 1497754, 1504427, 1511472, 1518193, 1524217, 1529038, 1532163, 1533504, 1533165, 1531142, 1527693, 1523583, 1519248, 1514030, 1507039, 1498784, 1491230, 1485929, 1482383, 1478339, 1471500, 1461163, 1448555, 1435617, 1423341, 1411437, 1399622, 1388665, 1379691, 1372883, 1367504, 1362968, 1359181, 1355924, 1352592, 1348722, 1344383, 1340013, 1336132, 1333045, 1330389, 1327073, 1322179, 1315954, 1309454, 1303278, 1297260, 1291452, 1286711, 1283834, 1282426, 1281145, 1279038, 1276382, 1274120, 1272730, 1271974, 1271816, 1273102, 1276654, 1281647]
60626A281647L937O86k835n312p091r013j1130j2961j4218j4820j4735j4163j3588
60613A166404j3400j3809j4948j6429j6998j5604j2867j0519r127p612n299l091
60601A026701j820q13Q16K455L061L101L924N570O745O861O675O767O741O329
60587A083113O074O271O212N255L998L604M260M918M493K837P35o59n16J092L218
60572A134905M803N465N559N725O567Q356J0671J2497J3223J3487J4474J6429
60560A252161J8421J9650K0184K0164J9306J7953J7628J9200K1102K0970J8929
60549A465668J7452J7558J7121J4017R284N485K950l91n718j1578j5608j6965
60537A499275j6890j7537k0069k3193k4071k1485j7427j4543j2925j1083r154
$$ y = [1281647, 1285584, 1286270, 1283435, 1278123, 1271032, 1262019, 1250889, 1237928, 1223710, 1208890, 1194155, 1179992, 1166404, 1153004, 1139195, 1124247, 1107818, 1090820, 1075216, 1062349, 1051830, 1042703, 1035091, 1029792, 1026701, 1024881, 1024068, 1024884, 1027339, 1030400, 1033501, 1037425, 1042995, 1049740, 1056601, 1063276, 1070043, 1076784, 1083113, 1089187, 1095458, 1101670, 1106925, 1110923, 1114527, 1118787, 1123705, 1128198, 1131035, 1131770, 1131111, 1130595, 1131687, 1134905, 1139708, 1145173, 1150732, 1156457, 1163024, 1171380, 1182051, 1194548, 1207771, 1221258, 1235732, 1252161, 1270582, 1290232, 1310416, 1330580, 1349886, 1367839, 1385467, 1404667, 1425769, 1446739, 1465668, 1483120, 1500678, 1517799, 1531816, 1541100, 1546585, 1549535, 1549144, 1543426, 1531848, 1516240, 1499275, 1482385, 1464848, 1444779, 1421586, 1397515, 1376030, 1358603, 1344060, 1331135, 1320052, 1310898]
60526A310898q719r503q963n949k513q05j27J339L441M584M416M153M508M922
60512A301682M725L935K831J692R91J038J491J754J843K272L155M068M835N901
60498A342213P709R972J1710J2104J1307J0289R758R491R085Q858R280R887R944
60485A471607J0098J2088J6339K1072K4519K7094L0503L5297M0168M3336M4048
60474A776169M2847M0640L7302L1439K2138J0754K9q577j5480k0976k4212k4695
60462A867378k3235k0613j6608j1280n827j020L902R572J4893J8532K1036K3886
60450A880616K7286L0416L3174L6045L8894M1569M5186N1057N8590O6037P3204
60439B382074Q1644R2103J03685J15853J29488J45208J62132J79163J96337K14014
$$ y = [1310898, 1302179, 1292676, 1283713, 1277764, 1275251, 1274446, 1274319, 1275658, 1279099, 1283683, 1288099, 1292252, 1296760, 1301682, 1306407, 1310342, 1313173, 1314865, 1315856, 1316894, 1318385, 1320139, 1321982, 1324254, 1327409, 1331477, 1336312, 1342213, 1349922, 1359894, 1371604, 1383708, 1395015, 1405304, 1415062, 1424553, 1433638, 1442496, 1451776, 1461663, 1471607, 1481705, 1493793, 1510132, 1531204, 1555723, 1582817, 1613320, 1648617, 1688785, 1732121, 1776169, 1819016, 1859656, 1896958, 1928397, 1950535, 1961289, 1961318, 1952741, 1937261, 1916285, 1892073, 1867378, 1844143, 1823530, 1806922, 1795642, 1789815, 1788795, 1792697, 1802269, 1817162, 1835694, 1856730, 1880616, 1907902, 1938318, 1971492, 2007537, 2046431, 2088000, 2133186, 2184243, 2242833, 2308870, 2382074, 2463718, 2555821, 2659506, 2775359, 2904847, 3050055, 3212187, 3391350, 3587687, 3801701]
60429C801701K31883K49789K68842K90538L14870L39858L62487L79261L85812
60420F625041L76802L47086K93680K17339J22686J7084r0690j91545k77443l43094
60410G096946l86753m09634m14924m07055l90370l67595l40087l09927k80431
60401C790170k53698k28973k05070j83291j65788j51723j37701j22434j08525
60392B232967r8471r0922q2689p3148o4625n8818n4756n0650m6285m2641l9937
60381A530025l7264l4185l1589l0239k9214k6856k3205k0184j9097j9053j8632
60370A240507j7830j7300j6646j4959j2647j1127j0837j0741j0006q971q345q269
60358A092829q379q090o897n039l562k826j576J285M567O071N792N896P372Q712
$$ y = [3801701, 4033584, 4283373, 4552215, 4842753, 5157623, 5497481, 5859968, 6239229, 6625041, 7001843, 7348929, 7642609, 7859948, 7982634, 7999718, 7909028, 7717483, 7440040, 7096946, 6710193, 6300559, 5885635, 5478580, 5088210, 4720615, 4380528, 4070601, 3790170, 3536472, 3307499, 3102429, 2919138, 2753350, 2601627, 2463926, 2341492, 2232967, 2134496, 2043574, 1960885, 1887737, 1823112, 1764294, 1709538, 1658888, 1612603, 1569962, 1530025, 1492761, 1458576, 1426987, 1396748, 1367534, 1340678, 1317473, 1297289, 1278192, 1259139, 1240507, 1222677, 1205377, 1188731, 1173772, 1161125, 1149998, 1139161, 1128420, 1118414, 1109443, 1101098, 1092829, 1084450, 1076360, 1069463, 1064424, 1060862, 1058036, 1056460, 1057745, 1062312, 1068383, 1074175, 1080071, 1087443, 1096155]
60344A096155Q450P103N646M000K355K315M847Q074R029P279N167M641N321N744
60330A176126N277M327L565L477M173N331O374O783O210M671K877J909K042K291
60316A235433J654M15m28o40q50j327j651j577j364j032k45O94P34k99q06P05
60300A229416L385N057N251N646P113Q133P436O685Q457J2185J4444J3547J1682
60287A338437J1650J3341J4715J4827J4220J3309J2055J0787R783Q313N404J481
60275A468322j912l845m422l868k418q93m4N11J494K350J928O84M64J793L010
60260A463154K547O69j636l965o021p266p940r113j0726j0868q312m682k657k716
60246A390468l155k813k197j926j589o28O33J611K527M023N779O173L973K36k296
$$ y = [1096155, 1104605, 1111708, 1117354, 1121354, 1123709, 1126024, 1130871, 1138945, 1147974, 1155253, 1160420, 1165061, 1170382, 1176126, 1181403, 1185730, 1189295, 1192772, 1196945, 1202276, 1208650, 1215433, 1221643, 1226314, 1229191, 1231100, 1233142, 1235433, 1237087, 1237502, 1237074, 1236434, 1235584, 1234257, 1232606, 1231029, 1229665, 1228633, 1228388, 1229082, 1229816, 1229517, 1228711, 1229416, 1232801, 1237858, 1243109, 1248755, 1255868, 1264001, 1271437, 1278122, 1286579, 1298764, 1313208, 1326755, 1338437, 1350087, 1363428, 1378143, 1392970, 1407190, 1420499, 1432554, 1443341, 1453124, 1461437, 1466841, 1468322, 1466410, 1462565, 1458143, 1454275, 1451857, 1450964, 1450920, 1451431, 1452925, 1455275, 1457203, 1457887, 1458351, 1460144, 1463154, 1465701, 1466370, 1464734, 1460769, 1454748, 1447482, 1439542, 1430429, 1419703, 1408835, 1400523, 1395841, 1393184, 1390468, 1387313, 1384500, 1382303, 1380377, 1378788, 1378160, 1378793, 1380404, 1382931, 1386954, 1392733, 1398906, 1402879, 1403115, 1400819]
60231A400819k157q01n51j594k296k097k234l226l481j496J821M442N948P672
60217A400769J0488J3682J5947J6464J5213J3058J1577J1943J3669J5069J5109
60206A552988J4500J4788J6664J9318K1343K2180K2593K3680K5699K8191L0977
60195A792921L4301L8044M1561M4557M7566N1302N6063O1809O8242P4643Q0380
60184B391389Q5715R1516R8197J05715J14384J24323J34038J41288J46079J51101
60174C583745J58072J65105J69246J70345J70440J70077J67396J60863J50959
60165E066248J38829J24811J08933R1643P3440N4679L6266J9617N274p675k0025
60154E692040l0854l8235m1232m0464l6856l0736k2424j2922l199P093J9381L4415
$$ y = [1400819, 1398662, 1397861, 1397310, 1395716, 1393420, 1391323, 1389089, 1385863, 1382382, 1380886, 1382707, 1387149, 1393097, 1400769, 1411257, 1424939, 1440886, 1457350, 1472563, 1485621, 1497198, 1509141, 1522810, 1537879, 1552988, 1567488, 1582276, 1598940, 1618258, 1639601, 1661781, 1684374, 1708054, 1733753, 1761944, 1792921, 1827222, 1865266, 1906827, 1951384, 1998950, 2050252, 2106315, 2168124, 2236366, 2311009, 2391389, 2477104, 2568620, 2666817, 2772532, 2886916, 3011239, 3145277, 3286565, 3432644, 3583745, 3741817, 3906922, 4076168, 4246513, 4416953, 4587030, 4754426, 4915289, 5066248, 5205077, 5329888, 5438821, 5530464, 5603904, 5658583, 5694849, 5714466, 5719740, 5712065, 5692040, 5661186, 5622951, 5581719, 5541255, 5504399, 5473663, 5451239, 5438317, 5435118, 5442211, 5461592, 5496007]
60142E496007N1198O7999Q3823R8488J12037J24915J38031J51212J61954J67330
60132F652994J67232J64030J58678J49150J33721J13859R2247O9554M5269K0563
60122G767297k338k3321m4461o6374q6526j01889j11729j16958j18184j15482
60112F980035j09083r9224q5918o9662n1795l3396j4465N166K4756M3355O1041
60101F650810P8297R4407J07449J15946J19684J18852J13446J03937R1824P8733
60091G673385O5331N1665L8169K5614J4320M340l432p223o023n66P964J9668L5447
60078G918659N5106P6958R9463J22438J46443J71761J98569K27296K58114K90259
60068I565066L22437L53837L84431M14334M43253M70461M94984N15614N30838
$$ y = [5496007, 5547205, 5615204, 5699027, 5797515, 5909552, 6034467, 6172498, 6323710, 6485664, 6652994, 6820226, 6984256, 7142934, 7292084, 7425805, 7539664, 7631911, 7701465, 7746734, 7767297, 7764959, 7741638, 7697177, 7630803, 7544277, 7442388, 7330659, 7213701, 7095517, 6980035, 6870952, 6771728, 6685810, 6616148, 6564353, 6530957, 6516492, 6521658, 6546414, 6589769, 6650810, 6729107, 6823514, 6930963, 7046909, 7166593, 7285445, 7398891, 7502828, 7594652, 7673385, 7738716, 7790381, 7828550, 7854164, 7868484, 7872824, 7869392, 7862169, 7856146, 7855580, 7863544, 7883212, 7918659, 7973765, 8050723, 8150186, 8272624, 8419067, 8590828, 8789397, 9016693, 9274807, 9565066, 9887503, 10241340, 10625771, 11040105, 11483358, 11953819, 12448803, 12964417, 13495255]
60059A3495255N38973N38680N29394N11072M83470M46225L99985L46681K87967
60050A7577702K23928J54248Q0191M119p2530j49056k23067k90093l46609l92180
60040A6566653m27637m52278m64298m63223m50695m29081m00375l66135l27528
60031A2785403k85383k40830j95693j51721j09642o9532l1826K501L2446N7054
60021A1792777P5363Q6791R1416Q9494Q1176O7061M8500K6814K644k3424n0138
60010A2288474p6028j00352j23055j44197j63677j81148j96106k08559k19443
60001A0875909k29284k36412k38088k33900k26428k17787k07236j93345j76656
59992H916773j58433j38386j15815r2002o9003m6703k3282J761K7083N1627P5119
$$ y = [13495255, 14034228, 14572908, 15102302, 15613374, 16096844, 16543069, 16943054, 17289735, 17577702, 17801630, 17955878, 18036069, 18040188, 17967658, 17818602, 17595535, 17305442, 16958833, 16566653, 16139016, 15686738, 15222440, 14759217, 14308522, 13879441, 13479066, 13112931, 12785403, 12500020, 12259190, 12063497, 11911776, 11802134, 11732602, 11700776, 11703277, 11735723, 11792777, 11868140, 11954931, 12046347, 12135841, 12217017, 12284078, 12332578, 12359392, 12362036, 12338612, 12288474, 12212446, 12112094, 11989039, 11844842, 11681165, 11500017, 11303911, 11095352, 10875909, 10646625, 10410213, 10172125, 9938225, 9711797, 9494010, 9286774, 9093429, 8916773, 8758340, 8619954, 8504139, 8412137, 8343134, 8296431, 8273149, 8274910, 8301993, 8353620, 8428739]
59981H428739R6668J15148J30943J44986J55851J60162J56558J47067J33863J16789
59971I786774R5127O9786M2434J3833j5753m5718p5571j04873j31992j54376j71080
59960I308591j83424j92147j95739j92963j85251j74620j60781j42663j21650
59951G759353j00578p9837n7242l2013o367J7651M0807O4848Q9681J13987J37508
59940G947798J60904J83645K03721K19773K32313K42146K48206K47849K39132
59931I925487K22220J98570J69406J35491R7952N8591J9155j9400n6760r2481
59921A0658231j25418j53836j76088j91374j99763k01539j96750j85590j68984
59912I058889j48428j25393j01034p6048n0510k4185K591K8803N3886P8270J01886
$$ y = [8428739, 8525407, 8640555, 8771498, 8916484, 9072335, 9232497, 9389055, 9536122, 9669985, 9786774, 9881901, 9951687, 9994121, 10007954, 9992201, 9946483, 9870912, 9766039, 9634047, 9479671, 9308591, 9125167, 8933020, 8737281, 8544318, 8359067, 8184447, 8023666, 7881003, 7759353, 7658775, 7578938, 7521696, 7489683, 7483316, 7500967, 7541774, 7606622, 7696303, 7810290, 7947798, 8108702, 8292347, 8496068, 8715841, 8948154, 9190300, 9438506, 9686355, 9925487, 10147707, 10346277, 10515683, 10651174, 10749126, 10807717, 10826872, 10807472, 10750712, 10658231, 10532813, 10378977, 10202889, 10011515, 9811752, 9610213, 9413463, 9227873, 9058889, 8910461, 8785068, 8684034, 8607986, 8557476, 8533291, 8535882, 8564685, 8618571, 8696841, 8798727]
59901H798727J22767J38572J49476J58240J66879J74190J77188J74323J66728
59892A0227090J56762J45974J34431J21759J08595R6656Q7147P9695P3559O9453
59882A1301121O9161P3626Q2482R5533J13537J37238J66412K00229K37647K77355
59872A2754341L18128L59468M01115M41755M78981N10508N34309N47532N46706
59863A6892843N29515M95245M43162L72250K83570J81689P2601l8781j48032k49548
59853A8834514l37659m09313m64342n03121n25373n31543n24149n06788m81977
59844A4550249m50343m12041l68674l23286k78098k32854j86336j39137r3545
59835A2065935n0682r502L0703O8495J02069J31326J56587J76309J87884J90074
$$ y = [8798727, 8921494, 9060066, 9209542, 9367782, 9534661, 9708851, 9886039, 10060362, 10227090, 10383852, 10529826, 10664257, 10786016, 10894611, 10991267, 11078414, 11158109, 11231668, 11301121, 11370282, 11443908, 11526390, 11621923, 11735460, 11872698, 12039110, 12239339, 12476986, 12754341, 13072469, 13431937, 13833052, 14274807, 14753788, 15264296, 15798605, 16346137, 16892843, 17422358, 17917603, 18360765, 18733015, 19016585, 19198274, 19270875, 19232094, 19084062, 18834514, 18496855, 18087542, 17623200, 17120079, 16594706, 16063163, 15539014, 15032226, 14550249, 14099906, 13687865, 13319191, 12995905, 12717807, 12484953, 12298617, 12159480, 12065935, 12015253, 12005751, 12036454, 12104949, 12207018, 12338344, 12494931, 12671240, 12859124, 13049198]
59825A3049198J82872J65428J36136R5096M4873j1540p2166j34981j96850k54437
59815A3003629l05455l48359l81631m04326m17080m21732m19798m11708l97590
59806I495950l78458l56179l32254l07147k81203k55717k32045k09806j87263
59797F955878j63997j42014j23338j07689r3747q1787p3409o8922o6703o5160
59787E969112o3936o2912o1415n9000n5937n2415m8075m3023l8495l5865l5448
59776E412591l6800l9714m4206m9796n5378n9866o2733o3936o3483o1205n7144
59765D818330n2147m7628m4212m0980l6608l0980k4898j8423j0732j806O757J3363
59753D530036J8204K2808K8432L5421M3611N2416O0710O7593P3469P9627Q6353
$$ y = [13049198, 13232070, 13397498, 13533634, 13628730, 13673603, 13662063, 13589897, 13454916, 13258066, 13003629, 12698174, 12349815, 11968184, 11563858, 11146778, 10725046, 10305248, 9893540, 9495950, 9117492, 8761313, 8429059, 8121912, 7840709, 7584992, 7352947, 7143141, 6955878, 6791881, 6649867, 6526529, 6418840, 6325093, 6243306, 6169897, 6100975, 6034272, 5969112, 5905176, 5842264, 5780849, 5721849, 5665912, 5613497, 5565422, 5522399, 5483904, 5448039, 5412591, 5375791, 5336077, 5291871, 5242075, 5186697, 5126831, 5064098, 5000162, 4936679, 4875474, 4818330, 4766183, 4718555, 4674343, 4633363, 4596755, 4565775, 4540877, 4522454, 4511722, 4509916, 4516673, 4530036, 4548240, 4571048, 4599480, 4634901, 4678512, 4730928, 4791638, 4859231, 4932700, 5012327, 5098680]
59742E098680R1888R3891R1795Q7185Q1783P5626O7861N8865N0671M4980M1571
59731E884796L9205L7548L7505M0040M5452N3668O4488P7522R2524J09743J29262
59720F611753J50079J70861J92004K15953K44800K78056L13431L49286L85385
59711H911608M21397M55487M84515N04751N11788M99996M63107L96625L01033
59702A2950307J83661N7397o3457j67586k48661l04610l36220l46686l41283l25620
59692A1057242l03093k74276k39168j99683j59265j20425q3700m8975j6527J3902
59682I626032M3917P5011J06571J36523J63992J90457K18082K47654K78476L09723
59672A1396438L41438L74414M09411M46517M85483N26710N71239O19151O68588
$$ y = [5098680, 5190568, 5284459, 5376254, 5463439, 5545222, 5620848, 5688709, 5747574, 5798245, 5843225, 5884796, 5924001, 5961549, 5999054, 6039094, 6084546, 6138214, 6202702, 6280224, 6372748, 6482491, 6611753, 6761832, 6932693, 7124697, 7340650, 7585450, 7863506, 8176937, 8526223, 8911608, 9333005, 9788492, 10273007, 10777758, 11289546, 11789542, 12252649, 12649274, 12950307, 13133968, 13191365, 13127908, 12960322, 12711661, 12407051, 12070831, 11724145, 11382862, 11057242, 10754149, 10479873, 10240705, 10041022, 9881757, 9761332, 9677632, 9628657, 9612130, 9626032, 9669949, 9744960, 9851531, 9988054, 10152046, 10342503, 10560585, 10808239, 11086715, 11396438, 11737876, 12112290, 12521701, 12968218, 13453701, 13980411, 14551650, 15170801, 15839389]
59663A5839389P17646P67008Q19058Q73964R28065R77094J019619J055905J084347
59654B4082095J101111J103409J091604J067955J035030R96031R55336R17331
59646C2349902Q85046Q60519Q45509Q40520Q43406Q50017Q56015Q57209Q48555
59637D0036698Q24675P82199P20826O41792N46528M37671L20491K01931Q8299
59628D4601110j5467j04915j75844k25287k52099k56482k39627k03772j51682
59619D2975935q5567o824Q3188J82697K89934M03259N20456O38437P53847Q63465
59609D6618827R63708J050129J117454J159439J168455J136272J056166R24477
59601E5194927P40693N07737K33503o8415l80692o85466r66173j208546j402516
$$ y = [15839389, 16557035, 17324043, 18143101, 19017065, 19945130, 20922224, 21941843, 22997748, 24082095, 25183206, 26286615, 27378219, 28446174, 29481204, 30477235, 31432571, 32349902, 33234948, 34095467, 34940976, 35781496, 36624902, 37474919, 38330934, 39188143, 40036698, 40861373, 41643572, 42364398, 43006190, 43552718, 43990389, 44310880, 44512811, 44601110, 44585643, 44480728, 44304884, 44079597, 43827498, 43571016, 43331389, 43127617, 42975935, 42890368, 42883544, 42966732, 43149429, 43439363, 43842622, 44363078, 45001515, 45755362, 46618827, 47582535, 48632664, 49750118, 50909557, 52078012, 53214284, 54270450, 55194927, 55935620, 56443357, 56676860, 56608445, 56227753, 55542287, 54576114, 53367568, 51965052]
59592E1965052j544034j634297j677059j677286j641940j580222j501752j414807
59584C9293655j326752j245668j180659j140071j128613j144877j180824j224101
59576B9722090j262270j286238j291270j276248j242763j194406j135796j071375
59568A9961724j004456r36877q69424q02848p38499o77752o20946n67543n17577
59559A3225802m72205m32342l97134l64547l33226l03313k75614k50733k29055
59550A0167633k10756j95501j82605j71849j63737j58624j56060j55393j56525
59541H616583j59478j63503j67295j69931j70987j70082j67171j63092j58663
59532G126381j53055j44445j32770j20525j09778r9643q8139p5533o3868n3558
$$ y = [51965052, 50421018, 48786721, 47109662, 45432376, 43790436, 42210214, 40708462, 39293655, 37966903, 36721235, 35540576, 34400505, 33271892, 32127015, 30946191, 29722090, 28459820, 27173582, 25882312, 24606064, 23363301, 22168895, 21033099, 19961724, 18957268, 18020391, 17150967, 16348119, 15609620, 14931868, 14310922, 13743379, 13225802, 12753597, 12321255, 11924121, 11559574, 11226348, 10923035, 10647421, 10396688, 10167633, 9956877, 9761376, 9578771, 9406922, 9243185, 9084561, 8928501, 8773108, 8616583, 8457105, 8293602, 8126307, 7956376, 7785389, 7615307, 7448136, 7285044, 7126381, 6973326, 6828881, 6696111, 6575586, 6465808, 6366165, 6278026, 6202493, 6138625, 6085067]
59522F085067m2763l0648j9106j0062k685N149J3710K1442K7590L3047L8559M3637
59510F162937M7693N1075N4438N7998O2051O7378P4314Q1927Q9048R5951J04265
59499F949075J15131J28132J42085J56307J70710J85400K00778K17797K37245
59490H502660K58635K80378L01221L21169L40833L60272L78826L95613M09713
59481A1549320M19982M25208M24591M18015M05944L88985L67205L39860L06420
59472A5045530K68213K28423J89929J53525J18735Q5779N5895L0098Q678p954
59462A6176851j8653k2032j7364n086J3404L6790O4918R8089J34742J70625K01110
59451A6833394K23498K36122K36376K21459J90619J44956Q5454J3363o7699j52390
$$ y = [6085067, 6042304, 6011656, 5992550, 5982488, 5979803, 5984952, 5998662, 6020104, 6047694, 6080741, 6119300, 6162937, 6210630, 6261705, 6316143, 6374141, 6436192, 6503570, 6577884, 6659811, 6748859, 6844810, 6949075, 7064206, 7192338, 7334423, 7490730, 7661440, 7846840, 8047618, 8265415, 8502660, 8761295, 9041673, 9342894, 9664063, 10004896, 10365168, 10743994, 11139607, 11549320, 11969302, 12394510, 12819101, 13237116, 13643060, 14032045, 14399250, 14739110, 15045530, 15313743, 15542166, 15732095, 15885620, 16004355, 16090134, 16146029, 16176127, 16184805, 16176851, 16158198, 16136166, 16118802, 16113716, 16127120, 16163910, 16228828, 16326917, 16461659, 16632284, 16833394, 17056892, 17293014, 17529390, 17750849, 17941468, 18086424, 18171878, 18185241, 18117542, 17965152]
59441A7965152k37025l20142l99063m68177n22149n59349n81014n88569n83263
59432A3706401n67032n42004n09823m72576m33225l93917l54730l15435k77345
59423I840314k41799k07856j73509j38771j05833p6149m8943k2478M407L2156
59413H861539O0564Q8785J15944J41838J66688J90633K13929K36725K57936K75250
59403A0609831K87304K94706K97569K93177K77944K51032K14173J68650J14807
59394A2809193N4392r071p2868j36088j97383k53514l01154l38982l67365l87081
59384A0800079l99104m04471m03617l96524l84034l68100l50298l30964l10258
59375G452709k89094k68403k48298k28656k09799j91956j74667j57422j40597
$$ y = [17965152, 17728127, 17407985, 17008922, 16540745, 16018596, 15459247, 14878233, 14289664, 13706401, 13139369, 12597365, 12087542, 11614966, 11181741, 10787824, 10433094, 10117659, 9840314, 9598515, 9390659, 9217150, 9078379, 8972546, 8896397, 8847454, 8824976, 8829383, 8861539, 8922103, 9010888, 9126832, 9268670, 9435358, 9625991, 9839920, 10076645, 10334581, 10609831, 10897135, 11191841, 11489410, 11782587, 12060531, 12311563, 12525736, 12694386, 12809193, 12863585, 12854514, 12781646, 12645558, 12448175, 12194661, 11893507, 11554525, 11187160, 10800079, 10400975, 9996504, 9592887, 9196363, 8812329, 8444229, 8093931, 7762967, 7452709, 7163615, 6895212, 6646914, 6418258, 6208459, 6016503, 5841836, 5684414, 5543817]
59366E543817j25112j11369r8911q6928p4922o3023n1765m1486l1959k2819j4033
59355D821490n654K610J1145K0046K9314L8668M6566N0153M7566M0260L2282K7417
59343E161863K7507L2616M1493N2206O3676P6403R0553J03888J13163J17474J18833
59332E999675J19784J22135J27903J39125J55934J76195J97835K20307K43651
59323G502544K67786K93321L21436L52233L84709M19031M57138M99937N45433
59314A1043568N91056O36648O83541P31329P77043Q17109Q48794Q69858Q78064
59305A7877010Q71647Q50220Q15189P69261P15213O55303N92068N28910M68481
59296B4143302M10894L54873L00453K48506J97589J43664Q3899J8657n1246j26869
$$ y = [5543817, 5418705, 5307336, 5208425, 5121497, 5046575, 4983552, 4931787, 4890301, 4858342, 4835523, 4821490, 4815836, 4818446, 4829591, 4849637, 4878951, 4917619, 4964185, 5014338, 5061904, 5102164, 5134446, 5161863, 5189370, 5221986, 5263479, 5315685, 5379361, 5455764, 5546317, 5650205, 5763368, 5880842, 5999675, 6119459, 6241594, 6369497, 6508622, 6664556, 6840751, 7038586, 7258893, 7502544, 7770330, 8063651, 8385087, 8737320, 9122029, 9541060, 9998198, 10498135, 11043568, 11634624, 12271272, 12954813, 13686142, 14463185, 15280294, 16129088, 16998946, 17877010, 18748657, 19598877, 20414066, 21183327, 21898540, 22553843, 23145911, 23674821, 24143302, 24554196, 24909069, 25209522, 25458028, 25655617, 25799281, 25883180, 25901837, 25850591, 25723722]
59286B5723722k08724k93832l77588m57553n33153o02532o62268p10306p47206
59277B1130560p74226p91811q00245q00216p92170p76210p53069p24287o91161
59268A4227165o54400o15043n74703n34426m94119m53694m14264l77449l43756
59259I765311l12182k81502k51498k22794j95872j70808j47944j27900j10382
59250G944429r3647p6235n8897m3506l0122j6565j224J4999L0295M4269N7635
59239G771431P0566Q2557R3506J03907J13978J23193J30587J35279J37031J36402
59229H898437J33996J29651J23175J15704J09083J03635R7882R1041Q4465Q0038
59219I967107P8415P9668Q4032R0744R7449J02165J04872J06000J04667J00128
$$ y = [25723722, 25514998, 25221166, 24843578, 24386025, 23852872, 23250340, 22588072, 21877766, 21130560, 20356334, 19564523, 18764278, 17964062, 17171892, 16395682, 15642613, 14918326, 14227165, 13572765, 12957722, 12383019, 11848593, 11354474, 10900780, 10486516, 10109067, 9765311, 9453129, 9171627, 8920129, 8697335, 8501463, 8330655, 8182711, 8054811, 7944429, 7850782, 7774547, 7715650, 7672144, 7642022, 7625457, 7624233, 7639232, 7669527, 7713796, 7771431, 7841997, 7924554, 8018060, 8121967, 8235945, 8359138, 8489725, 8625004, 8762035, 8898437, 9032433, 9162084, 9285259, 9400963, 9510046, 9613681, 9711563, 9802604, 9887069, 9967107, 10045522, 10125190, 10209222, 10299966, 10397415, 10499580, 10604452, 10710452, 10815119, 10915247]
59209A0915247R3705Q7047P9012O6564M8721K7672N738j6880m0835o5516q9087
59198A1111388j09660j26094j38257j46709j51384j50837j43813j31552j17392
59189I895690j03676q9963p4574n6909l7875j8912j326J3950K6536L6532M4050
59178I633523M9004N1467N2055N1744N1189N0177M8125M5569M4827M8132N5208
59167A0181020O3898P3537Q6210J03957J26409J52396J82324K17011K55123K93901
59157A1735786L31907L68953M03494M32063M51483M59823M54850M33610L94404
59148A5466373L37960K66020J80028Q2064k3998j33079k40093l40292m29420n04249
59138A4661314n62596o02870o24695o30128o22923o05999n80700n48938n14378
$$ y = [10915247, 11008952, 11095999, 11175011, 11241575, 11290296, 11317968, 11323706, 11306826, 11265991, 11200475, 11111388, 11001728, 10875634, 10737377, 10590668, 10439284, 10288447, 10144634, 10013082, 9895690, 9792014, 9702051, 9627477, 9570568, 9532693, 9513781, 9512455, 9526405, 9552941, 9589473, 9633523, 9682527, 9733994, 9786049, 9837793, 9888982, 9939159, 9987284, 10032853, 10077680, 10125812, 10181020, 10244918, 10318455, 10404665, 10508622, 10635031, 10787427, 10969751, 11186762, 11441885, 11735786, 12067693, 12436646, 12840140, 13272203, 13723686, 14183509, 14638359, 15071969, 15466373, 15804333, 16070353, 16250381, 16332445, 16308447, 16175368, 15935275, 15594983, 15165563, 14661314, 14098718, 13495848, 12871153, 12241025, 11618102, 11012103, 10431403, 9882465, 9368087]
59129I368087m80124m46223m11147l75309l41551l12007k86026k61729k38590
59120F215381k17487j98825j81929j66333j52433j40087j27621j13604r9277q7555
59110D730230p9274p1947o2984n2736m3247l5262k8106k1589j6090j1026n033
59099D302936K233R905J7581K5734L4185M1739M7786N3086N8517O4155P0008P6558
59087D804423Q4030R2021J00265J08730J16658J22752J26928J30795J35720J41303
59077E963625J46215J49371J49690J46158J39228J31069J23131J14407J03278
59068G166172R0187P6937O4169N1383L9192K9500K3115J8881J5952J5490J9084
59057G610062K6340L5170M4067N3248O3767P6241R0355J05086J19394J33111J47117
$$ y = [9368087, 8887963, 8441740, 8030593, 7655284, 7313733, 7001726, 6715700, 6453971, 6215381, 5997894, 5799069, 5617140, 5450807, 5298374, 5158287, 5030666, 4917062, 4817785, 4730230, 4650956, 4579009, 4516025, 4463289, 4420042, 4384780, 4356674, 4335085, 4318995, 4307969, 4302936, 4305169, 4315074, 4332655, 4358389, 4392574, 4434313, 4482099, 4535185, 4593702, 4657857, 4727865, 4804423, 4888453, 4980474, 5080739, 5189469, 5306127, 5428879, 5555807, 5686602, 5822322, 5963625, 6109840, 6259211, 6408901, 6555059, 6694287, 6825356, 6948487, 7062894, 7166172, 7256359, 7333296, 7397465, 7448848, 7488040, 7517540, 7540655, 7559536, 7575488, 7590978, 7610062, 7636402, 7671572, 7715639, 7768887, 7832654, 7908895, 7999250, 8104336, 8223730, 8356841, 8503958]
59046H503958J62299J78428J94446K09705K24295K38030K49757K58163K62941
59037A0482022K64576K62937K56445K42698K19775J87134J45832R8258M7374m198
59027A2202853n4596j02251j45279j81645k10215k31648k47851k60332k69197
59018A0499839k74188k76443k78360k81407k84768k86676k86618k85536k84297
59009G961546k82649k79514k73802k65427k55950k47513k40389k32390k21767
59000E662145k09699j98427j87936j76681j65060j55341j47869j40068j30300
58991D150764j20312j12422j06328j00371r4160q8158q2086p5722p0170o6489
58981C234546o3916o1074n7913n4955n1711m7708m3933m1261l8425l3793k8325
$$ y = [8503958, 8666257, 8844685, 9039131, 9248836, 9473131, 9711161, 9960918, 10219081, 10482022, 10746598, 11009535, 11265980, 11508678, 11728453, 11915587, 12061419, 12159677, 12207051, 12202853, 12148257, 12046006, 11900727, 11719082, 11508867, 11277219, 11029368, 10769036, 10499839, 10225651, 9949208, 9670848, 9389441, 9104673, 8817997, 8531379, 8245843, 7961546, 7678897, 7399383, 7125581, 6860154, 6604204, 6356691, 6116302, 5883912, 5662145, 5452446, 5254019, 5066083, 4889402, 4724342, 4569001, 4421132, 4281064, 4150764, 4030452, 3918030, 3811702, 3711331, 3617171, 3529013, 3446927, 3371205, 3301035, 3234546, 3170630, 3109556, 3051643, 2996688, 2944977, 2897269, 2853336, 2812075, 2773650, 2739857, 2711532]
58970B711532k4297k1681j8469j4323j1101r396p319l549N83L114L777L339K167
58957B614377N11j035k209l269m076l995l163k568k507k162j133j59K30N27J244
58942B590613K252L545N354O955O699M038M41k408m324n905p151p647p328o393
58928B578741n101l971l413k834j122J710M400O273Q042J0260J2314J3654J4846
58915B633799J6562J8432J9763K0615K1517K2835K4993K8467L2859L6747L9094
58904B915683M0132M0554M0802M1598M3983M7928N1778N3990N4775N5430N6756
58893C443409N8889O1934O5904P0463P5172P9657Q3428Q6426Q9875R5350J02595
58882D313102J09545J15251J21358J29780J40045J50169J59191J67732J76851
$$ y = [2711532, 2687235, 2665554, 2647085, 2632762, 2621661, 2612265, 2604946, 2601397, 2601980, 2605094, 2608871, 2612210, 2614377, 2614888, 2613853, 2611644, 2608375, 2604299, 2600304, 2597141, 2594573, 2592066, 2589904, 2588771, 2588612, 2588842, 2589369, 2590613, 2592865, 2596410, 2601764, 2608719, 2615418, 2619456, 2619897, 2617489, 2613165, 2607260, 2600109, 2592462, 2585134, 2578741, 2573640, 2569669, 2566256, 2563422, 2562300, 2564010, 2568410, 2574683, 2582725, 2592985, 2605299, 2618953, 2633799, 2650361, 2668793, 2688556, 2709171, 2730688, 2753523, 2778516, 2806983, 2839842, 2876589, 2915683, 2955815, 2996369, 3037171, 3078769, 3122752, 3170680, 3222458, 3276448, 3331223, 3386653, 3443409, 3502298, 3564232, 3630136, 3700599, 3775771, 3855428, 3938856, 4025282, 4115157, 4210507, 4313102, 4422647, 4537898, 4659256, 4789036, 4929081, 5079250, 5238441, 5406173, 5583024]
58873E583024J87468K00149K14227K27826K40077K52748K68436K87478L07866
58864G769299L28004L48290L70025L93902M19916M47963M78289N11515N48083
58855A1615286N87285O27330O67014P07057P49090P93361Q38014Q80432R18813
58846A8383682R52368R80202R99918J007248R97414R67017R14408Q38478P38225
58837B6778960O14033M68648L06478J32764m5955k21613l86263n34098o61597
58828B6451357p66422q47332r05037r41993r60851r63360r50963r26039q92023
58819A8297337q52214q08644p62462p15279o69388o26308n85882n47540n11771
58810A2217849m79390m49980m22397l96396l72344l49673l27413l06219k87815
$$ y = [5583024, 5770492, 5970641, 6184868, 6412694, 6652771, 6905519, 7173955, 7461433, 7769299, 8097303, 8445593, 8815618, 9209520, 9629436, 10077399, 10555688, 11067203, 11615286, 12202571, 12829901, 13496915, 14203972, 14953062, 15746423, 16584437, 17464869, 18383682, 19336050, 20316252, 21316170, 22323418, 23320832, 24287849, 25202257, 26040735, 26778960, 27392993, 27861641, 28168119, 28300883, 28254928, 28033315, 27647052, 27112954, 26451357, 25684935, 24837603, 23932566, 22990573, 22029722, 21066362, 20115399, 19189360, 18297337, 17445123, 16636479, 15874017, 15158738, 14489350, 13863042, 13277160, 12729620, 12217849, 11738459, 11288479, 10866082, 10469686, 10097342, 9747669, 9420256, 9114037, 8826222]
58801H826222k71937k55830k37750k19191k02397j87242j72105j56598j41717
58792F981455j27937j14792j01995q9754p7963o6118n3930m1439k8674j5802l298
58781F259753Q493J9755L0878M2231N4304O7429Q1122R4498J07590J21122J34800
58770G021975J47211J58243J70175J85162K02561K20039K36619K53341K71437
58761H866763K91203L12529L35420L59757L85335M12264M41016M72120N05941
58752A2382348N42621N81972O23678O67530P13009P58802Q03261Q45223Q83620
58743A8802064R16492R41275R55674R57019R41154R03578Q41888P55852O45491
58734B6660487N11294L56696J88236J2760j63715l34236m90951o28403p44775
$$ y = [8826222, 8554285, 8298455, 8060705, 7841514, 7639117, 7451875, 7279770, 7123172, 6981455, 6853518, 6738726, 6636731, 6546977, 6469014, 6402896, 6348966, 6307527, 6278853, 6263051, 6259753, 6268246, 6288001, 6318879, 6361110, 6415414, 6482843, 6563965, 6658463, 6766053, 6887175, 7021975, 7169186, 7327429, 7497604, 7682766, 7885327, 8105366, 8341985, 8595326, 8866763, 9157966, 9470495, 9805915, 10165672, 10551007, 10963271, 11404287, 11876407, 12382348, 12924969, 13506941, 14130619, 14798149, 15511158, 16269960, 17073221, 17918444, 18802064, 19718556, 20659831, 21615505, 22572524, 23513678, 24417256, 25259144, 26014996, 26660487, 27171781, 27528477, 27716713, 27729473, 27565758, 27231522, 26740571, 26112168, 25367393]
58725B5367393q38940r08766r54059r78699r87440r82240r63804r34854q99198
58716A6919393q58837q14636p69012p25192o84136o44481o05461n67886n32456
58707A0717296m98947m67210m37472m09713l83850l60249l38908l18707k98629
58698G203611k79167k61367k45272k30499k17340k05727j94108j81068j67347
58689E221716j54573j42831j31234j20084j10494j02498r5462q9626q5224q0759
58679D108931p4549o7670o2948o1090n9990n7915n5246n2859n0848m9257m8250
58668C468309m7211m5356m3394m2912m4002m5189m5891m7011m8790n0156n0780
58657B957617n1996n4707n7766n9374n9074n7913n7428n8585o0639o1083n8047
$$ y = [25367393, 24528453, 23619687, 22665628, 21686929, 20699489, 19717249, 18753445, 17818591, 16919393, 16060556, 15245920, 14476908, 13751716, 13067580, 12423099, 11817638, 11249752, 10717296, 10218349, 9751139, 9313667, 8903954, 8520104, 8159855, 7820947, 7502240, 7203611, 6924444, 6663077, 6417805, 6187306, 5969966, 5764239, 5570131, 5389063, 5221716, 5067143, 4924312, 4793078, 4672994, 4562500, 4460002, 4364540, 4274914, 4189690, 4108931, 4034382, 3966712, 3903764, 3842674, 3782684, 3724769, 3669523, 3616664, 3565816, 3516559, 3468309, 3421098, 3375742, 3332348, 3289436, 3245434, 3200245, 3154354, 3107343, 3058553, 3008397, 2957617, 2905621, 2850914, 2793148, 2733774, 2674700, 2616787, 2559359, 2500774, 2440135, 2379052, 2321005]
58646B321005n2795m8381m5809m3286l9485l5622l3440l2919l3002l3200l3238
58635A889828l2289k9905k7182k5806k6187k7222k7688k7233k6150k4724k2936
58624A592506k0654j8036j5528j3365j1346r182o827m386k213r54p07j82K066
58611A491192N366P507P963Q651J0498J1480R792O937N391M821L295J047j23n17
58597A573300k398o104r170r888r109p927n995l169o92O04J796M385Q311J2222
58583A546166J4981J6400J7247J8861K2033K6224L0400L4275L7896M0725M2438
58572A847646M4018M6553M9460N1575N3553N7227O2827O8719P3924P9040Q4619
58561B519161R0439R6567J03540J11439J20261J30983J44447J59331J73358J86500
$$ y = [2321005, 2268210, 2219829, 2174020, 2130734, 2091249, 2055627, 2022187, 1989268, 1956266, 1923066, 1889828, 1857539, 1827634, 1800452, 1774646, 1748459, 1721237, 1693549, 1666316, 1640166, 1615442, 1592506, 1571852, 1553816, 1538288, 1524923, 1513577, 1504395, 1497568, 1493182, 1490969, 1490015, 1489308, 1489126, 1491192, 1496558, 1504065, 1512028, 1520679, 1531177, 1542657, 1552449, 1559386, 1564777, 1569598, 1572893, 1573940, 1573817, 1573300, 1570902, 1564798, 1555628, 1545740, 1536631, 1528704, 1522709, 1519540, 1518848, 1519452, 1521248, 1525633, 1533944, 1546166, 1561147, 1577547, 1594794, 1613655, 1635688, 1661912, 1692312, 1726587, 1764483, 1805208, 1847646, 1891664, 1938217, 1987677, 2039252, 2092805, 2150032, 2212859, 2281578, 2355502, 2434542, 2519161, 2609600, 2706167, 2809707, 2921146, 3041407, 3172390, 3316837, 3476168, 3649526, 3836026]
58551C836026K00898K17373K34134K49312K62681K74227K82866K87313K86665
58542F131495K79531K64034K39187K05057J61627J09297N0887q616o4867j15619
58532G252013j59504j95221k22271k40946k51388k54126k51276k45372k36941
58523E194968k25109k10562j95704j81728j67736j53198j39204j26788j15897
58514C679042j06378r8111q9952q0730p1630o5386o2677o1380n9756n8074n6571
58503B868397n4344n1084m7827m5071m2154l9201l7570l7704l8416l9027m0097
58492B395902m1549m2252m2146m2576m3925m5100m5759m6589m6917m4850m0591
58481A913648l6766l4562l2379k9346k7005k6050k4617k1621j8838j7625j6437
$$ y = [3836026, 4036924, 4254297, 4488431, 4737743, 5000424, 5274651, 5557517, 5844830, 6131495, 6411026, 6675060, 6914247, 7119304, 7280931, 7390228, 7441115, 7432499, 7367632, 7252013, 7092509, 6897288, 6675017, 6434071, 6182683, 5928557, 5677281, 5431909, 5194968, 4969859, 4759297, 4563593, 4381865, 4214129, 4060931, 3921727, 3794939, 3679042, 3572664, 3474553, 3384601, 3303871, 3232241, 3166855, 3104178, 3042798, 2983042, 2924968, 2868397, 2814053, 2762969, 2715142, 2670071, 2627917, 2588716, 2551146, 2513442, 2475026, 2435999, 2395902, 2354353, 2312101, 2269955, 2227379, 2183454, 2138354, 2092595, 2046006, 1999089, 1954239, 1913648, 1876882, 1842320, 1809941, 1780595, 1753590, 1727540, 1702923, 1681302, 1662464, 1644839, 1628402]
58470A628402j3955j1962j2402j3779j3313j0919q436o560n130m953o639q726
58458A511628r431r417j0575j2981j5185j6789j8473j9944j9990j8541j7056j6530
58446A326716j6253j4642j1035o788m524n360p120o666l899j629j414j878j560
58433A243948q82l27Q57K756L781L014J659R89P39N49P73Q58o67l305m337k878
58417A247527j543k316l672l779l774n200o757o505n272m926n046m132k586j611
58403A190408n92J595L831M200L300L360M656N422M863L955L422K893J879J88
58389A233380k229m654n583m464k605j349m68O17J520J981K715L898M363L682
58375A230804L293M246N597O368P058P737O939M319K163K132K546J085j805m352
$$ y = [1628402, 1614447, 1602485, 1590083, 1576304, 1562991, 1552072, 1543636, 1537076, 1531946, 1526993, 1520354, 1511628, 1502197, 1492780, 1482205, 1469224, 1454039, 1437250, 1418777, 1398833, 1378843, 1360302, 1343246, 1326716, 1310463, 1295821, 1284786, 1277998, 1273474, 1268114, 1260994, 1254328, 1250429, 1248800, 1247386, 1245508, 1243948, 1243066, 1242739, 1243596, 1246352, 1250133, 1253147, 1254806, 1255795, 1256534, 1257083, 1257856, 1258714, 1258047, 1254742, 1250405, 1247527, 1245984, 1243668, 1239996, 1236217, 1232443, 1227243, 1220486, 1213981, 1208709, 1203783, 1198737, 1194605, 1192019, 1190408, 1189816, 1191411, 1195242, 1199442, 1202742, 1206102, 1210758, 1216180, 1221043, 1224998, 1228420, 1231313, 1233192, 1233380, 1231151, 1226497, 1220914, 1216450, 1213845, 1212496, 1212028, 1212645, 1214165, 1216146, 1218861, 1222759, 1227122, 1230804, 1234097, 1238343, 1243940, 1250308, 1257366, 1265103, 1272042, 1276361, 1278524, 1280656, 1283202, 1284287, 1282482, 1278130]
58361A278130o275p751p592n090j962PJ687M506P409Q546Q458Q900R941J0750
58347A309664J1870J4033J6017J6352J6009J6860J8577J9560J9772K0115J9964
58336A498793J7801J3729R296N453K228n35l433p063j0208j0425p972o570q413
58323A492681j0893j0699q657p724q372q867q405p206n084k461j057j348j165
58310A410743J031L740N383P036R702J1748J1974J2313J4381J6084J5122J3257
58298A532514J3408J5027J5894J6114J6609J6194J4015J2505J3891J6031J5750
58287A697952J3971J3455J3684J2256R461P323O043N043N181O267N327J488q01
58274A796650J901O052O880O537J0023J6047J9135J8780J9170K1034K1212J9783
$$ y = [1278130, 1271855, 1264104, 1256512, 1251422, 1249460, 1249467, 1251154, 1255660, 1263069, 1271615, 1280073, 1288973, 1298914, 1309664, 1321534, 1335567, 1351584, 1367936, 1383945, 1400805, 1419382, 1438942, 1458714, 1478829, 1498793, 1516594, 1530323, 1539619, 1545072, 1547300, 1546765, 1543332, 1536269, 1526061, 1515636, 1507664, 1501094, 1492681, 1481788, 1471089, 1462432, 1454708, 1446336, 1437469, 1429064, 1421858, 1416774, 1414313, 1413256, 1411908, 1410743, 1411774, 1415514, 1420897, 1427933, 1437635, 1449383, 1461357, 1473670, 1488051, 1504135, 1519257, 1532514, 1545922, 1560949, 1576843, 1592957, 1609566, 1625760, 1639775, 1652280, 1666171, 1682202, 1697952, 1711923, 1725378, 1739062, 1751318, 1760779, 1768102, 1774145, 1779188, 1784369, 1790636, 1795963, 1797451, 1796650, 1798551, 1804603, 1811483, 1818020, 1828043, 1844090, 1863225, 1882005, 1901175, 1922209, 1943421, 1963204]
58262A963204K0546K4051K6570K6490K6022K6193K5796K5413K7032K9399K9179
58251B249895K6872K6331K8213K9190K7929K6698K6608K6186K5095K4759K5020
58240B542796K4465K3948K5640K9028L1883L4216L7094L9066L8379L7070L8002
58229B901587L9743L9580L9241M1757M5104M5515M4842M7486N2063N3810N3663
58218C404391N6833O3277O7791O9182P1404P5637P9036Q1395Q5461R0623R3627
58207D238657R5405R9721J05557J08554J09394J12686J18188J21433J22671J26658
58197E358924J34063J41673J50317J63416J78396J89316J97640K10571K29061
58188F953377K47751K66147K88764L14248L35940L53848L74498L98278M18890
$$ y = [1963204, 1983750, 2007801, 2034371, 2060861, 2086883, 2113076, 2138872, 2164285, 2191317, 2220716, 2249895, 2276767, 2303098, 2331311, 2360501, 2388430, 2415128, 2441736, 2467922, 2493017, 2517776, 2542796, 2567261, 2591209, 2616849, 2645877, 2677760, 2711976, 2749070, 2788136, 2826515, 2863585, 2901587, 2941330, 2980910, 3020151, 3061908, 3107012, 3152527, 3197369, 3244855, 3296918, 3350728, 3404391, 3461224, 3524501, 3592292, 3661474, 3732878, 3808515, 3887551, 3968946, 4054407, 4145030, 4238657, 4334062, 4433783, 4539340, 4647894, 4757288, 4869974, 4988162, 5109595, 5232266, 5358924, 5492987, 5634660, 5784977, 5948393, 6126789, 6316105, 6513745, 6724316, 6953377, 7201128, 7467275, 7756039, 8070287, 8406227, 8760075, 9134573, 9532851, 9951741]
58179I951741M36261M57659M84680N11656N38485N72265O14242O57855P01852
58170A4926696P52608Q11622Q73612R38401J010883J088067J161024J231265J310023
58161B4104201J399995J493969J592432J704204J827679J950510K070680K198240
58153C8341910K333872K467453K601234K751599K924082L111216L319637L572707
58145F1423710L880899M237825M651421N148383N741918O430108P233171Q191796
58137A06939231R318342J0594492J2029636J3670390J5538235J7622156J9959693
58130B05672175K2657945K5802703K9403167L3366369L7231270L9708987L8735451
58123D32578067L2572534K1272306P061097o871945j8090757k5714056l0052790
$$ y = [9951741, 10388002, 10845661, 11330341, 11841997, 12380482, 12952747, 13566989, 14224844, 14926696, 15679304, 16490926, 17364538, 18302939, 19313822, 20401889, 21562913, 22794178, 24104201, 25504196, 26998165, 28590597, 30294801, 32122480, 34072990, 36143670, 38341910, 40675782, 43143235, 45744469, 48496068, 51420150, 54531366, 57851003, 61423710, 65304609, 69542434, 74193855, 79342238, 85084156, 91514264, 98747435, 106939231, 116257573, 126852065, 138881701, 152552091, 168090326, 185712482, 205672175, 228330120, 254132823, 283535990, 316902359, 354133629, 393842616, 432578067, 465150601, 486422907, 493484004, 486612059, 468521302, 442807246, 412754456]
58116D12754456l1877347l1970091l0966581k9294489k7197501k4841590k2377781
58109B14229076j9908867j7472421j5102519j2869935j0833560q997634p355556
58102A21688584n935129m746115l709402k717852j802633j200736j199602j884038
58094I8493077l028863m235122n170085n699653n850302n709056n372501m939585
58086E8487910m493618m076838l695781l348917l036130k750018k480255k228600
58078C2377753k005334j811656j639550j487412j360647j256897j165386j082075
58070B0568796j011725r53717q99072q43812p92930p48569p05731o62354o22729
58061A3328157n88005n53211n16609m82830m54358m28671m05746l89366l78587
$$ y = [412754456, 380877109, 348907018, 317940437, 288645948, 261448447, 236606857, 214229076, 194320209, 176847788, 161745269, 148875334, 138041774, 129044140, 121688584, 115753455, 111007340, 107297938, 104580086, 102777453, 101576717, 100377115, 98493077, 95464214, 91229092, 86059007, 80359354, 74509052, 68799996, 63427495, 58487910, 53994292, 49917454, 46221673, 42872756, 39836626, 37086608, 34606353, 32377753, 30372419, 28560763, 26921213, 25433801, 24073154, 22816257, 21650871, 20568796, 19557071, 18603354, 17704282, 16860470, 16067540, 15318971, 14613240, 13950886, 13328157, 12740152, 12186941, 11670332, 11187502, 10733144, 10304473, 9898727, 9509361, 9130774]
58052I130774l66438l49691l32334l17565l03991k91326k82103k75857k68873
58043F342596k61055k55904k52671k46216k35757k26078k18720k09756j97775
58034D238664j86301j76510j65155j51719j40240j31928j23120j12651j04252
58025B946788r9482r5125q9752q6017q4267q0812p5066p1569p2126p2301o8668
58014B051603o3491n9325n4818m8979m4157m1784l9933l7452l5803l4867l2148
58003A558846k7949k5895k6445k5541k1766j9039j9797k1224k0971k0865k2046
57992A307308k1988j9654j8377k0051k1268j8864j4942j2886j2372j1593j0662
57981A124651r784p664m592l437m950n840m059k149k561l550k687r03p2J62L78
$$ y = [9130774, 8764336, 8414645, 8082311, 7764746, 7460755, 7169429, 6887326, 6611469, 6342596, 6081541, 5825637, 5572966, 5326750, 5090993, 4864915, 4646195, 4436439, 4238664, 4052363, 3875853, 3710698, 3558979, 3418739, 3286811, 3163691, 3051040, 2946788, 2847306, 2752181, 2662429, 2576412, 2492145, 2411333, 2336267, 2264698, 2192572, 2120271, 2051603, 1988112, 1928787, 1873969, 1824990, 1780833, 1739049, 1699116, 1661664, 1625861, 1590994, 1558846, 1530897, 1505002, 1478557, 1453016, 1431250, 1412211, 1392414, 1371190, 1350219, 1329354, 1307308, 1285320, 1265666, 1247289, 1227238, 1205970, 1187106, 1172164, 1159278, 1146906, 1135313, 1124651, 1114867, 1107203, 1102611, 1099174, 1094224, 1088384, 1084325, 1082176, 1079615, 1076065, 1073378, 1072475, 1072403, 1072565, 1072943]
57966A072943n86l054m959n216n468o470o284m339l575n927r105j0487j0734j0884
57952I85855r460n689k557l131o186q311q326p285o229n953o883p523n609k048
57938I00665o48k493m101k986j124p50o64M51Q61q73k636k322j730l407o130o962
57922H65151n630l785j981m36n63k651l921k037J184K448J745J395J910J821O57
57907H55307n48j196j487j583j869k973m386m498l110k099k535l232l374l986
57893H18431n380n859m750m055n043n886m905l509l375l328j799j98o48k240k470
57878G64986r98O98K030L071K976J102j277k556l048l808m504m441m391n435p115
57863G37290q379r106r386q788p662p378p919p336n026l219l438l898k437K32
$$ y = [1072943, 1072357, 1069303, 1064344, 1059128, 1053660, 1047190, 1040906, 1036567, 1032992, 1027065, 1017960, 1007473, 996739, 985855, 976395, 970706, 968149, 965018, 958832, 950521, 942195, 934910, 928681, 922728, 915845, 908322, 902713, 900665, 900017, 897524, 893423, 890437, 889313, 888563, 887899, 888350, 889211, 888338, 885702, 883380, 881650, 878243, 872113, 865151, 859521, 855736, 853755, 853319, 852756, 850105, 846184, 844147, 845331, 847779, 849524, 850919, 852829, 854650, 855307, 854759, 853563, 852076, 850493, 848624, 845651, 841265, 836767, 833657, 831558, 829023, 825791, 822417, 818431, 813051, 807192, 802442, 798387, 793344, 787458, 782553, 779044, 775669, 772341, 770542, 770344, 769696, 767456, 764986, 763988, 764686, 766716, 769787, 772763, 773865, 772588, 770032, 766984, 763176, 758672, 754231, 749840, 744405, 737290, 728911, 719805, 710419, 701631, 693969, 686591, 678672, 671336, 666310, 663091, 659653, 655755, 653318, 653550]
57849F53550K352L954N664O867P300Q286J0171J0782Q841O521O091O506N997N515
57835G48397O395P055N488L008J989J687k8k493l651m209o376r502j0864j0149
57821G26747r337q695o719l913k797l841m734m186l477l625l762k942j437K74
57807F67556K019L329L967M738O156O985O035M549M510N456N486M608M356M604
57793G34354L767J862N39N2r94k769l851m009m735o495p850p826p054o070m599
57778F84322k942k141k334k651k872l491m156m099m022n283p125p256n605m979
57764F25366p055r942j0876r591p856p116p694r173j0552j0779r770q315o895
57751E09752n412m050l189k463j131N75J634J861J999K254K109J735K170L670
$$ y = [653550, 655902, 659856, 665520, 672387, 679687, 687973, 698144, 708926, 717767, 724288, 730379, 736885, 742882, 748397, 754792, 761847, 767335, 770343, 772332, 774019, 773991, 771498, 767847, 763638, 757262, 747760, 736896, 726747, 717410, 708715, 701996, 698083, 695286, 691445, 686711, 682525, 679048, 675423, 671661, 668719, 667282, 667556, 669575, 672904, 676871, 681609, 687765, 694750, 700785, 705334, 709844, 715300, 720786, 725394, 729750, 734354, 738121, 739983, 740522, 740574, 739580, 736811, 732960, 728951, 724216, 717721, 709871, 702045, 694991, 688921, 684322, 681380, 679239, 676905, 674254, 671382, 667891, 663735, 659636, 655614, 650331, 643206, 635950, 630345, 625366, 618311, 608369, 597493, 587902, 580046, 572930, 565236, 556063, 545511, 534732, 524962, 516647, 509752, 504340, 500290, 497101, 494638, 493507, 494082, 495716, 497577, 499576, 501830, 503939, 505674, 507844, 511514]
57737E11514N110N479M931M114L373K809K338J615O49K68J109K448L115L137L326
57722E55335L538K887J562Q73J332J888J438K1j668l050l784l926m125m985o292
57707E41044p224p072n382k290O61J199r80l208k886o78Q14P52O20J718L860O074
57691E27022P054N478J764j148p81J508K377J309J007K927N237O005N880O236
57677E71875O724O331N492N477O485P662Q455Q879Q845Q255P624P852R276J1223
57663F80455J2530J2516J1583J0837J1077J2287J4108J6229J8135J9189J9452
57652H38398J9853K1038K2672K4312K6107K8088K9698L0797L2191L4415L6901
57641A144470L9136M1569M4434M6944M8773N1006N4437N8175O1351O4799O9386
$$ y = [511514, 516624, 522103, 527034, 531148, 534521, 537330, 539668, 541283, 541932, 542200, 543309, 545757, 548872, 552009, 555335, 558873, 561760, 563322, 564195, 565527, 567415, 568853, 568874, 567206, 564156, 560372, 556446, 552321, 547336, 541044, 533820, 526748, 521366, 519076, 519737, 520936, 519956, 516748, 513862, 513184, 513998, 514750, 515370, 517088, 520948, 527022, 534076, 539554, 541318, 540170, 539389, 540897, 543274, 544583, 545590, 548517, 553754, 559759, 565639, 571875, 578599, 584930, 590422, 595899, 602384, 610046, 618501, 627380, 636225, 644480, 652104, 659956, 669232, 680455, 692985, 705501, 717084, 727921, 738998, 751285, 765393, 781622, 799757, 818946, 838398, 858251, 879289, 901961, 926273, 952380, 980468, 1010166, 1040963, 1073154, 1107569, 1144470, 1183606, 1225175, 1269609, 1316553, 1365326, 1416332, 1470769, 1528944, 1590295, 1655094, 1724480]
57630A724480P4104P7944Q2336Q9368R8444J07320J15780J25698J37738J50638
57620B783850J63838J78363J94667K11851K29398K47754K66641K84602L00552
57611D861516L13987L23110L24488L15397K95451K65534K26047J76211J14261
57602G216002L9222m5473j30132k02827k56320k90532l08994l14971l10900k99141
57592E095934k81767k60569k37625k14935j93412j73196j54713j38266j22965
57583C318486j07828r3586q1734p1899o2121n1635m1422l1995k2761j3981p103
57572B732421k275K630R517J8001K6567L4471M1793M8701N5562O3075P1869Q2397
57560C184729R4977J09096J23152J35990J48168J60473J71953J81130J88269J94135
$$ y = [1724480, 1798584, 1876528, 1958864, 2048232, 2146676, 2253996, 2369776, 2495474, 2633212, 2783850, 2947688, 3126051, 3320718, 3532569, 3761967, 4009721, 4276362, 4560964, 4861516, 5175503, 5498613, 5823101, 6138498, 6433949, 6699483, 6925530, 7101741, 7216002, 7255224, 7209751, 7079619, 6876792, 6620472, 6329940, 6020946, 5705975, 5395075, 5095934, 4814167, 4553598, 4315973, 4101038, 3907626, 3734430, 3579717, 3441451, 3318486, 3210658, 3117072, 3035338, 2963439, 2901318, 2849683, 2808261, 2776266, 2753505, 2739524, 2732421, 2730146, 2732776, 2742293, 2760294, 2786861, 2821332, 2863125, 2911826, 2967388, 3030463, 3102332, 3184729, 3279706, 3388802, 3511954, 3647944, 3796112, 3956585, 4128538, 4309668, 4497937, 4692072]
57550D692072J96928J93009J80689J60988J34604J00849O0271J5925k8842p2106
57540E634387j12203j46904j74626j95023k08181k14784k16946k16629k13167
57531C935924k04824j92932j81526j72217j62560j50668j38292j27649j18115
57522B487141j08359r9293r2296q6400p9874p3250o8195o4328n9644n3598m7734
57511A654170m3340m0129l7131l3687k9736k5966k3337k1898k0675j9209j8129
57500A340933j7587j6384j3668j0260p302m655j828O34K009K812M134O157Q371
57487A293366J0625J3017J5372J7627K0096K2656K4585K5830K7505L0366L3731
57476A534776L6744L9658M3017M6651N0394N4780O0028O5370P0353P5827Q2533
$$ y = [4692072, 4889000, 5082009, 5262698, 5423686, 5558290, 5659139, 5719410, 5735335, 5706493, 5634387, 5522184, 5375280, 5200654, 5005631, 4797450, 4582666, 4365720, 4149091, 3935924, 3731100, 3538168, 3356642, 3184425, 3021865, 2871197, 2732905, 2605256, 2487141, 2378782, 2279489, 2187193, 2100793, 2020919, 1947669, 1879474, 1815146, 1755502, 1701904, 1654170, 1610830, 1570701, 1533570, 1499883, 1470147, 1444181, 1420844, 1398946, 1378271, 1359062, 1340933, 1323346, 1306962, 1293294, 1283034, 1275732, 1271077, 1269249, 1269883, 1271892, 1274704, 1278838, 1284995, 1293366, 1303991, 1317008, 1332380, 1350007, 1370103, 1392759, 1417344, 1443174, 1470679, 1501045, 1534776, 1571520, 1611178, 1654195, 1700846, 1751240, 1806020, 1866048, 1931418, 2001771, 2077598, 2160131]
57465B160131Q9900R7214J05009J13892J23009J31021J37797J43675J47842J48940
57455C398430J46744J41619J32689J18105R7199P1082M1162Q441k5378n7291q4437
57444C988365j05839j22339j34936j43342j46314j43452j36449j28149j20474
57435B807071j13692j07390j01197r4516q6620p7526o8068n8863m9996m1867l5307
57424A972029l0309k5561k0082j4641j0757q468n802p47O416J3099J7216J9760
57412A912153K3519K9193L4597L8600M3695N2502O3380P2407P8837Q5347R3294
57401B527524J01138J07987J15233J23455J30636J34875J36265J34593J27771
57392C639477J14426R5845P3452M6536J4667j9422n1748q0609j06205j27979j44547
$$ y = [2160131, 2250031, 2347245, 2452254, 2566146, 2689155, 2820176, 2957973, 3101648, 3249490, 3398430, 3545174, 3686793, 3819482, 3937587, 4034786, 4105868, 4147030, 4155471, 4130093, 4072802, 3988365, 3882526, 3760187, 3625251, 3481909, 3335595, 3192143, 3055694, 2927545, 2807071, 2693379, 2585989, 2484792, 2390276, 2303656, 2226130, 2158062, 2099199, 2049203, 2007336, 1972029, 1941720, 1916159, 1896077, 1881436, 1870679, 1862211, 1856409, 1855662, 1862078, 1875177, 1892393, 1912153, 1935672, 1964865, 1999462, 2038062, 2081757, 2134259, 2197639, 2270046, 2348883, 2434230, 2527524, 2628662, 2736649, 2851882, 2975337, 3105973, 3240848, 3377113, 3511706, 3639477, 3753903, 3849748, 3923200, 3969736, 3984403, 3964981, 3913233, 3832624, 3726419, 3598440, 3453893]
57381C453893j55452j61100j61772j58397j53327j48395j42812j34742j24467
57372B113429j14279j05728r8590r2202q6218q0285p4314o8955o4599o0328n5031
57361A212900m9277m4688m1604l8689l5039l1572k9744k9561k9353k7597k4615
57350H31161k2198k1449k1617k1402k0547j9190j6766j3221j0464j0418j1909
57339F41980j1932j0020q636q904q951p580o496p127p859o748m799m211m937n373
57325E38407n191n105m868l720k289j952k684l147k517j020P68J909J220j251
57311E08560l519l696k102l56P42J279J170L25p00j287j403j108l09M97N14K45
57295D98852J206L325M495L689K578K719L148K357Q89J43K35O94J720L086L349
$$ y = [3453893, 3298441, 3137341, 2975569, 2817172, 2663845, 2515450, 2372638, 2237896, 2113429, 1999150, 1893422, 1794832, 1702630, 1616412, 1536127, 1461813, 1392858, 1328259, 1267931, 1212900, 1163623, 1118935, 1077331, 1038642, 1003603, 972031, 942287, 912726, 883373, 855776, 831161, 808963, 787514, 765897, 744495, 723948, 704758, 687992, 674771, 664307, 653889, 641980, 630048, 620028, 611392, 602488, 593537, 585957, 579461, 572334, 564475, 557727, 552928, 548717, 543780, 538407, 533216, 528111, 523243, 519523, 517234, 515282, 512598, 509451, 506934, 505914, 506682, 508591, 509811, 508560, 505041, 501345, 499243, 498887, 499629, 500908, 502078, 502403, 501703, 500416, 499013, 497905, 497596, 498093, 498607, 498852, 500058, 503383, 507878, 511567, 514145, 516864, 520012, 522369, 523258, 523401, 523636, 524330, 526050, 529136, 532485]
57280E32485K015Q78J460K766L319L582M299M426L145K151L301N443O313O094
57266E81677O300O534N517M333N312Q190J0444J1143J1622J2473J2696J2022J1553
57253F99816J1821J2196J2359J2537J2506J2060J2071J3287J4671J4947J4978
57242H43249J6382J8521J9452J9342K0296K2843K5221K6314K7060K8635L1204
57231A098519L4548L8111M0565M1185M1431M3321M6553M9238N0989N3004N5356
57220A592820N6774N7091N7406N7611N6103N2582M8915M6606M5101M3223M0624
57209B154856L7298L3020K7818K2011J5731R313L817j45l591p638j1295j2471
57197B268724j0915q461o469m694k620l78J771L709N306O839R149J2481J5894
$$ y = [532485, 534500, 535378, 536838, 539604, 542923, 546505, 550804, 555230, 558375, 560526, 563827, 569270, 575583, 581677, 587977, 594511, 600028, 604361, 609673, 617863, 628307, 639450, 651072, 663545, 676241, 688263, 699816, 711637, 723833, 736192, 748729, 761235, 773295, 785366, 798653, 813324, 828271, 843249, 859631, 878152, 897604, 916946, 937242, 960085, 985306, 1011620, 1038680, 1067315, 1098519, 1133067, 1171178, 1211743, 1252928, 1294359, 1337680, 1384233, 1433471, 1484460, 1537464, 1592820, 1649594, 1706685, 1764091, 1821702, 1877805, 1930387, 1979302, 2025908, 2071009, 2114232, 2154856, 2192154, 2225174, 2252992, 2275003, 2290734, 2300047, 2303864, 2303719, 2300128, 2292490, 2281195, 2268724, 2257809, 2249348, 2242879, 2238185, 2235565, 2235187, 2236958, 2240667, 2245973, 2252812, 2261961, 2274442, 2290336]
57184B290336J8715K1570K5016K8468L1687L5607M0195M3226M3174M1678M0985
57173B660657M0576L8742L5862L3420L1159K8227K6066K7127L1406L7007M3427
57162C033676N1467O0545O8818P5574Q1084Q4817Q6249Q6477Q6686Q6017Q3409
57151C884819Q0082P7377P3802O7546O0495N6042N4095N2147N0252N0774N3866
57140D561297N7471O1630O8366P7181Q4803Q9884R4019R7639R8890R7553R6441
57129E485174R7565R9772J01154J01233J00108R7928R5765R4842R4779R4634R5177
57118F558131R7560J00414J01052R8957R5224Q9357P9991O8342N7710M9804M4293
57107G440835M1065L9837L8619L5882L3220L2723L3168L2345L1330L2305L3909
$$ y = [2290336, 2309051, 2330621, 2355637, 2384105, 2415792, 2451399, 2491594, 2534820, 2577994, 2619672, 2660657, 2701233, 2739975, 2775837, 2809257, 2840416, 2868643, 2894709, 2921836, 2953242, 2990249, 3033676, 3085143, 3145688, 3214506, 3290080, 3371164, 3455981, 3542230, 3628707, 3715393, 3801410, 3884819, 3964901, 4042278, 4116080, 4183626, 4244121, 4300163, 4354258, 4406405, 4456657, 4507431, 4561297, 4618768, 4680398, 4748764, 4825945, 4910748, 5000632, 5094651, 5192290, 5291180, 5388733, 5485174, 5582739, 5682511, 5783665, 5884898, 5985006, 6082934, 6178699, 6273541, 6368320, 6462954, 6558131, 6655691, 6756105, 6857157, 6956114, 7051338, 7140695, 7220686, 7289028, 7346738, 7396542, 7440835, 7481900, 7521737, 7560356, 7596238, 7629458, 7662181, 7695349, 7727694, 7759024, 7791329, 7825238]
57096G825238L3389L1596L0959L0145K6251K0985J8840J9879J9998J7814J5704
57085H090798J4775J4569J7115K5108L6254M5140N0288N3484N3198M5500L1303
57074H477532J5894J147j5367l3730n0990o7037q4449j02347j17043j28398j38959
57063G756253j47822j53024j59162j74696k02286k39449k86950l47416m17338
57054E628110m90792n70278o63531p70619q85013j006137A02765a179793j431805
57045b611598j589943j765920j960529k169512k398568k658551k946605l249140
57037b1350366l562184l889925m225566m556253m886557n234424n606763o003894
57029e9315932o438664o913838p386059p788618q058227q055315p492769o148334
$$ y = [7825238, 7858627, 7890223, 7921182, 7951327, 7977578, 7998563, 8017403, 8037282, 8057280, 8075094, 8090798, 8105573, 8120142, 8137257, 8162365, 8198619, 8243759, 8294047, 8347531, 8400729, 8446229, 8477532, 8493426, 8494573, 8479206, 8445476, 8394486, 8327449, 8243000, 8140653, 8023610, 7895212, 7756253, 7608431, 7455407, 7296245, 7121549, 6919263, 6679814, 6392864, 6045448, 5628110, 5137318, 4567040, 3903509, 3132890, 2247877, 1241740, 102765, -1179793, -2611598, -4201541, -5967461, -7927990, -10097502, -12496070, -15154621, -18101226, -21350366, -24912550, -28802475, -33028041, -37584294, -42470851, -47705275, -53312038, -59315932, -65754596, -72668434, -80054493, -87843111, -95901338, -103956653, -111449422, -117597756]
57021a17597756m298788k835217k702422m109235o330471q288075r260623r079185
57013a64501772p868325n796498l048561J19594L385615O411429Q905795J0699149
57005a51693574J1788165J2290694J2346260J2060597J1517479J0796508R966894
56998g0926977R085866Q208742P381789O621526N918219N263563M661914M115921
56990a9669437L619605L169734K769909K419733K111879J842408J613025g01985
56981E56289J119481J004679R09319Q23749P43222O69471O02083N37655M78013
56972G443961M29307L91499L57637L24730K96377K73275K50211K24797K01053
56963A0192847J81636J63855J45737J29223J14965J00152Q3731O8093N3852L8599
$$ y = [-117597756, -121896544, -124731761, -127434183, -131543418, -137873889, -146161964, -155422587, -164501772, -172370097, -178166595, -181215156, -181095562, -177709947, -171298518, -162392723, -151693574, -139905409, -127614715, -115268455, -103207858, -91690379, -80893871, -70926977, -61841111, -53632369, -46250580, -39629054, -33710835, -28447272, -23785358, -19669437, -16049832, -12880098, -10110189, -7690456, -5578577, -3736169, -2123144, -701985, 556289, 1675770, 2680449, 3589768, 4413517, 5156739, 5826210, 6428293, 6965948, 7443961, 7873268, 8264767, 8622404, 8947134, 9243511, 9516786, 9766997, 9991794, 10192847, 10374483, 10538338, 10684075, 10813298, 10928263, 11028415, 11112146, 11180239, 11234091, 11272690]
56953A1272690K2407Q975l23q220j5775j9911j8625j4296j0199p449o594r419
56941A1193261j9384m3120q9066j58998k41641l20265l86211m40413m83940n14912
56931H495311n34401n47145n54216n51474n37270n15717m90257m59864m24132
56922C880835l86812l51597l18987k89604k66010k48538k33450k17859k02934
56913A365044j90078j77584j63474j48454j33918j19730j05612r2068p8774o4856
56903I0496C8959b305l3475k4788j4200m439K997R839J6593K0189a1271A465O203
56890G668p61a003j3334j5824j6675j7075j6014j2695q808o440n480m526k669
56877a20543N46N092R584J2472J4567J8125K3009a0681A6373K5899K3342J7805
$$ y = [11272690, 11295097, 11304072, 11303749, 11295529, 11279754, 11259843, 11241218, 11226922, 11216723, 11209274, 11202680, 11193261, 11173877, 11130757, 11041691, 10882693, 10641052, 10320787, 9934576, 9494163, 9010223, 8495311, 7960910, 7413765, 6859549, 6308075, 5770805, 5255088, 4764831, 4304967, 3880835, 3494023, 3142426, 2823439, 2533835, 2267825, 2019287, 1785837, 1567978, 1365044, 1174966, 997382, 833908, 685454, 551536, 431806, 326194, 234126, 155352, 90496, 38959, -2305, -35780, -60568, -74768, -79207, -76210, -66371, -49778, -29589, -11271, 1465, 7668, 6907, -1003, -14337, -30161, -46836, -63911, -79925, -92620, -101428, -107868, -113348, -117874, -120543, -119997, -114905, -105321, -92849, -78282, -60157, -37148, -10681, 16373, 42272, 65614, 83419]
56865H3419R007n59q722j5395k0325k2167D083a5671j8891j6878j3061r709q303
56852h2513p053m314j775j694l143l523k214n00Q16J726K083K011K289L161L738
56837i0905L513L198L463M130N168O875Q786J0206J2084J6116D268K5771K7300
56824E7339K7790K8231K7402K4629K1383J8691J5518J1191P024M036J451j011
56812B43674j776m7K546M642P213J1065J4679J6622J8067K0685K3934K6755L0044
56799D18103L4838L9359M0539L7667L2276K5141J5701M266p067j5848k0722k1870
56787E82383k0866j9495j8128j5765j1911p119j434N942J4686K2853K9433L5817
56775E96396M3740N3288O3748P4258Q2083Q2096P0486M8471K1347n257k7358m2715
$$ y = [83419, 92426, 91867, 83145, 67750, 47425, 25258, 4083, -15671, -34562, -51440, -64501, -74210, -82513, -89566, -93880, -95655, -97349, -100492, -104015, -106229, -106729, -105913, -104187, -102104, -100093, -97804, -94643, -90905, -87392, -84194, -80731, -76601, -71433, -64558, -55772, -45566, -33482, -17366, 4268, 30039, 57339, 85129, 113360, 140762, 165391, 186774, 205465, 220983, 232174, 239198, 243234, 244685, 243674, 241898, 241851, 244397, 249039, 256252, 267317, 281996, 298618, 316685, 337370, 361304, 388059, 418103, 452941, 492300, 532839, 570506, 602782, 627923, 643624, 647890, 640823, 624975, 604253, 582383, 561517, 542022, 523894, 508129, 496218, 489099, 487665, 493607, 508293, 531146, 560579, 596396, 640136, 693424, 757172, 831430, 913513, 995609, 1066095, 1114566, 1135913, 1130656, 1103298, 1060583]
56763A060583n1090n4071n3571n0732m6468m1583l5841k8400j9983j2887p853
56752F58104k616N071J4419K3067L0336L7439M5104N1882N4320M8588L3269J1351
56740A010334j1502l0972m5415n4006n6229n3665m9561m5415m0165l3583k7692
56729E62129k3555j9347j3536p510l082M27M431Q578J2211J6264K0996K3527K0489
56716F02022J2231K055p732j6742k4457k9832l2563l3066l1678k9257k7431k6653
56704C56897k5142k1533j7333j4770j3474j1551q945p355p361p890q119p922o888
56691A98614m810k828k357l191m151m896n494n033k735J31J477J164O82N11j39
56676A66945j224j676j339j237j683j902j747k087l074l576k942k029j964k647
$$ y = [1060583, 1009493, 955422, 901851, 851119, 804651, 763068, 727227, 698827, 678844, 665957, 658104, 655488, 660559, 674978, 698045, 728381, 765820, 810924, 862806, 917126, 965714, 998983, 1010334, 998832, 967860, 922445, 868439, 812210, 758545, 708984, 663569, 623404, 589821, 562129, 538574, 519227, 505691, 498181, 495099, 495526, 499957, 508535, 520746, 537010, 558006, 581533, 602022, 614253, 616308, 608576, 591834, 567377, 537545, 504982, 471916, 440238, 410981, 383550, 356897, 331755, 310222, 292889, 278119, 264645, 253094, 244149, 236794, 229433, 221543, 213424, 205502, 198614, 193804, 190976, 188619, 185428, 181277, 176381, 170887, 165854, 163119, 163250, 164727, 165891, 166573, 167084, 166945, 165721, 164045, 162706, 161469, 159786, 157884, 156137, 154050, 150976, 147400, 144458, 142429, 140465, 137818]
56662A37818l126k832k101j778k323l146l082j830m33K2l99r04r73m90K89N47
56646A15259m56k189l198l001k407j744l29J654K567J614J15o07r93j711k074
56631A02500j515j024j486k041j740j404j980k430j222J022K410K373J671Q01
56617I5935J73Q31L015M871M441K301N38k7L9L30N27k21j908k718j374N86Q66
56600A08205l45j270j560j958k010p51R53J347O87P31J883L101M220N753O923
56585A25909O619O015P317R865J0419P769M310K364J524O02o4M24J816L030L163
56570A91082J821m34j919j499k83k18j211j477n54N4m42r49m47N21R72P70L45
56553A86132K86J254L074M094K937P09j21J002K183J808K08j325j728n35J416
$$ y = [137818, 134692, 131860, 129759, 127981, 125658, 122512, 119430, 117600, 117167, 117189, 116790, 115886, 114913, 114423, 114712, 115259, 114803, 112614, 109416, 106415, 104008, 102264, 101935, 103589, 106156, 107770, 107885, 107278, 106285, 104574, 102500, 100985, 99961, 98475, 96434, 94694, 93290, 91310, 88880, 87658, 88680, 91090, 93463, 95134, 95935, 96108, 96939, 99954, 104825, 109266, 111567, 112105, 112078, 112117, 112447, 112974, 112753, 110845, 108127, 106753, 107339, 108205, 107860, 106590, 105030, 103072, 101062, 100311, 101264, 102611, 103298, 104029, 105912, 109013, 113233, 118986, 125909, 132528, 138543, 145860, 155725, 166144, 173913, 178223, 180587, 182111, 182713, 182649, 183073, 184889, 187919, 191082, 192903, 192469, 190550, 189051, 188768, 188550, 187339, 185862, 185308, 185362, 184920, 183971, 183524, 184045, 185017, 185787, 186132, 186418, 187672, 190746, 194840, 197777, 198486, 198365, 199367, 201550, 203358, 203566, 202241, 200513, 199978, 201394]
56538B01394K034L21j845k085r45p02j443j156M26J172J06j112j100m84J28J405
56522A96114L374M452L744K458J813J236j27j482j364M40K838M557M854M005L335
56507B30247L777M577M550M159M629N519N409M771N526P531Q263O809N414N897
56493C07078O940O497M958M167M684N421N185L630J569O25J470K423J423p24j374
56478C53972k79j54k257m386m542l846m041m558m175l576l960m600m093k947k816
56463C03742l866m720m581l910l434l503l977m086l126j744j365j895j607l2Q73
56448B62769l51k364l218l156l447l796k995j301k42l52p21n39J70J005J438R37
56432B43837k38q96l44O48J061J054J401K181K909L324L354K920K351K356L062
$$ y = [201394, 203428, 203749, 201904, 199819, 198874, 198172, 196729, 195573, 195999, 197171, 197277, 196165, 195065, 194581, 194709, 196114, 199488, 203940, 207684, 210142, 211955, 213191, 213064, 211582, 210218, 210658, 213496, 218053, 222907, 226912, 230247, 234024, 238601, 243151, 247310, 251939, 257458, 262867, 267638, 273164, 280695, 288958, 295767, 301181, 307078, 314018, 320515, 325473, 329640, 334324, 339745, 344930, 348560, 350129, 350754, 352224, 354647, 356070, 355346, 353972, 353693, 353539, 351282, 346896, 342354, 338508, 334467, 329909, 325734, 322158, 318198, 313598, 309505, 306558, 303742, 299876, 295156, 290575, 286665, 283231, 279728, 275751, 271665, 268539, 266795, 265430, 263535, 261928, 261896, 262769, 262418, 260054, 256836, 253680, 250233, 246437, 243442, 242141, 241899, 241547, 240826, 240287, 240457, 241462, 242900, 243837, 243599, 242703, 242359, 243007, 244068, 245122, 246523, 248704, 251613, 254937, 258291, 261211, 263562, 265918, 268980]
56417B68980L813M268M687M931M378L360L229M409N629N851N555N419N265N118
56403C34892N692O832P101O154N944P991J0862J2063J1309J0190R486Q553O890
56390D43959M893L269K718L523M688M245J564j518k794k168j124p22j255k806
56376D56472m789n725m837l338k955l768m610m928n038n092m948m902n484o639
56362C89419p706p936o822m542k350j695k558l517l668l379k918j927p67p37k054
56347C36843l165l005k466k626l032l026l198m026m426l212j023O33J376J668
56333C07315J566J056P65J104J557J754K150K609J713j084l818m155k326m77J07
56318C09836k45p85r77n32J08J7p20p83L56J503J786K051L055L889L711L505M407
$$ y = [268980, 272793, 277061, 281748, 286679, 291057, 294417, 297646, 302055, 307684, 313535, 319090, 324509, 329774, 334892, 340584, 347416, 354517, 360671, 366615, 374606, 385468, 397531, 408840, 419030, 428516, 437069, 443959, 448852, 452121, 454839, 458362, 463050, 467295, 468859, 467341, 464547, 462379, 461255, 460533, 459278, 456472, 451683, 445958, 441121, 437783, 434828, 431060, 426450, 421522, 416484, 411392, 406444, 401542, 396058, 389419, 381713, 373777, 366955, 362413, 360063, 358368, 355810, 352293, 348625, 345246, 342328, 340401, 339634, 338897, 336843, 333678, 330673, 328207, 325581, 322549, 319523, 316325, 312299, 307873, 304661, 303638, 304271, 305647, 307315, 308881, 309937, 310702, 311806, 313363, 315117, 317267, 319876, 321589, 320505, 316687, 312532, 310206, 309729, 309836, 309591, 308806, 307829, 307297, 307405, 307422, 306702, 305919, 306275, 307778, 309564, 311615, 314670, 318559, 322270, 325775, 330182]
56301C30182N670O010N696N455M678K757J098J625L921N814O126N170L368J308
56287C88878M45J693L754M525L727K655J974J487J435K235L269L578L396L614
56273D26665M114M112L734L921N010O495P678P933P086O275P186R558J0916R878
56259E20561Q099P636Q200Q611R063R900R996Q748Q084R911J2835J4047J3414
56246F49105J2994J3506J3954J3994J3981J3262J1166R223R648J1855J2925J1455
56234G97068Q702O235M665M508N955P825Q781R432J1326J4215J6408J7477J8606
56221I31203K0542K3051K5942K8831L0588L0915L1731L4842L9203M2758M5795
56210A285401M9877N4434N7657O0175O4541P1216P8178Q4536R1536R9770J08368
$$ y = [330182, 335852, 341862, 347558, 353013, 357691, 360448, 361546, 363171, 367092, 372906, 379032, 384202, 387570, 388878, 389323, 391016, 394770, 399295, 403022, 405677, 407651, 409138, 410573, 412808, 416077, 419655, 423051, 426665, 430779, 434891, 438625, 442546, 447556, 454051, 461729, 469662, 476748, 483023, 490209, 499767, 510683, 520561, 528660, 536296, 544496, 553107, 562170, 572070, 582066, 590814, 598898, 608809, 621644, 635691, 649105, 662099, 675605, 689559, 703553, 717534, 730796, 741962, 751185, 760833, 772688, 785613, 797068, 805770, 812005, 816670, 821178, 827133, 834958, 843739, 853171, 864497, 878712, 895120, 912597, 931203, 951745, 974796, 1000738, 1029569, 1060157, 1091072, 1122803, 1157645, 1196848, 1239606, 1285401, 1335278, 1389712, 1447369, 1507544, 1572085, 1643301, 1721479, 1806015, 1897551, 1997321, 2105689]
56199B105689J17239J27397J38502J48726J57565J66442J76095J85581J94054
56190C517290K01236K06044K07133K05007K01163J95142J84818J69691J51225
56181E238749J29943J05027P7248M9354K2995k291k6474m7994o5951q0906r3067
56170E306633j02008j08589j14510j19616j22272j22905j24285j27477j30505
56161D234466j32011j33294j35382j36688j35537j33032j31577j31925j32854
56152C032166j32638j30000j24821j18463j12254j05735r7982r0203q4668q1072
56142A954330p6570o9880o2794n7021n2084m7188m2771l9164l5738l2386l0039
56131A408695k8881k7719k5749k3272k0439j7138j4275j3053j2768j1557r479
$$ y = [2105689, 2222928, 2350325, 2488827, 2637553, 2795118, 2961560, 3137655, 3323236, 3517290, 3718526, 3924570, 4131703, 4336710, 4537873, 4733015, 4917833, 5087524, 5238749, 5368692, 5473719, 5550967, 5600321, 5623316, 5621025, 5594551, 5546557, 5480606, 5399700, 5306633, 5204625, 5096036, 4981526, 4861910, 4739638, 4616733, 4492448, 4364971, 4234466, 4102455, 3969161, 3833779, 3697091, 3561554, 3428522, 3296945, 3165020, 3032166, 2899528, 2769528, 2644707, 2526244, 2413990, 2308255, 2210273, 2120070, 2035402, 1954330, 1877760, 1807880, 1745086, 1688065, 1635981, 1588793, 1546022, 1506858, 1471120, 1438734, 1408695, 1379814, 1352095, 1326346, 1303074, 1282635, 1265497, 1251222, 1238169, 1225401, 1213844, 1204365]
56120A204365q443q694p960m765k20M076P644J0055J0684J0372J1197J3710J6247
56107A258268J7532J8181J9315K1340K4206K7072K8185K7038K5927K6910K8196
56096A522170K6759K3565K2264K3061K2366J8979J6147J6253J7543J7809J7878
56085A744794J9532K2871K7214L2232L7158M1494M7158N7020P0681Q4732R7605
56074B282491J10791J24632J36529J44262J47456J45010J35216J19813J04096
56065C450296R1374Q0635P0674O2399N5482M6940L5275K2620J0931m44j1658k0619
56053C893905k6606l2447m1041n2692o7186q4773j03248j17789j25936j29586
56043C112601j30519j27536j19996j10283j00548r0291p9132o8539n9079m9330
$$ y = [1204365, 1195922, 1187228, 1179268, 1174503, 1174283, 1178359, 1186003, 1196058, 1206742, 1217114, 1228311, 1242021, 1258268, 1275800, 1293981, 1313296, 1334636, 1358842, 1385914, 1414099, 1441137, 1467064, 1493974, 1522170, 1548929, 1572494, 1594758, 1617819, 1640185, 1659164, 1675311, 1691564, 1709107, 1726916, 1744794, 1764326, 1787197, 1814411, 1846643, 1883801, 1925295, 1972453, 2029473, 2100154, 2184886, 2282491, 2393282, 2517914, 2654443, 2798705, 2946161, 3091171, 3226387, 3346200, 3450296, 3541670, 3622305, 3692979, 3755378, 3810860, 3857800, 3893075, 3915695, 3926626, 3926182, 3914524, 3893905, 3867299, 3834852, 3793811, 3741119, 3673933, 3589160, 3485912, 3368123, 3242187, 3112601, 2982082, 2854546, 2734550, 2624267, 2523719, 2433428, 2354296, 2285757, 2226678, 2177348]
56033B177348l9153l0449k3354j5838q365m312m042l477o58J305K03j526j730
56020B045952k147l957m826l599l091m712n292k823l96m67k01L196P233Q814R747
56005B043431J2885J6829J9081K0628K3019K4607K4166K4403K7562L1222L2621
55994B300454L3230L4908L5836L4642L4283L7062M0044M0129L9476M0922M2515
55983B713501M1820M1454M4654M9206N1331N2066N4411N7649N9817O2278O6544
55972C294731P0161P0922P1642P5608Q1063Q5194Q9492R5938J02016J05084J07708
55961D249559J13251J20131J25673J31454J39614J48223J55486J63951J75528
55952E522870J87340J97419K08972K24040K39293K53243K70536K93183L15194
$$ y = [2177348, 2138195, 2107746, 2084392, 2068554, 2060189, 2055877, 2051835, 2048358, 2047700, 2049005, 2049208, 2047682, 2045952, 2043805, 2039848, 2035022, 2031423, 2028332, 2023620, 2018328, 2015505, 2015109, 2014642, 2014441, 2017637, 2024870, 2033684, 2043431, 2056316, 2073145, 2092226, 2112854, 2135873, 2160480, 2184646, 2209049, 2236611, 2267833, 2300454, 2333684, 2368592, 2404428, 2439070, 2473353, 2510415, 2550459, 2590588, 2630064, 2670986, 2713501, 2755321, 2796775, 2841429, 2890635, 2941966, 2994032, 3048443, 3106092, 3165909, 3228187, 3294731, 3364892, 3435814, 3507456, 3583064, 3664127, 3749321, 3838813, 3934751, 4036767, 4141851, 4249559, 4362810, 4482941, 4608614, 4740068, 4879682, 5027905, 5183391, 5347342, 5522870, 5710210, 5907629, 6116601, 6340641, 6579934, 6833177, 7103713, 7396896, 7712090]
55943G712090L32456L49766L70963L90880M05492M21118M44191M70588M95188
55934A1392732N23258N61192O04268O45353O88006P39132P96475Q55384R19788
55925A7725588R93507J068911J137828J206068J283836J370157J460544J560420
55917B7806859J675203J796268J912922K029522K154753K284763K414812K556466
55909D4631568K723784K913711L120486L357123L640850L971255M347542M793174
55901G3499493N337224N987225O748201P647779Q708234R916953J1268014J2813558
55893A41926681J4630954J6765484J9251709K2142375K5434464K9006038L2701532
55886C01859237L6335941L9304645M0138724L6865508K8340525J5426847P72442
$$ y = [7712090, 8044546, 8394312, 8765275, 9156155, 9561647, 9982765, 10426956, 10897544, 11392732, 11915990, 12477182, 13081450, 13726803, 14414809, 15153941, 15950416, 16805800, 17725588, 18719095, 19788006, 20925834, 22131902, 23415738, 24785895, 26246439, 27806859, 29482062, 31278330, 33191252, 35220774, 37375527, 39660290, 42075102, 44631568, 47355352, 50269063, 53389549, 56746672, 60387522, 64358777, 68706319, 73499493, 78836717, 84823942, 91572143, 99219922, 107928156, 117845109, 129113123, 141926681, 156557635, 173323119, 192574828, 214717203, 240151667, 269157705, 301859237, 338195178, 377499823, 417638547, 454504055, 482844580, 498271427, 499043869]
55879D99043869j2669741k3025913k9813280l3430810l4594900l4048898l2429094
55872B99031233l0195776k7652684k5007658k2391409j9860890j7448306j5211092
55865A41263418j3212703j1475977r987420q730562p684410o805455o046210n387004
55857G1933677m827255m355792l952922l610939l327736l086802k865341k656812
55849D3250078k466732k292761k127329j973746j841075j727031j621878j524496
55841B7675030j439255j361695j282611j202817j129865j063599r97959r33566
55833A8263663q75954q24423p74199p26350o84778o47028o08397n71173n39743
55824A2011618n10995m79781m49253m25263m05146l82781l60351l43824l30730
$$ y = [499043869, 486374128, 463348215, 433534935, 400104125, 365509225, 331460327, 299031233, 268835457, 241182773, 216175115, 193783706, 173922816, 156474510, 141263418, 128050715, 116574738, 106587318, 97856756, 90172346, 83366891, 77320681, 71933677, 67106422, 62750630, 58797708, 55186769, 51859033, 48772231, 45906890, 43250078, 40783346, 38490585, 36363256, 34389510, 32548435, 30821404, 29199526, 27675030, 26235775, 24874080, 23591469, 22388652, 21258787, 20195188, 19197229, 18263663, 17387709, 16563286, 15789087, 15062737, 14377959, 13730931, 13122534, 12551361, 12011618, 11500623, 11020842, 10571589, 10146326, 9741180, 9358399, 8998048, 8654224, 8323494]
55815H323494l13819k93708k76945k64137k50691k36933k27005k19729k10726
55806F029801k01768j98235j98928j97921j94759j93401j92851j88569j82036
55797D281333j79182j79989j78688j73799j69004j64427j56028j43842j32608
55788B803766j23667j13876j02839r3896q7630q1290p4683p0073o6425o0422n2824
55777A876141m7331m3757l8879l3191k9899k7940k3242j6462j2328j1589j0680
55766A580843r130r968j2883j4364j4931j8798k5677l0323l1172l2249l5337l7349
55754A308662l7030l7314l8952l8455l4556l0682k8714k6160k1799j8428j7542
55743I79030j6483j3455j0401q556n930j628J793K715L024M047M056K054J10k25
$$ y = [8323494, 8009675, 7715967, 7439022, 7174885, 6924194, 6687261, 6460256, 6240527, 6029801, 5828033, 5629798, 5430870, 5232949, 5038190, 4844789, 4651938, 4463369, 4281333, 4102151, 3922162, 3743474, 3569675, 3400671, 3236244, 3080216, 2936374, 2803766, 2680099, 2566223, 2463384, 2369488, 2281858, 2200568, 2125885, 2055812, 1989387, 1928965, 1876141, 1828810, 1785053, 1746174, 1712983, 1683084, 1655144, 1631902, 1615440, 1603112, 1591523, 1580843, 1571713, 1561745, 1548862, 1534498, 1519567, 1500769, 1475092, 1444769, 1413597, 1381348, 1346011, 1308662, 1271632, 1234318, 1195366, 1156911, 1122355, 1091673, 1062959, 1036799, 1015000, 996572, 979030, 962547, 949092, 938691, 930135, 924205, 922577, 924370, 927085, 930109, 934156, 938212, 940266, 940376, 940151]
55729I40151k96j257k194l054n627r863j2794j3046j2864j3783j3944j1824r374
55716H30231r129j0928j3456j6364j9220k0806k0996k1145k1526k0818j8823j6981
55704F20039j5545j3214j0250q734q952q728p318o592p386q066p899q366r768
55691D99221j0053q678q314j0718j3916j5446j5601j5502j4623j2373r912q422
55679C55663p378o147n373n494n675n411n330n458m772l315k556k746k235l96
55665B93377J095R84J1j170l267o157p810o931m806l313k769k716k954k948k003
55650B48623p46n25r39j79J741K650J809J052J478J669M91q08p99N6Q43J657K327
55633B60400J755j08j436q69Q97K708M319N387N208M339M521O172P835Q749R833
$$ y = [940151, 939855, 938598, 936404, 933350, 927723, 917860, 905066, 892020, 879156, 865373, 851429, 839605, 830231, 821102, 810174, 796718, 780354, 761134, 740328, 719332, 698187, 676661, 655843, 637020, 620039, 604494, 591280, 581030, 572296, 563344, 554616, 547298, 540706, 533320, 525254, 517355, 508989, 499221, 489168, 480490, 472176, 461458, 447542, 432096, 416495, 400993, 386370, 373997, 364085, 355663, 348285, 342138, 336765, 331271, 325596, 320185, 314855, 309397, 304625, 301310, 298754, 296008, 293773, 293377, 294472, 295456, 295467, 294297, 291030, 284873, 277063, 270132, 265326, 262013, 259244, 256528, 253574, 250626, 248623, 247877, 247352, 246413, 246234, 247975, 250625, 252434, 253486, 254964, 256633, 257124, 256316, 255517, 255573, 256416, 258073, 260400, 262155, 262047, 260611, 259742, 260639, 263347, 267666, 273053, 278261, 282600, 287121, 293293, 301128, 309877, 319710]
55618C19710J1363J1963J0806Q668O068K593j167l454m021m600n843o310n470
55605C40306m892n206m546j650J858L865M275L777K399P31L47J494K423K317K516
55590C50014L640M003K548Q22K22j73j235j703p28j75j852m429n514n238n315
55575C34887o017o513o964q048r295r887j0212j0939j1452j0886r705q850q258
55562B17861p513o912o693o371n862n880o319n890m472l843m814n653m882l569
55548A39188l059k638j529j163k901n097n154l293j791j404j104o42q36j561j614
55533A05402o16M89Q01P5j488l087l571k893k390k702k551q96J045J428M03m99
55517H8950o20l56Q4N50L69p46j915k274k092j787j044Q3N72J36N3J021J723J093
$$ y = [319710, 331073, 343036, 353842, 362510, 368578, 371171, 370004, 366550, 362529, 357929, 352086, 345776, 340306, 335414, 330208, 325662, 324012, 325870, 329735, 334010, 337787, 340186, 340917, 341264, 342758, 345181, 347498, 350014, 353654, 357657, 360205, 361027, 361249, 361076, 359841, 358138, 357410, 357235, 355383, 350954, 345440, 340202, 334887, 328870, 322357, 315393, 307345, 298050, 288163, 277951, 267012, 255560, 244674, 234969, 226119, 217861, 210348, 203436, 196743, 190372, 184510, 178630, 172311, 166421, 161949, 158106, 153292, 147639, 142757, 139188, 136129, 133491, 131962, 130799, 127898, 122801, 117647, 114354, 112563, 111159, 110055, 109413, 108577, 107016, 105402, 104786, 105275, 106076, 106151, 104663, 101576, 98005, 95112, 92722, 90020, 87469, 86573, 87618, 89046, 89449, 88950, 88330, 87974, 88058, 88608, 88977, 88231, 86316, 84042, 81950, 80163, 79119, 79202, 79774, 79910, 79963, 80984, 82707, 83800]
55499H3800L12Q23J847J842J000K90n62j972k680j422N09P89o23j924k458k878
55483G6693k954j646O83K427L062L452L824L439K292J469J461J608J359R29O91
55468I8789R20J926L487M504M243L470L349L809M077M035L876L171J716O26J111
55453A43109K633L509K949J359p67l071n033o543q117r631r919q595p140o872
55439H7871p071o536n671n333m922l576k164k032k689k848k786l508m321l775
55425C0639k416k196l349m161l781l042k396j282K50J059N23p82k073k771A947
55409A109k02g07l676l993k513j201p35K5J240J350k22j788j775o65K56O61Q73
55392a2870R55Q43N73k1j020j739j266K49J716K448K501J982J081L87J41m27j690
$$ y = [83800, 84112, 84935, 86782, 88624, 89624, 89914, 89352, 87380, 84700, 83278, 83787, 84576, 83953, 82029, 79571, 76693, 73739, 72093, 72776, 75203, 78265, 81717, 85541, 88980, 91272, 92741, 94202, 95810, 97169, 98098, 98789, 99709, 101635, 105122, 109626, 113869, 117339, 120688, 124497, 128574, 132609, 136485, 139656, 141372, 141998, 143109, 145742, 149251, 152200, 153559, 152792, 149721, 144688, 138145, 130028, 120397, 110478, 101883, 94743, 87871, 80800, 74264, 68593, 63260, 58338, 54762, 52598, 50566, 47877, 45029, 42243, 38735, 34414, 30639, 28223, 26027, 22678, 18517, 14736, 11694, 9298, 8016, 8266, 9325, 9848, 9066, 6993, 4222, 1947, 1109, 907, -707, -4383, -8376, -10889, -12090, -12825, -12800, -11560, -10210, -10432, -12220, -13995, -14660, -14404, -13743, -12870, -11915, -11072, -10499, -10520, -11540, -13279, -14545, -14296, -12580, -10132, -7631, -5649, -4568, -4181, -4040, -4467, -6157]
55375f157k265p98J444J745l43k438k543j055P23K096K597J868O90O06J890A049
55358C660J175k41j215A676A07a017j299k534m011m302k627M41L124L722K474
55343f029J564b125A080J676H35c643l978j718k40l45q84p17j03r9r16j257K1
55326a3879J869J993J39j317q15K05K4m44M65J951K002Q41M35R88O51j387l786
55309a0065n142n139l675r70J513K279J914K094K765K467J290Q96J551J670P78
55294e774L75J114J465L37j055j122j42N53L75l98j259j589j034p3N17O40M64
55277f606m27k097l192k518j094p74j393j520j239j696k315j438M23J029J92l4
55261b4699P10L51j664k955j954n4J196K165L033K596Q25r6R26K086J912J610
$$ y = [-6157, -8422, -9220, -7776, -6031, -6374, -8812, -11355, -12410, -11687, -9591, -6994, -5126, -4436, -3830, -1940, 1049, 3660, 4835, 4594, 3379, 1676, 107, -1017, -2316, -4850, -8861, -13163, -15790, -15349, -12225, -8503, -6029, -4465, -2125, 1080, 2756, 835, -3643, -7621, -9339, -9579, -9924, -10808, -11525, -11628, -11727, -12643, -13900, -13879, -12010, -10017, -9878, -11195, -12010, -11805, -11781, -12225, -11760, -9809, -7807, -6966, -6531, -5543, -4892, -6279, -10065, -15207, -20346, -24021, -24991, -23478, -21199, -19285, -17191, -14426, -11959, -10669, -9773, -8222, -6552, -5774, -5399, -4285, -2820, -2483, -3538, -4660, -4802, -4249, -3874, -4272, -5531, -7120, -8154, -8227, -7710, -7070, -6606, -7033, -9130, -12322, -14840, -15934, -16708, -18101, -19621, -20860, -22556, -24871, -26309, -25886, -24857, -24665, -24699, -23989, -23638, -25302, -28257, -30211, -30265, -29069, -26904, -23871, -21275, -20450, -20546, -19620, -17534, -15622, -14012]
55245a4012K254K353O74q54K10K988a758B415K722J044p95k336a19l662l873k904
55229a0558o25J387J995J935J785N80j795k959j246J315J780N55J39Q88R84j07
55213c947j038j107r00n44M38J556J633O89n4pM18R61c38A288O86n12E95A40j5
55194A25L03M45l25a591l410k704j028l43o44m32N36J108R63R04J085Q38K37K1
55176d460P3m50j351j466m91O52J276J500J463J304d07A843K259O10j638D52a767
55158c537j753j557j129r66o93M20J684J784J206J705C75L666K402J347J954L025
55142A2769K784J343k12j708l323m286l625j802k65L34O08J247K063K248J221
55127I396o70k228k371j127M40J199O43r13A959g82j786m27P12d91B155K279M95
$$ y = [-14012, -11758, -9405, -8731, -9585, -9375, -6387, -1758, 2415, 5137, 6181, 5386, 3050, -119, -3781, -7654, -10558, -11183, -9796, -7801, -5866, -4081, -3501, -5296, -8255, -9501, -8186, -6406, -5851, -5712, -4824, -3840, -3947, -4985, -6092, -6992, -7536, -7098, -5542, -3909, -3220, -3274, -3281, -2863, -1902, -338, 1288, 1974, 1462, 595, 140, 125, 428, 873, 548, -1591, -5001, -7705, -8733, -9076, -9720, -10152, -9616, -8508, -7545, -6641, -5556, -4718, -4481, -4460, -4387, -4837, -6188, -7654, -8145, -7493, -6217, -4717, -3254, -1950, -407, 1843, 4102, 4712, 3074, 452, -1767, -3537, -5290, -6847, -7976, -8942, -9635, -9215, -7531, -5747, -4541, -2836, 375, 4041, 6443, 7790, 9744, 12769, 15553, 16896, 16684, 14976, 11653, 7367, 3742, 1940, 1675, 2009, 2617, 3864, 5927, 8175, 9396, 8726, 6498, 4127, 3000, 3440, 4639, 5282, 4369, 1959, -782, -2568, -2995, -2283, -491, 2155, 4434, 4929]
55110D929j112j170n80r53f75j280N35A85J039K89O76J497J598J256J416J999
55094I955K033R40r70k836l727B193E00JJ484K572K765J775L59m22o29j111j879
55077E415k017j345q79h8j774j371k9J407C18K138J773J581J297R9j795k643j184
55060A584J378K687K129J123R15J444K207K809K651J457M9n44n58p52o81N86K399
55043B0883L102K634K441K760K168K49j575k435k976l134j436K067M518L707J115
55028C4088l47j40L19N59J226K102K060R11m00j316j908j810l75J873L260K710
55012D2812Q30r41j618j214n79n93j140j180k11R26J207Q76R52J727K562K884
54996D7300K641J980J094K06p28j916l000l072k006j061j319k122k096j251p98
$$ y = [4929, 3817, 2647, 2067, 1114, -675, -1955, -1420, 185, 1224, 1513, 2189, 3686, 5284, 6540, 7956, 9955, 11988, 12928, 11958, 9122, 5395, 2193, 500, 501, 1985, 4557, 7322, 9097, 9456, 9034, 8405, 7294, 5415, 3398, 2053, 1174, -88, -1862, -3233, -3262, -1855, 318, 2456, 4229, 5810, 7107, 7206, 5411, 2768, 1584, 2962, 5649, 7778, 8901, 9816, 11260, 13467, 16276, 18927, 20384, 20433, 19889, 19331, 18579, 17898, 18484, 20883, 23985, 26619, 29060, 31820, 33988, 34237, 32662, 30227, 27251, 24117, 22681, 24748, 29266, 32973, 34088, 33741, 33601, 33920, 34479, 35705, 37807, 39867, 40778, 40378, 39062, 37154, 35344, 34969, 36842, 40102, 42812, 43642, 42701, 41083, 39869, 39290, 38697, 37557, 36377, 36166, 37092, 38299, 39175, 40127, 41854, 44416, 47300, 49941, 51921, 53015, 53221, 52493, 50577, 47577, 44505, 42499, 41438, 40119, 37997, 35901, 34650, 33852]
54981C3852r95o33J011K729K772J145k20L24K217L374K693J313Q64J101L75j568
54965E0354k781j748M15J605J611J803K436K090J88j565j226P62K105J543K27
54950E7819JJ006J657Q41o23j101k82O18P16O61J481K901L555K621O34j225k171
54933F9109k107j347l84L35N94M96L79N40Q65Q28R3r23j439j253r28r66j177j070
54915F1645n17K29R06J391J684J897K125K210J872J224Q68J260K038K212J126
54900H2170p12j809j067J025K925L872M485N241N414M432L438L976N575O363O120
54885A31448O783R407J2389J3819J4052J4588J5493J5612J4655J3425J2067R688
54873B83426N947J764j861m933p929j0893j3378j4852j4882j3555j1879j1187
$$ y = [33852, 32857, 32224, 33235, 35964, 38736, 39881, 39661, 39985, 42202, 45576, 48269, 49582, 50446, 51547, 51922, 50354, 47573, 45825, 46240, 47845, 49456, 51259, 53695, 55785, 55973, 54408, 53182, 53944, 56049, 57592, 57819, 57820, 58826, 60483, 61324, 60701, 59600, 59318, 59936, 60652, 61313, 62794, 65695, 69250, 71871, 72505, 71280, 69109, 67002, 65655, 65271, 65606, 66200, 66696, 67075, 67615, 68480, 69308, 69401, 68478, 67039, 65786, 64858, 63892, 62715, 61645, 61128, 61357, 62263, 63654, 65338, 67235, 69360, 71570, 73442, 74666, 75534, 76794, 78832, 81044, 82170, 81458, 79649, 78582, 79607, 82532, 86404, 90889, 96130, 101544, 105976, 109414, 113390, 118965, 125328, 131448, 138231, 147638, 160027, 173846, 187898, 202486, 217979, 233591, 248246, 261671, 273738, 283426, 289373, 291137, 289276, 284343, 276414, 265521, 252143, 237291, 222409, 208854, 196975, 185788]
54861A85788j1678j1985j0743q265o133n245m920m117k841j758q71N53K589M090
54847A24464M084L172K912M077O122P972Q769Q192O927O586Q178J0674J2055J1823
54833B26007J1293J1247J0626Q261M801J878k9j859m485p817j1191j3893j5346
54820B19493j5427j4601j3420j2005j0328q754p799p468p208o543n566m881n042
54807A00451n836o113m854k496o43j63k99L1O83P24j30j232j958k224k194k104
54791G1643k308k951l637l774l191k157r90j20k38j617l313l692k136J39J372
54776D3030J089L71L18P72Q01J34m30k25K95K37l42m52M84J797K260J232q79k883
54758D7609l444j945R88L979N885O205N014L056J634J591K440L111L402L888M490
$$ y = [185788, 174110, 162125, 151382, 143117, 136984, 131739, 126819, 122702, 119861, 118103, 117232, 117785, 120374, 124464, 128548, 131720, 134632, 138709, 144831, 152803, 161572, 169764, 176691, 183277, 191455, 202129, 214184, 226007, 237300, 248547, 259173, 267434, 272235, 274113, 274084, 272225, 267740, 259923, 248732, 234839, 219493, 204066, 189465, 176045, 164040, 153712, 144958, 137159, 129691, 122483, 115940, 110374, 105493, 100451, 94615, 88502, 83648, 81152, 80509, 80346, 80047, 80078, 80761, 81485, 81355, 80123, 78165, 75941, 73747, 71643, 69335, 66384, 62747, 58973, 55782, 53625, 52635, 52515, 52277, 50660, 47347, 43655, 41519, 41658, 43030, 44119, 44490, 44808, 45580, 46381, 46515, 46085, 45860, 46155, 46392, 46050, 45598, 46082, 47879, 50139, 51371, 50492, 47609, 44165, 42220, 43208, 47187, 53072, 59277, 64291, 67347, 68981, 70572, 73012, 76123, 79525, 83413, 87903]
54743H7903M308L132K047K044K883L793M507N089N478N779O372P205P611P373
54729A55524P313Q258J0024J1987J3972J5938J7374J7753J7093J5495J2724Q977
54717C12432N315K448m07m368q892j1941j2252j0685r238r236j0468j1523j0970
54704B20215q589n587l445k744l103l764l902k910q87J345L011L987M483M668
54690B02778M795N156N729O441P845J0600J4105J6715J7868J8686J9842K0202
54678C50762J8716J6314J4281J1772O896j64o969j1734j4771j6986j8547j9387
54666C30183j9714j9430j8129j6072j4255j3251j2736j2405j2327j2165j1078
54655A68621q915o704n431m982m700m351m111m089m156l948l063j723j029j606
$$ y = [87903, 92211, 95343, 97390, 99434, 102317, 106110, 110617, 115706, 121184, 126963, 133335, 140540, 148151, 155524, 162837, 171095, 181119, 193106, 207078, 223016, 240390, 258143, 275236, 290731, 303455, 312432, 317747, 320195, 319788, 315420, 306528, 294587, 282335, 271650, 262412, 253176, 242708, 231185, 220215, 211626, 206039, 202594, 199850, 196747, 192983, 189081, 186171, 185284, 186629, 189640, 193627, 198110, 202778, 207573, 212729, 218458, 224899, 232744, 243344, 257449, 274164, 292032, 310718, 330560, 350762, 369478, 385792, 400073, 411845, 418741, 418577, 411608, 399874, 385103, 368117, 349570, 330183, 310469, 291039, 272910, 256838, 242583, 229332, 216596, 204191, 191864, 179699, 168621, 159706, 153002, 147571, 142589, 137889, 133538, 129427, 125338, 121182, 117234, 114171, 112448, 111419, 109813]
54641A09813k228r81J976M146L802K106J181J177O35q68k098k107j417p78J14
54626A14473J770L462L683K095J43o84n28n18q17m43Q77J745R03p54j123M13K295
54609A26992K996K773K751L201L547L528L366L065K455K017K745M728O546O688
54595A77398N236L496K313J478P92O03R47J067N66L37J368L099M055L919L825
54580B10499M474N189N227N057N713P553J0142J2812J4845J5653J5260J4238J3001
54567C39663J1631J0346R195P237L112k997q962j2866j4712j5516j5766j5536
54555B94829j5049j4230j2536j0096q176p517p126n792l983l062l291l774l839
54542A96358l357k323j278j403l060m833n277m876m899n155m488k987j947j966
$$ y = [109813, 107585, 106604, 108580, 112726, 116528, 118634, 119815, 120992, 121627, 120759, 118661, 116554, 115137, 114359, 114473, 116243, 119705, 123388, 125483, 125626, 124942, 124414, 123896, 123079, 122636, 123513, 125258, 126161, 125407, 124284, 124697, 126992, 129988, 132761, 135512, 138713, 142260, 145788, 149154, 152219, 154674, 156691, 159436, 164164, 170710, 177398, 182634, 186130, 188443, 189921, 190713, 191316, 192263, 193330, 193896, 194233, 195601, 198700, 202755, 206674, 210499, 214973, 220162, 225389, 230446, 236159, 243712, 253854, 266666, 281511, 297164, 312424, 326662, 339663, 351294, 361640, 370835, 378072, 381184, 378187, 369225, 356359, 341647, 326131, 310365, 294829, 279780, 265550, 253014, 242918, 234742, 227225, 220099, 214307, 210324, 207262, 203971, 200197, 196358, 193001, 190678, 189400, 187997, 184937, 180104, 174827, 169951, 165052, 159897, 155409, 152422, 150475, 148509]
54528A48509k613l641m879n440m761m044m713n781m964k275j78N3k91j49l98j735
54512A02700l066l200k562j957j251m19l45j266j807r64K17L54j30o9J97n32k005
54495H3895k526j348K72O44m05j372p26J281K618J836J0o81J1M40N0J84J383K096
54477H7662J361N65R70J342K94o62J046N003Q116Q676P670O322M727L255L049
54462A39396M325N712O163O181O530O886O414M802K196r99l914n591n943n698
54448A66460n273m667m443n502p396q197o857m594l133k424j379n9K71q58k344
54433A09605l007k815k277j520n77nk87p87k56J313K144P04k161l934l251j221
54417I1668J78J63p04j554j694o32J488L618M631M336L299K010Q29L79J074K295
$$ y = [148509, 145896, 142255, 137376, 131936, 127175, 123131, 118418, 112637, 107673, 105398, 105220, 105273, 104982, 104833, 104435, 102700, 99634, 96434, 93872, 91915, 90664, 90245, 89900, 88634, 86827, 85863, 86080, 86434, 86304, 86235, 86432, 85900, 83895, 81369, 80021, 80293, 80937, 80532, 79160, 78434, 79715, 82333, 84169, 84179, 83498, 83509, 83949, 83999, 84183, 85566, 87662, 89023, 89588, 90558, 91900, 92194, 91532, 92578, 97581, 105697, 114373, 122043, 128365, 133092, 136347, 139396, 143721, 149433, 155596, 161777, 168307, 175193, 181607, 186409, 188605, 187606, 183692, 178101, 172158, 166460, 161187, 156520, 152077, 146575, 139179, 130982, 124125, 119531, 116398, 113974, 112595, 112536, 112807, 111949, 109605, 106598, 103783, 101506, 99986, 99409, 99404, 99117, 98330, 98074, 99387, 101531, 102235, 100074, 96140, 92889, 91668, 91846, 92009, 91305, 89751, 88057, 87425, 88913, 92531, 97162, 101498, 104797, 106807, 107636, 108015, 109089, 111384]
54401A11384K820K222J165J75r55k215k669j529M48J538R75l16j057j069j086
54386A09831j522k049k278k315k440k568k338j476m2J524K419J994N48p24j038
54371I7526q63r90j227p81L38J195J186M95o19j927k574j571N42J737R87k38K8
54354I3244J530K179R00j043j604j32K159L465L085K059J997L155M228M136L384
54339A22742L135L587L977L798L273K895L116M208N818O856O437M728K589P32
54325A77891m84r59j202k080l517m062k708n54L44o00k290l766m835n168m313
54310A41697k910k423l211m002l828l318l293l216k109k83J016J307J186J146
54296A17759J015O09J49j43k06J19R16J623J357K30l35P82K801L870L302K201
$$ y = [111384, 114204, 116426, 117591, 117766, 116811, 114596, 111927, 110398, 110846, 112384, 113359, 113043, 111986, 110917, 109831, 108309, 106260, 103982, 101667, 99227, 96659, 94321, 92845, 92803, 94327, 96746, 98740, 99288, 98564, 97526, 96663, 95673, 94446, 93665, 94003, 95198, 96384, 96879, 96260, 94333, 91759, 90188, 90730, 92467, 93454, 93216, 93244, 94774, 96953, 97853, 96810, 95206, 95074, 97233, 100698, 103783, 105842, 107839, 110994, 115222, 119358, 122742, 125877, 129464, 133441, 137239, 140512, 143407, 146523, 150731, 156549, 163405, 169842, 174570, 177159, 177891, 177407, 176448, 175246, 173166, 169649, 165587, 162879, 162325, 162669, 162069, 159779, 156013, 151178, 146010, 141697, 138787, 136364, 133153, 129151, 125323, 122005, 118712, 115496, 113387, 113104, 114120, 115427, 116613, 117759, 118774, 119383, 119532, 119389, 119183, 119302, 120218, 121841, 123198, 123428, 123093, 123875, 126676, 130546, 133848, 136049]
54280A36049J763J842J706J443J699K404K703K200J487J190J156Q11q6j292k273
54265A52802k441j779j236j910l615m898m786l870l377l734m543n218n246m261
54251A01888k551j049l70k47k68n23j053j350j113j010j762k882l162k309j313
54236H0926j220k033k797k506j115J87K28n47m98Q72K058J703M96j62k75p41j469
54219G3107j608j194r38p49q5L70o47k596l208j595M34J026P76J395K998M062
54203G1548L549J900J03j304k099j925l84K263M649N127L499J467P33J062J046
54188I1234K38o81j456k432l157k539p81M32L58K17J000J703J012n73j732k406
54172H0437l212l668k712q84o5q42j586o96J355K895L179K904K897K985K412J085
$$ y = [136049, 137812, 139654, 141360, 142803, 144502, 146906, 149609, 151809, 153296, 154486, 155642, 156453, 156367, 155075, 152802, 150361, 148582, 147346, 145436, 141821, 136923, 132137, 128267, 124890, 121156, 116613, 111395, 106149, 101888, 99337, 98288, 97918, 97671, 97403, 96880, 95827, 94477, 93364, 92354, 90592, 87710, 84548, 82239, 80926, 79706, 77673, 74876, 72370, 71255, 71442, 71670, 71123, 70625, 71497, 73555, 75258, 75754, 75592, 75317, 74576, 73107, 71499, 70305, 69367, 68618, 68533, 68903, 68256, 65660, 62452, 60857, 61291, 62317, 63093, 64488, 67486, 71548, 75097, 76997, 77100, 75796, 73697, 71772, 71388, 73651, 78300, 83427, 86926, 88393, 89126, 90188, 91234, 91472, 90791, 89335, 86903, 83746, 81207, 80426, 80858, 81216, 81433, 82433, 84136, 85148, 84575, 82843, 80437, 77225, 73557, 70845, 69961, 69896, 69054, 67468, 66772, 68127, 71022, 74201, 77105, 80002, 82987, 85399, 86484]
54156H6484J23O87K367L388K655R07n92j661k643k958j610R66K863K738J057q69
54140I3902k129k250j079O85J677J297L97r5m91j422k296j967q01o03k113l777
54124G8935l725k080m26L24N05N37L68Q8P2J94k43j433k498k449j249L10J385
54107F8615J560J103R01J545K347K065Q31K42R36J323j49k470l228j807R5R05
54091G4814O27p5q29j205p18K79O68m0j136j842k084j940j294n29n63j487k036
54074F0610j187M37J440J359P83J84n01j275j706j330k10Q47Q21l49j317p28R01
54057E8779J616N15j214k052j906j465r38l88l89j227j920j218O81K320K720K085
54041E5999J064K18Q4Q19J745J938J402J012J325J948K114J452K42o77m67P53
$$ y = [86484, 86607, 87294, 89661, 93049, 95704, 96611, 96019, 94358, 91715, 88757, 87147, 88113, 90976, 93714, 94771, 93902, 91773, 89523, 88444, 89129, 90806, 92103, 92500, 92405, 91914, 90492, 88196, 86229, 85428, 84825, 82712, 78935, 75210, 73130, 72704, 73028, 73533, 74070, 74438, 74526, 74598, 74792, 74549, 73116, 70618, 68169, 66920, 67230, 68615, 70175, 71278, 72179, 73724, 76071, 78136, 78967, 79209, 80145, 81468, 81319, 78849, 75621, 73814, 73909, 74814, 75441, 75366, 74537, 73332, 72614, 72893, 73561, 73521, 72385, 70543, 68459, 66519, 65225, 64696, 64133, 62646, 60610, 59423, 59860, 61300, 62659, 63442, 63626, 63125, 61850, 60144, 58814, 58604, 59451, 60272, 59923, 58606, 57878, 58779, 60395, 60910, 59696, 57644, 55738, 54273, 53335, 52947, 52558, 51331, 49411, 48193, 48874, 51194, 53914, 55999, 57063, 57281, 57365, 58184, 59929, 61867, 63269, 64281, 65606, 67554, 69668, 71120, 71362, 70685, 70218, 70971]
54025G0971J755J491K96p24j035p85n4R96J551R50k7O5J126J305m16k600l124
54008G1741j713J35J182J369J044K97p58j545j315K06K364L742L245J326k35n8
53992H1027J582L497M944N671N187L250R63J90J392K988L519L505M218N386N582
53977A32901M690M410N804P622P961O717N335M799M964N542O495P387P545P140
53963B19312P138P828Q221P422N919M903M801N054M938M118K816J728J408J362
53949B86968M09j686l636m332m313m645n126m854m111m112m937n329m828m513
53935B30955n007n226m240l061l167m035l865k354j094j169j841k036j757j478
53921A90625j180q11o53n27L42J802K198O06j276j074R30K221J575K52n78j423
$$ y = [70971, 72726, 74217, 74513, 73789, 72754, 71969, 71915, 72911, 74462, 75412, 75385, 75450, 76576, 77881, 77465, 74865, 71741, 70028, 70163, 71345, 72714, 73758, 74055, 73297, 71752, 70437, 70643, 73007, 76749, 79994, 81320, 81085, 81027, 82609, 86106, 91050, 96721, 101908, 105158, 106121, 106311, 107703, 110691, 114210, 117715, 121933, 127319, 132901, 137591, 142001, 147805, 155427, 163388, 170105, 175440, 180239, 185203, 190745, 197240, 204627, 212172, 219312, 226450, 234278, 242499, 249921, 255840, 260743, 265544, 270598, 275536, 279654, 282470, 284198, 285606, 286968, 287377, 285691, 282055, 277723, 273410, 268765, 263639, 258785, 254674, 250562, 245625, 240296, 235468, 230955, 225948, 220722, 216482, 213421, 210254, 206219, 202354, 200000, 198906, 197737, 195896, 193860, 192103, 190625, 189445, 188634, 187981, 187454, 187796, 189598, 191796, 192402, 191126, 190052, 190982, 193203, 194778, 195030, 194452, 193029]
53905A93029k732l411k569j298j135j666j315J7P89J31j113j718j323l05O64R47
53889A76992O19N88J286J724J029L26J543M474O738O830N656M656M053L619L684
53874B23817M421N282N948O878Q138Q692P737N841M026K608J605J278J457J359
53860B89087J009J669L731N306M509K367J726L546N918O729N933M985N162O600
53846C48277Q169Q261O398M124L396M308N203M836L428J671j36j712k577k719
53832C90927k767l232m020m862n636o164o269o186o414p022p576p785p713p375
53818C07906o701o008n903o526p311p658p484p043o547o035n463m882m660n121
53804B20564n791n487l787j874j254j965k835l162l225l389l716m366n377o009
$$ y = [193029, 190297, 186886, 184317, 183019, 181884, 180218, 178903, 178920, 179709, 179840, 178727, 177009, 175686, 175381, 176045, 176992, 177611, 178199, 179485, 181209, 182238, 182564, 184107, 188581, 195319, 202149, 207805, 212461, 216514, 220133, 223817, 228238, 233520, 239468, 246346, 254484, 263176, 270913, 276754, 280780, 283388, 284993, 286271, 287728, 289087, 290096, 291765, 295496, 300802, 305311, 307678, 309404, 312950, 318868, 325597, 331530, 336515, 341677, 348277, 356446, 364707, 371105, 375229, 378625, 382933, 388136, 392972, 396400, 398071, 397935, 396223, 393646, 390927, 388160, 384928, 380908, 376046, 370410, 364246, 357977, 351791, 345377, 338355, 330779, 322994, 315281, 307906, 301205, 295197, 289294, 282768, 275457, 267799, 260315, 253272, 246725, 240690, 235227, 230345, 225685, 220564, 214773, 209286, 205499, 203625, 202371, 200406, 197571, 194409, 191184, 187795, 184079, 179713, 174336, 168327]
53790A68327n273l385j734j178j250j290j420j847k060j464m22J0p14k090l033
53775A41177k801j582k49N43Q46Q56L10r04j980j889p35M36J081J511J839J695
53759A40154J255J385K326L208L334L047K797K321J456Q77J102J520J401J171
53745A67354J645K404K323J597J863L872O200P007O388O105P147Q500Q539P000
53731B37944N107M041L944M330M754M779L918K240O89K27Q48J903L042M093M423
53716B86282L456J776O45K77l34j492k025j163j88j036l677o034o366m927l215
53701B61979k282k020j725j108p87j621l483n070n205m005k367q51M03R56K76
53686B33090j298k523k607k174k408l512m466m319l264k262j811j592j236r31
$$ y = [168327, 163054, 159669, 157935, 156757, 155507, 154217, 152797, 150950, 148890, 147426, 147004, 147014, 146300, 144210, 141177, 138376, 136794, 136545, 137088, 137934, 138790, 139100, 138196, 136216, 134327, 133592, 134028, 135109, 136620, 138459, 140154, 141409, 142794, 145120, 148328, 151662, 154709, 157506, 159827, 161283, 162160, 163262, 164782, 166183, 167354, 168999, 171403, 173726, 175323, 177186, 181058, 187258, 194265, 200653, 206758, 213905, 222405, 230944, 237944, 243051, 247092, 251036, 255366, 260120, 264899, 268817, 271057, 271746, 271973, 272821, 274724, 277766, 281859, 286282, 289738, 291514, 292159, 292436, 292102, 290610, 288585, 287422, 287234, 286198, 282521, 276487, 270121, 265194, 261979, 259697, 257677, 255952, 254844, 254057, 252436, 248953, 243883, 238678, 234673, 232306, 231455, 231858, 232814, 233090, 231792, 229269, 226662, 224488, 222080, 218568, 214102, 209783, 206519, 204257, 202446, 200854, 199618, 198687]
53672A98687r49r89n49J94N25J58m58q94j223j452j154j78P56Q12J96k6P74K244
53654A96474L775N088N882N634M361L178L258M268M580L368J722J206J986L103
53640B47883M056N009N706N521M756M593N312N721M998L940L500L242K450J762
53626C08449K226L364L818L542L709M524M786L767K129P02k57l82O98K148K331
53611C45554J113L31J130K192J750J39j017j278j508k097k408k098j676j594j552
53596C36981j021o0O31M01n69j198o13P05J404R11q6q90j543k022j728n57N00
53579C31246O25L32N27J075J221Q53L92l0l39L3J422K937L308K566J870J841K096
53562C51975K325K791L541M059M136M370N435P197Q772R195Q035N737L440K199
$$ y = [198687, 197738, 196749, 196200, 196394, 196919, 197077, 196619, 195725, 194502, 193050, 191896, 191718, 192474, 193286, 193482, 193456, 194230, 196474, 200249, 205337, 211219, 216853, 221214, 224392, 227650, 231918, 236498, 239866, 241588, 242794, 244780, 247883, 251939, 256948, 262654, 268175, 272931, 277524, 282836, 288557, 293555, 297495, 300995, 304237, 306687, 308449, 310675, 314039, 317857, 321399, 325108, 329632, 334418, 338185, 340314, 341016, 340759, 340377, 341075, 343223, 345554, 346667, 346998, 348128, 350320, 352070, 352209, 351192, 349914, 348406, 346309, 343901, 341803, 340127, 338533, 336981, 335960, 335900, 336531, 336932, 336363, 335165, 334552, 335257, 336661, 337572, 337486, 336596, 335053, 333031, 331303, 330746, 331246, 331871, 332203, 332730, 333805, 335026, 335879, 336271, 336241, 335902, 335935, 337357, 340294, 343602, 346168, 348038, 349879, 351975, 354300, 357091, 360632, 364691, 368827, 373197, 378632, 385829, 394601, 403796, 411831, 417568, 421008, 423207]
53548D23207K233L037M015M889N774P023Q638R779R512Q294P755Q514R169Q382
53534E20221P017O905Q174R221R114Q303P162N423L536L003M530O823Q099Q060
53520F15591P663P490P205O316M868L404K524K366K378J884Q72ql10j09M25J291
53504F63850K242K739K588K182J815J214P8j195j793j345k49P67J330J681K293
53489F78197L196L779L559K891K590K940L501L745L503K791J834J259J717L053
53475G18555M274M657M524M700N424O141O330O301O870Q277R748J0593J1418J3396
53461H21208J6278J8262J8422J8145J9164K1036K2099K2269K3140K5358K7621
53450A053002K8799K9459L0550L1821L2615L3248L4548L6564L8660M0497M2119
$$ y = [423207, 425440, 428477, 432492, 437381, 443155, 450178, 458816, 468595, 478107, 486401, 494156, 502670, 511839, 520221, 527238, 534143, 542317, 551538, 560652, 568955, 576117, 581540, 585076, 588079, 592609, 599432, 607531, 615591, 623254, 630744, 637949, 644265, 649133, 652537, 655061, 657427, 659805, 661689, 662561, 662553, 662243, 662134, 662559, 663850, 666092, 668831, 671419, 673601, 675416, 676630, 676708, 675513, 673720, 672375, 672126, 672893, 674223, 675904, 678197, 681393, 685172, 688731, 691622, 694212, 697152, 700653, 704398, 707901, 710692, 712526, 713785, 715502, 718555, 722829, 727486, 732010, 736710, 742134, 748275, 754605, 760906, 767776, 776053, 785801, 796394, 807812, 821208, 837486, 855748, 874170, 892315, 911479, 932515, 954614, 976883, 1000023, 1025381, 1053002, 1081801, 1111260, 1141810, 1173631, 1206246, 1239494, 1274042, 1310606, 1349266, 1389763, 1431882]
53439A431882M3419M4366M5437M7087M8935N0197N0685N0855N0976N0956N0914
53428A965709N1144N1447N1132N0001M8809M8367M8544M8541M8023M7524M7597
53417B506838M7972M7844M6919M5755M4897M4067M2522M0097L7478L5436L4034
53406B973859L2677L0653K7689K4199K0988J8474J6307J3917J1302Q751N926J885
53394C186627l668r598j4239j6986j8689k0528k2835k5178k7342k9679l2303l4504
53382B931078l5663l6479l8311m1118m3129m3141m2094m1505m1255m0243l8582
53371B489558l7610l7750l7778l6484l3882l0655k7422k4894k3595k2976k1732
53360B154780j9320j6308j3066r316n330k203r7K549O886J1677J4737J5855J7060
$$ y = [1431882, 1475301, 1519667, 1565104, 1612191, 1661126, 1711323, 1762008, 1812863, 1863839, 1914795, 1965709, 2016853, 2068300, 2119432, 2169433, 2218242, 2266609, 2315153, 2363694, 2411717, 2459241, 2506838, 2554810, 2602654, 2649573, 2695328, 2740225, 2784292, 2826814, 2866911, 2904389, 2939825, 2973859, 3006536, 3037189, 3064878, 3089077, 3110065, 3128539, 3144846, 3158763, 3170065, 3178816, 3184742, 3186627, 3182959, 3173361, 3159122, 3142136, 3123447, 3102919, 3080084, 3054906, 3027564, 2997885, 2965582, 2931078, 2895415, 2858936, 2820625, 2779507, 2736378, 2693237, 2651143, 2609638, 2568383, 2528140, 2489558, 2451948, 2414198, 2376420, 2339936, 2306054, 2275399, 2247977, 2223083, 2199488, 2176512, 2154780, 2135460, 2119152, 2106086, 2096770, 2091440, 2089237, 2089140, 2091689, 2098575, 2110252, 2124989, 2140844, 2157904]
53347B157904K0161K4983K9988L3768L5930L7163L8612M0861M3575M6281M9068
53336B558294N2221N5537N8530O1072O3565O6666P0895P6012Q0689Q3594Q5017
53325C312092Q6608Q9223R1989R3937R5355R6750R7750R8074R8488R9407R9569
53314D359242R7706R4803R2846R1791Q9659Q5559Q0648P5903P0845O4988N8819
53303E262809N2611M5753L8162L0910K4548J8058J0515K574m871j2379k0732k8911
53291E419047l5115l9533m4408n1077n8440o4866p0370p6031q2048q7286r0550
53280D719323r1650r1224r0111q8992q8287q8036q7903q7630q7500q8109q9364
53269C740517q9972q8393q4442p9587p5499p2656p0405o8001o5144o1808n8003
$$ y = [2157904, 2178065, 2203048, 2233036, 2266804, 2302734, 2339897, 2378509, 2419370, 2462945, 2509226, 2558294, 2610515, 2666052, 2724582, 2785654, 2849219, 2915885, 2986780, 3062792, 3143481, 3227075, 3312092, 3398700, 3487923, 3579912, 3673849, 3769204, 3865954, 3963704, 4061778, 4160266, 4259673, 4359242, 4456948, 4551751, 4644597, 4736388, 4826047, 4911606, 4992254, 5068157, 5139002, 5203990, 5262809, 5315420, 5361173, 5399335, 5430245, 5454793, 5472851, 5483366, 5485940, 5481069, 5468690, 5447958, 5419047, 5383932, 5344399, 5299991, 5248914, 5190474, 5125608, 5055238, 4979207, 4897159, 4809873, 4719323, 4627673, 4536449, 4446338, 4357346, 4269059, 4181023, 4093120, 4005490, 3917990, 3829881, 3740517, 3650545, 3562152, 3477710, 3398123, 3322624, 3249968, 3179563, 3111562, 3046418, 2984610, 2926607]
53258B926607n3784m9251m4649m0508l7473l5778l4968l4350l3442l1861k9165
53247B501378k5293k1035j7499j5090j3294j1429r308p079m849k642m29J976M811
53234B380218Q011J1045J3365J4963J6264J7590J8945K0447K2534K5518K8965
53223B577865L1978L4147L5891L7672L9211L9924L9865L9804M0335M1296M2039
53212C000027M1936M0553L7761L3848K9318K4562J9971J6175J3526J1357Q578
53201C277612N214K532J087n08l974r041j3720j6634j8226j9886k2705k7074l2369
53188C122308l6937l9372m0190m1395m4037m7033m8859m9486m9953n0753n1531
53177B622762n1944n1923n1222m9611m7448m5450m3905m2531m1079l9569l8020
$$ y = [2926607, 2872823, 2823572, 2778923, 2738415, 2700942, 2665164, 2630196, 2595846, 2562404, 2530543, 2501378, 2476085, 2455050, 2437551, 2422461, 2409167, 2397738, 2388430, 2381351, 2376502, 2373860, 2373431, 2375407, 2380218, 2388229, 2399274, 2412639, 2427602, 2443866, 2461456, 2480401, 2500848, 2523382, 2548900, 2577865, 2609843, 2643990, 2679881, 2717553, 2756764, 2796688, 2836553, 2876357, 2916692, 2957988, 3000027, 3041963, 3082516, 3120277, 3154125, 3183443, 3208005, 3227976, 3244151, 3257677, 3269034, 3277612, 3282826, 3285358, 3286445, 3285937, 3281963, 3272922, 3259202, 3242568, 3224342, 3204456, 3181751, 3154677, 3122308, 3085371, 3045999, 3005809, 2964414, 2920377, 2873344, 2824485, 2774999, 2725046, 2674293, 2622762, 2570818, 2518895, 2467673, 2418062, 2370614, 2325164, 2281259, 2238728, 2197649, 2158080, 2120060]
53166B120060l6466l5166l4423l4187l4123l3901l3166l1670k9846k8670k8343
53155A760099k7627k5523k3029k1952k2249k2143k1019k0397k1315k2351k1660
53144A510834j9833j9120k0357k2097k2708k2033k0828j9691j8997j9126k0149
53133A285895k1532k2542k2907k3008k3493k4581k5783k6514k6937k7682k8574
53122A012342k8431k6652k4217k2378k0929j8907j6659j5854j7212j9299k0181
53111G81623j9605j8854j8832j8985j8213j6493j5140j5231j6094j6014j4449
53100E93713j2744j2286j2780j2990j2373j1132r364p300n888n918o784p223p010
53087D69921o828o774o396n909n857n634m118j921j152k419l893m152m038m650
$$ y = [2120060, 2083594, 2048428, 2014005, 1979818, 1945695, 1911794, 1878628, 1846958, 1817112, 1788442, 1760099, 1732472, 1706949, 1683920, 1661968, 1639719, 1617576, 1596557, 1576160, 1554845, 1532494, 1510834, 1491001, 1471881, 1451524, 1429427, 1406719, 1384686, 1363858, 1344167, 1325170, 1306044, 1285895, 1264363, 1241821, 1218914, 1195906, 1172413, 1147832, 1122049, 1095535, 1068598, 1040916, 1012342, 983911, 957259, 933042, 910664, 889735, 870828, 854169, 838315, 821103, 801804, 781623, 762018, 743164, 724332, 705347, 687134, 670641, 655501, 640270, 624176, 608162, 593713, 580969, 568683, 555903, 542913, 530540, 519408, 510044, 502744, 496856, 490938, 484154, 476931, 469921, 463093, 456319, 449923, 444014, 438157, 432523, 428405, 426484, 425332, 422913, 419020, 414868, 410830, 406180]
53073D06180n234m647l548l386m179m921n294n415m705k879j425k125m277n335
53059C48810m269k634j978k087k214k420k850k957k373j622j272j196j238j705
53045C17995k514k710j801q66j407l352n034m996l251j003L83L10n33p80J82J550
53029B92173K283K493L019L845L867K478O76N5R98K318K658J802N08n26j176j534
53013C15937j541j199q34q35j281k037l047m252n281n651n333m786m295l540k176
52998B69849o88k51j404l134l790l081k508l378m866m954l136j096m70r99j507
52983B34587j720k205l118m012m541m423l171q96Q78N00j531k718j403J355L195
52968B10777K993J541K34l09n26j240k665m045m453l905l203k831k552k066j527
$$ y = [406180, 400946, 396299, 392751, 389365, 385186, 380265, 374971, 369556, 364851, 361972, 360547, 358422, 354145, 348810, 344541, 341907, 339929, 337842, 335628, 333208, 330358, 327401, 325028, 323406, 322134, 320938, 319700, 317995, 315481, 312771, 310970, 310104, 308697, 305345, 300311, 295315, 292064, 291061, 291444, 291754, 291221, 290441, 290623, 292173, 294456, 296949, 299968, 303813, 307680, 310158, 310834, 310889, 311887, 314205, 316863, 318665, 319173, 318647, 317471, 315937, 314396, 313197, 312363, 311528, 310247, 308210, 305163, 300911, 295630, 289979, 284646, 279860, 275565, 272025, 269849, 269161, 268910, 267506, 264372, 260582, 257501, 254993, 251615, 246749, 241795, 238659, 237563, 237093, 236094, 234587, 232867, 230662, 227544, 223532, 218991, 214568, 211397, 210501, 211379, 211879, 210348, 207630, 206227, 207582, 210777, 213770, 215311, 215545, 215236, 214710, 213470, 210805, 206760, 202307, 198402, 195199, 192368, 189816, 187750, 186223]
52953A86223j126p26j38N71J162J285N59r40k278k447j535n34K5N08J247J988
52937A83844K471K764K732K111J371J451K228K192M77j648k226r66P13J463J054
52922B00031O0o62n50M8K07m8O64K995N249N156K856O28j87m62j232j981j753
52905B11019p55J00O02J236K172K989L256K944K412K225K759L676M108L640K784
52890B45167K237K004J634J087Q86J506K825M167M819M641M243M348M993N667
52876B90224O189O871P627P531N850L076N01r79j280o76L86J280J554J281P52
52861C30187j3j021j897k393k987m124n086m622k851j424j361j799j571j095j519
52846B96424k702l324k772j761j078p41n45m30j05O63J179L91j242j650K04K658
$$ y = [186223, 185097, 184371, 184233, 184804, 185966, 187251, 187810, 186870, 184592, 182145, 180610, 180076, 180101, 180609, 181856, 183844, 186315, 189079, 191811, 193922, 195293, 196744, 198972, 201164, 201641, 199993, 197767, 196801, 197514, 198977, 200031, 200091, 199429, 198879, 198927, 199134, 199086, 199750, 202745, 207994, 213150, 216006, 216634, 216447, 215985, 214753, 212772, 211019, 210264, 210364, 210966, 212202, 214374, 217363, 220619, 223563, 225975, 228200, 230959, 234635, 238743, 242383, 245167, 247404, 249408, 251042, 252129, 253015, 254521, 257346, 261513, 266332, 270973, 275216, 279564, 284557, 290224, 296413, 303284, 310911, 318442, 324292, 327368, 327869, 326890, 325610, 324934, 325320, 326600, 328154, 329435, 330187, 330174, 329153, 327256, 324863, 321876, 317752, 312666, 308044, 305193, 303769, 302408, 300609, 299038, 297943, 296424, 293722, 290398, 287626, 285865, 284787, 284046, 283501, 283071, 282966, 283629, 284808, 285199, 283957, 282307, 282511, 285169]
52830B85169L384K182N50p09j826k456j677K43J662J790J597J915K026J087k44
52815B94693q25p51p27m66P54K278K518J272J43K04O49M00n1L89J328J129p83
52798C02154k857l206j803l03J75K91J241K786L344K077Mj288j359p39J96J257
52782C01970J791J267M03N84J958L196L411L163L063K634J410J29k87j69l93q05
52766C23325n90J40N42O14J107J807J405l78j919j787o12P6M8K61J023J482R43
52749C27487k12j158j653k144l105m414n340n236m264l155k333j684j272j518
52735B89999k335k918k969l394m862o411o574n544m812m863m683l818l355m117
52721B29344n072m658k894j122j55J73o7j174k846l912l636k677k279k792l472
$$ y = [285169, 288553, 290735, 291285, 290576, 288750, 286294, 284617, 284860, 286522, 288312, 289909, 291824, 293850, 294937, 294693, 293868, 293117, 292390, 291924, 292678, 294956, 297474, 298746, 298889, 299093, 299742, 300142, 300091, 300480, 301808, 302937, 302154, 299297, 296091, 294288, 293985, 294160, 294451, 295692, 298478, 301822, 303899, 303903, 302615, 301256, 300517, 300713, 301970, 303761, 305028, 305431, 306015, 307973, 311169, 314580, 317743, 320806, 323440, 324850, 324979, 324692, 324523, 324130, 323325, 322735, 322875, 323417, 324031, 325138, 326945, 328350, 327972, 326053, 324266, 323654, 323730, 323778, 324039, 325062, 326544, 327487, 327275, 326117, 324464, 322320, 319215, 314801, 309461, 304225, 299961, 296806, 294473, 292789, 291517, 289999, 287664, 284746, 281777, 278383, 273521, 267110, 260536, 254992, 250180, 245317, 240634, 236816, 233461, 229344, 224272, 219614, 216720, 215598, 215443, 215616, 215549, 214375, 211529, 207617, 203981, 201304, 199025, 196233, 192761]
52706A92761l583l186k807k678k604k368j912j201l29J20o48k556m328m773m115
52691A55793l463l239k910k193j502j142r28r33j603k758l401l057k405j961j159
52676A23139K68J082L7j978k844k012r08o04o39m40m10q38j024m01L76M75K99
52659A13578Q25J959K587K084Q00p42k376l809m536m376l584k289m54J433K372
52644A03472J990J122P72R02P81J28p14j516k247k459j477M41J883J747N39k47
52628A05117K46J624K920L331K637J429Q23J421K561L021K230N87r96j451q6K287
52612A27701L404J948m24q63R72K748L031L093M282N625N478M103K776J410q63
52597A64421l313l918k267m51m97k102l369k980j185O35J083j43k009l299l774
$$ y = [192761, 189178, 185992, 183185, 180507, 177903, 175535, 173623, 172422, 172093, 172213, 171565, 169009, 164681, 159908, 155793, 152330, 149091, 146181, 143988, 142486, 141344, 140416, 139483, 137880, 135122, 131721, 128664, 126259, 124298, 123139, 123407, 124489, 124526, 122548, 119704, 117692, 116784, 116180, 115541, 115101, 114691, 113853, 112829, 112428, 112804, 113279, 113578, 114403, 116362, 118949, 121033, 121833, 121091, 118715, 114906, 110370, 105994, 102410, 100121, 99667, 101100, 103472, 105462, 106584, 107356, 108258, 109039, 109167, 108453, 106937, 104690, 102231, 100754, 101195, 103078, 104825, 105364, 105117, 105363, 106987, 109907, 113238, 115875, 117304, 118127, 119548, 122109, 125130, 127360, 127947, 126951, 125500, 125414, 127701, 131105, 133053, 132629, 131766, 132738, 135486, 138517, 141610, 145892, 151517, 156995, 161098, 163874, 165284, 164421, 161108, 157190, 154923, 154472, 153975, 151873, 148504, 145524, 144339, 144974, 146057, 145914, 143905, 140606, 136832]
52582A36832l866l707l158k408j720q69L73J496J857J604J152K84j103j956j207
52567A23604L33Q45L5q67j475k634m174m417k760r09m57p50m19M03P07M51L18
52550A07834L64J54k08k30J79Q00J487J809J107l42j028L9J977L267L530L146
52534A23885K107M96o50m41L45K70m89k85J529L599M176K866O15j168j395l9J643
52517A37064K254J684R66Q32J136J581K196K889L157K621J577Q68J152K188K857
52502A65022K337J279J067J859K325J756J157J480K005J772J478K269L384K986
52488A92176J115k02Q1P22L99l78l48O74J957K861L030K210O22q81j592j469q46
52471B00131j26J78j50l67N86K501L828L516K163Q95N8m12k48N86J277J117O81
$$ y = [136832, 132966, 129259, 126101, 123693, 121973, 121104, 121477, 122973, 124830, 126434, 127586, 127870, 126767, 124811, 123604, 123937, 124782, 124817, 123950, 122475, 119841, 115667, 111250, 108490, 107581, 107124, 106374, 105955, 106358, 107065, 107516, 107834, 108198, 108352, 108144, 107914, 108093, 108893, 110380, 112189, 113296, 112954, 111926, 111965, 113942, 117209, 120739, 123885, 125992, 126488, 125838, 125397, 125742, 126012, 125523, 125238, 126767, 130366, 134542, 137408, 138023, 136855, 135460, 135421, 137064, 139318, 141002, 141968, 142800, 143936, 145517, 147713, 150602, 153759, 156380, 157957, 158825, 159977, 162165, 165022, 167359, 168638, 169705, 171564, 173889, 175645, 176802, 178282, 180287, 182059, 183537, 185806, 189190, 192176, 193291, 193089, 193170, 193892, 194291, 193913, 193565, 194239, 196196, 199057, 202087, 204297, 204919, 204038, 202446, 200977, 200131, 200005, 200183, 200033, 199666, 200252, 202753, 206581, 210097, 212260, 213155, 213213, 212801, 212553, 213139, 214416, 215533, 216214]
52454B16214J064K107K457J435ro10l71l26j098k222k886k786k195j516j080j080
52438B07098j306j139l63K56k09j417k003j527j111j580j868l86K571M962N384
52423B07362M374L255K584J984R53m01j239q06L47O21n60j524l11K534M370L617
52407B27160J402k08n33l78o45j343j641p32J121K550K488J368L19k90o31l70
52391B29637Q53K184K308J392P94Q82Q21O61J603L412L640Q83k777m245l186j726
52375B37136j212j103o96j30M02J051J554J280K52p04j149j451j811j737j027
52360B30655n66j246k521k769j301O87J564J209Q62J191J462R99O29J697L992
52345B36544N686N408L682K118J780K408K805K074P87N14J599K167N10k180l103
$$ y = [216214, 217278, 219385, 221842, 223277, 223268, 222658, 222287, 221961, 220863, 218641, 215755, 212969, 210774, 209258, 208178, 207098, 205792, 204653, 204290, 204546, 204337, 202920, 200917, 199390, 198279, 196699, 194831, 194445, 197016, 201978, 207362, 211736, 214991, 217575, 219559, 220512, 220111, 218872, 218066, 218413, 219034, 218474, 216950, 216639, 219173, 223543, 227160, 228562, 228354, 227821, 227443, 226798, 225455, 223814, 223082, 224203, 226753, 229241, 230609, 230928, 230638, 230007, 229637, 230490, 232674, 234982, 236374, 237168, 238050, 238871, 239532, 241135, 244547, 248187, 249070, 246293, 242048, 238862, 237136, 235924, 234821, 234125, 233995, 234397, 235448, 237002, 238282, 238534, 237830, 236681, 235230, 233419, 231682, 230655, 230089, 228843, 226322, 223553, 222252, 222939, 224503, 225712, 226574, 227765, 229227, 230226, 230855, 232552, 236544, 242230, 247638, 251320, 253438, 255218, 257626, 260431, 262505, 263292, 263806, 265405, 267572, 268082, 265902, 262799]
52330B62799j677k5M45Q47K374M046M266L088J587J70j045j350m80L70J59k09
52314B75365O91K303K802J835P17J41l49n99L88K447L769L452K992M202O543P802
52298C14501O869M806L288K897L102L347L617M090M599M818M848N123N658N850
52284C77413N353M599M084L786L748M538O320P925P840N972L644K012J267J190
52270D39691J697K712M085N634O854O947N828M815N344P084Q281Q011P261P516
52256E21760Q955J0518J1287J1422J1867J3228J5009J6212J6653J7084J7853J8339
52244F90187J8280J8638K0189K2116K3188K3681K4651K5878K6223K5808K6088
52233I44927K7584K9148K9747K9509K8649K7030K5315K4909K5911K6512K5466
$$ y = [262799, 261122, 261097, 261542, 262389, 264763, 268809, 273075, 276163, 277750, 277920, 276875, 275525, 275045, 275415, 275574, 275365, 276056, 278359, 281161, 282996, 283713, 283854, 283505, 282906, 283294, 285741, 289510, 292962, 295954, 300156, 306699, 314501, 321370, 326176, 329464, 332361, 335463, 338810, 342427, 346517, 351116, 355934, 360782, 365905, 371563, 377413, 382766, 387365, 391449, 395235, 398983, 403521, 409841, 417766, 425606, 431578, 435222, 437234, 438501, 439691, 441388, 444100, 448185, 453819, 460673, 467620, 473448, 478263, 483607, 490691, 498972, 506983, 514244, 521760, 530715, 541233, 552520, 563942, 575809, 589037, 604046, 620258, 636911, 653995, 671848, 690187, 708467, 727105, 747294, 769410, 792598, 816279, 840930, 866808, 893031, 918839, 944927, 972511, 1001659, 1031406, 1060915, 1089564, 1116594, 1141909, 1166818, 1192729, 1219241, 1244707]
52222A244707K3814K3000K2526K0902J8160J5825J4696J4031J2911J1413J0209
52211A432194R726R700R272P692N346L623L300L558L147J978Q48J04m93q91p14
52196A488390k5P92J879L834O614R267J0948J1719J2143J2631J3373J4483J5842
52183A601890J6985J7393J6978J6259J6038J6672J7597J7904J7475J7080J7070
52172A789341J6599J4779J2091R857Q457P061N108L093J571K51j374l130m575
52159A859129n849p362q911r868j0363j1453j3711j6149j7120j6157j4402j3233
52147A714551j2937j2951j2827j2547j2215j2002j2217j2829j2923j1440q688
52136A580975o524o360p388p521n939l995l416m332n445n726n260m550l786l038
$$ y = [1244707, 1268521, 1291521, 1314047, 1334949, 1353109, 1368934, 1383630, 1397661, 1410572, 1421985, 1432194, 1441920, 1451620, 1460892, 1468584, 1473930, 1477553, 1480853, 1484411, 1487558, 1489536, 1490384, 1490488, 1489995, 1489104, 1488390, 1488365, 1489157, 1491036, 1494870, 1501484, 1510751, 1521699, 1533418, 1545561, 1558192, 1571565, 1586048, 1601890, 1618875, 1636268, 1653246, 1669505, 1685543, 1702215, 1719812, 1737716, 1755191, 1772271, 1789341, 1805940, 1820719, 1832810, 1842667, 1851124, 1858185, 1863293, 1866386, 1867957, 1868208, 1866834, 1863704, 1859129, 1853280, 1845918, 1837007, 1827139, 1816776, 1805323, 1791612, 1775463, 1758343, 1742186, 1727784, 1714551, 1701614, 1688663, 1675836, 1663289, 1651074, 1639072, 1626855, 1614026, 1601103, 1589663, 1580975, 1574451, 1568091, 1560703, 1553182, 1547243, 1543248, 1539832, 1535500, 1530055, 1524329, 1519069, 1514519, 1510733, 1507695]
52122A507695k674k896l111k461j170o11j531k825k818j584j023k404m701n888
52108A471998n328m242m047m955o129o648o190n160m387m379m691m321k986j783
52094A406752k203m383o713p364n996l746j832p24o67k101m863p361p644n567
52080A345588l205k491l054l067j847o07n28j174j469j428j883k786l010k087
52066A316952j091j208k098k497j938j032l47J04L39L38N66J580K995L699L604
52051A319966M086O136Q857J0699J1532J2544J4380J6537J8413K0086K1795K3406
52039A488437K4685K5699K6705K7902K9323L0816L2063L2831L3090L2754L1586
52028A815891K9604K7269K5015K2946K1300K0564K0506J9693J6932J2942R649
$$ y = [1507695, 1505021, 1502125, 1499014, 1496553, 1495383, 1494772, 1493241, 1490416, 1487598, 1486014, 1484991, 1482587, 1477886, 1471998, 1466670, 1462428, 1458381, 1453426, 1447297, 1440649, 1434459, 1429299, 1424912, 1420533, 1415842, 1411521, 1408535, 1406752, 1404549, 1400166, 1393453, 1386089, 1380093, 1376347, 1374515, 1373791, 1373124, 1371023, 1366160, 1358799, 1351155, 1345588, 1342383, 1339892, 1336838, 1333771, 1331924, 1331317, 1330789, 1329615, 1328146, 1326718, 1324835, 1322049, 1319039, 1316952, 1315861, 1314653, 1312555, 1310058, 1308120, 1307088, 1306741, 1306845, 1307184, 1307522, 1308088, 1309668, 1312663, 1316362, 1319966, 1324052, 1330188, 1339045, 1349744, 1361276, 1373820, 1388200, 1404737, 1423150, 1443236, 1465031, 1488437, 1513122, 1538821, 1565526, 1593428, 1622751, 1653567, 1685630, 1718461, 1751551, 1784305, 1815891, 1845495, 1872764, 1897779, 1920725, 1942025, 1962589, 1983095, 2002788, 2019720, 2032662, 2042311]
52017B042311P875O630M725K223lj503k637m099o320q999j1222j2184j1906j1047
52003A993844j0241r910j0264j1029j1402j0828r542p922n869l435j488p57n39
51990A900618O48L285O513R271J0805J0618R108P942Q434R702R887Q899Q279Q483
51976B012492Q247O992N824N433M934L705K675K507J958m37m190p613r835j0964
51962B021728j1286j1587j3183j6334j9405k0869k1171k1476k1709k1500k1932
51951A821276k4220k7140k8130k6840k5708k6590k8642l0045l0379l0557l1418
51940A511607l2990l4480l4747l3429l1671l1040l1666l2214l1622l0038k8190
51929A159520k6763k6346k6931k7479k6930k5599k4663k4412k4168k3758k3690
$$ y = [2042311, 2050186, 2056816, 2061541, 2063764, 2063761, 2062258, 2059621, 2055522, 2049202, 2040203, 2028981, 2016797, 2004891, 1993844, 1983603, 1973693, 1963429, 1952400, 1940998, 1930170, 1920628, 1912706, 1906837, 1903402, 1901914, 1901157, 1900618, 1901266, 1904551, 1911064, 1920335, 1931140, 1941758, 1950866, 1958808, 1967242, 1976944, 1986831, 1995730, 2004009, 2012492, 2020739, 2027731, 2033555, 2038988, 2043922, 2047627, 2050302, 2052809, 2054767, 2054330, 2050140, 2042527, 2032692, 2021728, 2010442, 1998855, 1985672, 1969338, 1949933, 1929064, 1907893, 1886417, 1864708, 1843208, 1821276, 1797056, 1769916, 1741786, 1714946, 1689238, 1662648, 1634006, 1603961, 1573582, 1543025, 1511607, 1478617, 1444137, 1409390, 1375961, 1344290, 1313250, 1281584, 1249370, 1217748, 1187710, 1159520, 1132757, 1106411, 1079480, 1052001, 1025071, 999472, 974809, 950397, 926229, 902471, 878781]
51918H78781k3817k3243k1900k0762k0125j9177j7757j7044j7597j8033j6857
51907F62469j4533j2592j1530j0845j0438j0622j1012j0743r782r023r002r214
51895E33133q821p506n619m042l749m995o934q311q574q038p258o601o122n568
51881D40995m730l973l984m627m788l886k870k855l472l716l856m968o658p056
51867C79556n630m279m621n621n399m240l852m194l383j018O01l56k576l575k991
51852C28422k206j703q61l6n34k184l010k069q37p99j340j349j389k411l425k628
51836C01641m20P72j54j713k267j998j698j116L21K015K570J339r67k951l375
51821B91999j900N27K374K845K293J320K39n08l23O88J571J732J500J124K25j014
$$ y = [878781, 854964, 831721, 809821, 789059, 768934, 749757, 732000, 714956, 697359, 679326, 662469, 647936, 635344, 623814, 612969, 602531, 591909, 580897, 570154, 560372, 551349, 542347, 533133, 524312, 516806, 511187, 507145, 503396, 498401, 491467, 483156, 474582, 466544, 459286, 452685, 446563, 440995, 436265, 432292, 428308, 423681, 418893, 415007, 412137, 409282, 405810, 402094, 398238, 393270, 386612, 379556, 373926, 369647, 365026, 359405, 354006, 349766, 345914, 341720, 338337, 337319, 337920, 337564, 334988, 331413, 328422, 326216, 324513, 323652, 323616, 323082, 320898, 317888, 315819, 314982, 314183, 312843, 311494, 310105, 307694, 304269, 301641, 301221, 301993, 301839, 300126, 297859, 295861, 294163, 293047, 293368, 295383, 297953, 299292, 298325, 295374, 291999, 290099, 290626, 293000, 295845, 298138, 299458, 299697, 299189, 298866, 299554, 301125, 302857, 304357, 305481, 305706, 304692]
51805C04692j211L86K174J859n20k672l157k788k561j860J21K374L099K307J906
51790C04149L020M535M784L638K166R40j77j015j026l69J1k20k84L93J110R30
51774C22585J05m06m16n58j029j263q24J28J319K515L186K800J677Q72R56J491
51758C33138J821J797J479R09M38O97J806L018L369K383J89k433m109l829k125
51743C38548n95r8j86l76q67j517j443m14L81O1l46O91K845M333M346L647K915
51726C51925J927O81J2M48J361J942K334L075L888L738K129j63j669j486L6J598
51710C71776K077J481Q45J145K278L110K575Q14q48j274p10k62k50R9J259K526
51694C86641L198L840N316P075P593O532N304N106N522N614N458N617N772M980
$$ y = [304692, 303481, 303867, 306041, 307900, 307380, 304708, 301551, 298763, 296202, 294342, 294463, 296837, 299936, 302243, 304149, 307169, 311704, 316488, 320126, 322292, 323232, 323055, 322040, 321014, 320645, 320656, 320436, 320152, 320545, 321655, 322585, 322690, 322284, 321868, 321310, 320281, 319018, 318194, 318322, 319641, 322156, 325342, 328142, 329819, 330691, 331647, 333138, 334959, 336756, 338235, 339144, 339582, 340279, 342085, 345103, 348472, 350855, 351044, 348611, 344502, 340673, 338548, 337953, 337855, 337669, 337293, 336426, 334909, 333466, 333052, 333433, 333494, 333148, 333839, 336684, 341017, 345363, 349010, 351925, 353852, 354533, 354545, 354993, 356354, 358296, 360630, 363705, 367593, 371331, 373460, 373297, 371628, 370142, 370178, 371776, 373853, 375334, 376179, 377324, 379602, 382712, 385287, 386101, 385253, 383979, 383269, 383007, 382757, 382856, 384115, 386641, 389839, 393679, 398995, 406070, 413663, 420195, 425499, 430605, 436127, 441741, 447199, 452816, 458588, 463568]
51680D63568L245J737J218J006M2j581k728k562j288K63J336J549J084M85L7o23
51664D66788j750k584k073n47M25J80j65K74N78l78j846k373k296k977l951l252
51648D44053r27K35j371l722m195l186k723k898k204o56j2p75j309m30R20J374
51632D22174R77M29j82q00m91J534M412O279O446O168P025R068J0870J1202J0239
51617D95350Q861P181M442N40l243n595o595o992o668n074k849j596j836k471
51603D73455k671l069m423o107o913o671o163n818n471n229n624o742p794p934
51589C92826p178o251n680n262m545l612l039l081l290l234l049k979k840k555
51575C36231k698l564m087k957p20N18j73j371j451o44j97m02o05n46o02j035
$$ y = [463568, 466813, 468550, 469768, 470774, 470816, 469235, 466507, 463945, 462657, 462920, 464256, 465805, 466889, 467374, 467411, 466788, 465038, 462454, 460381, 459834, 460259, 460439, 460274, 460548, 461126, 460748, 458902, 456529, 454233, 451256, 447305, 444053, 443126, 443361, 441990, 438268, 434073, 430887, 428164, 425266, 423062, 422406, 422394, 421619, 420310, 419880, 420800, 422174, 423151, 423580, 423398, 422598, 422107, 423641, 428053, 434332, 440778, 446946, 453971, 463039, 473909, 485111, 495350, 504211, 511392, 515834, 516374, 513131, 507536, 500941, 493949, 487281, 482207, 479358, 477762, 475926, 473455, 470784, 467715, 463292, 457185, 450272, 443601, 437438, 431620, 426149, 420920, 415296, 408554, 400760, 392826, 385648, 379397, 373717, 368455, 363910, 360298, 357259, 354178, 350888, 347654, 344605, 341626, 338786, 336231, 333533, 329969, 325882, 322925, 322205, 322723, 322550, 321179, 319728, 319084, 318887, 318485, 317880, 317334, 316732, 315697]
51559C15697j815k923m050m294l035r65N92J322K043L193L956L277J166j224k529
51544C10411k131m93J225K110K113J744J441J334J428J699K182L106M561N889
51530C36619O004M877M061M890O635P414O677N685N467N523N030M281M095M323
51516D11581L917K318J54j625k819l908n045n520m620k883j870k328l109k595
51502C81648p73R24J617J869K422L207L903M574N135N018M118L410L757M540M406
51487D29775L159J993J846K347K616K359J897J590J597J907K261K189J330j00
51473D56766j310j447l70J150K321L288M712O300O720N546M285M396M961L912
51459E01230J340k76L91J518P35j722l770m489m685m967m983m657m612m994m985
$$ y = [315697, 313882, 310959, 306909, 302615, 299580, 298615, 299207, 300529, 302572, 305765, 309721, 312998, 314164, 312940, 310411, 308280, 307787, 309012, 311122, 313235, 314979, 316420, 317754, 319182, 320881, 323063, 326169, 330730, 336619, 342623, 347500, 351561, 356451, 363086, 370500, 377177, 382862, 388329, 393852, 398882, 403163, 407258, 411581, 415498, 417816, 417970, 416345, 413526, 409618, 404573, 399053, 394433, 391550, 389680, 387352, 384243, 381648, 380875, 381799, 383416, 385285, 387707, 390914, 394817, 399391, 404526, 409544, 413662, 417072, 420829, 425369, 429775, 432934, 434927, 436773, 439120, 441736, 444095, 445992, 447582, 449179, 451086, 453347, 455536, 456866, 456766, 455456, 454009, 453639, 454789, 457110, 460398, 465110, 471410, 478130, 483676, 487961, 492357, 497318, 501230, 502570, 502294, 502685, 504203, 504938, 503216, 499446, 494957, 490272, 485305, 480322, 475665, 471053, 466059, 461074]
51444D61074m125l146k940l414l911m075l801k971j837j136j180j351j047o08
51430D25532o05p12k30N79P30J6n79k12R08K095L006L487L328K598J964K168L339
51413D47412M955O259O693O324N935O338P318P726O796N074L745L409L877M794
51399E26655N949P051P648P325N901L620J212n47j597k559l715m417m021k961
51385E45544k206j903j384m77Q6j45n95o16n68j166k073k058p63M37k23k835n742
51368E23313p444q079q627r151q745p312o300o854p994p824o258n149n402n523
51354D22651l841j033Q24R04pj132k124k122k23K686M280L695K711L106M105L750
51338D38230J767m08j779k387k231j363q86k160m714o550o854o860p466p740o819
$$ y = [461074, 456949, 453803, 450863, 447449, 443538, 439463, 435662, 432691, 430854, 429718, 428538, 427187, 426140, 425532, 424927, 424215, 423985, 424564, 425294, 425310, 424731, 424519, 425427, 427522, 430528, 434015, 437343, 439941, 441905, 444073, 447412, 452367, 458626, 465319, 471643, 477578, 483916, 491234, 498960, 505756, 510830, 514575, 517984, 521861, 526655, 532604, 539655, 547303, 554628, 560529, 564149, 565361, 564814, 563217, 560658, 556943, 552526, 548505, 545544, 543338, 541435, 540051, 539574, 539660, 539515, 538920, 538304, 537736, 536570, 534497, 532439, 531676, 532113, 531890, 529055, 523313, 515869, 507790, 499163, 490012, 481267, 473955, 467655, 460801, 452807, 444983, 438725, 433576, 428174, 422651, 418810, 417777, 418601, 419505, 419498, 418366, 416242, 414120, 413897, 416583, 420863, 424558, 427269, 430375, 434480, 438230, 439997, 439589, 437810, 435423, 433192, 431829, 430943, 428783, 424069, 417519, 410665, 403805, 396339, 388599, 381780]
51323C81780n690n709o438o612o289o411o777o400n690o331q689j1005j1658j0831
51309B77250r292o998l969j398n30j023j488j331j124j464k392l691m862m819
51295B32869k747N12K701K385N02q16o83j91p12k061k807k196j123q94j573k069
51279B21097j607m02R81K177K812K527J547O06O5k14mJ296L295M388L805K952
51263B45321L540N046N562M628L700L830M525N138N790O305N706L718J650P10
51249C05169L07p60k261k942k554k160k433k929l217l698m784o019o570o236n560
51234B53353n084m747m103l056k315k774m304n591n527m347k990j837q36l50q37
51219B04655j856k370k172k000k171k029j085K82J638K927L667K808K64k316l286
$$ y = [381780, 376090, 370381, 363943, 357331, 351042, 344631, 337854, 331454, 325764, 319433, 310744, 299739, 288081, 277250, 267958, 260960, 256991, 255593, 255063, 254040, 252552, 251221, 250097, 248633, 246241, 242550, 237688, 232869, 230122, 230634, 233335, 235720, 236222, 235406, 234723, 234532, 233820, 231759, 228952, 226756, 225633, 224739, 223166, 221097, 219490, 219088, 220069, 222246, 225058, 227585, 229132, 229738, 229803, 229589, 229585, 230881, 234176, 238564, 242369, 245321, 248861, 253907, 259469, 264097, 267797, 271627, 276152, 281290, 287080, 293385, 299091, 302809, 304459, 305169, 305476, 304716, 302455, 299513, 296959, 294799, 292366, 289437, 286220, 282522, 277738, 271719, 265149, 258913, 253353, 248269, 243522, 239419, 236363, 234048, 231274, 226970, 221379, 215852, 211505, 208515, 206678, 205842, 205492, 204655, 202799, 200429, 198257, 196257, 194086, 192057, 190972, 191254, 192892, 195819, 199486, 202294, 202558, 200242, 196956]
51204A96956k834k174j644p84K35N93J83k19j89q1j55j77L3M00R02J272O47j375
51186A91589l409l380j142J216J992J518P70p9r56j057O4J550K389K652K553J521
51170A97791m71j703p73Q85O75j199j702O87L718M450K905J316R22R92N47m03
51154B08637j258j555j284q86q83j100o94O49J951K021R98J27J73P75J310J682
51138B10663J958J968J645J353J422J543J100Rj117j716j795j549q90K43J399
51123B16236J994K108K253K358J710K08j089j226n91k26m01o42p78j126j693k105
51107B16990k272k467k706k752k663k615k311j372k18K70K9j58K0K4m86j130j632
51090A94551k166k628k495j714q53j63N59R78M27n78n54O58J406Q28K86R13J539
$$ y = [196956, 194122, 191948, 190304, 189520, 189755, 190348, 190531, 190312, 190123, 190042, 189887, 189710, 189743, 190143, 191045, 192317, 192964, 191589, 188180, 184800, 183658, 184874, 186866, 188384, 189154, 189075, 188119, 187062, 187126, 188676, 191065, 193717, 196270, 197791, 197320, 195617, 194844, 195729, 196404, 195205, 193503, 194190, 197908, 202358, 205263, 206579, 207501, 208493, 209040, 208637, 207379, 205824, 204540, 203654, 202771, 201671, 200977, 201626, 203577, 205598, 206596, 206723, 206896, 207671, 208981, 210663, 212621, 214589, 216234, 217587, 219009, 220552, 221652, 221661, 220544, 218828, 217033, 215484, 214594, 214837, 216236, 218230, 220338, 222591, 224949, 226659, 226867, 225778, 224552, 223961, 223735, 223334, 222692, 221914, 220788, 219095, 216990, 214718, 212251, 209545, 206793, 204130, 201515, 199204, 197832, 197614, 197884, 197913, 197755, 197775, 197799, 197313, 196183, 194551, 192385, 189757, 187262, 185548, 184695, 184532, 185091, 186069, 186496, 185918, 185364, 186022, 187428, 188256, 188542, 189455, 190994]
51073A90994Q05j63N46K252K563J302Q64K459M235M044K149K78o77j105j702k720
51057B06124l529k821k32K274K080p15l218l501k750k722k875j730J34N45j107
51042A85957k873k674n57J749K705K150J048M01L97P47J661L614N950O807N286
51027B12368K840J492J358J148O16Q46K168L243K813J171o16k051k984k878j327
51012B20207J011K786L336L051K461J584M46l34r4Q71J405R14K52P39K450M069
50996B45154M428L621K396J106k35j291j554j088n62n06p99r35n10M57J421J679
50980B52782J108L93J90K71rn58m68Q18K756M202M347L077J006o80r34J20J154
50963B69575J091M02M72J738K932K516O37p87j25K150M089M612M566N265O611
$$ y = [190994, 191799, 191636, 192182, 194434, 196997, 198299, 199163, 201622, 205857, 209901, 212050, 212328, 211651, 210546, 208844, 206124, 202595, 199774, 199542, 201816, 203896, 203181, 199963, 196462, 193712, 190990, 188115, 186385, 186519, 187064, 185957, 183084, 180410, 179853, 181602, 184307, 186457, 187505, 187906, 188303, 189050, 190711, 194325, 200275, 207082, 212368, 215208, 216700, 218058, 219206, 219822, 220668, 222836, 226079, 228892, 230063, 229447, 227396, 224412, 221534, 220207, 221218, 224004, 227340, 230391, 232852, 234436, 234882, 234548, 234454, 235325, 236730, 237644, 237896, 238635, 241085, 245154, 249582, 253203, 255599, 256705, 256470, 255179, 253625, 252537, 251975, 251469, 250670, 249735, 249225, 249682, 251103, 252782, 253890, 254283, 254473, 254744, 254735, 254177, 253709, 254527, 257283, 261485, 265832, 268909, 269915, 269235, 268301, 268421, 269575, 270666, 271068, 271540, 273278, 276210, 278726, 279363, 278576, 278451, 280601, 284690, 289302, 293868, 299133, 305744]
50948C05744P374P028O278N784N319M641M238M592N283N740O346P801R520R905
50934C95593Q545P083P219Q711J0149J1112J2398J4329J6054J6836J7133J7840
50922E43002J9011K0031K0647K1241K2203K3638K5664K8472L1892L5257L7952
50911H29010M0045M2229M5224M9165N3650N8287O3073O7979P2398P5499P7341
50900A473900P9113Q1842Q5147Q7696Q8740Q8666Q8064Q6774Q4037P9282P2567
50889B395828O4430N5444M6083L6938K8682K1450J4506P193J65n134q385j0773
50877B646427j3086j4594j4652j4211j4565j5550j6509j8214k1932k7005l1333
50866B444776l4350l7606m2214m7599n3207n9271o5148o9030p0554p1838p4388
$$ y = [305744, 313118, 320146, 326424, 332208, 337527, 342168, 346406, 350998, 356281, 362021, 368367, 376168, 385688, 395593, 404138, 411221, 418440, 427151, 437300, 448412, 460810, 475139, 491193, 508029, 525162, 543002, 562013, 582044, 602691, 623932, 646135, 669773, 695437, 723909, 755801, 791058, 829010, 869055, 911284, 956508, 1005673, 1059323, 1117610, 1180683, 1248662, 1321060, 1396559, 1473900, 1553013, 1634855, 1720002, 1807698, 1896438, 1985104, 2073168, 2159942, 2243979, 2323261, 2395828, 2460258, 2515702, 2561785, 2598723, 2627405, 2648855, 2663361, 2670554, 2670719, 2665585, 2657200, 2646427, 2633341, 2618747, 2604095, 2589884, 2575319, 2559769, 2543260, 2525046, 2503114, 2476109, 2444776, 2410426, 2372820, 2330606, 2283007, 2229800, 2170529, 2105381, 2036351, 1965797, 1893959, 1819571]
50855A819571p6601p6113p3284p0350o8100o5404o1487n6748n1647m6407m1661
50844A131769l7900l4499l0598k6570k3240k0308j7113j4401j3373j3296j2157
50833H88314r612p224n766m407k765j537o28R58K792L082K103K870O769J0904
50819H85853J1969J0787J0530J1966J3250J3673J4575J6629J8725K0070K1378
50808A049405K3437K6018K8764L1744L4683L6959L8904M1936M6787N2536N7920
50797A469093O2680O7089P1180P5323Q0674Q8070R6819J05480J13796J23017J34141
50786B487362J46396J57980J67992J76993J85456J92434J96655J98489J99494
50777D109251J99642J96351J87222J72833J55658J37085J16822R4911P2543N0743
$$ y = [1819571, 1742970, 1666857, 1593573, 1523223, 1455123, 1389719, 1328232, 1271484, 1219837, 1173430, 1131769, 1093869, 1059370, 1028772, 1002202, 978962, 958654, 941541, 927140, 913767, 900471, 888314, 878702, 871478, 865712, 861305, 858540, 857003, 856375, 857333, 860125, 863207, 865310, 868180, 874949, 885853, 897822, 908609, 919139, 931105, 944355, 958028, 972603, 989232, 1007957, 1028027, 1049405, 1072842, 1098860, 1127624, 1159368, 1194051, 1231010, 1269914, 1311850, 1358637, 1411173, 1469093, 1531773, 1598862, 1670042, 1745365, 1826039, 1914109, 2010928, 2116408, 2230204, 2353221, 2487362, 2633758, 2791738, 2959730, 3136723, 3322179, 3514613, 3711268, 3909757, 4109251, 4308893, 4505244, 4692466, 4865299, 5020957, 5158042, 5274864, 5369775, 5442318, 5493061]
50767E493061K9662R687p786k1345l0736l6614l9708m0579l9695l7437l4326l1242
50755E212942k9099k8421k9719l3964m1784n2373o4251p7023r1333j06933j22087
50744D535955j35295j46444j55733j62508j66054j66653j65014j61234j55098
50735C121922j46929j37366j26777j15362j03486r1364p8969o6772n5865m6698
50725B152334l8321k9751k1604j5389j1393q326n053j945k97r33l401o245q116
50712B001560q994j0171j2727j6255j9330k0984k1375k1326k1663k2844k4765
50701A801126k6906k8640k9243k7940k4768k1288j9303j8513j6685j2636p650
50690A567554l223R74N541R388J1502J3598J8487K5967L2765L6777L9238M2274
$$ y = [5493061, 5522723, 5532410, 5524624, 5503279, 5472543, 5435929, 5396221, 5355642, 5315947, 5278510, 5244184, 5212942, 5183843, 5155422, 5125703, 5091739, 5049955, 4997582, 4933331, 4856308, 4764975, 4658042, 4535955, 4400660, 4254216, 4098483, 3935975, 3769921, 3603268, 3438254, 3277020, 3121922, 2974993, 2837627, 2710850, 2595488, 2492002, 2400638, 2321669, 2254897, 2199032, 2152334, 2114013, 2084262, 2062658, 2047269, 2035876, 2027550, 2022497, 2020552, 2020255, 2019322, 2015921, 2009676, 2001560, 1992566, 1982395, 1969668, 1953413, 1934083, 1913099, 1891724, 1870398, 1848735, 1825891, 1801126, 1774220, 1745580, 1716337, 1688397, 1663629, 1642341, 1623038, 1604525, 1587840, 1575204, 1567554, 1564331, 1565305, 1570846, 1580234, 1591736, 1605334, 1623821, 1649788, 1682553, 1719330, 1758568, 1800842]
50678A800842M6415N1295N6803O2512O7595P2305P8098Q5236R1849R6746J01525
50667B611221J08040J15006J19181J19442J17664J15828J13921J10685J04851
50658C635839R5463Q2524O7643N2833L8329K2757N698j1168k5894l7922m7311
50647C878791n3574n6475n7001n6328n4205m9619m2849l5708k9728k5120k1884
50636C396300k0725k2125k5318k9393l5115m4157n6127o7636p5426p9748q3346
50625B857184q7422r0179q9584q5952q0876p4843o7260n8215m8722l9366k9984
50614B104781k0814j2685n727J282R662J9513K9920L9816M8314N4773N9145O2017
50602B389997O4005O5222O5328O3731N9764N3389M5918L9234L3878K8660K2757
$$ y = [1800842, 1847257, 1898552, 1955355, 2017867, 2085462, 2157767, 2235865, 2321101, 2412950, 2509696, 2611221, 2719261, 2834267, 2953448, 3072890, 3190554, 3306382, 3420303, 3530988, 3635839, 3731302, 3813826, 3881469, 3934302, 3972631, 3995388, 4001086, 3989918, 3964024, 3926102, 3878791, 3825217, 3768742, 3711741, 3655413, 3601208, 3551589, 3508740, 3473032, 3443304, 3418184, 3396300, 3375575, 3353450, 3328132, 3298739, 3263624, 3219467, 3163340, 3095704, 3020278, 2940530, 2857184, 2769762, 2679583, 2589999, 2504047, 2423171, 2348328, 2281068, 2222853, 2174131, 2134765, 2104781, 2083967, 2071282, 2065555, 2066837, 2076499, 2096012, 2125932, 2165748, 2214062, 2268835, 2327980, 2389997, 2454002, 2519224, 2584552, 2648283, 2708047, 2761436, 2807354, 2846588, 2880466, 2909126, 2931883]
50591B931883J7468J4953J5541J7210J7805J6935J5640J4946J5266J6677J9161
50580C113485K2570K6640L1129L5822M0284M3840M6055M7251M8315M9611N0297
50569C555299M9144M6002M1958L7994L4042K9512K4112J7812J0635L154l331p803
50557C838530j0463j2003j2335j0869p827m285q55K712O463R761J2122J3690J4219
50544C838860J2641Q466K905k458p669j4137k2594l2453m3192n5075o7998q0533
50532C536763r0808r7919j02111j04228j05463j06864j08220j07786j04094r7940
50522B511330r1716q6722q2004p6082o8947o1849n5735n0554m5737m0650l4827
50511A816507k8411k2359j7657j4275j1217p609l308J523O829J2429J7827K2694
$$ y = [2931883, 2949351, 2964304, 2979845, 2997055, 3014860, 3031795, 3047435, 3062381, 3077647, 3094324, 3113485, 3136055, 3162695, 3193824, 3229646, 3269930, 3313770, 3359825, 3407076, 3455391, 3505002, 3555299, 3604443, 3650445, 3692403, 3730397, 3764439, 3793951, 3818063, 3835875, 3846510, 3849664, 3846333, 3838530, 3828067, 3816064, 3803729, 3792860, 3785033, 3780748, 3779893, 3782605, 3789068, 3798829, 3810951, 3824641, 3838860, 3851501, 3859967, 3862872, 3860414, 3852745, 3838608, 3816014, 3783561, 3740369, 3685294, 3617296, 3536763, 3445955, 3348036, 3245925, 3141697, 3036234, 2929370, 2821150, 2713364, 2609270, 2511330, 2419614, 2332892, 2250888, 2174806, 2105859, 2044010, 1988275, 1937721, 1891984, 1851334, 1816507, 1788096, 1765737, 1748080, 1733805, 1722588, 1714979, 1711671, 1713194, 1720023, 1732452, 1750279, 1772973]
50499A772973K7193L1532L5496L8839M1971M5709N0273N4991N9142O2771O6455
50488B287345P0494P4673P8606Q2004Q4525Q5767Q5616Q4480Q2905Q1084P8876
50477C176375P6281P3693P1717P0995P2009P4741P8539Q2620Q6859R1595R6652
50466D052076J01188J04786J08156J12125J16551J20820J24949J29131J32493
50457E102275J33605J32286J29618J25666J18618J07110R2412P6921O1121M3347
50447F122979K2491l49k3071m4248o3314q0061r4536j06908j16878j23538j25961
50436E366606j23688j16730j05764r2346p8023o3066m6900l0008j4347j332R387
50425D703789J8249K3893K4359J9355R850m116k3289m6677p1007r3358j13023
$$ y = [1772973, 1800166, 1831698, 1867194, 1906033, 1948004, 1993713, 2043986, 2098977, 2158119, 2220890, 2287345, 2357839, 2432512, 2511118, 2593122, 2677647, 2763414, 2849030, 2933510, 3016415, 3097499, 3176375, 3252656, 3326349, 3398066, 3469061, 3541070, 3615811, 3694350, 3776970, 3863829, 3955424, 4052076, 4153264, 4258050, 4366206, 4478331, 4594882, 4715702, 4840651, 4969782, 5102275, 5235880, 5368166, 5497784, 5623450, 5742068, 5849178, 5941590, 6018511, 6079632, 6122979, 6145470, 6145121, 6122050, 6077802, 6014488, 5934427, 5839891, 5732983, 5616105, 5492567, 5366606, 5242918, 5126188, 5020424, 4928078, 4850055, 4786989, 4740089, 4710081, 4695734, 4694402, 4703789, 4722038, 4745931, 4770290, 4789645, 4799495, 4795379, 4772090, 4725413, 4654406, 4561048, 4448025]
50414D448025j30055j43495j52393j57562j60660j61852j59783j53953j45929
50405C082343j37855j30502j23144j14777j05136r4909q5284p7123p0362o4254
50395B078997n7982n1018m3332l5675k9136k3865j8734j2914p368l562j070K215
50383A796556P185J2321J5945J8404K1097K4334K7302K9548L1373L3038L4578
50372B051681L6245L8267M0278M1708M2614M3462M4248M4591M4523M4415M4264
50361B516296M3859M3489M3608M3873M3464M2462M2001M2865M4886M7737N1205
50350C005745N4432N6187N6589N7438N9961O3166O5281O5862O5322O3251N8810
50339C672044N2587M6454M1335L6235K9751K1564J2004J152j1105k4557l8761
$$ y = [4448025, 4317970, 4174475, 4022082, 3864520, 3703860, 3542008, 3382225, 3228272, 3082343, 2944488, 2813986, 2690842, 2576065, 2470929, 2376020, 2290736, 2213613, 2143251, 2078997, 2021015, 1969997, 1926665, 1890990, 1861854, 1837989, 1819255, 1806341, 1798973, 1795411, 1794341, 1796556, 1803741, 1816062, 1832007, 1850411, 1871508, 1895842, 1923144, 1952692, 1984065, 2017103, 2051681, 2087926, 2126193, 2166471, 2208179, 2250793, 2294255, 2338503, 2383094, 2427617, 2472032, 2516296, 2560155, 2603644, 2647252, 2691125, 2734589, 2777051, 2819052, 2861917, 2906803, 2954540, 3005745, 3060177, 3116364, 3172953, 3230391, 3290352, 3353518, 3418799, 3484661, 3549983, 3613234, 3672044, 3724631, 3771085, 3812420, 3848655, 3878406, 3899970, 3911974, 3913126, 3902021, 3877464, 3838703]
50328C838703n3279o7548q0780r2232j01239j07013j09072j07999j05116j01072
50318B913353r5309q7372p8023o8415n8645m8016l6511k5088j4524m942L258Q819
50306B408585J0694R259N808J051n246j3257k2428l1976m1356m9981n6952o1693
50294B152508o4498o5983o6196o4863o2225n8951n5281n1117m7081m4433m3343
50283A528537m2094l8850l3766k8610k4647k1796j9563j7759j6143j4288j2169
50272A258852j0234q597o662l910n28K880N804P831Q797R347J0787J3705J7076
50259A305148J9330K0066K0226K0621K1004K0785K0275K0766K3211K6889K9747
50248A548068L0316K9197K8163K7946K7591K6099K3777K1550J9764J8402J7838
$$ y = [3838703, 3785424, 3717876, 3637096, 3544864, 3443625, 3336612, 3227540, 3119541, 3014425, 2913353, 2818044, 2730672, 2652649, 2584234, 2525589, 2477573, 2441062, 2415974, 2401450, 2396508, 2399766, 2408585, 2419279, 2428538, 2434346, 2435397, 2430151, 2416894, 2394466, 2362490, 2321134, 2271153, 2214201, 2152508, 2088010, 2022027, 1955831, 1890968, 1828743, 1769792, 1714511, 1663394, 1616313, 1571880, 1528537, 1486443, 1447593, 1413827, 1385217, 1360570, 1338774, 1319211, 1301452, 1285309, 1271021, 1258852, 1248618, 1240021, 1233359, 1229449, 1228921, 1231801, 1237605, 1245436, 1254233, 1263580, 1274367, 1288072, 1305148, 1324478, 1344544, 1364770, 1385391, 1406395, 1427180, 1447455, 1468221, 1491432, 1518321, 1548068, 1578384, 1607581, 1635744, 1663690, 1691281, 1717380, 1741157, 1762707, 1782471, 1800873, 1818711]
50237A818711J8224J8499J7088J3674R405N268J301k402m997o034o682q867j3212
50224A859976j8272k1922k3296k3454k4239k6402k8924l0257l0097k9320k8519
50213A575274k7385k5855k4815k5029k5939k6240k5294k3322k0636j7475j4469
50202A318815j2389j1288j0468r374q058o803n726m849m008k927j796j669l340
50189A236120n793o765n336l170k472l504m874n767o595p540p682o389m756m660
50175A160817o458q450q929q102p410p399p228o291n282n050n131m335k534r23
50161A077295n23j079j566j131M35K596M243M610M062L447K856J771L51n42p53
50146A096072j080j840k425k764l823n808p351p602p821r367j1261j1629j0722
$$ y = [1818711, 1836935, 1855434, 1872522, 1886196, 1895601, 1900869, 1902170, 1899768, 1894771, 1888737, 1882055, 1873188, 1859976, 1841704, 1819782, 1796486, 1773032, 1748793, 1722391, 1693467, 1663210, 1633113, 1603793, 1575274, 1547889, 1522034, 1497219, 1472190, 1446251, 1420011, 1394717, 1371395, 1350759, 1333284, 1318815, 1306426, 1295138, 1284670, 1275296, 1267238, 1260435, 1254709, 1249860, 1245852, 1242925, 1241129, 1239460, 1236120, 1230327, 1223562, 1218226, 1215056, 1212584, 1209080, 1204206, 1198439, 1191844, 1184304, 1176622, 1170233, 1165477, 1160817, 1154359, 1145909, 1136980, 1128878, 1121468, 1114069, 1106841, 1100550, 1095268, 1090218, 1085087, 1080752, 1078218, 1077295, 1076772, 1075693, 1074127, 1072996, 1073431, 1076027, 1080270, 1084880, 1088942, 1092389, 1095245, 1097016, 1097367, 1096825, 1096072, 1094992, 1093152, 1090727, 1087963, 1084140, 1078332, 1070981, 1063379, 1055558, 1046191, 1034930, 1023301, 1012579]
50133A012579j0366j0973j1382j1478j2381j3573j2556q563m497l475m987o251
50121I02097o152n824o079o302n879n108m443l983l873m246m612m206l175k641
50107H35574l277m447n069m870m419m333m741n419o152o892p569p974q096q349
50093G53967r053r781r829r314r026q998q258o507m976m740m989m117k098n51
50079F61730n37j391j771j128L8P43K69j115k153j737O4K306M064M694L944K606
50063F70626K384M074O292P091O486O195P180Q786J0204J1343J2132J2375J2505
50050G77673J3132J3616J2595J0349R032R736J0864J0597R526R418J0346J0832
50038I07716J0225R432R298R599R730R380Q402O985O017O348P553Q170P445O220
$$ y = [1012579, 1002213, 991240, 979858, 968380, 955999, 942426, 929870, 921307, 916810, 913335, 908348, 902097, 895945, 890121, 884042, 877740, 871861, 866753, 862310, 858327, 854454, 850208, 845596, 841390, 838215, 835574, 832297, 827850, 822781, 817911, 813492, 809159, 804418, 798999, 792847, 785955, 778386, 770412, 762316, 753967, 744914, 735133, 725304, 715990, 706964, 697966, 689708, 683201, 678225, 673485, 668496, 664379, 662281, 661730, 661193, 659802, 658031, 656903, 656941, 657684, 657953, 656838, 654685, 652948, 653012, 655318, 659382, 664076, 668020, 670626, 673010, 677084, 683376, 690467, 696953, 703148, 710328, 719114, 729318, 740661, 752793, 765168, 777673, 790805, 804421, 817016, 827365, 836397, 846133, 856997, 867594, 877120, 886538, 896884, 907716, 917941, 927373, 936671, 946270, 956000, 965380, 973782, 980767, 986784, 993132, 1000685, 1008855, 1016300, 1022520]
50024A022520N753O216O699O431N694N585O962R507J2008J3611J4539J5337J5925
50011A146787J6019J6221J7724K0698K3658K5024K4840K4451K4706K5170K5193
50000A390491K5108K5762K7170K8329K8499K7988K7457K6996K6423K5926K5725
49989A685874K5392K4292K2472K0341J7801J4676J1920J1027J2043J3331J3745
49978A872914J3816J4237J4556J4490J5391J8778K3994K8892L2800L7326M3916
49967B131110N1695N8324O2308O3925O4140O3176O0157N4162M5629L6422K8375
49956B719423K2097J7326J3970J2186J1793J2168J2517J1894R200L697m622j5397
49944B826252k8166m1946n5194o6860p6801q4619q8961q9230q7360q6219q6292
$$ y = [1022520, 1028273, 1034489, 1041188, 1047619, 1053313, 1058898, 1065860, 1075367, 1087375, 1100986, 1115525, 1130862, 1146787, 1162806, 1179027, 1196751, 1217449, 1241107, 1266131, 1290971, 1315422, 1340128, 1365298, 1390491, 1415599, 1441361, 1468531, 1496860, 1525359, 1553347, 1580804, 1607800, 1634223, 1660149, 1685874, 1711266, 1735558, 1758030, 1778371, 1796172, 1810848, 1822768, 1833795, 1845838, 1859169, 1872914, 1886730, 1900967, 1915523, 1930013, 1945404, 1964182, 1988176, 2017068, 2049868, 2087194, 2131110, 2182805, 2241129, 2303437, 2367362, 2431502, 2494678, 2554835, 2608997, 2654626, 2691048, 2719423, 2741520, 2758846, 2772816, 2785002, 2796795, 2808963, 2821480, 2833374, 2842574, 2846271, 2841649, 2826252, 2798086, 2756140, 2700946, 2634086, 2557285, 2472666, 2383705, 2294475, 2207115, 2120896, 2034604]
49933B034604q5396q1883p6650p1411o6450o1098n5481n0502m6435m2602l8599
49922A358097l5026l2719l1552l0504k8800k6635k4459k1960j8587j5115j3481
49911A079259j4231j5089j3400r538o511o198p478q272q069p643p444p208o648
49898I61530n752m681l745l142k635j911j375j768k830l265k433j139j97Q06K491
49883I29954M354N425N804O408P589Q945J0235J1616J2909J3619J3782J4235J5866
49870A060741J8944K3040K7161L0072L1097L0776L0604L2086L5960M1729M7677
49859A409887N2022N4791N8006O3409P0483P7504Q3982R0794R8140J04896J10243
49848B274157J14600J18173J19577J16954J10054J00463R0128Q0397P2143O5780
$$ y = [2034604, 1949208, 1867325, 1790675, 1719264, 1652814, 1591716, 1536235, 1485733, 1439298, 1396696, 1358097, 1323071, 1290352, 1258800, 1228296, 1199496, 1172861, 1148402, 1126442, 1107855, 1092740, 1079259, 1065028, 1049939, 1036539, 1027001, 1020490, 1014292, 1006814, 998542, 990473, 982830, 975386, 968178, 961530, 955778, 951097, 947352, 944210, 941575, 939664, 938289, 936521, 933691, 930426, 927993, 926854, 926657, 927463, 929954, 934308, 939733, 945537, 951945, 959534, 968479, 978714, 990330, 1003239, 1016858, 1030640, 1044875, 1060741, 1079685, 1102725, 1129886, 1159958, 1191055, 1221831, 1252435, 1284521, 1320481, 1362210, 1409887, 1461909, 1516700, 1574706, 1638115, 1708598, 1786102, 1870084, 1960878, 2059018, 2163914, 2274157, 2388757, 2506930, 2626507, 2743461, 2853515, 2953978, 3044106, 3124503, 3196646, 3262426]
49838C262426O0846N6213N1240M6410M2431L8797L3708K5573J4301Q43j4157l0651
$$ y = [3262426, 3323272, 3379485, 3430725, 3477135, 3519566, 3558363, 3592071, 3617644, 3631945, 3632788, 3618631, 3587980]
$$ [...]
##END NTUPLES=NMR SPECTRUM
##END=
