
##TITLE=UV0000_Referencia_6274410_kYPeEmP82W
##JCAMPDX= 6.0         $$ Bruker NMR JCAMP-DX V2.0
##DATA TYPE= NMR SPECTRUM
##DATA CLASS= NTUPLES
##ORIGIN= BRUKER
##OWNER= Administrator
$$ 1.72 TOPSPIN		Version 2.1
$$ 2012-06-02 18:41:33.125 -0500  Administrator@TOPSPIN
$$ Compression mode = diff/dup
##.OBSERVE FREQUENCY= 400.13188235
##.OBSERVE NUCLEUS= ^1H
##.ACQUISITION MODE= SIMULTANEOUS (DQD)
##.ACQUISITION SCHEME= undefined
##.AVERAGES= 64
##.DIGITISER RES= 22
##SPECTROMETER/DATA SYSTEM= spect
##.PULSE SEQUENCE= noesygpps1d.comp
##.SOLVENT NAME= COFFEE_meoh
##.SHIFT REFERENCE= INTERNAL, COFFEE_meoh, 1, 15.02031
##AUDIT TRAIL= $$ (NUMBER, WHEN, WHO, WHERE, PROCESS, VERSION, WHAT)
$$ ##TITLE= Audit trail, TOPSPIN		Version 2.1
$$ ##JCAMPDX= 5.01
$$ ##ORIGIN= Bruker BioSpin GmbH
$$ ##OWNER= Administrator
$$ $$ C:\Bruker\TOPSPIN/data/COFFEE/nmr/UV0000_Referencia_6274410_kYPeEmP82W/12/pdata/1/auditp.txt
$$ ##AUDIT TRAIL=  $$ (NUMBER, WHEN, WHO, WHERE, PROCESS, VERSION, WHAT)
(   1,<2012-06-02 18:41:26.312 -0500>,<Administrator>,<TOPSPIN>,<go>,<TOPSPIN 2.1>,
      <created by zg
	started at 2012-06-02 18:29:55.453 -0500,
	POWCHK enabled, PULCHK disabled,
       configuration hash MD5:
       D5 CA 7A 23 FE 6B EE E2 50 67 74 61 24 F7 5E 3B
       data hash MD5: 64K
       65 87 CF F4 7F 09 D3 6E 34 36 36 E2 B4 8F 38 46>)
(   2,<2012-06-02 18:41:29.640 -0500>,<Administrator>,<TOPSPIN>,<proc1d>,<TOPSPIN 2.1>,
      <Start of raw data processing
       efp LB = 0.3 FT_mod = 6 PKNL = 1 PHC0 = 0 PHC1 = 0 SI = 128K 
       data hash MD5: 128K
       AC CC 2C 2E 38 45 6A CB 96 D0 5E 18 08 7F 46 A2>)
(   3,<2012-06-02 18:41:31.015 -0500>,<Administrator>,<TOPSPIN>,<proc1d>,<TOPSPIN 2.1>,
      <pk PHC0 = 43.46191 PHC1 = 0 
       data hash MD5: 128K
       CA FE 5B FF 21 03 3A 9F 99 4A EA 6D E8 14 AA 92>)
(   4,<2012-06-02 18:41:32.328 -0500>,<Administrator>,<TOPSPIN>,<proc1d>,<TOPSPIN 2.1>,
      <abs ABSG = 1 
       data hash MD5: 128K
       15 28 AE 46 DD CE FA 99 25 91 BE 4C 90 25 2D EE>)
(   5,<2012-06-02 18:41:32.484 -0500>,<Administrator>,<TOPSPIN>,<proc1d>,<TOPSPIN 2.1>,
      <abs ABSG = 2 
       data hash MD5: 128K
       A9 98 49 D5 3E 94 68 87 2D E9 A3 66 D3 F2 CB C7>)
(   6,<2012-06-02 18:41:32.640 -0500>,<Administrator>,<TOPSPIN>,<proc1d>,<TOPSPIN 2.1>,
      <abs ABSG = 3 
       data hash MD5: 128K
       22 EC 5D F1 F1 46 74 DF 7D B6 0C 18 DF 12 AF D6>)
(   7,<2012-06-02 18:41:32.796 -0500>,<Administrator>,<TOPSPIN>,<proc1d>,<TOPSPIN 2.1>,
      <abs ABSG = 4 
       data hash MD5: 128K
       96 79 DE BF 9C C6 5D 7E B5 FA 6E 2A 85 98 13 38>)
(   8,<2012-06-02 18:41:32.937 -0500>,<Administrator>,<TOPSPIN>,<proc1d>,<TOPSPIN 2.1>,
      <abs ABSG = 5 
       data hash MD5: 128K
       BF A3 07 36 A3 12 D0 87 7B A0 4C 3A D1 23 17 7D>)
$$ ##END=
$$ 
$$ $$ hash MD5
$$ $$ 80 DD A5 89 5A 3E 9D 00 D4 52 68 82 F4 2A DF 26
##$RELAX= 
##$RELAX= 
##$RELAX= 
##$RELAX= 
##$RELAX= 
##$RELAX= 
##$RELAX= 
##$RELAX= 
$$ Bruker specific parameters
$$ [...]
##$TP07= 0
##$TPNAME0= <>
##$TPNAME1= <>
##$TPNAME2= <>
##$TPNAME3= <>
##$TPNAME4= <>
##$TPNAME5= <>
##$TPNAME6= <>
##$TPNAME7= <>
##$TPOAL= (0..7)
0.5 0.5 0.5 0.5 0.5 0.5 0.5 0.5
##$TPOFFS= (0..7)
0 0 0 0 0 0 0 0
##$TUNHIN= 0
##$TUNHOUT= 0
##$TUNXOUT= 0
##$USERA1= <user>
##$USERA2= <user>
##$USERA3= <user>
##$USERA4= <user>
##$USERA5= <user>
##$V9= 5
##$VALIST= <valist>
##$VCLIST= <CCCCCCCCCCCCCCC>
##$VD= 0
##$VDLIST= <DDDDDDDDDDDDDDD>
##$VPLIST= <PPPPPPPPPPPPPPP>
##$VTLIST= <TTTTTTTTTTTTTTT>
##$WBST= 2048
##$WBSW= 25
##$XGAIN= (0..3)
0 0 0 0
##$XL= 0
##$YL= 0
##$YMAX_a= 60384280
##$YMIN_a= -50479284
##$ZGOPTNS= <>
##$ZL1= 120
##$ZL2= 120
##$ZL3= 120
##$ZL4= 120
##$ABSF1= 15.02031
##$ABSF2= -5.532222
##$ABSG= 5
##$ABSL= 3
##$ALPHA= 0
##$AQORDER= 0
##$ASSFAC= 0
##$ASSFACI= 0
##$ASSFACX= 0
##$ASSWID= 0
##$AUNMP= <proc_prof1d_extract.lims>
##$AXLEFT= 0
##$AXNAME= <>
##$AXNUC= <1H>
##$AXRIGHT= 0
##$AXTYPE= 0
##$AXUNIT= <>
##$AZFE= 0.1
##$AZFW= 0.1
##$BCFW= 0
##$BC_mod= 0
##$BYTORDP= 0
##$COROFFS= 0
##$CY= 15
##$DATMOD= 1
##$DC= 0
##$DFILT= <>
##$DTYPP= 0
##$F1P= 0
##$F2P= 0
##$FCOR= 0.5
##$FTSIZE= 131072
##$FT_mod= 6
##$GAMMA= 0
##$GB= 0
##$INTBC= 1
##$INTSCL= 1
##$ISEN= 128
##$LB= 0.3
##$LEV0= 0
##$LPBIN= 0
##$MAXI= 10000
##$MC2= 0
##$MEAN= 0
##$ME_mod= 0
##$MI= 0
##$NCOEF= 0
##$NC_proc= 2
##$NLEV= 6
##$NOISF1= 0
##$NOISF2= 0
##$NSP= 0
##$NTH_PI= 0
##$NZP= 0
##$OFFSET= 15.02031
##$PC= 1
##$PHC0= 43.46191
##$PHC1= 0
##$PH_mod= 1
##$PKNL= yes
##$PPARMOD= 0
##$PPDIAG= 0
##$PPIPTYP= 0
##$PPMPNUM= 2147483647
##$PPRESOL= 1
##$PSCAL= 4
##$PSIGN= 0
##$PYNMP= <proc.py>
##$REVERSE= no
##$SF= 400.129984117149
##$SI= 131072
##$SIGF1= 0
##$SIGF2= 0
##$SINO= 400
##$SIOLD= 131072
##$SPECTYP= <>
##$SREGLST= <1H.CDCl3>
##$SSB= 0
##$STSI= 131072
##$STSR= 0
##$SW_p= 8223.68421052632
##$SYMM= 0
##$S_DEV= 0
##$TDeff= 65536
##$TDoff= 0
##$TI= <>
##$TILT= no
##$TM1= 0
##$TM2= 0
##$TOPLEV= 0
##$USERP1= <user>
##$USERP2= <user>
##$USERP3= <user>
##$USERP4= <user>
##$USERP5= <user>
##$WDW= 1
##$XDIM= 131072
##$YMAX_p= 375644356
##$YMIN_p= -7099516
##$CURPLOT= <Network HP LaserJet P1505>
##$CURPRIN= <$Network HP LaserJet P1505>
##$DFORMAT= <normdp>
##$LAYOUT= <+/1D_H.xwp>
##$LFORMAT= <normlp>
##$PFORMAT= <normpl>
##$SURQMSG= 1
$$ End of Bruker specific parameters
$$ ---------------------------------
##NTUPLES= NMR SPECTRUM
##VAR_NAME=  FREQUENCY,     SPECTRUM/REAL,   SPECTRUM/IMAG
##SYMBOL=    X,             R,               I
##VAR_TYPE=  INDEPENDENT,   DEPENDENT,       DEPENDENT
##VAR_FORM=  AFFN,          ASDF,            ASDF
##VAR_DIM=   131072,        131072,          131072
##UNITS=     HZ,            ARBITRARY UNITS, ARBITRARY UNITS
##FACTOR=    0.0627417313425165, 1,          1
##FIRST=     8223.62146879498, -1715,        -5112
##LAST=      0,             5674,            -5187
##MIN=       0,             -7099516,        0
##MAX=       8223.62146879498, 375644356,    0
$$ Real data points
##PAGE= N=1
##DATA TABLE= (X++(R..R)), XYDATA
$$ [...]
62069a72813o66o11n36n07n33n60n59n59n59n32m92m92n32n67n79n84n86n64n40
62050a83371n32n23m85m55m72m96m68m04l74l71l50l07k91k90k63k27k50l17l53
62031a90599l43l34l38l24k93k83k76k22j43j06j09r3n0j5J4R6K08K72K74K98
62011a92366L63L93L37K21O7j52m17o38p60q15q54q68q61q60q66q47q13q04q13
61992b01353p81p10o70o73o62o20o01o26o34n87n19m65m12l64l61m05m41m49m57
61973b11790m66m40l83l51l64l75l62l63l87l78l34l24l73m11l76l10k86l08l34
61954b18715l54l47k97k35k19k57k89k87k89l20l43l28l01k89k70k47k64l30l74
61935b24355l37k59k11k21k73l34l64l35k88k79l05l07k64k20j94j76j86k74l93
$$ plain form
62069 -172813 -173479 -174090 -174626 -175133 -175666 -176226 -176785 -177344 -177903 -178435 -178927 -179419 -179951 -180518 -181097 -181681 -182267 -182831 -183371
62050 -183371 -183903 -184426 -184911 -185366 -185838 -186334 -186802 -187206 -187580 -187951 -188301 -188608 -188899 -189189 -189452 -189679 -189929 -190246 -190599
62031 -190599 -190942 -191276 -191614 -191938 -192231 -192514 -192790 -193012 -193155 -193261 -193370 -193463 -193513 -193528 -193514 -193418 -193210 -192938 -192664 -192366
62011 -192366 -192003 -191610 -191273 -191052 -190985 -191137 -191554 -192192 -192952 -193767 -194621 -195489 -196350 -197210 -198076 -198923 -199736 -200540 -201353
61992 -201353 -202134 -202844 -203514 -204187 -204849 -205469 -206070 -206696 -207330 -207917 -208436 -208901 -209313 -209677 -210038 -210443 -210884 -211333 -211790
61973 -211790 -212256 -212696 -213079 -213430 -213794 -214169 -214531 -214894 -215281 -215659 -215993 -216317 -216690 -217101 -217477 -217787 -218073 -218381 -218715
61954 -218715 -219069 -219416 -219713 -219948 -220167 -220424 -220713 -221000 -221289 -221609 -221952 -222280 -222581 -222870 -223140 -223387 -223651 -223981 -224355
61935 -224355 -224692 -224951 -225162 -225383 -225656 -225990 -226354 -226689 -226977 -227256 -227561 -227868 -228132 -228352 -228546 -228722 -228908 -229182 -229575
61916b29575m37l75l09k96k95k61k38k75l33l43l23l12l00k60k24k30k68k84k66
61897b35204k34k12k06k12k16j99j93k24k61k36j59j17j56k26k67k67k34j60q4
61878b39067q0j53k24k37k35k55k70k70k77l11l15k65k16k07k11j87j60j59j68
61859b43267j54j32j20r6o6o1q9r3m7%j9r0j67k45l14l56l56l48l51l53l56l73
61837b47453l95l77l33l16l48l76l69l61l58l36k91k72k95l05k86k78k96k84k45
61818b53574k37k86l21k99k80k97k94k33j94k47l17l06k37k06k23k33k32k42k58
61799b58516k54k50k85l20k97k42k14k16k13j99j95j87j52j05q1r0j08j50k02
61780b62276k24j88j32j06j06j15j40j92k35k52k61k77k65k24j96k07k14j83j51
$$ plain form
61916 -229575 -230012 -230387 -230696 -230992 -231287 -231548 -231786 -232061 -232394 -232737 -233060 -233372 -233672 -233932 -234156 -234386 -234654 -234938 -235204
61897 -235204 -235438 -235650 -235856 -236068 -236284 -236483 -236676 -236900 -237161 -237397 -237556 -237673 -237829 -238055 -238322 -238589 -238823 -238983 -239067
61878 -239067 -239147 -239300 -239524 -239761 -239996 -240251 -240521 -240791 -241068 -241379 -241694 -241959 -242175 -242382 -242593 -242780 -242940 -243099 -243267
61859 -243267 -243421 -243553 -243673 -243769 -243835 -243896 -243985 -244078 -244125 -244125 -244144 -244234 -244401 -244646 -244960 -245316 -245672 -246020 -246371 -246724 -247080 -247453
61837 -247453 -247848 -248225 -248558 -248874 -249222 -249598 -249967 -250328 -250686 -251022 -251313 -251585 -251880 -252185 -252471 -252749 -253045 -253329 -253574
61818 -253574 -253811 -254097 -254418 -254717 -254997 -255294 -255588 -255821 -256015 -256262 -256579 -256885 -257122 -257328 -257551 -257784 -258016 -258258 -258516
61799 -258516 -258770 -259020 -259305 -259625 -259922 -260164 -260378 -260594 -260807 -261006 -261201 -261388 -261540 -261645 -261726 -261816 -261924 -262074 -262276
61780 -262276 -262500 -262688 -262820 -262926 -263032 -263147 -263287 -263479 -263714 -263966 -264227 -264504 -264769 -264993 -265189 -265396 -265610 -265793 -265944
61761b65944j51j58j35j12j17j09o5k4l2m5j8K7M4O9J35J92J89J54J68K36L24
61740b65372M25N50O72P65Q72J040J247J455J682J956K252K554K909L367L894
61725b39732M445N029N632O078O145N765N028M057K956J875R76L27j24m13n30
61710a92486m71k84j3L37P54J214J680K079K304K276J996J523Q92J85m55q97j120
61693a80486j185j147j043r39r18r94j124j273j427j561j649j677j633j506j341
61678a99903j223j162j077q97o71m67k63j1K71N37P99J101J444J808K232K752
61662a94730L335L949M612N338O028O519O698O536O030N228M284L336K417J466
61648a28954M66n66j626k730l834m859n723o375o768o911o870o703o427o060n693
$$ plain form
61761 -265944 -266095 -266253 -266388 -266500 -266617 -266726 -266791 -266815 -266847 -266892 -266910 -266883 -266839 -266770 -266635 -266443 -266254 -266100 -265932 -265696 -265372
61740 -265372 -264947 -264397 -263725 -262960 -262088 -261048 -259801 -258346 -256664 -254708 -252456 -249902 -246993 -243626 -239732
61725 -239732 -235287 -230258 -224626 -218548 -212403 -206638 -201610 -197553 -194597 -192722 -191746 -191419 -191543 -191956 -192486
61710 -192486 -192957 -193241 -193254 -192917 -192163 -190949 -189269 -187190 -184886 -182610 -180614 -179091 -178199 -178014 -178469 -179366 -180486
61693 -180486 -181671 -182818 -183861 -184800 -185718 -186712 -187836 -189109 -190536 -192097 -193746 -195423 -197056 -198562 -199903
61678 -199903 -201126 -202288 -203365 -204262 -204933 -205400 -205663 -205674 -205403 -204866 -204067 -202966 -201522 -199714 -197482 -194730
61662 -194730 -191395 -187446 -182834 -177496 -171468 -164949 -158251 -151715 -145685 -140457 -136173 -132837 -130420 -128954
61648 -128954 -128488 -129054 -130680 -133410 -137244 -142103 -147826 -154201 -160969 -167880 -174750 -181453 -187880 -193940 -199633
61633a99633n359n000m592m221l956l729l444l125k866k676k508k347k212k051
61619b47719j830j604j453j340j185r77p58m98j56K01M58O04P08P39O06L01q6
61602b53989m99r39j344j626j784j899j989j992j917j843j807j757j680j618j554
61587b78237j421j231j081j027j007r65r25r12q82p92o58n22m10l36k86k43k20
61570b91155k78m36o01o75o78p16p97q50q53q52q52q16p48o90o63o31o03o06o14
61551c04114n77n20n02n15n07m86m96m94m13k80k09k11k00j49j21j23q9j7J2j0
61531c10021lP6J45J52J46J87K57L42M57N84O41O09N84O39P44Q47R36J019J087
61512c00572J150J246J350J427J495J620J798J959K107K333K647K943L158L356
$$ plain form
61633 -199633 -204992 -209992 -214584 -218805 -222761 -226490 -229934 -233059 -235925 -238601 -241109 -243456 -245668 -247719
61619 -247719 -249549 -251153 -252606 -253946 -255131 -256108 -256866 -257364 -257520 -257319 -256861 -256257 -255549 -254810 -254204 -253903 -253989
61602 -253989 -254488 -255427 -256771 -258397 -260181 -262080 -264069 -266061 -267978 -269821 -271628 -273385 -275065 -276683 -278237
61587 -278237 -279658 -280889 -281970 -282997 -284004 -284969 -285894 -286806 -287688 -288480 -289138 -289660 -290070 -290406 -290692 -290935 -291155
61570 -291155 -291433 -291869 -292470 -293145 -293823 -294539 -295336 -296186 -297039 -297891 -298743 -299559 -300307 -300997 -301660 -302291 -302894 -303500 -304114
61551 -304114 -304691 -305211 -305713 -306228 -306735 -307221 -307717 -308211 -308624 -308904 -309113 -309324 -309524 -309673 -309794 -309917 -310006 -310023 -310011 -310021
61531 -310021 -310024 -309948 -309803 -309651 -309505 -309318 -309061 -308719 -308262 -307678 -307037 -306428 -305844 -305205 -304461 -303614 -302678 -301659 -300572
61512 -300572 -299422 -298176 -296826 -295399 -293904 -292284 -290486 -288527 -286420 -284087 -281440 -278497 -275339 -271983
61498b71983L629L956M290M632N009N418N848O328O870P441Q013Q588R165R719
61484a83077J0264J0848J1462J2061J2652J3326J4125J5034J6062J7275J8707
61473c1261a0911A1307K4388K6837K9496L2322L5314L8399M1327M3802M5544M6266
61461C75002M5681M3622M0134L5382K9613K3164J6451R830L538k239p357j1766
61449F01055j5520j8666k1232k3280k4917k6200k7130k7758k8184k8423k8382
61438C31363k8030k7461k6767k5942k4970k3922k2867k1800k0689j9569j8474
61427G0872j7404j6364j5390G225f392j2797j2062j1420j0790j0134r508q958
61415h2061q465p996p571p189o825o458o128n840n535n207m911m666m418m130
$$ plain form
61498 -271983 -268354 -264398 -260108 -255476 -250467 -245049 -239201 -232873 -226003 -218562 -210549 -201961 -192796 -183077
61484 -183077 -172813 -161965 -150503 -138442 -125790 -112464 -98339 -83305 -67243 -49968 -31261
61473 -31261 -10911 11307 35695 62532 92028 124350 159664 198063 239390 283192 328736 375002
61461 375002 420683 464305 504439 539821 569434 592598 609049 618879 622417 620178 612821 601055
61449 601055 585535 566869 545637 522357 497440 471240 444110 416352 388168 359745 331363
61438 331363 303333 275872 249105 223163 198193 174271 151404 129604 108915 89346 70872
61427 70872 53468 37104 21714 7225 -6392 -19189 -31251 -42671 -53461 -63595 -73103 -82061
61415 -82061 -90526 -98522 -106093 -113282 -120107 -126565 -132693 -138533 -144068 -149275 -154186 -158852 -163270 -167400
61401a67400l824l522l219k937k712k499k227j910j657j468j228q93n64k99l4
61386a96393K88O14R11J262J738K258K703L035L253L323L266L209L256L402L628
61371a60247L982M463M971N444N965O624P359Q079Q814R634J0541J1502J2569
61358f0300J3795J5168a4683C612K0140K2113K4181K6424K8909L1572L4328L7179
61346B28458M0187M3299M6402M9451N2440N5322N8036O0606O3057O5300O7148
61335H29706O8405O8845O8199O6237O2879N8195N2362M5716L8726L1768K4979
61324A416017J8342J1865N580n35o490j2213j7614k2657k7276l1275l4432l6692
61312A262620l8125l8790l8750l8181l7359l6537l5921l5660l5814l6284l6943
$$ plain form
61401 -167400 -171224 -174746 -177965 -180902 -183614 -186113 -188340 -190250 -191907 -193375 -194603 -195496 -196060 -196359 -196393
61386 -196393 -196105 -195491 -194580 -193318 -191580 -189322 -186619 -183584 -180331 -177008 -173742 -170533 -167277 -163875 -160247
61371 -160247 -156265 -151802 -146831 -141387 -135422 -128798 -121439 -113360 -104546 -94912 -84371 -72869 -60300
61358 -60300 -46505 -31337 -14683 3612 23752 45865 70046 96470 125379 156951 191279 228458
61346 228458 268645 311944 358346 407797 460237 515559 573595 634201 697258 762558 829706
61335 829706 898111 966956 1035155 1101392 1164271 1222466 1274828 1320544 1359270 1391038 1416017
61324 1416017 1434359 1446224 1451804 1451269 1444779 1432566 1414952 1392295 1365019 1333744 1299312 1262620
61312 1262620 1224495 1185705 1146955 1108774 1071415 1034878 998957 963297 927483 891199 854256
61301H54256l7712l8504l9147l9471l9450l9141l8552l7666l6531l5214l3738
61290D39130l2118l0460k8872k7343k5806k4294k2891k1610k0389j9208j8107
61279A68032j7093j6139j5245j4416j3629j2860j2146j1503j0887j0246r636r135
61267A5097F386a882p809p360o935o500o082n725n406n066m706m388m138l943
61253f9940l796l682l549l385l232l104k944k710k465k280k104j859j557j269
61239a07876r99p24m69k49%L48P42J115J480J888K304K684L091L602M184M747
61223h4132N316N966O689P400Q121Q931R854J0837i107D049J4596J6136J7762
61210E2543J9533K1463K3502K5611K7747K9794L1644L3304L4827L6207L7347L8180
$$ plain form
61301 854256 816544 778040 738893 699422 659972 620831 582279 544613 508082 472868 439130
61290 439130 407012 376552 347680 320337 294531 270237 247346 225736 205347 186139 168032
61279 168032 150939 134800 119555 105139 91510 78650 66504 55001 44114 33868 24232 15097
61267 15097 6386 -1882 -9691 -17051 -23986 -30486 -36568 -42293 -47699 -52765 -57471 -61859 -65997 -69940
61253 -69940 -73736 -77418 -80967 -84352 -87584 -90688 -93632 -96342 -98807 -101087 -103191 -105050 -106607 -107876
61239 -107876 -108875 -109599 -110068 -110317 -110317 -109969 -109227 -108112 -106632 -104744 -102440 -99756 -96665 -93063 -88879 -84132
61223 -84132 -78816 -72850 -66161 -58761 -50640 -41709 -31855 -21018 -9107 4049 18645 34781 52543
61210 52543 72076 93539 117041 142652 170399 200193 231837 265141 299968 336175 373522 411702
61198D11702L8652L8602L7806L6070L3265K9250K3981J7635J0588L255l966j0669
61186F66171j6545k1463k5409k8339l0242l1262l1627l1472l0845k9855k8648
61175C60464k7278k5729k4065k2404k0793j9215j7724j6427j5347j4401j3587
61164A43494j2967j2553j2283j2126j2083j2082j2006j1840j1662j1476A1199
61152C27a0168j0105r651r186q792q441q001p471o964o546o150n741n353m972
61138a07541m536m054l622l238k799k270j760j336r07l74K39Q46J415J929K313
61123a25695K472K344J918J232L99m27j163j783k232k446k461k354k162j824j356
61108a35538q42l28K20P86J286J645J824J755J349O40k44j212k236l226m038m608
$$ plain form
61198 411702 450354 488956 526762 562832 596097 625347 649328 666963 677551 680806 676840 666171
61186 666171 649626 628163 602754 574415 544173 512911 481284 449812 418967 389112 360464
61175 360464 333186 307457 283392 260988 240195 220980 203256 186829 171482 157081 143494
61164 143494 130527 117974 105691 93565 81482 69400 57394 45554 33892 22416 11199
61152 327 -10168 -20273 -29924 -39110 -47902 -56343 -64344 -71815 -78779 -85325 -91475 -97216 -102569 -107541
61138 -107541 -112077 -116131 -119753 -122991 -125790 -128060 -129820 -131156 -132063 -132437 -132198 -131352 -129937 -128008 -125695
61123 -125695 -123223 -120879 -118961 -117729 -117330 -117757 -118920 -120703 -122935 -125381 -127842 -130196 -132358 -134182 -135538
61108 -135538 -136380 -136708 -136488 -135702 -134416 -132771 -130947 -129192 -127843 -127203 -127447 -128659 -130895 -134121 -138159 -142767
61092a42767n004n269n375n350n287n226n099m877m638m420m187l911l639l392
61078b08441l132k867k664k512k325k066j818j645j510j365j228j095r09o72m61
61063b34710l09j54M3K08K71K32J08j08l76o22q21j001j149j198j175j170j226
61046b43157j266j252j230j218j151j031r57r77j038j081j127j179j184j135j121
61031b60104j174j219j206j181j162j098r91r42r84j022r75r01q67q41p93p57
61015b76217p55p28o41n65n56n71n57n42n52n42m92m46m47m39l99l68l68l47k84
60996b85816k50k89l13k36j05j0M8J00J55K00K49L02L35L64M41N66O73P72R17
60977b81897J088J178J148J069R72P99N72M24M07M07L54L36M21N35O14P43R79
$$ plain form
61092 -142767 -147771 -153040 -158415 -163765 -169052 -174278 -179377 -184254 -188892 -193312 -197499 -201410 -205049 -208441
61078 -208441 -211573 -214440 -217104 -219616 -221941 -224007 -225825 -227470 -228980 -230345 -231573 -232668 -233577 -234249 -234710
61063 -234710 -235019 -235173 -235130 -234922 -234651 -234419 -234311 -234419 -234795 -235417 -236238 -237239 -238388 -239586 -240761 -241931 -243157
61046 -243157 -244423 -245675 -246905 -248123 -249274 -250305 -251262 -252239 -253277 -254358 -255485 -256664 -257848 -258983 -260104
61031 -260104 -261278 -262497 -263703 -264884 -266046 -267144 -268135 -269077 -270061 -271083 -272058 -272959 -273826 -274667 -275460 -276217
61015 -276217 -276972 -277700 -278341 -278906 -279462 -280033 -280590 -281132 -281684 -282226 -282718 -283164 -283611 -284050 -284449 -284817 -285185 -285532 -285816
60996 -285816 -286066 -286355 -286668 -286904 -287009 -287019 -286971 -286871 -286716 -286516 -286267 -285965 -285630 -285266 -284825 -284259 -283586 -282814 -281897
60977 -281897 -280809 -279631 -278483 -277414 -276442 -275643 -275071 -274647 -274240 -273833 -273479 -273143 -272722 -272187 -271573 -270830 -269851
60960b69851J220J354J430J541J644J657J591J511J358J080P39M46K03l4k31l33
60944b54675l82m30m40l55k02l2K08N48R05J173J369J539J645J626J551J526J510
60927b42916J401J196R72P44M50Q3l01o51r58j199j367j491j553j477j255r84
60911b49306p25m09L0M94Q64J172J511J837K022K039J931J686J276P65K63k21
60895b34771p43j269j680j943k102k165k100j920j676j382j017o03j89K08N91
60880b52761R23J175J361J474J465J349J239J217J181J006P07L86L7m08r30j420
60864b41999j843k231k573k807k923k958k919k792k598k387k168j924j663j409
60850b75194j170j007j015j192j415j605j834k164k499k705k803k893k969k973
$$ plain form
60960 -269851 -268631 -267277 -265847 -264306 -262662 -261005 -259414 -257903 -256545 -255465 -254726 -254280 -254077 -254111 -254342 -254675
60944 -254675 -255057 -255487 -255927 -256282 -256484 -256516 -256308 -255760 -254855 -253682 -252313 -250774 -249129 -247503 -245952 -244426 -242916
60927 -242916 -241515 -240319 -239347 -238603 -238153 -238070 -238371 -239022 -239980 -241179 -242546 -244037 -245590 -247067 -248322 -249306
60911 -249306 -250031 -250440 -250410 -249916 -249052 -247880 -246369 -244532 -242510 -240471 -238540 -236854 -235578 -234813 -234550 -234771
60895 -234771 -235514 -236783 -238463 -240406 -242508 -244673 -246773 -248693 -250369 -251751 -252768 -253371 -253560 -253352 -252761
60880 -252761 -251838 -250663 -249302 -247828 -246363 -245014 -243775 -242558 -241377 -240371 -239664 -239278 -239241 -239649 -240579 -241999
60864 -241999 -243842 -246073 -248646 -251453 -254376 -257334 -260253 -263045 -265643 -268030 -270198 -272122 -273785 -275194
60850 -275194 -276364 -277371 -278386 -279578 -280993 -282598 -284432 -286596 -289095 -291800 -294603 -297496 -300465 -303438
60836c03438k915k866k823k736k622k534k460k357k260k191k098j931j765j679
60822c36675j633j534j416j354j324j250j162j135j135j081r96r52r28q57p84
60807c54216q01q55q53q24q74r69r62q57p91q32q85q81q51q19p60o93o88p17o93
60788c69821o11n54n31m77l93l65l98l90k89j55n4L5J13J60J94K68L74M46M72
60769c71976N14N60N37M25K85J64N4m8j25j90k51k71k21j51j26j20o2K1P1J06
60749c70804J78K46K36J82J78K16K14J73J69J91J60P0lo0j65l21m44n21n95o53
60729c71353o52o26o52o92o41n17m36m15l74k92k32k01j33o2q1j67k13k16l07
60710c78262m96o51p00p44q61r89j055j063j023q98p24o01n56n13m41m01m23m80
$$ plain form
60836 -303438 -306353 -309219 -312042 -314778 -317400 -319934 -322394 -324751 -327011 -329202 -331300 -333231 -334996 -336675
60822 -336675 -338308 -339842 -341258 -342612 -343936 -345186 -346348 -347483 -348618 -349699 -350695 -351647 -352575 -353432 -354216
60807 -354216 -355017 -355872 -356725 -357549 -358423 -359392 -360354 -361211 -362002 -362834 -363719 -364600 -365451 -366270 -367030 -367723 -368411 -369128 -369821
60788 -369821 -370432 -370986 -371517 -371994 -372387 -372752 -373150 -373540 -373829 -373984 -374038 -374003 -373890 -373730 -373536 -373268 -372894 -372448 -371976
60769 -371976 -371462 -370902 -370365 -369940 -369655 -369491 -369437 -369485 -369610 -369800 -370051 -370322 -370543 -370694 -370820 -370940 -371002 -370981 -370910 -370804
60749 -370804 -370626 -370380 -370144 -369962 -369784 -369568 -369354 -369181 -369012 -368821 -368661 -368591 -368594 -368654 -368819 -369140 -369584 -370105 -370700 -371353
60729 -371353 -372005 -372631 -373283 -373975 -374616 -375133 -375569 -375984 -376358 -376650 -376882 -377083 -377216 -377278 -377359 -377526 -377739 -377955 -378262
60710 -378262 -378758 -379409 -380109 -380853 -381714 -382703 -383758 -384821 -385844 -386742 -387466 -388067 -388623 -389136 -389577 -389978 -390401 -390881
60692c90881n53o89q71j000j052j082j102j058r82r78j055j102j059r94r63r32
60676d06353q74q28p92p23o27n64n32m55l43k87l08l25l10l34m10m53m57n09o33
60657d16117p47q19r18j054j128j118j134j229j310j306j283j312j336j293j235
60642d33339j224j233j219j208j219j194j113j048j051j084j090j076j054j003
60628d49155r34r03r06q87q48q49q84q70q06p88q35q50p99p86q41q66q02p40p68
60609d65117q18q03p52p30p26p25p51q00q04p38o72o42o20o09o54p41p57o91o53
60590d78803p12p86p92p58p30o96o74p20p93p80o89o60p34p74o98o16o30o66o40
60571d92351o21o75p27o88o21o21o70p10p54q31q77q58q46q89r11q51p80p80q23
$$ plain form
60692 -390881 -391434 -392123 -392994 -393994 -395046 -396128 -397230 -398288 -399270 -400248 -401303 -402405 -403464 -404458 -405421 -406353
60676 -406353 -407227 -408055 -408847 -409570 -410197 -410761 -411293 -411748 -412091 -412378 -412686 -413011 -413321 -413655 -414065 -414518 -414975 -415484 -416117
60657 -416117 -416864 -417683 -418601 -419655 -420783 -421901 -423035 -424264 -425574 -426880 -428163 -429475 -430811 -432104 -433339
60642 -433339 -434563 -435796 -437015 -438223 -439442 -440636 -441749 -442797 -443848 -444932 -446022 -447098 -448152 -449155
60628 -449155 -450089 -450992 -451898 -452785 -453633 -454482 -455366 -456236 -457042 -457830 -458665 -459515 -460314 -461100 -461941 -462807 -463609 -464349 -465117
60609 -465117 -465935 -466738 -467490 -468220 -468946 -469671 -470422 -471222 -472026 -472764 -473436 -474078 -474698 -475307 -475961 -476702 -477459 -478150 -478803
60590 -478803 -479515 -480301 -481093 -481851 -482581 -483277 -483951 -484671 -485464 -486244 -486933 -487593 -488327 -489101 -489799 -490415 -491045 -491711 -492351
60571 -492351 -492972 -493647 -494374 -495062 -495683 -496304 -496974 -497684 -498438 -499269 -500146 -501004 -501850 -502739 -503650 -504501 -505281 -506061 -506884
60552e06884q44q54q76q60p86p39p70p94p62p37p78q10p60o83o49o17n39m86n13
60533e20741n61n63n63o09o33n73n03n04n21m91m63m80m69l68k68k68l05k89k45
60514e29417k45k35j61o9l6l1J1M6L7N0J45K56L26M28O03P61Q20R02J128J438
60494e23243J693J907K182K509K833L188L619M023M261M361M404M364M131L721
60480d76047L200K602J962J431J129J012R73J030J259J600J991K482L156L942
60466d48278M728N543O474P496Q550R695J1021J2440J3799J5098J6417J7714J8832
60453c00471J9679K0190K0197J9523J8179J6303J3968J1225Q242N244K316n12
60441a45917l121n371p286q960j0329j1268j1831j2192j2404j2386j2160j1825
$$ plain form
60552 -506884 -507728 -508582 -509458 -510318 -511104 -511843 -512613 -513407 -514169 -514906 -515684 -516494 -517254 -517937 -518586 -519203 -519742 -520228 -520741
60533 -520741 -521302 -521865 -522428 -523037 -523670 -524243 -524746 -525250 -525771 -526262 -526725 -527205 -527674 -528042 -528310 -528578 -528883 -529172 -529417
60514 -529417 -529662 -529897 -530058 -530127 -530163 -530194 -530183 -530137 -530100 -530050 -529905 -529649 -529323 -528895 -528292 -527531 -526711 -525809 -524681 -523243
60494 -523243 -521550 -519643 -517461 -514952 -512119 -508931 -505312 -501289 -497028 -492667 -488263 -483899 -479768 -476047
60480 -476047 -472847 -470245 -468283 -466852 -465723 -464711 -463738 -462708 -461449 -459849 -457858 -455376 -452220 -448278
60466 -448278 -443550 -438007 -431533 -424037 -415487 -405792 -394771 -382331 -368532 -353434 -337017 -319303 -300471
60453 -300471 -280792 -260602 -240405 -220882 -202703 -186400 -172432 -161207 -152965 -147721 -145405 -145917
60441 -145917 -149038 -154409 -161695 -170655 -180984 -192252 -204083 -216275 -228679 -241065 -253225 -265050
60429b65050j1384j0757r981r168q321p341o243n131m013k805j505k02J082K363
60415c38456L503M292M660M699M493M112L735L568L663L930M352M968N677O298
60401b76506O755P082P238P107O648N916M908L571J989L12j399l179m943o553
60387b41054p967r230j0310j1117j1675j2093j2373j2440j2344j2202j1992j1591
60375c76388j1031j0470r944r350q667p982p294o509n643m802l984l090k172j399
60361d68725q26l76j00j68n81j091j495j783j945j892j610j187o61L5Q79J728
60345d79798K541L417M413N466O576P836R248J0688J2121J3639J5266J6884J8407
60332c53296J9865K1205K2258K2917K3193K3061K2398K1213J9648J7849J5860
$$ plain form
60429 -265050 -276434 -287191 -297172 -306340 -314661 -322002 -328245 -333376 -337389 -340194 -341699 -341901 -340819 -338456
60415 -338456 -334953 -330661 -326001 -321302 -316809 -312697 -308962 -305394 -301731 -297801 -293449 -288481 -282804 -276506
60401 -276506 -269751 -262669 -255431 -248324 -241676 -235760 -230852 -227281 -225292 -224980 -226379 -229558 -234501 -241054
60387 -241054 -249021 -258251 -268561 -279678 -291353 -303446 -315819 -328259 -340603 -352805 -364797 -376388
60375 -376388 -387419 -397889 -407833 -417183 -425850 -433832 -441126 -447635 -453278 -458080 -462064 -465154 -467326 -468725
60361 -468725 -469551 -469927 -470027 -470195 -470776 -471867 -473362 -475145 -477090 -478982 -480592 -481779 -482440 -482405 -481526 -479798
60345 -479798 -477257 -473840 -469427 -463961 -457385 -449549 -440301 -429613 -417492 -403853 -388587 -371703 -353296
60332 -353296 -333431 -312226 -289968 -267051 -243858 -220797 -198399 -177186 -157538 -139689 -123829
60321a23829J3759J1662R561P344M999K654L41k026m435o724q795j0688j2396
60308a18573j3813j4899j5719j6269j6455j6305j5965j5470j4709j3684j2547
60297b84408j1353j0017q538p076n721m410l159k124j350p19k00J15K77N43J081
60282c37059J813K679L771N129O626Q237J0079J2169J4341J6523J8846K1322K3733
60269a91791K5926K7985K9965L1739L3224h409B7361L6781L7447L7862L8070L7905
60257B15426L7189L5873L3872L1039K7523K3869K0684J8281J6851J6558J7252
60246D94417J8282J8821J8186J5810J1347N045k174r261j5488k0324k3306k4351
60234D87004k3845k2183j9434j5700j1358o715j720L682R262J4848K0618K6711
$$ plain form
60321 -123829 -110070 -98408 -88847 -81503 -76504 -73850 -73509 -75535 -79970 -86694 -95489 -106177 -118573
60308 -118573 -132386 -147285 -163004 -179273 -195728 -212033 -227998 -243468 -258177 -271861 -284408
60297 -284408 -295761 -305778 -314316 -321392 -327113 -331523 -334682 -336806 -338156 -338875 -339075 -338960 -338683 -338140 -337059
60282 -337059 -335246 -332567 -328796 -323667 -317041 -308804 -298725 -286556 -272215 -255692 -236846 -215524 -191791
60269 -191791 -165865 -137880 -107915 -76176 -42952 -8409 27361 64142 101589 139451 177521 215426
60257 215426 252615 288488 322360 353399 380922 404791 425475 443756 460607 477165 494417
60246 494417 512699 531520 549706 565516 576863 581908 579734 570473 554985 534661 511355 487004
60234 487004 463159 440976 421542 405842 394484 387769 386049 389731 398993 413841 434459 461170
60222D61170L2916L9114M5653N2874O0650O8792P7555Q7305R7993J09515J22236
60211A255773J36689J53099J71772J93463K18781K47613K79927L16600L58772
60202C332489M06809M61076N23105N94577O75509P65045Q62910R65408J056964
60193I643892J108578J091681R98750Q51616O88991N45129M38139L72883L47069
60184A6086728L49434L54039L24460K32116P4867j21485l19965m91520o22366
60175A5866308p10347p59579p77737p73933p55898p28678o95583o59333o21818
60166I383402n83717n45198n06740m69092m32877l98633l66893l37851l11209
60157E431192k86565k63783k42805k23379k05255j88455j73104j59159j46520
$$ plain form
60222 461170 494086 533200 578853 631727 692377 761169 838724 926029 1024022 1133537 1255773
60211 1255773 1392462 1545561 1717333 1910796 2129577 2377190 2657117 2973717 3332489
60202 3332489 3739298 4200374 4723479 5318056 5993565 6758610 7621520 8586928 9643892
60193 9643892 10752470 11844151 12842901 13694517 14383508 14928637 15366776 15739659 16086728
60184 16086728 16436162 16790201 17114661 17346777 17421644 17300159 16980194 16488674 15866308
60175 15866308 15155961 14396382 13618645 12844712 12088814 11360136 10664553 10005220 9383402
60166 9383402 8799685 8254487 7747747 7278655 6845778 6447145 6080252 5742401 5431192
60157 5431192 5144627 4880844 4638039 4414660 4209405 4020950 3847846 3688687 3542167
60148C542167j35181j25165j16304j08362j01183r4661q8627q2948p7663p2829
60138B539244o8363o4148o0213n6644n3402n0370m7538m4954m2589m0351l8241
60127A972431l6348l4728l3414l2494l2056l2047l2288l2607l2887l2965l2653
60116A607944l1888l0741k9312k7652k5839k3972k2110k0267j8458j6738j5108
60105A345859j3535j2024j0619r300p946o515n074l658k127k95J860M231O749
60092A287606R423J2227J5028J7631J9795K1211K1562K0637J8383J4896J0423
60081A468822N360J58m815r316j3188j6344j8819k0660k1825k2209k1806k0729
60069A304629j9089j6968j4487j1860r267o795m564k763j581j061j169j851k981
$$ plain form
60148 3542167 3406986 3281821 3165517 3057155 2955972 2861311 2772684 2689736 2612073 2539244
60138 2539244 2470881 2406733 2346520 2289876 2236474 2186104 2138566 2093612 2051023 2010672 1972431
60127 1972431 1936083 1901355 1867941 1835447 1803391 1771344 1739056 1706449 1673562 1640597 1607944
60116 1607944 1576056 1545315 1516003 1488351 1462512 1438540 1416430 1396163 1377705 1360967 1345859
60105 1345859 1332324 1320300 1309681 1300381 1292435 1285920 1280846 1277188 1275061 1274766 1276626 1280857 1287606
60092 1287606 1297029 1309256 1324284 1341915 1361710 1382921 1404483 1425120 1443503 1458399 1468822
60081 1468822 1474182 1474340 1469525 1460209 1447021 1430677 1411858 1391198 1369373 1347164 1325358 1304629
60069 1304629 1285540 1268572 1254085 1242225 1232958 1226163 1221599 1218836 1217255 1216194 1215025 1213174 1210193
60056A210193m334n681o907p969q803r351r642r738r678r481r179q817q416p991
60042A094206p587p228o891o535o157n741n246m647l994l347k727k154j681j348
60028A028923j152j088j191j490k005k817m059n830q093j0787j3831j7079k0286
60015I39215k3225k5778k7874k9397l0283l0609l0512l0056k9247k8124k6763
60004F27347k5235k3588k1887k0167j8418j6672j5028j3565j2238j0997r895r009
59992D30648q331p772p295o894o553o248n996n782n525n155m693m179l551k758
59978C49916j854r35oR79K010L042M072N127O160P118Q024Q922R770J0495J1113
59963D23953J1684J2223J2704J3169J3714J4358J5068J5890J6924J8221J9763
$$ plain form
60056 1210193 1205859 1200178 1193271 1185302 1176499 1167148 1157506 1147768 1138090 1128609 1119430 1110613 1102197 1094206
60042 1094206 1086619 1079391 1072500 1065965 1059808 1054067 1048821 1044174 1040180 1036833 1034106 1031952 1030271 1028923
60028 1028923 1027771 1026683 1025492 1024002 1021997 1019180 1015121 1009291 1001198 990411 976580 959501 939215
60015 939215 915990 890212 862338 832941 802658 772049 741537 711481 682234 654110 627347
60004 627347 602112 578524 556637 536470 518052 501380 486352 472787 460549 449552 439657 430648
59992 430648 422317 414545 407250 400356 393803 387555 381559 375777 370252 365097 360404 356225 352674 349916
59978 349916 348062 347127 347121 348100 350110 353152 357224 362351 368511 375629 383653 392575 402345 412840 423953
59963 423953 435637 447860 460564 473733 487447 501805 516873 532763 549687 567908 587671
59952E87671K1547K3609K5955K8551L1381L4420L7591M0830M4157M7613N1116
59941I74441N4507N7689O0639O3299O5573O7425O8920P0160P1277P2460P3889
59930A700279P5660P7785Q0284Q3150Q6314Q9684R3253R7079J01179J05529J10107
59919B700303J14812J19385J23517J26917J29273J30116J28933J25383J19341
59910C817980J10774R9806Q6830P2492N7544M2736K8801J6311N514l582j1030
59899D324176j6931k1518k5119k7947l0090l1639l2685l3233l3171l2435l1014
59888D008394k8847k5832k1943j7207j1571m916K778J1396K0821L0898M1279N1399
59876D056649O0678O8643P4874P8996Q0828Q0413P7974P3840O8516O2594N6564
$$ plain form
59952 587671 609218 632827 658782 687333 718714 753134 790725 831555 875712 923325 974441
59941 974441 1028948 1086637 1147276 1210575 1276148 1343573 1412493 1482653 1553930 1626390 1700279
59930 1700279 1775939 1853724 1934008 2017158 2103472 2193156 2286409 2383488 2484667 2590196 2700303
59919 2700303 2815115 2934500 3058017 3184934 3314207 3444323 3573256 3698639 3817980
59910 3817980 3928754 4028560 4115390 4187882 4245426 4288162 4316963 4333274 4338788 4335206 4324176
59899 4324176 4307245 4285727 4260608 4232661 4202571 4170932 4138247 4105014 4071843 4039408 4008394
59888 4008394 3979547 3953715 3931772 3914565 3902994 3898078 3900856 3912252 3933073 3963971 4005250 4056649
59876 4056649 4117327 4185970 4260844 4339840 4420668 4501081 4579055 4652895 4721411 4784005 4840569
59865D840569N0770M5515M1084L7577L4903L2904L1430L0268K9112K7704K5878
59854E227714K3501K0470J6844J2839Q636M313l5m261q321j2308j6280k0148k3857
59841E229107k7493l1166l4852l8439m1855m5043m7910n0384n2473n4240n5757
59830D749495n7147n8586o0250o2257o4735o7816p1543p5798q0382q5082q9648
59819C976251r3806r7356j00179j02176j03227j03300j02489j00896r8558r5514
59809B978750r1876q7792q3358p8679p3849o8923o3903n8846n3881m9090m4468
59798B224085l9976l5650l1534k7675k4152k1082j8549j6566j5171j4432j4392
59787A964906j5018j6269j8102k0419k3072k5963k9035l2157l5115l7742l9988
$$ plain form
59865 4840569 4891339 4936854 4977938 5015515 5050418 5083322 5114752 5145020 5174132 5201836 5227714
59854 5227714 5251215 5271685 5288529 5301368 5310004 5314317 5314282 5310021 5301700 5289392 5273112 5252964 5229107
59841 5229107 5201614 5170448 5135596 5097157 5055302 5010259 4962349 4911965 4859492 4805252 4749495
59830 4749495 4692348 4633762 4573512 4511255 4446520 4378704 4307161 4231363 4150981 4065899 3976251
59819 3976251 3882445 3785089 3684910 3582734 3479507 3376207 3273718 3172822 3074264 2978750
59809 2978750 2886874 2799082 2715724 2637045 2563196 2494273 2430370 2371524 2317643 2268553 2224085
59798 2224085 2184109 2148459 2116925 2089250 2065098 2044016 2025467 2008901 1993730 1979298 1964906
59787 1964906 1949888 1933619 1915517 1895098 1872026 1846063 1817028 1784871 1749756 1712014 1672026
59776A672026m1847m3265m4220m4775m5003m4924m4519m3819m2874m1746m0486
59765A194548l9132l7673l6097l4446l2779l1128k9489k7911k6416k4945k3447
59754H51085k2007k0769j9757j8880j8113j7510j7067j6680j6295j5955j5654
59743F52398j5289j4830j4357j3917j3455j2928j2392j1904j1420j0891j0316
59732E10699r701r002q233p480o791o095n323m482l601k675j702p03L26J374K304
59717D48915K885K968K546J635K30j558l474n282o850q071q829r122r095q874
59703C98024q471p882p199o488n738m943m149l332k396j318k10Q58J976L242M626
59688C56600O071P630R373J1295J3365J5630J8138K0882K3859K7114L0645L4307
$$ plain form
59776 1672026 1630179 1586914 1542694 1497919 1452916 1407992 1363473 1319654 1276780 1235034 1194548
59765 1194548 1155416 1117743 1081646 1047200 1014421 983293 953804 925893 899477 874532 851085
59754 851085 829078 808309 788552 769672 751559 734049 716982 700302 684007 668052 652398
59743 652398 637109 622279 607922 594005 580550 567622 555230 543326 531906 521015 510699
59732 510699 500998 491996 483763 476283 469492 463397 458074 453592 449991 447316 445614 444911 445237 446611 448915
59717 448915 451800 454768 457314 458949 459179 457621 454147 448865 442015 433944 425115 415993 406898 398024
59703 398024 389553 381671 374472 367984 362246 357303 353154 349822 347426 346108 345898 346756 348732 351974 356600
59688 356600 362671 370301 379674 390969 404334 419964 438102 458984 482843 509957 540602 574909
59676E74909L7937M1454M4735M7535M9556N0574N0397M8845M5875M1595L6159
59665A069571K9648K2219J4200N979k134r870j6921k3067k8247l2454l5658l7884
59653I55382l9291m0050m0216l9821l8995l7876l6501l4919l3240l1563k9846
59642E53064k8052k6272k4634k3146k1735k0384j9114j7906j6757j5719j4820
59631C24525j3973j3108j2260j1487j0762j0040r356q750q158p500o817o181n589
59618B00544n021m551m261m127m065m060m132m237m312m336m288m096l729l267
59604A42062k794k298j744j179o42q6N29J128J614J975K245K361K262J978J548
59589A48959R55K20n29j180j767k349k860l216l442l614l693l627l475l336l188
$$ plain form
59676 574909 612846 654300 699035 746570 796126 846700 897097 945942 991817 1033412 1069571
59665 1069571 1099219 1121438 1135638 1141617 1139483 1129613 1112692 1089625 1061378 1028924 993266 955382
59653 955382 916091 876041 835825 796004 757009 719133 682632 647713 614473 582910 553064
59642 553064 525012 498740 474106 450960 429225 408841 389727 371821 355064 339345 324525
59631 324525 310552 297444 285184 273697 262935 252895 243539 234789 226631 219131 212314 206133 200544
59618 200544 195523 190972 186711 182584 178519 174459 170327 166090 161778 157442 153154 149058 145329 142062
59604 142062 139268 136970 135226 134047 133405 133319 133848 134976 136590 138565 140810 143171 145433 147411 148959
59589 148959 149914 150134 149605 148425 146658 144309 141449 138233 134791 131177 127484 123857 120382 117046 113858
59574A13858k962k688k428k151j802j451j221j089r33p24n07k52J13N63J006J440
59558I8772J941K508L059L578M125M734N381O069O836P700Q670R796J1108J2563
59544A86840J4133J5892J7931K0230K2729K5464K8504L1846L5474L9441M3792
59533D82276M8456N3290N8218O3156O7889P2092P5476P7751P8619P7920P5781
59522A230924P2475O8195O3097N7475N1738M6171M0905L6008L1456K7028K2411
59511A747883J7383J1805N487j713r716j8220k6898l5431m3421n0428n6145o0463
59499A480123o3352o4876o5238o4714o3497o1720n9581n7263n4836n2301m9733
59488H23012m7247m4833m2417m0030l7775l5644l3555l1515k9615k7854k6170
$$ plain form
59574 113858 110896 108208 105780 103629 101827 100376 99155 98066 97133 96409 95902 95650 95763 96326 97332 98772
59558 98772 100713 103221 106280 109858 113983 118717 124098 130167 137003 144703 153373 163169 174277 186840
59544 186840 200973 216865 234796 255026 277755 303219 331723 363569 399043 438484 482276
59533 482276 530732 584022 642240 705396 773285 845377 920853 998604 1077223 1155143 1230924
59522 1230924 1303399 1371594 1434691 1492166 1543904 1590075 1630980 1666988 1698444 1725472 1747883
59511 1747883 1765266 1777071 1782558 1780845 1771129 1752909 1726011 1690580 1647159 1596731 1540586 1480123
59499 1480123 1416771 1351895 1286657 1221943 1158446 1096726 1037145 979882 925046 872745 823012
59488 823012 775765 730932 688515 648485 610710 575066 541511 509996 480381 452527 426357
59477D26357k4587k3188k1923k0672j9434j8336j7395j6501j5592j4749j4015
59466B19965j3338j2677j2054j1473j0904j0363r905r491r031q556q188p936p675
59453H8374p336o981o664o368o088n863n670n435n144m880m685m510m321m145
59439A0284l971B534a053l442l301l094k860k692k582k430k209j995j804j592
59425b9054j360j166r96p76n25l27j66O0L84P00R80J299J698K114K532L002L527
59408a8074M044M531d425A285O414P140P925Q742R508J0164J0665J0890J0759
59395H3492J0408J0126J0078J0228J0538J1082J1899J2887J3952J5123J6471J8025
59383B34309J9828K1942K4391K7161L0267L3766L7633M1773M6110N0560N4900
$$ plain form
59477 426357 401770 378582 356659 335987 316553 298217 280822 264321 248729 233980 219965
59466 219965 206627 193950 181896 170423 159519 149156 139251 129760 120729 112173 103985 96049 88374
59453 88374 81038 74057 67393 61025 54937 49074 43404 37969 32825 27945 23260 18750 14429 10284
59439 10284 6313 2534 -1053 -4495 -7796 -10890 -13750 -16442 -19024 -21454 -23663 -25658 -27462 -29054
59425 -29054 -30414 -31580 -32576 -33352 -33877 -34204 -34370 -34310 -33926 -33226 -32246 -30947 -29249 -27135 -24603 -21601 -18074
59408 -18074 -14030 -9499 -4425 1285 7699 14839 22764 31506 41014 51178 61843 72733 83492
59395 83492 93900 104026 114104 124332 134870 145952 157851 170738 184690 199813 216284 234309
59383 234309 254137 276079 300470 327631 357898 391664 429297 471070 517180 567740 622640
59372F22640N8832O2148O4673O6129O6157O4521O1136N5927M8832M0018K9902
59361A240915J8939P545l777j4444k3986l2158l8807m3871m7456m9833n1206n1652
59349I10209n1295n0355m9010m7336m5434m3449m1402l9230l6938l4656l2422
59338D38682l0152k7838k5612k3542k1520j9460j7449j5565j3759j1942j0132
59327B21711q357o606m897l349k098j258r81j424k548m078n738p376q845r988
59313A54168j0736j1197j1456j1479j1264j0909j0483r967r356q751q196p624
59301C2750o979o303n631m932m215A120a897k493j963j534j239r82p04n17m90
59286a1819n75p18j010j529k192k883l582m286m927n424n792o033o125o107o081
$$ plain form
59372 622640 681472 743620 808293 874422 940579 1005100 1066236 1122163 1170995 1211013 1240915
59361 1240915 1259854 1267399 1263622 1249178 1225192 1193034 1154227 1110356 1062900 1013067 961861 910209
59349 910209 858914 808559 759549 712213 666779 623330 581928 542698 505760 471104 438682
59338 438682 408530 380692 355080 331538 310018 290558 273109 257544 243785 231843 221711
59327 221711 213354 206748 201851 198502 196404 195146 194165 192741 190193 186115 180377 173001 164156 154168
59313 154168 143432 132235 120779 109300 98036 87127 76644 66677 57321 48570 40374 32750
59301 32750 25771 19468 13837 8905 4690 1120 -1897 -4390 -6353 -7887 -9126 -10108 -10812 -11329 -11819
59286 -11819 -12394 -13112 -14122 -15651 -17843 -20726 -24308 -28594 -33521 -38945 -44737 -50770 -56895 -63002 -69083
59271f9083o059n937n700n468n305n102m788m477m279m141l979l805l655l488
59257a35266l280l096k961k789k549k353k275k219k076j914j828j782j691j556
59243a67635j409j220r81p58n92m30k37o9Q3L26P00J070J353J613J928K258K572
59226a61428K957L465L984M434M879N361N740N870N789N579N181M529L728K961
59212i6971K304J779J459J343J273J124R78R74J062J121J148J222J332J444J604
59197g6804J837K039K122K161K278K419K456K382K232J961J513R64M13j69q41
59182e3037j508k050k502k980l493l987m497n057n553n853n990o099o183o151
59168a14940n998n786n510n122m682m266l846l339k783k259j759j241p57l93j02
$$ plain form
59271 -69083 -75142 -81079 -86779 -92247 -97552 -102654 -107442 -111919 -116198 -120339 -124318 -128123 -131778 -135266
59257 -135266 -138546 -141642 -144603 -147392 -149941 -152294 -154569 -156788 -158864 -160778 -162606 -164388 -166079 -167635
59243 -167635 -169044 -170264 -171245 -172003 -172595 -173025 -173262 -173331 -173248 -172922 -172222 -171152 -169799 -168186 -166258 -164000 -161428
59226 -161428 -158471 -155006 -151022 -146588 -141709 -136348 -130608 -124738 -118949 -113370 -108189 -103660 -99932 -96971
59212 -96971 -94667 -92888 -91429 -90086 -88813 -87689 -86711 -85737 -84675 -83554 -82406 -81184 -79852 -78408 -76804
59197 -76804 -74967 -72928 -70806 -68645 -66367 -63948 -61492 -59110 -56878 -54917 -53404 -52440 -52027 -52196 -53037
59182 -53037 -54545 -56595 -59097 -62077 -65570 -69557 -74054 -79111 -84664 -90517 -96507 -102606 -108789 -114940
59168 -114940 -120938 -126724 -132234 -137356 -142038 -146304 -150150 -153489 -156272 -158531 -160290 -161531 -162288 -162681 -162783
59153a62783K06N04P24R28J227J617K042K553L239M092N039O091P274Q459R424
59138a09364J0030J0164R611Q186N955L225L17k505m979o920q334r330r929j0135
59124a14008j0067r885r612r201q704q221p729p170o582o061n581n064m544m114
59110b16543l750l343k911k543k216j830j396j004o50k33K44P02J144J644K178
59095b30507K632K971L236L380L281K911K322J536N57n06j478k286k958l477l786
59080b22172l921l976l960l824l601l383l179k931k656k412k172j869j531j246
59066b62833r91o82l24J8L75Q06J275J706K154K717L344L874M263M596M891N057
59050b29754N068M981M832M609M371M207M110M032M019M173M474M780M996N097
$$ plain form
59153 -162783 -162577 -162073 -161349 -160421 -159194 -157577 -155535 -152982 -149743 -145651 -140612 -134521 -127247 -118788 -109364
59138 -109364 -99334 -89170 -79559 -71373 -65418 -62193 -61876 -64381 -69360 -76280 -84614 -93944 -103873 -114008
59124 -114008 -124075 -133960 -143572 -152773 -161477 -169698 -177427 -184597 -191179 -197240 -202821 -207885 -212429 -216543
59110 -216543 -220293 -223636 -226547 -229090 -231306 -233136 -234532 -235536 -236186 -236419 -236175 -235473 -234329 -232685 -230507
59095 -230507 -227875 -224904 -221668 -218288 -215007 -212096 -209774 -208238 -207681 -208187 -209665 -211951 -214909 -218386 -222172
59080 -222172 -226093 -230069 -234029 -237853 -241454 -244837 -248016 -250947 -253603 -256015 -258187 -260056 -261587 -262833
59066 -262833 -263824 -264506 -264830 -264812 -264437 -263631 -262356 -260650 -258496 -255779 -252435 -248561 -244298 -239702 -234811 -229754
59050 -229754 -224686 -219705 -214873 -210264 -205893 -201686 -197576 -193544 -189525 -185352 -180878 -176098 -171102 -166005
59036a66005N027M784M535M451M499M531M502M475M393M100L593L037K554K153
59022a09371J900J934K270K789L404M093M774N298N602N747N795N820N962O330
59008d7653O868P452Q091Q873f603D078J1694J2938J4421J6021J7716J9589K1625
58995A18082K3717K5896K8293L0915L3615L6392L9386M2625M5945M9216N2450
58984E26532N5646N8744O1812O5050O8632P2637P7215Q2569Q8737R5622J03227
58973A356423J11714J21159J31460J42528J54381J67001J80212J93810K07576
58964B766264K21104K33783K44928K53820K59562K61105K57497K48030K32209
58955D978302K09873J81462J48009J10848P1413L1307p823m4575p7960j07254
$$ plain form
59036 -166005 -160978 -156194 -151659 -147208 -142709 -138178 -133676 -129201 -124808 -120708 -117115 -114078 -111524 -109371
59022 -109371 -107471 -105537 -103267 -100478 -97074 -92981 -88207 -82909 -77307 -71560 -65765 -59945 -53983 -47653
59008 -47653 -40785 -33333 -25242 -16369 -6603 4078 15772 28710 43131 59152 76868 96457 118082
58995 118082 141799 167695 195988 226903 260518 296910 336296 378921 424866 474082 526532
58984 526532 582178 640922 702734 767784 836416 909053 986268 1068837 1157574 1253196 1356423
58973 1356423 1468137 1589296 1720756 1863284 2017665 2184666 2364878 2558688 2766264
58964 2766264 2987368 3221151 3466079 3719899 3979461 4240566 4498063 4746093 4978302
58955 4978302 5188175 5369637 5517646 5628494 5699907 5731214 5723391 5678816 5600856 5493602
58945E493602j31977j52014j67587j79039j86720j91084j92677j91943j89230
58936C911331j84954j79568j73344j66391j58936j51337j43827j36390j29062
58927B487522j21994j15288j08895j02796r7089r1771q6715q1887p7400p3282
58917A530405o9416o5750o2380n9313n6381n3485n0738m8218m5844m3542m1397
58906I33941l9449l7572l5689l3889l2249l0678k9078k7490k5961k4433k2871
58895E94582k1387k0097j9029j8209j7709j7473j7288j7034j6778j6597j6428
58884C96553j6209j5982j5754j5425j4958j4470j4022j3536j2988j2492j2105
58873B38612j1723j1270j0829j0465j0093r651r235q912q594q210p849p581p299
$$ plain form
58945 5493602 5361625 5209611 5042024 4862985 4676265 4485181 4292504 4100561 3911331
58936 3911331 3726377 3546809 3373465 3207074 3048138 2896801 2752974 2616584 2487522
58927 2487522 2365528 2250240 2141345 2038549 1941460 1849689 1762974 1681087 1603687 1530405
58917 1530405 1460989 1395239 1332859 1273546 1217165 1163680 1112942 1064724 1018880 975338 933941
58906 933941 894492 856920 821231 787342 755093 724415 695337 667847 641886 617453 594582
58895 594582 573195 553098 534069 515860 498151 480678 463390 446356 429578 412981 396553
58884 396553 380344 364362 348608 333183 318225 303755 289733 276197 263209 250717 238612
58873 238612 226889 215619 204790 194325 184232 174581 165346 156434 147840 139630 131781 124200 116901
58860A16901o896o460o120n840n521n168m858m580m321m131m075m112m192m331
58846D6296m515m678m781m865m911m813m576m340m171F66c047l518l489l577l708
58831a7339l914m196m430m542m601m679m688m570m427m349m281m139l971l820
58817g7946l641l405l203l086k981k844k757k764k770k723k703k746k734k596
58803a18899k464k430k392k253k096k051k056j990j861j734j594j425j289j208
58789a45742j086q63o26m39k48qK15L59M68M79K01m00j061j530j832k083k233
58772a56429k197k039j873j669j399j167j043r11o72m24k76j51M0K23K98L33M10
58755a68946M13K23o0k83m98q08j109j232j197j157j153j135j167j312j530j743
$$ plain form
58860 116901 110005 103545 97425 91585 86064 80896 76038 71458 67137 63006 58931 54819 50627 46296
58846 46296 41781 37103 32322 27457 22546 17733 13157 8817 4646 666 -3047 -6565 -10054 -13631 -17339
58831 -17339 -21253 -25449 -29879 -34421 -39022 -43701 -48389 -52959 -57386 -61735 -66016 -70155 -74126 -77946
58817 -77946 -81587 -84992 -88195 -91281 -94262 -97106 -99863 -102627 -105397 -108120 -110823 -113569 -116303 -118899
58803 -118899 -121363 -123793 -126185 -128438 -130534 -132585 -134641 -136631 -138492 -140226 -141820 -143245 -144534 -145742
58789 -145742 -146828 -147691 -148317 -148756 -149004 -149012 -148797 -148438 -147970 -147491 -147290 -147690 -148751 -150281 -152113 -154196 -156429
58772 -156429 -158626 -160665 -162538 -164207 -165606 -166773 -167816 -168727 -169399 -169823 -170099 -170250 -170210 -169987 -169689 -169356 -168946
58755 -168946 -168533 -168310 -168370 -168653 -169151 -169959 -171068 -172300 -173497 -174654 -175807 -176942 -178109 -179421 -180951 -182694
58739a82694j997k338k641k773k811k897k989k962k838k718k600k442k318k279
58725b19297k231k078j895j811j754j630j516j523j578j555j501j532j591j558
58711b43050j482j470j480j408j321j344j417j411j364j390j448j404j287j224
58697b62500j194j119j036j036j056r88q94r00r72r83r63r94j023r54q78r24j017
58680b79431j001r17r13r54r00p96q00q95r20q51p84p30o40o09p70j041j229j333
58662b95514j479j642j667j576j534j571j558j466j409j394j323j207j158j172
58648c15670j145j083j095j166j180j140j138j149j079r68r50j025j055j025j030
58633c31898j073j052r95j013j086j101j058j068j120j112j053j049j069j019
$$ plain form
58739 -182694 -184691 -187029 -189670 -192443 -195254 -198151 -201140 -204102 -206940 -209658 -212258 -214700 -217018 -219297
58725 -219297 -221528 -223606 -225501 -227312 -229066 -230696 -232212 -233735 -235313 -236868 -238369 -239901 -241492 -243050
58711 -243050 -244532 -246002 -247482 -248890 -250211 -251555 -252972 -254383 -255747 -257137 -258585 -259989 -261276 -262500
58697 -262500 -263694 -264813 -265849 -266885 -267941 -268929 -269823 -270723 -271695 -272678 -273641 -274635 -275658 -276612 -277490 -278414 -279431
58680 -279431 -280432 -281349 -282262 -283216 -284116 -284912 -285712 -286607 -287527 -288378 -289162 -289892 -290532 -291141 -291911 -292952 -294181 -295514
58662 -295514 -296993 -298635 -300302 -301878 -303412 -304983 -306541 -308007 -309416 -310810 -312133 -313340 -314498 -315670
58648 -315670 -316815 -317898 -318993 -320159 -321339 -322479 -323617 -324766 -325845 -326813 -327763 -328788 -329843 -330868 -331898
58633 -331898 -332971 -334023 -335018 -336031 -337117 -338218 -339276 -340344 -341464 -342576 -343629 -344678 -345747 -346766
58619c46766r57j004j111j120j044j049j143j189j175j217j310j308j210j157
58605c62760j168j132j041j006j030j003r37r44j009j000r18q88r16q94q22q13
58589c78281q60q47p97q14q49p79o75p12q49q62p30o52o76o59n75n75o67o89o23
58570c92171o27p33p73o89o47p16p58o88o17n99n56m72m49m75m16k76k06k28k20
58551d02316j87k89n12o39o26o61q03q53p40o55p38q52q71q88r84j048j015r97
58533d15674j062j094j023r74j016j040r65r03r10q95q00p48p97q30p57o80o71
58516d30839o39n25m32m33m25l52l14l45l20j57K5J22K09L78N73P42R17J059J002
58497d29754O83K49j68o08j083j471j695j827j935j965j921j911j956j927j787
$$ plain form
58619 -346766 -347723 -348727 -349838 -350958 -352002 -353051 -354194 -355383 -356558 -357775 -359085 -360393 -361603 -362760
58605 -362760 -363928 -365060 -366101 -367107 -368137 -369140 -370077 -371021 -372030 -373030 -373948 -374836 -375752 -376646 -377468 -378281
58589 -378281 -379141 -379988 -380785 -381599 -382448 -383227 -383902 -384614 -385463 -386325 -387055 -387707 -388383 -389042 -389617 -390192 -390859 -391548 -392171
58570 -392171 -392798 -393531 -394304 -394993 -395640 -396356 -397114 -397802 -398419 -399018 -399574 -400046 -400495 -400970 -401386 -401662 -401868 -402096 -402316
58551 -402316 -402503 -402792 -403304 -403943 -404569 -405230 -406033 -406886 -407626 -408281 -409019 -409871 -410742 -411630 -412614 -413662 -414677 -415674
58533 -415674 -416736 -417830 -418853 -419827 -420843 -421883 -422848 -423751 -424661 -425556 -426356 -427104 -427901 -428731 -429488 -430168 -430839
58516 -430839 -431478 -432003 -432435 -432868 -433293 -433645 -433959 -434304 -434624 -434781 -434756 -434634 -434425 -434047 -433474 -432732 -431815 -430756 -429754
58497 -429754 -429071 -428822 -428990 -429598 -430681 -432152 -433847 -435674 -437609 -439574 -441495 -443406 -445362 -447289 -449076
58482d49076j679j659j609j484j409j441j430j307j198j191j172j065r90j014
58468d67724j015r27q83r66j051j012r43r26q99q12p86q79r53r24q99r60r95r35
58450d84489r01r73j018r35q51q89r46r20q92r46r72q78p79p94q53q63q73r43
58432e00715r55q65q06q80r51r06q34q38q20p09o48p52q85q90q44q70q78p63o55
58413e16464p07q22q10p13o91p40p57p57p99q41q15p82q03q00p10o31o44o58o04
58394e30548n97p23q45q20p47p59p95p41o64o63o82o33o14o96p59o79n66n78o57
58375e43766o77o75p28p61o85o04o23o36n11l51l08l06k17j11j23j79j36m8n6
58356e51501j23j20q1j04j23m1N4L9KR2K56L78N01P41J036J273J541J974K500
$$ plain form
58482 -449076 -450755 -452414 -454023 -455507 -456916 -458357 -459787 -461094 -462292 -463483 -464655 -465720 -466710 -467724
58468 -467724 -468739 -469666 -470549 -471515 -472566 -473578 -474521 -475447 -476346 -477158 -477944 -478823 -479776 -480700 -481599 -482559 -483554 -484489
58450 -484489 -485390 -486363 -487381 -488316 -489167 -490056 -491002 -491922 -492814 -493760 -494732 -495610 -496389 -497183 -498036 -498899 -499772 -500715
58432 -500715 -501670 -502535 -503341 -504221 -505172 -506078 -506912 -507750 -508570 -509279 -509927 -510679 -511564 -512454 -513298 -514168 -515046 -515809 -516464
58413 -516464 -517171 -517993 -518803 -519516 -520207 -520947 -521704 -522461 -523260 -524101 -524916 -525698 -526501 -527301 -528011 -528642 -529286 -529944 -530548
58394 -530548 -531145 -531868 -532713 -533533 -534280 -535039 -535834 -536575 -537239 -537902 -538584 -539217 -539831 -540527 -541286 -541965 -542531 -543109 -543766
58375 -543766 -544443 -545118 -545846 -546607 -547292 -547896 -548519 -549155 -549666 -550017 -550325 -550631 -550848 -550959 -551082 -551261 -551397 -551445 -551501
58356 -551501 -551624 -551744 -551825 -551929 -552052 -552093 -552039 -552000 -551998 -551906 -551650 -551272 -550771 -550030 -548994 -547721 -546180 -544206 -541706
58337e41706K976L449M069M792N429N871N980N488M261K584R15n15j698k566l047
58322e03718l256l342l251k891k394j954j505q90j73M80J127J920K746L329L594
58307e10178L608L268K395J091l21j649k879l922m653n136n506n732n710n532
58293e40856n382n234m955m621m394m211l898l523l293l164k922k590k377k276
58279e93696k090j805j604j489j271r46p24o38m89k30j5R8K48M92P25R40J242
58262f01252J625J955K264K704L274L819M340N002N813O640P506Q604R937J1302
58248e26467J2630J4009J5353J6332J6693J6369J5288J3426J1097Q818O887N320
58236c74245M230L843M150M879N933P474R506J1797J4276J7145K0492K4137K7983
$$ plain form
58337 -541706 -538730 -535281 -531212 -526420 -520991 -515120 -509140 -503652 -499391 -496807 -495892 -496407 -498105 -500671 -503718
58322 -503718 -506974 -510316 -513567 -516458 -518852 -520806 -522311 -523201 -523374 -522894 -521767 -519847 -517101 -513772 -510178
58307 -510178 -506570 -503302 -500907 -499816 -500137 -501786 -504665 -508587 -513240 -518376 -523882 -529614 -535324 -540856
58293 -540856 -546238 -551472 -556427 -561048 -565442 -569653 -573551 -577074 -580367 -583531 -586453 -589043 -591420 -593696
58279 -593696 -595786 -597591 -599195 -600684 -601955 -602901 -603625 -604263 -604752 -604982 -604997 -604899 -604651 -604159 -603434 -602494 -601252
58262 -601252 -599627 -597672 -595408 -592704 -589430 -585611 -581271 -576269 -570456 -563816 -556310 -547706 -537769 -526467
58248 -526467 -513837 -499828 -484475 -468143 -451450 -435081 -419793 -406367 -395270 -386452 -379565 -374245
58236 -374245 -370015 -366172 -362022 -357143 -351210 -343736 -334230 -322433 -308157 -291012 -270520 -246383 -218400
58223b18400L2210L6937M2035M7390f792E2030O4280O8854P2045P3120P1146O5575
58211D67050N6583M4825L1166J6757K930r322j9596k7765l3745l7716m0200m1674
58199D09293m2363m2502m2452m2319m1852m0890l9607l8156l6391H513b3464k9800
58187e3264k7559k5133k2723k0535j8431j6253j4156j2290j0499q584o673m929
58175b41029l197j285O85K545M447O592Q892J1206J3711J6612J9775K3049K6617
58162a11380L0668L4964f508C7200M8659N3750N8365O2244O5242O6685O5675O1895
58150E19715N5507M6591L5408K3061J1038J48r373j6955k1871k4224k4651k3235
58138E71159j9753j4876r612l514N040J6652L0832M8326P0988R8861J30695J68746
$$ plain form
58223 -218400 -186190 -149253 -107218 -59828 -6792 52030 116310 185164 257209 330329 401475 467050
58211 467050 523633 568458 599624 616381 619311 609989 590393 562628 528883 491167 450967 409293
58199 409293 366930 324428 281976 239657 197805 156915 117308 79152 42761 8513 -23464 -53264
58187 -53264 -80823 -105956 -128679 -149214 -167645 -183898 -198054 -210344 -220843 -229427 -236100 -241029
58175 -241029 -244226 -245511 -244826 -242281 -237834 -231242 -222350 -211144 -197433 -180821 -161046 -137997 -111380
58162 -111380 -80712 -45748 -6508 37200 85859 139609 197974 260218 325460 392145 457820 519715
58150 519715 575222 621813 657221 680282 691320 691468 682095 665140 643269 619045 594394 571159
58138 571159 551406 536530 526918 523404 528444 545096 575928 624254 695242 794103 924798 1093544
58126A093544K17773K73318L13178L08710K48836J50696M5306m4273j10391j53930
58116B342767j77780j86483j86155j81404j73721j63581j52256j40885j29440
58107H51062j17748j06378r5795q5745p6170o7749o0863n4916m9290m4198l9952
58096E2258A6079a6352k8953k6067k3569k1164j9054j7449j6004j4368j2762j1480
58084b07222j0263q770p245o077n111l950k638j426j79J417L271N114P039R320
58070b26720J1871J4469J7218K0395K3952K7709L1802L6429a517D4607N0564N4517
58058A49688N7384N8352N7029N3368M7224L8554K7959J6439M772o521j6755k5259
58046D62234l1900l6959m0547m2627m3469m3539m2991m1751m0012l8156B4056
$$ plain form
58126 1093544 1311317 1584635 1897813 2206523 2455359 2606055 2651361 2607088 2496697 2342767
58116 2342767 2164987 1978504 1792349 1610945 1437224 1273643 1121387 980502 851062
58107 851062 733314 626936 531141 445396 369226 301477 240614 185698 136408 92210 52258
58096 52258 16079 -16352 -45305 -71372 -94941 -116105 -135159 -152608 -168612 -182980 -195742 -207222
58084 -207222 -217485 -226255 -233500 -239577 -244688 -248638 -251276 -252702 -252881 -251464 -248193 -243079 -236040 -226720
58070 -226720 -214849 -200380 -183162 -162767 -138815 -111106 -79304 -42875 -1517 44607 95171 149688
58058 149688 207072 265424 322453 375821 423045 461599 489558 505997 510769 504248 487493 462234
58046 462234 430334 393375 352828 310201 266732 223193 180202 138451 98439 60283 24056
58034i967l1649k9403k7321k5153k2935k0948j9185j7355j5428j3686j2191j0698
58022b55919r118p625o227m725l120j622k05J399L245N118O999R123J1548J4073
58008b37056J6595J9169K1644K3730K5466K7202K9120L1168i498B6738L9365M2309
57996A08412M4651M6079M5961M3426L8130L0435K0914J0106j147j1747k0960k8643
57984C25617l4764l9159m1924m3483m4125m3864C5443f051l9992l8197l6132l4110
57972a54482l2262l0365k8318k6349k4578k2831k1057j9498j8234j7001j5662
57961d10637j4429j3429j2451j1362j0345r521q720p825o997o311n569m687l859
57948e26142l212k613k063j854k176k855l688m678n731o552p009p302p555p628
$$ plain form
58034 -9967 -41616 -71019 -98340 -123493 -146428 -167376 -186561 -203916 -219344 -233030 -245221 -255919
58022 -255919 -265037 -272662 -278889 -283614 -286734 -288356 -288561 -287162 -283917 -278799 -271800 -262677 -251129 -237056
58008 -237056 -220461 -201292 -179648 -155918 -130452 -103250 -74130 -42962 -9498 26738 66103 108412
57996 108412 153063 199142 245103 288529 326659 357094 378008 388114 386967 375220 354260 325617
57984 325617 290853 251694 209770 166287 122162 78298 35443 -6051 -46043 -84240 -120372 -154482
57972 -154482 -186744 -217109 -245427 -271776 -296354 -319185 -340242 -359740 -377974 -394975 -410637
57961 -410637 -425066 -438495 -450946 -462308 -472653 -482174 -490894 -498719 -505716 -512027 -517596 -522283 -526142
57948 -526142 -529354 -531967 -534030 -535884 -538060 -540915 -544603 -549281 -555012 -561564 -568573 -575875 -583430 -591058
57934e91058p490p337p251p041o670o374o241o047n708n473n437n344n067m832
57920f77370m774m659m360m095m015l912l645l415l375l337l167l040l051k978
57906g29193k705k501k542k605k513k440k536k618k534k467k551k577k413k288
57892g64483k373k442k302k144k159k167j992j827j844j860j701j538j553j576
57878g91961j442j360j505j671j633j552j615j665j525j369j380j377j165r23
57864h12143q56q10n60k57j13LK83N99P88J019J475J991K343K586K773K638J976
57847g96265J035J34p61j741k576l047l341l699l966l929l759l696l609l296k935
57832h35451k760k619k270j855j610j388r50m27q4J86N93R76J062R60R46R31O79
$$ plain form
57934 -591058 -598548 -605885 -613136 -620177 -626847 -633221 -639462 -645509 -651217 -656690 -662127 -667471 -672538 -677370
57920 -677370 -682144 -686803 -691163 -695258 -699273 -703185 -706830 -710245 -713620 -716957 -720124 -723164 -726215 -729193
57906 -729193 -731898 -734399 -736941 -739546 -742059 -744499 -747035 -749653 -752187 -754654 -757205 -759782 -762195 -764483
57892 -764483 -766856 -769298 -771600 -773744 -775903 -778070 -780062 -781889 -783733 -785593 -787294 -788832 -790385 -791961
57878 -791961 -793403 -794763 -796268 -797939 -799572 -801124 -802739 -804404 -805929 -807298 -808678 -810055 -811220 -812143
57864 -812143 -812999 -813809 -814369 -814626 -814739 -814736 -814453 -813854 -813066 -812047 -810572 -808581 -806238 -803652 -800879 -798241 -796265
57847 -796265 -795230 -795096 -795857 -797598 -800174 -803221 -806562 -810261 -814227 -818156 -821915 -825611 -829220 -832516 -835451
57832 -835451 -838211 -840830 -843100 -844955 -846565 -847953 -848903 -849330 -849414 -849228 -848635 -847659 -846597 -845637 -844691 -843760 -843081
57815h43081K74l2k94o94j113j332j448j650j823j779j680j739j791j554j143
57800h60879q49o09j97L01O65J002J538K180K690L105L502L637L232K465J710
57785h36507J003K30m21o81o77o76n79j73L85P99J179J800K569L195L768M569
57769h20217N522O368P199Q319R693J1092J2581J4384J6417J8471K0670K3284
57757f66217K6211K9181L2291L5783L9469M2945M6137M9113N1506N2704N2461
57746b08416N0791M7436M2083c3119f343A1462Q279j225H625h765k3881k9284
57734f1930l3328l6103l7988l9100l9335l8890l8176l7253l5917l4302l2756l1275
57722d96353k9570k7697k6001k4499k2932k1325j9986j8873j7686j6448j5460
$$ plain form
57815 -843081 -842807 -842839 -843133 -843827 -844940 -846272 -847720 -849370 -851193 -852972 -854652 -856391 -858182 -859736 -860879
57800 -860879 -861728 -862337 -862534 -862233 -861568 -860566 -859028 -856848 -854158 -851053 -847551 -843914 -840682 -838217 -836507
57785 -836507 -835504 -835274 -835695 -836376 -837053 -837729 -838308 -838481 -838096 -837297 -836118 -834318 -831749 -828554 -824786 -820217
57769 -820217 -814695 -808327 -801128 -792809 -783116 -772024 -759443 -745059 -728642 -710171 -689501 -666217
57757 -666217 -640006 -610825 -578534 -542751 -503282 -460337 -414200 -365087 -313581 -260877 -208416
57746 -208416 -157625 -110189 -68106 -33119 -6343 11462 19741 18516 8625 -8765 -32646 -61930
57734 -61930 -95258 -131361 -169349 -208449 -247784 -286674 -324850 -362103 -398020 -432322 -465078 -496353
57722 -496353 -525923 -553620 -579621 -604120 -627052 -648377 -668363 -687236 -704922 -721370 -736830
57711g36830j4709j3890j3004j2315j1786j1119j0342r763r365q829q150p618
57699h67720p213o645n958n489n222m819m241l788l471l007k391j922j607j150
57685i24643n78k26r7J35M86O20M98M30M09O7o81j501k266l187m233n058n584
57668i45409o085o596o820o743o692o766o711o490o378o391o248n928n739n673
57654a034669n391m881m502m346m101l679l347l138k768k216j801j552j134n08
57640a078033k0K73P20J401J993K398K941L706M409M968N671O568P349P976Q791
57625a018889R881J0922J1841J2972J4420J5907J7400J9270K1608K4081K6584
57614h34003K9449L2799L6345M0008M4092M8674N3391N8062O2846O7560P1569
$$ plain form
57711 -736830 -751539 -765429 -778433 -790748 -802534 -813653 -823995 -833758 -843123 -851952 -860102 -867720
57699 -867720 -874933 -881578 -887536 -893025 -898247 -903066 -907307 -911095 -914566 -917573 -919964 -921886 -923493 -924643
57685 -924643 -925221 -925447 -925544 -925409 -924923 -924303 -923805 -923375 -922966 -922899 -923580 -925081 -927347 -930534 -934767 -939825 -945409
57668 -945409 -951494 -958090 -964910 -971653 -978345 -985111 -991822 -998312 -1004690 -1011081 -1017329 -1023257 -1028996 -1034669
57654 -1034669 -1040060 -1044941 -1049443 -1053789 -1057890 -1061569 -1064916 -1068054 -1070822 -1073038 -1074839 -1076391 -1077525 -1078033
57640 -1078033 -1078053 -1077780 -1077060 -1075659 -1073666 -1071268 -1068327 -1064621 -1060212 -1055244 -1049573 -1043005 -1035656 -1027680 -1018889
57625 -1018889 -1009008 -998086 -986245 -973273 -958853 -942946 -925546 -906276 -884668 -860587 -834003
57614 -834003 -804554 -771755 -735410 -695402 -651310 -602636 -549245 -491183 -428337 -360777 -289208
57603b89208P4453P6249f1722A3765P2125O7019O0468N2472M3329L3748K4135
57592C67061J4373M522m930j3753k2195l0280l7544m3714m9003n3436n6628A5985
57579d3468n9797n9287n7935n6263n4544n2476m9941m7369m5022m2616l9998l7527
57567f46243l5415l3335l1104k9049k7378k5789k4084k2521k1253j9986j8610
57556i34767j7445j6616j5741j4680j3801j3245j2586j1625j0788j0318r829r046
57544a090487q309p879p438o751o149n868n576n057m658m646m694m542m496m784
57530a171334n094n224n553o336p178p728q249q980r581r752r780r939r946r555
57516a284229r084q810q451p790p153o803o406n711n121n006n090n016m989n213
$$ plain form
57603 -289208 -214755 -138506 -61722 13765 85890 152909 213377 265849 309178 342926 367061
57592 367061 381434 385956 381026 367273 345078 314798 277254 233540 184537 131101 74473 15985
57579 -43468 -103265 -162552 -220487 -276750 -331294 -383770 -433711 -481080 -526102 -568718 -608716 -646243
57567 -646243 -681658 -714993 -746097 -775146 -802524 -828313 -852397 -874918 -896171 -916157 -934767
57556 -934767 -952212 -968828 -984569 -999249 -1013050 -1026295 -1038881 -1050506 -1061294 -1071612 -1081441 -1090487
57544 -1090487 -1098796 -1106675 -1114113 -1120864 -1127013 -1132881 -1138457 -1143514 -1148172 -1152818 -1157512 -1162054 -1166550 -1171334
57530 -1171334 -1176428 -1181652 -1187205 -1193541 -1200719 -1208447 -1216696 -1225676 -1235257 -1245009 -1254789 -1264728 -1274674 -1284229
57516 -1284229 -1293313 -1302123 -1310574 -1318364 -1325517 -1332320 -1338726 -1344437 -1349558 -1354564 -1359654 -1364670 -1369659 -1374872
57502a374872n370n187m967m987m940m559m186m134m094l751l390l312l235k902
57488a433886k633k703k735k382j975j877j804j412r88q52o80j12N54R37J317
57473a451231K019K765L202L646M504N522O326P184Q496J0049J1462J2927J4749
57460a358380J6663J8336K0010K1996K3976K5511K6763K7976K8804K8813K8194
57449a091338K7214K5529K2723J9066J4997J0372M975p48o193j1354j6339k0703
57437a021799k3990k6479k8584l0069l0588l0501l0349l0030k9272k8381k7740
57426a337782k7049k5918k4710k3932k3347k2461k1465k0753k0084j9024j7840
57415a584365j7033j6410j5542j4602j3976j3414j2510j1532j0952j0564r934
$$ plain form
57502 -1374872 -1380242 -1385429 -1390396 -1395383 -1400323 -1404882 -1409068 -1413202 -1417296 -1421047 -1424437 -1427749 -1430984 -1433886
57488 -1433886 -1436519 -1439222 -1441957 -1444339 -1446314 -1448191 -1449995 -1451407 -1452395 -1453247 -1453927 -1454039 -1453485 -1452548 -1451231
57473 -1451231 -1449212 -1446447 -1443245 -1439599 -1435095 -1429573 -1423247 -1416063 -1407567 -1397518 -1386056 -1373129 -1358380
57460 -1358380 -1341717 -1323381 -1303371 -1281375 -1257399 -1231888 -1205125 -1177149 -1148345 -1119532 -1091338
57449 -1091338 -1064124 -1038595 -1015872 -996806 -981809 -971437 -966462 -967210 -973403 -984757 -1001096 -1021799
57437 -1021799 -1045789 -1072268 -1100852 -1130921 -1161509 -1192010 -1222359 -1252389 -1281661 -1310042 -1337782
57426 -1337782 -1364831 -1390749 -1415459 -1439391 -1462738 -1485199 -1506664 -1527417 -1547501 -1566525 -1584365
57415 -1584365 -1601398 -1617808 -1633350 -1647952 -1661928 -1675342 -1687852 -1699384 -1710336 -1720900 -1730834
57404a730834r284r024q901q462p983p956q157q100p995q314q839r112r356j0005
57390a852322j0736j0951j0830j0914j1075j0869j0526j0540j0702j0496j0124
57379a970085j0106j0263j0058r660r566r606r277q753q550q508q145p669p578
57366b087824p672p422p022p010p187p011o666o687o859o616o139o016o085n772
57352b181988n269n195n402n263m876m813m977m824m532m694n163n324n277n591
57338b253188o129o293o204o478p002p180p106p367p857p979p852q097q621q856
57324b356209q932r448j0220j0521j0405j0534j0877j0840j0533j0607j0990j1004
57312b481120j0700j0724j1038j1015j0717j0766j1079j1002j0611j0594j0906
$$ plain form
57404 -1730834 -1740118 -1749142 -1758043 -1766505 -1774488 -1782444 -1790601 -1798701 -1806696 -1815010 -1823849 -1832961 -1842317 -1852322
57390 -1852322 -1863058 -1874009 -1884839 -1895753 -1906828 -1917697 -1928223 -1938763 -1949465 -1959961 -1970085
57379 -1970085 -1980191 -1990454 -2000512 -2010172 -2019738 -2029344 -2038621 -2047374 -2055924 -2064432 -2072577 -2080246 -2087824
57366 -2087824 -2095496 -2102918 -2109940 -2116950 -2124137 -2131148 -2137814 -2144501 -2151360 -2157976 -2164115 -2170131 -2176216 -2181988
57352 -2181988 -2187257 -2192452 -2197854 -2203117 -2207993 -2212806 -2217783 -2222607 -2227139 -2231833 -2236996 -2242320 -2247597 -2253188
57338 -2253188 -2259317 -2265610 -2271814 -2278292 -2285294 -2292474 -2299580 -2306947 -2314804 -2322783 -2330635 -2338732 -2347353 -2356209
57324 -2356209 -2365141 -2374589 -2384809 -2395330 -2405735 -2416269 -2427146 -2437986 -2448519 -2459126 -2470116 -2481120
57312 -2481120 -2491820 -2502544 -2513582 -2524597 -2535314 -2546080 -2557159 -2568161 -2578772 -2589366 -2600272
57301b600272j0859j0458j0379j0666j0732j0613j0865j1343j1360j1005j0984
57290b719536j1236j1075j0572j0449j0653j0429r805r529r610r308q603q219
57278b839024q158p682o769o121n724m830l432k315j538m06J058K056K583L494
57264b876808M932O109O831P686Q640Q929Q552Q336Q433Q176P626P665Q424R137
57250b767332R764J1202J3628J6205J8675K1688K5304K8744L1954L5856M0699
57239b513613M5766N0938N7067O4364P1993P9560Q7522R5816J03680J11335J20331
57228a625241J31854J46125J63791J86252K14061K46459b53649G0895L71466M23633
57218H65994M82096N50447O33367P34135Q53196R86976J125091J246246J316637
$$ plain form
57301 -2600272 -2611131 -2621589 -2631968 -2642634 -2653366 -2663979 -2674844 -2686187 -2697547 -2708552 -2719536
57290 -2719536 -2730772 -2741847 -2752419 -2762868 -2773521 -2783950 -2793755 -2803284 -2812894 -2822202 -2830805 -2839024
57278 -2839024 -2847182 -2854864 -2861633 -2867754 -2873478 -2878308 -2881740 -2884055 -2885593 -2885999 -2884941 -2882885 -2880302 -2876808
57264 -2876808 -2871876 -2865767 -2858936 -2851250 -2842610 -2833681 -2825129 -2816793 -2808360 -2800184 -2792558 -2784893 -2776469 -2767332
57250 -2767332 -2757568 -2746366 -2732738 -2716533 -2697858 -2676170 -2650866 -2622122 -2590168 -2554312 -2513613
57239 -2513613 -2467847 -2416909 -2359842 -2295478 -2223485 -2143925 -2056403 -1960587 -1856907 -1745572 -1625241
57228 -1625241 -1493387 -1347262 -1183471 -997219 -783158 -536699 -253649 70895 442361 865994
57218 865994 1348090 1898537 2531904 3266039 4119235 5106211 6231302 7477548 8794185
57209H794185J296972J160561R12485N92191K53915n8312l20628n23909o67470
57200A1439990p58046q07547q27028q23595q02861p70810p31873o88021o41145
57191D589064n93980n47934n02576m58372m17529l81190l48288l18143k91752
57182G29300k69520B09677b2935k17630k04969j92944j80796j69629j59976j50763
57172a299642j41663j33963j28041j22406j16305j10859j06569j02232r7401r3445
57162b452526r0875q8190q4558q1176p8730p6091p2781p0190o8923o7537o5254
57151c296831o3386o2701o1925o0284n8944n8479n7537n5492n3833n3356n2695
57140c935463n1114n0089n0446n0665m9693m8734m8596m8042m6452m5360m5548
$$ plain form
57209 8794185 10091157 11251718 12164203 12756394 13010309 12951997 12631369 12107460 11439990
57200 11439990 10681944 9874397 9047369 8223774 7420913 6650103 5918230 5230209 4589064
57191 4589064 3995084 3447150 2944574 2486202 2068673 1687483 1339195 1021052 729300
57182 729300 459780 209677 -22935 -240565 -445534 -638478 -819274 -988903 -1148879 -1299642
57172 -1299642 -1441305 -1575268 -1703309 -1825715 -1942020 -2052879 -2159448 -2261680 -2359081 -2452526
57162 -2452526 -2543401 -2631591 -2716149 -2797325 -2876055 -2952146 -3024927 -3095117 -3164040 -3231577 -3296831
57151 -3296831 -3360217 -3422918 -3484843 -3545127 -3604071 -3662550 -3720087 -3775579 -3829412 -3882768 -3935463
57140 -3935463 -3986577 -4036666 -4087112 -4137777 -4187470 -4236204 -4284800 -4332842 -4379294 -4424654 -4470202
57129d470202m5423m4109m3265m3991m4809m4676m5008m6699m8105m8097m8204
57118d972588m9575n0775n0767n1040n2576n3707n3313n3059n4098n4759n3874
57107e550131n3262n4340n5434n5007n4325n4385n3595n1255m9815n0770n1641
57096f133960n0181m8151m7841m8226m7877m8157n0088n1322m9799m7250m5773
57085f668625m4235m1405l9157l8971l8670l6247l3485l2252l0802k7355k3551
57074g054755k0611j6056q094P36Q315J7094K9312M2457N3672O4205P5187Q4039
57062f724499Q9929R7602J10523J25368J38746J53682J73259J93466K09442K23656
57052e208826K40887K60282K80005L04570L39141L80778M23052M64936N07772
$$ plain form
57129 -4470202 -4515625 -4559734 -4602999 -4646990 -4691799 -4736475 -4781483 -4828182 -4876287 -4924384 -4972588
57118 -4972588 -5022163 -5072938 -5123705 -5174745 -5227321 -5281028 -5334341 -5387400 -5441498 -5496257 -5550131
57107 -5550131 -5603393 -5657733 -5713167 -5768174 -5822499 -5876884 -5930479 -5981734 -6031549 -6082319 -6133960
57096 -6133960 -6184141 -6232292 -6280133 -6328359 -6376236 -6424393 -6474481 -6525803 -6575602 -6622852 -6668625
57085 -6668625 -6712860 -6754265 -6793422 -6832393 -6871063 -6907310 -6940795 -6973047 -7003849 -7031204 -7054755
57074 -7054755 -7075366 -7091422 -7099516 -7098780 -7090465 -7073371 -7044059 -7001602 -6947930 -6883725 -6808538 -6724499
57062 -6724499 -6634570 -6536968 -6426445 -6301077 -6162331 -6008649 -5835390 -5641924 -5432482 -5208826
57052 -5208826 -4967939 -4707657 -4427652 -4123082 -3783941 -3403163 -2980111 -2515175 -2007403
57043b007403N48827N86566b44808D32210P32777P88241Q45336R10149R84088
57034D692801J067997J167594J284014J407069J531296J672137J852719K082025
57026A6757652K362049K709215L148270L686191M309526N008604N794889O707360
57018E0483756P825492R260140J1071720J3154631J5233153J7072274J8798667
57011A42899833K1014698K4408950K8960243L3376268L5485260L3540199K7414284
57004C47099735J8623129R224922O96570o332848j1685207j5311357j7324089
56997C24990855j8079573j8056236j7659342j7144751j6640321j6168042j5673250
56990B05569340j5087787j4376576j3531202j2559662j1505538j0447120r448183
$$ plain form
57043 -2007403 -1458576 -872010 -244808 432210 1164987 1953228 2798564 3708713 4692801
57034 4692801 5760798 6928392 8212406 9619475 11150771 12822908 14675627 16757652
57026 16757652 19119701 21828916 24977186 28663377 32972903 37981507 43776396 50483756
57018 50483756 58309248 67569388 78641108 91795739 107028892 124101166 142899833
57011 142899833 163914531 188323481 217283724 250659992 286145252 319685451 347099735
57004 347099735 365722864 374947786 375644356 369311508 357626301 342314944 324990855
56997 324990855 306911282 288855046 271195704 254050953 237410632 221242590 205569340
56990 205569340 190481553 176104977 162573775 150014113 138508575 128061455 118613272
56983A18613272q523420p666731o889371o207810n613519n081367m598588m166204
56975F9866262l781609l438560l137295k878131k650858k444267k259887k103226
56967D7172429j967698j840287j717862j605703j504696j411656j328180j257684
56959C4538663j196386j136883j077932j022197r67973r11919q56846q08429p66775
56950B5793323p28571o94212o65230o37951o07475n75360n46278n19973m93511
56941B0324762m68625m49367m34695m20289m05693l93097l81097l66412l50186
56932A6655301l36337l25026l13573l02280k93439k85959k76687k65911k56365
56923A3999724k48036k39123k30735k25336k21668k16168k08512k01105j94324
$$ plain form
56983 118613272 110089852 102423121 95533750 89325940 83712421 78631054 74032466 69866262
56975 69866262 66084653 62646093 59508798 56630667 53979809 51535542 49275655 47172429
56967 47172429 45204731 43364444 41646582 40040879 38536183 37124527 35796347 34538663
56959 34538663 33342277 32205394 31127462 30105265 29137292 28225373 27368527 26560098 25793323
56950 25793323 25064752 24370540 23705310 23067359 22459884 21884524 21338246 20818273 20324762
56941 20324762 19856137 19406770 18972075 18551786 18146093 17752996 17371899 17005487 16655301
56932 16655301 16318964 15993938 15680365 15378085 15084646 14798687 14522000 14256089 13999724
56923 13999724 13751688 13512565 13281830 13056494 12834826 12618658 12410146 12209041 12014717
56914A2014717j87006j80403j76738j74743j71187j66020j61661j58180j53681
56905A0485098j48508j44634j41555j37092j31601j27283j24055j20071j15687
56896I294612j12831j11043j08133j04213j01261r9217r6281r2638r0123q8679
56886H290193q6728q4562q3801q3934q2914q0808p9390p8540p6564p3686p1782
56875G407484p0876o9306o7067o5671o4909o3118o0439n8659n7918n6713n5003
56864F717805n4111n3725n2169m9644m8166m8183m8247m7954m8268m8902m8379
56853F170057m6819m5876m5791m5239m4099m3616m3754m3142m1769m1025m0991
56842E687936m0272l8713l7620l7161l6144l4525l3580l3428l2842l1744l1346
$$ plain form
56914 12014717 11827711 11647308 11470570 11295827 11124640 10958620 10796959 10638779 10485098
56905 10485098 10336590 10191956 10050401 9913309 9781708 9654425 9530370 9410299 9294612
56896 9294612 9181781 9070738 8962605 8858392 8757131 8657914 8561633 8468995 8378872 8290193
56886 8290193 8203465 8118903 8035102 7951168 7868254 7787446 7708056 7629516 7552952 7479266 7407484
56875 7407484 7336608 7267302 7200235 7134564 7069655 7006537 6946098 6887439 6829521 6772808 6717805
56864 6717805 6663694 6609969 6557800 6508156 6459990 6411807 6363560 6315606 6267338 6218436 6170057
56853 6170057 6123238 6077362 6031571 5986332 5942233 5898617 5854863 5811721 5769952 5728927 5687936
56842 5687936 5647664 5608951 5571331 5534170 5498026 5463501 5429921 5396493 5363651 5331907 5300561
56831E300561l1701l1492l0526k9974k9934k9216k7674k6383k5314k3322k0752
56820D994273j9540k0346k1856k3270k5175k7569k9345l0225l1070l1898l1650
56809D702329l0331k9229k8657k7553k5684k4112k3100k1646j9495j7579j6097
56798D438846j4128j1501r081p047m938l662n119r353j4193j8145k1568k4608
56786D295503k6342k6623k6646k6868k6360k4846k3439k2633k1524j9711j8066
56775D032445j6864j5130j2585j0286q324m932Q41P028J0443R395M116l976j2543
56762C979628j9270k3484k6110k7702k7823k6552k4992k3756k2418k0943k0138
56751C716440k0124j9909j9023j8110j7390j6031j3662j0955q279n317k696k251
$$ plain form
56831 5300561 5268860 5237368 5206842 5176868 5146934 5117718 5090044 5063661 5038347 5015025 4994273
56820 4994273 4974733 4954387 4932531 4909261 4884086 4856517 4827172 4796947 4765877 4733979 4702329
56809 4702329 4671998 4642769 4614112 4586559 4560875 4536763 4513663 4492017 4472522 4454943 4438846
56798 4438846 4424718 4413217 4404136 4397089 4392151 4388489 4383370 4374017 4359824 4341679 4320111 4295503
56786 4295503 4269161 4242538 4215892 4189024 4162664 4137818 4114379 4091746 4070222 4050511 4032445
56775 4032445 4015581 4000451 3987866 3977580 3969256 3964324 3965165 3972193 3982636 3992031 3996147 3992171 3979628
56762 3979628 3960358 3936874 3910764 3883062 3855239 3828687 3803695 3779939 3757521 3736578 3716440
56751 3716440 3696316 3676407 3657384 3639274 3621884 3605853 3592191 3581236 3572957 3567640 3564944 3562693
56739C562693m788q979j3166j6901k0027k1863k2280k2209k2249k1933k0982k0080
56727C347236j9622j9001j7880j6889j6381j5680j4384j3128j2385j1592j0251
56716C180043q754p572o659o327p345r591j1766j3091j4095j5186j5767j5482
56704C048408j5028j4936j4720j4039j3484j3451j3399j2932j2573j2675j2663
56693B898508j2189j1808j1891j1871j1372j0967j1049j1054j0553j0081j0057
56682B775616r969r439r023r180r399r185q919q963q898q436q099q254q394q118
56668B651340p901q108q240p922p688p982q313q217q087q293q385p996p629p718
56654B538861p840p589p392p629p828p538p182p187p165o757o420o566o739o469
$$ plain form
56739 3562693 3557905 3548926 3535760 3518859 3498832 3476969 3454689 3432480 3410231 3388298 3367316 3347236
56727 3347236 3327614 3308613 3290733 3273844 3257463 3241783 3227399 3214271 3201886 3190294 3180043
56716 3180043 3171289 3163717 3157058 3150731 3143386 3133795 3122029 3108938 3094843 3079657 3063890 3048408
56704 3048408 3033380 3018444 3003724 2989685 2976201 2962750 2949351 2936419 2923846 2911171 2898508
56693 2898508 2886319 2874511 2862620 2850749 2839377 2828410 2817361 2806307 2795754 2785673 2775616
56682 2775616 2765647 2756208 2747185 2738005 2728606 2719421 2710502 2701539 2692641 2684205 2676106 2667852 2659458 2651340
56668 2651340 2643439 2635331 2627091 2619169 2611481 2603499 2595186 2586969 2578882 2570589 2562204 2554208 2546579 2538861
56654 2538861 2531021 2523432 2516040 2508411 2500583 2493045 2485863 2478676 2471511 2464754 2458334 2451768 2445029 2438560
56640B438560o169o282o449o270o134o439o760o645o472o676o862o593o233o248
56626B348328o329o088n883o124o454o485o584p145p744p881p848q059q169p782
56612B249753p275p113o987o491n993n960o079n879n602n617n597n158m685m679
56598B166638m852m738m579m768n014m909m779n055n397n302n039n100n241m993
56584B096872m579m466m475m204l898l979m206m118l907l987m171m073l919m105
56570B038785m395m360m203m334m558m509m404m627m939m925m795m935n104m882
56556A973815m499m395m416m197l949m034m200m044l820l989m313m310m147m283
56542A915219m569m576m430m491m580m332l995m022m216m118l882l948m146m026
$$ plain form
56640 2438560 2432391 2426109 2419660 2413390 2407256 2400817 2394057 2387412 2380940 2374264 2367402 2360809 2354576 2348328
56626 2348328 2341999 2335911 2330028 2323904 2317450 2310965 2304381 2297236 2289492 2281611 2273763 2265704 2257535 2249753
56612 2249753 2242478 2235365 2228378 2221887 2215894 2209934 2203855 2197976 2192374 2186757 2181160 2176002 2171317 2166638
56598 2166638 2161786 2157048 2152469 2147701 2142687 2137778 2132999 2127944 2122547 2117245 2112206 2107106 2101865 2096872
56584 2096872 2092293 2087827 2083352 2079148 2075250 2071271 2067065 2062947 2059040 2055053 2050882 2046809 2042890 2038785
56570 2038785 2034390 2030030 2025827 2021493 2016935 2012426 2008022 2003395 1998456 1993531 1988736 1983801 1978697 1973815
56556 1973815 1969316 1964921 1960505 1956308 1952359 1948325 1944125 1940081 1936261 1932272 1927959 1923649 1919502 1915219
56542 1915219 1910650 1906074 1901644 1897153 1892573 1888241 1884246 1880224 1876008 1871890 1868008 1864060 1859914 1855888
56528A855888l738l743l945l921l767l865m070l965l700l705l882l806l584l625
56514A802572l836l802l594l579l669l541l338l419l644l610l440l497l645l503
56500A752455l240l281l494l445l246l313l563l572l414l472l666l611l409l442
56486A704287l607l503l249l272l465l374l061k981l133l137k988l019l152l046
56472A659300k805k820l000k932k676k654k839k852k728k820l052l022k790k770
56458A619540k941k923k740k746k893k816k593k622k845k838k623k605k771k736
56444A580848k528k545k769k778k553k493k629k601k384k332k445k378k128k041
56430A546244k121k055j886j988k291k366k212k234k474k556k451k523k775k830
$$ plain form
56528 1855888 1852150 1848407 1844462 1840541 1836774 1832909 1828839 1824874 1821174 1817469 1813587 1809781 1806197 1802572
56514 1802572 1798736 1794934 1791340 1787761 1784092 1780551 1777213 1773794 1770150 1766540 1763100 1759603 1755958 1752455
56500 1752455 1749215 1745934 1742440 1738995 1735749 1732436 1728873 1725301 1721887 1718415 1714749 1711138 1707729 1704287
56486 1704287 1700680 1697177 1693928 1690656 1687191 1683817 1680756 1677775 1674642 1671505 1668517 1665498 1662346 1659300
56472 1659300 1656495 1653675 1650675 1647743 1645067 1642413 1639574 1636722 1633994 1631174 1628122 1625100 1622310 1619540
56458 1619540 1616599 1613676 1610936 1608190 1605297 1602481 1599888 1597266 1594421 1591583 1588960 1586355 1583584 1580848
56444 1580848 1578320 1575775 1573006 1570228 1567675 1565182 1562553 1559952 1557568 1555236 1552791 1550413 1548285 1546244
56430 1546244 1544123 1542068 1540182 1538194 1535903 1533537 1531325 1529091 1526617 1524061 1521610 1519087 1516312 1513482
56416A513482k667k661k834k815k599k581k781k790k556k501k712k781k591k498
56402A476115k620k646k486k447k591k596k384k283k380k389k255k261k433k441
56388A441903k258k211k340k307k062j971k103k128j964j907k023k000j805j773
56374A413051j950j989j825j814k045k169k084k123k390k547k469k446k591k626
56360A381983k485k476k668k736k567k468k556k545k343k240k310k257k014j914
56346A348404k062k121j959j880k017k094j993j968k106k094j831j636j671j683
56332A321289j557j538j696j746j621j625j842j943j817j798k036k210k134k064
56318A295662k166k209k077k002k076k018j747j583j670j716j583j540j703j778
$$ plain form
56416 1513482 1510815 1508154 1505320 1502505 1499906 1497325 1494544 1491754 1489198 1486697 1483985 1481204 1478613 1476115
56402 1476115 1473495 1470849 1468363 1465916 1463325 1460729 1458345 1456062 1453682 1451293 1449038 1446777 1444344 1441903
56388 1441903 1439645 1437434 1435094 1432787 1430725 1428754 1426651 1424523 1422559 1420652 1418629 1416629 1414824 1413051
56374 1413051 1411101 1409112 1407287 1405473 1403428 1401259 1399175 1397052 1394662 1392115 1389646 1387200 1384609 1381983
56360 1381983 1379498 1377022 1374354 1371618 1369051 1366583 1364027 1361482 1359139 1356899 1354589 1352332 1350318 1348404
56346 1348404 1346342 1344221 1342262 1340382 1338365 1336271 1334278 1332310 1330204 1328110 1326279 1324643 1322972 1321289
56332 1321289 1319732 1318194 1316498 1314752 1313131 1311506 1309664 1307721 1305904 1304106 1302070 1299860 1297726 1295662
56318 1295662 1293496 1291287 1289210 1287208 1285132 1283114 1281367 1279784 1278114 1276398 1274815 1273275 1271572 1269794
56304A269794j627j540j669j729j584j528j699j780j605j490j637j762j640j530
56290A246974j645j766j686j619j742j852j770j686j742j741j586j534j704j811
56276A223090j677j575j685j747j577j430j519j613j499j384j469j563j475j396
56262A201481j495j586j503j438j530j576j440j345j449j519j387j313j467j592
56248A180841j459j303j358j433j306j155j206j296j203j078j114j156j022q53
56234A163899q18q01o94o90r13j143j201j292j571j803j782j709j790j856j716
56219A144120j576j631j702j587j462j530j617j517j403j476j580j501j398j464
56205A122676j541j437j317j397j511j444j337j378j416j287j168j254j357j278
$$ plain form
56304 1269794 1268167 1266627 1264958 1263229 1261645 1260117 1258418 1256638 1255033 1253543 1251906 1250144 1248504 1246974
56290 1246974 1245329 1243563 1241877 1240258 1238516 1236664 1234894 1233208 1231466 1229725 1228139 1226605 1224901 1223090
56276 1223090 1221413 1219838 1218153 1216406 1214829 1213399 1211880 1210267 1208768 1207384 1205915 1204352 1202877 1201481
56262 1201481 1199986 1198400 1196897 1195459 1193929 1192353 1190913 1189568 1188119 1186600 1185213 1183900 1182433 1180841
56248 1180841 1179382 1178079 1176721 1175288 1173982 1172827 1171621 1170325 1169122 1168044 1166930 1165774 1164752 1163899
56234 1163899 1163081 1162280 1161586 1160896 1159983 1158840 1157639 1156347 1154776 1152973 1151191 1149482 1147692 1145836 1144120
56219 1144120 1142544 1140913 1139211 1137624 1136162 1134632 1133015 1131498 1130095 1128619 1127039 1125538 1124140 1122676
56205 1122676 1121135 1119698 1118381 1116984 1115473 1114029 1112692 1111314 1109898 1108611 1107443 1106189 1104832 1103554
56191A103554j195j312j436j312j135j194j359j336j206j220j319j290j205j248
56177A085787j326j254j138j165j238j177j104j195j335j319j240j263j286j179
56163A068568j095j205j317j200j031j081j228j199j072j084j161j086r47r72
56149A052890j094j091j006j029j108j087j037j099j163j081r97j107j269j251
56135A037471j148j184j283j234j115j127j192j126j045j159j343j320j162j141
56121A020892j244j265j225j304j446j441j334j305j305j158r51r21j040j116
56107A003837j175j375j632j808k105k818l675m024l907m575p527j2907j8845
56094I37464k2424k1647j6800r993l419J867N627P750Q312P868P083O202N230
$$ plain form
56191 1103554 1102359 1101047 1099611 1098299 1097164 1095970 1094611 1093275 1092069 1090849 1089530 1088240 1087035 1085787
56177 1085787 1084461 1083207 1082069 1080904 1079666 1078489 1077385 1076190 1074855 1073536 1072296 1071033 1069747 1068568
56163 1068568 1067473 1066268 1064951 1063751 1062720 1061639 1060411 1059212 1058140 1057056 1055895 1054809 1053862 1052890
56149 1052890 1051796 1050705 1049699 1048670 1047562 1046475 1045438 1044339 1043176 1042095 1041098 1039991 1038722 1037471
56135 1037471 1036323 1035139 1033856 1032622 1031507 1030380 1029188 1028062 1027017 1025858 1024515 1023195 1022033 1020892
56121 1020892 1019648 1018383 1017158 1015854 1014408 1012967 1011633 1010328 1009023 1007865 1006914 1005993 1004953 1003837
56107 1003837 1002662 1001287 999655 997847 995742 992924 989249 985225 981318 976743 969216 956309 937464
56094 937464 915040 893393 876593 866600 863181 865048 870675 878425 886737 894605 901688 907890 913120
56081I13120M363L834L531L192K838K623K442K092J676J429J279J022P29O14N98
56066I45382M61K58J97K26J30l2o2j4j04k97l68l50m37o05o58o09o47p45p46o93
56046I40287p55q72q55p52p57q36q24p63q22r44r37q61r23j073j100j018j009
56029I25186j037r58q48q90r93r37p85p83r06r31q62q82r77r53q48q61r63r61
56011I08811q88r39j057j025q80q62r70r81q97r16j032j043r43r46j054j079j007
55994H92292j009j061r92q42q42r71r91q70q14q52q16p12p34q67r16q67q92r76
55976H76268r34q05q09r39r53q20p69q55q96q61r16j050j058r37r19j024j047
55959H60676r46r23j012r99q42p48q01q21p50p44q35q39p16o72p68q37p95p65
$$ plain form
56081 913120 917483 921317 924848 928040 930878 933501 935943 938035 939711 941140 942419 943441 944170 944784 945382
56066 945382 945843 946101 946298 946524 946654 946622 946560 946546 946442 946145 945777 945427 944990 944385 943727 943118 942471 941726 940980 940287
56046 940287 939532 938660 937805 937053 936296 935460 934636 933873 933051 932107 931170 930309 929386 928313 927213 926195 925186
56029 925186 924149 923191 922343 921453 920460 919523 918738 917955 917049 916118 915256 914374 913397 912444 911596 910735 909772 908811
56011 908811 907923 906984 905927 904902 904022 903160 902190 901209 900312 899396 898364 897321 896378 895432 894378 893299 892292
55994 892292 891283 890222 889230 888388 887546 886575 885584 884714 883900 883048 882232 881520 880786 879919 879003 878136 877244 876268
55976 876268 875334 874529 873720 872781 871828 871008 870239 869384 868488 867627 866711 865661 864603 863666 862747 861723 860676
55959 860676 859730 858807 857795 856796 855954 855206 854405 853584 852834 852090 851255 850416 849700 849028 848260 847423 846628 845863
55941H45863p88p62o81o93p87p89p04p36q90r42q34p77q62r17q56q13q23p49n91
55922H30869n52o66p33o78o83q10q70p67o60o42o02m88m61n73o44n60m63m70n01
55903H19046m82m94n50n22l92l16l64l97l29k65k87k96k23j61j54j14K4J77K88
55884H14189L95N14N84O26P29R08J075J226J462J830K258K688L125L610M163M833
55868H44215N697O897Q495J0166J1414J2723J6196K3622L3211L9415L7396K7478
55856A076925J4411K739n989j2110j5988j7924j8613j8632j7983j6667j5154j3901
55844I41114j2834j1765j0798r995r128q100p213o657o191n588n031m690m377
55831H38747l920l517l347l222k956k712k669k660k490k285k195k117j926j799
$$ plain form
55941 845863 845075 844313 843632 842939 842152 841363 840659 839923 839033 838091 837257 836480 835618 834701 833845 833032 832209 831460 830869
55922 830869 830317 829651 828918 828240 827557 826747 825877 825110 824450 823808 823206 822718 822257 821684 821040 820480 820017 819547 819046
55903 819046 818564 818070 817520 816998 816606 816290 815926 815529 815200 814935 814648 814352 814129 813968 813814 813700 813724 813901 814189
55884 814189 814584 815098 815682 816308 817037 817945 819020 820246 821708 823538 825796 828484 831609 835219 839382 844215
55868 844215 849912 856809 865304 875470 886884 899607 915803 939425 972636 1012051 1049447 1076925
55856 1076925 1091336 1094075 1088086 1075976 1059988 1042064 1023451 1004819 986836 970169 955015 941114
55844 941114 928280 916515 905717 895722 886594 878494 871281 864624 858433 852845 847814 843124 838747
55831 838747 834827 831310 827963 824741 821785 819073 816404 813744 811254 808969 806774 804657 802731 800932
55817H00932j850j891j743j575j573j621j559j480j501j493j351j222j233j240
55803G79600j128j055j147j226j117r53r20r46r04q72r35r73q95q29q72q90q04
55786G63134p76q86r57q77q39r59j021q73p22p72q74q38p72q34q93p95o82p39
55768G48025q43q25p82q61r45q69p45p43p79p23o75p58q38p73o80p12p55o77n94
55749G33448o58p34o63n69o17o95o37n54o09o94o49n71o11o70o01n23o03p09o46
55730G21435n06m94n62n39m84n50o54o30n38n48o15n96n47n90o56o16n47n89o61
55711G10513o12n07m97n22m76m39n27o23n71m62m64n07m55l98m80n95n80n04n26
55692G00768n75n07m16m74n83n61m74n03n95n83n09n21n66n13m35m76n55n03l92
$$ plain form
55817 800932 799082 797191 795448 793873 792300 790679 789120 787640 786139 784646 783295 782073 780840 779600
55803 779600 778472 777417 776270 775044 773927 772974 772054 771108 770204 769332 768397 767424 766529 765700 764828 763938 763134
55786 763134 762358 761472 760515 759638 758799 757840 756819 755946 755224 754452 753578 752740 751968 751134 750241 749446 748764 748025
55768 748025 747182 746357 745575 744714 743769 742900 742155 741412 740633 739910 739235 738477 737639 736866 736186 735474 734719 734042 733448
55749 733448 732790 732056 731393 730824 730207 729512 728875 728321 727712 727018 726369 725798 725187 724517 723916 723393 722790 722081 721435
55730 721435 720929 720435 719873 719334 718850 718300 717646 717016 716478 715930 715315 714719 714172 713582 712926 712310 711763 711174 710513
55711 710513 709901 709394 708897 708375 707899 707460 706933 706310 705739 705277 704813 704306 703851 703453 702973 702378 701798 701294 700768
55692 700768 700193 699686 699270 698796 698213 697652 697178 696675 696080 695497 694988 694467 693901 693388 692953 692477 691922 691419 691027
55673F91027l96m67m50m07n02o51o58n75n75o37n95n05n37o45o52n85o16p21p06
55654F80147n76m99m88m32l45l68m64m79m26m46n17n15m54m48m66l99l20l75n09
55635F71621n55n18n32n77n43m72m72m90m21l59m44n80n75m79m72n36n28m88n48
55616F62032o40o08n12n18n63m62l04l20m83n34m16l17l16l12k96l61m60m42l57
55597F53811l65m46m39l49l32l84l71l20l73m95n15m39m29m76m26l17l11l89l72
55578F46263k91l24m53m80l82l50m15m17l26l03l90m42m25m41m83m33l25l36m59
55559F38788n28n14n45o19n90m86m69n46n56m82m86n68n63m61m33n08n23m37l91
55540F29083m08l86l24l66m86n11m37m32n06n01l93l58m20m35l81m04n00m91l71
$$ plain form
55673 691027 690631 690164 689714 689307 688805 688154 687496 686921 686346 685709 685114 684609 684072 683427 682775 682190 681574 680853 680147
55654 680147 679571 679072 678584 678152 677807 677439 676975 676496 676070 675624 675107 674592 674138 673690 673224 672825 672505 672130 671621
55635 671621 671066 670548 670016 669439 668896 668424 667952 667462 667041 666682 666238 665658 665083 664604 664132 663596 663068 662580 662032
55616 662032 661392 660784 660272 659754 659191 658729 658425 658105 657622 657088 656672 656355 656039 655727 655431 655070 654610 654168 653811
55597 653811 653446 653000 652561 652212 651880 651496 651125 650805 650432 649937 649422 648983 648554 648078 647652 647335 647024 646635 646263
55578 646263 645972 645648 645195 644715 644333 643983 643568 643151 642825 642522 642132 641690 641265 640824 640341 639908 639583 639247 638788
55559 638788 638260 637746 637201 636582 635992 635506 635037 634491 633935 633453 632967 632399 631836 631375 630942 630434 629911 629474 629083
55540 629083 628675 628289 627965 627599 627113 626602 626165 625733 625227 624726 624333 623975 623555 623120 622739 622335 621835 621344 620973
55521F20973l28m09m37l56l25l85l94l10k91l72l99l33l31m32m70l77l11l48l77
55502F13988l51l83m72m77l89l91n05n31m14l46m07m28l27k75l80m93m81m35m46
55483F06057m41l60l01l17l12k55k53l28l51k96l02m14m76m14l61l86l69k58k03
55464E99660k96m13m47m61n16n22m64m38m84m83l96l57m01m12l54l53m45m73l97
55445E91548l67m44m78l99l50l91l85k77k28l21l94l35k77l20l55k94k43k86l00
55426E85104k14j61k37l24l09k79l06l14k55k53l67m51m05l45l71l82l01k34k81
55407E79315l49l53l54m04m10l34k96l60m07l71l58m24m49l71l48m60n66n34m65
55388E71702m68m67l90l53m24m71l82k84l06l77l93m18m81m67l38k71l77m81m12
$$ plain form
55521 620973 620645 620236 619799 619443 619118 618733 618339 618029 617738 617366 616967 616634 616303 615871 615401 615024 614713 614365 613988
55502 613988 613637 613254 612782 612305 611916 611525 611020 610489 610075 609729 609322 608894 608567 608292 607912 607419 606938 606503 606057
55483 606057 605616 605256 604955 604638 604326 604071 603818 603490 603139 602843 602541 602127 601651 601237 600876 600490 600121 599863 599660
55464 599660 599364 598951 598504 598043 597527 597005 596541 596103 595619 595136 594740 594383 593982 593570 593216 592863 592418 591945 591548
55445 591548 591181 590737 590259 589860 589510 589119 588734 588457 588229 587908 587514 587179 586902 586582 586227 585933 585690 585404 585104
55426 585104 584890 584729 584492 584168 583859 583580 583274 582960 582705 582452 582085 581634 581229 580884 580513 580131 579830 579596 579315
55407 579315 578966 578613 578259 577855 577445 577111 576815 576455 576048 575677 575319 574895 574446 574075 573727 573267 572701 572167 571702
55388 571702 571234 570767 570377 570024 569600 569129 568747 568463 568157 567780 567387 566969 566488 566021 565683 565412 565035 564554 564142
55369E64142k90k97l86m06l78l90l90l15k58l06l60l20k60k84l44l54l59l98l94
55350E57653k99k33k73l05k41j95k49k97k48k16k90l58l18k91l84m77m36l67m17
55331E51759n06m84l98l71l75l43l39m13m35l20k15k71l75l62k82k97l63l59k99
55312E44952k84k89k53k46l34m17l96l63m28m85l98k63k41k92k86k42k69l19k98
55293E38849k41k41k54k10j79k52l26k82j89j86k34k36k21k74l22k78k24k69l41
55274E34090l31l15l98m91m71m00l99m06l20k39k99m13m21l52l47l70l18k43k74
55255E27283l49l16k17j97k44k50k24k50k74k01j34k04l37l62l01k95l28k79j84
55236E22337j81k50k73k74l47m35m16l37l30l66l33k72l01l73l49k74k96l83l89
$$ plain form
55369 564142 563852 563555 563169 562763 562385 561995 561605 561290 561032 560726 560366 560046 559786 559502 559158 558804 558445 558047 557653
55350 557653 557354 557121 556848 556543 556302 556107 555858 555561 555313 555097 554807 554449 554131 553840 553456 552979 552543 552176 551759
55331 551759 551253 550769 550371 550000 549625 549282 548943 548530 548095 547775 547560 547289 546914 546552 546270 545973 545610 545251 544952
55312 544952 544668 544379 544126 543880 543546 543129 542733 542370 541942 541457 541059 540796 540555 540263 539977 539735 539466 539147 538849
55293 538849 538608 538367 538113 537903 537724 537472 537146 536864 536675 536489 536255 536019 535798 535524 535202 534924 534700 534431 534090
55274 534090 533759 533444 533046 532555 532084 531684 531285 530879 530559 530320 530021 529608 529187 528835 528488 528118 527800 527557 527283
55255 527283 526934 526618 526401 526204 525960 525710 525486 525236 524962 524761 524627 524423 524086 523724 523423 523128 522800 522521 522337
55236 522337 522156 521906 521633 521359 521012 520577 520161 519824 519494 519128 518795 518523 518222 517849 517500 517226 516930 516547 516158
55217E16158l26l27l89l73k85k48k82k95k91l38l77l09k09k15l00l22k82k92l28
55198E10370k87k24k58l47l47k74k72l23l06k34k36k95k94k49k70l22k76j72j64
55179E05220k30k25j60j89l13l68l13k68k75k54k20k65l50l47k67k50l04l05k55
55160E00062k80l65l74k98k66l00k91k28k24k78k61j61j12j62k13k37k93l63l52
55141D95004k78k61l03l07k80l01l40k92k10k08k62k35j54j62k34k24j60j94l12
55122D90287l39k68k67l47l55k69k53l35l50k45j82k29k65k35k27k75k77k25k33
55103D85111l05l04k15k00k95l52k98k54k79k75k09j88k45k77k49k65l25l11k27
55084D80038k26l19l24k02j43k52l74l66l15l15k88j76j01j45k08j99j86k43l00
$$ plain form
55217 516158 515832 515505 515116 514743 514458 514210 513928 513633 513342 513004 512627 512318 512109 511894 511594 511272 510990 510698 510370
55198 510370 510083 509859 509601 509254 508907 508633 508361 508038 507732 507498 507262 506967 506673 506424 506154 505832 505556 505384 505220
55179 505220 504990 504765 504605 504416 504103 503735 503422 503154 502879 502625 502405 502140 501790 501443 501176 500926 500622 500317 500062
55160 500062 499782 499417 499043 498745 498479 498179 497888 497660 497436 497158 496897 496736 496624 496462 496249 496012 495719 495356 495004
55141 495004 494726 494465 494162 493855 493575 493274 492934 492642 492432 492224 491962 491727 491573 491411 491177 490953 490793 490599 490287
55122 490287 489948 489680 489413 489066 488711 488442 488189 487854 487504 487259 487077 486848 486583 486348 486121 485846 485569 485344 485111
55103 485111 484806 484502 484287 484087 483792 483440 483142 482888 482609 482334 482125 481937 481692 481415 481166 480901 480576 480265 480038
55084 480038 479812 479493 479169 478967 478824 478572 478198 477832 477517 477202 476914 476738 476637 476492 476284 476085 475899 475656 475356
55065D75356k84k47k35k09j48j38k10k70k78k90l32l16k43k31l10l46k97k83l60
55046D70329l97l04j86j56j63j37j19j63k27k61k82k75j96r6r7j95k60k44k53
55027D66318l19l26k55k26k91l40l01k63k71k55j87j59k03k17j78j84k46k42j55
55008D61700j27k08k62k21j89k12j93j10r9j88k26j51j04j53j78j08p0j34j67
54989D58600r8o9j62k27j58r7j61k24j45m3n8j03k4J09J45J08J29K03K51K89L60
54968D58625L95L47L13L93N15N82O40P71R33J049J151J311J492J685J975K377
54952D74554K778L134L560M144M765N299N728N966N707M751L295J722K45j081
54938E24567k163k921l422l764l911l843l693l605l539l393l199l039k871k630
$$ plain form
55065 475356 475072 474825 474590 474381 474233 474095 473885 473615 473337 473047 472715 472399 472156 471925 471615 471269 470972 470689 470329
55046 470329 469932 469628 469442 469286 469123 468986 468867 468704 468477 468216 467934 467659 467463 467367 467270 467075 466815 466571 466318
55027 466318 465999 465673 465418 465192 464901 464561 464260 463997 463726 463471 463284 463125 462922 462705 462527 462343 462097 461855 461700
55008 461700 461573 461365 461103 460882 460693 460481 460288 460178 460079 459891 459665 459514 459410 459257 459079 458971 458901 458767 458600
54989 458600 458502 458433 458271 458044 457886 457789 457628 457404 457259 457216 457158 457055 457031 457140 457285 457393 457522 457725 457976 458265 458625
54968 458625 459020 459367 459680 460073 460588 461170 461810 462581 463514 464563 465714 467025 468517 470202 472177 474554
54952 474554 477332 480466 484026 488170 492935 498234 503962 509928 515635 520386 523681 525403 525648 524567
54938 524567 522404 519483 516061 512297 508386 504543 500850 497245 493706 490313 487114 484075 481204 478574
54924D78574k367k168j997j805j655j601j555j423j282j230j200j102j009j003
54910D57177j011r18q00p78q10p78p15p18p37o84o02n81n96n58n03n28n81n54
54892D44725m76m49m74m62m13l94m00l90l86m00l70k73k10k51l08k94k66k99l42
54873D37868l15k79l11l48l16k90l42l86l21k31k45l02k95k61k91l26k59j64j68
54854D32418k32k44k18k55l09k79k16k36l03k92k24k20k72k81k60l01l72l59k76
54835D27269k40k59k59k37k50k63k07j36j57k57l25l35l26k89k01j42j95k80k65
54816D22646j84j66j94j84j43j57j87j43q8j39k49k63j85j48j91k13j83j66j68
54797D19295j32r5j36k14k21j78j98k79l02k36j85j81j78j72k10k59k40j74j43
$$ plain form
54924 478574 476207 474039 472042 470237 468582 466981 465426 464003 462721 461491 460291 459189 458180 457177
54910 457177 456166 455248 454448 453670 452860 452082 451367 450649 449912 449228 448626 448045 447449 446891 446388 445860 445279 444725
54892 444725 444249 443800 443326 442864 442451 442057 441657 441267 440881 440481 440111 439838 439628 439377 439069 438775 438509 438210 437868
54873 437868 437553 437274 436963 436615 436299 436009 435667 435281 434960 434729 434484 434182 433887 433626 433335 433009 432750 432586 432418
54854 432418 432186 431942 431724 431469 431160 430881 430665 430429 430126 429834 429610 429390 429118 428837 428577 428276 427904 427545 427269
54835 427269 427029 426770 426511 426274 426024 425761 425554 425418 425261 425004 424679 424344 424018 423729 423528 423386 423191 422911 422646
54816 422646 422462 422296 422102 421918 421775 421618 421431 421288 421200 421061 420812 420549 420364 420216 420025 419812 419629 419463 419295
54797 419295 419163 419068 418932 418718 418497 418319 418121 417842 417540 417304 417119 416938 416760 416588 416378 416119 415879 415705 415562
54778D15562j41j04n9q9j68j93j71j91k38k32j90k08k64k70k33k43k84k62j91
54759D11831j91k63l04k75k41k21j78j30j43j96k12j90j83j65r6n1j23k43k67
54740D08159k14k04k40k16j36j05j40j67j80k44l05k72j90j86k35k22j50j34j80
54721D04439j77j19j12j55j58j23j50k23k32j83k06k84k82j76j15j61k22k35k46
54702D00880k60k14j46j54k20k21j72k07l08l15k10j63k42l00k60k29k67k69j67
54683C96556q1j07j56j26o9o9r9j17j62k50l11k92k53k46k40k17k23k64k75k45
54663C92754k39k63k45j85j81k46k81k52k38k66k51j48o0n7r5j28j76k26k13j38
54643C88866j07j56k08k18k30k49j99q7k2n7j10j24j35j69j72j37j30j72j89j57
$$ plain form
54778 415562 415421 415317 415258 415169 415001 414808 414637 414446 414208 413976 413786 413578 413314 413044 412811 412568 412284 412022 411831
54759 411831 411640 411377 411073 410798 410557 410336 410158 410028 409885 409689 409477 409287 409104 408939 408843 408792 408669 408426 408159
54740 408159 407945 407741 407501 407285 407149 407044 406904 406737 406557 406313 406008 405736 405546 405360 405125 404903 404753 404619 404439
54721 404439 404262 404143 404031 403876 403718 403595 403445 403222 402990 402807 402601 402317 402035 401859 401744 401583 401361 401126 400880
54702 400880 400620 400406 400260 400106 399886 399665 399493 399286 398978 398663 398453 398290 398048 397748 397488 397259 396992 396723 396556
54683 396556 396475 396368 396212 396086 396017 395948 395849 395732 395570 395320 395009 394717 394464 394218 393978 393761 393538 393274 392999 392754
54663 392754 392515 392252 392007 391822 391641 391395 391114 390862 390624 390358 390107 389959 389899 389842 389747 389619 389443 389217 389004 388866
54643 388866 388759 388603 388395 388177 387947 387698 387499 387412 387390 387333 387223 387099 386964 386795 386623 386486 386356 386184 385995 385838
54623C85838j50j65j49j07j28j93j98j36j23j70j61p7l2p4r3m9n2j68k79k87k37
54602C82810j97j49j09j42k23k27j38j01j76k25j69j15j64k32k16j67j70j87j75
54583C79528j76k23k40j83j22j18j16p8p1j40k06k14k06k18j88j09q4j54k19k10
54563C76253j95k32k47k01j72k31k89k71k37k45k47j95j51j59j57j07q7j38j73
54544C72519j29q7j08j22q2p3j46j96j43q1j01j23q9q3j84k74k35j47j52k09j95
54523C69560j30j29j83j99j71j65j90k03k16k44k32j58j10j65k40k35j87j97k42
54504C65964k44k05j80j62j10o8r4j41j32r7j01j43j60j69j98k09j69j31j48j77
54484C62926j65j42j63j92j83j56j55j58j43j53k09k39k08j67j74j68j13q5j32
$$ plain form
54623 385838 385688 385523 385374 385267 385139 384946 384748 384612 384489 384319 384158 384081 384049 383975 383882 383833 383781 383613 383334 383047 382810
54602 382810 382613 382464 382355 382213 381990 381763 381625 381524 381348 381123 380954 380839 380675 380443 380227 380060 379890 379703 379528
54583 379528 379352 379129 378889 378706 378584 378466 378350 378272 378201 378061 377855 377641 377435 377217 377029 376920 376836 376682 376463 376253
54563 376253 376058 375826 375579 375378 375206 374975 374686 374415 374178 373933 373686 373491 373340 373181 373024 372917 372830 372692 372519
54544 372519 372390 372303 372195 372073 371991 371918 371772 371576 371433 371352 371251 371128 371039 370956 370772 370498 370263 370116 369964 369755 369560
54523 369560 369430 369301 369118 368919 368748 368583 368393 368190 367974 367730 367498 367340 367230 367065 366825 366590 366403 366206 365964
54504 365964 365720 365515 365335 365173 365063 364995 364901 364760 364628 364531 364430 364287 364127 363958 363760 363551 363382 363251 363103 362926
54484 362926 362761 362619 362456 362264 362081 361925 361770 361612 361469 361316 361107 360868 360660 360493 360319 360151 360038 359953 359821
54465C59821j68j21o3q9j55j50r0n8o4q1j28k11k45j81j10j24j83j98j82j96k09
54444C56815j80j54j81j95j31o3q2j56j88j96k31k44j81j00j01j51j69j47j31
54425C53834j14q4r3j60k20k09j72j75j74j34j28j92k35j81j11j20j53j23r0j31
54405C50835j81j32l6j4o0r3j18j66j72r0j2n1j40j58j44j85k29j89j13j14j47
54384C48291j08n1r0j94k23j74j63j85j43m9j9p0j23j61k35k98k47j20o0r6j38
54363C45344j48j82k24j96j09o6r1j30j57k01k24j83j25j28j64j58j41j77k11
54344C42329j59q7j08j81j78j10j03j54j40n9l1p3q2m5p1j61k04j77j76k19k09
54323C39602j37j04j49j73j30r0p8n9k8n4j36j77j41j16j37j46j11j01j32j45
$$ plain form
54465 359821 359653 359532 359469 359380 359225 359075 358985 358927 358863 358782 358654 358443 358198 358017 357907 357783 357600 357402 357220 357024 356815
54444 356815 356635 356481 356300 356105 355974 355911 355829 355673 355485 355289 355058 354814 354633 354533 354432 354281 354112 353965 353834
54425 353834 353720 353636 353543 353383 353163 352954 352782 352607 352433 352299 352171 351979 351744 351563 351452 351332 351179 351056 350966 350835
54405 350835 350654 350522 350486 350472 350412 350319 350201 350035 349863 349773 349761 349710 349570 349412 349268 349083 348854 348665 348552 348438 348291
54384 348291 348183 348132 348042 347848 347625 347451 347288 347103 346960 346911 346892 346822 346699 346538 346303 346005 345758 345638 345578 345482 345344
54363 345344 345196 345014 344790 344594 344485 344419 344328 344198 344041 343840 343616 343433 343308 343180 343016 342858 342717 342540 342329
54344 342329 342170 342083 341975 341794 341616 341506 341403 341249 341109 341050 341019 340946 340864 340819 340748 340587 340383 340206 340030 339811 339602
54323 339602 339465 339361 339212 339039 338909 338819 338741 338682 338654 338600 338464 338287 338146 338030 337893 337747 337636 337535 337403 337258
54303C37258j26j32j72j85j67j79k08j72p1j4m5j10j64k17k46j94j08r0j50j92
54283C34316j85j89k15j81r5m6o4q1o8q4j23j04m3m8j37k01j84j55j73j91j78
54262C31571j70j72j35p1n8j01j07o4n0j12j78k04k20k12j27jL8k7p9m9k4n4q2
54239C29312p4r0j51j73j20q3j16j55j33j06j25j54j41j19j30j59j93k45k83k29
54219C26333r9j0k9q6j21j41j65j55j29j45k02k18j74j42j55j31n6rn2j28j62
54198C23824j80k04k05j59j16r7p6n7j01j83k05j46r8j14j26r0o8r3j03o1l6r4
54176C21212j76k04j95j81j48q7n0o8q9p1o4r8j27j21j23j49j59j18p7q2j11j23
54154C18591j24j14r1q0j23j99k33k13j82j57r9m7o1j12r9l4k3r2j36j12r9j38
$$ plain form
54303 337258 337132 337000 336828 336643 336476 336297 336089 335917 335846 335832 335787 335677 335513 335296 335050 334856 334748 334658 334508 334316
54283 334316 334131 333942 333727 333546 333451 333405 333341 333260 333192 333108 332985 332881 332838 332790 332653 332452 332268 332113 331940 331749 331571
54262 331571 331401 331229 331094 331023 330965 330864 330757 330693 330643 330531 330353 330149 329929 329717 329590 329589 329627 329600 329521 329472 329448 329394 329312
54239 329312 329238 329148 328997 328824 328704 328621 328505 328350 328217 328111 327986 327832 327691 327572 327442 327283 327090 326845 326562 326333
54219 326333 326234 326224 326195 326109 325988 325847 325682 325527 325398 325253 325051 324833 324659 324517 324362 324231 324175 324166 324114 323986 323824
54198 323824 323644 323440 323235 323076 322960 322863 322787 322730 322629 322446 322241 322095 321997 321883 321757 321667 321599 321506 321403 321342 321306 321212
54176 321212 321036 320832 320637 320456 320308 320221 320171 320103 320014 319943 319879 319781 319654 319533 319410 319261 319102 318984 318907 318825 318714 318591
54154 318591 318467 318353 318262 318182 318059 317860 317627 317414 317232 317075 316976 316929 316868 316756 316657 316623 316600 316508 316372 316260 316161 316023
54132C16023j51j07p0p8p7m6o2j43k06j97j65j53j08k3J8j9o2o6p8j18j17o6o1
54109C13868j41k01j71j31j46j58j17q2q7p3mL3k8j12j33j31j43j38p9m2q0j21
54087C11583j00p8j07j38j12q3j00j01m5j9r4j86j84j17q2q9j00j23j69j96j57
54066C09203j12j01j08j12j43j89j57m5Rp1j66j57j07j27j73j53j09j11j30j01
54046C06840o7r9j41j13o2o7j06r4m9m7o9m3QNn1j01j23j48j56j34j25j59j88
54023C04711j62j32j53j77j52j18j16j00l5Lo1j47j55j29j44j56p8L7N9j4q7j16
54001C02578j33j25p5l5p3j54j91j95k11k12j59r5q7j05r3p5j08j49j34q6p5p9
53979B99929m2pl6r7j08r8j24j45r9k9m0j02j27j12j33j75j60r8p5j00j04p2m8
$$ plain form
54132 316023 315872 315765 315695 315617 315540 315494 315432 315289 315083 314886 314721 314568 314460 314437 314455 314436 314374 314308 314230 314112 313995 313929 313868
54109 313868 313727 313526 313355 313224 313078 312920 312803 312721 312634 312561 312557 312590 312562 312450 312317 312186 312043 311905 311826 311784 311704 311583
54087 311583 311483 311405 311298 311160 311048 310965 310865 310764 310719 310700 310606 310420 310236 310119 310037 309948 309848 309725 309556 309360 309203
54066 309203 309091 308990 308882 308770 308627 308438 308281 308236 308245 308174 308008 307851 307744 307617 307444 307291 307182 307071 306941 306840
54046 306840 306773 306674 306533 306420 306358 306291 306185 306091 306042 305995 305926 305883 305891 305896 305845 305744 305621 305473 305317 305183 305058 304899 304711
54023 304711 304549 304417 304264 304087 303935 303817 303701 303601 303566 303569 303508 303361 303206 303077 302933 302777 302699 302736 302795 302781 302694 302578
54001 302578 302445 302320 302245 302210 302137 301983 301792 301597 301386 301174 301015 300920 300833 300728 300635 300560 300452 300303 300169 300083 300008 299929
53979 299929 299887 299880 299844 299747 299639 299541 299417 299272 299173 299144 299104 299002 298875 298763 298630 298455 298295 298197 298122 298022 297918 297846 297798
53956B97798m1m0o8j52k22j95j15p1p7p4o6q8j04p9n9j10j67j43p5o4j04j09p8
53933B95497p2o7k2J3m5j55j93j66j61j92j89j55j49j51r6k9n5j55k06j92j92
53912B92868k13j80q3j6oj7n0j33k01j48k7J5k1j4M9L0r9k00j71j04q3p6l8j5
53888B91067n4j07j21j30j62j84j60j10o3j9Jl3r4j23j14j22j45j26p6p7j26j34
53866B88788p5k6m0p5p8n4k5PJ2l8r0p5j5oo7j37j88k45k79k15p4J9K1KJ9K2l3
53839B87055j04j38j40j19p7m5p3j44j82j57j36j49j59j29q4m6j0J1mm5o7n8m1
53816B84959j4K8M6Mm3m0j4l3o5l7Qro9n9J2K6m8j10j13j09j34j26p4m6p7j00
53790B83763q2o8q5r1o2m7n6m6j5k2p8j19j12j11j38j42j02o5n8m6l5o1j20j42
$$ plain form
53956 297798 297757 297717 297649 297497 297275 297080 296965 296894 296817 296743 296677 296589 296485 296406 296347 296237 296070 295927 295852 295788 295684 295575 295497
53933 295497 295425 295358 295336 295349 295304 295149 294956 294790 294629 294437 294248 294093 293944 293793 293697 293668 293613 293458 293252 293060 292868
53912 292868 292655 292475 292392 292376 292370 292353 292303 292170 291969 291821 291794 291809 291788 291774 291823 291853 291754 291554 291383 291279 291196 291120 291082 291067
53888 291067 291013 290906 290785 290655 290493 290309 290149 290039 289976 289957 289958 289925 289831 289708 289594 289472 289327 289201 289125 289048 288922 288788
53866 288788 288713 288687 288647 288572 288494 288440 288415 288422 288434 288396 288306 288231 288216 288210 288143 288006 287818 287573 287294 287079 287005 287024 287045 287047 287066 287088 287055
53839 287055 286951 286813 286673 286554 286477 286432 286359 286215 286033 285876 285740 285591 285432 285303 285219 285173 285163 285174 285170 285125 285058 285000 284959
53816 284959 284945 284973 285019 285023 284980 284940 284926 284893 284828 284791 284799 284790 284721 284662 284674 284700 284652 284542 284429 284320 284186 284060 283986 283940 283863 283763
53790 283763 283681 283613 283528 283437 283375 283328 283272 283226 283211 283189 283111 282992 282880 282769 282631 282489 282387 282322 282264 282218 282183 282122 282002 281860
53766B81860j15j00j23j43j45j55j57j06l4l9j01j18n5k1n8q7m2J7J8l3r8j57
53744B80008j95j77j49j77k23j98j13p1j06j28r0m9m3k6J1Mn8j00q5p1p3m8Ll
53720B77843p9j33j24j19j46j39p6m4q0r3l9jl5p4o6n7r7j34j22j15j58j94j81
53697B75537j59j52j12k0L6Pl6l4l4p3r7p4n4p6q6o4p6j50j85j27m9k5k4j2l7
53672B73824r8j03%Q2N9pk0rm2p8p5q2j44j85j34n2l2m1j1J0m8j20j24q2q0r7
53646B72311o9k8n1j14j27j03j07j44j44j01p0p3q6j05j20j07p2o1j04j33r9n4
53624B70239n6p6p3p3j08j39j30j07r4n0K4L2p4j83j89j29j03r9o7l9o5r8o7j3
53600B68263ok0J9P5N2l6q3o3n1p5r5r7r5q1m4k5n8r0p4m1n3q9r1p9j03j35r8
$$ plain form
53766 281860 281745 281645 281522 281379 281234 281079 280922 280816 280782 280743 280642 280524 280469 280448 280390 280303 280261 280278 280296 280263 280165 280008
53744 280008 279813 279636 279487 279310 279087 278889 278776 278705 278599 278471 278381 278332 278289 278263 278274 278278 278220 278120 278035 277964 277891 277843 277846 277843
53720 277843 277764 277631 277507 277388 277242 277103 277027 276983 276903 276810 276771 276770 276735 276661 276595 276538 276441 276307 276185 276070 275912 275718 275537
53697 275537 275378 275226 275114 275094 275130 275137 275101 275067 275033 274960 274863 274789 274735 274659 274573 274509 274433 274283 274098 273971 273922 273897 273873 273861 273824
53672 273824 273726 273623 273623 273705 273764 273757 273737 273728 273686 273608 273533 273451 273307 273122 272988 272936 272904 272863 272852 272862 272814 272694 272570 272488 272408 272311
53646 272311 272242 272214 272163 272049 271922 271819 271712 271568 271424 271323 271253 271180 271094 270989 270869 270762 270690 270629 270525 270392 270293 270239
53624 270239 270183 270107 270034 269961 269853 269714 269584 269477 269383 269333 269357 269389 269315 269132 268943 268814 268711 268612 268545 268506 268441 268343 268276 268263
53600 268263 268257 268237 268256 268331 268383 268347 268264 268201 268150 268075 267980 267883 267788 267707 267663 267638 267580 267490 267416 267375 267322 267233 267142 267063 266960 266825 266727
53573B66727j7K7Kn4j18j90k26j94j20p4m9k1rl5o2n0l1o0r7r0n3m3n0n8r2j59
53547B64804j96j41n7m5p8r4j03j53k01j56m2K2k4j16j78j75j08oN5L3k7o4j04
53524B62846j45j32m3J9m0j38j35m8ml2n9o6j00j49j34o1j0j0k0k3n1r3j19j34
53500B61119j77k14j64m2M3L8j4n6q4r7q9q0q6q3m1kKrjpo4j17j13q7j03j26q6
53473B59260j4Rk9o4p9j01j10p1k3l1n4l6j7p1j45j26l0J3k3m8l4n2j18j54j19
53448B57733p2o7q0q3r0j04j07j04j25j37r8l1j0l3n0o3j03j52j51j18j03r8n8
53425B55696k6o9j35j15k7Km1o2l0k6p5r9p0o4j14j45j10o0n3n6l5j6k2k9k3l1
53399B54165n3o0o3r9j51j43p3j7j5m1o1p8q1n7n1j13j85j66o4Lrl2l1m3p0o5
$$ plain form
53573 266727 266710 266737 266739 266685 266567 266377 266151 265957 265837 265763 265714 265693 265684 265649 265587 265537 265506 265446 265349 265259 265206 265163 265113 265055 264963 264804
53547 264804 264608 264467 264410 264365 264287 264193 264090 263937 263736 263580 263538 263560 263536 263420 263242 263067 262959 262953 263008 263041 263014 262950 262846
53524 262846 262701 262569 262526 262545 262505 262367 262232 262184 262180 262148 262089 262023 261923 261774 261640 261579 261569 261559 261539 261516 261465 261372 261253 261119
53500 261119 260942 260728 260564 260522 260565 260603 260589 260533 260449 260352 260263 260183 260097 260014 259973 259971 259973 259964 259963 259956 259892 259775 259662 259575 259472 259346 259260
53473 259260 259246 259255 259226 259162 259083 258982 258872 258801 258778 258747 258693 258657 258640 258569 258424 258298 258268 258281 258258 258210 258176 258124 258006 257852 257733
53448 257733 257661 257594 257514 257431 257341 257237 257130 257026 256901 256764 256666 256635 256625 256592 256542 256479 256376 256224 256073 255955 255852 255754 255696
53425 255696 255670 255601 255466 255351 255324 255326 255285 255223 255193 255167 255092 254993 254923 254859 254745 254600 254490 254430 254377 254321 254286 254270 254248 254219 254196 254165
53399 254165 254112 254052 253989 253890 253739 253596 253523 253506 253491 253450 253389 253311 253230 253173 253122 253009 252824 252658 252594 252597 252588 252556 252525 252482 252412 252347
53373B52347l2l2p0q2o6r0j42j35o7m6j02j45j16r4j27j41q2k7m9j03j13r3r8
53350B50295j20j34j48j66j47q4l4l3l4j3Ml0q2j06r6n9j0K3Kn2o2k6j4n2r2j02
53324B48628j21j65j69r9j3K5J7j2o0j12j21q0l8k6k1j8n5j18j44j11p4o5n1j6
53300B46981Kk2m7l9l2n4q3r7q1l5K6N1mq8j03n6m4q6j05o6l7n9r8j19j39j53
53274B45413j26q7r9j52j57j07r4j40j63j12o4o8o9l4nqPM3K1p0j33j01n1p1j25
53249B43448j43j45j61j65j25p7m9j7K2J2m8o7j3K0l7j06j02o8p0q8p2o6j06j26
53225B41651p2JRk5l4k9m8n9k1K2j6j05j50j31j03q7o9n5n9o1m3m6q5j16j04q6
53199B40079j03j26j12p4o0m8l0l5p1r3o8l3l3n0n9q4j30j47j10o8o3p0o5r4j51
$$ plain form
53373 252347 252315 252283 252213 252131 252065 251975 251833 251698 251631 251585 251483 251338 251222 251128 251001 250860 250778 250751 250702 250599 250486 250393 250295
53350 250295 250175 250041 249893 249727 249580 249496 249462 249429 249395 249382 249386 249356 249274 249168 249072 249013 249003 249026 249028 248976 248914 248888 248874 248822 248730 248628
53324 248628 248507 248342 248173 248074 248061 248086 248103 248091 248031 247919 247798 247718 247680 247654 247633 247615 247560 247442 247298 247187 247113 247048 246997 246981
53300 246981 246983 246961 246914 246875 246843 246789 246706 246609 246528 246493 246519 246570 246566 246478 246375 246319 246275 246189 246084 246018 245981 245922 245824 245705 245566 245413
53274 245413 245287 245200 245101 244949 244792 244685 244591 244451 244288 244176 244112 244044 243975 243941 243936 243928 243935 243978 243999 243929 243796 243695 243644 243573 243448
53249 243448 243305 243160 242999 242834 242709 242632 242583 242566 242588 242600 242552 242485 242472 242492 242455 242349 242247 242179 242109 242021 241949 241883 241777 241651
53225 241651 241579 241580 241589 241564 241530 241501 241453 241394 241373 241395 241379 241274 241124 240993 240890 240803 240734 240679 240620 240559 240516 240470 240385 240269 240165 240079
53199 240079 239976 239850 239738 239664 239604 239556 239526 239491 239420 239327 239259 239226 239193 239143 239084 239000 238870 238723 238613 238545 238482 238412 238347 238253 238102
53174B38102j65r6k3l4r4j18r9p6n2k0j6n1p6o0o4j05j06l2L8K7k4l8m5q3j20
53149B36570r9o1o4q0o4n7j07j55j14l0nl4l6mJ1%MQl5j10j61j87k06j93j32q6
53123B34573j06j35j00k9kj3j5j0l2n5m3j1k0l9l2k9p8j42j38r2p7q2n0KRk3k7
53096B33204rl2j02j50j34r5n9k5j1k8m0k3k0o6j14r5m2l5q5j24j16q4m6mJ9Q
53070B31692KJ7Kp1j36j26r0j13j66j67j16q3p6n4l7o7j04r0m2m3q5q2k9J1Mk4
53044B29927n1j00j50j55j27r2m9J8O3N0J7J4Rl9q5p3n5j05j76j54o6l1q2j27
53020B28381j10p6n8l7j7l1o1n3l1o2j21j20p8o6j05j25j03r6j05p4lK6j7p5j03
52995B26680r8o8pL2jm2qP1P1l3j43j89j94j72j03l0k7r5j46j35j06q0m6l3r1
$$ plain form
53174 238102 237937 237841 237818 237784 237690 237572 237473 237397 237345 237325 237309 237258 237182 237122 237058 236953 236847 236815 236853 236880 236856 236818 236773 236690 236570
53149 236570 236471 236410 236346 236266 236202 236145 236038 235883 235769 235739 235734 235700 235664 235660 235671 235671 235675 235683 235648 235538 235377 235190 234984 234791 234659 234573
53123 234573 234467 234332 234232 234203 234201 234188 234173 234163 234131 234076 234033 234022 234002 233963 233931 233902 233824 233682 233544 233452 233375 233293 233243 233245 233254 233231 233204
53096 233204 233195 233163 233061 232911 232777 232682 232623 232598 232587 232559 232519 232496 232476 232410 232296 232201 232159 232124 232039 231915 231799 231715 231669 231665 231684 231692
53070 231692 231694 231711 231713 231642 231506 231380 231290 231177 231011 230844 230728 230645 230569 230515 230478 230411 230307 230217 230175 230132 230047 229965 229936 229947 229951 229927
53044 229927 229876 229776 229626 229471 229344 229252 229203 229221 229284 229334 229351 229365 229374 229335 229250 229177 229122 229017 228841 228687 228621 228590 228508 228381
53020 228381 228271 228195 228137 228100 228083 228052 227991 227938 227907 227845 227724 227604 227526 227460 227355 227230 227127 227031 226926 226852 226849 226875 226858 226783 226680
52995 226680 226582 226514 226507 226539 226538 226496 226488 226559 226630 226597 226454 226265 226071 225899 225796 225766 225739 225644 225498 225363 225257 225177 225131 225098 225007
52970B25007j62j42n0k1q8j41r8l9l3n6p3j01j28j14n4j7k4l0j4j9o5q9n7j5O
52945B23383K3K9qo0o3k3l0r1j19p8m4o0p9n8n5r4j13p2l7n9r3q7p4r2j05p5k8
52918B21738j9m1n3m6j8K8O0L3m1r4r5p8o8m2j3j7n0n2k4l0q9j33j16q6q1p7n3
52891B20443l8l5k2Nj3n7m9J5L8k4r8j08r1r3p8j9J7k5r4j08o7k7qKJj4l2n3r4
52862B19274j26j03l7j6p1j43j59j17o5j7km1r3q2j7J1l0p4n8m0q0j33j35r3n7
52837B17496m1l7m5n2l2k0o0j30j41p6l3o2r8q0m9m2m7l4m5q4r6n6k0l2n0k6K
52810B16010j6m5m4k9l7m6l8l2l3j7J4J0l1l7oj7j04j81j77j41j37j34r3m7m9
52785B14543n3j2L2K3j7l3l7n6p6o1m1m4m8l0k0m1m7j7Qj2m3n5q4j51j73j03j3
$$ plain form
52970 225007 224845 224703 224653 224632 224544 224403 224305 224266 224233 224177 224104 224003 223875 223761 223707 223690 223666 223636 223622 223603 223538 223449 223392 223377 223383
52945 223383 223406 223435 223427 223367 223304 223281 223251 223160 223041 222963 222919 222859 222780 222722 222667 222573 222460 222388 222351 222292 222199 222112 222038 221946 221841 221766 221738
52918 221738 221719 221678 221625 221579 221561 221589 221649 221682 221641 221547 221452 221374 221306 221264 221251 221234 221184 221132 221108 221078 220989 220856 220740 220654 220573 220496 220443
52891 220443 220405 220370 220348 220353 220340 220283 220234 220249 220287 220263 220165 220057 219966 219873 219795 219776 219793 219768 219674 219566 219499 219472 219464 219466 219467 219453 219421 219368 219274
52862 219274 219148 219045 219008 218992 218921 218778 218619 218502 218437 218420 218418 218377 218284 218202 218185 218196 218166 218092 218034 217994 217914 217781 217646 217553 217496
52837 217496 217455 217418 217373 217321 217289 217269 217209 217079 216938 216862 216829 216767 216669 216589 216540 216498 216451 216417 216372 216288 216192 216136 216116 216084 216034 216008 216010
52810 216010 215994 215949 215905 215876 215839 215793 215755 215723 215690 215673 215687 215697 215666 215629 215623 215606 215502 215321 215144 215003 214866 214732 214639 214592 214543
52785 214543 214490 214478 214510 214533 214516 214483 214446 214390 214314 214253 214212 214168 214120 214090 214070 214029 213982 213965 213973 213961 213918 213863 213779 213628 213455 213352 213339
52758B13339Rk1l8m7q3j22j23j06j20j36j09o2m7m3j1L3K0m7j21j62j54r2j1J3
52734B11759k7m8nM1J6l9n4m7p7j24j25r0p2p2n8n0q0j22j30j10r8q2l7lk2p3
52708B10171j05j20j38j36r4l1K2P4J18J22P0K2L1N9M5j0o2r8j08p3l0m5j17j40
52684B09427o6Pj2p1q7p4r2j17r6n6m2l9NN3N2J2l2p8j30j18k7M4J2n8o1k4m3
52657B08289q9p2MM2K1j0k5m0k4L2O6K2m4n3n6j18j91j63o9m0q4r2m0j0m5q7j05
52630B07019j26j37r4j6J6oj3J9K7nj7kj1m4n2k4k7q2j33j44j33j07l9M4O2J0
52604B05985m7o4p5r0q6n7m7o6p3m8j8j3k3n1q7j05p5k4PK2M1L0l3r5q3l2m5j14
52576B04634j48j16q7q4o9l0j8m2n8n4n8o8n5k9l3n6l9J3L9K2J6K9K1qj5ql4q9
$$ plain form
52758 213339 213348 213327 213289 213242 213159 213037 212914 212808 212688 212552 212443 212381 212334 212291 212280 212313 212333 212286 212165 212003 211849 211757 211746 211759
52734 211759 211732 211684 211679 211720 211736 211697 211643 211596 211519 211395 211270 211180 211108 211036 210978 210928 210848 210726 210596 210486 210388 210306 210269 210266 210244 210171
52708 210171 210066 209946 209808 209672 209578 209547 209569 209643 209761 209883 209953 209975 210006 210065 210110 210100 210038 209940 209832 209759 209729 209684 209567 209427
52684 209427 209361 209368 209356 209285 209198 209124 209032 208915 208819 208763 208721 208682 208687 208740 208792 208804 208772 208694 208564 208446 208419 208463 208475 208417 208356 208332 208289
52657 208289 208200 208128 208132 208174 208195 208185 208160 208120 208096 208128 208194 208216 208172 208119 208063 207945 207754 207591 207522 207482 207398 207306 207266 207256 207211 207124 207019
52630 207019 206893 206756 206662 206646 206662 206656 206643 206662 206689 206684 206667 206665 206654 206610 206558 206534 206507 206425 206292 206148 206015 205908 205869 205913 205975 205985
52604 205985 205938 205874 205799 205709 205623 205566 205519 205453 205380 205332 205314 205301 205278 205227 205140 205035 204960 204936 204943 204965 205006 205036 205003 204908 204825 204793 204748 204634
52576 204634 204486 204370 204283 204199 204130 204100 204082 204040 203982 203928 203870 203802 203747 203718 203685 203629 203590 203603 203642 203664 203680 203709 203730 203722 203707 203699 203665 203576
52548B03576j07p9o2p5p6n0l5m0k5Opo7j02q7o3p2q9r7j07j19j11q7o3n0k8j0
52522B01874j3j1L1Q4Q5N7M6L1l1r7r0m1l8o7m5K2L3l2q4r4j28j96k22j68r7n4
52496B00755k1J3jm7m7LK6lrK6K3m3q1n4l2o3q3n0k8p2j06o6j8m3j08j09l9L5
52468A99758O2N1pq2j22j06p3n8l6LJ1l0o9m9jK9L9K3m0j34j87j57r3m9k6j1j7
52441A98629l2j2M2N4ko5q2p8q5p1k7rm4p4m3ONj7pL7N8M5J1l6q5j01q1o3o3n7
52411A97753k8noj2j8m8q4q2m5l5o6p3l1pm4r9j09q4o6n5m0l3l0k2rl1p7q7o0
52382A96367m4m6k6J6J7l1n5k7k0o3j01r4r0j07q5qM1Qk7%K1k7p1m5pm0j02j04
52354A95250o3n5o4l4PJl3k5J2Rl5o5o7o8o8m9k8k9l7j6RRj4k6m5q6j15j02p8
$$ plain form
52548 203576 203469 203390 203328 203253 203177 203127 203092 203052 203027 203033 203026 202959 202857 202770 202707 202635 202546 202449 202342 202223 202112 202025 201962 201912 201884 201874
52522 201874 201861 201850 201881 201965 202050 202107 202153 202184 202153 202056 201966 201925 201887 201820 201775 201797 201830 201798 201714 201620 201492 201296 201074 200906 200809 200755
52496 200755 200734 200747 200746 200699 200652 200655 200681 200678 200669 200695 200718 200675 200594 200540 200508 200445 200362 200312 200284 200212 200106 200040 200022 199979 199871 199762 199723 199758
52468 199758 199820 199871 199864 199782 199660 199554 199481 199423 199387 199390 199401 199371 199302 199253 199252 199281 199320 199343 199303 199169 198982 198825 198732 198683 198657 198646 198629
52441 198629 198597 198585 198627 198681 198679 198614 198532 198454 198369 198298 198271 198262 198218 198144 198101 198107 198112 198095 198088 198125 198183 198228 198239 198203 198118 198017 197936 197873 197810 197753
52411 197753 197725 197720 197714 197702 197684 197636 197552 197470 197425 197390 197324 197251 197220 197213 197169 197070 196961 196877 196811 196756 196716 196683 196653 196631 196622 196591 196514 196427 196367
52382 196367 196323 196277 196251 196267 196284 196253 196198 196171 196151 196088 195987 195893 195803 195696 195611 195603 195644 195652 195625 195625 195646 195619 195548 195503 195496 195456 195354 195250
52354 195250 195187 195132 195068 195034 195041 195042 195009 194984 194996 195005 194970 194905 194838 194770 194702 194653 194625 194596 194559 194543 194552 194561 194547 194521 194476 194390 194275 194173 194095
52325A94095q7j00q3n7o6r3j06j24j41j18l8J8j2p3p7l3j4j4J7O4O7Po0r7j01
52300A92774p9m9n6j07j37j08o5n5n8l5j1l0o7p7q5j02r4k5M0K4l9o8o0n9o4l2
52274A91276J7L6K4Rj6n9p7k8K8K1l4o0m5m8p5q2o8o6p0n9l3l5n5o6p9j14j42
52247A90100j20p7p5j00j04r0r3j00o6%M1M0K4J1lpMLj9k2OMo3j17q8k2k2p6j04
52218A88865q3o6o4m9m0o5q9o4k6m6j01r2k8pn6r7p8n6q0j17j09o9l1j4k3m2l0
52191A87243K3N0Lo8q3m8m0o9q6p5p3q2p6m0KM3Q9Q2pj23j49r1l7l6m7m6n5o4
52163A86140m3kJ0j3k7k2l3o6p8o0n1n2k6J4J4k6m7k9j4k8n1o6q5j14j14q2o2
52136A84987o8p2o0n0n6p6j07j42j38p4rj0n8q7q1p8q5o9m1l2l2LN1N4J2k9n1
$$ plain form
52325 194095 194008 193908 193825 193768 193702 193609 193503 193379 193238 193120 193082 193100 193088 193015 192938 192905 192891 192877 192894 192958 193025 193032 192972 192875 192774
52300 192774 192695 192646 192590 192483 192346 192238 192173 192118 192060 192025 192014 191984 191917 191840 191755 191653 191559 191534 191574 191598 191559 191491 191431 191372 191308 191276
52274 191276 191293 191329 191353 191362 191346 191287 191210 191182 191210 191231 191197 191137 191092 191044 190969 190887 190819 190753 190683 190624 190591 190556 190501 190435 190356 190242 190100
52247 190100 189980 189903 189828 189728 189624 189534 189441 189341 189275 189275 189316 189356 189380 189391 189388 189381 189385 189388 189369 189347 189353 189357 189294 189177 189089 189067 189045 188969 188865
52218 188865 188782 188716 188652 188603 188563 188498 188409 188345 188319 188273 188172 188080 188052 188045 187989 187892 187814 187758 187678 187561 187452 187383 187352 187338 187315 187273 187243
52191 187243 187266 187316 187319 187251 187168 187120 187080 187011 186925 186850 186777 186695 186619 186579 186581 186624 186713 186795 186788 186665 186516 186425 186388 186352 186305 186259 186204 186140
52163 186140 186097 186095 186105 186092 186065 186043 186010 185944 185866 185806 185755 185703 185677 185691 185705 185679 185632 185603 185589 185561 185510 185444 185359 185245 185131 185049 184987
52136 184987 184919 184847 184787 184737 184681 184605 184498 184356 184218 184144 184135 184125 184067 183980 183899 183821 183736 183667 183626 183594 183562 183565 183616 183670 183682 183653 183602
52109A83602o3p4o4n7p7q8o5m3p2j03p3k6m7j07j02k8L1M2O1R0O5k0q4r7r4j00
52083A82407q5p1r5j30j10n9o3j07r9l9l1r9j30o3Kk6j01j40j40j26r5m7k5l8
52059A80490k7K3N1K9nk4o3j16j28r3p7r5p7k0qp7j34j05m2j2OL0K4k6l4L9J05
52032A79634O4l7r8j05j14j26j03n7k7k8l3l2j9J5L9J3o6j36j64j69j66j23n1
52009A78111k3n6q6o5l6m5n1l5k8n8p0l4%k0n8n8m4n3o2m9n8j11j47j18p2q8j37
51982A76449j31n4L3P8P1L1mLK2j5j11j65j17k7Mk0l9l4k7j4J5K9%l3j8K2M2L6
51954A76026K5Jm6p8n6rJ6J0mk7o5r2q8p2p1p4o4m8m8n7p1r4j03p4k6k1n9q3p8
51925A74570r3j27j19n9k0m1n9k8j0m7q1n8k9n8j13j19q0n6m7l2k3l9o3p1q0r5
$$ plain form
52109 183602 183539 183465 183401 183344 183267 183179 183114 183071 182999 182896 182823 182797 182750 182643 182541 182513 182544 182586 182647 182737 182802 182782 182698 182601 182507 182407
52083 182407 182322 182251 182156 182026 181916 181857 181794 181687 181588 181549 181518 181419 181289 181226 181228 181202 181101 180961 180821 180695 180600 180553 180528 180490
52059 180490 180463 180486 180537 180566 180561 180537 180474 180358 180230 180137 180060 179965 179888 179868 179860 179783 179649 179544 179502 179490 179496 179526 179550 179524 179490 179529 179634
52032 179634 179698 179661 179563 179458 179344 179218 179115 179058 179031 179003 178970 178938 178919 178934 178973 178986 178920 178784 178620 178451 178285 178162 178111
52009 178111 178088 178032 177946 177881 177845 177800 177749 177714 177686 177628 177558 177524 177524 177504 177446 177388 177344 177291 177229 177180 177122 177011 176864 176746 176674 176586 176449
51982 176449 176318 176264 176297 176375 176446 176477 176473 176476 176498 176483 176372 176207 176090 176063 176067 176047 176008 175974 175947 175933 175948 175977 175977 175944 175926 175948 175990 176026
51954 176026 176051 176052 176006 175928 175872 175863 175879 175889 175885 175858 175793 175701 175613 175541 175470 175396 175332 175284 175236 175179 175108 175014 174911 174837 174811 174790 174731 174648 174570
51925 174570 174477 174350 174231 174172 174152 174111 174052 174024 174014 173967 173886 173828 173799 173741 173628 173509 173429 173373 173326 173294 173271 173232 173169 173098 173018 172923
51899A72923o8QM5j2r4j00o0o4r8r7n8l3l1j2Kk1o7q0o7n8l5L7J10J01Nq3j09
51872A71984j10j25j35j11o4j3Ok3p4q4l4J5Nk5k7j9l9o7m6MJ8j5m7n6n9o5n7
51845A70737m2k3JJ5j0p7j09o7kRl4o9o5m0j8j9o9j42j66j15o0n9o8m6k9n5q5
51818A69293n6MK7J9J4lo6j24j29r3p9p5m9k2l1m4oM0K2m3o1k4pl9n7m4l3l9l3
51789A68262k3m0q2q5m5l2q6j59j84j62j05l6K4M4L8K1jl2m2mM3N3L4J9%m8q3
51762A67289n0K5N7L4J5J6oo5j03q8n1l8m1m4m5o3q9j23j46j30p9j8Pnl8q4j14
51735A66023j01n7n3j02j27o9K1N7L0j0m4p8p8l2ll9q4n5J0K1j9k5LNm0o4n6n5
51707A64979p2n3kJ7k2p1q2o0l0rk8r4j50j34p1j4L8Q9R2Lr4r5k3Ok2l3lkm9o5
$$ plain form
51899 172923 172855 172863 172908 172896 172802 172702 172642 172578 172480 172383 172325 172292 172261 172249 172251 172230 172163 172083 172016 171958 171923 171960 172070 172171 172176 172093 171984
51872 171984 171874 171749 171614 171503 171439 171426 171432 171409 171335 171251 171217 171232 171237 171212 171185 171166 171127 171060 171014 171018 171036 171021 170974 170918 170859 170794 170737
51845 170737 170695 170672 170673 170688 170678 170601 170492 170425 170423 170432 170398 170329 170264 170224 170206 170187 170118 169976 169810 169695 169635 169576 169508 169462 169433 169378 169293
51818 169293 169237 169241 169268 169287 169301 169298 169232 169108 168979 168886 168807 168732 168683 168661 168630 168586 168580 168620 168642 168599 168538 168514 168507 168468 168411 168367 168334 168295 168262
51789 168262 168239 168199 168117 168032 167987 167955 167869 167710 167526 167364 167259 167223 167247 167291 167329 167350 167349 167317 167275 167271 167314 167367 167401 167420 167420 167372 167289
51762 167289 167239 167264 167321 167355 167370 167386 167380 167315 167212 167124 167073 167035 166994 166950 166905 166842 166753 166630 166484 166354 166275 166257 166264 166259 166221 166137 166023
51735 166023 165922 165865 165812 165710 165583 165514 165535 165592 165622 165612 165568 165490 165412 165380 165377 165338 165254 165199 165209 165230 165211 165186 165189 165194 165154 165090 165034 164979
51707 164979 164907 164854 164852 164869 164847 164776 164694 164634 164604 164595 164567 164473 164323 164189 164118 164104 164142 164231 164323 164326 164232 164137 164114 164120 164098 164065 164062 164060 164011 163946
51677A63946l1j9p1j29j49j47j38r0pL7jr0j71k12j83p8K3M1k0q0j07j21j04l3
51653A62066M5O2L3L5N6J1q6j20o2JMmRnm8n7qL1J9RM2N6J7k6k7k3m1n2l6l4n3
51622A61814m2jj4j11j88j53o7l9p0q9o3j8K9O7N9j2r7j42j34j03o1l8n6r4q8
51597A60289k8K3K6Lj5l6o4p1o2o3p9p1n2n3n7j7N5P2J5l4l2l0o5q9o8m6m7k7
51569A59377K1L9Kk7j1on3r0p5p3j33j71j05J3O1K1k8m3l4pL5N6K7k9p7j09j22
51542A58459r2l0Mj1k2jOl4o4l5pm6j16j42j34j42j44q5PP0P2N3J7m7j03j16r3
51515A57224q2p8n8l5m9q9j12q6k7L9O9L2k4l5NJ2l5n9mN0K3m9p1l9j6j8rPjj9
51485A56466k4l3q2j36j42j08q5p0l7J%l4o2o1m0j7Kok6lO3R3M8j2k1nk9p4q2
$$ plain form
51677 163946 163915 163896 163825 163696 163547 163400 163262 163172 163165 163202 163201 163111 162940 162728 162545 162467 162490 162531 162511 162431 162324 162203 162099 162066
51653 162066 162111 162173 162206 162241 162297 162308 162222 162102 162040 162041 162045 162041 162050 162045 161997 161940 161932 161963 161982 161991 162033 162089 162106 162080 162053 162030 161989 161937 161901 161867 161814
51622 161814 161772 161771 161757 161646 161458 161305 161238 161199 161129 161040 160977 160959 160988 161055 161114 161102 161005 160863 160729 160626 160565 160527 160471 160377 160289
51597 160289 160261 160284 160310 160313 160298 160262 160198 160127 160065 160002 159923 159852 159800 159747 159690 159673 159728 159800 159815 159781 159749 159719 159654 159565 159497 159451 159404 159377
51569 159377 159398 159437 159439 159412 159401 159395 159342 159252 159177 159104 158971 158800 158695 158708 158769 158790 158762 158719 158685 158678 158713 158769 158796 158767 158690 158581 158459
51542 158459 158367 158337 158341 158330 158308 158307 158313 158279 158215 158180 158173 158127 158011 157869 157735 157593 157449 157364 157371 157441 157513 157566 157583 157536 157433 157317 157224
51515 157224 157142 157064 157006 156971 156922 156833 156721 156635 156608 156647 156716 156748 156724 156689 156694 156706 156671 156612 156608 156658 156681 156632 156561 156522 156506 156488 156479 156486 156485 156466
51485 156466 156442 156409 156327 156191 156049 155941 155856 155786 155749 155750 155750 155716 155654 155593 155553 155536 155538 155532 155506 155503 155566 155659 155707 155695 155674 155669 155640 155566 155484
51456A55484o8p6r4q2n5o1r0p5k5Lj1l1j5J7M1L9J0m1p8q1p0o1l9mln3r7r4p7
51427A54213q7r9q9r7j42j47n6M6M3m2p8m2l6j05j66j53r5m7k4k0l9n7l1K5O7
51402A52742O9O5O1J8o9j33j28p2j7jk5o9r6q2n2m1m0k6NK5L1K9J1j6k6mJ5OJ
51373A52181J4Ko6j42j53j11o5k6K0M0Qm3o3o1o8o2nN5M8j2m4l6m3p6r1p8o5o1
51345A50997m6l2n0p9q0n9p4j09j06n4kJ4kl4q2r6m1M6P9M0Kj2l6q2j09q9n3m0
51317A49811n3p6j00r9p5n4o2p6n7l3l8n1m3k8m1m8mN9N6qm3k1lk0m5o2r4j29
51289A48563j17n4jOpj3k7m1l3j3j6l4k3J1J3k5n3n5p4j02q6k3L1L0J4J0lm3o5
51260A47770l9jJl8r3j39j52j07l2K4M1L9Rn1j01q6l3j3l4l9j5k5o5p4m5n4j16
$$ plain form
51456 155484 155416 155340 155246 155164 155109 155048 154958 154883 154858 154861 154850 154819 154804 154821 154862 154901 154911 154870 154792 154711 154641 154580 154541 154537 154534 154481 154384 154290 154213
51427 154213 154126 154027 153938 153841 153699 153552 153496 153542 153585 153543 153465 153423 153387 153282 153116 152963 152868 152821 152797 152777 152738 152681 152650 152675 152742
51402 152742 152811 152876 152937 152955 152886 152753 152625 152553 152536 152535 152510 152441 152345 152263 152211 152170 152130 152104 152109 152134 152165 152194 152205 152189 152163 152159 152174 152180 152181
51373 152181 152195 152197 152131 151989 151836 151725 151660 151634 151654 151694 151702 151659 151596 151535 151467 151405 151400 151455 151503 151491 151447 151411 151368 151292 151201 151123 151058 150997
51345 150997 150951 150919 150869 150790 150710 150651 150577 150468 150362 150308 150306 150320 150318 150284 150202 150106 150065 150111 150190 150230 150232 150220 150184 150102 149993 149904 149851 149811
51317 149811 149758 149682 149582 149483 149408 149354 149292 149216 149159 149126 149088 149037 148994 148966 148925 148877 148873 148932 148988 148980 148937 148916 148913 148893 148848 148786 148692 148563
51289 148563 148446 148392 148391 148397 148390 148377 148350 148309 148276 148263 148247 148213 148190 148201 148214 148189 148136 148081 148007 147905 147819 147796 147827 147857 147871 147881 147878 147835 147770
51260 147770 147731 147730 147731 147693 147600 147461 147309 147202 147170 147194 147235 147274 147283 147232 147131 147045 147012 146999 146965 146926 146911 146886 146821 146747 146702 146648 146532
51233A46532j44q3j7l3r0j08q7p2o0rN7Q8O6L8J4j8p1j19j36j05n2j1nj8j9j7
51207A45521l5o1o1m4n6r0r0l1K8L2k0o2o0j4L6M4Nk4qJ0j8o9q0m7l1l6k9k0n9
51178A44631j25j38o9QK3mm3r1j36j38j00o3m1LO5Q7M7Mjjl0p1r4j04j02n7J6
51151A43476N4J3m7p9r4j20j17o4nJk9m0k7k3m4o4o6n4m3n1p2q3o0l7n6r1q7m8
51123A42043l7n9o7n4n7o9l2M6N6l4j25j33q6n9n0k4lj7n1o5o7o8n0ON2N4K4k0
51095A41054q9j67j95j51q8n6m8l2k6n1r4j22j34j32q5LP7R1P1M4Mm1m9j7Jj7
51069A39751j3L1N8J8l2k3Rop3j31j52j50j28r8q6q9n8J4N8J7m5n6l4l4n5m7j9
51042A38627k9o8q7p1m2k2ppl2m5k3J8L3K4J8K3K3L4M7K4m5j03r9n7m3n1n2m3
$$ plain form
51233 146532 146388 146305 146288 146255 146165 146057 145970 145898 145838 145829 145886 145974 146040 146078 146092 146074 146003 145884 145748 145643 145591 145580 145575 145557 145538 145521
51207 145521 145486 145425 145364 145320 145264 145174 145084 145053 145081 145113 145093 145031 144971 144957 144993 145037 145042 145018 145010 145020 145002 144933 144853 144806 144775 144739 144710 144690 144631
51178 144631 144506 144368 144299 144307 144330 144326 144283 144192 144056 143918 143818 143755 143714 143717 143782 143869 143916 143920 143919 143918 143888 143817 143723 143619 143517 143460 143476
51151 143476 143530 143543 143496 143417 143323 143203 143086 143022 143017 143018 142989 142949 142922 142899 142855 142791 142725 142671 142628 142577 142505 142422 142362 142325 142269 142178 142091 142043
51123 142043 142006 141947 141880 141826 141769 141700 141668 141714 141770 141736 141611 141478 141392 141333 141283 141259 141256 141239 141188 141123 141056 140988 140938 140944 140996 141050 141074 141054
51095 141054 140965 140798 140603 140452 140364 140308 140260 140228 140202 140151 140057 139935 139801 139669 139584 139587 139664 139755 139826 139870 139874 139833 139784 139767 139768 139751
51069 139751 139738 139769 139827 139845 139813 139790 139799 139793 139720 139589 139437 139287 139159 139061 138975 138886 138828 138842 138900 138917 138872 138816 138782 138748 138693 138646 138627
51042 138627 138598 138530 138443 138372 138330 138308 138301 138294 138262 138217 138194 138212 138245 138269 138287 138310 138333 138367 138414 138438 138393 138290 138191 138134 138091 138040 137988 137945
51014A37945n8q9r2q1r7j30j23m7M1O0Mo7p6k0K4j1p5q1j6K7%k8j5J0j1l9k1O
50986A36940qm2l8j2k6p3j12j28j36j26q2k1J5K9L6K5j6n6o5n9o1o7o3n6n7l7
50960A35704qj4o8r5o2k5l7o2m1kpm5o0n8n2l5l%m4p9o5o2j18j87j74j03m5j4
50932A34139K3M6No1q1m5j5j0KPl2r2j08p8n5n5m8k8j4LK8K1m1r7q3l5k4l1NO3
50902A33309N5pm8l9m4q8j09p7l9m3p9j09j28j16p3k7k6n9p8q2r6j19j11q3p1
50877A31613p4n6l5m4o2m7j2j1l4k9jj6o8r3p5o1p2n9k1k0q0j52j71j49r9m1R
50850A30040J8J0K4M2Ro1r3p2n5o2o1l0j3l9p0p7p6p8q4j06j53j87j44l5M3M7
50824A28737J3loj0pmk8p2r6q1m2J0O9Q6L2l2k4L8M6k7j00j13j14j39j50j03k8
$$ plain form
51014 137945 137887 137798 137706 137625 137528 137398 137275 137228 137269 137329 137333 137266 137190 137170 137194 137183 137108 137027 137011 137038 137038 137010 136995 137005 136994 136955 136934 136940
50986 136940 136932 136890 136852 136840 136814 136741 136629 136501 136365 136239 136157 136136 136151 136180 136216 136241 136225 136169 136104 136045 135984 135917 135854 135798 135741 135704
50960 135704 135696 135682 135614 135519 135457 135432 135395 135333 135292 135290 135283 135238 135178 135120 135068 135033 135030 135030 134986 134907 134842 134780 134662 134475 134301 134198 134153 134139
50932 134139 134162 134208 134213 134152 134071 134026 134011 134001 134003 134010 133978 133886 133778 133700 133645 133590 133542 133514 133500 133503 133531 133552 133511 133414 133331 133296 133272 133241 133246 133309
50902 133309 133364 133357 133309 133270 133226 133138 133029 132952 132913 132870 132791 132682 132554 132438 132365 132338 132312 132253 132175 132093 131997 131878 131767 131684 131613
50877 131613 131539 131483 131448 131404 131342 131295 131283 131272 131238 131209 131208 131192 131124 131031 130956 130895 130823 130764 130743 130723 130643 130491 130320 130171 130072 130031 130040
50850 130040 130058 130068 130092 130134 130143 130082 129989 129917 129862 129800 129739 129709 129696 129657 129587 129510 129434 129356 129272 129166 129013 128826 128682 128647 128690 128737
50824 128737 128750 128747 128741 128731 128724 128720 128692 128620 128524 128443 128401 128411 128480 128566 128598 128566 128542 128580 128626 128599 128499 128386 128272 128133 127983 127880 127852
50797A27852Olk8o0q0p7n7m5m6m0l2m8o0k1O3J10Q8M1J8j0o6j27j54j47j27j05
50771A26845q8q3o0lN3M7om1l3k5n2q8j10j31j31q6j1J8j1l6k9k2l2l2j3j1l6
50744A25793m1j3ll6q4r7q1n3j5Rll7n4m8n0n9l5Kj1o9j05r6q9r9r4o0m0l9k5
50715A24368Jj4p5j03q2o2p0p1o0p5j09r1l8m4j36j97j64j14j02p5LN2Nn7l7K3
50689A22676K5k6n3n2o5p3l5J5Qm7p7o8o1p4q7j04j22j28r4n1l3l0l3n6r6j05
50663A21154o7l7m6n6l5l4r5j58j44p8m3n4o7p0o9m1J9N4J8n1q2p6p2p5o7o9r9
50636A19560j27j23r8q5o7k9j4m6o5k9Rqm1j8K5J6l4m7k1nj4k0l4q6j46j48j01
50609A18204n5l0mJm0q4o9j8Lj9l1j6j5l4l2rjj8m3p9j31j49r5rJ6k2m3j6Okk
$$ plain form
50797 127852 127858 127855 127827 127767 127687 127610 127553 127508 127462 127422 127390 127342 127282 127261 127324 127434 127522 127563 127581 127571 127505 127378 127224 127077 126950 126845
50771 126845 126757 126674 126614 126611 126664 126711 126705 126664 126631 126606 126554 126466 126356 126225 126094 126008 125997 126015 126004 125968 125939 125917 125885 125853 125840 125829 125793
50744 125793 125752 125739 125736 125700 125616 125519 125438 125385 125370 125379 125376 125339 125285 125237 125187 125128 125093 125095 125084 125015 124910 124814 124725 124626 124532 124472 124432 124393 124368
50715 124368 124369 124355 124280 124177 124095 124033 123963 123892 123832 123757 123648 123557 123519 123475 123339 123142 122978 122864 122762 122687 122690 122742 122747 122690 122653 122676
50689 122676 122701 122675 122622 122570 122505 122432 122397 122412 122420 122373 122296 122228 122167 122093 122006 121902 121780 121652 121558 121507 121474 121444 121411 121355 121259 121154
50663 121154 121087 121050 121004 120948 120913 120879 120784 120626 120482 120404 120361 120307 120240 120170 120101 120060 120079 120133 120151 120100 120018 119942 119870 119795 119728 119659 119560
50636 119560 119433 119310 119212 119127 119060 119031 119017 118971 118906 118877 118886 118878 118837 118819 118844 118860 118826 118779 118758 118753 118739 118719 118685 118599 118453 118305 118204
50609 118204 118149 118119 118115 118116 118076 117992 117923 117905 117908 117889 117858 117842 117827 117793 117761 117752 117751 117733 117690 117611 117480 117331 117236 117227 117243 117221 117178 117162 117168 117166 117164
50578A17164L3N5K0n9j23j18m9L7O6K0l6m1j4nmJ2K3k2r5j29j07o7m0k0k0o1r2
50551A16328q1o4j00j59j57q1k1k0m3m8m5m9n4o8j03j33j20r1r7j32j21o3l7o9
50527A14372r3o5j6MNJ5K1Pk7p1j26j65j54r7n5o8j00j08p4j9J8Nm6p2l9ll9j28
50499A12882j82j64j19r6r0p9o6n5m7n0p4q4m1K2M4J6%K5M4K2k3p2j15j37j09
50474A11452m9j1k3l8k7lJ4J4j5p3j13r1l3k0o3q5n3j8k4n0o1o6p6o2rK8%p0j13
50445A10262r9m5J0M3L8J4j4m5r1j29j22p0j2J8L7M9M2Nn0j02j38j39r7m7l0l8
50419A09250l1j9l6p5q2l3K5M7L5J5qj9qK9M8K2l3j02j58j77j37o6j8k1n6j08
50393A08284j71k06j63o0L0N4L1jk6l9l3j5j5l8o6r5j31j61j52j16r7j11j26j08
$$ plain form
50578 117164 117197 117252 117272 117213 117090 116972 116923 116960 117026 117046 117010 116969 116955 116950 116946 116958 116981 116959 116864 116735 116628 116561 116521 116501 116481 116420 116328
50551 116328 116247 116183 116083 115924 115767 115686 115665 115645 115602 115554 115509 115460 115406 115338 115235 115102 114982 114891 114794 114662 114541 114478 114441 114372
50527 114372 114279 114214 114198 114202 114207 114222 114243 114250 114223 114152 114026 113861 113707 113610 113555 113487 113387 113279 113205 113186 113204 113209 113163 113091 113052 113049 113010 112882
50499 112882 112700 112536 112417 112321 112231 112152 112086 112031 111984 111934 111860 111776 111735 111757 111801 111817 111817 111842 111886 111908 111885 111813 111698 111561 111452
50474 111452 111403 111392 111369 111331 111304 111301 111315 111329 111314 111241 111128 111037 111004 110984 110921 110836 110783 110765 110741 110691 110630 110564 110488 110426 110417 110445 110445 110375 110262
50445 110262 110163 110118 110128 110171 110209 110223 110209 110164 110073 109944 109822 109752 109740 109758 109795 109844 109886 109891 109841 109739 109601 109462 109365 109318 109288 109250
50419 109250 109219 109200 109164 109089 109007 108974 108999 109046 109081 109096 109088 109069 109061 109090 109138 109160 109127 109025 108867 108690 108553 108487 108469 108448 108392 108284
50393 108284 108113 107907 107744 107684 107714 107768 107799 107798 107772 107733 107700 107685 107670 107632 107566 107471 107340 107179 107027 106911 106814 106703 106577 106469
50369A06469p0l9j4NJ6J4%k8o3o9n3m5p7j04p7l4m9j12j47j23r4r1q6p4p7q3m9
50342A04846K3O3K3m7r2r9p8l4J0K6J6Oj4o1j13j13q1q0j19j26q3n1p4r6p1m4
50316A03537p2j19j22p7l3qkj4m6p7q9j01j31j55j40r7n9m8n8p7p7n3l0l6n1l5
50290A01730JQk5n1m0l9q4j41j64j34o8J1N6K7n1j06j05r0r0q5o0l3j6QK5qr3
50263A00383j59j68j61j61j47r0l3k2l4l5l8n5o2k8J2K1J4Rj0o5j04r2o2o6r1
50238I8756r0n9m1m4m8l8k2plk0m5m5nK6J3k9n8o0m7l0k6o2j22j54j32q7o4n7
50210I7400o0o6o9n6m4o9j11j24r4o4m8j4N3Q2M3k2n6p3j08j37j37j26j28j08
50186I5864m7j1m5j00r2l1Qj5p2j26j58j43p5%K6Ml4p3j03j08q7q4j08j29j23
$$ plain form
50369 106469 106399 106360 106346 106351 106367 106381 106381 106353 106290 106221 106168 106123 106046 105942 105865 105831 105782 105670 105523 105400 105306 105215 105129 105055 104978 104895 104846
50342 104846 104869 104932 104955 104908 104816 104717 104639 104605 104615 104641 104657 104663 104649 104588 104475 104362 104281 104201 104082 103956 103873 103822 103748 103652 103581 103537
50316 103537 103465 103346 103224 103147 103114 103106 103104 103090 103044 102967 102878 102777 102646 102491 102351 102254 102195 102147 102089 102012 101935 101882 101852 101816 101765 101730
50290 101730 101731 101739 101714 101663 101623 101584 101500 101359 101195 101061 100993 101004 101060 101087 101036 100930 100825 100735 100645 100560 100500 100467 100451 100459 100484 100476 100383
50263 100383 100224 100056 99895 99734 99587 99497 99464 99442 99408 99373 99335 99280 99218 99190 99202 99223 99237 99246 99236 99171 99067 98975 98913 98847 98756
50238 98756 98666 98607 98566 98522 98474 98436 98414 98407 98404 98384 98339 98294 98289 98315 98328 98299 98241 98181 98134 98104 98078 98016 97894 97740 97608 97521 97457 97400
50210 97400 97340 97274 97205 97149 97105 97036 96925 96801 96707 96643 96595 96581 96634 96716 96759 96737 96681 96608 96500 96363 96226 96100 95972 95864
50186 95864 95817 95806 95761 95661 95569 95538 95546 95531 95459 95333 95175 95032 94957 94957 94983 94987 94953 94880 94777 94669 94582 94498 94390 94261 94138
50161I4138j18j35j37j00q0j06j22o7RJ7k2k4K2L7ln1p1p7q4p6o1o8r8j12r0n1
50135I2470k2k2n7j02j08o1k1l5o7o3l4k5m9n9m8l9l8k5j0j5l1k3PL1N0Q0R4N8
50107I1836rm8m3l8l9j6M7J06J23J07Q8O7N0M6N7P6J01J47K01K22K04J73J76K22
50083I3856K82L16L11L00L23L61L63L34L27L69M03L91L86M43N22N51N17M88M99
50064A01342N36N77O16O34O25O26O60O98P09P05P28P72Q05Q25Q44Q67Q96R58J054
50045A15477J134J167J191J253J344J436J553J720J889J985K021K075K176K301
50031A38722K438K580K678K705K713K764K826K805K707K623K586K540K428K282
50017A75397K128J963J787J652J581J542J503J451J377J280J207J224J324J432
$$ plain form
50161 94138 94020 93885 93748 93648 93568 93462 93340 93273 93282 93299 93277 93253 93275 93312 93309 93258 93187 93110 93026 92950 92889 92821 92723 92611 92521 92470
50135 92470 92448 92426 92369 92267 92159 92098 92077 92042 91975 91912 91878 91853 91804 91745 91697 91658 91620 91595 91585 91570 91539 91516 91523 91554 91604 91684 91778 91836
50107 91836 91827 91779 91736 91698 91659 91643 91690 91796 91919 92026 92114 92181 92231 92277 92334 92410 92511 92658 92859 93081 93285 93458 93634 93856
50083 93856 94138 94454 94765 95065 95388 95749 96112 96446 96773 97142 97545 97936 98322 98765 99287 99838 100355 100843 101342
50064 101342 101878 102455 103071 103705 104330 104956 105616 106314 107023 107728 108456 109228 110033 110858 111702 112569 113465 114423 115477
50045 115477 116611 117778 118969 120222 121566 123002 124555 126275 128164 130149 132170 134245 136421 138722
50031 138722 141160 143740 146418 149123 151836 154600 157426 160231 162938 165561 168147 170687 173115 175397
50017 175397 177525 179488 181275 182927 184508 186050 187553 189004 190381 191661 192868 194092 195416 196848
50003A96848J510J574J629J668J697J754J828J858J827J791J787J788J745J672
49989B20976J593J520J437J342J234J131J070J064J089J114J167J298J491J672
49975B39198J823J966K149K395K714L100L493L854M204M595N001N342N614N888
49961B91336O194O481O699O837O904O877O761O592O381O097N738N329M864M306
49947C77396L671L032K423J815J187N75K0m93r59j344j649j917k161k338k415
49932C76843k425k411k365k267k124j967j805j628j448j263j078r12p90o94n84
49917C53082m66l69k89j96r4j5L6J13K27L47M51N73P14Q42R56J118J330J509J592
49898C61461J617J621J572J425J202R56O70L02j32n73j002j463j980k513l012
$$ plain form
50003 196848 198358 199932 201561 203229 204926 206680 208508 210366 212193 213984 215771 217559 219304 220976
49989 220976 222569 224089 225526 226868 228102 229233 230303 231367 232456 233570 234737 236035 237526 239198
49975 239198 241021 242987 245136 247531 250245 253345 256838 260692 264896 269491 274492 279834 285448 291336
49961 291336 297530 304011 310710 317547 324451 331328 338089 344681 351062 357159 362897 368226 373090 377396
49947 377396 381067 384099 386522 388337 389524 390099 390119 389626 388667 387323 385674 383757 381596 379258 376843
49932 376843 374418 372007 369642 367375 365251 363284 361479 359851 358403 357140 356062 355150 354360 353666 353082
49917 353082 352616 352247 351958 351762 351668 351653 351689 351802 352029 352376 352827 353400 354114 354956 355912 357030 358360 359869 361461
49898 361461 363078 364699 366271 367696 368898 369854 370524 370826 370694 370121 369119 367656 365676 363163 360151
49883C60151l460l880m297m696n040n310n525n725n898o011o046o025n961n852
49869B86425n724n579n396n147m887m684m520m327m091l870l661l397l068k772
49855B25302k582k445k270k054j825j577j305j065r02p85o36m44k61j19lJ05K27
49838B07361L64N16O64Q05R53J124J312J512J730J954K143K290K448K671K940
49823B30787L191L389L540L699L923M219M534M795M993N162N320N434N480N489
49809B93955N486N480N472N428N314N110M862M615M348M031L703L441L256L078
49795C57579K873K681K518K365K230K171K186K213K215K237K309K386K439K488
49781C90890K535K541K493K443K410K320K144J941J782J639J457J243J019P75
$$ plain form
49883 360151 356691 352811 348514 343818 338778 333468 327943 322218 316320 310309 304263 298238 292277 286425
49869 286425 280701 275122 269726 264579 259692 255008 250488 246161 242070 238200 234539 231142 228074 225302
49855 225302 222720 220275 218005 215951 214126 212549 211244 210179 209277 208492 207856 207412 207151 207032 207029 207134 207361
49838 207361 207725 208241 208905 209710 210663 211787 213099 214611 216341 218295 220438 222728 225176 227847 230787
49823 230787 233978 237367 240907 244606 248529 252748 257282 262077 267070 272232 277552 282986 288466 293955
49809 293955 299441 304921 310393 315821 321135 326245 331107 335722 340070 344101 347804 351245 354501 357579
49795 357579 360452 363133 365651 368016 370246 372417 374603 376816 379031 381268 383577 385963 388402 390890
49781 390890 393425 395966 398459 400902 403312 405632 407776 409717 411499 413138 414595 415838 416857 417632
49767D17632N07K83J37J8j23k48k78k15r5Q5L46O48R49J272J669K116K560L012
49749D30275L512M068M625N169N720O304O892P464Q005Q513R002R480R900J0195
49735E29124J0349J0427J0472J0458J0364J0185R935R569R091Q568Q062P531O909
49722F51044O199N450M685L905L127K378J634R01K23l69r27j495k028k463k834
49707F69430l209l579l893m143m384m624m827m982n102n186n232n256n283n287
49693F04443n231n126m998m840m623m368m089l774l409l040k709k377k005j640
49679E52214j355j120q50n22k04M3K03K57J84L7j12k51m40p04j019j363j761k208
49661E41029k688l186l698m209m683n122n552n984o406o796p133p382p533p650
$$ plain form
49767 417632 418139 418422 418559 418577 418454 418206 417928 417713 417618 417703 418049 418697 419646 420918 422587 424703 427263 430275
49749 430275 433787 437855 442480 447649 453369 459673 466565 474029 482034 490547 499549 509029 518929 529124
49735 529124 539473 549900 560372 570830 581194 591379 601314 610883 619974 628542 636604 644135 651044
49722 651044 657243 662693 667378 671283 674410 676788 678422 679323 679546 679177 678250 676755 674727 672264 669430
49707 669430 666221 662642 658749 654606 650222 645598 640771 635789 630687 625501 620269 615013 609730 604443
49693 604443 599212 594086 589088 584248 579625 575257 571168 567394 563985 560945 558236 555859 553854 552214
49679 552214 550859 549739 548889 548367 548163 548206 548409 548666 548850 548887 548775 548524 548084 547380 546361 544998 543237 541029
49661 541029 538341 535155 531457 527248 522565 517443 511891 505907 499501 492705 485572 478190 470657 463007
49647D63007p783p902p945p911p852p784p686p557p416p254p054o834o641o474
49633C58914o301o106n901n677n432n187m973m786m595m401m212m011l794l608
49619B89930l489l392l259l114k994k886k738k580k461k381k292k186k083j960
49605B52115j806j689j681j715j670j526j390j309j217j079r59q99q64q08p43
49590B32760o89o29n48m73m10l28k15j08k6N8J72K97L96M61N17N89P03Q67J034
49571B34428J169J309J486J684J851K005K205K445K654K814K985L212L460L695
49557B67402L923M157M376M582M810N064N318N553N788O010O197O351O518O704
49543C42753O865O961O987O954O877O797O715O553O241N836N456N112M689M119
$$ plain form
49647 463007 455224 447322 439377 431466 423614 415830 408144 400587 393171 385917 378863 372029 365388 358914
49633 358914 352613 346507 340606 334929 329497 324310 319337 314551 309956 305555 301343 297332 293538 289930
49619 289930 286441 283049 279790 276676 273682 270796 268058 265478 263017 260636 258344 256158 254075 252115
49605 252115 250309 248620 246939 245224 243554 242028 240638 239329 238112 237033 236074 235175 234311 233503 232760
49590 232760 232071 231442 230894 230421 230011 229683 229468 229360 229334 229392 229564 229861 230257 230718 231235 231824 232527 233394 234428
49571 234428 235597 236906 238392 240076 241927 243932 246137 248582 251236 254050 257035 260247 263707 267402
49557 267402 271325 275482 279858 284440 289250 294314 299632 305185 310973 316983 323180 329531 336049 342753
49543 342753 349618 356579 363566 370520 377397 384194 390909 397462 403703 409539 414995 420107 424796 428915
49529D28915L480K857K243J587R02K37l87r71j544k138k762l363l868m271m630
49514D16287m971n257n483n692n902o053o117o125o118o094o045n984n897n748
49500C34801n555n397n301n196n033m852m696m542m356m173m044l960l858l725
$$ plain form
49529 428915 432395 435252 437495 439082 439984 440221 439834 438863 437319 435181 432419 429056 425188 420917 416287
49514 416287 411316 406059 400576 394884 388982 382929 376812 370687 364569 358475 352430 346446 340549 334801
49500 334801 329246 323849 318548 313352 308319 303467 298771 294229 289873 285700 281656 277696 273838 270113
$$ [...]
##END NTUPLES=NMR SPECTRUM
##END=
