
##TITLE=UV1009_M1-1003-1002_6268712_73uEjPg4XR
##JCAMPDX= 6.0         $$ Bruker NMR JCAMP-DX V2.0
##DATA TYPE= NMR SPECTRUM
##DATA CLASS= NTUPLES
##ORIGIN= BRUKER
##OWNER= Administrator
$$ 1.72 TOPSPIN		Version 2.1
$$ 2012-06-02 05:48:19.890 -0500  Administrator@TOPSPIN
$$ Compression mode = diff/dup
##.OBSERVE FREQUENCY= 400.13188235
##.OBSERVE NUCLEUS= ^1H
##.ACQUISITION MODE= SIMULTANEOUS (DQD)
##.ACQUISITION SCHEME= undefined
##.AVERAGES= 8
##.DIGITISER RES= 22
##SPECTROMETER/DATA SYSTEM= spect
##.PULSE SEQUENCE= zg30
##.SOLVENT NAME= COFFEE_calctemp
##.SHIFT REFERENCE= INTERNAL, COFFEE_calctemp, 1, 14.98061
##AUDIT TRAIL= $$ (NUMBER, WHEN, WHO, WHERE, PROCESS, VERSION, WHAT)
$$ ##TITLE= Audit trail, TOPSPIN		Version 2.1
$$ ##JCAMPDX= 5.01
$$ ##ORIGIN= Bruker BioSpin GmbH
$$ ##OWNER= Administrator
$$ $$ C:\Bruker\TOPSPIN/data/COFFEE/nmr/UV1009_M1-1003-1002_6268712_73uEjPg4XR/20/pdata/1/auditp.txt
$$ ##AUDIT TRAIL=  $$ (NUMBER, WHEN, WHO, WHERE, PROCESS, VERSION, WHAT)
(   1,<2012-06-02 05:48:12.453 -0500>,<Administrator>,<TOPSPIN>,<go>,<TOPSPIN 2.1>,
      <created by zg
	started at 2012-06-02 05:47:05.890 -0500,
	POWCHK enabled, PULCHK disabled,
       configuration hash MD5:
       D5 CA 7A 23 FE 6B EE E2 50 67 74 61 24 F7 5E 3B
       data hash MD5: 64K
       6A 4D AC 93 03 B3 F2 C3 F5 39 2C BD AB 68 FF 55>)
(   2,<2012-06-02 05:48:15.562 -0500>,<Administrator>,<TOPSPIN>,<proc1d>,<TOPSPIN 2.1>,
      <Start of raw data processing
       efp LB = 0 FT_mod = 6 PKNL = 1 PHC0 = 0 PHC1 = 0 SI = 32K 
       data hash MD5: 32K
       5E E4 1F AF FA 7C E2 55 F5 BE F2 5B FC F7 5E 88>)
(   3,<2012-06-02 05:48:16.000 -0500>,<Administrator>,<TOPSPIN>,<proc1d>,<TOPSPIN 2.1>,
      <pk PHC0 = 205.6915 PHC1 = 0 
       data hash MD5: 32K
       CF DE 4B 91 FC CC 97 F4 B9 1D 77 7B E5 E7 26 D8>)
(   4,<2012-06-02 05:48:16.078 -0500>,<Administrator>,<TOPSPIN>,<proc1d>,<TOPSPIN 2.1>,
      <abs ABSG = 1 
       data hash MD5: 32K
       32 F7 BC 9F 26 E5 86 52 9A 53 6B 42 0D CE E6 54>)
(   5,<2012-06-02 05:48:16.109 -0500>,<Administrator>,<TOPSPIN>,<proc1d>,<TOPSPIN 2.1>,
      <abs ABSG = 2 
       data hash MD5: 32K
       CD 5C C6 F5 89 3C 01 37 93 EC 35 77 F6 F6 EB 46>)
(   6,<2012-06-02 05:48:16.140 -0500>,<Administrator>,<TOPSPIN>,<proc1d>,<TOPSPIN 2.1>,
      <abs ABSG = 3 
       data hash MD5: 32K
       83 91 20 0B 85 21 BF 24 AA 22 5F A8 18 35 0A D2>)
(   7,<2012-06-02 05:48:16.171 -0500>,<Administrator>,<TOPSPIN>,<proc1d>,<TOPSPIN 2.1>,
      <abs ABSG = 4 
       data hash MD5: 32K
       1E D6 A8 13 56 56 F6 5B A0 BE D9 25 8D C6 E2 68>)
(   8,<2012-06-02 05:48:16.203 -0500>,<Administrator>,<TOPSPIN>,<proc1d>,<TOPSPIN 2.1>,
      <abs ABSG = 5 
       data hash MD5: 32K
       7E 96 C5 82 F2 B7 06 BF A2 CF B5 DF 59 70 57 5B>)
$$ ##END=
$$ 
$$ $$ hash MD5
$$ $$ FA 7C 35 41 50 E7 99 22 4A 60 C7 39 2C 1C 97 D0
##$RELAX= 
##$RELAX= 
##$RELAX= 
##$RELAX= 
##$RELAX= 
##$RELAX= 
##$RELAX= 
$$ Bruker specific parameters
$$ --------------------------
$$ [...]
150 150 150 150 150 150 150 150
##$TP07= 0
##$TPNAME0= <>
##$TPNAME1= <>
##$TPNAME2= <>
##$TPNAME3= <>
##$TPNAME4= <>
##$TPNAME5= <>
##$TPNAME6= <>
##$TPNAME7= <>
##$TPOAL= (0..7)
0.5 0.5 0.5 0.5 0.5 0.5 0.5 0.5
##$TPOFFS= (0..7)
0 0 0 0 0 0 0 0
##$TUNHIN= 0
##$TUNHOUT= 0
##$TUNXOUT= 0
##$USERA1= <user>
##$USERA2= <user>
##$USERA3= <user>
##$USERA4= <user>
##$USERA5= <user>
##$V9= 5
##$VALIST= <valist>
##$VCLIST= <CCCCCCCCCCCCCCC>
##$VD= 0
##$VDLIST= <DDDDDDDDDDDDDDD>
##$VPLIST= <PPPPPPPPPPPPPPP>
##$VTLIST= <TTTTTTTTTTTTTTT>
##$WBST= 2048
##$WBSW= 25
##$XGAIN= (0..3)
0 0 0 0
##$XL= 0
##$YL= 0
##$YMAX_a= 520278
##$YMIN_a= -650264
##$ZGOPTNS= <>
##$ZL1= 120
##$ZL2= 120
##$ZL3= 120
##$ZL4= 120
##$ABSF1= 14.98061
##$ABSF2= -5.57192
##$ABSG= 5
##$ABSL= 3
##$ALPHA= 0
##$AQORDER= 0
##$ASSFAC= 0
##$ASSFACI= 0
##$ASSFACX= 0
##$ASSWID= 0
##$AUNMP= <proc_prof1d_extract_pilot.lims>
##$AXLEFT= 0
##$AXNAME= <>
##$AXNUC= <1H>
##$AXRIGHT= 0
##$AXTYPE= 0
##$AXUNIT= <>
##$AZFE= 0.1
##$AZFW= 0.1
##$BCFW= 0
##$BC_mod= 0
##$BYTORDP= 0
##$COROFFS= 0
##$CY= 15
##$DATMOD= 1
##$DC= 0
##$DFILT= <>
##$DTYPP= 0
##$F1P= 0
##$F2P= 0
##$FCOR= 0.5
##$FTSIZE= 32768
##$FT_mod= 6
##$GAMMA= 0
##$GB= 0
##$INTBC= 1
##$INTSCL= 1
##$ISEN= 128
##$LB= 0
##$LEV0= 0
##$LPBIN= 0
##$MAXI= 10000
##$MC2= 0
##$MEAN= 0
##$ME_mod= 0
##$MI= 0
##$NCOEF= 0
##$NC_proc= -8
##$NLEV= 6
##$NOISF1= 0
##$NOISF2= 0
##$NSP= 0
##$NTH_PI= 0
##$NZP= 0
##$OFFSET= 14.98061
##$PC= 1
##$PHC0= 205.6915
##$PHC1= 0
##$PH_mod= 1
##$PKNL= yes
##$PPARMOD= 0
##$PPDIAG= 0
##$PPIPTYP= 0
##$PPMPNUM= 2147483647
##$PPRESOL= 1
##$PSCAL= 4
##$PSIGN= 0
##$PYNMP= <proc.py>
##$REVERSE= no
##$SF= 400.13
##$SI= 32768
##$SIGF1= 0
##$SIGF2= 0
##$SINO= 400
##$SIOLD= 32768
##$SPECTYP= <>
##$SREGLST= <1H.CDCl3>
##$SSB= 0
##$STSI= 32768
##$STSR= 0
##$SW_p= 8223.68421052632
##$SYMM= 0
##$S_DEV= 0
##$TDeff= 65536
##$TDoff= 0
##$TI= <>
##$TILT= no
##$TM1= 0
##$TM2= 0
##$TOPLEV= 0
##$USERP1= <user>
##$USERP2= <user>
##$USERP3= <user>
##$USERP4= <user>
##$USERP5= <user>
##$WDW= 1
##$XDIM= 32768
##$YMAX_p= 459242043
##$YMIN_p= -745236
##$CURPLOT= <Network HP LaserJet P1505>
##$CURPRIN= <$Network HP LaserJet P1505>
##$DFORMAT= <normdp>
##$LAYOUT= <+/1D_H.xwp>
##$LFORMAT= <normlp>
##$PFORMAT= <normpl>
##$SURQMSG= 1
$$ End of Bruker specific parameters
$$ ---------------------------------
##NTUPLES= NMR SPECTRUM
##VAR_NAME=  FREQUENCY,     SPECTRUM/REAL,   SPECTRUM/IMAG
##SYMBOL=    X,             R,               I
##VAR_TYPE=  INDEPENDENT,   DEPENDENT,       DEPENDENT
##VAR_FORM=  AFFN,          ASDF,            ASDF
##VAR_DIM=   32768,         32768,           32768
##UNITS=     HZ,            ARBITRARY UNITS, ARBITRARY UNITS
##FACTOR=    0.250966925370066, 1,           1
##FIRST=     8223.43324360095, -57473,       -157206
##LAST=      0,             85219,           -440894
##MIN=       0,             -745236,         0
##MAX=       8223.43324360095, 459242043,    0
$$ Real data points
##PAGE= N=1
##DATA TABLE= (X++(R..R)), XYDATA
$$ [...]
19531i5914c2042I0869d9096G6179N2662a53553r1111n2665A87395a44684F851
$$ -95914 -32042 90869 -49096 76179 128841 -153553 -244664 -297329 187395 -144684 6851
19519B5305O5767a55736J5149q6637c3042B19338d14894B33249c88748A1938P5899
$$ 25305 91072 -155736 -140587 -227224 -33042 219338 -414894 233249 -388748 11938 87837
19508H7837c18056C9262d6342H0553b46334L8391C6567R3698d02129e1919C27861
$$ 87837 -318056 39262 -46342 80553 -246334 -207943 36567 130265 -402129 -51919 327861
19496h3202A08197g3192A10335R729a73497c4108l29668A56853a354G8864j4436
$$ -83202 108197 -73192 110335 120064 -173497 -34108 -363776 156853 -1354 78864 64428
19485F4428d9536A95867D8167h4855J0697A34383B4775d3987j52953b3595j09950
$$ 64428 -49536 195867 48167 -84855 -74158 134383 24775 -43987 -196940 -23595 -133545
19474a33545N2185I9991M8490a55746H7622o831B915b71315R9805D23221b88132
$$ -133545 -81360 99991 148481 -155746 87622 80791 2915 -271315 -171510 423221 -288132
19462c46681A16807a34710l861j84688A2220a67419M7505N9297k54870i054q9757
$$ -346681 116807 -134710 -138571 -323259 12220 -167419 -119914 -60617 -315487 -9054 -98811
19451i8811m3380I7164i413l031k01027M6717j24357J41595j99403d4810n7490
$$ -98811 -142191 97164 -9413 -12444 -213471 -166754 -291111 -149516 -348919 -44810 -102300
19440a02300n6262A3359a00070K9287j70969A09580b72165R3363G2953a68277
$$ -102300 -158562 13359 -100070 -70783 -241752 109580 -272165 -178802 72953 -168277
19429b56090f725E229N5432N2571J99819a03995k2756F5174b03412g2140k3028
$$ -256090 -6725 5229 60661 113232 313051 -103995 -126751 65174 -203412 -72140 -95168
19418i5168p6312N6831A91220d16359a37114d5644e599B6320h0289j03074g0987
$$ -95168 -171480 -114649 191220 -416359 -137114 -45644 -5599 26320 -80289 -183363 -70987
19406B54748I0879h3913A28978o4272R4977B0406f8328K9996a421p1726C5957
$$ 254748 90879 -83913 128978 64706 159683 20406 -68328 -38332 -1421 -73147 35957
19394c74040a18123B80795A29858N8188m0531a54470A57385a75559l6638a6406
$$ -374040 -118123 280795 129858 188046 147515 -154470 157385 -175559 -212197 -16406
19383d3398k32125q7302h8538j87009H8383A0129d32193I5289b36857A83363l9023
$$ -43398 -275523 -362825 -88538 -275547 88383 10129 -432193 95289 -236857 183363 144340
19372A44340e0700D6435e10135a91013C4813A1583b59242a6619l58882A84014
$$ 144340 -50700 46435 -510135 -191013 34813 11583 -259242 -16619 -375501 184014
19361a2384r0141B16778C0326p527a88396C34033d1502I1681g4670k94414c255
$$ -12384 -102525 216778 30326 22799 -188396 334033 -41502 91681 -74670 -369084 -3255
19349f9387I4905I408b49841L5772B31573J640A15107a88867a5370B6050h024
$$ -69387 94905 9408 -249841 -214069 231573 233213 115107 -188867 -15370 26050 -8024
19337a94151Q5152h72j05652a8347j10616L4776d6284j17801L4505p7587E2364
$$ -194151 -108999 -872 -106524 -18347 -128963 -94187 -46284 -164085 -129580 -207167 52364
19325e9520o0024Q750C5904b90880e7759A71968b16112g5981A55653A5370a53305
$$ -59520 -119544 -110794 35904 -290880 -57759 171968 -216112 -75981 155653 15370 -153305
19313B35239c26597i8057i373j671A87215b16033k62180J42532B7797a51800j46878
$$ 235239 -326597 -98057 -9373 -11044 187215 -216033 -478213 -335681 27797 -151800 -298678
19302b98678f1360n0113j64745j6823A42098e5j01342d2498A37611c39636a44134
$$ -298678 -61360 -111473 -276218 -293041 142098 -55 -101397 -42498 137611 -339636 -144134
19290c0869j00554A44293a79360E3050k5343d39439a55457a3981p592A61725a42568
$$ -30869 -131423 144293 -179360 53050 27707 -439439 -155457 -13981 -21573 161725 -142568
19278c14079e2249j17009A7839N3906M6704c86772E9617J82737a68765n6678C79978
$$ -314079 -52249 -169258 17839 71745 118449 -386772 59617 242354 -168765 -225443 379978
19266B34323b4924j0538k5884k14113G0500a51046c0201d265l10051A5463J2754
$$ 234323 -24924 -35462 -61346 -275459 70500 -151046 -30201 -4265 -314316 15463 28217
19255B8217N8182C4104d9047B9077a21457r1977f2388C2484a3204G7244b79368
$$ 28217 86399 34104 -49047 29077 -121457 -213434 -62388 32484 -13204 77244 -279368
19243F0665b69088B0460a29201j1714J5583k12909h1775a5816j90714g9774f147
$$ 60665 -269088 20460 -129201 -140915 -125332 -338241 -81775 -15816 -206530 -79774 -6147
19231e0672j03426J1271A31997Q0490b17407a8307j91699A57499d75442a14547
$$ -50672 -154098 -142827 131997 212487 -217407 -18307 -210006 157499 -475442 -114547
19220A55585i3769k80121f9154k05348C2222e9958J7600k86188J547B04336h4934
$$ 155585 -93769 -373890 -69154 -274502 32222 -59958 -42358 -328546 -326999 204336 -84934
19208b19076C8315g7013n1508J3547j88611A0575e74932b71184e4986E6286L4935
$$ -219076 38315 -77013 -128521 -114974 -303585 10575 -574932 -271184 -54986 56286 91221
19197I1221m3310a17068C668d43379B24464a26524A12388a10969B27902g3001
$$ 91221 47911 -117068 3668 -443379 224464 -126524 112388 -110969 227902 -73001
19186C12847a47145A75874D1544c71642g2378q6337j6108A03966J05272a33835
$$ 312847 -147145 175874 41544 -371642 -72378 -158715 -174823 103966 209238 -133835
19175a41297j8659F9574d27963i4869A00593a13253d7568D104K16719M2211e7518
$$ -141297 -159956 69574 -427963 -94869 100593 -113253 -47568 4104 220823 263034 -57518
19163A66742a41141O6481c1567k82660f0030A99223b52419f8617c2633k6213N159
$$ 166742 -141141 -74660 -31567 -314227 -60030 199223 -252419 -68617 -32633 -58846 -53687
19152e3687j59267b5170k02077f8324e261C4313a15612l29025b3159g510C98725
$$ -53687 -212954 -25170 -227247 -68324 -5261 34313 -115612 -444637 -23159 -7510 398725
19140E7844a74141M4865B506J67385a94370P7104b5076m6756j16016A30860J01701
$$ 57844 -174141 -129276 2506 169891 -194370 -117266 -25076 -71832 -187848 130860 232561
19129B32561a63828O8593k46303a69694J9748D7593A3067c8448m7189A17490c86772
$$ 232561 -163828 -95235 -341538 -169694 -149946 47593 13067 -38448 -85637 117490 -386772
19117C79887a93778h6806A3807M5434g4096k20537a16851B25477b01738N5582
$$ 379887 -193778 -86806 13807 59241 -74096 -294633 -116851 225477 -201738 -146156
19107a46156B90247a85140C47128A23664b70304N7242b2942k23023F00156a9668
$$ -146156 290247 -185140 347128 123664 -270304 -213062 -22942 -245965 600156 -19668
19096b33235j97455C600a70102d5468o3662G0480L2095J90255a8604B05003D7134
$$ -233235 -430690 3600 -170102 -45468 -109130 70480 102575 292830 -18604 205003 47134
19084A31280d4220B60843c60996c4076j42610G645e4598j71769I8036m3828I01
$$ 131280 -44220 260843 -360996 -34076 -176686 7645 -54598 -226367 98036 54208 901
19072f924H1453b38521d0017r5853M4948I410g8635l47428B59822g3095A61810
$$ -6924 81453 -238521 -40017 -135870 -90922 9410 -78635 -426063 259822 -73095 161810
19060a80184l7343B81279d53376B60487d50839a0928A8256a59294N781L3388A93552
$$ -180184 -217527 281279 -453376 260487 -450839 -10928 18256 -159294 -153513 -120125 193552
19048a6807B81104o2630G124K16211a90860A45563d0731k02097i6982A35129d0189
$$ -16807 281104 218474 7124 223335 -190860 145563 -40731 -242828 -96982 135129 -40189
19036d7930E4989K14923r6037k5636b32222a11103d7063H7374d4558R712B06279
$$ -47930 54989 269912 173875 148239 -232222 -111103 -47063 87374 -44558 -34846 206279
19024d38656B46535d3590n2510j74852C55533b2748p2705j11302g0027e679F2159
$$ -438656 246535 -43590 -96100 -270952 355533 -22748 -95453 -206755 -70027 -5679 62159
19012E5371e9646A08545a6518E5774a61491F9553a83684Q3116E3071H597N8322
$$ 55371 -59646 108545 -16518 55774 -161491 69553 -183684 -100568 53071 8597 66919
19001F6919o965f2115k0367j12997M051c9154H7223N969b36026B19944b7816l548
$$ 66919 59954 -62115 -82482 -195479 -191428 -39154 87223 93192 -236026 219944 -27816 -31364
18989c1364a393m8496m7277p0280A00955d36125a32193A9508J85611e7567A90224
$$ -31364 -1393 -49889 -97166 -167446 100955 -436125 -132193 19508 205119 -57567 190224
18977b06824A67295a27467J4648A0345b48435c1572p372r7392M5418H0061a95854
$$ -206824 167295 -127467 -112819 10345 -248435 -31572 -38944 -136336 -90918 80061 -195854
18965B02778l2150n0863c43212a13880J2605I3611a58474F6754b83213C5915O1103
$$ 202778 170628 119765 -343212 -113880 -101275 93611 -158474 66754 -283213 35915 97018
18954I7018C9133a98167A66346D9712c56230A02431h9554B47058a61615d9124
$$ 97018 39133 -198167 166346 49712 -356230 102431 -89554 247058 -161615 -49124
18943g4783k08977C5105K86241b3668A18913i3343g375F9352J29023a98856a4313
$$ -74783 -283760 35105 321346 -23668 118913 -93343 -7375 69352 198375 -198856 -14313
18931H0739L228A8415a58749A78929c2481I7431f0047J1000j53897j51208a03126
$$ 80739 83967 18415 -158749 178929 -32481 97431 -60047 -49047 -202944 -354152 -103126
18919A93381a43592L7915A42703b45170h4409A32600A7153d6026G6786b0703r2241
$$ 193381 -143592 -105677 142703 -245170 -84409 132600 17153 -46026 76786 -20703 -112944
18908a12944H5619c18464d2387j04942k9240P3430K7838k6273L5635e298k18027
$$ -112944 85619 -318464 -42387 -147329 -176569 -103139 -75301 -101574 -65939 -5298 -223325
18897b23325C7239J73724H0620a80460A55669a75153A4015b765l2426A11836d90222
$$ -223325 37239 210963 80620 -180460 155669 -175153 14015 -2765 -35191 111836 -490222
18885a21033B17566i3281k7107G0469K84912a51691L0926f112j40869m900o0036
$$ -121033 217566 -93281 -120388 70469 355381 -151691 -120765 -6112 -146981 -151881 -211917
18874b11917c379H2854J30970G3751b5178n3132A92357c86002E1203a88011K7814
$$ -211917 -3379 82854 213824 73751 -25178 -78310 192357 -386002 51203 -188011 -160197
18863a60197K8171A02299b8420j37569L0589a651m77344O3258a4196C2245c64465
$$ -160197 -132026 102299 -28420 -165989 -135400 -1651 -478995 -415737 -14196 32245 -364465
18851a25409k12712G5409J14759c07669I4638O6286K49211a3916k28685C31186
$$ -125409 -338121 75409 190168 -307669 94638 160924 410135 -13916 -242601 331186
18840D6929K51050I8263a74433g0023K8119J6306A4047K886p894b00604h6977
$$ 46929 297979 98263 -174433 -70023 -41904 -25598 14047 16933 9039 -200604 -86977
18828g8792b3738B66966a79371I0053b16320K0254E2883b92456e0521l8846k19607
$$ -78792 -23738 266966 -179371 90053 -216320 -196066 52883 -292456 -50521 -89367 -308974
18817c08974a16973k8438f163k98580B87779a12340E6050i1538F4864b28783A16809
$$ -308974 -116973 -145411 -6163 -304743 287779 -112340 56050 -91538 64864 -228783 116809
18805d5911j50871B90272A05248E0397J5597J53436h086D04326j05892a6040B99515
$$ -45911 -196782 290272 105248 50397 65994 219430 -8086 404326 298434 -16040 299515
18793A40879M2439b69127E0235K3427f3788b8963j89549M497J2786j22192H9901
$$ 140879 183318 -269127 50235 73662 -63788 -28963 -218512 -214015 -201229 -323421 89901
18781e4380E7920c08772M0221B06736D3683f9087k54953A51423m088c5918q127
$$ -54380 57920 -308772 -268551 206736 43683 -69087 -324040 151423 147335 -35918 -44045
18770d4045k94236Q3703e0041k6385j40439B78138j13487a64499F0664o260b6326
$$ -44045 -338281 -254578 -50041 -76426 -216865 278138 164651 -164499 60664 54404 -26326
18758b73973A70053a20705n0154k1257B91627b57415C01814b55614Q5861A1770
$$ -273973 170053 -120705 -170859 -192116 291627 -257415 301814 -255614 -169753 11770
18747g7262D74166A33101M1333h4762A7631b63286a18582c6357k18906A46127
$$ -77262 474166 133101 174434 -84762 17631 -263286 -118582 -36357 -255263 146127
18736C2766K00211a15416N3657m0083A24809a21925b3745M226B17121J03344j21828
$$ 32766 232977 -115416 -61759 -101842 124809 -121925 -23745 -19519 217121 320465 198637
18725A98637c32490a57669G9461b49280A99117m4088k2315a3032j1834o5479A30043
$$ 198637 -332490 -157669 79461 -249280 199117 155029 132714 -13032 -24866 -90345 130043
18713b61991A02611b2429B7194m549f9572q0240B1360c50080A42344b31632A60708
$$ -261991 102611 -22429 27194 22645 -69572 -149812 21360 -350080 142344 -231632 160708
18701C9324j2555J7664M9965e3902C8512b23436B94181f7668k82821M8393B28976
$$ 39324 26769 44433 94398 -53902 38512 -223436 294181 -67668 -350489 -302096 228976
18689e9644B06153F183M5610f7882j20319B670c74086p0783J72127e9912l8274
$$ -59644 206153 6183 51793 -67882 -188201 2670 -374086 -444869 -272742 -59912 -98186
18678i8186m0809O0377G5712M9110e1007j61589C79259A01055J50242j20509d0288
$$ -98186 -138995 -78618 75712 124822 -51007 -212596 379259 101055 251297 130788 -40288
18666f504k14035l2062L4242g2230q0823A70520B1768J33316h7126b6710C15050
$$ -6504 -220539 -252601 -218359 -72230 -153053 170520 21768 155084 -87126 -26710 315050
18654a62132N8811m2189m7755g1133l4270l8924H5903a86149K7812F1871P5506
$$ -162132 -103321 -145510 -193265 -71133 -105403 -144327 85903 -186149 -158337 61871 137377
18643A37377g1923A23185c02817a45854A71835b72419i9980j70680A22247J24961
$$ 137377 -71923 123185 -302817 -145854 171835 -272419 -99980 -270660 122247 247208
18633B47208a26188C24966B551O4889d38545i5441k61725a75023J5600c9524A44569
$$ 247208 -126188 324966 2551 67440 -438545 -95441 -357166 -175023 -159423 -39524 144569
18621a61915A67265m693D1256J54943E7153a31123A4025E915a46122m9902P1903
$$ -161915 167265 162572 41256 196199 57153 -131123 14025 5915 -146122 -196024 -124121
18610a24121q3443R942A02685A1916J18821e3517k19581A13898i5448G4098J66472
$$ -124121 -207564 -197622 102685 11916 130737 -53517 -273098 113898 -95448 74098 240570
18599B40570d1019j42903D3952d3104B5716a34940f2149A76567b35006P8101J1833
$$ 240570 -41019 -183922 43952 -43104 25716 -134940 -62149 176567 -235006 -156905 -145072
18588a45072H4733j2398N2191b50455A58078h3787c2683O736I2352e2923j1998
$$ -145072 84733 72335 124526 -250455 158078 -83787 -32683 -25947 92352 -52923 -64921
18577f4921C3997G606b8704E7016a50612r8312j54700H4446O7333i5017A55324
$$ -64921 33997 7606 -28704 57016 -150612 -248924 -403624 84446 151779 -95017 155324
18565h8925c8935j4385j24912B46873a8306q8366j76777A18586c26015a0112j13024
$$ -88925 -38935 -53320 -178232 246873 -18306 -106672 -283449 118586 -326015 -10112 -123136
18554a23136j2579B26646c98379d015k273A82409F4104b6952l60784C76128a66025
$$ -123136 -135715 226646 -398379 -4015 -6288 182409 64104 -26952 -387736 376128 -166025
18542D1409J97311b59722B801L5447b72384i9845B29406a9596A66979d29581a87858
$$ 41409 238720 -259722 2801 38248 -272384 -99845 229406 -19596 166979 -429581 -187858
18530b42915C11811a00117E9122k2446c12700A42108a63111R128B67153f6634
$$ -242915 311811 -100117 59122 36676 -312700 142108 -163111 -153983 267153 -66634
18519c82077A91012b92673k7270J9267c3060j11759c8924k70282f12F1334a60564
$$ -382077 191012 -292673 -319943 -300676 -33060 -144819 -38924 -309206 -612 61334 -160564
18507b63361k00489B75071a62952b9261l41450J05792f8305j37948J01572E5845
$$ -263361 -463850 275071 -162952 -29261 -370711 -264919 -68305 -206253 -104681 55845
18496A11473a39914b8753B22281b25907q9569b8225B9130R6525n7980P1397H930
$$ 111473 -139914 -28753 222281 -225907 -315476 -28225 29130 125655 67675 139072 8930
18484A65605g2118I0221A190K89695a39414B09219a3066j7441k15619n6262a1174
$$ 165605 -72118 90221 1190 290885 -139414 209219 -13066 -30507 -246126 -302388 -11174
18472A48333L2624H1304J25905e7976A3880c403D3437M0677j5762a5169l3952
$$ 148333 180957 81304 207209 -57976 13880 -3403 43437 84114 68352 -15169 -49121
18461d9121A58378b98982i0710A85466F7476e6706m61608J59438Q8321E4765c31521
$$ -49121 158378 -298982 -90710 185466 67476 -56706 -518314 -358876 -270555 54765 -331521
18449G9285L0001d5078J8693H1335a71047C75120e4110q699m5044j6383j88253
$$ 79285 109286 -45078 -26385 81335 -171047 375120 -54110 -62809 -107853 -124236 -312489
18438c12489d8923o9321A42774a63104f7929j34366j9097I9394C3360J23089b35565
$$ -312489 -48923 -118244 142774 -163104 -67929 -202295 -221392 99394 33360 156449 -235565
18426b1412j51711j4328C9048a07897I7008B6904b32410D5409K32782A00299d87937
$$ -21412 -173123 -187451 39048 -107897 97008 26904 -232410 45409 278191 100299 -487937
18414a41723l3738c625B9998i2181F0952a90102B44578B3671G226Q9763K16054
$$ -141723 -175461 -3625 29998 -92181 60952 -190102 244578 23671 7226 96989 313043
18403C13043C5945Q9082a58827j64496B2719g6031b5926A72965c42239D8291Q9285
$$ 313043 35945 125027 -158827 -323323 22719 -76031 -25926 172965 -342239 48291 137576
18392A37576J02321h1946L6436A10342e4795I6855e9117j43299k9338l0693A10159
$$ 137576 239897 -81946 -45510 110342 -54795 96855 -59117 -202416 -231754 -262447 110159
18380A5664M9064b46203B52199b52447f1635p6406k2981B28412A03743J6136J14987
$$ 15664 64728 -246203 252199 -252447 -61635 -138041 -161022 228412 103743 119879 234866
18369B34866p4666i8508B57022j2810n343a49318O9275m6920l0906d2351A22165
$$ 234866 160200 -98508 257022 244212 238869 -149318 -80043 -126963 -157869 -42351 122165
18357C62353A66382n3843i0587M2125B48109a72264a3852j21402c6061j86902
$$ 362353 166382 112539 -90587 -48462 248109 -172264 -13852 -135254 -36061 -222963
18347b22963f3369k1917K7540K4987j71437A33987B0687b71478J04846e6704j64397
$$ -222963 -63369 -85286 -57746 -32759 -204196 133987 20687 -271478 -166632 -56704 -221101
18336b21101L7382p9948J28430k5745G0043b49285C70518E5673h9248F3705b90294
$$ -221101 -183719 -263667 -135237 -160982 70043 -249285 370518 55673 -89248 63705 -290294
18324b6441m42679A37740N6620l3387A2613a49647N0915B14420B7191d2464r8629
$$ -26441 -469120 137740 194360 160973 12613 -149647 -98732 214420 27191 -42464 -141093
18313a41093k53695A11525b33602A09130a37300a3537m5625E760a53619A98328
$$ -141093 -394788 111525 -233602 109130 -137300 -13537 -59162 5760 -153619 198328
18302A642g5468C0725J06039A6240e8496A26359c96376M0066H7843h3523k43084
$$ 1642 -75468 30725 136764 16240 -58496 126359 -396376 -356310 87843 -83523 -326607
18291c26607A35694c5627j22529B47823j23093J6326D7932J33716d8065G2409
$$ -326607 135694 -35627 -158156 247823 124730 141056 47932 181648 -48065 72409
18280d6753I2106a48797L0222I2499c94646a39368A50231a50831B26841h1805
$$ -46753 92106 -148797 -118575 92499 -394646 -139368 150231 -150831 226841 -81805
18269C3188b51797f7748k30890i0466A04585L6644a35759F4875a27129M1154p1014
$$ 33188 -251797 -67748 -298638 -90466 104585 141229 -135759 64875 -127129 -85975 -156989
18258a56989D6214b42901f926m9850k27475a14763A99977d5456r774R052C2085
$$ -156989 46214 -242901 -6926 -56776 -284251 -114763 199977 -45456 -55230 -46178 32085
18246H9310J05273a6597j40449j7570A4189e773k34181i765C24886b54903G7667
$$ 89310 194583 -16597 -157046 -174616 14189 -5773 -239954 -9765 324886 -254903 77667
18234A4249J804k132a17149p8274G6742c3643j41528q7706h4783A9726b46847
$$ 14249 16053 13921 -117149 -195423 76742 -33643 -175171 -262877 -84783 19726 -246847
18222A22354B3411b16115A50774j8989b32666f1883A18197D3060a92206A49819
$$ 122354 23411 -216115 150774 131785 -232666 -61883 118197 43060 -192206 149819
18211b8572j82358b9678k59114P098C41195b6309F8463l2372K12934c1684k3974
$$ -28572 -210930 -29678 -288792 -281694 341195 -26309 68463 36091 249025 -31684 -55658
18200e5658j89969A55645a81251B9490i5840a4136A76569c5535k8893H6570b9469
$$ -55658 -245627 155645 -181251 29490 -95840 -14136 176569 -35535 -64428 86570 -29469
18188A19273R926h2827I8365C9202K6473a00966i500A37261o4989d098k97014
$$ 119273 129199 -82827 98365 39202 65675 -100966 -9500 137261 72272 -4098 -301112
18177c01112N8769d4804j29872j08870A47496f5146B52883l9545h6004B1516a53278
$$ -301112 -242343 -44804 -174676 -283546 147496 -65146 252883 213338 -86004 21516 -153278
18165A27941c09699A50678a63052j94451J00063B05434c59182G6804b1975A62588
$$ 127941 -309699 150678 -163052 -357503 -257440 205434 -359182 76804 -21975 162588
18154a80564B30885E7894a86362C81345d6389j82308f9188A15449M6551a23599
$$ -180564 230885 57894 -186362 381345 -46389 -228697 -69188 115449 162000 -123599
18143a56188A2364d6360A5924J42512G051d25508b473j74045G267O2417k253b52274
$$ -156188 12364 -46360 15924 158436 7051 -425508 -2473 -176518 7267 69684 67431 -252274
18130h1625A97213a06055A25854o1889a90279k7172L9783F2968a6824q509A47983
$$ -81625 197213 -106055 125854 63965 -190279 -217451 -177668 62968 -16824 -25333 147983
18118a57078l7941r9935B24695J0569a1662j12536G6164K55037b40239O7556e2756
$$ -157078 -195019 -294954 224695 235264 -11662 -124198 76164 331201 -240239 -172683 -52756
18106C654J19603J4640a6048I1992J13724b6289C52571a91434C3558a03124J9139
$$ 3654 123257 137897 -16048 91992 205716 -26289 352571 -191434 33558 -103124 -83985
18095h3985H2124b47458c4393k13077o9820A00835b11979A09699K8437a78853
$$ -83985 82124 -247458 -34393 -247470 -317290 100835 -211979 109699 138136 -178853
18084A88408f8011B42109c2057D494K28801J31163b1033C46482A40302a15944
$$ 188408 -68011 242109 -32057 4494 233295 364458 -21033 346482 140302 -115944
18073A87574C4493J40126m7184f7186b4872E0813Q3755H677O0886b90854B38905
$$ 187574 34493 174619 127435 -67186 -24872 50813 134568 8677 69563 -290854 238905
18061a78231B68186a35652L8691q0193A528b62783L6197k0856a10240l4210A25473
$$ -178231 268186 -135652 -96961 -177154 1528 -262783 -226586 -247442 -110240 -144450 125473
18049b06509f3933B03123o1699f7479J1452B68257A15238A7107e9132A95118a79688
$$ -206509 -63933 203123 141424 -67479 -56027 268257 115238 17107 -59132 195118 -179688
18037A65912a4642j31772R326j14251A39727A9297c22530D7103e851A07655b80467
$$ 165912 -14642 -146414 -137088 -251339 139727 19297 -322530 47103 -5851 107655 -280467
18025a54012e4125A47774L4909a47536A46292h9906B05901D8850g8439f430j14287
$$ -154012 -54125 147774 182683 -147536 146292 -89906 205901 48850 -78439 -6430 -120717
18014a20717G7842M9583c45207J71342J0367D3510a42408B14903c9713A80483
$$ -120717 77842 127425 -345207 -173865 -163498 43510 -142408 214903 -39713 180483
18003B37473e9259F6650b22920A00584a83292c7094l4706K5921A31266F5074h3208
$$ 237473 -59259 66650 -222920 100584 -183292 -37094 -71800 -45879 131266 65074 -83208
17991b23449C40386B0650b0574o4335p1458A0863b74833B76416A06696c13697
$$ -223449 340386 20650 -20574 -84909 -156367 10863 -274833 276416 106696 -313697
17980B78957A13735m320a70878c9851G979P8448I510e6443A718J50083o1545b51113
$$ 278957 113735 109415 -170878 -39851 7979 86427 9510 -56443 1718 151801 90256 -251113
17967d9691g170A9895h563H8799a85778j0667Q1961r5049B27730J8560k1229a4148
$$ -49691 -7170 19895 -8563 88799 -185778 -196445 -114484 -209533 227730 246290 225061 -14148
17954b34675f3842C3732a05784r8520F4574i0973A717d8780p6288I0383c3420
$$ -234675 -63842 33732 -105784 -204304 64574 -90973 1717 -48780 -125068 90383 -33420
17942a40315e4245A00313i4190A76930c2716m3013j53043H7770b64372j0361f9863
$$ -140315 -54245 100313 -94190 176930 -32716 -75729 -228772 87770 -264372 -274733 -69863
17930B32246a37721n253k1382O3317j98367K3268H7916C5718K45505a9015G5475
$$ 232246 -137721 -142974 -164356 -101039 -299406 -276138 87916 35718 281223 -19015 75475
17918F3536K50041A03308k7135g4017j68830C8574b39652A73719a56778A1073
$$ 63536 313577 103308 76173 -74017 -242847 38574 -239652 173719 -156778 11073
17907A31066B4442b2505J858A42321C9654e7997K0837C00935H0249J14370n9308
$$ 131066 24442 -22505 -20647 142321 39654 -57997 -37160 300935 80249 194619 135311
17896A35311a81429C401J01126M0240p579K57084g9248L2749e905C56616b16854
$$ 135311 -181429 3401 104527 144767 137188 394272 -79248 -46499 -5905 356616 -216854
17884I9281g6546g230k7056j1333F8634b41287D4799h3724I5717P6845C5521J7663
$$ 99281 -76546 -7230 -34286 -45619 68634 -241287 44799 -83724 95717 172562 35521 53184
17872E3184J30305a18576K3621C5525a11574j21151A3547J22144h6479B39811
$$ 53184 183489 -118576 -94955 35525 -111574 -232725 13547 135691 -86479 239811
17861h7230B19790M4442a95987H9731J47158H7384B1351c0303E9037J28411a2764
$$ -87230 219790 264232 -195987 89731 236889 87384 21351 -30303 59037 187448 -12764
17849c16258f0754A0332J23695h9008A55812a048B5980a16103c3171F7309h7844
$$ -316258 -60754 10332 134027 -89008 155812 -1048 25980 -116103 -33171 67309 -87844
17837A51060a28518j47494R9347B83067e8284m4312D8272j1277b46962A2220a23927
$$ 151060 -128518 -276012 -176665 283067 -58284 -102596 48272 36995 -246962 12220 -123927
17825A42963A3582J54968M0781a95634N4930p2141A61307D7421b01548k371e1484
$$ 142963 13582 168550 209331 -195634 -140704 -212845 161307 47421 -201548 -203919 -51484
17813f3839J0750r9774j6663L3649A83015a15371H7832e1289A35030e012j96958
$$ -63839 -53089 -152863 -169526 -135877 183015 -115371 87832 -51289 135030 -5012 -201970
17802b01970l8069A26734a00953j25724R0110r634j89808a27941c4902j2400k81134
$$ -201970 -240039 126734 -100953 -226677 -136567 -146201 -336009 -127941 -34902 -47302 -328436
17791c28436A57552p3126o484i0624P507n9331f6038E596J09173K437B6354a33798
$$ -328436 157552 84426 77942 -90624 -83117 -142448 -66038 5596 114769 117206 26354 -133798
17778G4255f2701k27996e703A6475J2498R0320l8837A4709b26096N3589h5845
$$ 74255 -62701 -290697 -5703 16475 28973 119293 80456 14709 -226096 -172507 -85845
17766a40661A92100a67712B01138b91537J34324A73568b9921A43852L07626g7245
$$ -140661 192100 -167712 201138 -291537 -157213 173568 -29921 143852 451478 -77245
17755B55574d6627q352j69244a03549L6541r4760k05066i1538a8705j29687c3624
$$ 255574 -46627 -54979 -224223 -103549 -67008 -161768 -366834 -91538 -18705 -148392 -33624
17743D5113c9236C63932E8245J41389J77015A30647N3152i3044A7735a09330N3511
$$ 45113 -39236 363932 58245 199634 376649 130647 183799 -93044 17735 -109330 -55819
17732e5819E7856g1846G823J2001e6846k5596r370A52488D432b87512g7038G2728
$$ -55819 57856 -71846 7823 19824 -56846 -82442 -91812 152488 4432 -287512 -77038 72728
17719B55551D6943J87456A8130J68696c21716B0643g9326m5011D1732R4130c1367
$$ 255551 46943 234399 18130 186826 -321716 20643 -79326 -124337 41732 135862 -31367
17707A10898e4481A69067h6328A68b57556d7283G1943J78419f6496k46382A53579
$$ 110898 -54481 169067 -86328 168 -257556 -47283 71943 250362 -66496 -312878 153579
17695i9798n9346a8288r996A6207c2320C0991f1054a2840B4379a93916j01791
$$ -99798 -159144 -18288 -28284 16207 -32320 30991 -61054 -12840 24379 -193916 -295707
17684b95707E37346A68025a0648G4915P4913a72397c1587A48173F4328J81326
$$ -295707 537346 168025 -10648 74915 149828 -172397 -31587 148173 64328 245654
17674B45654J01944A30850J21290D1740b0924A28231K09782A25859A0246J07389
$$ 245654 347598 130850 252140 41740 -20924 128231 338013 125859 10246 117635
17664A17635f649B01726a57967B43092k102e5919A69323a44928N4915k50392B03639
$$ 117635 -6649 201726 -157967 243092 240990 -55919 169323 -144928 -90013 -340405 203639
17652b0169A7619L49024d10908C5891J23646n555o61J24433q1193J31948b88976
$$ -20169 17619 366643 -410908 35891 159537 153982 153321 277754 196561 328509 -288976
17640g8611k0231k8658A64852m0276L3613K62635j59459a77166K7201G052K55744
$$ -78611 -98842 -127500 164852 124576 158189 420824 261365 -177166 -149965 7052 262796
17629B62796g9730A63450B1356b51890B26203a1575B16136g6316A45789O002A3564
$$ 262796 -79730 163450 21356 -251890 226203 -11575 216136 -76316 145789 151791 13564
17617A0429d490B28396E0399o929J47579Q4094j29532D1260b078r5117H2280J7141
$$ 10429 -4490 228396 50399 43470 191049 275143 145611 41260 -2078 -97195 82280 99421
17605I9421A8255p8p831j892g146F6581a11963A24818i2131j45208A34099P4405
$$ 99421 18255 18177 10346 8454 -7146 66581 -111963 124818 -92131 -237339 134099 208504
17593B08504a61607H9071J69869b43999j00985A97075a60904A98932f8848o0999
$$ 208504 -161607 89071 258940 -243999 -344984 197075 -160904 198932 -68848 -129847
17583a29847d1819C60514B8662K19025A3436J45842n1188a66957k04568a77623
$$ -129847 -41819 360514 28662 247687 13436 159278 108090 -166957 -371525 -177623
17572c98970h823B74640b40212G9011g2507b5699I6066E168d24058d294j16338
$$ -398970 -8823 274640 -240212 79011 -72507 -25699 96066 5168 -424058 -4294 -120632
17561a20632B5282J56054J62763d7320E6661J49186J79446G8423a42096c9569
$$ -120632 25282 181336 344099 -47320 56661 205847 385293 78423 -142096 -39569
17550a01324B62434F4145M4507l1990a6202A46692a1519B2275K7432J6152N2716
$$ -101324 262434 64145 108652 76662 -16202 146692 -11519 22275 49707 65859 118575
17539A18575M01263b607C34706A54482N3826b10842c4396A86323C9662i1883G6195
$$ 118575 519838 -2607 334706 154482 208308 -210842 -34396 186323 39662 -91883 76195
17527a91007D3543k284Q082J00161J95387a35034B07534a33480F8617K90477A66956
$$ -191007 43543 41259 49341 149502 344889 -135034 207534 -133480 68617 359094 166956
17515f9119p4270A03370J52229a96016B9702K9046d1385A19805k3822L40304j35565
$$ -69119 -143389 103370 255599 -196016 29702 58748 -41385 119805 95983 436287 300722
17504C00722r7194K9661a86889B21462b3147F3560i3011B53540j3210d6776A13442
$$ 300722 203528 233189 -186889 221462 -23147 63560 -93011 253540 240330 -46776 113442
17492A26738K3908J56124d4472p799A64989j4185P3067I0031J76073g8550r4057
$$ 126738 150646 306770 -44472 -52271 164989 150804 223871 90031 266104 -78550 -172607
17481a72607C13752A47991k0626n8252h0433H2029L852L52452b08904A80930a34032
$$ -172607 313752 147991 127365 69113 -80433 82029 85881 438333 -208904 180930 -134032
17469B17303F0619L60523H9795L04396q9890o7682J10796G7123K58589A07467
$$ 217303 60619 421142 89795 394191 304301 236619 347415 77123 335712 107467
17458B14202a36491D0443d0426A04843J17783m7852G2403P3550G2655f7154A60324
$$ 214202 -136491 40443 -40426 104843 222626 174774 72403 145953 72655 -67154 160324
17446G8619Q9579Q152m3985J5488J54940j26468D6652J04121b04475A48076d3640
$$ 78619 168198 176350 132365 147853 302793 176325 46652 150773 -204475 148076 -43640
17434a86695B9216J27315K56445a94404B13416L57525B64749j20708Q5097E0663
$$ -186695 29216 156531 412976 -194404 213416 570941 264749 144041 229138 50663
17423B96587A22694L06260B11612K30214B03073G9497i6927B11277J17442H0029
$$ 296587 122694 428954 211612 441826 203073 79497 -96927 211277 328719 80029
17412E4353L79008A78020l6344K00302J30954k34260a79307C55965m5614l5733
$$ 54353 433361 178020 141676 341978 472932 238672 -179307 355965 310351 274618
17402B74618H3762J61632G7490L87337A72174J25012P6644J24808B43893A7288
$$ 274618 83762 245394 77490 464827 172174 297186 373830 498638 243893 17288
17391D37478c07637H4101K47816A37379b08230Q9334b9964O6B37559r4897c04017
$$ 437478 -307637 84101 331917 137379 -208230 -118896 -29964 -29898 237559 142662 -304017
17379A00118k2406d4178j07377C0124d6942B89214r6101C6670L96198r5441G0262
$$ 100118 77712 -44178 -151555 30124 -46942 289214 193113 36670 432868 337427 70262
17367i2390A46746L7999n9377J39048j11278K55941j58452m3661i4977A08535
$$ -92390 146746 184745 125368 264416 153138 409079 250627 206966 -94977 108535
17356C77161g2473C93441j27677D3121f3948j27210A90798P0673C0331J76072
$$ 377161 -72473 393441 265764 43121 -63948 -191158 190798 261471 30331 206403
17346B06403l6098O8828p9220R319K98258q7869j7879c8435E4079M74600B63860
$$ 206403 170305 239133 159913 169232 467490 379621 361742 -38435 54079 528679 263860
17334I5427J44964P712Q3391G9567f4965H4525i6285D87678k06331I1514P6502
$$ 95427 240391 248103 331494 79567 -64965 84525 -96285 487678 281347 91514 168016
17323A68016Q7618o2703P4246B6652c3865p1958A27763a01408a5094A34822k8722
$$ 168016 255634 192931 267177 26652 -33865 -105823 127763 -101408 -15094 134822 106100
17312A06100P5631c6296C40137j52946D4765J708N6427K33966A60127f866j47755
$$ 106100 181731 -36296 340137 187191 44765 46473 102900 336866 160127 -6866 -154621
17301a54621A17968J60485A31030L76232I6571K80679p1496c1122J0315B91599
$$ -154621 117968 278453 131030 507262 96571 377250 305754 -31122 -20807 291599
17290B31556h1897C26898A08374K65674G5876M46423a08750H1194M15489A54240
$$ 231556 -81897 326898 108374 374048 75876 522299 -108750 81194 496683 154240
17279A50787m3281i3894b0655A29093B5258a29532A9901c136q627B26451J56136
$$ 150787 107506 -93894 -20655 129093 25258 -129532 19901 -3136 -11763 226451 382587
17268C82587j66643I5714J94001k7537k5601J62173j48489l8749J65029m3717
$$ 382587 215944 95714 289715 262178 236577 398750 250261 211512 376541 332824
17258C32824a22600E12044A88678O8312O3111j5284J1608j40864B1275J63323
$$ 332824 -122600 512044 188678 256990 320101 304817 316425 175561 21275 184598
17248A84598J07579R4775A35285M3726J27597j42877J46882l4753A18190J72900
$$ 184598 292177 386952 135285 179011 306608 163731 310613 275860 118190 291090
17238B91090l9072p6372a01135A06322N2580o2285J08086Q5078a59966B84369
$$ 291090 252018 175646 -101135 106322 158902 96617 204703 289781 -159966 284369
17227B32825M3454c293A9090K5605J2388e6400B34611J23689j26325N042C8090
$$ 232825 276279 -3293 19090 44695 57083 -56400 234611 358300 231975 237017 38090
17215E43635k00015C2653L25906A1946J97819l2553J865b6340B37215j07154Q5143
$$ 543635 343620 32653 358559 11946 209765 177212 179077 -26340 237215 130061 215204
17204B15204K00950A08217J77369D3073M98594j36056j21773A01923M5105P7175
$$ 215204 416154 108217 285586 43073 541667 405611 283838 101923 147028 224203
17194B24203j0963J00247J61982j59920A7379L83503q8397A06936J0107K31989
$$ 224203 213240 313487 475469 315549 17379 400882 312485 106936 117043 349032
17184C49032c0963C68113O1863O1962o9424j03414J05350a9951B19293J32387
$$ 349032 -30963 368113 429976 491938 422514 319100 424450 -19951 219293 351680
17174C51680N60D2394J70956J70927C1386a11098B54926p540n4529K63334p8924
$$ 351680 352240 42394 213350 384277 31386 -111098 254926 247386 192857 456191 377267
17163C77267A38431C2425K34701N6044R5197A44099J56877J52577J40469B78448
$$ 377267 138431 32425 267126 323170 418367 144099 300976 453553 594022 278448
17152C17421J31006j10336K14772A76947L4298J96621R7432b6153B21512J37873
$$ 317421 448427 338091 552863 176947 211245 407866 505298 -26153 221512 359385
17142C59385m8134K19397B07718k1545J68077J65537A27096K03729k4712A22823
$$ 359385 311251 530648 207718 186173 354250 519787 127096 330825 306113 122823
17131B03020K74502j47011j35664L58218k54108P180N7555L04676B80043L43687
$$ 203020 477522 330511 194847 553065 298957 306137 363692 668368 280043 623730
17121F23730j6887P7570D8298L20493M0512j11231E0302L67117p5158L11437k00376
$$ 623730 606843 684413 48298 368791 409303 298072 50302 417419 342261 653698 453322
17110D53322B11296H6387i981D15593k792k1685j72967L98480j13874p4504j26624
$$ 453322 211296 86387 -9981 415593 412801 391116 218149 616629 502755 428251 301627
17099C01627J59603j08999J22791q0657j65814K11987j46203K15854K1075p7677
$$ 301627 461230 352231 475022 394365 228551 440538 294335 510189 531264 453587
17089D53587j88355J62263R4645j74432P7965J84677k42373j83860L29755j9945
$$ 453587 265232 427495 522140 347708 425673 610350 367977 184117 513872 493927
17079D93927j49410J18635A83312L22572j68582L43568K02907D15331r4238q5032
$$ 493927 344517 463152 183312 505884 337302 680870 883777 415331 321093 236061
17069B36061K31831j2515A71810M45364I0404M10898k01967J29323j40171M45962
$$ 236061 467892 455377 171810 617174 90404 501302 299335 428658 288487 734449
17059G34449j19600j68051L0928L12593k28847q2860J2057K27261B73103K49238
$$ 734449 614849 446798 477726 790319 561472 478612 490669 717930 273103 522341
17049E22341K950j46013R8854l9093L805j62862J45104J66313Q277j20309A69136
$$ 522341 525291 379278 478132 439039 442844 279982 425086 591399 599676 479367 169136
17037H67589l58353K12240C49861K3660J49691J47467J20718k72004k51361K18535
$$ 867589 509236 721476 349861 373521 523212 670679 791397 519393 268032 486567
17027D86567L41472j01776O7757k15678j09771J82566J45693q6596q6580J11324
$$ 486567 828039 726263 794020 578342 468571 651137 796830 710234 623654 734978
17017G34978k89040K16523L07386k49898r3943l03144L45117B81821P98674k39938
$$ 734978 445938 662461 969847 719949 626006 322862 667979 281821 1080495 840557
17007H40557D14026L62265l4072M8731j18661Q3373R6530Q5732J23467m12643
$$ 840557 414026 776291 742219 790950 672289 755662 852192 937924 1061391 648748
16997F48748J97016k83155K84810K25963K0191k04902O3833q6505J04826m75081
$$ 648748 845764 562609 847419 1073382 1093573 888671 952504 865999 970825 495744
16987D95744J65826p6886J82847Q4683j165r686o2474J53260k59936M58197k55930
$$ 495744 661570 584684 767531 852214 851049 841363 778889 932149 672213 1130410 874480
16976H74480k8672J73918k459L6128j70891Q6678R0072j75023n478J24518k19319
$$ 874480 845808 1019726 1017267 1053395 882504 969182 1059254 884231 878753 1003271 783952
16965G83952Q7088M07866l82948l9000N91231n31790J89839j41610j529j34371
$$ 783952 871040 1278906 895958 856958 1448189 916399 1106238 964628 963099 828728
16955H28728L92484M164J97919n75904O45184k86963j82378J68918l35855K33618
$$ 828728 1221212 1225376 1423295 847391 1492575 1205612 1023234 1192152 856297 1089915
16945A089915j79201J75061n6523l4004k03452K69462O3091J61968j95744N7417
$$ 1089915 910714 1085775 1029252 995248 791796 1061258 1124349 1286317 1090573 1147990
16935A147990K48793k68117J80777J7508l45502M28614l9241j88045K12450J10454
$$ 1147990 1396783 1128666 1309443 1326951 981449 1410063 1370822 1182777 1395227 1505681
16925A505681j36269j63662L2836R7423q4840l6581J41434K88072j34780j14320
$$ 1505681 1369412 1205750 1238586 1336009 1251169 1214588 1356022 1644094 1509314 1394994
16915A394994j56005L04110m7583J47535J2836J0084l98462J41873J96229j3059
$$ 1394994 1238989 1543099 1495516 1643051 1655887 1665971 1267509 1409382 1605611 1592552
16905A592552J51480j64659k5099M04065k62371Q9861o884K4054j93641K0481
$$ 1592552 1744032 1579373 1554274 1958339 1695968 1785829 1778945 1802999 1609358 1629839
16895A629839M6255J55552N1960k35463J01329J03361r9062j94945M34556R4764
$$ 1629839 1676094 1831646 1883606 1648143 1749472 1852833 1753771 1558826 1993382 2088146
16885B088146J72572k39050K83008p1851m8364m20575M70128O1219K62462j99633
$$ 2088146 2260718 2021668 2304676 2232825 2184461 1763886 2234014 2295233 2557695 2358062
16875B358062j4236k99656j10312M01572o9405J73686q8789L46406l48028K56602
$$ 2358062 2343826 2044170 1933858 2335430 2266025 2439711 2350922 2697328 2349300 2605902
16865B605902J31087k31673o4802M3564K37244j02774K18080j17014j36743L47983
$$ 2605902 2736989 2505316 2440514 2484078 2721322 2618548 2836628 2719614 2582871 2930854
16855B930854l90773M24074l30827M52496j3168n9243R6227J88499k0866k06549
$$ 2930854 2540081 2964155 2633328 3085824 3072656 3013413 3109640 3298139 3277273 3070724
16845C070724j49175M77805j97829K70869J42949n9685q7893K1272J36617J04784
$$ 3070724 2921549 3399354 3201525 3472394 3615343 3555658 3467765 3489037 3625654 3730438
16835C730438j20181J81299K59193l13208K89048J4938K6682R3916r9333L49749
$$ 3730438 3610257 3791556 4050749 3737541 4026589 4041527 4068209 4162125 4062792 4412541
16825D412541o9249L2795J63494J73769k44741L8497L41233p2244O721K88712
$$ 4412541 4343292 4376087 4539581 4713350 4468609 4507106 4848339 4776095 4782816 5071528
16815E071528L51280m00790O53396m25526J82823L75348K12387L6050Q0602k79255
$$ 5071528 5422808 5022018 5675414 5249888 5432711 5808059 6020446 6056496 6137098 5857843
16805E857843M59503J35384J42303J39060L5596N08597l95097Q5247J82590K34308
$$ 5857843 6317346 6452730 6595033 6734093 6769689 7278286 6883189 6968436 7151026 7385334
16795G385334J06006O2215K37838J82596L99873L4861K48197K76469L12342j40742
$$ 7385334 7491340 7553555 7791393 7973989 8373862 8408723 8656920 8933389 9245731 9104989
16785I104989P1287O59406J61265K05394M80172m01785N65359L17990L62644L25909
$$ 9104989 9176276 9835682 9996947 10202341 10682513 10280728 10846087 11164077 11526721 11852630
16775A1852630M65264K79351O4982L83656N79568O50711j5727L33169P47483m880
$$ 11852630 12317894 12597245 12662227 13045883 13625451 14276162 14260435 14593604 15341087 15336207
16765A5336207Q29763N33565M97386J86511P70907P77328J23340Q20639M70044
$$ 15336207 16165970 16699535 17196921 17383432 18154339 18931667 19055007 19875646 20345690
16756B0345690Q47492Q07419O25782Q98645R68112P85564R14911R86901Q51918
$$ 20345690 21193182 22000601 22626383 23525028 24493140 25278704 26193615 27180516 28032434
16747B8032434J368207J368775J070182J083662J280314J825150J548576J370636
$$ 28032434 29400641 30769416 31839598 32923260 34203574 36028724 37577300 38947936
16739C8947936J721082K011622K049904K101427J971748K730923K540700K876776
$$ 38947936 40669018 42680640 44730544 46831971 48803719 51534642 54075342 56952118
16731E6952118K637276L315505L018628L962846L580831L386310M350072M500824
$$ 56952118 59589394 62904899 65923527 69886373 73467204 76853514 81203586 85704410
16723H5704410M599089N332878N083133N551716N806380N723258O215609N874778
$$ 85704410 90303499 95636377 100719510 106271226 112077606 117800864 124016473 129891251
16715A29891251O275006O145787O196685N955215N825945N115133M964058M020628
$$ 129891251 136166257 142312044 148508729 154463944 160289889 165405022 170369080 174389708
16707A74389708L387576K711974J475206P0228J3212j608282k534603l359221
$$ 174389708 177777284 180489258 181964464 182034692 182047904 180439622 177905019 174545798
16699A74545798m184564m738458n328521o191101o021016o298689o647235o507061
$$ 174545798 170361234 165622776 160294255 154103154 148082138 141783449 135136214 128629153
16691A28629153o256550o456333o391158n711816n590194n460313n261189m522874
$$ 128629153 122372603 115916270 109525112 103813296 98223102 92762789 87501600 82978726
16683H2978726m762526m064471m365969l540711l692739l029507l217497k894517
$$ 82978726 78216200 74151729 69785760 66245049 62552310 59522803 56305306 53410789
16675E3410789k580370l020821k294046j820658k209795k146136k128189j085745
$$ 53410789 50830419 47809598 45515552 43694894 41485099 39338963 37210774 36125029
16667C6125029j614708j459459j546525j350498j670326j042972p68117j291531
$$ 36125029 34510321 33050862 31504337 30153839 28483513 27440541 26672424 25380893
16659B5380893r96588j264812o69035q39578p93399p28677r62288p30250m22632
$$ 25380893 24384305 23119493 22450458 21610880 20817481 20088804 19126516 18396266 17973634
16650A7973634n66238r41217k43127n53976l80385o54212l43892m04045n88505
$$ 17973634 17407396 16466179 16223052 15669076 15288691 14634479 14290587 13886542 13298037
16641A3298037k29864o56784m48080j05855n54439k34105o71870r3164k15041
$$ 13298037 13068173 12411389 11963309 11857454 11303015 11068910 10397040 10303876 10088835
16632A0088835m37106R7538j25856n56183l26190L6478m52426j73003j82833j93790
$$ 10088835 9651729 9749267 9623411 9067228 8741038 8777516 8325090 8152087 7969254 7775464
16622G775464m90277O0331K13946o49021j25726k72846k6720l14056K99824j79889
$$ 7775464 7285187 7345518 7559464 6910443 6784717 6511871 6485151 6171095 6470919 6291030
16612F291030j26569m18430L01813l43268j95j06029l23162k62111K4587K23240
$$ 6291030 6164461 5746031 6047844 5704576 5704381 5598352 5275190 5013079 5037666 5260906
16602E260906n56185L25149l75096o9120r5191o0590r6982P5902j07670m04819
$$ 5260906 4704721 5029870 4654774 4585654 4490463 4429873 4332891 4408793 4301123 3896304
16592C896304K84012q5949k70310M2562j02268j35325l78088L62690m55677L85513
$$ 3896304 4180316 4094367 3824057 3866619 3764351 3629026 3250938 3613628 3157951 3543464
16582C543464p8941r3705k01433j70113m5473M5598R9579j63617j50853N98707
$$ 3543464 3464523 3370818 3169385 2999272 2953799 2999397 3098976 2935359 2784506 3383213
16572C383213n87453l31o4513j94503j22839K83098n653k58696J18582l22095
$$ 3383213 2795760 2795429 2730916 2536413 2413574 2696672 2691019 2432323 2550905 2228810
16562B228810J75683j38287J831K11869k53701l93326M16014q6525l14471J91648
$$ 2228810 2404493 2266206 2268037 2479906 2226205 1832879 2248893 2162368 1847897 2039545
16552B039545m667O3862o0432K04828k75070P1250j47003L3706k84925r0911K10177
$$ 2039545 2034878 2098740 2038308 2243136 1968066 2039316 1892313 1926019 1641094 1550183 1760360
16541A760360J50391j86067j64047L78763k79534k50667K85991J37446l41443
$$ 1760360 1910751 1724684 1560637 1939400 1659866 1409199 1695190 1832636 1491193
16532A491193O4026J41244j52624k34165o8314N6672L49363q5785k96032l8953
$$ 1491193 1555219 1696463 1543839 1309674 1241360 1298032 1647395 1561610 1265578 1226625
16522A226625J0534K95759l75270K87304j52346j2273q7521o91R871L6438m3127
$$ 1226625 1237159 1532918 1157648 1444952 1292606 1280333 1192812 1192121 1201992 1238430 1195303
16511A195303k56877L18198J07044k53150J79805l34879j4494o422L51101k49390
$$ 1195303 938426 1256624 1363668 1110518 1290323 955444 940950 934528 1285629 1036239
16501A036239N0763L91739l77012k1038j49993l2819J51904j67764k5429N8744
$$ 1036239 1087002 1478741 1101729 1080691 930698 897879 1049783 882019 856590 915334
16491I15334j13746J81681J8542j16989j7488j23984K32400j57525N8031j98804
$$ 915334 801588 983269 1001811 884822 867334 743350 975750 818225 876256 677452
16481F77452j88863L16778K30287k00492p1981K99146l11465m0728J59956J57646
$$ 677452 488589 805367 1035654 835162 763181 1062327 750862 710134 870090 1027736
16471A027736m35634P4091N149k30191N02972m61821L36311p3966J41233r0289
$$ 1027736 592102 666193 671342 441151 944123 482302 818613 744647 885880 795591
16461G95591j21204M1531k96677L67320k59794J53491M5734j68830J82957K69608
$$ 795591 674387 715918 419241 786561 526767 680258 725992 557162 740119 1009727
16451A009727k04844k24625K7585q150M6170k81934K71336J65358k13750k08187
$$ 1009727 804883 580258 607843 599693 645863 363929 635265 800623 586873 378686
16441C78686K21049J49498J34764C30843K08287J31431C18519M3958L45908j34770
$$ 378686 599735 749233 883997 330843 539130 670561 318519 362477 708385 573615
16431E73615B46763K98304J17092k23502j64972J66206K3011j31122O8760J3445
$$ 573615 246763 545067 662159 438657 273685 439891 462902 331780 400540 413985
16421D13985J34019J44676B39151J82977R937K2328K1522D7370O34179l21208
$$ 413985 548004 692680 239151 422128 432065 454393 475915 47370 681549 360341
16411C60341L77514m8614k55080j04719L18424B98092N48820l03629P5280j66785
$$ 360341 737855 689241 434161 329442 647866 298092 846912 543283 618563 451778
16401D51778A43663J81941P3717R4786O9987B44290J43547M8957M03894l18493
$$ 451778 143663 325604 399321 494107 564094 244290 387837 436794 840688 522195
16391E22195K13864B71615M42905B74713M0014L39640j95940K18507G6112M11156
$$ 522195 736059 271615 714520 274713 314727 654367 458427 676934 76112 487268
16381D87268G5139M54352N2492B74923K567p2777J76683n9416L12356l7594G2109
$$ 487268 75139 529491 581983 274923 277490 204713 381396 321980 634336 596742 72109
16369d8270C66526m9975K97856k74657J227o3197D0051L7340M02517B34543j7092
$$ -48270 366526 316551 614407 339750 340977 277780 40051 77391 479908 234543 217451
16358B17451q303L7271G0376A7150K25093H9585P6142b25231A10496J60375A35382
$$ 217451 209148 246419 70376 17150 242243 89585 165727 -225231 110496 270871 135382
16346E95322B17430F9735J43211J43758l7100j1136H5857J94352o2708J7496R3224
$$ 595322 217430 69735 212946 356704 319604 308468 85857 280209 217501 234997 328221
16335C28221J51608j22722N6206I2085c0338B45466l7173r4053K2842a7529C38150
$$ 328221 479829 357107 413313 92085 -30338 245466 208293 114240 137082 -17529 338150
16323B43193J89794R0321j28930j88474L27970b9240A43699J02983H3954K50418
$$ 243193 432987 523308 394378 205904 533874 -29240 143699 246682 83954 334372
16313C34372M5486G4471L08289A10109j9407h27B1937K4316L33153A39846d8211
$$ 334372 379858 74471 382760 110109 90702 -827 21937 46253 379406 139846 -48211
16301c1259C1902J71045I1450K30656J06434n1536a77566B54614j0701r0159K27175
$$ -31259 31902 202947 91450 322106 428540 377004 -177566 254614 243913 153754 380929
16290C80929j19851O0210C3013N8644B4765N55143B58410a75718f7433K7204F3710
$$ 380929 261078 321288 33013 91657 24765 579908 258410 -175718 -67433 -40229 63710
16278A92072K9295I9431a64546A85653M7850M3916A15469R5720j4102J3779C4487
$$ 192072 221367 99431 -164546 185653 233503 277419 115469 211189 197087 210866 34487
16266C98766b2438H0701J16081b0972A69831p3917M3735k0456R5367F589O51197
$$ 398766 -22438 80701 196782 -20972 169831 95914 139649 119193 214560 6589 657786
16255F57786A79113E3947K00791d3539G4809j4478R5626m4839k4282J54484a1132
$$ 657786 179113 53947 254738 -43539 74809 60331 155957 111118 86836 241320 -11132
16243H7492L18242B01358n0126c0186j08392q3005P2084a1326j76193b0086N062
$$ 87492 405734 201358 151232 -30186 -138578 -221583 -149499 -11326 -187519 -20086 -15024
16232a5024B81284A28889o0298g8230r232j4144J086H4926L14560C0655L19383
$$ -15024 281284 128889 68591 -78230 -87462 -101606 -100520 84926 399486 30655 350038
16221C50038a74241A19602O9254k2206c6941A64214E238J13248b93494a18336
$$ 350038 -174241 119602 188856 166650 -36941 164214 5238 118486 -293494 -118336
16210f6158B07617a9157B10285k4259k2153a18698B30404a15936G5886J70984
$$ -66158 207617 -19157 210285 186026 163873 -118698 230404 -115936 75886 246870
16200B46870a83701L4477F8744K93645j41326g5928i100C07190r6188b3427k87868
$$ 246870 -183701 -149224 68744 362389 221063 -75928 -9100 307190 211002 -23427 -311295
16189c11295p7522C54870J70550a91467d8462K1538A36564h0363I5858a3532j87721
$$ -311295 -388817 354870 525420 -191467 -48462 -26924 136564 -80363 95858 -13532 -201253
16178b01253h4533k82056C4394J45055i8752M7824B74206a71660j6920A37173
$$ -201253 -84533 -366589 34394 179449 -98752 -50928 274206 -171660 -188580 137173
16167C17745j26973J17065c2351j80081N5370q7035C8484J57124a57283g6424
$$ 317745 190772 307837 -32351 -212432 -157062 -244097 38484 195608 -157283 -76424
16156I0460d0402A86216F6613b06814c5506C4752a33225j13703b7643j26585A73910
$$ 90460 -40402 186216 66613 -206814 -35506 34752 -133225 -246928 -27643 -154228 173910
16144b39885R7644A50783j0303J20843d9031k02115B74612A31024J6218N8098
$$ -239885 -142241 150783 140480 261323 -49031 -251146 274612 131024 147242 205340
16134B05340j02234J25521e7929l6054M4808m1412c982C3381a64625I0747a65004
$$ 205340 103106 228627 -57929 -93983 -49175 -90587 -3982 33381 -164625 90747 -165004
16122G8224b18865a1191D00655a04971A20152M8569H2322d746I5563B4399K88861
$$ 78224 -218865 -11191 400655 -104971 120152 168721 82322 -4746 95563 24399 313260
16111C13260D9797J41160I0591N164a78957O8910r4918B98001D4168a90746B30661
$$ 313260 49797 190957 90591 95755 -178957 -110047 -204965 298001 44168 -190746 230661
16099a6237o0866b2035j14791d2052B35509A6491i9824j18720G4565J63534D8402
$$ -16237 -77103 -22035 -136826 -42052 235509 16491 -99824 -218544 74565 238099 48402
16087A43300J62078A43961L6359k8278O9706a54840c6219j78461B1745M4167a45688
$$ 143300 305378 143961 180320 152042 221748 -154840 -36219 -214680 21745 65912 -145688
16075A05636C8416J17816B8427f9386k0240L9951D7904a30837E1697j2292K82718
$$ 105636 38416 156232 28427 -69386 -89626 -49675 47904 -130837 51697 39405 322123
16064C22123I5120c48665F7791o412O0123h1585A90204j5428D5278a68794L3643
$$ 322123 95120 -348665 67791 61379 121502 -81585 190204 174776 45278 -168794 -135151
16053a35151B079Q7038a72249J0809O7466H215M5421c1358B846c50816g3696A96527
$$ -135151 2079 89117 -172249 -161440 -93974 8215 53636 -31358 2846 -350816 -73696 196527
16040B95216J00154i7175M2854J3646k81536a14241j83134I4142c60681B69341
$$ 295216 395370 -97175 -54321 -40675 -322211 -114241 -297375 94142 -360681 269341
16029B615b0312j25047A7052K95527j14626a59400j45884R3240A28836B5864O4219
$$ 2615 -20312 -145359 17052 312579 197953 -159400 -305284 -212044 128836 25864 90083
16018I0083e947j5752k46887e4620K0571j61254G0136i6247B25895r3265F4899
$$ 90083 -5947 -21699 -268586 -54620 -34049 -195303 70136 -96247 225895 132630 64899
16006f1878A24870b0070A05662i9265B55134b8796j63051H8905E439g5752r80
$$ -61878 124870 -20070 105662 -99265 255134 -28796 -191847 88905 5439 -75752 -76732
15995g6732o4984B2554e7670H9505a84055B83043E461J35241B6564a9176A94189
$$ -76732 -141716 22554 -57670 89505 -184055 283043 5461 140702 26564 -19176 194189
15983A38616B2937J01825c4083j1200B62212B8812L1372e2874A95785q6793a99470
$$ 138616 22937 124762 -34083 -45283 262212 28812 60184 -52874 195785 108992 -199470
15971B39321a51101E32039k46932q5380J19243J85432J0257I6570P8082k5607
$$ 239321 -151101 532039 285107 199727 318970 504402 514659 96570 174652 149045
15961A49045E0583i4369A72156e8744k26807R6284b3899j50099c4839B2914e9436
$$ 149045 50583 -94369 172156 -58744 -285551 -189267 -23899 -173998 -34839 22914 -59436
15949A36880J06d53679a26013j99854E4814e1526b4546A08966a77544A12341M8140
$$ 136880 136986 -453679 -126013 -325867 54814 -51526 -24546 108966 -177544 112341 160481
15938A60481e73910A18085h5668l5646l1135B09100a40252k2244e4774r1237j38118
$$ 160481 -573910 118085 -85668 -121314 -152449 209100 -140252 -162496 -54774 -146011 -284129
15927b84129J5064N2706h7276A31976c9517A48885F4129L022J49733C1364p534
$$ -284129 -269065 -216359 -87276 131976 -39517 148885 64129 67151 216884 31364 23830
15916B3830b85012B37079A04171K2457C3617a19980p4570E1942i9051d6958A46096
$$ 23830 -285012 237079 104171 126628 33617 -119980 -194550 51942 -99051 -46958 146096
15904A05089e3702B056a54713D6603K18935a09585A87668d50578c5150b960j65346
$$ 105089 -53702 2056 -154713 46603 265538 -109585 187668 -450578 -35150 -2960 -168306
15893a68306j52600E217e8646q0177A74218a00443d4056k26509h0586l44235J33623
$$ -168306 -320906 5217 -58646 -138823 174218 -100443 -44056 -270565 -80586 -424821 -291198
15882b91198B95526a90462H4182b10360g1630k93260J47127d4997F3748b63724
$$ -291198 295526 -190462 84182 -210360 -71630 -364890 -217763 -44997 63748 -263724
15871D0246d3714F7644d0539q0350B48035J24301h4415b15B50218L5319a82580
$$ 40246 -43714 67644 -40539 -120889 248035 372336 -84415 -215 250218 285537 -182580
15859H0611a50119c9856A19516i9687L0859A62086a34806C0882e8458E5314J3535
$$ 80611 -150119 -39856 119516 -99687 -68828 162086 -134806 30882 -58458 55314 68849
15848F8849a09507a0491I1297P7774c7677A30393B0234J03108J14087I8688l959
$$ 68849 -109507 -10491 91297 169071 -37677 130393 20234 123342 237429 98688 94729
15837I4729P0698J16117b9783j35975P583o3920c8261j43850j43441J15123A1695
$$ 94729 165427 281544 -29783 -165758 -158175 -222095 -38261 -182111 -325552 -210429 11695
15825b60768J20676A57721a00304n6994h044k7469p6270c3349k6043b981j08030
$$ -260768 -140092 157721 -100304 -157298 -8044 -35513 -111783 -33349 -59392 -2981 -111011
15814a11011a5878b032j5412A45749K7457p8392b86892K890A36687a57487C34501
$$ -111011 -15878 -2032 -17444 145749 173206 94814 -286892 -284002 136687 -157487 334501
15802G3200d04035a37715j74002C2397a23977q5103C65964j19708d1573B64608
$$ 73200 -404035 -137715 -311717 32397 -123977 -209080 365964 246256 -41573 264608
15791a15576A42397a70362j12711C21433a89169A47979b14096b6676m6846j62364
$$ -115576 142397 -170362 -283073 321433 -189169 147979 -214096 -26676 -73522 -235886
15781b35886A59979m9914L7989d3649G2130a86494B22424b40548h5575A30406
$$ -235886 159979 110065 148054 -43649 72130 -186494 222424 -240548 -85575 130406
15770A34560B9760Q7216a41575N3106k01907A4410f3716A67113a07737A08045
$$ 134560 29760 116976 -141575 -88469 -290376 14410 -63716 167113 -107737 108045
15759a48355o0546e8897A61476a9329r5864J4558B386b23441C7704P9223n3740
$$ -148355 -208901 -58897 161476 -19329 -115193 -100635 2386 -223441 37704 116927 63187
15748F3187n515k4052b46012J18807C54004E0695a88929j13548A39869o5082c49673
$$ 63187 57672 33620 -246012 -127205 354004 50695 -188929 -302477 139869 74787 -349673
15736A95165f6019F9454c1451m38331A05123J80594d9651l35034F0029K33715
$$ 195165 -66019 69454 -31451 -469782 105123 285717 -49651 -384685 60029 293744
15726B93744A1639N10324a68165c3059k39714J02289l3079P5489A89771h4455
$$ 293744 11639 521963 -168165 -33059 -272773 -170484 -203563 -128074 189771 -84455
15715E765a74882B53412A17806c88911a93233P7947I0899b4871B15499E3926J20685
$$ 5765 -174882 253412 117806 -388911 -193233 -115286 90899 -24871 215499 53926 174611
15704A74611b03934A21455h5227B20091E7413a47383A82069a03605p9288A10590
$$ 174611 -203934 121455 -85227 220091 57413 -147383 182069 -103605 -182893 110590
15693c17885i0867b2178n960k1100j13476I0316a1070k22081M6044f9174A6514
$$ -317885 -90867 -22178 -28138 -49238 -162714 90316 -11070 -233151 -187107 -69174 16514
15681A08797Q111a2331A45702f7435A11919d4562A61585B6152N4855a19223B4517
$$ 108797 116908 -12331 145702 -67435 111919 -44562 161585 26152 81007 -119223 24517
15669e6634p3869M8016A52195F4234a02645C73847R39a44572A60878c78359J10800
$$ -56634 -130503 -82487 152195 64234 -102645 373847 374786 -144572 160878 -378359 -267559
15658b67559h4090O222K6848j40028n9447A85347a98259h0101m8401b0727k430
$$ -267559 -84090 -77868 -51020 -191048 -250495 185347 -198259 -80101 -128502 -20727 -23157
15647b3157M319j35725f909k63591A51269c02302Q7419A89079b21768g1667q1650
$$ -23157 -18838 -154563 -6909 -270500 151269 -302302 -214883 189079 -221768 -71667 -153317
15636a53317l3382b5802o5672L044A0878K09025A01460B5687a46862k52487a10135
$$ -153317 -186699 -25802 -91474 -88430 10878 219903 101460 25687 -146862 -399349 -110135
15624f2464K4327J2628k8827B4078M5746N3532K393h9058g965A58585K6223a8713
$$ -62464 -38137 -25509 -54336 24078 69824 123356 125749 -89058 -7965 158585 184808 -18713
15611D6842g2473c4691F6240Q7390F4913J07962D42Q6872K13879f5561A0455C000
$$ 46842 -72473 -34691 66240 153630 64913 172875 442 87314 301193 -65561 10455 3000
15598a45123j12837d0232E5109J43574e219D7685b34625c7317B88111a82081B19532
$$ -145123 -257960 -40232 55109 198683 -5219 47685 -234625 -37317 288111 -182081 219532
15586I2232c16668B95239q519e0042A86080a08901A249J41215a73566A30248b11810
$$ 92232 -316668 295239 286720 -50042 186080 -108901 1249 142464 -173566 130248 -211810
15574A23026d0299A41960O4781b7559B5695f8498J1955m7062A36578f2488A7838
$$ 123026 -40299 141960 206741 -27559 25695 -68498 -56543 -103605 136578 -62488 17838
15562F0743J69147e4969e192k29522A73535b093k49020B39936h2504D2742K2345
$$ 60743 229890 -54969 -5192 -234714 173535 -2093 -251113 239936 -82504 42742 65087
15551F5087B2349L9892J07389O8286G7236a78594A70415a55964b5108B2497J20418
$$ 65087 22349 62241 169630 237916 77236 -178594 170415 -155964 -25108 22497 142915
15540A42915R7121L0319A8870J83939J9500R6660C1225a4654n4926J0874o4496
$$ 142915 240036 270355 18870 202809 222309 318969 31225 -14654 -69580 -58706 -123202
15529a23202A06542O1765l7605L00131a04812d2780n1520k2593k1143A95612N5839
$$ -123202 106542 168307 130702 430833 -104812 -42780 -94300 -116893 -138036 195612 251451
15518B51451b30351e6982A2148J19351g994C9056a21040D6662Q7406m365b25267
$$ 251451 -230351 -56982 12148 131499 -7994 39056 -121040 46662 134068 129703 -225267
15506c53098A12176j6351b9258q6041b5459m2361j58486C43933I6664e2968A67184
$$ -353098 112176 95825 -29258 -115299 -25459 -67820 -226306 343933 96664 -52968 167184
15494e5561K3271o1740A07493f6224C116K4306J59960b84661a03935A94485c06658
$$ -55561 -32290 -94030 107493 -66224 3116 27422 187382 -284661 -103935 194485 -306658
15482b79190A40851a6722p8603p6960C76217g9756L4340m5771E2209f907q0489
$$ -279190 140851 -16722 -95325 -172285 376217 -79756 -45416 -91187 52209 -6907 -87396
15471h7396l30295i0019F0483Q5636K6674a03249K8054c602j29958b2354B7901
$$ -87396 -417691 -90019 60483 146119 172793 -103249 -75195 -3602 -133560 -22354 27901
15459a99166j56104a62448A70716c2013k63491B04531F9252K2289a79562A92065
$$ -199166 -355270 -162448 170716 -32013 -295504 204531 69252 91541 -179562 192065
15448d5899D7723f0710F1141J20545p6638j2365b86213G6707J12958L4525c8440
$$ -45899 47723 -60710 61141 181686 105048 92683 -286213 76707 189665 224190 -38440
15436A07325l0270J62021b34226P7333A59228c30415e1793i908D1883J06660D1170
$$ 107325 77055 239076 -234226 -156893 159228 -330415 -51793 -9908 41883 148543 41170
15424d4697A4401b5543D30365C7508O4168K4342c47904I047Q8020D2574Q8948
$$ -44697 14401 -25543 430365 37508 101676 126018 -347904 9047 97067 42574 131522
15413A31522Q3884l2811h4875C07167a65601K5099b5049E5190J36416L7703a21208
$$ 131522 215406 182595 -84875 307167 -165601 -140502 -25049 55190 191606 229309 -121208
15401b06334C2279a91845A21624h99l28953F3904O5881K86227f0587j2383I7755
$$ -206334 32279 -191845 121624 -899 -329852 63904 129785 416012 -60587 -72970 97755
15389E9946c07290d2870F1008b39923Q2180n301M3195D3068J7424J50232C7746
$$ 59946 -307290 -42870 61008 -239923 -157743 -163044 -119849 43068 60492 210724 37746
15377A2068K10958A5813a95677K3296L3018B8898a86148e871A94334L03847a1329
$$ 12068 223026 15813 -195677 -172381 -139363 28898 -186148 -5871 194334 498181 -11329
15365A39661o2164L0200B0687J73226M0563i3329l1186C12105a5072j09837k29485
$$ 139661 77497 107697 20687 193913 234476 -93329 -124515 312105 -15072 -124909 -354394
15354c54394a63981g5349H1426a42675B74830C4900b39298P0669B00259a04424
$$ -354394 -163981 -75349 81426 -142675 274830 34900 -239298 -168629 200259 -104424
15343a46661m958A29936d8662a5428q3899m33715a96037P3376A47650l2140l6644
$$ -146661 -151619 129936 -48662 -15428 -99327 -533042 -196037 -122661 147650 115510 78866
15332G8866J61053c2058j04744q9350B10103A271a541B18309a50329H508b1847
$$ 78866 239919 -32058 -136802 -226152 210103 1271 -1541 218309 -150329 8508 -21847
15320B59609j12445E18J17574e551A65105i4793B31459m6563h702k6688A40048
$$ 259609 147164 518 118092 -5551 165105 -94793 231459 184896 -8702 -35390 140048
15308b7458A60087i0141A56212a25829K8904I7999J85558E4952c00099A43388
$$ -27458 160087 -90141 156212 -125829 -96925 97999 283557 54952 -300099 143388
15297H7994P4285L76867B59454e5121A1124K47592A15054a6167j54189O7511a2921
$$ 87994 162279 539146 259454 -55121 11124 258716 115054 -16167 -170356 -102845 -12921
15285B90602B8462L52939A37965g5668B4124K04781L3540n1680a35908G3108J48260
$$ 290602 28462 381401 137965 -75668 24124 228905 262445 210765 -135908 73108 221368
15274B21368n3825M8575K5427G3359J33629C0513J49059g1139B32869G0566b96800
$$ 221368 167543 216118 241545 73359 206988 30513 179572 -71139 232869 70566 -296800
15262A56205J51307A46384b62098H777a39597A13241d5703C5645J52942E4989
$$ 156205 307512 146384 -262098 8777 -139597 113241 -45703 35645 188587 54989
15251a00357C49052K5279d0540A77705f3659C87085a40298B23168b29050C49103
$$ -100357 349052 374331 -40540 177705 -63659 387085 -140298 223168 -229050 349103
15240g2946A51506J75251b03153E50305j89869R3702J88208O22292R3311K36884
$$ -72946 151506 326757 -203153 550305 360436 454138 642346 1264638 1357949 1594833
15230A594833l02812E00156K2520C4838K68159k6371b33084i6963A22689b17878
$$ 1594833 1292021 500156 522676 34838 302997 276626 -233084 -96963 122689 -217878
15219c527H2079i2839A80860a84675A00984J02147e3310B47807j06757o2594J8000
$$ -3527 82079 -92839 180860 -184675 100984 203131 -53310 247807 141050 78456 96456
15208I6456b16318A07911l9559K00262j00599o078h7876G6334a00398I5949N5689
$$ 96456 -216318 107911 68352 268614 168015 161937 -87876 76334 -100398 95949 151638
15197A51638h3938m345j9159j73293a3942j83569f6403f625A55937l6030N7739
$$ 151638 -83938 -88283 -107442 -280735 -13942 -197511 -66403 -6625 155937 119907 177646
15186A77646J5369a5372m5731o488A90406J47502A24845f3938C27174J17741B13996
$$ 177646 193015 -15372 -61103 -67591 190406 337908 124845 -63938 327174 444915 213996
15174A5578K17589j13053E0514a18486B99679a49388B04644G0021J20003b84282
$$ 15578 233167 120114 50514 -118486 299679 -149388 204644 70021 190024 -284282
15163A85689B4732J5873Q8587e4977H5737K11311L0414b8939A0505J17988K60844
$$ 185689 24732 40605 129192 -54977 85737 297048 327462 -28939 10505 128493 389337
15152C89337F2380a50143A10359K24911D8774l995J07584j5837L7001J35606a12219
$$ 389337 62380 -150143 110359 335270 48774 44779 152363 136526 173527 309133 -112219
15140B97078a20605E7573f9624A24747o2352b34357B571K03254L0950M5956G8262
$$ 297078 -120605 57573 -69624 124747 62395 -234357 2571 205825 236775 282731 78262
15128e1683A35308l520J18991q5223J08508K30144I7079a24349e8506n1855H5311
$$ -51683 135308 131788 250779 165556 274064 504208 97079 -124349 -58506 -110361 85311
15116A93671o466a24543B46559K06029p5658b22603D82J92363M1173r5661M7543
$$ 193671 187205 -124543 246559 452588 376930 -222603 482 192845 234018 138357 185900
15105A85900a40068B67692H0875C3153K23021A11119c89633J50713D5071J46105
$$ 185900 -140068 267692 80875 33153 256174 111119 -389633 -238920 45071 191176
15095A91176e9588C14493g1153m5121C36401l4492n222G6354R6261J44236A03343
$$ 191176 -59588 314493 -71153 -116274 336401 301909 296687 76354 172615 316851 103343
15083C84754A13243F708J8249L31785j05015D2582K68556j8450E7950M816C1239
$$ 384754 113243 6708 24957 356742 251727 42582 311138 292688 57950 62766 31239
15071H6726L82107g9626A55391e9987A46524E0059g9524A79639G5403K76676A45669
$$ 86726 468833 -79626 155391 -59987 146524 50059 -79524 179639 75403 352079 145669
15059H9230J70667K65090C7609J87688A07363J06006b12297A34842m0622L56096
$$ 89230 259897 524987 37609 225297 107363 213369 -212297 134842 94220 450316
15049D50316c4318B70123L71186d6161q6338D29022m7417A07647J61942J16917
$$ 450316 -34318 270123 641309 -46161 -132499 429022 381605 107647 269589 386506
15039C86506j77654J99191r6025j52663G3098J68732R7573N2459A60486J39022
$$ 386506 208852 408043 312018 159355 73098 241830 339403 391862 160486 299508
15029B99508q5800h3225A64927L03282A20960M76666B07931L2655A03878J45845
$$ 299508 213708 -83225 164927 468209 120960 597626 207931 240586 103878 249723
15019B49723j24209a01381B30877q5153J27701m8412j5490M364K19124j98639
$$ 249723 125514 -101381 230877 145724 273425 225013 209523 213887 433011 234372
15009B34372k7228K12753O5101B30139A0130K32419o8839L51765A82121P8853
$$ 234372 207144 419897 484998 230139 10130 242549 173710 525475 182121 260974
14999B60974r6940J5321c1370C09416b04543C72496j78576p5989L9984K21590
$$ 260974 164034 179355 -31370 309416 -204543 372496 193920 117931 157915 379505
14989C79505e2397H6691k406J34838C9355Q9954J99452j36419o4732L9531J29015
$$ 379505 -52397 86691 84285 219123 39355 129309 328761 192342 127610 167141 296156
14978B96156a90408f4554E12691E2106L15971J92652G8996N95792B69256o2828
$$ 296156 -190408 -64554 512691 52106 368077 560729 78996 674788 269256 206428
14968B06428J39091J09240C289J99164j4577K24948j20052p4129p0241p498K2696
$$ 206428 345519 454759 3289 202453 187876 412824 292772 218643 148402 140904 163600
14957A63600N9861A02586K72669j60407H3431L19426A60510L37971A34293j0679
$$ 163600 223461 102586 375255 214848 83431 402857 160510 498481 134293 123614
14947A23614L12696A28453K43709K79267b24894C89447j37566J61684B02033J87569
$$ 123614 436310 128453 372162 651429 -224894 389447 251881 413565 202033 389602
14937C89602H9983K27010A16964n6934l044M1593C5063J68753J88091j27463K26104
$$ 389602 89983 316993 116964 60030 56986 98579 35063 203816 391907 264444 490548
14926D90548H7671L43609J9933l4057j03463J80634A45387K34993O030J45833
$$ 490548 87671 431280 451213 417156 313693 494327 145387 380380 386410 532243
14916E32243k27966k8332J15993A75939J26045M4550J80220B05433K84435A10124
$$ 532243 304277 275945 391938 175939 301984 346534 526754 205433 489868 110124
14905C08674P01J17765j50508j19336K41891A45937Q4212K83323j01000B05192
$$ 308674 309375 427140 276632 157296 399187 145937 230149 513472 412472 205192
14894F16359B88611k3874Q4122o9325j25037K51804j95233m5640R8558o9718M11487
$$ 616359 288611 264737 348859 279534 154497 406301 211068 165428 263986 194268 605755
14883F05755j42111j81845J90588o5225A67829m4092L16581o6210L02197A75306
$$ 605755 463644 281799 472387 407162 167829 123737 440318 374108 676305 175306
14872G4131M71085k06049Q0734r9258N4450o3987L63752j93615a08741D87574
$$ 74131 545216 339167 419901 320643 375093 311106 674858 481243 -108741 487574
14861B29481M44972n8654A66042J08209a33958B16608K83994K0243N5489A00628
$$ 229481 674453 615799 166042 274251 -133958 216608 500602 520845 576334 100628
14850A91802D0596M11690Q565r2164j40383K37324q1683O0038J45368j42760j34977
$$ 191802 40596 452286 460851 368687 228304 465628 383945 443983 589351 446591 311614
14839C11614F5535M55091k17171j44168N11573o1734B81327l5511J27475p5175
$$ 311614 65535 520626 303455 159287 670860 609126 281327 245816 373291 298116
14829B98116j09982K18975K03219Q5347j49000l804m9880r0097k4230j08756J00189
$$ 298116 188134 407109 610328 695675 546675 542871 492991 402894 378664 269908 370097
14818C70097M25753l32563j28007R9524j25349K39476n7418A59213O23160k16686
$$ 370097 795850 463287 335280 434804 309455 548931 491513 159213 782373 565687
14808E65687K11549l57017O4447N9733l2239q3452Q3478j07330L26125O9971C92987
$$ 565687 777236 420219 484666 544399 512160 428708 512186 404856 730981 800952 392987
14796G87979l30967J83509k05641q0104J87842J70189q7927L6661m2878B90889
$$ 787979 457012 640521 434880 354776 542618 712807 624880 661541 618663 290889
14785E58662j24950J72971l8775j19122j31555J52022j06638N1029N5177L01575
$$ 558662 433712 606683 567908 448786 317231 469253 362615 413644 468821 770396
14775G70396j7132k33946p0641K39108l31626M97486C08622K61694k29267Q8982
$$ 770396 753264 519318 448677 687785 356159 853645 308622 570316 341049 430031
14765D30031N4562J60184j2333k59712K05104J05097O2023j71049j11855J52962
$$ 430031 484593 644777 632444 372732 577836 682933 744956 573907 462052 615014
14755F15014J58561L167o6954K4529k64205J20400j23884L15658k37683L66782
$$ 615014 773575 776742 709788 734317 470112 590512 466628 782286 544603 911385
14745I11385m17441p4462N82775k79023j91607L21492L5012k16150M492Q0670
$$ 911385 493944 419482 1002257 723234 531627 853119 888131 671981 676473 757143
14735G57143k52075K65309J6090j7312k56444K10042j35593r8702N85893m55263
$$ 757143 505068 770377 786467 769155 512711 722753 587160 488458 1074351 619088
14725F19088J46751M12153E78395j2920O62998n91189J54343k40789L92421l39090
$$ 619088 765839 1177992 578395 565475 1228473 637284 791627 550838 943259 604169
14715F04169K13160l0280j02379k2586r075K29152P1458m07562K99948j42570
$$ 604169 817329 787049 684670 662084 653009 882161 953619 546057 846005 703435
14705G03435K33469P7057j4919R681Q6649l31799k32830N33898k02056j67633
$$ 703435 936904 1013961 999042 1008723 1095372 763573 530743 1064641 862585 694952
14695F94952L49743j65755J3694q1076O1008j14741K80048j42448J8085o0484
$$ 694952 1044695 878940 892634 811558 872566 757825 1037873 895425 913510 853026
14685H53026J96854j57364O3077k23948K99754L3228j43098J39988K61827j09787
$$ 853026 1049880 892516 955593 731645 1031399 1064627 921529 1061517 1323344 1213557
14675A213557k48836J39643l47584o1431L86817j65418K85661k25050J65174l13926
$$ 1213557 964721 1104364 756780 695349 1082166 916748 1202409 977359 1142533 828607
14665H28607o0165n6774N88848l27771K45826P2580k86336J39239l0921R0023
$$ 828607 768442 711668 1300516 972745 1218571 1291151 1004815 1144054 1113133 1203156
14655A203156j15847Q0590J44065l56585j22387J64454K67659j83536k00179N84207
$$ 1203156 1087309 1167899 1311964 955379 832992 997446 1265105 1081569 881390 1465597
14645A465597m55576L66221k84072m6151L32722k65360N4813J70112l40551K70639
$$ 1465597 1010021 1376242 1092170 1046019 1378741 1113381 1168194 1338306 997755 1268394
14635A268394k62829K49658l03964k5347J92172L86552n3192l76373K09443P5545
$$ 1268394 1005565 1255223 951259 925912 1118084 1504636 1451444 1075071 1284514 1360059
14625A360059p5622L95740n21292N2165l19945L21952N993J23006k25911K94933
$$ 1360059 1284437 1680177 1158885 1211050 891105 1213057 1219050 1342056 1116145 1411078
14615A411078k30985L71567k29034J13333J45867m31779L22047k41745N98214
$$ 1411078 1180093 1551660 1322626 1435959 1581826 1150047 1472094 1230349 1828563
14606A828563k29789J73776p7024j20741J16725j48951J59024r1507k27973K46893
$$ 1828563 1598774 1772550 1695526 1574785 1691510 1542559 1701583 1610076 1382103 1628996
14596A628996o6267p5290O4096Q3147k06871L71407l81129M73572n9924l16460
$$ 1628996 1562729 1487439 1551535 1634682 1427811 1799218 1418089 1891661 1831737 1515277
14586A515277o7702N04986r7593R0159j07353j34569k76160J91488J70866K48529
$$ 1515277 1447575 1952561 1854968 1945127 1837774 1703205 1427045 1618533 1789399 2037928
14576B037928K31850n88218J66749N2779J25543k03032J12299K32569j77474j8945
$$ 2037928 2269778 1681560 1848309 1901088 2026631 1823599 1935898 2168467 1990993 1972048
14566A972048J12991l723j2589P8542O0538j23365J25609j21480j1252L00734
$$ 1972048 2085039 2081316 2068727 2147269 2207807 2084442 2210051 2088571 2077319 2378053
14556B378053l98392N01974l60056K6151J96815L13152j98349J1527Q9608J41865
$$ 2378053 1979661 2481635 2121579 2147730 2344545 2657697 2459348 2470875 2560483 2702348
14546B702348L26378q3983M5016J31237K33388N55467J50341J99738M08808P40671
$$ 2702348 3028726 2944743 2989759 3120996 3354384 3909851 4060192 4259930 4668738 5409409
14536E409409Q80691J426394K411555M321297O921669J2179300k495589j1908525
$$ 5409409 6290100 7716494 10128049 14449346 21371015 33550315 31054726 19146201
14528A9146201q084965m300630k018850q27183n62764n87612m17486j15906K42936
$$ 19146201 11061236 6760606 4741756 3914573 3351809 2764197 2346711 2230805 2473741
14519B473741j10508k36137L41934k77800k7084Q1341J60215q716j60694K35532
$$ 2473741 2363233 2127096 2469030 2191230 2164146 2245487 2405702 2396986 2236292 2471824
14509B471824M3238N7254J75016k76110M9967J4058l8823K20776J79795l46533
$$ 2471824 2515062 2572316 2747332 2471222 2521189 2535247 2496424 2717200 2896995 2550462
14499B550462L72962j86646M1770j05393M6895K87011J74801J81216l51334n7296
$$ 2550462 2923424 2736778 2778548 2673155 2720050 3007061 3181862 3363078 3011744 2954448
14489B954448j00601M07950J1508M1601l2297L29685k1611j5002l11669O1865
$$ 2954448 2853847 3261797 3273305 3314906 3282609 3612294 3590683 3575681 3264012 3325877
14479C325877M23663j52326J60925k39720J34775O4432N5170K95599l87442J03639
$$ 3325877 3749540 3597214 3758139 3518419 3653194 3717626 3772796 4068395 3680953 3784592
14469C784592j7613M11669j88923j4847O7668J11927N8896J02794j0264J66944
$$ 3784592 3766979 4178648 3989725 3974878 4042546 4154473 4213369 4316163 4305899 4472843
14459D472843l74507M42236K9370o0381K9540N7894M6504L797j10899K08390K48855
$$ 4472843 4098336 4540572 4569942 4509561 4539101 4596995 4643499 4647296 4536397 4744787 4993642
14448D993642J95790k02089j72447K42051K80711j2002p7913n7159m1771N52555
$$ 4993642 5189432 4987343 4814896 5056947 5337658 5325656 5247743 5190584 5148813 5701368
14438E701368r7947j1984J25817L14454j34533j31151L38643O069J44592j19072
$$ 5701368 5603421 5591437 5717254 6031708 5897175 5766024 6104667 6110736 6255328 6136256
14428F136256L68426k21110K79681q5632K40308j40325K43117K33611m07260M74804
$$ 6136256 6504682 6283572 6563253 6477621 6717929 6577604 6820721 7054332 6647072 7121876
14418G121876J00067k3154k32267P79252L2626m77608M08740J44633p1668K10950
$$ 7121876 7221943 7198789 6966522 7745774 7778400 7300792 7709532 7854165 7782497 7993447
14408G993447k307K70308l5255L87205k20378J66534N52090m22379L50671K63553
$$ 7993447 7991140 8261448 8226193 8613398 8393020 8559554 9111644 8689265 9039936 9303489
14398I303489m8555J33425K34890J22632J54842Q5729L42773O2817K4774P9525
$$ 9303489 9254934 9388359 9623249 9745881 9900723 9986452 10329225 10392042 10416816 10496341
14388A0496341M63271J2737K18873J66855L73420J24849J23985k18283N01052
$$ 10496341 10959612 10972349 11191222 11358077 11731497 11856346 11980331 11762048 12263100
14379A2263100J64946L03461J09494M30859K78606J62203K76354M456L68065J30740
$$ 12263100 12428046 12731507 12841001 13271860 13550466 13712669 13989023 13993479 14361544 14492284
14369A4492284J54192K41098O30759R520O32804K64483J86125K43095N53626M73634
$$ 14492284 14646476 14887574 15518333 15527853 16160657 16425140 16611265 16854360 17407986 17881620
14359A7881620J82579K53024O78604j42787L31106O59772L15515M56121N62480
$$ 17881620 18064199 18317223 18995827 18853040 19184146 19843918 20159433 20615554 21178034
14350B1178034M29369N31798K25894N52560Q34585k1596P32459M30367P12132
$$ 21178034 21607403 22139201 22365095 22917655 23752240 23730644 24463103 24893470 25605602
14341B5605602O18163O53706N40973O45776Q59036M64990J305007M37427O58252
$$ 25605602 26223765 26877471 27418444 28064220 28923256 29388246 30693253 31130680 31788932
14332C1788932P00126R66497R52125J099209O38456Q66963J178963P39424J386997
$$ 31788932 32489058 33455555 34407680 35506889 36145345 37012308 38191271 38930695 40317692
14323D0317692J047885J248559J119315J415177J137417J434909J393345J492222
$$ 40317692 41365577 42614136 43733451 45148628 46286045 47720954 49114299 50606521
14315E0606521J635010J473681K223461J395457K508184J785822K061616K214933
$$ 50606521 52241531 53715212 55938673 57334130 59842314 61628136 63689752 65904685
14307F5904685K012488K185712K567949K712377K715047K597377L625848L185394
$$ 65904685 67917173 70102885 72670834 75383211 78098258 80695635 84321483 87506877
14299H7506877L710038L136711M139092L755599M376617M490924M700261N069129
$$ 87506877 91216915 94353626 98492718 102248317 106624934 111115858 115816119 120885248
14291A20885248N091106N748906O496060N825194O977147P065079P655264Q057421
$$ 120885248 125976354 131725260 138221320 144046514 151023661 158088740 165744004 173801425
14283A73801425Q556078Q718651R614798J0173145J0786535J0798539J2240093
$$ 173801425 182357503 191076154 200690952 210864097 221650632 232449171 244689264
14276B44689264J2207513J3212203J4267871J3910612J5124905J4813862J4220025
$$ 244689264 256896777 270108980 284376851 298287463 313412368 328226230 342446255
14269C42446255J3595760J2887983J3130135J1806038J1053995J0607943R821355
$$ 342446255 356042015 368929998 382060133 393866171 404920166 415528109 425349464
14262D25349464R501726Q733471P883100N905332J459399M09551o41304j52022
$$ 425349464 434851190 443584661 451467761 457373093 458832492 459242043 458600739 458448717
14254D58448717o804371r052626o991906r516996j0766379j2596550j2673530
$$ 458448717 451644346 442591720 435599814 426082818 415316439 402719889 390046359
14247C90046359j3707794j3357179j4612120j4381316j5126913j4723924j4353497
$$ 390046359 376338565 362981386 348369266 333987950 318861037 304137113 289783616
14240B89783616j3986114j3400603j3158736j2942886j2145295j0814363j0747381
$$ 289783616 275797502 262396899 249238163 236295277 224149982 213335619 202588238
14233B02588238r703103r605062q978526q072458p958887p197678p529739o360097
$$ 202588238 192885135 183280073 174301547 166229089 158270202 151072524 143542785 137182688
14225A37182688o243217n900856n463732n376661m839162m817856m205488m243530
$$ 137182688 130939471 125038615 119574883 114198222 109359060 104541204 100335716 96092186
14217I6092186l649503l737589l528820l765075k931497k641001l127322k925085
$$ 96092186 92442683 88705094 85176274 81411199 78479702 75838701 72711379 69786294
14209F9786294k472364k233932k552451j751884k106423j717737k091331j954151
$$ 69786294 67313930 65079998 62527547 60775663 58669240 56951503 54860172 52906021
14201E2906021j583021j756018j732512p92934j663409j294572j243063j510723
$$ 52906021 51323000 49566982 47834470 47041536 45378127 44083555 42840492 41329769
14193D1329769r36197p89828j308686j046937j607904r31101p13913q45495l18291
$$ 41329769 40393572 39603744 38295058 37248121 35640217 34709116 33995203 33149708 32831417
14184C2831417j263119q01886r33423o62584p73883l27445q81972p21775p80760
$$ 32831417 31568298 30766412 29832989 29170405 28396522 28069077 27187105 26465330 25684570
14175B5684570m27111q76120m61006l49062p43699k76526n47236m41515n81861
$$ 25684570 25257459 24381339 23920333 23571271 22827572 22551046 22003810 21562295 20980434
14166B0980434m86793m24416n07750k65768l15738p86978Q7202l79871l77702
$$ 20980434 20493641 20069225 19561475 19295707 18979969 18192991 18280193 17900322 17522620
14157A7522620l98667n49097j8674l37329l36961l77392k26193m72210O082j86736
$$ 17522620 17123953 16574856 16556182 16218853 15881892 15504500 15278307 14806097 14812179 14625443
14147A4625443n45293r9255l85967j34251j40462k35532N6578m99240j03608o18030
$$ 14625443 14080150 13980895 13594928 13460677 13320215 13084683 13141261 12642021 12538413 11920383
14137A1920383L43278m63192K2633n13208p8712m52555J54071m60015m4619M1116
$$ 11920383 12263661 11800469 11823102 11309894 11231182 10778627 10932698 10472683 10428064 10469180
14127A0469180l34554j16313R8499j54120m77802J86034n16327j3770l6758m00837
$$ 10469180 10134626 10018313 10116812 9962692 9484890 9670924 9154597 9140827 9104069 8703232
14117H703232J86884m91689L28181n13466p1102K76898j56880k40159j45287n37922
$$ 8703232 8890116 8398427 8726608 8213142 8142040 8418938 8262058 8021899 7876612 7338690
14107G338690K01700j425j29442M0369m11914J13411m1517k41357J2915j50913
$$ 7338690 7540390 7538965 7409523 7449892 7037978 7151389 7109872 6868515 6881430 6730517
14097F730517o7272M8124r8630k84659k65184J96613j28537r550q5671k89472
$$ 6730517 6663245 6711369 6612739 6328080 6062896 6259509 6130972 6121422 6035751 5746279
14087E746279J05150K78336n14719M51194m77158K96734k53718K9248k93353J17911
$$ 5746279 5851429 6129765 5615046 6066240 5589082 5885816 5632098 5661346 5367993 5485904
14077E485904M4721m41592k01940K65190j83421q0834j12134P5368P732k54506
$$ 5485904 5530625 5089033 4887093 5152283 4968862 4888028 4775894 4851262 4858994 4604488
14067D604488L00913l17050k62708L13915N1505m26869J01331O5476k13633R8976
$$ 4604488 4905401 4588351 4325643 4639558 4691063 4264194 4365525 4431001 4217368 4316344
14057D316344l3445K92188q3092n88919J70502p5215j65842L5784L54930k87185
$$ 4316344 4282899 4575087 4491995 3903076 4073578 3998363 3832521 3868305 4223235 3936050
14047C936050n1748J07656L58299l67711P3899l3144J65626j15738l64675m79777
$$ 3936050 3884302 3991958 4350257 3982546 4056445 4023301 4188927 4073189 3708514 3228737
14037C228737J53652M40731n60664K08736j37321j31076J62031l61535m5183L25487
$$ 3228737 3382389 3823120 3262456 3471192 3333871 3202795 3364826 3003291 2958108 3283595
14027C283595j35818J40679o8280k38151N9465J69595J00805j12025K6640k56453
$$ 3283595 3147777 3288456 3220176 2982025 3041490 3211085 3311890 3199865 3226505 2970052
14017B970052n1914L54871m14489J59434o7217j21955m41903L52450J68380n02976
$$ 2970052 2918138 3273009 2858520 3017954 2950737 2828782 2386879 2739329 2907709 2404733
14007B404733M97476k06455K06817m72075J73878k67726L18162l49685L72677
$$ 2404733 2902209 2695754 2902571 2430496 2604374 2336648 2654810 2305125 2677802
13998B677802L9174m0066l16549o0371L59638m99275J15239J81098k03897k09539
$$ 2677802 2716976 2676910 2360361 2299990 2659628 2160353 2275592 2456690 2252793 2043254
13988B043254K40696k45876L68332l85513K06563J22010K44549L1284N6074L59646
$$ 2043254 2283950 2038074 2406406 2020893 2227456 2349466 2594015 2625299 2681373 3041019
13978C041019j15723L35893M80169N35817J902355L284300N880764J2095616N211519
$$ 3041019 2925296 3261189 3741358 4277175 6179530 9463830 15344594 27440210 32651729
13969C2651729j2123551o782901m599303j978285j410983j035949n79261l94073
$$ 32651729 20528178 13745277 9145974 7167689 5756706 4720757 4141496 3747423
13961C747423k20212m31213l06126K45390k63216l74824R9184J75070m5986k57814
$$ 3747423 3527211 3095998 2789872 3035262 2772046 2397222 2496406 2671476 2625490 2367676
13951B367676k54498R5189r8452k4004N6848L13872m35056K19374P3912m96381
$$ 2367676 2113178 2208367 2109915 2085911 2142759 2456631 2021575 2240949 2314861 1818480
13941A818480K76694J35306j29863l85105P0780J94853M529k09356J31060m3715
$$ 1818480 2095174 2230480 2100617 1715512 1786292 1981145 1985674 1776318 1907378 1863663
13931A863663o1034L3861k01002L43107j44354p6494K35561n92670L72231J6773
$$ 1863663 1802629 1836490 1635488 1978595 1834241 1757747 1993308 1400638 1772869 1789642
13921A789642r0369K61369j98477j68674j67977J75416J4560j421l75548J69827
$$ 1789642 1699273 1960642 1762165 1593491 1425514 1600930 1615490 1614069 1238521 1408348
13911A408348K14116J0875m7756M1701k69575L59747m41540K26221j11436m6400
$$ 1408348 1622464 1633339 1585583 1627284 1357709 1717456 1275916 1502137 1390701 1344301
13901A344301J00233k48863K12045K66172l03158J15045K51390p80913J89417
$$ 1344301 1444534 1195671 1407716 1673888 1370730 1485775 1737165 956252 1145669
13892A145669M68293j88760p5289k45172J82497N3813M2897P5178k88620j04285
$$ 1145669 1613962 1425202 1349913 1104741 1287238 1341051 1383948 1459126 1170506 1066221
13882A066221L37910j69310K97467l53752n7764J78755J1826P4596m09202L14973
$$ 1066221 1404131 1234821 1532288 1178536 1120772 1299527 1311353 1385949 976747 1291720
13872A291720Q808k97755N45264G26928N56376M4563L8181K0132J8839F88686
$$ 1291720 1300528 1002773 1548037 726928 1283304 1327867 1366048 1386180 1405019 688686
13861I92606R4707J28863k16223N1354K87876k14548p0230J36673Q0171j53557
$$ 992606 1087313 1216176 999953 1051307 1339183 1124635 1054405 1191078 1271249 1117692
13851A117692m74871N09589k38443N73486k21942k97902L65996m64332K35238
$$ 1117692 642821 1152410 913967 1487453 1265511 967609 1333605 869273 1104511
13842A104511J57144j34200l85461L63431r3N282l38266K61651j22401j05232
$$ 1104511 1261655 1127455 741994 1105425 1105332 1110614 772348 1033999 911598 806366
13832H06366N00720o0912n05889K34604l5725J60831m03736K91269k44182J93056
$$ 806366 1307086 1246174 740285 974889 939164 1099995 696259 987528 743346 936402
13822I36402J91900q2683P0606j77765N9126l5028j40128p4363K08814j88096
$$ 936402 1128302 1045619 1116225 938460 997586 962558 822430 748067 956881 768785
13812G68785j24736J16795k17959J92905L64491j58305l07077M7323J34923j15580
$$ 768785 644049 760844 542885 735790 1100281 941976 634899 682222 817145 701565
13802G01565l0953J68970K86352l42917j15861P7198L4575o0927n8450J32295
$$ 701565 670612 839582 1125934 783017 667156 744354 778929 718002 659552 791847
13792G91847K52653n2500j05078k9554J57004l61626K972K33150j89183K21802
$$ 791847 1044500 992000 886922 857368 1014372 652746 655718 888868 699685 921487
13782I21487k73530N6608j90814L00541j92620K61736k40355k4211K37980j94878
$$ 921487 647957 704565 513751 814292 621672 883408 643053 618842 856822 661944
13772F61944K72354C98732J66651J98123J17160C69427L16355R7381q4346l10193
$$ 661944 934298 398732 565383 763506 880666 369427 685782 783163 698817 388624
13762C88624L21637k43992l3820J43184R1011J07998j48131K43428k15191J20957
$$ 388624 710261 466269 432449 575633 666644 774642 626511 869939 654748 775705
13752G75705P3349L3086C40453J22519M35115q1347k27452J86188j86157L90016
$$ 775705 849054 882140 340453 462972 898087 816740 589288 775476 589319 979335
13742I79335m87769J96378J19233r3784o4444K7936J33482l54423J03412L07129
$$ 979335 491566 687944 807177 713393 648949 676885 810367 455944 559356 866485
13732H66485l75929k12257L463K16263j78246L91903N5508A42142M10846j88081
$$ 866485 490556 278299 281762 498025 319779 711682 767190 142142 552988 364907
13722C64907J74358j39918L10126j30986L13241k62453j58220J30473K14597m00167
$$ 364907 539265 399347 709473 578487 891728 629275 471055 601528 816125 415958
13712D15958K8682J06766n1068L38175A26049J16742L88328j73484j8905J12659
$$ 415958 444640 551406 500338 838513 126049 242791 631119 457635 438730 551389
13702E51389j28581Q5788K19320l52456N3873K58101J5628B85406M10278j79938
$$ 551389 422808 508596 727916 375460 429333 687434 703062 285406 695684 515746
13692E15746k38164K03487j59531K22564j62185R5651M7056M2546J14620o3610
$$ 515746 277582 481069 321538 544102 381917 477568 524624 567170 681790 618180
13682F18180k50888M4283J20445K40364j94095j13392K14123l09173J75697M48875
$$ 618180 367292 411575 532020 772384 578289 464897 679020 369847 545544 994419
13672I94419C27872o9867M50937k47032m8230k5865L61805l24425M9893M1420
$$ 994419 327872 258005 708942 461910 413680 387815 749620 425195 475088 516508
13662E16508A57123J70456n1578J92429A82942K24471j18782K729p489o8184A05468
$$ 516508 157123 327579 276001 468430 182942 407413 288631 291360 283871 215687 105468
13650F07285B07931K87972j00534j83504P6069J89356p1183M9185l0182j87455
$$ 607285 207931 495903 395369 211865 287934 477290 406107 455292 425110 237655
13640B37655M23009B98582A6617M21906F2390K23362K3792K08588j18449m3344
$$ 237655 660664 298582 16617 438523 62390 285752 309544 518132 399683 356339
13630C56339n9895L4452L15959B21726L54947j49047j16097P090o6798L19351
$$ 356339 296444 330896 646855 221726 576673 427626 311529 318619 251821 571172
13620E71172k49174k4820K02807j4402A84091J93422k569R5562A93338K24834
$$ 571172 321998 297178 499985 485583 184091 377513 374944 470506 193338 418172
13610D18172r7465L24343B74594H9365l7335Q7441Q3405J95566A17429K74193
$$ 418172 320707 645050 274594 89365 52030 139471 222876 418442 117429 391622
13600C91622K94598l31158n07j13567M42996l36233m1348J31183O2545K1394j14241
$$ 391622 686220 355062 354555 240988 683984 347751 306403 437586 500131 521525 407284
13589D07284n5566L26745j85053m7843M1467m7905j14852N2088o366A23063L74223
$$ 407284 351718 678463 493410 445567 487034 439129 324277 376365 369999 123063 497286
13578D97286A0546L38810J65057j47069K42163k30042j16664P7074r2296K00026
$$ 497286 10546 349356 514413 367344 609507 379465 262801 339875 247579 447605
13568D47605k16513r108L78476A11007K57499j77697J71108m9018R676M3180b504
$$ 447605 231092 221984 600460 111007 368506 190809 361917 312899 322575 365755 -2504
13556E30229k9533A19270J89038M6549o3681K20302k54611p1785L76892A80109
$$ 530229 500696 119270 308308 354857 291176 511478 256867 185082 561974 180109
13545B10678K45035j56761q3033M8374N0771I1490J11409a203A21701a4622A08296
$$ 210678 455713 298952 215919 264293 315064 91490 202899 -1203 121701 -14622 108296
13533F32836A48133l9032K65431j36986P5049j44962L0196r1798K61882k24n0950
$$ 632836 148133 109101 374532 237546 312595 167633 197829 106031 367913 367689 316739
13522C16739A31396L42876j74574A43597K72137O0531j33661F3471L21665k4121
$$ 316739 131396 474272 299698 143597 415734 476265 342604 63471 385136 361015
13512C61015e1500C49117A16332j7611K96310L1464j06525G2979O6520L69379
$$ 361015 -51500 349117 116332 98721 395031 426495 319970 72979 139499 508878
13502E08878A70050J74000r1265q9385J3794J56486F037L77988r6628q3519K70250
$$ 508878 170050 344050 252785 163400 177194 333680 6037 384025 287397 203878 474128
13491D74128g0594C60756J11326k15403n8087L0754o4781J48423L8502j0654A51641
$$ 474128 -70594 360756 472082 256679 198592 229346 164565 312988 351490 340836 151641
13479C00395l013I1341L59489K73824a45313B40180I9656J16843K38840e0248
$$ 300395 297382 91341 450830 724654 -145313 240180 99656 216499 455339 -50248
13468a60601E93166B53277A18326M57955B81303j05245J17722A46835P5658E8762
$$ -160601 593166 253277 118326 576281 281303 176058 293780 146835 222493 58762
13457E57124A50583p795N6357K6262O4096b9326G1589M84495B38761K4880n4442
$$ 557124 150583 142788 199145 225407 289503 -29326 71589 556084 238761 263641 209199
13446B09199D0381e2885B70620J39822A04961J37606p3495L7484K02720o9792
$$ 209199 40381 -52885 270620 410442 104961 242567 169072 206556 409276 339484
13436C39484B9805J45099a64384n1858A93779i673I4872J34835j07519n926Q7346
$$ 339484 29805 174904 -164384 -216242 193779 -9673 94872 229707 122188 116262 203608
13425B03608a39241A16632O8063a02549A39678C0892K44007P949A00090l7354
$$ 203608 -139241 116632 184695 -102549 139678 30892 274899 282848 100090 62736
13415F2736e3308C21028j1710R410D8139A3048K07896j7184L43026C5210M59076
$$ 62736 -53308 321028 309318 318728 48139 13048 220944 203760 546786 35210 494286
13404D94286I621L57667A10911a4466F2694i6612C50916A65672k932N14917H5488
$$ 494286 9621 367288 110911 -14466 62694 -96612 350916 165672 162740 677657 85488
13392c6055a5372A68458O509l3658L24316k09342G4880K57593a66864G037J16750
$$ -36055 -15372 168458 174967 141309 465625 256283 74880 332473 -166864 7037 123787
13381A23787j8021B9581N2985J30654r8950K65407A17369R6390H7107M45175H5225
$$ 123787 105766 29581 82566 213220 114270 379677 117369 213759 87107 532282 85225
13369B28903j5593a08368D59253i1456a7064j16760j28210C14699o9848D2610
$$ 228903 213310 -108368 459253 -91456 -17064 -133824 -262034 314699 244851 42610
13358B33221P7686j5104J27712A41542j551a2749C45357A33884J46060M0408D3779
$$ 233221 310907 295803 423515 141542 139991 -12749 345357 133884 279944 320352 43779
13346D40440A28879K16836F3041L78557b3844D34013J2457G0413P2040J69476
$$ 440440 128879 345715 63041 441598 -23844 434013 446470 70413 142453 311929
13336C11929J32800j28590j57940K14135r4019L4633q9136J28719Q206J26705
$$ 311929 444729 316139 158199 372334 278315 312948 223812 352531 360737 487442
13326D87442k1710n9167C1256L47853q3469L16226k87051J3108q0920A21805M60320
$$ 487442 465732 406565 31256 379109 295640 611866 324815 337923 257003 121805 582125
13315E82125B18568a38782D58191a39981C76671a09956c0496E2728J17481K6688
$$ 582125 218568 -138782 458191 -139981 376671 -109956 -30496 52728 170209 196897
13305A96897P5566h7519D8618h8010A31202K6246L68917A13128L33862F0694f0568
$$ 196897 272463 -87519 48618 -88010 131202 157448 526365 113128 446990 60694 -60568
13293a01888D204a99755B6060M40838H3748J19895K64419B07269a8408k96415
$$ -101888 4204 -199755 26060 466898 83748 203643 468062 207269 -18408 -314823
13283c14823C676b00622A88335f7781B96720P7601g6052B28795C0032K67609j01560
$$ -314823 3676 -200622 188335 -67781 296720 374321 -76052 228795 30032 297641 196081
13272A96081c0932j0750B75486o1000m0934o3194L7674O7282A2855H11J55599
$$ 196081 -30932 -41682 275486 214486 173552 110358 148032 215314 12855 811 156410
13261A56410J74444b41648A48581n2721a20051A30241e6476C43660j51620Q020
$$ 156410 330854 -241648 148581 95860 -120051 130241 -56476 343660 192040 200060
13251B00060a33491P799C19437A52066o4145J52667a25213B08018J30714G1038
$$ 200060 -133491 -125692 319437 152066 87921 240588 -125213 208018 338732 71038
13240A45316B7636c32253g634k8947B60202d594q3574C74500a43373j82511A29337
$$ 145316 27636 -332253 -7634 -36581 260202 -4594 -88168 374500 -143373 -325884 129337
13228a5277C01056a59792B21410b397A82977K35631A33671E0390a15027d6765
$$ -15277 301056 -159792 221410 -2397 182977 418608 133671 50390 -115027 -46765
13217A93213d8554H1330e2849B34767L39314B47117e2867k8244b4176A70794p5576
$$ 193213 -48554 81330 -52849 234767 574081 247117 -52867 -81111 -24176 170794 95218
13206I5218n196J734f5200E76401i13n9599m25763A32742j7568E0609a9212k8296
$$ 95218 90022 91756 -65200 576401 -913 -60512 -486275 132742 115174 50609 -19212 -47508
13194d7508i176I3081d33927C24124g8449C801g807B29234n5983c3598A40176
$$ -47508 -9176 93081 -433927 324124 -78449 3801 -7807 229234 173251 -33598 140176
13182I2520Q417a04791E8402K36918D0907N3448J37026B5180K4260j002a4597
$$ 92520 100937 -104791 58402 295320 40907 94355 231381 25180 49440 48438 -14597
13170c54C62687A35377b5278j3434C2813r813g0760A57027P3040a93362K862F2847
$$ -354 362687 135377 -25278 -38712 32813 23000 -70760 157027 230067 -193362 -190500 62847
13157a43132A65152A2376a06097A4788h0395C59314G2262L14401j85090I9526
$$ -143132 165152 12376 -106097 14788 -80395 359314 72262 386663 201573 99526
13146C57106c0844q6056B52323A05864a437B05616g2904B05587l1997P7427B6462
$$ 357106 -30844 -116900 252323 105864 -1437 205616 -72904 205587 173590 251017 26462
13134a4119n010E9428K48366L6186f4124j06017D3100M8615C2989g6482p9891
$$ -14119 -19129 59428 307794 343980 -64124 -170141 43100 91715 32989 -76482 -156373
13123a56373D6982K51383j18653a29634J5430C2152M7961C130J21571J70668a42072
$$ -156373 46982 298365 179712 -129634 -114204 32152 80113 3130 124701 295369 -142072
13111A32120a99752i5046A86451b0268k71240A50480l6215h28H9360b75741L2903
$$ 132120 -199752 -95046 186451 -20268 -291508 150480 114265 -828 89360 -275741 -242838
13100b42838C28008a09161A76222o7182N7864n7848d5781k4246I8185Q4037d2240
$$ -242838 328008 -109161 176222 109040 166904 109056 -45781 -70027 98185 182222 -42240
13088D9750b08392R149l876Q2984N7414B09845d7677A77776b47482G635K2560
$$ 49750 -208392 -199243 -203119 -120135 -62721 209845 -47677 177776 -247482 7635 30195
13077C0195K8438O6921L54188b11421D14990A5216K10314M4602K33523E6081B5545
$$ 30195 58633 125554 479742 -211421 414990 15216 225530 270132 503655 56081 25545
13065C43453I2037K17776c97854H4513L03996A14885J15636k0785K1947J13967
$$ 343453 92037 309813 -397854 84513 388509 114885 230521 209736 231683 345650
13055C45650C9494K36983a547C25008j26891g7835B3644J59514b17448D9329J56231
$$ 345650 39494 276477 -1547 325008 198117 -77835 23644 183158 -217448 49329 205560
13044B05560b5849l5903A61626J46445H8473a16109A44769o132l3697A1496L3933
$$ 205560 -25849 -61752 161626 308071 88473 -116109 144769 138637 104940 11496 45429
13033D5429h5181B76928k8834I4963J07657j7967F2645B9028J04207k3476J61964
$$ 45429 -85181 276928 248094 94963 202620 184653 62645 29028 133235 109759 271723
13022B71723a11996A71866f9313H3718h6129G6622K06683j36301N3912a42737
$$ 271723 -111996 171866 -69313 83718 -86129 76622 283305 147004 200916 -142737
13011A5117K7802Q800K14362d3070A29835a8391m953r7038B19262M6178j03866
$$ 15117 42919 51719 266081 -43070 129835 -18391 -23344 -120382 219262 265440 161574
13000A61574f9308A7609J45343F8734N5287J4607b7540I0350m2185K60347A31491
$$ 161574 -69308 17609 162952 68734 124021 138628 -27540 90350 48165 308512 131491
12988F08666a41399L5985B18955q3975B2750J18431d9610k8850J2997m4343l16735
$$ 608666 -141399 -105414 218955 134980 22750 141181 -49610 -78460 -65463 -109806 -426541
12977d26541C20778j09418a842B05549h8199C22575j31297D2388J36031a78985
$$ -426541 320778 211360 -1842 205549 -88199 322575 191278 42388 178419 -178985
12966B66269f6404k0988A17071g7829C5261b94421E6753R202a66880A58166a47386
$$ 266269 -66404 -87392 117071 -77829 35261 -294421 56753 65955 -166880 158166 -147386
12954e3972C86596a14225B73176D6801a759A43435b25037H2634c45647C20968
$$ -53972 386596 -114225 273176 46801 -1759 143435 -225037 82634 -345647 320968
12943I214L0022b53130J19225a3801C11782r2420G0767B181c0944J5086p6706
$$ 9214 39236 -253130 -133905 -13801 311782 219362 70767 2181 -30944 -15858 -92564
12932i2564A82440a31507A09124K77201I2927N4684N7507f4731A45641B4451Q3256
$$ -92564 182440 -131507 109124 386325 92927 147611 205118 -64731 145641 24451 107707
12921A07707B822a56278D8955F65g7610k35699c2443A15751f415D8135g7480I3943
$$ 107707 2822 -156278 48955 665 -77610 -313309 -32443 115751 -6415 48135 -77480 93943
12908A61983l8698C8967c10801J09342A21480D2K53834A01769e4584A49808a66062
$$ 161983 123285 38967 -310801 -201459 121480 42 253876 101769 -54584 149808 -166062
12896A25454H060R380b6699I6826b36567H1248J24846g6456B67644f4677G146
$$ 125454 8060 17440 -26699 96826 -236567 81248 206094 -76456 267644 -64677 7146
12884c7117D41781A60195J58619a07685A3558b1801j59020A54940J26326a61049
$$ -37117 441781 160195 318814 -107685 13558 -21801 -180821 154940 281266 -161049
12873i0011b2661I9634B0984P5761N8236B5862a51487a4182A71301K4271I7330
$$ -90011 -22661 99634 20984 96745 154981 25862 -151487 -14182 171301 195572 97330
12861A25553E6600B4929f7166H6940D087K5461a30345A11355n4282J4719O9952
$$ 125553 56600 24929 -67166 86940 4087 29548 -130345 111355 57073 71792 141744
12850A41744o0462a01846B92565l0924g8959k26175I74a27977a1124l26803j86527
$$ 141744 81282 -101846 292565 261641 -78959 -305134 974 -127977 -11124 -337927 -524454
12839e24454f4802j69494G2192a10324a547A29308k2808b66309a16738L0095G6403
$$ -524454 -64802 -234296 72192 -110324 -1547 129308 106500 -266309 -116738 -86643 76403
12827c15479B45918I3929d7356j06882B68474b1237k8849F0704K03422h742m23635
$$ -315479 245918 93929 -47356 -154238 268474 -21237 -50086 60704 264126 -8742 -432377
12816d32377a27529C9479b04443m801A71797j4380a88517B639L41258g2665r6264
$$ -432377 -127529 39479 -204443 -209244 171797 157417 -188517 2639 343897 -72665 -168929
12805a68929A9467J43895a12075j5381D5261g7570A85940n973b22099B5308a49296
$$ -168929 19467 163362 -112075 -127456 45261 -77570 185940 179967 -222099 25308 -149296
12793B18608a97033A9095a69765K5051N2212n2830a2639j19854k97371F2893a2973
$$ 218608 -197033 19095 -169765 -144714 -92502 -145332 -12639 -132493 -429864 62893 -12973
12781d0067C9629d6660o9670A71730C9623c01296R6719i2352G8226b00273C36083
$$ -40067 39629 -46660 -116330 171730 39623 -301296 -204577 -92352 78226 -200273 336083
12769A92667d3998G4552a76958M4511c873H6369b25014Q2345j9118B81770I7284
$$ 192667 -43998 74552 -176958 -132447 -3873 86369 -225014 -142669 -161787 281770 97284
12757h4928B92891D1025J72377J5728A13892a72207A5565J04845M3509m5160d4055
$$ -84928 292891 41025 213402 229130 113892 -172207 15565 120410 163919 118759 -44055
12745A962i0893i268A59447b1264B4695J23220b334j5905B30638q7051a46031
$$ 1962 -90893 -9268 159447 -21264 24695 147915 -2334 -18239 230638 143587 -146031
12733a5544n0897A90570J71753A41631O9881r1306f6680C7118i7813b2705m6346
$$ -15544 -66441 190570 362323 141631 211512 120206 -66680 37118 -97813 -22705 -69051
12722f9051D8632J64154a21233E8061b60813J20954a1958B46290A06826P7042
$$ -69051 48632 212786 -121233 58061 -260813 -139859 -11958 246290 106826 183868
12712A83868c8809D671P2643C6222a11888C31308D5333i2004A64896E4274c4552
$$ 183868 -38809 4671 77314 36222 -111888 331308 45333 -92004 164896 54274 -34552
12700I3367N6165a59605a1817B44308b1499j83656E4954J19737J24451I9289L0153
$$ 93367 149532 -159605 -11817 244308 -21499 -205155 54954 174691 299142 99289 129442
12689A29442J5874f943B76085q109E3221k2733h7809b5959A70852B8346c7788
$$ 129442 145316 -6943 276085 267976 53221 30488 -87809 -25959 170852 28346 -37788
12677e1176A0608h5922j64114A72496g8730G6142b88940e6807F1758K03943H9442
$$ -51176 10608 -85922 -250036 172496 -78730 76142 -288940 -56807 61758 265701 89442
12665a34009B06337a26065K9165J8712H6846J67673J59045C452f3459j41419I1847
$$ -134009 206337 -126065 -96900 -78188 86846 254519 413564 3452 -63459 -204878 91847
12653E0991g3806B5586N1046C8219Q9878e4983B7196J55927e892E3545K41042
$$ 50991 -73806 25586 76632 38219 128097 -54983 27196 183123 -5892 53545 294587
12642B94587q5610p4069n2764M5716i7865q3547F7083O8349B390J34107k1975
$$ 294587 208977 134908 82144 127860 -97865 -181412 67083 135432 2390 136497 114522
12631A14522K38143A32837B2467a36377e8316A28744J667E8160J88028C1484L21034
$$ 114522 352665 132837 22467 -136377 -58316 128744 130411 58160 246188 31484 352518
12620C52518A71900O4753m893o6713a42242C3791J1649L00406c3576C69551C4108
$$ 352518 171900 236653 231760 165047 -142242 33791 45440 345846 -33576 369551 34108
12608a87117A66417c1328B79967p4799M2605H0873p22c5019C937e9980D516b03161
$$ -187117 166417 -31328 279967 205168 247773 80873 80151 -35019 3937 -59980 4516 -203161
12595C10327C5668a64903B25343F9853B7525f230A37368F7771O0810a94203E7078
$$ 310327 35668 -164903 225343 69853 27525 -6230 137368 67771 128581 -194203 57078
12583d6585A96695l9955Q129N926J33911d5700A1976J19644O0773a10383r2187
$$ -46585 196695 156740 164869 170795 304706 -45700 11976 131620 192393 -110383 -202570
12572b02570e2632B13699h8870j66347A54211j8528a21012A48424m2017B2498
$$ -202570 -52632 213699 -88870 -255217 154211 135683 -121012 148424 106407 22498
12561E4608f3222C2033g818C2133J23149B5585Q495L05932D3971e8533k0584B11821
$$ 54608 -63222 32033 -7818 32133 155282 25585 34080 340012 43971 -58533 -79117 211821
12548a58896B41331g0521B19355a70342P4888n2818b403j3906k23254A70319b19616
$$ -158896 241331 -70521 219355 -170342 -95454 -148272 -2403 -16309 -239563 170319 -219616
12536c26395R7850E8757a06138r8418c9991p0205H613a52668e9961j58175f7137
$$ -326395 -228545 58757 -106138 -204556 -39991 -110196 8613 -152668 -59961 -218136 -67137
12524B5738K03653i6830B25041b3169A10859B7246d3357A58981a51477f8693f430
$$ 25738 229391 -96830 225041 -23169 110859 27246 -43357 158981 -151477 -68693 -6430
12512G9843a83395Q0026C26248A33705d6171m2624J0149F5659j789J7675b11144
$$ 79843 -183395 -103369 326248 133705 -46171 -88795 -78646 65659 63870 81545 -211144
12500a06337o4901g2208B8378J55376J3951b918j91537j5366E6946h4525F3659
$$ -106337 -171238 -72208 28378 183754 197705 -2918 -194455 -209821 56946 -84525 63659
12488B79100B8937g0603E3605Q427d3098l0717r0492H9142c41367A11122a71853
$$ 279100 28937 -70603 53605 62032 -43098 -73815 -164307 89142 -341367 111122 -171853
12476a00396D3267J56983r08a07502M4462H5910J32989a32640d2526D00371a88943
$$ -100396 43267 200250 199342 -107502 -63040 85910 218899 -132640 -42526 400371 -188943
12464b06357h8437j0471d5029j42652D579e9371A83828a15451G9696a53064B41791
$$ -206357 -88437 -98908 -45029 -187681 4579 -59371 183828 -115451 79696 -153064 241791
12452a80274B30456B0159b71455A40731Q9303M1344A430b91569A52757p5564a47908
$$ -180274 230456 20159 -271455 140731 230034 271378 1430 -291569 152757 77193 -147908
12440B52602a62118p9927d3991j87928B0628K21701B2176J65827C0623d1464O633
$$ 252602 -162118 -242045 -43991 -231919 20628 242329 22176 188003 30623 -41464 -34831
12429c4831j98924e0328l6j16187f963j48395C91030g0915j31061I9759D4529
$$ -34831 -233755 -50328 -50364 -166551 -6963 -155358 391030 -70915 -201976 99759 44529
12417A84302b52814c4182G892M9666k7176b03384Q3455j41754a5235A46376b36302
$$ 184302 -252814 -34182 7892 57558 30382 -203384 -119929 -261683 -15235 146376 -236302
12405A70674n9440L548e8359j0836k90K6325l5228K5587L558I2793g0307a4603
$$ 170674 111234 114782 -58359 -69195 -69485 -43160 -78388 -52801 -49243 92793 -70307 -14603
12392A27622c187k09842D38934k06445a51076k36550A36149a40292O660e2698
$$ 127622 -3187 -213029 438934 232489 -151076 -387626 136149 -140292 -133632 -52698
12381a26972A37269b90660J29626k1423l00887B01440a19634L4273K9057I8104
$$ -126972 137269 -290660 -161034 -182457 -483344 201440 -119634 -85361 -56304 98104
12370e3225A5134J46917e6878j30021A2788K03702i5424B00990b93514a07293
$$ -53225 15134 162051 -56878 -186899 12788 216490 -95424 200990 -293514 -107293
12359A74404a82429N9460F8647b04100A48318b6626l40287d6473p0940A20343
$$ 174404 -182429 -122969 68647 -204100 148318 -26626 -366913 -46473 -117413 120343
12348b8649B00938b00964d5638j1327K7761m8120b0910D7000J89542N5530a13205
$$ -28649 200938 -200964 -45638 -56965 -29204 -77324 -20910 47000 236542 292072 -113205
12336f5435k3520L4652A974e8856C2079b24869D0055a10244N716B34601b6214
$$ -65435 -88955 -54303 1974 -58856 32079 -224869 40055 -110244 -104528 234601 -26214
12324A31402J62929b9450A43821e9736E5992N9683b82550A19609d7354A69981
$$ 131402 294331 -29450 143821 -59736 55992 115675 -282550 119609 -47354 169981
12313A43286B1226K36209N5224b95742b5693k06924f906n2467A59323a05629E6366
$$ 143286 21226 257435 312659 -295742 -25693 -232617 -6906 -59373 159323 -105629 56366
12301A74512M3073F5234k3960g0068C8049e2294A30043B2751K09157e4568A24794
$$ 174512 217585 65234 41274 -70068 38049 -52294 130043 22751 231908 -54568 124794
12289a89116j44216A36238J03061a41185A990J36497a90923B42108c4048A32004
$$ -189116 -333332 136238 239299 -141185 1990 138487 -190923 242108 -34048 132004
12278B50699M1601a63852G6239b42519J09395A22196c3156B175K6381a76254A25872
$$ 250699 292300 -163852 76239 -242519 -133124 122196 -33156 2175 28556 -176254 125872
12266A79744C2401O6665c4530B89332F5637J19553K4507b1828A30353o4364R1394
$$ 179744 32401 99066 -34530 289332 65637 185190 209697 -21828 130353 65989 157383
12255A57383M2908q7341J1779J54583b82949A05212g1659B09127o2234a36003
$$ 157383 200291 112950 124729 279312 -282949 105212 -71659 209127 146893 -136003
12244D5882J86656a59430q8116B30721A01033b84247O3114A01768k22e8091n3558
$$ 45882 232538 -159430 -247546 230721 101033 -284247 -221133 101768 101546 -58091 -111649
12233a11649c0571E916K21710Q4716j11612G6444f1817B13657J29886G833J48158
$$ -111649 -30571 5916 227626 312342 200730 76444 -61817 213657 343543 7833 155991
12222A55991h8659A69888J01873a50494L0890B94626j34147j2624a54291B0627
$$ 155991 -88659 169888 271761 -150494 -119604 294626 160479 147855 -154291 20627
12211h4941H3147L57681d4681A52332q572J6086m517h0120I053a69955B42778
$$ -84941 83147 440828 -44681 152332 143760 159846 155329 -80120 9053 -169955 242778
12199h70B06364g3100C34214a33665e7628B88195g8517A25461J59138b67021A32884
$$ -870 206364 -73100 334214 -133665 -57628 288195 -78517 125461 284599 -267021 132884
12187A8294J26099C2301K2989b3582B47716A20501Q0107k5029a05154A19433A8632
$$ 18294 144393 32301 55290 -23582 247716 120501 200608 175579 -105154 119433 18632
12175F7190g2611E118h1197I5433J34089k3683h7740A7871b9577k54O125C13271
$$ 67190 -72611 5118 -81197 95433 229522 205839 -87740 17871 -29577 -29831 -23706 313271
12162E0988L16953G2346A6696K0009J30714n4440M7935k5542A378K56794F0330
$$ 50988 367941 72346 16696 36705 167419 112979 160914 135372 1378 258172 60330
12150A45263K48351A83331D1192L08150b82051C5806K29293A05851g5332B22872
$$ 145263 393614 183331 41192 349342 -282051 35806 265099 105851 -75332 222872
12139I1132l3092e6671B22302A4881b20347A71219a33357F9002c0815l2555B45610
$$ 91132 58040 -56671 222302 14881 -220347 171219 -133357 69002 -30815 -63370 245610
12127B67256b6602D7925L3250a33340C76042f8514R348A4141M131e3955j411k05072
$$ 267256 -26602 47925 81175 -133340 376042 -68514 -59166 14141 18272 -53955 -55366 -260438
12115b60438f3090p7913A04073k2023K14038f7523K4161a9483B30673G7459a85428
$$ -260438 -63090 -141003 104073 82050 296088 -67523 -43362 -19483 230673 77459 -185428
12103I5603J25200c8990H0723i5019A75719O4750n3622d0229B28552B2711J74204
$$ 95603 220803 -38990 80723 -95019 175719 240469 186847 -40229 228552 22711 196915
12092A96915n7490a21325A09961D1653k372N2419a29956E5846J72989i0128A18970
$$ 196915 139425 -121325 109961 41653 39281 91700 -129956 55846 228835 -90128 118970
12080C37730A32892r851b48150g5804I63J25431g0558n5692O0175l3251B12949
$$ 337730 132892 123041 -248150 -75804 963 126394 -70558 -126250 -66075 -99326 212949
12068a12612p3059A69852K40115j39515O89905J96411D85087r9771K09483B83730
$$ -112612 -185671 169852 409967 270452 960357 1156768 485087 385316 594799 283730
12057a26048n029A20176c05527Q4205C40200D4166K1562J5528K3617M6896K4322
$$ -126048 -131077 120176 -305527 -221322 340200 44166 65728 81256 104873 151769 176091
12046A76091i9109B22408a98186Q2772E6686N3362d8444A91589f4581b7447k22615
$$ 176091 -99109 222408 -198186 -115414 56686 110048 -48444 191589 -64581 -27447 -250062
12035b50062g24j0090A53651c73457a18368I1479a4977l5641g88B58062A21774
$$ -250062 -724 -10814 153651 -373457 -118368 91479 -14977 -50618 -788 258062 121774
12023B63751g8265A67784a193j78531d9630A82670q4426b73416g9444D371J0056
$$ 263751 -78265 167784 -1193 -179724 -49630 182670 98244 -273416 -79444 4371 14427
12012A4427a1575k87251E3838b77646A21630j07J05609n5765J46684j32385m8005
$$ 14427 -11575 -298826 53838 -277646 121630 121523 227132 171367 318051 185666 137661
12001A37661k068d2248F6779M0076b7455q1934N3842H3452E394K89364a18736
$$ 137661 135593 -42248 66779 106855 -27455 -109389 -55547 83452 5394 294758 -118736
11989c16807J42697P5330k70395a81555Q8204B71556R718b34281j4417b5437I2771
$$ -316807 -174110 -98780 -369175 -181555 -93351 271556 281274 -234281 -248698 -25437 92771
11977a73550l9731B30907f0067K9139o6837m860m1009F9818c6925E0768O3615
$$ -173550 -213281 230907 -60067 -30928 -97765 -102625 -143634 69818 -36925 50768 114383
11966A14383b09719B25115b93918F0821K51117G7029L7902j040P748F0106J61494
$$ 114383 -209719 225115 -293918 60821 311938 77029 114931 113891 121639 60106 221600
11955B21600h8960p8941A27998d32752H1122J95705a84176c9113A9980J31403
$$ 221600 -88960 -167901 127998 -432752 81122 276827 -184176 -39113 19980 151383
11945A51383a39396O4254j0498m9161A52681b21915P4578a5937B249J03352J66235
$$ 151383 -139396 -75142 -85640 -134801 152681 -221915 -147337 -15937 2249 105601 271836
11934B71836n309f688j05806J019L0412j63640D0137J9210g7788A80825b30383
$$ 271836 266527 -6688 -112494 -111475 -81063 -244703 40137 59347 -77788 180825 -230383
11922c40678J58599a7604p193A64141A4785K25241O0404A11774a86655A27480
$$ -340678 -182079 -17604 -24797 164141 14785 240026 300430 111774 -186655 127480
11911c9615D9769b20127Q4193B73936i8354l04528C05848b02508m9499J25819
$$ -39615 49769 -220127 -135934 273936 -98354 -402882 305848 -202508 -252007 -126188
11901a26188A25952E8680J5532b8288B173a40999j55235J26508g0034j42845q8211
$$ -126188 125952 58680 74212 -28288 2173 -140999 -296234 -169726 -70034 -212879 -301090
11890c01090c6485H2236J91760C6344J88928g3041F7504h3708k92254J03133j05957
$$ -301090 -36485 82236 273996 36344 225272 -73041 67504 -83708 -375962 -272829 -378786
11879c78786e7980I9556P3036a71434j43842B49361G2760d2017j94482k81417
$$ -378786 -57980 99556 172592 -171434 -315276 249361 72760 -42017 -236499 -517916
11869e17916J83593D7603B1274i9487L2364C4919b0623A61376b8537j58084A35824
$$ -517916 -334323 47603 21274 -99487 -67123 34919 -20623 161376 -28537 -186621 135824
11857b64793D1655d7332B54184b67768I0035a19397E5583Q5256a29807b3403I5725
$$ -264793 41655 -47332 254184 -267768 90035 -119397 55583 140839 -129807 -23403 95725
11845B00d2694E6603K01310l6221j06537j5891d68914a19601A14967c00053c6682
$$ 200 -42694 56603 257913 221692 115155 99264 -468914 -119601 114967 -300053 -36682
11833h904r2570D41938b08994F4124b72984b4217B5472a38245j14161G8032J52818
$$ -8904 -101474 441938 -208994 64124 -272984 -24217 25472 -138245 -252406 78032 230850
11822B30850d00127a22130E5169J051a79364j4397k25979c2960k18990e3392j68467
$$ 230850 -400127 -122130 55169 56220 -179364 -193761 -419740 -32960 -251950 -53392 -221859
11811b21859B8012J7236a35026F4912O0060a779D5817M0675a23094C08366B5340
$$ -221859 28012 45248 -135026 64912 124972 -1779 45817 86492 -123094 308366 25340
11799a00585g019j25512N225K7906j56165D7472b33601r5395a10167d7023k99318
$$ -100585 -7019 -132531 -127306 -99400 -255565 47472 -233601 -328996 -110167 -47023 -346341
11788c46341Q2578J22196e2810I8564K30200a02124F8682a47667A60189a17611
$$ -346341 -263763 -141567 -52810 98564 328764 -102124 68682 -147667 160189 -117611
11777A45675l5064h4810A22801E5147c8436G1063b69936B8770J70954f3332A8104
$$ 145675 110611 -84810 122801 55147 -38436 71063 -269936 28770 199724 -63332 18104
11765a34474e7693H7766M4217P5291p4645a54703D8710K22987A00867b36634b3936
$$ -134474 -57693 87766 131983 207274 132629 -154703 48710 271697 100867 -236634 -23936
11753c6968G7451g0088o9563B67153h6078M860D6494d14797B07318F6645L7775
$$ -36968 77451 -70088 -139651 267153 -86078 -81218 46494 -414797 207318 66645 104420
11742A04420K87768a41669A22517g6425A73648g6983j58452h0451p3821G078K6513
$$ 104420 392188 -141669 122517 -76425 173648 -76983 -235435 -80451 -154272 7078 33591
11731C3591M9495J61791A20513a01702k17401a31408B14499h8648A87065b9705
$$ 33591 83086 244877 120513 -101702 -319103 -131408 214499 -88648 187065 -29705
11720A21509e3306I1431a06791L5705I964L09366c94988h4475A26028a62476b7631
$$ 121509 -53306 91431 -106791 -71086 9964 319330 -394988 -84475 126028 -162476 -27631
11708A3963K08565D435a87853C03490c20598P2699B38750D2004a47171j13081
$$ 13963 222528 4435 -187853 303490 -320598 -247899 238750 42004 -147171 -260252
11698b60252F8705J8327J84948j26646b73859Q9602d4836k04683C50831A31106
$$ -260252 68705 87032 271980 145334 -273859 -184257 -44836 -249519 350831 131106
11687A40484n2926N9052C4209a26785C00925r3744b23561R8474b4580l2693G2221
$$ 140484 87558 146610 34209 -126785 300925 207181 -223561 -125087 -24580 -57273 72221
11675C9300b13301N3095l8169P1184j07884e7166r9104I4924B0257K5867J08006
$$ 39300 -213301 -160206 -198375 -127191 -235075 -57166 -156270 94924 20257 46124 154130
11664A54130H132J7160K54651A31613M3194f719k38457C57615G0212L42487A79342
$$ 154130 8132 25292 279943 131613 174807 -6719 -245176 357615 70212 412699 179342
11652c28759J14347B0555e6293D49272A1018L83413a02214l7136D8492M4865l6148
$$ -328759 -214412 20555 -56293 449272 11018 394431 -102214 -139350 48492 93357 57209
11641E7209k0040h035C21433N967A36697l8335b581D08909b65766B56132c24j0973
$$ 57209 37169 -8035 321433 327400 136697 98362 -2581 408909 -265766 256132 -324 -11297
11629a1297B10673a76441k1324L8374c0521A28023A5565b7778j84946G6570a41529
$$ -11297 210673 -176441 -197765 -159391 -30521 128023 15565 -27778 -212724 76570 -141529
11617a21356A38321N1937F7268J17982a06F2748b12111B71404k5780G4649a61645
$$ -121356 138321 190258 67268 185250 -106 62748 -212111 271404 245624 74649 -161645
11605B87767b12136e5869I7206c9354A13724j4193c43604C03539j07766P2460
$$ 287767 -212136 -55869 97206 -39354 113724 99531 -343604 303539 195773 268233
11595B68233i5595j30297R9805F8534J91714i1981D7702h9595k65371J3290A26602
$$ 268233 -95595 -225892 -126087 68534 260248 -91981 47702 -89595 -354966 -341676 126602
11583a239j50906l946b472q5361j989j2695r4463C26926G6777a25703c6491k6305
$$ -1239 -152145 -156091 -2472 -87833 -89822 -102517 -196980 326926 76777 -125703 -36491 -62796
11571f2796I2901b83391A37819Q7361h3138j33369D6321g5447r2789C149P7077
$$ -62796 92901 -283391 137819 225180 -83138 -216507 46321 -75447 -168236 3149 80226
11560H0226J01614m0649n7941b77809C88089q8901r6857p3264K97457k12169G4127
$$ 80226 181840 141191 83250 -277809 388089 299188 202331 129067 426524 214355 74127
11548A35013j1697a29517b2547j18921C8541K50386K5027d6573A6386K04804j345
$$ 135013 123316 -129517 -22547 -141468 38541 288927 313954 -46573 16386 221190 219845
11537B19845I6149a57076B37122j11879f2481f419p3872B84064j29956a19997
$$ 219845 96149 -157076 237122 125243 -62481 -6419 -80291 284064 154108 -119997
11526a49079n5322n3462C75892a88406M0574B94559G071M6033b46513e0399B75982
$$ -149079 -204401 -257863 375892 -188406 -147832 294559 7071 53104 -246513 -50399 275982
11514D64812a14870A64333a14282E7039k421q642b20196A1864R0566J82313d8667
$$ 464812 -114870 164333 -114282 57039 54618 45976 -220196 11864 102430 284743 -48667
11502B44885f3263b6280l4450B1562K75868a38471A84700J29585q9674m7109a04957
$$ 244885 -63263 -26280 -60730 21562 297430 -138471 184700 314285 224611 177502 -104957
11490A530J6196J16452l9330b9915G5801f1947A6437N969J92503l7932d4441B87258
$$ 1530 17726 134178 94848 -29915 75801 -61947 16437 22406 214909 176977 -44441 287258
11477F1255N0434J98506b17855C63658a2812D62830h6148A85726a77563g0570
$$ 61255 111689 310195 -217855 363658 -12812 462830 -86148 185726 -177563 -70570
11466C04394p3508G6127K58438A47132J56777j40096K6575K769N3647n1432i8135
$$ 304394 230886 76127 334565 147132 303909 163813 190388 193157 246804 195372 -98135
11454b71022C01390e8950B1775K44186g4628B71476q8567J13109A36447i1723
$$ -271022 301390 -58950 21775 265961 -74628 271476 182909 296018 136447 -91723
11443H1246L3361g1826A18002k6874L40789B3108K41099c74449g142B6992b34295
$$ 81246 114607 -71826 118002 91128 431917 23108 264207 -374449 -7142 26992 -234295
11431H0815a07686A63404B1765K28888D9707K53524A34586Q4267a09259A06745
$$ 80815 -107686 163404 21765 250653 49707 303231 134586 218853 -109259 106745
11420a49966D97298a30962A84672N0694F7659H002c29722A2433b6000D85533j78407
$$ -149966 497298 -130962 184672 235366 67659 8002 -329722 12433 -26000 485533 307126
11409C07126r2542g8942A12533f89m6331A85092h0882k91859F5809a80137q7325
$$ 307126 214584 -78942 112533 -689 -47020 185092 -80882 -372741 65809 -180137 -267462
11398b67462h3084k10071H8171L4302B5536A309b44293A24251F0654N4849E7333
$$ -267462 -83084 -293155 88171 122473 25536 1309 -244293 124251 60654 115503 57333
11386b36068b7562D5167K0490D414g3141k330I4360J93347b53488a7137j58135
$$ -236068 -27562 45167 65657 4414 -73141 -75471 94360 287707 -253488 -17137 -175272
11375a75272B58728A12042J46353o7241C0957b93205a10757l9312G3296c17132
$$ -175272 258728 112042 258395 191154 30957 -293205 -110757 -150069 73296 -317132
11364A95536e9354B2483J06312b77249l2748a14419o5435j97956a33022d714C17854
$$ 195536 -59354 22483 128795 -277249 -309997 -114419 -179854 -377810 -133022 -4714 317854
11352a7689Q39A34412a6792m0867n3617F1277b02839l4773d7846B15662a41467
$$ -17689 -16850 134412 -16792 -57659 -111276 61277 -202839 -237612 -47846 215662 -141467
11340a60986B40840c37555n1246a47952c9049B55O804J95894c02391H2117m0452
$$ -160986 240840 -337555 -388801 -147952 -39049 255 7059 202953 -302391 82117 41665
11329D1665N1081c04508m3994A54163E2915Q88a00600J8359A83186J0795q0838
$$ 41665 92746 -304508 -348502 154163 52915 53803 -100600 -82241 183186 193981 113143
11318A13143D1962K4861N6670K4366c90482a53623m9856A36649a42836C47613
$$ 113143 41962 66823 123493 147859 -390482 -153623 -203479 136649 -142836 347613
11307I2378c38659K2814A42584F7347O3170b65890E5233i4452L6131h868k50256
$$ 92378 -338659 -315845 142584 67347 130517 -265890 55233 -94452 -58321 -8868 -259124
11296b59124K9935M5213A58285c66067J48676D630K71999I1439c42402F821b06256
$$ -259124 -229189 -183976 158285 -366067 -217391 4630 276629 91439 -342402 6821 -206256
11284a73703F1184i9398l4740B06315F8193e1034A15766f3526j47217P2357F6510
$$ -173703 61184 -99398 -134138 206315 68193 -51034 115766 -63526 -210743 -138386 66510
11272g6777m596F7885a65601E3002E46J3396c16618a32635a8383F3959g7360A27051
$$ -76777 -81373 67885 -165601 53002 546 13942 -316618 -132635 -18383 63959 -77360 127051
11259a8318o0561D0414a517A92470f1926n8606H5859b52204P5716n566b0912B69670
$$ -18318 -78879 40414 -1517 192470 -61926 -120532 85859 -252204 -176488 -182054 -20912 269670
11246h2842B9196d8155l16969B03696a0284j60598G0422a91002d2495E3847d31964
$$ -82842 29196 -48155 -365124 203696 -10284 -170882 70422 -191002 -42495 53847 -431964
11234d6797r2519F4544g7088r5892G6424J76880c26635I541b70570A02859a06467
$$ -46797 -139316 64544 -77088 -172980 76424 253304 -326635 9541 -270570 102859 -106467
11222d7801l31378J25710A28518b45810Q2854m331A97686p1839J8948d6861A93719
$$ -47801 -379179 -253469 128518 -245810 -162956 -167287 197686 125847 144795 -46861 193719
11210a47971M1077A57994b03431r561L3149d5628B53371a67585A54086J4221a43611
$$ -147971 -106894 157994 -203431 -212992 -179843 -45628 253371 -167585 154086 168307 -143611
11198b6083k698j61472L4155e6703B3405O4220h4615J122a3218k61712A0978J10388
$$ -26083 -28781 -190253 -156098 -56703 23405 87625 -84615 -83493 -13218 -274930 10978 121366
11186A21366a21782j04942K0242g5638k18246C752J03654g0748k2882j8817n1439
$$ 121366 -121782 -226724 -206482 -75638 -293884 3752 107406 -70748 -93630 -112447 -163886
11175a63886N769p4699b4472p3772F3747P9670g331k03912F6020K37768b42766
$$ -163886 -158117 -232816 -24472 -98244 63747 143417 -7331 -211243 66020 303788 -242766
11163E6228B6866f0863B55643F2257M0196d45195D2706J32836a96105f7741l04498
$$ 56228 26866 -60863 255643 62257 102453 -445195 42706 175542 -196105 -67741 -372239
11152c72239D9949b34097L8261G1936J11679a40841G8227b23652d8108A2724b53019
$$ -372239 49949 -234097 -195836 71936 183615 -140841 78227 -223652 -48108 12724 -253019
11140h8800A03689K5903j7415g1742p1851N9634L8172A49674g7290A74609a189
$$ -88800 103689 129592 112177 -71742 -143593 -83959 -45787 149674 -77290 174609 -1189
11128a72717B98329N8913G3713a53543B08231i4013D05801f8353A00441a86778
$$ -172717 298329 357242 73713 -153543 208231 -94013 405801 -68353 100441 -186778
11117A81736c41745A69355c9071b643l06217h069D0296J17362P2263j014H4691
$$ 181736 -341745 169355 -39071 -2643 -308860 -8069 40296 157658 229921 228907 84691
11105B13873r7414j653f0186F4286Q0053c5768A69143n4892J08160E6730J8634
$$ 213873 116459 114806 -60186 64286 144339 -35768 169143 114251 222411 56730 75364
11094G5364d8503A81109J4469a45392A56556J42218d0400j18610B73336P4572
$$ 75364 -48503 181109 195578 -145392 156556 298774 -40400 -159010 273336 347908
11084C47908m5059a4202q8460B95679g5366F70106p3431k53213A0989g2100B60763
$$ 347908 302849 -14202 -102662 295679 -75366 670106 596675 343462 10989 -72100 260763
11072I0717j1404L71384A25752J94008A49902Q0990o7294g5962A36900a58606
$$ 90717 79313 450697 125752 319760 149902 230892 163598 -75962 136900 -158606
11061D21941C2993M44167k00983c137B61450J4319K7969D7002b9454C27826j23119
$$ 421941 32993 477160 276177 -3137 261450 275769 303738 47002 -29454 327826 204707
11050B04707O3616L71230j24103j11014n6471j3213L39086C14890n874A35969
$$ 204707 268323 639553 515450 404436 347965 334752 673838 314890 309016 135969
11039C53125j21026J12870L53031j61509j9667N00004m77360j8763O022L64158
$$ 353125 232099 344969 698000 536491 516824 1016828 539468 520705 526727 890885
11029H90885k68672R295j59317J06145j44608J27706J54493J29755q5910R0453
$$ 890885 622213 631508 472191 578336 433728 561434 715927 845682 759772 850225
11019H50225C67417J25141q212J28282l0798J50915j53550K40987n0496r393k59491
$$ 850225 367417 492558 484346 612628 581830 732745 579195 820182 769686 760293 500802
11008E00802B37588M85298m0061K6672Q9222C63634L83883l39703J30820p6081
$$ 500802 237588 722886 682825 709497 798719 363634 747517 407814 538634 462553
10998D62553J68240l9724J96766k30804j36281K39039j34142M3331J27832K24739
$$ 462553 630793 591069 787835 557031 420750 659789 525647 568978 696810 921549
10988I21549p6108k67413J38356J74262J5701j71555l715C25097L84212j17966
$$ 921549 845441 578028 716384 890646 906347 734792 731077 325097 709309 591343
10978E91343L65802C20155O39963m45723J54228m9757N290n7716P16219l77542
$$ 591343 957145 320155 960118 514395 668623 618866 624156 566440 1282659 905117
10968I05117O2886M84J49360r1899K08027J20580J51063P3354J79947k20662N40404
$$ 905117 968003 968487 1117847 1025948 1233975 1354555 1505618 1578972 1758919 1538257 2078661
10957B078661p3579J38995J60299O2489K91582n30257l8229j70860K913j46079
$$ 2078661 2005082 2144077 2304376 2366865 2658447 2128190 2089961 1919101 1922014 1775935
10947A775935k23666L3357K5105k13259L99703J37565l81280p4456P0916L14142
$$ 1775935 1552269 1585626 1610731 1397472 1797175 1934740 1553460 1479004 1549920 1864062
10937A864062H86104M1316M3159Q0435l35375K7987J12226C40707j39014J15815
$$ 1864062 886104 927420 970579 1051014 715639 743626 855852 340707 201693 317508
10927C17508D6231k2511K03863J59878j86180J4793K39698I5838i9628G4824a95288
$$ 317508 46231 23720 227583 387461 201281 216074 455772 95838 -99628 74824 -195288
10915a1119H6956l0665K98527e6624C22413A36484l9482J41860j19060k3669a23772
$$ -11119 86956 56291 354818 -56624 322413 136484 97002 238862 119802 96133 -123772
10903F9782F461K53780a62437K7214p8677A34693E0890a81109P4922C16662A52818
$$ 69782 6461 260241 -162437 -135223 -213900 134693 50890 -181109 -106187 316662 152818
10891A80399k1402J72016H8394j6239d6960A72674J55552F965J4618K47105E0679
$$ 180399 158997 331013 88394 72155 -46960 172674 328226 6965 21583 268688 50679
10879E613h0114j23560B53963b67233b0363A43058Q3299J2209B1831J71141b4719
$$ 5613 -80114 -203674 253963 -267233 -20363 143058 226357 238566 21831 192972 -24719
10867b75867J11572L0796B13335n3627b77139A5167d3320I151a29367C5573a5979
$$ -275867 -164295 -133499 213335 159708 -277139 15167 -43320 9151 -129367 35573 -15979
10855b46796l5798a1402r2804a4249F9403J73430c21806B3778h7473B9930K03593
$$ -246796 -282594 -11402 -104206 -14249 69403 242833 -321806 23778 -87473 29930 233523
10844B33523g0933j29557A1151c96402a72858j61806i3348j49758E6636J2232
$$ 233523 -70933 -200490 11151 -396402 -172858 -334664 -93348 -243106 56636 68868
10834F8868a64168A33947b40366g8589H6030a83205B222c23144a59532D1605K5795
$$ 68868 -164168 133947 -240366 -78589 86030 -183205 2222 -323144 -159532 41605 67400
10823F7400O2536a08774J8369k21986a23519L5371K2692A55614a10706j83458
$$ 67400 129936 -108774 -90405 -312391 -123519 -88148 -65456 155614 -110706 -294164
10813b94164e0383k18741H6061k0038j3989i5057C8130J15781B4385J22940o6948
$$ -294164 -50383 -269124 86061 66023 52034 -95057 38130 153911 24385 147325 80377
10802H0377a8522q4405B37677f3817A14867c0926q9615E5055e1567b0179j37892
$$ 80377 -18522 -102927 237677 -63817 114867 -30926 -120541 55055 -51567 -20179 -158071
10791a58071A22608J06009H4524B0960b41780r5049B2466J41796i0758E2923c44915
$$ -158071 122608 228617 84524 20960 -241780 -336829 22466 164262 -90758 52923 -344915
10779c29837N9649a16284I5244O1559b41772a06214H769a04518B17049a30965
$$ -329837 -270188 -116284 95244 156803 -241772 -106214 8769 -104518 217049 -130965
10768B41109b39043j35699I1213e8537p8390A8218e5029p4021J1453a9340B90837
$$ 241109 -239043 -374742 91213 -58537 -136927 18218 -55029 -129050 -117597 -19340 290837
10756a21060N6837B3657g1916B28436j8987A998a60063B33104A01563b347j96836
$$ -121060 -64223 23657 -71916 228436 209449 1998 -160063 233104 101563 -2347 -199183
10745a99183r8320A59427n9442a65860J7014A9912c63460h5638A4611b30389B15883
$$ -199183 -297503 159427 99985 -165860 -148846 19912 -363460 -85638 14611 -230389 215883
10733a04396B40485b23487A80181b14832C53836h6892p0924H678J91382f657p7835
$$ -104396 240485 -223487 180181 -214832 353836 -86892 -157816 8678 200060 -6657 -84492
10722h4492B40711a67122N3577r1677A98722b1652k97109A16274A2931b58015
$$ -84492 240711 -167122 -113545 -205222 198722 -21652 -318761 116274 12931 -258015
10711a04331N792j72883i7344j4052A82878n9373D278a03048j9580E6525b08419
$$ -104331 -98539 -271422 -97344 -111396 182878 123505 4278 -103048 -122628 56525 -208419
10699B22213b17558A94770b439A19053m8262L228d3423k7176a7082E4004a73062
$$ 222213 -217558 194770 -2439 119053 70791 74019 -43423 -70599 -17082 54004 -173062
10687b39113d5612l7850G4196a43817D1186h6223k21010a23111o7756F9097J03246
$$ -239113 -45612 -83462 74196 -143817 41186 -86223 -307233 -123111 -190867 69097 172343
10676A72343l0524C8759b95669b2502A01830c53549A17533b04956N3781n0482
$$ 172343 141819 38759 -295669 -22502 101830 -353549 117533 -204956 -151175 -201657
10666b01657D8611a140A492a66967l37299J07556a00409j37403C6556J47865e8657
$$ -201657 48611 -1140 1492 -166967 -504266 -396710 -100409 -237812 36556 184421 -58657
10654b5110o5726k08616b2297H8374J50016h3229B07234b8587j34681j06768l3358
$$ -25110 -90836 -299452 -22297 88374 238390 -83229 207234 -28587 -163268 -270036 -303394
10643c03394n250A48617c42789J43556B34421b14033l9529A27088a19216p8711
$$ -303394 -308644 148617 -342789 -199233 234421 -214033 -253562 127088 -119216 -197927
10633a97927k6633K680k4380C1543a81213H5598c6417r7653j1668e246C48545
$$ -197927 -224560 -221880 -246260 31543 -181213 85598 -36417 -134070 -145738 -5246 348545
10621A03394h317A19932n6985j4786a22335L2745C49459c56919N5437a20881N4958
$$ 103394 -8317 119932 62947 48161 -122335 -89590 349459 -356919 -301482 -120881 -65923
10610f5923a0203D24836a64112B23153A02753h2331j24695A72129c02551C20966
$$ -65923 -10203 424836 -164112 223153 102753 -82331 -207026 172129 -302551 320966
10599c96421A69840b36929J14336l8590j62792N8262F6260c75665i2760d1399
$$ -396421 169840 -236929 -122593 -161183 -323975 -265713 66260 -375665 -92760 -41399
10588a15983A79498M2687C6934a76314E6353c79096d73C15736a95385d0743A35608
$$ -115983 179498 222185 36934 -176314 56353 -379096 -473 315736 -195385 -40743 135608
10576b48530P9704O7624J0229q2205a8989o9696L434j76894c3669j29863K9958
$$ -248530 -168826 -101202 -90973 -173178 -18989 -88685 -85251 -262145 -33669 -163532 -133574
10565a33574o24H0862b77167j52201e5063r7206b3064h540j31205o1300G9989
$$ -133574 -134198 80862 -277167 -429368 -55063 -152269 -23064 -8540 -139745 -201045 79989
10553b62534l1103a21769K6595G8541a87357P6469G6507a1332j1755A21489A454
$$ -262534 -293637 -121769 -95174 78541 -187357 -110888 76507 -11332 -23087 121489 1454
10541C0522i6542k08889F9910P0503A3294a9463j53043J5817B6037a95161a6092
$$ 30522 -96542 -305431 69910 140413 13294 -19463 -172506 -156689 26037 -195161 -16092
10529A2643P9761k4684J71989a16877G8998J19081D6347J24668P5248a7861d607
$$ 12643 92404 67720 239709 -116877 78998 198079 46347 171015 246263 -17861 -4607
10517f7870G9800G770d76361J81676q4929B17603b02307k0132A82569J22991a42912
$$ -67870 79800 7770 -476361 -294685 -379614 217603 -202307 -222439 182569 305560 -142912
10505A61908a31309O2439a6925j2920H2713K26696a2758o0049A67569g3368N770
$$ 161908 -131309 -68870 -16925 -29845 82713 309409 -12758 -72807 167569 -73368 -67598
10494f7598r9082J5670b0459G5346d0622j22317j18030A380O9728C3769K11856
$$ -67598 -166680 -151010 -20459 75346 -40622 -162939 -280969 1380 71108 33769 245625
10483B45625e7239q1286B27142b43766J3008a1499m5764j51787A16858g9185E4538
$$ 245625 -57239 -138525 227142 -243766 -230758 -11499 -57263 -209050 116858 -79185 54538
10471A27293L0802n2352m0680O9437L48629n7703P8101R7522A98214c7791D66495
$$ 127293 158095 105743 65063 134500 483129 425426 503527 601049 198214 -37791 466495
10459C72032m0346I7709a12566p0366A25575k640i6170A34766C1009b44287C11719
$$ 372032 331686 97709 -112566 -182932 125575 122935 -96170 134766 31009 -244287 311719
10447A14419D7867a63608A69970D8251b25224A93594F2830B369a79197A17414
$$ 114419 47867 -163608 169970 48251 -225224 193594 62830 2369 -179197 117414
10436a27365B01541c2256E098J08908L75609A13549a75798A05335b94799A81889
$$ -127365 201541 -32256 5098 114006 489615 113549 -175798 105335 -294799 181889
10425G7762a25021j36524k82212D54590b01395f2981A9377J83233f0896C92172
$$ 77762 -125021 -261545 -543757 454590 -201395 -62981 19377 202610 -60896 392172
10414e1149J6068a2216C62012j06682e3486o2366G7506J46622a92255n5675h8542
$$ -51149 -35081 -12216 362012 255330 -53486 -115852 77506 224128 -192255 -247930 -88542
10402f6999A29775a98942i2274r312j11758Q1271A46457d73k84044o4780J31832
$$ -66999 129775 -198942 -92274 -101586 -213344 -132073 146457 -473 -284517 -349297 -217465
10391b17465P7447b9227a3246m9096k17966J21264J8694A74533m4027b21791B50861
$$ -217465 -140018 -29227 -13246 -62342 -280308 -159044 -140350 174533 130506 -221791 250861
10379a09900a4249l7111K0488I7846N9101L92589A40220e4908A75447h3973L949
$$ -109900 -14249 -51360 -30872 97846 156947 549536 140220 -54908 175447 -83973 -80024
10368h0024A2871J49456F7266K01194A07689a73095C28740d28525D92530K4240
$$ -80024 12871 162327 67266 268460 107689 -173095 328740 -428525 492530 516770
10358E16770j45982p0245P8172A34511l3442P5752A1101K51708K16739K9143B47950
$$ 516770 370788 300543 378715 134511 101069 176821 11101 262809 479548 508691 247950
10346A08134K1352J47212O0383j47123p136o1674J14339J21540j14319J74361
$$ 108134 129486 276698 337081 189958 182822 121148 235487 357027 242708 417069
10336D17069j68153p6218L07641J28598B21632F4024L14856M7016l2778A51683
$$ 417069 248916 172698 480339 608937 221632 64024 378880 425896 393118 151683
10325B06855K19811A95864m9063o7543M61646H4528M83065a3633A74680l7679
$$ 206855 426666 195864 146801 79258 540904 84528 567593 -13633 174680 137001
10315A37001P4746N5287a74088B20258j04806J16535e427m0323A70762M0963R9585
$$ 137001 211747 267034 -174088 220258 115452 231987 -5427 -45750 170762 211725 311310
10304C11310A03160K43503F2597N1670J44396F7509a66677b5518A884a14007A76312
$$ 311310 103160 346663 62597 114267 258663 67509 -166677 -25518 1884 -114007 176312
10292C3438a47062j99656K0096j87033i6796D8106i2137H7450c1418B19038G6383
$$ 33438 -147062 -346718 -326622 -513655 -96796 48106 -92137 87450 -31418 219038 76383
10280a17412e3205q1715A97448G615c9374o9065N62B53589i213B10310A04045
$$ -117412 -53205 -134920 197448 7615 -39374 -108439 -107877 253589 -9213 210310 104045
10268G9611B2338r934K8080R4171j4204a08560k1790j13939N1790j82643K5720
$$ 79611 22338 12404 40484 134655 120451 -108560 -130350 -244289 -192499 -375142 -349422
10257c49422J27931A49177J74912f9661l4842k78504L0197e2217A33571c60824
$$ -349422 -221491 149177 324089 -69661 -104503 -383007 -352810 -52217 133571 -360824
10246a56222A11717J35346r0307J25828j1646F8032C749h3219E0808K68775L2590
$$ -156222 111717 247063 156756 282584 270938 68032 3749 -83219 50808 319583 352173
10235C52173g7220a7244F1411c22830F7614k2568J51570g0172k84878i1943K8977
$$ 352173 -77220 -17244 61411 -322830 67614 45046 196616 -70172 -355050 -91943 -62966
10224f2966C48825A74019H6591c71454f264A38461a68454J4356F4428a58852G1942
$$ -62966 348825 174019 86591 -371454 -6264 138461 -168454 -154098 64428 -158852 71942
10212d0482j85536a7994G6804J23603J67585a09551A4902J89234F9762h2297A3523
$$ -40482 -226018 -17994 76804 200407 367992 -109551 14902 204136 69762 -82297 13523
10200H3282b46001g6805B8480b63916Q9395C4302J64007O6739b26043C7380L23017
$$ 83282 -246001 -76805 28480 -263916 -174521 34302 198309 265048 -226043 37380 360397
10189C60397j29945a92849A03713K03480b3689C25165h8955c5837E542a10762
$$ 360397 230452 -192849 103713 307193 -23689 325165 -88955 -35837 5542 -110762
10178A81988a98030b1994j1456j72383P2936r8351a7686k18723M6899j00934N9578
$$ 181988 -198030 -21994 -33450 -205833 -132897 -231248 -17686 -236409 -189510 -290444 -230866
10167b30866A39046b50926B08569f3244p338b24A88611b81255J7782O0432A60554
$$ -230866 139046 -250926 208569 -63244 -70582 -224 188611 -281255 -263473 -203041 160554
10155f9144j09467Q5767d1425j83099j29750J43524A2903b96013c3877a3222j13525
$$ -69144 -178611 -92844 -41425 -224524 -354274 -210750 12903 -296013 -33877 -13222 -126747
10144a26747j50951A52677a13358d4647p2634m2048B13214b6668k3553A01951
$$ -126747 -277698 152677 -113358 -44647 -117281 -159329 213214 -26668 -50221 101951
10133F297J12507a584H4651b0244n2732J8340A78296E6010b45075a06932A17593
$$ 6297 118804 -1584 84651 -20244 -72976 -54636 178296 56010 -245075 -106932 117593
10121b01770C0081a96088B79687c16784J37127A75307c21945B52445a76514B38654
$$ -201770 30081 -196088 279687 -316784 -179657 175307 -321945 252445 -176514 238654
10110C1227L2333n375N6519D1606a20944o9416q8524a7670p6858d2389K533o827
$$ 31227 63560 58185 114704 41606 -120944 -190360 -278884 -17670 -94528 -42389 -39856 -46683
10098d6683r383F7754b12426k0533B01859b9230b457E1506J83091G4382B7435
$$ -46683 -56066 67754 -212426 -232959 201859 -29230 -2457 51506 234597 74382 27435
10086b40742J05095A01283h704D43056a2369l7917j99492a16975G4630a94518
$$ -240742 -135647 101283 -8704 443056 -12369 -50286 -249778 -116975 74630 -194518
10075d07169J26699J04231n9238a14391B08757A00999O9910h2789C05783a22858
$$ -407169 -280470 -176239 -235477 -114391 208757 100999 170909 -82789 305783 -122858
10064b57100b4128C9788j1151b43125j16999a65088j9208F2437Q1760c03680b7081
$$ -257100 -24128 39788 28637 -243125 -360124 -165088 -184296 62437 144197 -303680 -27081
10052C92434c93925A17441b01972d4802C2616e0461A10612E3072K29942r6820
$$ 392434 -393925 117441 -201972 -44802 32616 -50461 110612 53072 283014 186194
10042A86194p167g0598A26095a79718c5259n3417C04896A04513a33485G818d5308
$$ 186194 179027 -70598 126095 -179718 -35259 -88676 304896 104513 -133485 7818 -45308
10030C830Q1347b33588n9703n8175d2280A37214a36581N7740m8121A03942D2442
$$ 3830 85177 -233588 -293291 -351466 -42280 137214 -136581 -78841 -126962 103942 42442
10018b20409a4626o4269k23906M3568n478B69769A33394a36013k38033m0997h7376
$$ -220409 -14626 -78895 -302801 -259233 -264711 269769 133394 -136013 -374046 -415043 -87376
10006b2825k3530G1030P6049J10402a86970D5437i6416j34172j2269F5648c332
$$ -22825 -46355 71030 147079 257481 -186970 45437 -96416 -230588 -242857 65648 -3332
9994I8773B9432i0648m1628F4791C361c47306c6399j71493i5213h038m90A784
$$ 98773 29432 -90648 -132276 64791 3361 -347306 -36399 -207892 -95213 -8038 -8528 1784
9981c05747E7689N2657b28394I297K82770a58367A09841l8235e6209l06281n5848
$$ -305747 57689 110346 -228394 9297 292067 -158367 109841 71606 -56209 -362490 -418338
9970d18338J32247R1229f3401m6468k25447C4333i2541p7520A73229a58182N1010
$$ -418338 -286091 -194862 -63401 -109869 -335316 34333 -92541 -170061 173229 -158182 -107172
9959a07172C00683e3916j24859d6601C68160A30981b67711d7051j32668k8674
$$ -107172 300683 -53916 -178775 -46601 368160 130981 -267711 -47051 -179719 -208393
9949b08393m2836E536b02305g913k27691D991M9757H534d2650l53217C4338L88665
$$ -208393 -251229 5536 -202305 -7913 -235604 4991 54748 8534 -42650 -395867 34338 423003
9937D23003a14143k19551J07117j18273F1240a39451L9251l28716a58839o9954
$$ 423003 -114143 -333694 -226577 -344850 61240 -139451 -100200 -428916 -158839 -228793
9927b28793H6114g9955E1104B237e4001H6248a33319O2579p2981F8357b15046
$$ -228793 86114 -79955 51104 2237 -54001 86248 -133319 -70740 -143721 68357 -215046
9915b62700G4022b68211r2351a32157B19373M8670b8727k2887q1903k9112E8676
$$ -262700 74022 -268211 -360562 -132157 219373 268043 -28727 -51614 -133517 -162629 58676
9903b48244C6940d9082A3368O8720R0254a33133n2709B59704a29960A86591c16584
$$ -248244 36940 -49082 13368 82088 172342 -133133 -185842 259704 -129960 186591 -316584
9891a23250A5668d1067B72244e3964j70787A41127a87135h2184A68451b83307
$$ -123250 15668 -41067 272244 -53964 -224751 141127 -187135 -82184 168451 -283307
9880a5531p9305A8523J5140g7849n4577D4636a8070k19933A35729a86442o5389
$$ -15531 -94836 18523 33663 -77849 -132426 44636 -18070 -238003 135729 -186442 -251831
9869b51831e071I8564a32236N6369j2640I9792N7635b60489G820b66137B20573
$$ -251831 -5071 98564 -132236 -75867 -88507 99792 157427 -260489 7820 -266137 220573
9857C2643c73134A50198a00075b9617A22376a84601B49g395l56666J42203a09193
$$ 32643 -373134 150198 -100075 -29617 122376 -184601 249 -7395 -364061 -221858 -109193
9845A20376c3671A9414a20290k51718e5523J0635l6498j49487C2523b15226e9873
$$ 120376 -33671 19414 -120290 -372008 -55523 -44888 -81386 -230873 32523 -215226 -59873
9833C9507l029a56562j80824D2118b98802J00438a7774j24283d3356o0238J8686
$$ 39507 36478 -156562 -337386 42118 -298802 -198364 -17774 -142057 -43356 -103594 -84908
9822h4908A16923a68634A01717a00168a3066C88908d6892l4906o074M2154I210
$$ -84908 116923 -168634 101717 -100168 -13066 388908 -46892 -81798 -87872 -45718 9210
9810a15841E7572b84235J11290A62195g0058j76747j5407f2684j18799M1656D7615
$$ -115841 57572 -284235 -172945 162195 -70058 -246805 -262212 -62684 -181483 -139827 47615
9798G4319a691j50707H4063f9657J4481p1423a4535p6011k11j08114A71027b29102
$$ 74319 -1691 -152398 84063 -69657 -55176 -126599 -14535 -90546 -90757 -198871 171027 -229102
9785a27485j4177o1491R0465C73947i7526k03713b9975A89446f4706J3542F8499
$$ -127485 -141662 -203153 -112688 373947 -97526 -301239 -29975 189446 -64706 -51164 68499
9773A07532a56287N3404J4433j11587J0787A27683e3693m7609C17446b74108A49535
$$ 107532 -156287 -102883 -88450 -200037 -189250 127683 -53693 -101302 317446 -274108 149535
9761F6373P9525a35223j64598c0725R682o7501A1923a68556l2419h6196A10752
$$ 66373 145898 -135223 -299821 -30725 -21043 -88544 11923 -168556 -200975 -86196 110752
9749a85609a7634A14491K31469a62540C86721i5480B07589c9607H2154K46164
$$ -185609 -17634 114491 345960 -162540 386721 -95480 207589 -39607 82154 328318
9739C28318E3549J93317K2056a58273j53208a45785A160c98421E7318K3023A4924
$$ 328318 53549 246866 268922 -158273 -311481 -145785 1160 -398421 57318 80341 14924
9727a60081N6067J1874j7913B1072c1323A82196i8624n824C829a6410j52357j92725
$$ -160081 -104014 -92140 -110053 21072 -31323 182196 -98624 -104448 3829 -16410 -168767 -361492
9715c61492E6360g8844l04615f3002j03970k01018P1439C10629b91941b9663r1283
$$ -361492 56360 -78844 -383459 -63002 -166972 -367990 -296551 310629 -291941 -29663 -120946
9704a20946A21667k250a01621j13672j4177B04664q5045K9077c83254G4282k735
$$ -120946 121667 119417 -101621 -215293 -229470 204664 119619 148696 -383254 74282 71547
9693G1547a00079J5833r42j432n181j11264j62472g9782A209c02318J29347G9560
$$ 71547 -100079 -84246 -85188 -86620 -91801 -203065 -365537 -79782 1209 -302318 -172971 79560
9680A5003b19596a5905D3778r745p935K10350c58273e1239I493c6963k80222h2233
$$ 15003 -219596 -15905 43778 34033 26098 236448 -358273 -51239 9493 -36963 -317185 -82233
9667b45169g603A43503a09590j56071k36407A88705a82973L6765K0710A80700
$$ -245169 -7603 143503 -109590 -265661 -502068 188705 -182973 -146208 -125498 180700
9656a25785k82984H299e8541j97881B99183b8335E7093c4120A3339K00932i3274
$$ -125785 -408769 8299 -58541 -256422 299183 -28335 57093 -34120 13339 214271 -93274
9644a85438p8465A43493D886J09504a26425C37428i1164j14737k8681B926g2086
$$ -185438 -263903 143493 4886 114390 -126425 337428 -91164 -205901 -234582 2926 -72086
9632F9867c3420j23637j6193J2619r3638B4446b6151k0649k60964F2528c04952
$$ 69867 -33420 -157057 -173250 -160631 -254269 24446 -26151 -46800 -307764 62528 -304952
9620e7230b7560o2460o5146c6346j14151j64713g4688I8488B1712e1095c020A43255
$$ -57230 -27560 -90020 -155166 -36346 -150497 -315210 -74688 98488 21712 -51095 -3020 143255
9607a57043P6443g363k40371B03843h690k71056A25425j4821A7901i2460H8019
$$ -157043 -80600 -7363 -247734 203843 -8690 -279746 125425 110604 17901 -92460 88019
9595b24299a00506j53226d4183A46998F5381B1410O8730h2515A39322F4100O4987
$$ -224299 -100506 -253732 -44183 146998 65381 21410 90140 -82515 139322 64100 129087
9584A29087b28289L7833N9231A11735e0999l28817g2053r6144c1769F7315e0063
$$ 129087 -228289 -190456 -131225 111735 -50999 -379816 -72053 -168197 -31769 67315 -50063
9572A74563h5825j02683B90102r7827C5370a05221F3837b16511d5519B71143a86926
$$ 174563 -85825 -188508 290102 192275 35370 -105221 63837 -216511 -45519 271143 -186926
9560a71100B10589H4722b29078c9542m0780J1604l30092d0887k39711J32164j57626
$$ -171100 210589 84722 -229078 -39542 -80322 -68718 -398810 -40887 -280598 -148434 -306060
9549c06060J34811L5891A55344h5713H0804d5522J1189l66194E9114R5764L6716
$$ -306060 -171249 -135358 155344 -85713 80804 -45522 -34333 -400527 59114 154878 191594
9538A91594B2542b70515a04340k03691f167H5817a37912I7195f7330I7896R6178
$$ 191594 22542 -270515 -104340 -308031 -6167 85817 -137912 97195 -67330 97896 194074
9527A94074c43786a01856j36824J665F8296a80279j11977A02735b13763j95677
$$ 194074 -343786 -101856 -238680 -237015 68296 -180279 -292256 102735 -213763 -409440
9517d09440F0720a86225h0800c0197A6996K8095a96348B20108f7915E2683P6460
$$ -409440 60720 -186225 -80800 -30197 16996 45091 -196348 220108 -67915 52683 129143
9506A29143e0985A16744a4186l77247J47521b1139A97050L6927r5677M220B3642
$$ 129143 -50985 116744 -14186 -391433 -243912 -21139 197050 233977 138300 142520 23642
9494H7002b37894a14386j75419h99G832d75135B8740k62a5849H5239Q6659a5678
$$ 87002 -237894 -114386 -289805 -899 7832 -475135 28740 28478 -15849 85239 171898 -15678
9481B40658r7238N0599k1195i425p5864O832B2404e4908j33631A06459Q3620a68283
$$ 240658 143420 194019 172824 -9425 -85289 -78457 22404 -54908 -188539 106459 190079 -168283
9468c37901A99111B8441a58866O1662C1640a71675k00632a9989l8276D0610h9943
$$ -337901 199111 28441 -158866 -97204 31640 -171675 -372307 -19989 -58265 40610 -89943
9456e660j37834l0157n5956j3159a09742A49688b85992k63460a98303n0344E1532
$$ -5660 -143494 -173651 -229607 -242766 -109742 149688 -285992 -549452 -198303 -248647 51532
9444a40979j59027A75719H503f5744k2040n2068F2747g310A5514b27039A65730
$$ -140979 -300006 175719 8503 -65744 -87784 -139852 62747 -7310 15514 -227039 165730
9432a1519k92899J48729j23327f9228j72340e254n4848j44663M1601j50364F9264
$$ -11519 -304418 -155689 -279016 -69228 -241568 -5254 -60102 -204765 -163164 -313528 69264
9420a07973e3453k80388c6943E2395c0439j31221A8197b76504P5921l1768A51595
$$ -107973 -53453 -333841 -36943 52395 -30439 -161660 18197 -276504 -200583 -232351 151595
9408A00120a13160H1060J66444n8501a97832A05620D702J56238c58584F917h1453
$$ 100120 -113160 81060 247504 189003 -197832 105620 4702 160940 -358584 6917 -81453
9396a32280G9361b7938G6451a70967A19520J21235b13484N6188c9914a0748B87204
$$ -132280 79361 -27938 76451 -170967 119520 240755 -213484 -157296 -39914 -10748 287204
9384C130J43307b14321p7852g3909D5941a67989j69490a14717k1193p3575m172
$$ 3130 146437 -214321 -292173 -73909 45941 -167989 -337479 -114717 -135910 -209485 -213657
9373b13657A29028b51179B086c1788A68002i6720b4100A52794c720k289A08112
$$ -213657 129028 -251179 2086 -31788 168002 -96720 -24100 152794 -3720 -6009 108112
9361a20919K4997D4352A4212J3112R617A4763b3181C1039A2886L810J3127d3321
$$ -120919 -95922 44352 14212 27324 36941 14763 -23181 31039 12886 16696 29823 -43321
9348C5488a67118k57706H0973a69085p3537A08024B4920b24041E2405N5745b66749
$$ 35488 -167118 -424824 80973 -169085 -242622 108024 24920 -224041 52405 108150 -266749
9336D2024J2765a30745B57465a80052J0356Q1249l6693l3819A75281K3202a49289
$$ 42024 54789 -130745 257465 -180052 -169696 -88447 -125140 -158959 175281 198483 -149289
9324A30700b1414p003j25263p3237F0834J1211a40005j45711E6451P5007a28004
$$ 130700 -21414 -28417 -153680 -226917 60834 72045 -140005 -285716 56451 131458 -128004
9312a25181k42526J58738j82201H9270b04392C04509C4325k738i6597j08674A1038
$$ -125181 -367707 -208969 -391170 89270 -204392 304509 34325 31587 -96597 -205271 11038
9300C4392P5394d79916K21679F2932K04336C3994A0726b52370k89507b2331j59562
$$ 34392 109786 -479916 -258237 62932 267268 33994 10726 -252370 -541877 -22331 -181893
9289a81893A03972b66410E3557c48687g9583j05358B3905J9151A0724b20305i4298
$$ -181893 103972 -266410 53557 -348687 -79583 -184941 23905 43056 10724 -220305 -94298
9277b53666o2437M4679G780g6774j85262h0550a2275k93994J47131B50482f2076
$$ -253666 -316103 -271424 7780 -76774 -262036 -80550 -12275 -306269 -159138 250482 -62076
9265E9062K386O9565J71014a14067C4910M0961J42549e3594n7918j41214A03228
$$ 59062 61448 131013 302027 -114067 34910 75871 218420 -53594 -111512 -252726 103228
9253A3112g2641p6139G0067a33677d5723A158b590r4937E501N31361b70857I1625
$$ 13112 -72641 -148780 70067 -133677 -45723 1158 -2590 -97527 5501 536862 -270857 91625
9240I0622c4484E8905J6539J18906b61855H1195a39722A2871a39273k50617J83206
$$ 90622 -34484 58905 75444 194350 -261855 81195 -139722 12871 -139273 -389890 -206684
9229b06684i2757I2681c3817j93845A76499L4922b44727K7945k6271g9081A51784
$$ -206684 -92757 92681 -33817 -227662 176499 211421 -244727 -216782 -243053 -79081 151784
9217a45808H1395b44382J3756o617A27736b09810k1068q5175i5160A01524l6994
$$ -145808 81395 -244382 -230626 -237243 127736 -209810 -230878 -316053 -95160 101524 64530
9206F4530a16650B07697G1548M787o45a80076j08564k03098C1378g6991A00090
$$ 64530 -116650 207697 71548 76335 75690 -180076 -288640 -491738 31378 -76991 100090
9194c24574H5075a74550Q2235b6882j21876A341P2637a66774H2204b06940O271
$$ -324574 85075 -174550 -92315 -26882 -148758 1341 73978 -166774 82204 -206940 -200669
9183b00669F5217b6560o1682j46708A52437d40702a00367m8785B6373N1117K8507
$$ -200669 65217 -26560 -88242 -234950 152437 -440702 -100367 -149152 26373 77490 105997
9172A05997D6563K5165A0867a95004g0576j02158A360O2123a2719j07484F8372
$$ 105997 46563 71728 10867 -195004 -70576 -172734 1360 63483 -12719 -120203 68372
9160a5227F8575J9432e4923A42538a45361A40839a66380I2937c6117m34021f8612
$$ -15227 68575 88007 -54923 142538 -145361 140839 -166380 92937 -36117 -470138 -68612
9148c2674n470j23971e6964D36894g6861j16703c6449J6664j03682b9152A83730
$$ -32674 -38144 -162115 -56964 436894 -76861 -193564 -36449 -19785 -123467 -29152 183730
9136a26343o2906A60870b93071B2713b41437A98019a53692n1340k0130D5839R7879
$$ -126343 -189249 160870 -293071 22713 -241437 198019 -153692 -205032 -225162 45839 143718
9125A43718o5624g4710F854a37288f7294j54321A78704A1244a81915A35237i6703
$$ 143718 78094 -74710 6854 -137288 -67294 -221615 178704 11244 -181915 135237 -96703
9113a29885a5793n9408C5411A6336P9716B6763a9691I6164M2051h7225q5470m0271
$$ -129885 -15793 -75201 35411 16336 96052 26763 -19691 96164 138215 -87225 -172695 -212966
9101b12966f3972q3874b7963j31368b2545B4472i0859j9357r7806j77959a81324
$$ -212966 -63972 -147846 -27963 -159331 -22545 24472 -90859 -110216 -208022 -385981 -181324
9089g3175A01386a13442M9089j6493E1900g3870j33022O813F3223f4548B20307
$$ -73175 101386 -113442 -64353 -80846 51900 -73870 -206892 -200079 63223 -64548 220307
9077A7632a3705B73943a24915b9642l07431B8880J03412B523L2548e5268q4651
$$ 17632 -13705 273943 -124915 -29642 -337073 28880 132292 2523 35071 -55268 -139919
9066a39919b135j42094J4327B73549b16236Q3768d8499j57088O744J8082A1150
$$ -139919 -2135 -144229 -129902 273549 -216236 -132468 -48499 -205587 -198843 -180761 11150
9054b23896J4773J02272A473a82279c6402o0743j88118N9170l9857p0957b9562
$$ -223896 -209123 -106851 1473 -182279 -36402 -97145 -285263 -226093 -265950 -336907 -29562
9042b00354B24303a36288C230a14218o4272O7328j3485H6453C616M3999J43897
$$ -200354 224303 -136288 3230 -114218 -178490 -111162 -124647 86453 3616 47615 191512
9031A91512n992a13907j74273D483b24976B95986C3308b80126b3231j77847j24930
$$ 191512 185520 -113907 -288180 4483 -224976 295986 33308 -280126 -23231 -201078 -326008
9020c26008L6157b1041k87354C48732A39051c32558I554h0155K6986G8909A3375
$$ -326008 -289851 -21041 -308395 348732 139051 -332558 9554 -80155 -53169 78909 13375
9008b06464p7122A00810a97415B75654b97591A23354a72068N8521H1419l6028
$$ -206464 -283586 100810 -197415 275654 -297591 123354 -172068 -113547 81419 45391
8998D5391a13026i640F6975b69726a26817G2495l577c45351B7039h7049A26306
$$ 45391 -113026 -9640 66975 -269726 -126817 72495 68918 -345351 27039 -87049 126306
8986A78178c29756J20764L9046d2074D85a21837j40132C4137c16826d6359k11881
$$ 178178 -329756 -208992 -169946 -42074 485 -121837 -261969 34137 -316826 -46359 -258240
8975b58240A18909b71304l3201J07805A8349l131L33584j37412k8219a12109C0658
$$ -258240 118909 -271304 -304505 -196700 18349 15218 348802 211390 183171 -112109 30658
8963a55083P3138m161k49731e4817m559F7507B6402J51506C613b78694c4072j1707
$$ -155083 -81945 -86106 -335837 -54817 -59376 67507 26402 177908 3613 -278694 -34072 -45779
8951d5779B2115F318e8593q416b3913A02211c0224m959k63695i2641F5685e506
$$ -45779 22115 6318 -58593 -67009 -23913 102211 -30224 -35183 -298878 -92641 65685 -5506
8938b02247i8693B28764d5393G4926b10161c1996B5311L863b13490B41997J00430
$$ -202247 -98693 228764 -45393 74926 -210161 -31996 25311 29174 -213490 241997 342427
8927C42427a8476l31340F3603b03828d0519j41281h276G9130f6642A40053O5539
$$ 342427 -18476 -349816 63603 -203828 -40519 -181800 -8276 79130 -66642 140053 205592
8916B05592J65314e2748B86178M08804B51283K36681K23236M20024N57382J750169
$$ 205592 370906 -52748 286178 694982 251283 487964 711200 1131224 1688606 3438775
8906C438775K804509N441467E032420k445170j042017m76543E09986l2235j87482
$$ 3438775 6243284 11684751 5032420 2587250 1545233 1068690 509986 477751 290269
8897B90269D7674K98957A56325a3593D23152n6870H9599m1583K52337c270A98560
$$ 290269 47674 346631 156325 -13593 423152 366282 89599 48016 300353 -3270 198560
8885c0996k05157A17248a3286p473B9279f4614B2329e5550A22237l943b51960
$$ -30996 -236153 117248 -13286 -20759 29279 -64614 22329 -55550 122237 118294 -251960
8873c9663D2866b50404a06216B31659a3254H6051f0329q0349C27937A33210C3749
$$ -39663 42866 -250404 -106216 231659 -13254 86051 -60329 -140678 327937 133210 33749
8861a51874D0304J93693C5139E101a10398N1784k10476i7704B73593C0373J2877
$$ -151874 40304 233997 35139 5101 -110398 -58614 -269090 -97704 273593 30373 43250
8850D3250a96363e7963j75512I5997Q3899h3981D90541A9847L7094k2964I495
$$ 43250 -196363 -57963 -233475 95997 179896 -83981 490541 19847 56941 33977 9495
8838B08761c0084F3345d1073k3822C1699b5045A75190A0633c59216a23687D0594
$$ 208761 -30084 63345 -41073 -64895 31699 -25045 175190 10633 -359216 -123687 40594
8826B12208F4469Q0919d52214A29007a67397k05467A91054e7179j37278f8304
$$ 212208 64469 145388 -452214 129007 -167397 -372864 191054 -57179 -194457 -68304
$$ [...]
##END NTUPLES=NMR SPECTRUM
##END=
