
##TITLE=UV1009_M1-1003-1002_6268712_73uEjPg4XR
##JCAMPDX= 6.0         $$ Bruker NMR JCAMP-DX V2.0
##DATA TYPE= NMR SPECTRUM
##DATA CLASS= NTUPLES
##ORIGIN= BRUKER
##OWNER= Administrator
$$ 1.72 TOPSPIN		Version 2.1
$$ 2012-06-02 06:01:23.015 -0500  Administrator@TOPSPIN
$$ Compression mode = diff/dup
##.OBSERVE FREQUENCY= 400.13188235
##.OBSERVE NUCLEUS= ^1H
##.ACQUISITION MODE= SIMULTANEOUS (DQD)
##.ACQUISITION SCHEME= undefined
##.AVERAGES= 64
##.DIGITISER RES= 22
##SPECTROMETER/DATA SYSTEM= spect
##.PULSE SEQUENCE= noesygpps1d.comp
##.SOLVENT NAME= COFFEE_calctemp
##.SHIFT REFERENCE= INTERNAL, COFFEE_calctemp, 1, 14.967
##AUDIT TRAIL= $$ (NUMBER, WHEN, WHO, WHERE, PROCESS, VERSION, WHAT)
$$ ##TITLE= Audit trail, TOPSPIN		Version 2.1
$$ ##JCAMPDX= 5.01
$$ ##ORIGIN= Bruker BioSpin GmbH
$$ ##OWNER= Administrator
$$ $$ C:\Bruker\TOPSPIN/data/COFFEE/nmr/UV1009_M1-1003-1002_6268712_73uEjPg4XR/22/pdata/1/auditp.txt
$$ ##AUDIT TRAIL=  $$ (NUMBER, WHEN, WHO, WHERE, PROCESS, VERSION, WHAT)
(   1,<2012-06-02 06:01:17.953 -0500>,<Administrator>,<TOPSPIN>,<go>,<TOPSPIN 2.1>,
      <created by zg
	started at 2012-06-02 05:49:47.656 -0500,
	POWCHK enabled, PULCHK disabled,
       configuration hash MD5:
       D5 CA 7A 23 FE 6B EE E2 50 67 74 61 24 F7 5E 3B
       data hash MD5: 64K
       70 B3 3C 3D 69 EB 95 B1 70 83 A6 7A CA 18 60 C0>)
(   2,<2012-06-02 06:01:20.734 -0500>,<Administrator>,<TOPSPIN>,<proc1d>,<TOPSPIN 2.1>,
      <Start of raw data processing
       efp LB = 0.3 FT_mod = 6 PKNL = 1 PHC0 = 0 PHC1 = 0 SI = 128K 
       data hash MD5: 128K
       CB 4C 3B 5D 1F 69 C6 FE 15 38 8F CB BD 5C 6B 0E>)
(   3,<2012-06-02 06:01:21.968 -0500>,<Administrator>,<TOPSPIN>,<proc1d>,<TOPSPIN 2.1>,
      <pk PHC0 = 28.3667 PHC1 = 0 
       data hash MD5: 128K
       F8 14 67 E0 42 EF 45 6E DF 3C FF 1E 01 1D 1A 2F>)
(   4,<2012-06-02 06:01:22.656 -0500>,<Administrator>,<TOPSPIN>,<proc1d>,<TOPSPIN 2.1>,
      <abs ABSG = 1 
       data hash MD5: 128K
       E0 8A 31 21 41 11 98 79 02 61 80 F9 9D 41 14 86>)
(   5,<2012-06-02 06:01:22.734 -0500>,<Administrator>,<TOPSPIN>,<proc1d>,<TOPSPIN 2.1>,
      <abs ABSG = 2 
       data hash MD5: 128K
       35 26 1F 2E F5 5D 2C 0F E7 0B 4A 2D F4 26 9E 9E>)
(   6,<2012-06-02 06:01:22.796 -0500>,<Administrator>,<TOPSPIN>,<proc1d>,<TOPSPIN 2.1>,
      <abs ABSG = 3 
       data hash MD5: 128K
       2B C6 2D 04 A3 C8 1C F5 08 FF F7 AF 28 3D BA 0D>)
(   7,<2012-06-02 06:01:22.859 -0500>,<Administrator>,<TOPSPIN>,<proc1d>,<TOPSPIN 2.1>,
      <abs ABSG = 4 
       data hash MD5: 128K
       18 37 90 A6 52 1D AF FE 78 42 13 E8 D9 88 C6 50>)
(   8,<2012-06-02 06:01:22.921 -0500>,<Administrator>,<TOPSPIN>,<proc1d>,<TOPSPIN 2.1>,
      <abs ABSG = 5 
       data hash MD5: 128K
       6F E0 4D A8 EC D4 1F 9E 01 8B F9 CC F0 37 E6 7A>)
$$ ##END=
$$ 
$$ $$ hash MD5
$$ $$ F4 19 CF 34 E1 1D 8E E3 C8 E4 48 BF 16 7B 27 8F
##$RELAX= 
##$RELAX= 
##$RELAX= 
##$RELAX= 
##$RELAX= 
##$RELAX= 
##$RELAX= 
##$RELAX= 
$$ Bruker specific parameters
$$ [...]
##$TP07= 0
##$TPNAME0= <>
##$TPNAME1= <>
##$TPNAME2= <>
##$TPNAME3= <>
##$TPNAME4= <>
##$TPNAME5= <>
##$TPNAME6= <>
##$TPNAME7= <>
##$TPOAL= (0..7)
0.5 0.5 0.5 0.5 0.5 0.5 0.5 0.5
##$TPOFFS= (0..7)
0 0 0 0 0 0 0 0
##$TUNHIN= 0
##$TUNHOUT= 0
##$TUNXOUT= 0
##$USERA1= <user>
##$USERA2= <user>
##$USERA3= <user>
##$USERA4= <user>
##$USERA5= <user>
##$V9= 5
##$VALIST= <valist>
##$VCLIST= <CCCCCCCCCCCCCCC>
##$VD= 0
##$VDLIST= <DDDDDDDDDDDDDDD>
##$VPLIST= <PPPPPPPPPPPPPPP>
##$VTLIST= <TTTTTTTTTTTTTTT>
##$WBST= 2048
##$WBSW= 25
##$XGAIN= (0..3)
0 0 0 0
##$XL= 0
##$YL= 0
##$YMAX_a= 12204392
##$YMIN_a= -6805496
##$ZGOPTNS= <>
##$ZL1= 120
##$ZL2= 120
##$ZL3= 120
##$ZL4= 120
##$ABSF1= 14.967
##$ABSF2= -5.58553
##$ABSG= 5
##$ABSL= 3
##$ALPHA= 0
##$AQORDER= 0
##$ASSFAC= 0
##$ASSFACI= 0
##$ASSFACX= 0
##$ASSWID= 0
##$AUNMP= <proc_prof1d_extract.lims>
##$AXLEFT= 0
##$AXNAME= <>
##$AXNUC= <1H>
##$AXRIGHT= 0
##$AXTYPE= 0
##$AXUNIT= <>
##$AZFE= 0.1
##$AZFW= 0.1
##$BCFW= 0
##$BC_mod= 0
##$BYTORDP= 0
##$COROFFS= 0
##$CY= 15
##$DATMOD= 1
##$DC= 0
##$DFILT= <>
##$DTYPP= 0
##$F1P= 0
##$F2P= 0
##$FCOR= 0.5
##$FTSIZE= 131072
##$FT_mod= 6
##$GAMMA= 0
##$GB= 0
##$INTBC= 1
##$INTSCL= 1
##$ISEN= 128
##$LB= 0.3
##$LEV0= 0
##$LPBIN= 0
##$MAXI= 10000
##$MC2= 0
##$MEAN= 0
##$ME_mod= 0
##$MI= 0
##$NCOEF= 0
##$NC_proc= -3
##$NLEV= 6
##$NOISF1= 0
##$NOISF2= 0
##$NSP= 0
##$NTH_PI= 0
##$NZP= 0
##$OFFSET= 14.967
##$PC= 1
##$PHC0= 28.3667
##$PHC1= 0
##$PH_mod= 1
##$PKNL= yes
##$PPARMOD= 0
##$PPDIAG= 0
##$PPIPTYP= 0
##$PPMPNUM= 2147483647
##$PPRESOL= 1
##$PSCAL= 4
##$PSIGN= 0
##$PYNMP= <proc.py>
##$REVERSE= no
##$SF= 400.130005448358
##$SI= 131072
##$SIGF1= 0
##$SIGF2= 0
##$SINO= 400
##$SIOLD= 131072
##$SPECTYP= <>
##$SREGLST= <1H.CDCl3>
##$SSB= 0
##$STSI= 131072
##$STSR= 0
##$SW_p= 8223.68421052632
##$SYMM= 0
##$S_DEV= 0
##$TDeff= 65536
##$TDoff= 0
##$TI= <>
##$TILT= no
##$TM1= 0
##$TM2= 0
##$TOPLEV= 0
##$USERP1= <user>
##$USERP2= <user>
##$USERP3= <user>
##$USERP4= <user>
##$USERP5= <user>
##$WDW= 1
##$XDIM= 131072
##$YMAX_p= 499724210
##$YMIN_p= -108995182
##$CURPLOT= <Network HP LaserJet P1505>
##$CURPRIN= <$Network HP LaserJet P1505>
##$DFORMAT= <normdp>
##$LAYOUT= <+/1D_H.xwp>
##$LFORMAT= <normlp>
##$PFORMAT= <normpl>
##$SURQMSG= 1
$$ End of Bruker specific parameters
$$ ---------------------------------
##NTUPLES= NMR SPECTRUM
##VAR_NAME=  FREQUENCY,     SPECTRUM/REAL,   SPECTRUM/IMAG
##SYMBOL=    X,             R,               I
##VAR_TYPE=  INDEPENDENT,   DEPENDENT,       DEPENDENT
##VAR_FORM=  AFFN,          ASDF,            ASDF
##VAR_DIM=   131072,        131072,          131072
##UNITS=     HZ,            ARBITRARY UNITS, ARBITRARY UNITS
##FACTOR=    0.0627417313425165, 1,          1
##FIRST=     8223.62146879498, 2017,         -119021
##LAST=      0,             5095,            -120631
##MIN=       0,             -108995182,      0
##MAX=       8223.62146879498, 499724210,    0
$$ Real data points
##PAGE= N=1
##DATA TABLE= (X++(R..R)), XYDATA
$$ [...]
61172A286230N986O941P868R062R769R281Q489Q939J0693J2291J2667J1985J0716
$$ 1286230 1292216 1299157 1307025 1316087 1325856 1335137 1343626 1352565 1363258 1375549 1388216 1400201 1410917
61159A410917R052P332O187O025O780Q095R389R804Q687O186L293J393J519L437
$$ 1410917 1419969 1427301 1433488 1439513 1446293 1454388 1463777 1473581 1482268 1488454 1491747 1493140 1494659 1498096
61145A498096N593O652P140Q584J1073J2964J3351J3437J4645J6568J7721J7393
$$ 1498096 1503689 1510341 1517481 1526065 1537138 1550102 1563453 1576890 1591535 1608103 1625824 1643217
61133A643217J5787J3135R718O218L213P63j030j854k179l374n929q494r737j0313
$$ 1643217 1659004 1672139 1681857 1688075 1691288 1692051 1691021 1689167 1686988 1683614 1677685 1669191 1659454 1649141
61119A649141j1751j3981j5341j4842j3334j2347j2527j3280j3544j2980j2467
$$ 1649141 1637390 1623409 1608068 1593226 1579892 1567545 1555018 1541738 1528194 1515214 1502747
61108A502747j3016j4133j4158j2401r996q263p206o263n451m935m327l140j284
$$ 1502747 1489731 1475598 1461440 1449039 1439043 1430780 1423574 1417311 1411860 1406925 1402598 1399458 1398174
61095A398174J340M835Q431J0728J1505J2016J2876J3048J1770J0031Q967Q289
$$ 1398174 1399514 1404349 1412780 1423508 1435013 1447029 1459905 1472953 1484723 1494754 1503721 1512010
61083A512010P573P720R453J1696J3159J4460J6842J9755K1780K3213K5547K8805
$$ 1512010 1519583 1527303 1536756 1548452 1561611 1576071 1592913 1612668 1634448 1657661 1683208 1712013
61071A712013L1469L2970L4372L6531L9257M2360M5902M9207N1201N1978N2750
$$ 1712013 1743482 1776452 1810824 1847355 1886612 1928972 1974874 2024081 2075282 2127260 2180010
61060B180010N4140N5671N6917N7787N7737N6128N3524N1155M8873M5127L9390
$$ 2180010 2234150 2289821 2346738 2404525 2462262 2518390 2571914 2623069 2671942 2717069 2756459
61049B756459L3132K7632K2121J5159P134J06m739q799j4757k3617l3383m1013
$$ 2756459 2789591 2817223 2839344 2854503 2861637 2861743 2857004 2848205 2833448 2809831 2776448 2735435
61037B735435m5553m8532n1256n3028n2777n1263n0289n0369n0497m9831m8347
$$ 2735435 2689882 2641350 2590094 2537066 2484289 2433026 2382737 2332368 2281871 2232040 2183693
61026B183693m6106m3180m0209l7941l6232l4355l2248l0405k8719k6378k3087
$$ 2183693 2137587 2094407 2054198 2016257 1980025 1945670 1913422 1883017 1854298 1827920 1804833
61015A804833j9587j6874j5343j4598j3729j2035r878q347p799p368o215m236
$$ 1804833 1785246 1768372 1753029 1738431 1724702 1712667 1702789 1694442 1686643 1679275 1673060 1668824
61003A668824j330K691O728Q711Q574R224J2922J8127K1892K3963K6206K9156
$$ 1668824 1667494 1670185 1676913 1685624 1694198 1703422 1716344 1734471 1756363 1780326 1806532 1835688
60991A835688L1941L4887L9140M3844M6639M7424M8851N2343N6202N8789O1244
$$ 1835688 1867629 1902516 1941656 1985500 2032139 2079563 2128414 2180757 2236959 2295748 2356992
60980B356992O5429P0883P5664P9201Q2710Q7074R1711R5591R8882J03094J09473
$$ 2356992 2422421 2493304 2568968 2648169 2730879 2817953 2909664 3005255 3104137 3207231 3316704
60969C316704J17326J24574J30204J35261J40995J47336J54233J63003J74728
$$ 3316704 3434030 3558604 3688808 3824069 3965064 4112400 4266633 4429636 4604364
60960D604364J88561K03406K20164K40248K63193K88274L17440L53755L97802
$$ 4604364 4792925 4996331 5216495 5456743 5719936 6008210 6325650 6679405 7077207
60951G077207M48692N07741N77405O57229P45111Q42333R52833J078013J218538
$$ 7077207 7525899 8033640 8611045 9268274 10013385 10855718 11808551 12886564 14105102
60942A4105102J381746J579289J815007K083465K380592K692791K951947L014654
$$ 14105102 15486848 17066137 18881144 20964609 23345201 26037992 28989939 32004593
60934C2004593K735342K099855J284002N53335R0705q1418l5422J51251L92752
$$ 32004593 34739935 36839790 38123792 38677127 38767832 38686414 38650992 38802243 39194995
60925C9194995N40269M08199r5429q69013j671101k281716k616572k714143k655062
$$ 39194995 39735264 40143463 40048034 39179021 37507920 35226204 32609632 29895489 27240427
60916B7240427k507084k316923k115437j917859j728055j548490j383882j236183
$$ 27240427 24733343 22416420 20300983 18383124 16655069 15106579 13722697 12486514
60908A2486514j102325r78862q65502p63325o72921n95147n30694m77622m31464
$$ 12486514 11384189 10405327 9539825 8776500 8103579 7508432 6977738 6500116 6068652
60899F068652l88810l49324l13944k82890k55778k31830k09475j87344j66303
$$ 6068652 5679842 5330518 5016574 4733684 4477906 4246076 4036601 3849257 3682954
60890C682954j49181j37833j31345j27248j23402j18611j12594j05893r9188r2608
$$ 3682954 3533773 3395940 3264595 3137347 3013945 2895334 2782740 2676847 2577659 2485051
60880B485051q6146q0282p5430p1178o7065o3491o0800n8059n4194m9781m6191
$$ 2485051 2398905 2318623 2243193 2172015 2104950 2041459 1980659 1922600 1868406 1818625 1772434
60869A772434m3370m0211l6937l4995l4399l3180l0213k6870k4918k4230k3671
$$ 1772434 1729064 1688853 1651916 1616921 1582522 1549342 1519129 1492259 1467341 1443111 1419440
60858A419440k2963k2350k1320j9142j6343j4342j3600j3229j2577j2139j2407
$$ 1419440 1396477 1374127 1352807 1333665 1317322 1302980 1289380 1276151 1263574 1251435 1239028
60847A239028j2627j1649r786q704r180r975r688q820q801r489r352q142p511
$$ 1239028 1226401 1214752 1204966 1196262 1187082 1177107 1167419 1158599 1149798 1140309 1130957 1122815 1115304
60834A115304q256q760p390n057l807l959m301m486n188o193o279n231m347m370
$$ 1115304 1107048 1098288 1090898 1085841 1082034 1078075 1073774 1069288 1064100 1057907 1051628 1046397 1042050 1037680
60820A037680m383l388j946j336j769k176j618l91K06p08k209k091N72L822M777
$$ 1037680 1033297 1029909 1027963 1026627 1024858 1022682 1021064 1020673 1020879 1020171 1017962 1015871 1016443 1020265 1025042
60805A025042L114J311J345K431K686J749P25K86K5n00j147j638j892j726r74
$$ 1025042 1028156 1029467 1030812 1033243 1035929 1037678 1038403 1038689 1038714 1038214 1037067 1035429 1033537 1031811 1030837
60790A030837j99o12k730n397o864o798o566p344q666r374r410r803j1014j2220
$$ 1030837 1030638 1030026 1027296 1021899 1015035 1008237 1001671 994327 985661 976287 966877 957074 946060 933840
60776I33840j2427j1604j0444r504q923q562q215p832p538p158o114m384l141
$$ 933840 921413 909809 899365 889861 880938 872376 864161 856329 848791 841633 835519 831135 827994
60763H27994l447m479m323k631j126j088j702j632r59o00q41j417k212k910k741
$$ 827994 824547 820068 815745 813114 811988 810900 809198 807566 806607 806007 805166 803749 801537 798627 795886
60748G95886j495n4R22J905L219L907L129J710Q45J59j328k986l202j898o00j08
$$ 795886 794391 794337 795259 797164 800383 804290 807419 809129 809974 810133 808805 805819 802617 800719 800119 800011
60732H00011J61N00L71k37o20q90k080m164n509n067l723k622j575k04N18o65
$$ 800011 800172 800672 801043 800806 800186 799296 797216 793052 787543 782476 778753 776131 774556 774352 774870 774205
60716G74205l296n579o490o434n915m745k833r41o6k85n77M2J371K226J799N69
$$ 774205 770909 765330 758840 752406 746491 741746 738913 737972 737906 737621 737044 737086 738457 740683 742482 743051
60700G43051l53m66r3L10N26L91j30o26m19P64K554M273N267N121M023K722J780
$$ 743051 742698 742232 742139 742449 742975 743366 743236 742610 742191 742955 745509 749782 755049 760170 764193 766915 768695
60683G68695J062L34q2J12L89K1p29r26k79P16J754K800L298K577J186O26J304
$$ 768695 769757 770091 770009 770121 770510 770531 769802 768876 768597 769313 771067 773867 777165 779742 780928 781554 782858
60666G82858J963J690J258J569J853O84j705l465l440k392j700j754k046k252
$$ 782858 784821 786511 787769 789338 791191 791875 790170 786705 783265 780873 779173 777419 775373 773121
60652G73121k510k803k751k313k238l209m624n010l911k580k263k552k267j451
$$ 773121 770611 767808 765057 762744 760506 757297 752673 747663 743752 741172 738909 736357 734090 732639
60638G32639j236j998k901l388l813m253l935k519r27k2O33J836L232L814L429
$$ 732639 731403 729405 726504 723116 719303 715050 711115 708596 707669 707647 708280 710116 713348 717162 720591
60623G20591K757K107J390J088K028L924N302N425N418O638Q500Q871O506K398
$$ 720591 723348 725455 726845 727933 729961 733885 739187 744612 750030 756668 765168 774039 780545 782943
60609G82943j407l660m449m499m435m491m554m400l968l149j430J607N011O539
$$ 782943 781536 777876 773427 768928 764493 760002 755448 751048 747080 743931 742501 744108 749119 755658
60595G55658M950J905L80J206K450K528K370L517N210N125K561o36k437k659k242
$$ 755658 760608 762513 762893 764099 766549 769077 771447 774964 780174 785299 787860 787224 784787 782128 779886
60580G79886j768j409j565k495l636l971l236k163j425q55l5P12N74m32j091n30
$$ 779886 778118 776709 775144 772649 769013 765042 761806 759643 758218 757363 757328 758040 758614 758182 757091 756561
60564G56561M15K38j021j715r28L46R05J128J986L110L223K138J105J042J501
$$ 756561 756976 757214 756193 754478 753550 753896 754801 755929 757915 761025 764248 766386 767491 768533 770034
60549G70034J559R92K74L3O58J910K847K635J584R07J426K858M274M787M104K940
$$ 770034 771593 772585 772859 772892 773550 775460 778307 780942 782526 783433 784859 787717 791991 796778 800882 803822
60533H03822K686L927N421N356L577J729J251K099L462M707N399N323M860M655
$$ 803822 806508 810435 815856 821212 824789 826518 827769 829868 833330 838037 843436 848759 853619 858274
60519H58274M579L910K743K250L075M417N386O348Q061J0153J1519J1915J2178
$$ 858274 862853 866763 869506 871756 874831 879248 884634 890982 899043 909196 920715 932630 944808
60506I44808J3038J4454J5937J6762J6015J3360R827P035N354L549O01k683m407
$$ 944808 957846 972300 988237 1004999 1021014 1034374 1044201 1051236 1056590 1060139 1060740 1058057 1053650
60493A053650l616j070J710L731M900N735O763P977Q858R366J0635J3929J8701
$$ 1053650 1050034 1048964 1050674 1054405 1059305 1065040 1071803 1079780 1088638 1098004 1108639 1122568 1141269
60480A141269K2569K3941K3961K5018K7793L0958L3343L5053L6220L6105L3964
$$ 1141269 1163838 1187779 1211740 1236758 1264551 1295509 1328852 1363905 1400125 1436230 1470194
60469A470194K9827K3947J6599Q881K398k658p802j3608j8078j9194j7944j6931
$$ 1470194 1500021 1523968 1540567 1549448 1551846 1549188 1541386 1527778 1509700 1490506 1472562 1455631
60457A455631j6719j5645j3030j0247q301o402l747r95J183L660P632J2648J7112
$$ 1455631 1438912 1423267 1410237 1399990 1391689 1385287 1381540 1380545 1381728 1385388 1393020 1405668 1422780
60444A422780K0430K3653K8017L3582L9404M4664M9374N3971N8250O1095O1610
$$ 1422780 1443210 1466863 1494880 1528462 1567866 1612530 1661904 1715875 1774125 1835220 1896830
60433A896830O0159N7653N4109M8841M2040L5231K9932K6508K4509K3212K1506
$$ 1896830 1956989 2014642 2068751 2117592 2159632 2194863 2224795 2251303 2275812 2299024 2320530
60422B320530J7970J1668K623q647k1696l5993n0499o3515p3039p7883p8876p8392
$$ 2320530 2338500 2350168 2352791 2344144 2322448 2286455 2235956 2172441 2099402 2021519 1942643 1864251
60410A864251p7957p6726p3164o7530o1575n6258n1284m6647m2927l9927l6633
$$ 1864251 1786294 1709568 1636404 1568874 1507299 1451041 1399757 1353110 1310183 1270256 1233623
60399A233623l2883k9649k7265k4860k2000j9447j7671j6048j4244j2935j2398
$$ 1233623 1200740 1171091 1143826 1118966 1096966 1077519 1059848 1043800 1029556 1016621 1004223
60388A004223j1691j0204q699p829o928n322l684k845k434j912j915l129m733
$$ 1004223 992532 982328 973629 965800 958872 953550 949866 947021 944587 942675 940760 937631 932898
60375I32898n372n013m475l836k734j574j104j142j076j091j623k069j432K0J055
$$ 932898 927526 922513 918038 914202 911468 909894 908790 907648 906572 905481 903858 901789 900357 900377 901432
60360I01432J163Q17M14J11L83J408K365K518K548L368M204L596K011J496K768
$$ 901432 902595 903412 903826 903937 904320 905728 908093 910611 913159 916527 920731 924327 926338 927834 930602
60345I30602M419N146N092M752M320M397N472O382N293K803J906L845O185O405
$$ 930602 935021 940167 945259 950011 954331 958728 964200 970582 975875 978678 980584 984429 990614 997019
60331I97019N408N521O656O875N753M718M410M034L476L902N636P132O964N633
$$ 997019 1002427 1007948 1014604 1021479 1027232 1031950 1036360 1040394 1043870 1047772 1053408 1060540 1067504 1073137
60317A073137M555M261M442M979N935O810O780N717M419L780L967M457M683M520
$$ 1073137 1077692 1081953 1086395 1091374 1097309 1104119 1110899 1116616 1121035 1124815 1128782 1133239 1137922 1142442
60303A142442M289M291M518M873N533O788Q520J0180J1418J2431J3503J4340J4202
$$ 1142442 1146731 1151022 1155540 1160413 1165946 1172734 1181254 1191434 1202852 1215283 1228786 1243126 1257328
60290A257328J2680J0177P555N317L151L19l500p530j0229j0527q910p098o436
$$ 1257328 1270008 1280185 1287740 1293057 1296208 1296527 1293027 1285497 1275268 1264741 1255831 1248733 1242297
60277A242297o759p099p146p335p567o926n282m243n324p582q470p069n118m333
$$ 1242297 1235538 1228439 1221293 1213958 1206391 1199465 1194183 1189940 1184616 1177034 1168564 1161495 1156377 1152044
60263A152044m070k719l17J642K530L229M497O041P465Q950J0495J1529J1867
$$ 1152044 1147974 1145255 1144938 1146580 1149110 1152339 1156836 1162877 1170342 1179292 1189787 1201316 1213183
60250A213183J2182J2753J2569J0654P850O219O767Q625J0326J1024J0314P865
$$ 1213183 1225365 1238118 1250687 1261341 1269191 1275410 1282177 1290802 1301128 1312152 1322466 1330331
60238A330331L690j687p662j3697j8800k1561k1380j9403j7566j6718j6105j4782
$$ 1330331 1334021 1332334 1324672 1310975 1292175 1270614 1249234 1229831 1212265 1195547 1179442 1164660
60226A164660j2902j1325j0255r039p432o460p234r148j0203r439q125p865q261
$$ 1164660 1151758 1140433 1130178 1121139 1113707 1107247 1100013 1090865 1080662 1071223 1063098 1055233 1046972
60213A046972p572n392l347k905l580l867l235k559k891m208n294m825k846r68
$$ 1046972 1039400 1034008 1030661 1027756 1024176 1020309 1017074 1014515 1011624 1007416 1002122 997297 994451 993483
60199I93483m67n65L89K220K921J759O57J503L405M067L026J943K127L191M024
$$ 993483 993016 992451 992840 995060 997981 999740 1000397 1001900 1005305 1009372 1012398 1014341 1016468 1019659 1023683
60184A023683L929K848J464R06J428J762Q39l58l6J644K773K698K948M555O256
$$ 1023683 1027612 1030460 1031924 1032830 1034258 1036020 1036859 1036501 1036465 1038109 1040882 1043580 1046528 1051083 1057339
60169A057339O401N379M801N144N601N849O630Q529J1017J2963J3691J3372J2710
$$ 1057339 1063740 1069119 1073920 1079064 1084665 1090514 1097144 1105673 1116690 1129653 1143344 1156716 1169426
60156A169426J2228J1890J1471J1226J1648J2534J2848J1881J0203R052R065R858
$$ 1169426 1181654 1193544 1205015 1216241 1227889 1240423 1253271 1265152 1275355 1284407 1293472 1303330
60144A303330J0668J1018J0873J0339R440Q194O855N770M826L541J885M88m35
$$ 1303330 1313998 1325016 1335889 1346228 1355668 1363862 1370717 1376487 1381313 1384854 1386739 1387227 1386792
60131A386792j693l831n875o432n725n251n569n748n198m669m919n575n916n855
$$ 1386792 1385099 1381268 1375393 1368961 1363236 1357985 1352416 1346668 1341470 1336801 1331882 1326307 1320391 1314536
60117A314536n530m805l825l269l410l554l087k431k359k928l674m263m454l971
$$ 1314536 1309006 1304201 1300376 1297107 1293697 1290143 1287056 1284625 1282266 1279338 1275664 1271401 1266947 1262976
60103A262976l070k634l082l645l391k519j878j542o95J048K852L418K380Q41
$$ 1262976 1259906 1257272 1254190 1250545 1247154 1244635 1242757 1241215 1240520 1241568 1244420 1247838 1250218 1251059
60089A251059L80J350K330J733k19j688j218J087M164O733P603O490M801M461
$$ 1251059 1251439 1252789 1255119 1256852 1256633 1254945 1253727 1254814 1258978 1265711 1273314 1279804 1284605 1289066
60075A289066N629O649O554O160O147N633L825J866J574L031M691N432N491N654
$$ 1289066 1294695 1301344 1307898 1314058 1320205 1325838 1329663 1331529 1333103 1336134 1340825 1346257 1351748 1357402
60061A357402O376P444P907O964N355N043O787Q906R319Q008O393N239M407L957
$$ 1357402 1363778 1371222 1379129 1386093 1391448 1396491 1403278 1412184 1421503 1429511 1435904 1441143 1445550 1449507
60047A449507M054M153L611K795K475K433K011J599K207L606M330L697K644K205
$$ 1449507 1453561 1457714 1461325 1464120 1466595 1469028 1471039 1472638 1474845 1478451 1482781 1486478 1489122 1491327
60033A491327K096J227r75l980o558p924q758j0560j3472j5685j5848j5058j5016
$$ 1491327 1493423 1494650 1493675 1489695 1483137 1475213 1466455 1455895 1442423 1426738 1410890 1395832 1380816
60020A380816j5152j3596j0662q980r813j1359j1607j1054j1299j2333j2770j1977
$$ 1380816 1365664 1352068 1341406 1332426 1322613 1311254 1299647 1288593 1277294 1264961 1252191 1240214
60008A240214j0512q914p330o240o376p699r191r880r598q657p315n821m573l875
$$ 1240214 1229702 1220788 1213458 1207218 1200842 1193143 1183952 1174072 1164474 1155817 1148502 1142681 1138108 1134233
59994A134233l562l122k141n58J337K891L223J946P0m34J442M512O705P240O740
$$ 1134233 1130671 1127549 1125408 1124850 1126187 1129078 1132301 1134247 1134317 1133883 1135325 1139837 1146542 1153782 1160522
59979A160522N586L508R31p20p53j64q6k37J72Q36O79p57l168o228r482j1934
$$ 1160522 1166108 1169616 1170547 1169827 1169074 1168910 1168824 1168587 1168759 1169595 1170274 1169517 1166349 1160121 1150639 1138705
59963A138705j2688j1910j0607r684r543r932r760p958n188l736m685o196n807
$$ 1138705 1126017 1114107 1103500 1093816 1084273 1074341 1064581 1056623 1051435 1047699 1043014 1036818 1031011
59950A031011l591j677j356k194l416m593n155m745l935l372k603j040N07Q84
$$ 1031011 1027420 1025743 1024387 1022193 1018777 1014184 1009029 1004284 1000349 996977 994374 993334 993841 994725
59936I94725P33J654L466M391M038L971M846N184L959K472K372L381M334N181
$$ 994725 995458 997112 1000578 1004969 1009007 1012978 1017824 1023008 1026967 1029439 1031811 1035192 1039526 1044707
59922A044707O376P135N950K671r72l030k944j839j530k895m896n707m882l727
$$ 1044707 1051083 1058218 1064168 1066839 1065867 1062837 1059893 1058054 1056524 1053629 1048733 1043026 1038144 1034417
59908A034417l395l501l041j628N98L238N127M784K394L76P06K326K629J031n06
$$ 1034417 1031022 1027521 1024480 1022852 1023450 1026688 1031815 1036599 1038993 1039369 1040075 1042401 1045030 1046061 1045555
59893A045555n41M9p2n05kJ242J761J125O69J450K706L163K918K846K883K456
$$ 1045555 1045014 1045063 1044991 1044486 1044484 1045726 1047487 1048612 1049281 1050731 1053437 1056600 1059518 1062364 1065247 1067703
59877A067703K228L482N589O235M964M403O598R884J1312J0657R644Q306N066
$$ 1067703 1069931 1073413 1079002 1085237 1090201 1094604 1101202 1111086 1122398 1133055 1142699 1151005 1156071
59864A156071K94l089l193j245O74K003K960L297L098L467N016O616O848N980
$$ 1156071 1156365 1153276 1150083 1148838 1149512 1151515 1154475 1157772 1160870 1164337 1169353 1175969 1182817 1188797
59850A188797N461N880O403N990M501K692J417O57n83k982n609o705n791m108
$$ 1188797 1194258 1200138 1206541 1212531 1217032 1219724 1221141 1221798 1221215 1218233 1212624 1205919 1200128 1196020
59836A196020k908k222j548p28K43J490K923M289N692P389Q912R289Q285O761
$$ 1196020 1193112 1190890 1189342 1188614 1188857 1190347 1193270 1197559 1203251 1210640 1219552 1228841 1237126 1243887
59822A243887N648N321N865O989P808P728P430P748P915O498M025K734L234L440
$$ 1243887 1249535 1254856 1260721 1267710 1275518 1283246 1290676 1298424 1306339 1312837 1316862 1319596 1322830 1326270
59808A326270J601j312l203l384k502j273l37k00m24J01J400K211K148K385L348
$$ 1326270 1327871 1326559 1323356 1319972 1317470 1316197 1315860 1315660 1315236 1315337 1316737 1318948 1321096 1323481 1326829
59793A326829L673K774K562M840Q533J1458J3440J5445J6770J5675J2336Q820
$$ 1326829 1330502 1333276 1335838 1340678 1349211 1360669 1374109 1389554 1406324 1421999 1434335 1443155
59781A443155O297M398L260L921O213Q144Q045O087L294M10j886l020l368m082
$$ 1443155 1449452 1453850 1457110 1461031 1467244 1475388 1483433 1489520 1492814 1493224 1491338 1488318 1484950 1480868
59767A480868n622p291q588r972j1837j3562j4022j2529r220n191k310j852l038
$$ 1480868 1475246 1467955 1459367 1449395 1437558 1423996 1409974 1397445 1388225 1383034 1380724 1378872 1375834
59754A375834l752l099k337k885m433n683o206o579p005o844n618l881k570j842
$$ 1375834 1372082 1368983 1366646 1363761 1359328 1353645 1347439 1340860 1333855 1327011 1321393 1317512 1314942 1313100
59740A313100j025J26O65m01k337l068j727M7K44q00j072L7Q53Jj513j744n40
$$ 1313100 1312075 1312201 1312866 1312465 1310128 1307060 1305333 1305380 1305624 1304824 1303752 1303789 1304642 1304643 1303130 1301386 1300846
59723A300846L00o29k843m905n950n870m651k365K53J920J911P71k86n24L9J126
$$ 1300846 1301146 1300517 1297674 1292769 1286819 1280949 1276298 1273933 1274186 1276106 1278017 1278788 1278502 1277978 1278017 1279143
59707A279143K465L679M471N126O353Q393J0437J1360J0895R921R500R886J0632
$$ 1279143 1281608 1285287 1289758 1294884 1301237 1309630 1320067 1331427 1342322 1352243 1361743 1371629 1382261
59694A382261J1555J3076J5233J6804J6249J3567J0440Q304P057N983N008M474
$$ 1382261 1393816 1406892 1422125 1438929 1455178 1468745 1479185 1487489 1494546 1500529 1505537 1510011
59682A510011M485N120O504P938Q033O588N273N322N634M711L274K953L345K725
$$ 1510011 1514496 1519616 1526120 1534058 1542091 1548679 1553952 1559274 1564908 1569619 1572893 1575846 1579191 1581916
59668A581916J210M99O09k54k166k780j152M65R8j098j263q52j095j190L75K827
$$ 1581916 1583126 1583625 1584234 1583980 1581814 1579034 1577882 1578347 1578445 1577347 1576084 1575232 1574137 1572947 1573322 1576149
59652A576149L981L596L602N043O824P719Q135R327J1826J4994J7644J8935J9034
$$ 1576149 1580130 1583726 1587328 1592371 1599195 1606914 1615049 1624376 1636202 1651196 1668840 1687775 1706809
59639A706809J8759J8505J8069J7591J7588J7701J6572J3792J0885R449R221Q787
$$ 1706809 1725568 1744073 1762142 1779733 1797321 1815022 1831594 1845386 1856271 1865720 1874941 1883728
59627A883728P367N068K403L55k54m27k580p241j1470j2311j0712j0097j1812
$$ 1883728 1891095 1896163 1898566 1898921 1898667 1898240 1895660 1888419 1876949 1864638 1853926 1843829 1832017
59614A832017j4044j4786j3920j2356j0888j0055r723q703o081k940j446k048
$$ 1832017 1817973 1803187 1789267 1776911 1766023 1755968 1746245 1737542 1731461 1728521 1727075 1725027
59602A725027k753j448J942N697P922P968O941O668P529P721N486J561j681l209
$$ 1725027 1722274 1720826 1722768 1728465 1736387 1744355 1751296 1757964 1765493 1773214 1778700 1780261 1778580 1775371
59588A775371m278o520j0161j4235j7708k0239k2305k4456k6278k6632k5272k3340
$$ 1775371 1771093 1764573 1754412 1740177 1722469 1702230 1679925 1655469 1629191 1602559 1577287 1553947
59576A553947k1765k0212j8433j7278j7154j6783j5121j3462j3749j5616j7095
$$ 1553947 1532182 1511970 1493537 1476259 1459105 1442322 1427201 1413739 1399990 1384374 1367279
59565A367279j7587j8006j8327j7465j5657j4661j4967j4880j3182j1034j0045
$$ 1367279 1349692 1331686 1313359 1295894 1280237 1265576 1250609 1235729 1222547 1211513 1201468
59554A201468r914r149p448o095o136o851o321l572p4J621R66J57J051K550K417
$$ 1201468 1191554 1182405 1174957 1168862 1162726 1155875 1149554 1145982 1145908 1147529 1148495 1148652 1149703 1152253 1154670
59539A154670O72o35m79K70Q47J439J923J565M84j36K31P99Q81O95N14K22NK25
$$ 1154670 1155342 1154707 1154228 1154498 1155345 1156784 1158707 1160272 1160756 1160620 1160851 1161650 1162531 1163226 1163740 1163962 1163967 1164192
59521A164192L28p60k859m450m790m778n245n667n248m149k961j907j204j336
$$ 1164192 1164520 1163760 1160901 1156451 1151661 1146883 1141638 1135971 1130723 1126574 1123613 1121706 1120502 1119166
59507A119166k319l329l615l227k507j567n12L75J012J582K151K618K901K742
$$ 1119166 1116847 1113518 1109903 1106676 1104169 1102602 1102090 1102465 1103477 1105059 1107210 1109828 1112729 1115471
59493A115471J770M78M79K678N708P424P510P343P791Q859J0939J4348J7755J9373
$$ 1115471 1117241 1117719 1118198 1120876 1126584 1134008 1141518 1148861 1156652 1165511 1176450 1190798 1208553 1227926
59479A227926K0054K2609K7152K9294K4703J4100K472n613q843q535o825n186
$$ 1227926 1247980 1270589 1297741 1327035 1351738 1365838 1368310 1362697 1353854 1345319 1338494 1333308
59467A333308l687j813p9O0j687l477l343j512K1k28j862l240l270k778l816o945
$$ 1333308 1329621 1327808 1327729 1327789 1326102 1322625 1319282 1317770 1317791 1317563 1315701 1312461 1309191 1306413 1302597 1295652
59451A295652r935j0299q675p967r336j1055j1478j0974j0170q482n708l246k132
$$ 1295652 1285717 1275418 1266743 1258776 1249440 1238385 1226907 1215933 1205763 1197281 1191573 1188327 1186195
59438A186195j218J062M110N941N831M669L343K183J717K471L999N138N362N176
$$ 1186195 1184977 1186039 1190149 1196090 1201921 1206590 1209933 1212116 1213833 1216304 1220303 1225441 1230803 1235979
59424A235979N151N269N343N479N896O451O575N901M983N004O289P554P210N072
$$ 1235979 1241130 1246399 1251742 1257221 1263117 1269568 1276143 1282044 1287027 1292031 1298320 1305874 1313084 1318156
59410A318156K102r18l445m543l703k043j053l21J684M618O128N329M277N069
$$ 1318156 1320258 1319340 1315895 1311352 1307649 1305606 1304553 1304232 1305916 1310534 1316662 1321991 1326268 1331337
59396A331337P231R160J0509J1686J2325J1770J0347Q896P625O293M880L343J455
$$ 1331337 1338568 1347728 1358237 1369923 1382248 1394018 1404365 1413261 1420886 1427179 1432059 1435402 1436857
59383A436857n70k141l339m609n180l530k02J854J094l61O2J710K352K144L268
$$ 1436857 1436287 1434146 1430807 1426198 1421018 1417488 1417286 1419140 1420234 1419873 1419935 1421645 1423997 1426141 1429409
59368A429409O319R574J1661J2860J3784J4735J6482J9642K3139K4982K5077K5449
$$ 1429409 1435728 1445302 1456963 1469823 1483607 1498342 1514824 1534466 1557605 1582587 1607664 1633113
59356A633113K7367L0063L2884L6579M0905M2470L7158K4632R217l662j1183j3803
$$ 1633113 1660480 1690543 1723427 1760006 1800911 1843381 1880539 1905171 1914388 1910726 1899543 1885740
59344A885740j3643j2455j0242n450K626J1238J4852R520l314j7895k8812l4199
$$ 1885740 1872097 1859642 1849400 1843950 1846576 1857814 1872666 1882186 1878872 1860977 1832165 1797966
59332A797966l5144l3605l1356k9500k7813k4995k0439j5298j1211q565o775n504
$$ 1797966 1762822 1729217 1697861 1668361 1640548 1615553 1595114 1579816 1568605 1560040 1553265 1547761
59320A547761m593l445j675M0R57J697L390N732P305P551P114O479N803N816P177
$$ 1547761 1543168 1539723 1538048 1538088 1539045 1540742 1544132 1549864 1557169 1564720 1571834 1578313 1584116 1589932 1597109
59305A597109Q855R037P774O979P572Q510R129J0283J2324J3875J3919J3498J4015
$$ 1597109 1605964 1615001 1622775 1629754 1637326 1645836 1654965 1665248 1677572 1691447 1705366 1718864 1732879
59292A732879J5134J5664J5426J5065J4880J4923J5421J6180J6299J5349J4035
$$ 1732879 1748013 1763677 1779103 1794168 1809048 1823971 1839392 1855572 1871871 1887220 1901255
59281A901255J2979J1709R510O401K669j540n631q656j0685j2864j5493j7454
$$ 1901255 1914234 1925943 1935453 1941854 1944523 1942983 1937352 1928696 1918011 1905147 1889654 1872200
59269A872200j8330j9564k2282k5215k6226k5102k3586k3233k4083k4848k3895
$$ 1872200 1853870 1834306 1812024 1786809 1760583 1735481 1711895 1688662 1664579 1639731 1615836
59258A615836k0842j7537j6282j6809j6720j5191j4060j4354j4302j2479j0452
$$ 1615836 1594994 1577457 1561175 1544366 1527646 1512455 1498395 1484041 1469739 1457260 1446808
59247A446808j0028r793p206k669J264L782O076Q541J0648J3178J7324K1255K0675
$$ 1446808 1436780 1426987 1419781 1417112 1418376 1422158 1428234 1436775 1447423 1460601 1477925 1499180 1519855
59234A519855J3994M597l239q674j3125j6589j7328j4669j0347o663m240j999
$$ 1519855 1533849 1538446 1535207 1526533 1513408 1496819 1479491 1464822 1454475 1447812 1443572 1441573
59222A441573J053M584P494R311J0519J1686J2995J4630J6756J8830J9891J9912
$$ 1441573 1442626 1447210 1454704 1464015 1474534 1486220 1499215 1513845 1530601 1549431 1569322 1589234
59210A589234J9938K0337K0028J8263J6087J4927J4559J3727J2144J0548R086
$$ 1589234 1609172 1629509 1649537 1667800 1683887 1698814 1713373 1727100 1739244 1749792 1758878
59199A758878O930L609k06l357n230o150p123r005j1703j4364j6281j7073j6363
$$ 1758878 1765808 1769417 1769211 1765854 1760624 1754474 1747351 1738346 1726643 1712279 1695998 1678925 1662562
59186A662562j4335j2484j2396j3621j4137j3169j1904j1158j0235q788p783p609
$$ 1662562 1648227 1635743 1623347 1609726 1595589 1582420 1570516 1559358 1549123 1540335 1532552 1524943
59174A524943p197o195n998p119p654o308n062o500r794j1742j0870q360n785
$$ 1524943 1517746 1511551 1505553 1498434 1490780 1484472 1479410 1472910 1463116 1451374 1440504 1432144 1426359
59161A426359l967l393l722l559k468k245m256o603o295l491j103o39j020j203
$$ 1426359 1422392 1418999 1415277 1411718 1409250 1407005 1402749 1396146 1389851 1386360 1385257 1384618 1383598 1382395
59147A382395j388j391l13J567K530J667p7j466k138k072j380q37j225j996j943
$$ 1382395 1381007 1379616 1379303 1380870 1383400 1385067 1384990 1383524 1381386 1379314 1377934 1377097 1375872 1373876 1371933
59132A371933j191r79j427j115O87K777L513K530N98j348k776l817m959o096o341
$$ 1371933 1370742 1369763 1368336 1367221 1367908 1370685 1374198 1376728 1377326 1375978 1373202 1369385 1364426 1358330 1351989
59117A351989n442m598m926n830o107n759n406m782l432k246k471l576l928l249
$$ 1351989 1346547 1341949 1337023 1331193 1325086 1319327 1313921 1309139 1305707 1303461 1300990 1297414 1293486 1290237
59103A290237k752k950l052k522j753j305j673l427o149p824p017n152m783n950
$$ 1290237 1287485 1284535 1281483 1278961 1277208 1275903 1274230 1270803 1264654 1256830 1249813 1244661 1239878 1233928
59089A233928o401n264m242m693n682n734m993m735n683p455q962r149p919o267
$$ 1233928 1227527 1222263 1218021 1213328 1207646 1201912 1196919 1192184 1186501 1179046 1170084 1160935 1153016 1146749
59075A146749n017l955k756j921j778j529m59Q60J887L492O377R252J0517J0702
$$ 1146749 1141732 1137777 1135021 1133100 1131322 1129793 1129334 1130194 1132081 1135573 1141950 1151202 1161719 1172421
59061A172421J1296J2173J2433J2750J4268J5953J5913J4863J5284J7218J7916
$$ 1172421 1183717 1195890 1208323 1221073 1235341 1251294 1267207 1282070 1297354 1314572 1332488
59050A332488J6025J3236J1217R525P439N519M270L064J316o35k321l526l894
$$ 1332488 1348513 1361749 1372966 1382491 1389930 1395449 1399719 1402783 1404099 1403464 1401143 1397617 1393723
59037A393723l524l611m841n711m597k816l051n049n862m397k762k604l042l058
$$ 1393723 1390199 1386588 1381747 1376036 1371439 1368623 1365572 1360523 1354661 1350264 1347502 1344898 1341856 1338798
59023A338798l227m079n026n805o866p759p384o281o236p118o730m444k227j324
$$ 1338798 1335571 1331492 1326466 1320661 1313795 1306036 1298652 1292371 1286135 1279017 1272287 1267843 1265616 1264292
59009A264292q48n97k087n339p635p314o142o042o039m654l001l027m363n205
$$ 1264292 1263444 1262847 1260760 1255421 1247786 1240472 1234330 1228288 1222249 1217595 1214594 1211567 1207204 1201999
58995A201999n024m404l454k171j280j188j130o32n59j472k338k148j440j028
$$ 1201999 1196975 1192571 1189117 1186946 1185666 1184478 1183348 1182716 1182157 1180685 1178347 1176199 1174759 1173731
58981A173731o02K03Q44J152J950L241L526K275J280J966L165L351L342M784P294
$$ 1173731 1173129 1173332 1174176 1175328 1177278 1180519 1184045 1186320 1187600 1189566 1192731 1196082 1199424 1204208 1211502
58966A211502R252J0361J1412J2411J2794J2868J3250J3454J2548J0715Q867P222
$$ 1211502 1220754 1231115 1242527 1254938 1267732 1280600 1293850 1307304 1319852 1330567 1339434 1346656
58954A346656N441L578J885K23j406k535l059l472l654k665n51J156J692K279
$$ 1346656 1352097 1355675 1357560 1357783 1356377 1353842 1350783 1347311 1343657 1340992 1340441 1341597 1343289 1345568
58940A345568L914N524N774N270N254N356M564L403L240L970M190L363K279J605
$$ 1345568 1349482 1355006 1360780 1366050 1371304 1376660 1381224 1384627 1387867 1391837 1396027 1399390 1401669 1403274
58926A403274J340J643K989N347P860R625J0521J1408J3354J6177J8227J8382
$$ 1403274 1404614 1406257 1409246 1414593 1422453 1432078 1442599 1454007 1467361 1483538 1501765 1520147
58914A520147J7733J8005J8967J9277J9286K0331K1360J9381J4174R461P975Q064
$$ 1520147 1537880 1555885 1574852 1594129 1613415 1633746 1655106 1674487 1688661 1698122 1706097 1714161
58902A714161O927M610K649J033j056l278n253q157j2753j7173j9099j9213k0131
$$ 1714161 1721088 1725698 1728347 1729380 1728324 1725046 1719793 1711636 1698883 1681710 1662611 1643398 1623267
58889A623267k2596k4836k5169k3391k0118j6471j3981j3197j2760j1014q031
$$ 1623267 1600671 1575835 1550666 1527275 1507157 1490686 1476705 1463508 1450748 1439734 1431703
58878A431703n102l104k355k835l376k019J297L724K961M38p90j89L72K9k43J01
$$ 1431703 1426601 1423497 1421142 1418307 1414931 1412912 1414209 1417933 1420894 1421332 1420542 1420353 1420725 1420754 1420511 1420612
58862A420612K15n58j704k427k432j759o44N19J624L006M727O322P567Q630R316
$$ 1420612 1420827 1420269 1418565 1416138 1413706 1411947 1411303 1411822 1413446 1416452 1421179 1427501 1435068 1443698 1453014
58847A453014R371R790J2122J5901J8609J9107J9143K0212K1101K0265J8780J8670
$$ 1453014 1462385 1472175 1484297 1500198 1518807 1537914 1557057 1577269 1598370 1618635 1637415 1656085
58835A656085J9685J9964J9148J8747J9862K2117K4394K5492K4591K2189J9850
$$ 1656085 1675770 1695734 1714882 1733629 1753491 1775608 1800002 1825494 1850085 1872274 1892124
58824A892124J8283J6700J4725J3362J3060J2482J0552Q167O509N128L272J491
$$ 1892124 1910407 1927107 1941832 1955194 1968254 1980736 1991288 1999455 2005964 2011092 2014364 2015855
58812B015855L38j084l571o107p291p338p253p414q188j0317j3304j5268j5789
$$ 2015855 2016193 2015109 2011538 2005431 1998140 1990802 1983549 1976135 1967947 1957630 1944326 1929058 1913269
58799A913269j6882j9545k1791k2036k1912k3113k3952k2227j9560j9278k1422
$$ 1913269 1896387 1876842 1855051 1833015 1811103 1787990 1764038 1741811 1722251 1702973 1681551
58788A681551k3227k3553k3390k2788k0780j8188j7282j8467j9810j9875j8818
$$ 1681551 1658324 1634771 1611381 1588593 1567813 1549625 1532343 1513876 1494066 1474191 1455373
58777A455373j6945j4413j2139j0938j0036q361o595n868n284l183k22J375J248
$$ 1455373 1438428 1424015 1411876 1400938 1390902 1382541 1375946 1370078 1364794 1361611 1361389 1362764 1364012
58764A364012J181K194L660N002O080O115M394J884L42J34M92J139J839J461l69
$$ 1364012 1365193 1367387 1371047 1376049 1382129 1388244 1392638 1394522 1394864 1394998 1395490 1396629 1398468 1399929 1399560
58749A399560j794j371q91k828o048p296o384o313q313j0091r650p910o645o223
$$ 1399560 1397766 1396395 1395504 1392676 1386628 1379332 1372948 1366635 1358322 1348231 1338581 1330671 1324026 1317803
58735A317803o171o182n867n022m282m124l605j728N30J632K321M628Q270J0525
$$ 1317803 1311632 1305450 1299583 1294561 1290279 1286155 1282550 1280822 1281352 1282984 1285305 1289933 1298203 1308728
58721A308728R935P990O866P307Q835J0305J0225Q150N581M084L021P75k537n403
$$ 1308728 1318663 1326653 1333519 1340826 1349661 1359966 1370191 1378341 1383922 1388006 1391027 1391802 1389265 1383862
58707A383862p268q640r570r947j0472j1439j1550j0077q884r860j1570j1318
$$ 1383862 1376594 1367954 1358384 1348437 1337965 1326526 1314976 1304899 1296015 1286155 1274585 1263267
58695A263267r391q177p985p174n718n134n112l804j451k66m79P9K140M003M919
$$ 1263267 1253876 1245699 1237714 1230540 1224822 1219688 1214576 1210772 1209321 1209055 1208576 1208655 1210795 1214798 1219717
58680A219717O195Q024Q392O378M000L464M685O318P418P274N610L603L041M047
$$ 1219717 1225912 1233936 1242328 1248706 1252706 1256170 1260855 1267173 1274591 1281865 1287475 1291078 1294119 1298166
58666A298166N077N165M541L410K071J879L879O770Q328Q470Q749R409R433Q904
$$ 1298166 1303243 1308408 1312949 1316359 1318430 1320309 1324188 1330958 1339286 1347756 1356505 1365914 1375347 1384251
58652A384251Q620P773M788K24l804o750r615j2392j4433j6592j9949k2928k3134
$$ 1384251 1392871 1400644 1405432 1405656 1401852 1395102 1385487 1373095 1358662 1342070 1322121 1299193 1276059
58639A276059k1467k0962k1948k2198k1421k1385k1589j9354j4915j1972j2014
$$ 1276059 1254592 1233630 1211682 1189484 1168063 1146678 1125089 1105735 1090820 1078848 1066834
58628A066834j2147j0029p219n960n973o138o415o607n777m163l188k921k171
$$ 1066834 1054687 1044658 1037439 1031479 1025506 1019368 1012953 1006346 1000569 996406 993218 990297 988126
58615I88126j344j997l138j729K365N664O342O376P253P523O419O016P526Q823
$$ 988126 986782 984785 981647 979918 982283 987947 994289 1000665 1007918 1015441 1021860 1027876 1035402 1044225
58601A044225P861N586L355M65l455o467p121o790p066p173o152n183n544o259
$$ 1044225 1052086 1057672 1061027 1061492 1058037 1051570 1044449 1037659 1030593 1023420 1017268 1012085 1006541 1000282
58587A000282o022n653o481p785p732n807l024p35M2n78q83N09K320K293R48Q04
$$ 1000282 994260 988607 982126 974341 966609 960802 957778 957043 957085 956507 955624 956133 958453 960746 961694 962498
58571I62498J985J962L1j611k028k884m374l839l69K736K507L43q22p03p11j046
$$ 962498 964483 966445 966476 964865 962837 959953 955579 951740 951371 954107 956614 956957 956135 955432 954721 953675
58555I53675r91l61J035L604O503P858P433O961P046O363M664L721M328N182N714
$$ 953675 952684 952323 953358 956962 963465 971323 978756 985717 992763 999126 1003790 1007511 1011839 1017021 1022735
58540A022735O921Q343P651M676K581L377N290O159O320O607O588O492P824J0504
$$ 1022735 1029656 1037999 1045650 1050326 1052907 1056284 1061574 1067733 1074053 1080660 1087248 1093740 1101564 1112068
58526A112068J2374J2850J3847J5783J6400J5139J4708J6343J7398J6001J4297
$$ 1112068 1124442 1137292 1151139 1166922 1183322 1198461 1213169 1229512 1246910 1262911 1277208
58515A277208J4426J4985J4237J3471J4248J5466J5965J7100J9917K2735K4248
$$ 1277208 1291634 1306619 1320856 1334327 1348575 1364041 1380006 1397106 1417023 1439758 1464006
58504A464006K6064K9509L2840L4239L4549L4418L1920K5976J9149J4026R787
$$ 1464006 1490070 1519579 1552419 1586658 1621207 1655625 1687545 1713521 1732670 1746696 1756483
58493A756483N178J688M98o30l787p046p724p033p843j0177j2409j4872j8566
$$ 1756483 1761661 1763349 1763847 1763217 1759430 1752384 1744660 1737627 1729784 1719607 1707198 1692326 1673760
58480A673760k2159k3802k4395k5903k7854k8502k7943k7277k6158k3854k1415
$$ 1673760 1651601 1627799 1603404 1577501 1549647 1521145 1493202 1465925 1439767 1415913 1394498
58469A394498k0336k0241j9816j8625j6605j3703j1340j1612j3579j3310r477
$$ 1394498 1374162 1353921 1334105 1315480 1298875 1285172 1273832 1262220 1248641 1235331 1225854
58458A225854n677n049n953n529m263l999m339m119l882m134l605j792n88j015
$$ 1225854 1220177 1215128 1209175 1203646 1199383 1195384 1191045 1186926 1183044 1178910 1175305 1173513 1172925 1171910
58444A171910j208M5R28K53J05K123M448N194N554O596O598M736L808N978R103
$$ 1171910 1170702 1170747 1171675 1171928 1172033 1174156 1178604 1183798 1189352 1195948 1202546 1207282 1211090 1217068 1226171
58429A226171J0622J1548J3389J4765J4626J5022J7020J7805J5774J4547J7475
$$ 1226171 1236793 1248341 1261730 1276495 1291121 1306143 1323163 1340968 1356742 1371289 1388764
58418A388764K1922K3545K2600K1273J8490J2667O424L127J315k304o822r076
$$ 1388764 1410686 1434231 1456831 1478104 1496594 1509261 1515685 1518812 1520127 1517823 1511001 1501925
58406A501925r207r317q944o777m656m903n551k972K440P448J0804J3027J3654
$$ 1501925 1492718 1483401 1474457 1467680 1463024 1458121 1452570 1449598 1452038 1459486 1470290 1483317 1496971
58393A496971J2790J2780J4370J3993R014K524j512m377q959j3438j4260j2528
$$ 1496971 1509761 1522541 1536911 1550904 1559918 1562442 1560930 1556553 1547594 1534156 1519896 1507368
58381A507368j1743j1597r642o865o023o344n147k909j819j338K11J917K694M453
$$ 1507368 1495625 1484028 1474386 1467521 1461498 1455154 1450007 1447098 1445279 1443941 1444152 1446069 1448763 1453216
58367A453216Q185J0285P999N116O355R497R253N884L327J628j870o068p670p279
$$ 1453216 1461401 1471686 1479685 1484801 1491156 1500653 1509906 1515790 1519117 1520745 1518875 1512807 1505137 1497858
58353A497858p706q254o884n610p206r008o845k794j884l263k048J797L913L532
$$ 1497858 1490152 1481898 1475014 1469404 1462198 1453190 1446345 1443551 1441667 1438404 1436356 1438153 1442066 1445598
58339A445598L681M549L748K229L017N104N235M505O386R594R868P662P052Q267
$$ 1445598 1449279 1453828 1457576 1459805 1462822 1467926 1473161 1477666 1484052 1493646 1503514 1511176 1518228 1526495
58325A526495Q329P774R547J2340J2232R906R187R652Q052N721O955J1009J3250
$$ 1526495 1534824 1542598 1552145 1564485 1576717 1586623 1595810 1605462 1613514 1619235 1626190 1637199 1650449
58312A650449J3380J4883J7341J7062J4648J4263J5988J6346J5535J6660J8723
$$ 1650449 1663829 1678712 1696053 1713115 1727763 1742026 1758014 1774360 1789895 1806555 1825278
58301A825278J8219J6526J7712K0153J8698J4227J2458J3897J3666J0882R491
$$ 1825278 1843497 1860023 1877735 1897888 1916586 1930813 1943271 1957168 1970834 1981716 1991207
58290A991207J0126R668Q709J0749J4251J4124J1048J0746J4116J6558J6792J7778
$$ 1991207 2001333 2011001 2019710 2030459 2044710 2058834 2069882 2080628 2094744 2111302 2128094 2145872
58278B145872J9401J8947J8237K1296K5801K6063K3493K4311K7881K7740K3587
$$ 2145872 2165273 2184220 2202457 2223753 2249554 2275617 2299110 2323421 2351302 2379042 2402629
58267B402629K1372K1752J9551J4909J3678J6087J6256J3762J4507J9004K1134
$$ 2402629 2424001 2445753 2465304 2480213 2493891 2509978 2526234 2539996 2554503 2573507 2594641
58256B594641J9859K0774K4504K5055K1550K0337K3369K5535K5506K8158L4126
$$ 2594641 2614500 2635274 2659778 2684833 2706383 2726720 2750089 2775624 2801130 2829288 2863414
58245B863414L7862L7989L8946M0975L9598L6080L6745M0828M1193L8111L9353
$$ 2863414 2901276 2939265 2978211 3019186 3058784 3094864 3131609 3172437 3213630 3251741 3291094
58234C291094M5322M7726M4978M4978N0071N3288N2479N4036N9277O1356N9385
$$ 3291094 3336416 3384142 3429120 3474098 3524169 3577457 3629936 3683972 3743249 3804605 3863990
58223C863990O1235O8323P2137P0251P1176P8328Q3711Q2917Q2317Q5913Q8874
$$ 3863990 3925225 3993548 4065685 4135936 4207112 4285440 4369151 4452068 4534385 4620298 4709172
58212D709172Q9367R3054J00632J04738J04154J07133J16031J23100J26010J32311
$$ 4709172 4798539 4891593 4992225 5096963 5201117 5308250 5424281 5547381 5673391 5805702
58202E805702J43853J52300J55153J60355J70127J76511J77983J83711J96238
$$ 5805702 5949555 6101855 6257008 6417363 6587490 6764001 6941984 7125695 7321933
58193G321933K07255K15612K31319K56064K78512K94786L14415L40138L61928
$$ 7321933 7529188 7744800 7976119 8232183 8510695 8805481 9119896 9460034 9821962
58184I821962L77367L97041M23005M43455M55877M73164M99541N23656N42983
$$ 9821962 10199329 10596370 11019375 11462830 11918707 12391871 12891412 13415068 13958051
58175A3958051N70219O07141O38486O61210O92606P38744P82955Q17167Q55670
$$ 13958051 14528270 15135411 15773897 16435107 17127713 17866457 18649412 19466579 20322249
58166B0322249R05200R51601R90145J038165J102679J166995J224715J293900
$$ 20322249 21227449 22179050 23169195 24207360 25310039 26477034 27701749 28995649
58158B8995649J381429J468453J548790J645114J768277J899088K030000K183647
$$ 28995649 30377078 31845531 33394321 35039435 36807712 38706800 40736800 42920447
58150D2920447K368869K562998K761848L001134L303882L657386M068075M581422
$$ 42920447 45289316 47852314 50614162 53615296 56919178 60576564 64644639 69226061
58142F9226061N215502N935157O725857P628315Q669574R842961J1194777J2825393
$$ 69226061 74441563 80376720 87102577 94730892 103400466 113243427 124438204 137263597
58134A37263597J4739056J6799891J8920554K1204319K3864740K7168749L1432743
$$ 137263597 152002653 168802544 187723098 208927417 232792157 259960906 291393649
58127B91393649L6533344M0902191M1339250L4856593K1394174M559544j0711403
$$ 291393649 327926993 368829184 410168434 445025027 466419201 470978745 460267342
58120D60267342k1341123k7206903k9814731l0569557l0189306k9000197k7239636
$$ 460267342 438926219 411719316 381904585 351335028 321145722 292145525 264905889
58113B64905889k5131388k2908633k0792794j8892984j7172870j5562550j4051358
$$ 264905889 239774501 216865868 196073074 177180090 160007220 144444670 130393312
58106A30393312j2647413j1328084j0082929q947096p946002p054061o243711
$$ 130393312 117745899 106417815 96334886 87387790 79441788 72387727 66144016
58099F6144016n527774m918959m392071l920466l510684l170185k877516k613377
$$ 66144016 60616242 55697283 51305212 47384746 43874062 40703877 37826361 35212984
58091C5212984k386937k203927k041078j878652j728483j604655j494508j382607
$$ 35212984 32826047 30622120 28581042 26702390 24973907 23369252 21874744 20492137
58083B0492137j276852j187268j103180j013628r28239q57568p94138p31350o79423
$$ 20492137 19215285 18028017 16924837 15911209 14982970 14125402 13331264 12599914 11920491
58074A1920491o44108o10687n67353n24562m93603m65751m30512l95719l71386
$$ 11920491 11276383 10665696 10098343 9573781 9080178 8614427 8183915 7788196 7416810
58065G416810l50785l25049l00506k84800k70892k50812k30860k18038k05539
$$ 7416810 7066025 6740976 6440470 6155670 5884778 5633966 5403106 5185068 4979529
58056D979529j86473j68264j58981j52530j41206j30032j25130j20751j11291
$$ 4979529 4793056 4624792 4465811 4313281 4172075 4042043 3916913 3796162 3684871
58047C684871j03653j04165j05306r8771r0412q8915r0567q8034q3858q2673q0175
$$ 3684871 3581218 3477053 3371747 3272976 3182564 3093649 3003082 2915048 2831190 2748517 2668342
58036B668342p2184o5012o4812o5816o0681n3264n0018m8016m2831l9153m1943
$$ 2668342 2596158 2531146 2466334 2400518 2339837 2286573 2236555 2188539 2145708 2106555 2064612
58025B064612m5514m2730l7096l4965l3872k9420k5745k7996l1720l0470k7251
$$ 2064612 2019098 1976368 1939272 1904307 1870435 1841015 1815270 1787274 1755554 1725084 1697833
58014A697833k7989l0330k9054k6286k6557k7708k5998k4094k5197k5599k1822
$$ 1697833 1669844 1639514 1610460 1584174 1557617 1529909 1503911 1479817 1454620 1429021 1407199
58003A407199j8519k0371k2862k0246j6062j6431j9123j8716j6801j7684j9424
$$ 1407199 1388680 1368309 1345447 1325201 1309139 1292708 1273585 1254869 1238068 1220384 1200960
57992A200960j8162j6138j6816j7378j4481j1827j3437j5210j2081p967r235j3449
$$ 1200960 1182798 1166660 1149844 1132466 1117985 1106158 1092721 1077511 1065430 1057463 1048228 1034779
57980A034779j4005j1340j0212j0107p716n160o646j0091j0540q877r237j1008
$$ 1034779 1020774 1009434 999222 989115 981399 976239 969593 959502 948962 940085 930848 919840
57968I19840j1018j0425j1913j3340j1469q498p878p469m155j168l151p547q661
$$ 919840 908822 898397 886484 873144 861675 853177 845299 837830 833675 832507 829356 821809 813148
57955H13148o815o016o022m385k966m669o781n144j879j553k849j657O82J27j966
$$ 813148 806333 800317 794295 789910 786944 782275 775494 770350 768471 766918 764069 762412 763094 763221 761255
57940G61255j296J275J869J352L203N835M930J656Q44K416K085o66k353k127k038
$$ 761255 759959 761234 763103 764455 767658 773493 778423 780079 780923 783339 785424 784758 782405 780278 778240
57925G78240j862n3J602M82j292l5K700K915J634K650M726L364p85k583q10Q59
$$ 778240 776378 776325 777927 778409 777117 777082 779782 782697 784331 786981 791707 795071 794286 791703 790893 791752
57909G91752P94Q97J414N35j115j247p61k333m921n146l346k790l734l856l485
$$ 791752 792546 793443 794857 795392 794277 793030 792269 789936 785015 779869 776523 773733 769999 766143 762658
57894G62658m806o699o071l544k403k695j870l32p28k495k592r52R1Q02L054N532
$$ 762658 757852 751153 745082 741538 739135 736440 734570 734238 733510 731015 728423 727471 727562 728364 731418 736950
57878G36950N562M631O109Q608P776M033K100L120L581K119J188J454M91k238
$$ 736950 742512 747143 753252 761860 769636 773669 775769 778889 782470 784589 785777 787231 787722 785484
57864G85484m432n607p528r677r364o864n471n980n877m262k962k588k058j851
$$ 785484 781052 775445 767917 758240 748876 742012 736541 730561 724684 720422 717460 714872 712814 710963
57850G10963l089l833j328K529L355J491J254L134K954o04l747m114l813m432
$$ 710963 707874 704041 702713 705242 708597 710088 711342 714476 717430 716826 713079 708965 705152 700720
57836G00720m307k497p09K73J639K886J681j379k554q12O25p2p38L12J569J890
$$ 700720 696413 693916 693207 693480 695119 698005 699686 698307 695753 694941 695566 695494 694756 695068 696637 698527
57820F98527K488L661L537J846J189K740M309M296M109M984N823N832O194P456
$$ 698527 701015 704676 708213 710059 711248 713988 718297 722593 726702 731686 737509 743341 749535 756991
57806G56991Q148P463O731P024P736Q271Q734Q562P132N816O417P739P074M786
$$ 756991 765139 772602 779333 786357 794093 802364 811098 819660 826792 832608 839025 846764 853838 858624
57792H58624L652L692K108j304l248k464j720k865m037l552k786l324m395m925
$$ 858624 862276 865968 868076 866772 863524 861060 859340 856475 852438 848886 846100 842776 838381 833456
57778H33456n250n347m128j748O5Q65J964L457L814L016K928L904M269L757L968
$$ 833456 828206 822859 818731 816983 817048 817913 819877 823334 827148 830164 833092 836996 841265 845022 848990
57763H48990M802M153J958R05K044L456M161N394O906O172L027R96J940L106J761
$$ 848990 853792 857945 859903 860808 862852 866308 870469 875863 882769 888941 891968 892964 894904 898010 899771
57748H99771p43j900j885k050k294k196k362k769k250j148j684l967m781k326
$$ 899771 899028 897128 895243 893193 890899 888703 886341 883572 881322 880174 878490 874523 869742 867416
57734H67416O72R78o88j621j174l77M78J333J196l02j482p86Q89J658J315J030
$$ 867416 868088 869066 868378 866757 865583 865206 865684 867017 868213 867911 866429 865643 866532 868190 869505 870535
57718H70535J452K396L473M128L940L341L030K752J934J213J427J628M09j262
$$ 870535 871987 874383 877856 881984 885924 889265 892295 895047 896981 898194 899621 901249 901658 900396
57704I00396j320k81l52j183k91K010K371j0j703n31J164P55p13j081m74K92J900
$$ 900396 899076 898795 898443 897260 896969 898979 901350 901340 899637 899106 900270 901025 900312 899231 898757 899049 900949
57687I00949M613O510N968M093K808K363K344L077M500N535N967O900Q347Q676
$$ 900949 905562 912072 918040 922133 924941 927304 929648 932725 937225 942760 948727 955627 963974 972650
57673I72650P575O899P355P192N647M829O232Q091Q190O889N441L797K036J565
$$ 972650 980225 987124 994479 1001671 1007318 1012147 1018379 1026470 1034660 1041549 1046990 1050787 1052823 1054388
57659A054388K791L756L013J745J198M16j423k783k156p15m60j464k735l877m183
$$ 1054388 1057179 1060935 1063948 1065693 1066891 1067307 1065884 1063101 1060945 1060230 1059770 1058306 1055571 1051694 1047511
57644A047511k294J383L993L796K358J651J442J281K311M779O333N324L467K886
$$ 1047511 1045217 1046600 1050593 1054389 1056747 1058398 1059840 1061121 1063432 1068211 1074544 1079868 1083335 1086221
57630A086221K999K805L598O347Q806Q603P244P667R609J0851J1521J3439J6261
$$ 1086221 1089220 1092025 1095623 1101970 1110776 1119379 1126623 1134290 1143899 1154750 1166271 1179710 1195971
57617A195971J7921J8399J9694K2393K5304K8304L2587L8178M3753M8983N4442
$$ 1195971 1213892 1232291 1251985 1274378 1299682 1327986 1360573 1398751 1442504 1491487 1545929
57606A545929N8827N8422N0113L3929J2961p971k4235l3749l7675l8131l6165
$$ 1545929 1604756 1663178 1713291 1747220 1760181 1752210 1727975 1694226 1656551 1618420 1582255
57595A582255l2694k9681k8367k7461k4952k0945j7097j4282j2435j1577j1186
$$ 1582255 1549561 1519880 1491513 1464052 1439100 1418155 1401058 1386776 1374341 1362764 1351578
57584A351578r722o651l850l076l213k151k47N91K93N21J663K399K174J801J665
$$ 1351578 1341856 1335205 1331355 1328279 1325066 1322915 1322668 1323259 1323552 1324073 1325736 1328135 1330309 1332110 1333775
57569A333775J310Q43R24J354J351J125J604K665L148K623J766J072N30M38J260
$$ 1333775 1335085 1335928 1336852 1338206 1339557 1340682 1342286 1344951 1348099 1350722 1352488 1353560 1354090 1354528 1355788
57554A355788K665L725L987L548K542J365Q81J465K417L127M025N450O599O683
$$ 1355788 1358453 1362178 1366165 1369713 1372255 1373620 1374501 1375966 1378383 1381510 1385535 1390985 1397584 1404267
57540A404267O217O012N796N090M440M542M977N092N241N915O577O595O340O230
$$ 1404267 1410484 1416496 1422292 1427382 1431822 1436364 1441341 1446433 1451674 1457589 1464166 1470761 1477101 1483331
57526A483331N922N580O450Q628R875Q550O296N547N789M855K964K589M579P057
$$ 1483331 1489253 1494833 1501283 1509911 1519786 1528336 1534632 1540179 1545968 1550823 1553787 1556376 1560955 1568012
57512A568012Q263Q273P724O869O190O225O529O295N951O601P918Q287P168N771
$$ 1568012 1576275 1584548 1592272 1599141 1605331 1611556 1618085 1624380 1630331 1636932 1644850 1653137 1660305 1666076
57498A666076N121M992N032N579O853Q416R786J0799J1159J0489R077P921P883
$$ 1666076 1671197 1676189 1681221 1686800 1693653 1702069 1711855 1722654 1733813 1744302 1753379 1761300 1769183
57485A769183R164J1340J3521J4818J5246J5691J6469J6560J5032J2641J1193
$$ 1769183 1778347 1789687 1803208 1818026 1833272 1848963 1865432 1881992 1897024 1909665 1920858
57474A920858J1606J3273J4895J5499J5076J4608J4889J5368J5028J4319J4669
$$ 1920858 1932464 1945737 1960632 1976131 1991207 2005815 2020704 2036072 2051100 2065419 2080088
57463B080088J5976J6525J6054J6681J9664K3082K4341K3350K1727K0388J9561
$$ 2080088 2096064 2112589 2128643 2145324 2164988 2188070 2212411 2235761 2257488 2277876 2297437
57452B297437J9647K0341K0210J8802J7771J8223J8608J7260J5460J5504J6911
$$ 2297437 2317084 2337425 2357635 2376437 2394208 2412431 2431039 2448299 2463759 2479263 2496174
57441B496174J7147J5447J3381J2031J0955R837R126R019R334J0214J1638J2720
$$ 2496174 2513321 2528768 2542149 2554180 2565135 2574972 2584098 2593117 2602451 2612665 2624303 2637023
57429B637023J2726J2121J1453J0318Q852Q757J0952J3538J4250J3701J3859J4563
$$ 2637023 2649749 2661870 2673323 2683641 2692493 2701250 2712202 2725740 2739990 2753691 2767550 2782113
57417B782113J4299J3498J4000J5716J6715J6545J6619J7368J7755J7821J8925
$$ 2782113 2796412 2809910 2823910 2839626 2856341 2872886 2889505 2906873 2924628 2942449 2961374
57406B961374K0996K2120K1588K0980K1490K2272K2381K2389K3132K4349K5327
$$ 2961374 2982370 3004490 3026078 3047058 3068548 3090820 3113201 3135590 3158722 3183071 3208398
57395C208398K5665K4957K3083K1176K0807K1899K2769K2528K2060K2429K3632
$$ 3208398 3234063 3259020 3282103 3303279 3324086 3345985 3368754 3391282 3413342 3435771 3459403
57384C459403K5078K5990K5377K3156K1252K1896K4640K6791K6959K6405K6533
$$ 3459403 3484481 3510471 3535848 3559004 3580256 3602152 3626792 3653583 3680542 3706947 3733480
57373C733480K6965K6822K6317K6187K6615K7345K7948K7791K6745K6001K6854
$$ 3733480 3760445 3787267 3813584 3839771 3866386 3893731 3921679 3949470 3976215 4002216 4029070
57362D029070K8628K9258K8157K6974K7177K8347K9387L0013L0384L0413L0142
$$ 4029070 4057698 4086956 4115113 4142087 4169264 4197611 4226998 4257011 4287395 4317808 4347950
57351D347950K9916K9732K9191K8313K7572K6997K6232K5513K5534K6215K6702
$$ 4347950 4377866 4407598 4436789 4465102 4492674 4519671 4545903 4571416 4596950 4623165 4649867
57340D649867K6703K6748K6978K6849K6233K5786K5941K6525K7463K8865L0293
$$ 4649867 4676570 4703318 4730296 4757145 4783378 4809164 4835105 4861630 4889093 4917958 4948251
57329D948251L0901L0561L0025K9876L0100L0602L1286L1715L1595L1438L1836
$$ 4948251 4979152 5009713 5039738 5069614 5099714 5130316 5161602 5193317 5224912 5256350 5288186
57318E288186L2352L2142L1509L1616L2779L4045L4439L3628L1669K9091K7116
$$ 5288186 5320538 5352680 5384189 5415805 5448584 5482629 5517068 5550696 5582365 5611456 5638572
57307E638572K6779K7841K9249L0255L0397K9350K7769K7350K8613K9630K8600
$$ 5638572 5665351 5693192 5722441 5752696 5783093 5812443 5840212 5867562 5896175 5925805 5954405
57296E954405K6695K6345K7487K7954K7173K6981K8585L0998L2876L3865L3699
$$ 5954405 5981100 6007445 6034932 6062886 6090059 6117040 6145625 6176623 6209499 6243364 6277063
57285F277063L2039K9828K9027L0118L1356L1036K9293K7212K5685K5511K7165
$$ 6277063 6309102 6338930 6367957 6398075 6429431 6460467 6489760 6516972 6542657 6568168 6595333
57274F595333K9712L1248L0997L0006K9413K9158K8790K8384K8136K7992K7963
$$ 6595333 6625045 6656293 6687290 6717296 6746709 6775867 6804657 6833041 6861177 6889169 6917132
57263F917132K8160K8455K8909L0167L2384L4228L4245L2880L1663L0939L0072
$$ 6917132 6945292 6973747 7002656 7032823 7065207 7099435 7133680 7166560 7198223 7229162 7259234
57252G259234K9461L0123L1357L1104K9043K7239K7063K7556K7534K7375K7667
$$ 7259234 7288695 7318818 7350175 7381279 7410322 7437561 7464624 7492180 7519714 7547089 7574756
57241G574756K7776K7092K6389K6659K7445K7462K6298K4787K4071K4614K5720
$$ 7574756 7602532 7629624 7656013 7682672 7710117 7737579 7763877 7788664 7812735 7837349 7863069
57230G863069K6005K4993K3930K4166K5107K5063K3723K2317K1492K0789K0185
$$ 7863069 7889074 7914067 7937997 7962163 7987270 8012333 8036056 8058373 8079865 8100654 8120839
57219H120839K0351K0956K0532J8542J6090J4112J2360J0597R265Q314O991N461
$$ 8120839 8141190 8162146 8182678 8201220 8217310 8231422 8243782 8254379 8263644 8271958 8278949 8284410
57207H284410N110O445Q118Q967R732J1708J4774J7830K0380K2601K4568K6252
$$ 8284410 8289520 8295965 8304083 8313050 8322782 8334490 8349264 8367094 8387474 8410075 8434643 8460895
57195H460895K7950K9964L2062L3642L4196L3553L2064L0497K9278K7989K6177
$$ 8460895 8488845 8518809 8550871 8584513 8618709 8652262 8684326 8714823 8744101 8772090 8798267
57184H798267K4202K2457K0294J6863J2643Q884N755K365j563n445r182j3068
$$ 8798267 8822469 8844926 8865220 8882083 8894726 8903610 8909365 8911730 8910167 8904722 8895540 8882472
57172H882472j6392j7796j7450j7168j7721j7583j5228j1458q330o535m815j586
$$ 8882472 8866080 8848284 8830834 8813666 8795945 8778362 8763134 8751676 8743346 8736811 8731996 8730410
57160H730410L607J0026J6578K2663K8385L3976L9278M3987M8051N1482N3984
$$ 8730410 8734017 8744043 8760621 8783284 8811669 8845645 8884923 8928910 8976961 9028443 9082427
57149I082427N5179N4981N3601N1556M9678M8447M7330M5554M3582M2737M3372
$$ 9082427 9137606 9192587 9246188 9297744 9347422 9395869 9443199 9488753 9532335 9575072 9618444
57138I618444M4659M6107M7686M8537M7753M6719M7965N1030N2350N0573M8952
$$ 9618444 9663103 9709210 9756896 9805433 9853186 9899905 9947870 9998900 10051250 10101823 10150775
57127A0150775N0526N3867N6082N7306N9202O1250O1869O1633O2125O2897O2427
$$ 10150775 10201301 10255168 10311250 10368556 10427758 10489008 10550877 10612510 10674635 10737532 10799959
57116A0799959O0791N8419N3589M4422L2350K0459R013m357k0518l7659n3801
$$ 10799959 10860750 10919169 10972758 11017180 11049530 11069989 11079002 11074645 11054127 11016468 10962667
57105A0962667o8147q0459r1148j01062j09297j12494j08408r8768q6606p2928
$$ 10962667 10894520 10814061 10722913 10621851 10512554 10400060 10291652 10192884 10106278 10033350
57095A0033350n8354m5616l7091l1853k8311k7724l1435l6453l7668l3345k5281
$$ 10033350 9974996 9929380 9892289 9860436 9832125 9804401 9772966 9736513 9698845 9665500 9640219
57084I640219j5152m333M114O872L000p176k3787m5501o8416q9966j11476j34277
$$ 9640219 9625067 9620734 9624848 9631720 9634720 9627544 9603757 9558256 9489840 9399874 9288398 9154121
57072I154121j56630j77428j98959k22449k45180k65868k87966l13147l36848
$$ 9154121 8997491 8820063 8621104 8398655 8153475 7887607 7599641 7286494 6949646
57063F949646l55587l73161l93796m15016m34004m54795m81486n10274n36510
$$ 6949646 6594059 6220898 5827102 5412086 4978082 4523287 4041801 3531527 2995017
57054B995017n63703n96851o33051E33597a70438p44840p84823q19450q55198
$$ 2995017 2431314 1834463 1201412 533597 -170438 -915278 -1700101 -2519551 -3374749
57045c374749q98374r41824r75408j000411j019748j025263j012658j000186j017116
$$ -3374749 -4273123 -5214947 -6190355 -7190766 -8210514 -9235777 -10248435 -11248621 -12265737
57036a2265737j086579j234281j489382j848588k261510k678706l075974l393313
$$ -12265737 -13352316 -14586597 -16075979 -17924567 -20186077 -22864783 -25940757 -29334070
57028b9334070l533036l552942l831200m826443o539371q318897r363745r399004
$$ -29334070 -32867106 -36420048 -40251248 -45077691 -51617062 -59935959 -69299704 -78698708
57020g8698708q750616p800455o548802m766927k429674J36746K489689M351980
$$ -78698708 -87449324 -95249779 -101798581 -106565508 -108995182 -108858436 -106368747 -102016767
57012a02016767N681714O565944P089073P270129P093235O591137N889471N159862
$$ -102016767 -96335053 -89769109 -82680036 -75409907 -68316672 -61725535 -55836064 -50676202
57004e0676202M537722M087523L816907L691994L647954L616840L556742L450383
$$ -50676202 -46138480 -42050957 -38234050 -34542056 -30894102 -27277262 -23720520 -20270137
56996b0270137L287187L063476K793335K500782K201835J905477J625976J378381
$$ -20270137 -16982950 -13919474 -11126139 -8625357 -6423522 -4518045 -2892069 -1513688
56988a513688c49893F22560Q00113O50174N22596M12886L20885K49077J93114
$$ -1513688 -349893 622560 1422673 2072847 2595443 3008329 3329214 3578291 3771405
56979C771405J44503J01999P0609N0099L4380K1876J6785J9397K4254K9315L8814
$$ 3771405 3915908 4017907 4088516 4138615 4172995 4194871 4211656 4231053 4255307 4284622 4323436
56968D323436N5012P3939R1406J07249J20934J26911J16739Q4977L4443k1879
$$ 4323436 4378448 4452387 4543793 4651042 4771976 4898887 5015626 5100603 5135046 5113167
56958E113167o6836r1462j00571j03991j05457j03366r7835r0893q2351p1315
$$ 5113167 5046331 4954869 4854298 4750307 4644850 4541484 4443649 4352756 4270405 4199090
56948D199090o0161n1876m5242l7414k9290k3546j9476j4885j1032j0519j2220
$$ 4199090 4138929 4087053 4041811 4004397 3975107 3951561 3932085 3917200 3906168 3895649 3883429
56937C883429j3488j5599k1489k9640l5612l8404m0115m0618l8069l3854l1636
$$ 3883429 3869941 3854342 3832853 3803213 3767601 3729197 3689082 3648464 3610395 3576541 3544905
56926C544905l1910l2230l2329l4329l8525m3367m9030n6456o3681o7608o8865
$$ 3544905 3512995 3480765 3448436 3414107 3375582 3332215 3283185 3226729 3163048 3095440 3026575
56915C026575p0521p2668p2774p0743o9070o8349o6998o5065o3983o2960n9919
$$ 3026575 2956054 2883386 2810612 2739869 2670799 2602450 2535452 2470387 2406404 2343444 2283525
56904B283525n5732n3187n2020m9373m4935m1186l8448l4341k8834k5571k7099
$$ 2283525 2227793 2174606 2122586 2073213 2028278 1987092 1948644 1914303 1885469 1859898 1832799
56893A832799l2216l8661m5095m9924n1599n0999n0746n1582n1873n0769m9056
$$ 1832799 1800583 1761922 1716827 1666903 1615304 1564305 1513559 1461977 1410104 1359335 1310279
56882A310279m6907m3515l9140l4957l0899k5988k0565j5746j1134n522O99O149
$$ 1310279 1263372 1219857 1180717 1145760 1114861 1088873 1068308 1052562 1041428 1035906 1036605 1042754
56870A042754J0356J2463R327j387j6798l0739l9893m5233m8350m9648m9773m9433
$$ 1042754 1053110 1065573 1074900 1073513 1056715 1025976 986083 940850 892500 842852 793079 743646
56858G43646m7937m4657m1271l9734l8934l6583l3422l1882l1367k8820k3827
$$ 743646 695709 651052 609781 570047 531113 494530 461108 429226 397859 369039 345212
56847C45212j9312j6941j5382j3361j1213r110o673m495l445k718j241k29j243
$$ 345212 325900 308959 293577 280216 269003 259893 253220 248725 245280 242562 241321 241092 239849
56834B39849k666j653J075K432K333L662O913R281R587R791J0703J0178O933K558
$$ 239849 237183 235530 236605 239037 241370 245032 251945 261226 270813 280604 291307 301485 308418 310976
56820C10976j486n711j0030j2480j1931r711p329m819k155J28K482O182J0921
$$ 310976 309490 303779 293749 281269 269338 259627 252298 247479 245324 245452 247934 254116 265037
56807B65037J4706J6735J8370K0911K4463K9114L5008M0976M4969M5718M2230
$$ 265037 279743 296478 314848 335759 360222 389336 424344 465320 510289 556007 598237
56796E98237L2820J7471L81j2983k1058k5696k7546k5621k0847j5930j1473n927
$$ 598237 631057 648528 648909 635926 614868 589172 561626 536005 515158 499228 487755 481828
56784D81828L91N098P913J1215J5936K0657K5492L2815M2985N3045O0657O5751
$$ 481828 482219 487317 495230 506445 522381 543038 568530 601345 644330 697375 758032 823783
56772H23783O7040O0788M5137K2917j064k2881l9067m7202m8711m7962m7026m4133
$$ 823783 890823 951611 996748 1019665 1018601 995720 956653 909451 860740 812778 765752 721619
56760G21619l8359l2268k8005k4078j8338j1405m927J121P250J2736J7189K2080
$$ 721619 683260 650992 622987 598909 580571 569166 564239 565360 572610 585346 602535 624615
56748F24615K8707L5937M1086M1666L5684K2581N047j2040k5562l5430m1812m3836
$$ 624615 653322 689259 730345 772011 807695 830276 835323 823283 797721 762291 720479 676643
56736F76643m1839l8121l4239k9820k4898k0841j8011j5093j1688q809n936p95
$$ 676643 634804 596683 562444 532624 507726 486885 468874 453781 442093 433284 427348 426553
56724D26553O645J3186J6999J9998K3514K4645J9668R047l364j4349k2618k7824
$$ 426553 433198 446384 463383 483381 506895 531540 551208 560255 556891 542542 519924 492100
56712D92100l0479l1691l1602k9386k5524k2177k0350j8878j7144j6220j6113
$$ 492100 461621 429930 398328 368942 343418 321241 300891 282013 264869 248649 232536
56701B32536j4759j1587r434j0608j3162j3426j0590o755l873k590k920m240n441
$$ 232536 217777 206190 196756 186148 172986 159560 148970 142215 138342 135752 132832 128592 123151
56688A23151o102o510o183m206j591r19k656m141l502k202k313l562m660n347
$$ 123151 117049 110539 104356 100150 98559 97640 94984 90843 87341 85139 82826 79264 74604 69257
56674F9257n505m294j900k25k75o95l66l02j317j931n95J659K701K110J014M48
$$ 69257 63752 59458 57558 57333 57058 56363 55997 55695 54378 52447 51852 53511 56212 58322 59336 59784
56658E9784R70K508L637K759P12J99J767K809J588l09q31k21O13J822K974K262
$$ 59784 60754 63262 66899 69658 70370 70569 72336 75145 76733 76424 75593 75372 75985 77807 80781 83043
56642H3043o15l028k887j426o38j00J504L703N196N978O550O556N914N665O297
$$ 83043 82428 79400 76513 75087 74449 74349 75853 79556 84752 90730 97280 103836 109750 115415 121712
56627A21712O741O309N703N002L093M19l95J561L473K741O19k07O02J739K677
$$ 121712 128453 134762 140465 145467 148560 148979 148584 150145 153618 156359 156978 156771 157373 159112 161789
56612A61789L234K644J107M31J370K150J308m1l68P4P51K130L719L434Q40j419
$$ 161789 165023 167667 168774 169205 170575 172725 174033 173992 173624 173698 174449 176579 180298 183732 184572 183153
56596A83153j265K33J511K855M214M007K282J875L911N479M423K966L495M273
$$ 183153 181888 182121 183632 186487 190701 194708 196990 198865 202776 208255 212678 215644 219139 223412
56582B23412K982J282J739K969K128l5p95j72j09o55p92j298l163m876m809m281
$$ 223412 226394 227676 229415 232384 234512 234477 233682 233510 233401 232746 231954 230656 227493 222617 217808 213527
56566B13527m729m227q68K705K786O39J56J160K49k693m208l108j759j425r11
$$ 213527 208798 204571 203703 206408 209194 209833 209989 211149 211398 208705 204497 201389 199630 198205 197294
56551A97294q7m76j847k012n72N38N34N83J021R16L47J18m19k200l502j755K062
$$ 197294 197207 196731 194884 192872 192300 192838 193372 193955 194976 195892 196239 196357 195938 193738 190236 188481 190543
56534A90543M348M057L438L700L682L013K932L419K852J222N83J629K648K438
$$ 190543 194891 198948 202386 206086 209768 212781 215713 219132 221984 223206 223789 225418 228066 230504
56520B30504J673R19j50j138q83N95K209L708N459O720O441N329M761M416L466
$$ 230504 232177 233096 232946 231808 230925 231520 233729 237437 242896 249616 256057 261386 266147 270563 274029
56505B74029L102M932P741R106R383J0742J2846J3224J1519R703Q257N877L007
$$ 274029 277131 282063 289804 298910 308293 319035 331881 345105 356624 366327 374584 380461 383468
56492C83468J873K557K683J489P63J171J076j42r17n85o96k160l748m376m555
$$ 383468 385341 387898 390581 392070 392833 394004 395080 394938 394021 393436 392740 390580 386832 382456 377901
56477C77901m770m553l811l163k659k000j880l100m620m682l475k554k190j643
$$ 377901 373131 368578 364767 361604 358945 356945 355065 351965 347345 342663 339188 336634 334444 332801
56463C32801j179j333j038P01K262J423j104l052m223n437n509l244j046k104
$$ 332801 331622 330289 329251 329952 332214 333637 332533 329481 325258 319821 314312 311068 310022 307918
56449C07918m981n732m463m717o733o915m340k333k592k923k077j893k946k695
$$ 307918 302937 297205 292742 288025 281292 274377 270037 267704 265112 262189 260112 258219 255273 252578
56435B52578n5K232J918M46L0O83J767L425N062N197L811K355J073p17j864o10
$$ 252578 252523 254755 256673 257119 257149 257832 259599 263024 268086 273283 277094 279449 280522 279805 277941 277331
56419B77331J507J161j199j808J07J341O76N56J651J134j656l030r14J767K137
$$ 277331 278838 279999 278800 276992 277099 278440 279116 279672 281323 282457 280801 277771 276857 278624 280761
56404B80761J441J422R87o63j518l02R95Q07P71K224L400K687J373P42j40j377
$$ 280761 282202 283624 284611 283948 282430 282128 283123 283930 284701 286925 290325 293012 294385 295127 294987 293610
56388B93610o74K534M907M020K074J950K782K423J259N90p2j295j863j165q03
$$ 293610 292936 295470 300377 304397 306471 308421 311203 313626 314885 315475 315403 314108 312245 311080 310277
56373C10277j604j852o25K63j47J09J930K798J162l83N03J775P58j231j599q36
$$ 310277 308673 306821 306196 306459 306312 306421 308351 311149 312311 311928 312431 314206 314964 313733 312134 311298
56357C11298n87p1J768L056J783m47j057p48j455k171p35J890K924K262K182L454
$$ 311298 310711 310640 312408 315464 317247 316800 315743 314995 313540 311369 310634 312524 315448 317710 319892 323346
56341C23346M808N501N786N634N121N018N235M177J465o52n79P7n57j326k26K046
$$ 323346 328154 333655 339441 345075 350196 355214 360449 364626 366091 365439 364860 364937 364380 363054 362828 364874
56325C64874L291K955J821K44j234j272K18J154K47j028j094o95q61q74j68J41
$$ 364874 368165 371120 372941 373185 371951 370679 370897 372051 372298 371270 370176 369481 368620 367746 367578 367719
56309C67719m62m61R71K316K541K821L747L924L167L773O446Q415P831O570O321
$$ 367719 367257 366796 367767 370083 372624 375445 379192 383116 386283 390056 396502 404917 412748 419318 425639
56294D25639N737M060L482M769M767J801n58R08L582L568J964J907K712K057J074
$$ 425639 431376 435436 438918 443687 448454 450255 449697 450605 454187 457755 459719 461626 464338 466395 467469
56279D67469K104L733L215J691K107L800M017L079L253M106L691K923M064O136
$$ 467469 469573 473306 476521 478212 480319 484119 488136 491215 494468 498574 502265 505188 509252 515388
56265E15388O501N762O573Q580R045P683O556O018M954M177N251O619N191J572
$$ 515388 521889 527651 534224 542804 551849 559532 566088 572106 577060 581237 586488 593107 598298 599870
56251E99870l03J346M466O877Q423R606J0824J2710J5021J6076J5220J4252J4336
$$ 599870 599567 600913 605379 612256 620679 630285 641109 653819 668840 684916 700136 714388 728724
56238G28724J3780J1496R984J1623J4494J5583J5730J7447J9967K0662J9633J8907
$$ 728724 742504 754000 763984 775607 790101 805684 821414 838861 858828 879490 899123 918030
56226I18030J8775J8601J9455K2071K4248K4137K4011K6644L0192L1131L0099
$$ 918030 936805 955406 974861 996932 1021180 1045317 1069328 1095972 1126164 1157295 1187394
56215A187394L0230L1733L2870L4389L7947M1817M3221M3632M6729N2388N7494
$$ 1187394 1217624 1249357 1282227 1316616 1354563 1396380 1439601 1483233 1529962 1582350 1639844
56204A639844O1443O6039P1226P5872Q1486R0223J00372J08851J16890J28047
$$ 1639844 1701287 1767326 1838552 1914424 1995910 2086133 2186505 2295356 2412246 2540293
56194B540293J41782J54430J65568J77914J91572K03901K14650K25720K35950
$$ 2540293 2682075 2836505 3002073 3179987 3371559 3575460 3790110 4015830 4251780
56185D251780K41496K41616K39110K34725K25704K10194J88847J62193J30543
$$ 4251780 4493276 4734892 4974002 5208727 5434431 5644625 5833472 5995665 6126208
56176F126208R6215O1780K6572j1031m8660q1617j08771j32542j53887j71593
$$ 6126208 6222423 6284203 6310775 6299744 6251084 6169467 6060696 5928154 5774267 5602674
56166E602674j85662j97094k05136k08802k09758k09751k06999j99633j90461
$$ 5602674 5417012 5219918 5014782 4805980 4596222 4386471 4179472 3979839 3789378
56157C789378j83257j76607j67082j56246j48236j42197j33837j23243j14470
$$ 3789378 3606121 3429514 3262432 3106186 2957950 2815753 2681916 2558673 2444203
56148B444203j08196j01435r3957q8283q3648p6585o7530o0559n6500n2324m7167
$$ 2444203 2336007 2234572 2140615 2052332 1968684 1892099 1824569 1764010 1707510 1655186 1608019
56137A608019m3037l9840l5769l2026l1009l0515k6439k0423j7949j9106j8637
$$ 1608019 1564982 1525142 1489373 1457347 1426338 1395823 1369384 1348961 1331012 1311906 1293269
56126A293269j5000j2090j1546j0716q875q326q580o338k092Q1j46R93L940N154
$$ 1293269 1278269 1266179 1254633 1243917 1235042 1226716 1218136 1211798 1209706 1209787 1209641 1210634 1214574 1219728
56112A219728M302M890O987O860M684N106Q987J2040J2839J4582J7600J7966J5458
$$ 1219728 1224030 1228920 1235907 1242767 1247451 1252557 1261544 1273584 1286423 1301005 1318605 1336571 1352029
56099A352029J5121J8717K1845K1889K1882K4146K6866K9121L2845L7957M1754
$$ 1352029 1367150 1385867 1407712 1429601 1451483 1475629 1502495 1531616 1564461 1602418 1644172
56088A644172M4572M9634N6478O1524O5772P4250Q6842R7662J04659J11417J18057
$$ 1644172 1688744 1738378 1794856 1856380 1922152 1996402 2083244 2180906 2285565 2396982 2515039
56077B515039J19224J13309J05067R6733Q5311P1215O0723N6476N3784M9314M5100
$$ 2515039 2634263 2747572 2852639 2949372 3034683 3105898 3166621 3223097 3276881 3326195 3371295
56066C371295M1114L2689J9251P258O02m241j0426j6386k2614l4060n1602o8964
$$ 3371295 3412409 3445098 3464349 3471607 3472209 3467968 3457542 3441156 3418542 3384482 3332880 3263916
56054C263916q1886r2600j01917j05513j02095r6860r2734q6235p5888o6355o0130
$$ 3263916 3182030 3089430 2987513 2882000 2779905 2683045 2590311 2504076 2428188 2361833 2301703
56043B301703n3487m4742l8000l4706l0139k2573j7105j5910j3717p563k119l90
$$ 2301703 2248216 2203474 2165474 2130768 2100629 2078056 2060951 2045041 2031324 2023761 2021642 2021252
56031B021252J704O496R423Q115P599J0887J3287J1745J1005J4599J8331J8572
$$ 2021252 2022956 2029452 2038875 2046990 2054589 2065476 2078763 2090508 2101513 2116112 2134443 2153015
56019B153015J8611K1150K2885K2066K2865K6815K8727K6374K5298K8699L1840
$$ 2153015 2171626 2192776 2215661 2237727 2260592 2287407 2316134 2342508 2367806 2396505 2428345
56008B428345L1799L3015L7631M0314L8512L7744M0803M2145L8975L7159L9825
$$ 2428345 2460144 2493159 2530790 2571104 2609616 2647360 2688163 2730308 2769283 2806442 2846267
55997B846267M1129L8052L6971M1372M4497M1904L9888M3566M7966M8902N1074
$$ 2846267 2887396 2925448 2962419 3003791 3048288 3090192 3130080 3173646 3221612 3270514 3321588
55986C321588N7069O0163N6936N5207O0457O6034O5991O5749P0503P5100P5174
$$ 3321588 3378657 3438820 3495756 3550963 3611420 3677454 3743445 3809194 3879697 3954797 4029971
55975D029971P6430Q2925Q8059Q7119Q6772R2372R8213J00006J03901J13241J20027
$$ 4029971 4106401 4189326 4277385 4364504 4451276 4543648 4641861 4741867 4845768 4959009 5079036
55964E079036J19961J21840J31381J40374J42980J47373J59412J70676J75270
$$ 5079036 5198997 5320837 5452218 5592592 5735572 5882945 6042357 6213033 6388303
55955F388303J82321J98652K15627K26858K41755K66968K91915L08040L24563
$$ 6388303 6570624 6769276 6984903 7211761 7453516 7720484 8012399 8320439 8645002
55946H645002L49269L72208L85353L99405M23272M46219M59019M73137M99204
$$ 8645002 8994271 9366479 9751832 10151237 10574509 11020728 11479747 11952884 12452088
55937A2452088N26756N45905N68058O03429O39514O65057O93310P37046P82985
$$ 12452088 12978844 13524749 14092807 14696236 15335750 16000807 16694117 17431163 18214148
55928A8214148Q16878Q50976Q99369R49678R88160J028998J088357J153566J209639
$$ 18214148 19031026 19882002 20781371 21731049 22719209 23748207 24836564 25990130 27199769
55919B7199769J270945J353700J443654J526024J619612J744329J884499K023469
$$ 27199769 28470714 29824414 31268068 32794092 34413704 36158033 38042532 40066001
55911D0066001K182423K382291K601807K821003L071443L393652L783411M234847
$$ 40066001 42248424 44630715 47232522 50053525 53124968 56518620 60302031 64536878
55903F4536878M793602N503872O344420P281657Q337122R533079J0836235J2246937
$$ 64536878 69330480 74834352 81178772 88460429 96797551 106330630 117166865 129413802
55895A29413802J3878820J5845645J8141521K0749145K3764583K7251903L1080374
$$ 129413802 143292622 159138267 177279788 198028933 221793516 249045419 280125793
55888B80125793L5069352L9001327M1938148M1582463L5210813K2055981M740333
$$ 280125793 315195145 354196472 396134620 437717083 472927896 494983877 499724210
55881D99724210j2100974k4779867l2237618l5399168l5677778l4218984l1880150
$$ 499724210 487623236 462843369 430605751 395206583 359528805 325309821 293429671
55874B93429671k9246353k6583454k3975731k1518990j9304508j7314171j5473782
$$ 293429671 264183318 237599864 213624133 192105143 172800635 155486464 140012682
55867A40012682j3774002j2247235j0876543r621327q494368p529822o705602
$$ 140012682 126238680 113991445 103114902 93493575 84999207 77469385 70763783
55860G0763783n969663n314005m756807m278935l841593l444793l111197k831391
$$ 70763783 64794120 59480115 54723308 50444373 46602780 43157987 40046790 37215399
55852C7215399k576769k347651k159848k000727j844443j695279j573368j472092
$$ 37215399 34638630 32290979 30131131 28130404 26285961 24590682 23017314 21545222
55844B1545222j369481j267525j181803j105703j021771r36347q67797q11680
$$ 21545222 20175741 18908216 17726413 16620710 15598939 14662592 13794795 12983115
55836A2983115p50710o88158o39198n99601n54136n06525m71252m44570m12104
$$ 12983115 12232405 11544247 10905049 10305448 9751312 9244787 8773535 8328965 7916861
55827G916861l76619l50772l30813l04235k75302k56941k45103k26632k05164
$$ 7916861 7540242 7189470 6858657 6554422 6279120 6022179 5777076 5550444 5345280
55818E345280j94094j90768j82109j69408j63658j62406j54667j43230j39133
$$ 5345280 5151186 4960418 4778309 4608901 4445243 4282837 4128170 3984940 3845807
55809C845807j39271j31855j19286j13612j13668j08318r8390r4337r5616r2805
$$ 3845807 3706536 3574681 3455395 3341783 3228115 3119797 3021407 2927070 2831454 2738649
55799B738649q6905q6620q9560q5662p6488p2064p1522o5850n6974n5021n8720
$$ 2738649 2651744 2565124 2475564 2389902 2313414 2241350 2169828 2103978 2047004 1991983 1933263
55788A933263n7453n1066m9065n1393m8514m0219l6343l8542l8453l4497l3889
$$ 1933263 1875810 1824744 1775679 1724286 1675772 1635553 1599210 1560668 1522215 1487718 1453829
55777A453829l7091l6303l0679k7887k9300k8119k3352k1574k3545k2694j8158
$$ 1453829 1416738 1380435 1349756 1321869 1292569 1264450 1241098 1219524 1195979 1173285 1155127
55766A155127j6193j7617j6629j3096j3267j7277j8245j5081j4193j7262j8765
$$ 1155127 1138934 1121317 1104688 1091592 1078325 1061048 1042803 1027722 1013529 996267 977502
55755I77502j6893j5818j6259j4419j0937j0380j1504q613k655l77k375k616J42
$$ 977502 960609 944791 928532 914113 903176 892796 881292 872679 870024 869647 867272 864656 864798
55742H64798J213K91K014N832O007K297L35R34q15n482q528r727j3144j7521j7145
$$ 864798 866011 866302 868316 874148 880155 882452 882787 883721 882906 877424 868896 859169 846025 828504 811359
55727H11359j2630j0511j1656j0611o786n560p350o454k056K37o07J078O950J2047
$$ 811359 798729 788218 776562 765951 759165 753605 746255 739801 737745 737982 737375 738453 745403 757450
55713G57450J4828J9746K7322L1145K7414J8878P555p493k3231l2762l4730l4398
$$ 757450 772278 792024 819346 850491 877905 896783 904338 896845 873614 840852 806122 771724
55701G71724l3897l0196k3987k0932k1812k0793j6014j2820j3730j4296j2033
$$ 771724 737827 707631 683644 662712 640900 620107 604093 591273 577543 563247 551214
55690E51214j0723j2378j3143j0737q307p559n519j302J160K62l23J251J730q24
$$ 551214 540491 528113 514970 504233 495926 488367 482848 481546 482706 482968 482645 483896 485626 484802
55676D84802l977o532j0334j4518j5108j2395j1386j2928j2087p541m485n416
$$ 484802 480825 474293 463959 449441 434333 421938 410552 397624 385537 377996 373511 368095
55664C68095o117m024k739m497n692l854j871j355J051O591J0503R655P790Q692
$$ 368095 361978 357954 355215 350718 345026 341172 339301 337946 338997 345588 356091 365746 373536 382228
55650C82228J0083Q739N974L715M95m396p757p602o808p979r425r456r828j1494
$$ 382228 392311 401050 407024 410739 411234 406838 399081 391479 384671 376692 367267 357811 347983 336489
55636C36489j1821r435p196p074o739m440k431k409k224l45R93K64k50J096K304
$$ 336489 324668 315233 308037 300963 294224 289784 287353 284944 282720 282375 283368 283632 283382 284478 286782
55621B86782K082K669N291P304O793N607N011L059p84l089j792J80k44j894k573
$$ 286782 288864 291533 296824 304128 310921 316528 321539 324598 323814 320725 318933 319113 318869 316975 314402
55606C14402k597k472j129J118J968J460K415M733M580J257p75N76J459p31k576
$$ 314402 311805 309333 308204 309322 311290 312750 315165 319898 324478 325735 324960 325536 326995 326264 323688
55591C23688r55J407J101l28l49l96k245l741k777j692l264n916p060p677r444
$$ 323688 322733 324140 325241 324913 324564 324168 321923 318182 315405 313713 310449 304533 297473 289796 280352
55576B80352j0781r866q429q548q789p208n104m201l244r03J076J100Q08J654
$$ 280352 269571 259705 251276 242728 233939 226731 221627 217426 214182 213279 214355 215455 216263 217917
55562B17917J717n18k671k410j639k967n147n759n392n465m854k432k15k93j298
$$ 217917 219634 219116 216445 214035 212396 209429 204282 198523 193131 187666 182812 180380 180165 179872 178574
55547A78574j295j275k408k857j010J023P66m30k26M73k11j272j027n80j506k482
$$ 178574 177279 176004 173596 170739 169729 170752 171518 171088 170862 171335 171124 169852 168825 168245 166739 164257
55531A64257j877j090j686j804O33L509L449J170j21J0n42k195l314l130k038
$$ 164257 162380 161290 159604 157800 158433 161942 165391 166561 166440 166450 165908 163713 160399 157269 155231
55516A55231j22K222L519L269L118M036M594L908L630M699N064L290J526J901
$$ 155231 155109 157331 160850 164119 167237 171273 175867 179775 183405 188104 193168 196458 197984 199885
55502A99885K825K020M82K28O33K72j53J47l29k475l906k641q48j325k806k496
$$ 199885 202710 204730 205212 205440 206073 206345 206192 206339 206010 203535 199629 196988 196140 194815 192009 189513
55486A89513j039r84k148k356j290k48N64J450J583O77L90J519K073Q25j6J280
$$ 189513 188474 187490 185342 182986 181696 181448 182012 183462 185045 185722 186112 187631 189704 190529 190513 191793
55470A91793K247M1l716n615n576n439m799k420J74N88n69j275j787l175m212
$$ 191793 194040 194081 190365 184750 179174 173735 168936 166516 166690 167278 166709 165434 163647 160472 156260
55455A56260l432k432l347m999n227m922n720n953l307K45Q52j285k814k799k934
$$ 156260 152828 150396 147049 142050 136823 131901 126181 120228 116921 117166 118018 116733 113919 111120 108186
55440A08186l308k408p13k39r35j140p72o77KK215M055L211J048M47R99M76m43
$$ 108186 104878 102470 101757 101518 100583 99443 98671 97994 97996 100211 104266 107477 108525 108972 109971 110447 110004
55423A10004N24K431K305M83kJ086J042n75j223q1Q06N32M08O66r9j672k070j175
$$ 110004 110528 112959 115264 115747 115745 116831 117873 117298 116075 115994 116800 117332 117740 118406 118307 116635 114565 113390
55405A13390j030k098k458j228L01J327K352L055K269L21j105j432j177j11J833
$$ 113390 112360 110262 107804 106576 106877 108204 110556 113611 115880 116201 115096 113664 112487 112376 114209
55390A14209K751J006j464j496L69R37l32j023m39l52j011n29J183J767N19m49
$$ 114209 116960 117966 116502 115006 115375 116312 115980 114957 114518 114166 113155 112626 113809 115576 116095 115646
55374A15646M0O80P57J447K984L613K523J254J141J644J880J605L51k082m017
$$ 115646 115686 116366 117123 118570 121554 125167 127690 128944 130085 131729 133609 135214 135565 133483 129466
55359A29466l256k87K143K708K398K061J679J873L154L891K115q09j622l38k81
$$ 129466 126210 125923 128066 130774 133172 135233 136912 138785 141939 145830 147945 147136 145514 145176 144895
55344A44895k555m208k960m20Q82O58l54k107m088m621l031r60k94r69j601j200
$$ 144895 142340 138132 135172 134752 135634 136292 135938 133831 129743 125122 122091 121131 120837 119868 118267 117067
55328A17067J05J135N87j138j768j91J618J541O38J030J911R81j347k732l133
$$ 117067 117172 118307 118894 117756 115988 115797 117415 118956 119594 120624 122535 123516 122169 119437 116304
55313A16304m341n694m482q82J616J417O36P69M33j148j952l84K019K926K129
$$ 116304 111963 106269 101787 100905 102521 103938 104574 105343 105776 104628 102676 102292 104311 107237 109366
55298A09366P86l33p18m6R13R95N65Q72J484P26j203k165j416m51j78J21O23L49
$$ 109366 110152 109819 109101 109055 109968 110963 111528 112400 113884 114610 113407 111242 109826 109375 109197 109318 109941 110290
55280A10290o48j072q08j031j606j045M52P98n21j521r21K96J181K080K888K619
$$ 110290 109642 108570 107762 106731 105125 104080 104532 105330 104809 103288 102367 102663 103844 105924 108812 111431
55264A11431J438O88M31o07k273k879k107j303o58Q25K275J365j559l112j753
$$ 111431 112869 113557 113988 113381 111108 108229 106122 104819 104161 104986 107261 108626 107067 103955 102202
55249A02202K86R04P32O44K9r77o94J002J678K8k073k689k298j790o96J043K152
$$ 102202 102488 103392 104124 104768 104797 103820 103126 104128 105806 105834 103761 101072 98774 96984 96288 97331 99483
55232I9483K298K781L734L408J541N18J603K884K580J594J082L26j125j902j310
$$ 99483 101781 104562 108296 111704 113245 113763 115366 118250 120830 122424 123506 123832 122707 120805 119495
55217A19495p39r16m57J019J366l83j774p98P52N15m68K5J435J730R13L41l4j002
$$ 119495 118756 117840 117383 118402 119768 119385 117611 116813 117565 118080 117612 117637 119072 120802 121715 122056 122022 121020
55199A21020j909j620p19n37r58j007n86k2Q36J635J147o38j738j028J8lp0R95
$$ 121020 119111 117491 116772 116235 115277 114270 113684 113662 114498 116133 117280 116642 114904 113876 113894 113891 113821 114816
55181A14816J986J300k60j020j201j850k487k140j493j710k208j633j03J394K618
$$ 114816 116802 118102 117842 116822 115621 113771 111284 109144 107651 105941 103733 102100 101997 103391 106009
55166A06009L398K673K36j906j898n74J80K61N24N98j40o02N54K377K717J275
$$ 106009 109407 112080 112316 110410 108512 107938 108118 108379 108903 109501 109361 108759 109313 111690 114407 115682
55150A15682m19j322j355l57J464K733K391J380J159J416R82J54J20O79N18n71
$$ 115682 115263 113941 112586 112229 113693 116426 118817 120197 121356 122772 123754 123908 124028 124707 125225 124654
55134A24654j435j304l83Q53J777J563K53p62n06J26k01j233j810j614j019K9
$$ 124654 123219 121915 121532 122385 124162 125725 125978 125216 124710 124836 124635 123402 121592 119978 118959 118988
55118A18988J525K652K734K328K258K316J880R46k74j743k806k368o79M22O4m97
$$ 118988 120513 123165 125899 128227 130485 132801 134681 135627 135353 133610 130804 128436 127757 128179 128243 127746
55102A27746k76k67j321k186j443J91J209J490J460O71p94j137Q04L172L232R60
$$ 127746 127470 127203 125882 123696 122253 122444 123653 125143 126603 127274 126480 125343 126147 129319 132551 133511
55086A33511j432k537k458j516j61O01L67R8M09M22l17m48Q58J934J139l38n74
$$ 133511 132079 129542 127084 125568 125407 126008 126375 126473 126882 127304 126987 126539 127397 129331 130470 130132 129558
55069A29558j52o84j505r92rp77k837l420j750rK01l11l78M0R40K645M512M961
$$ 129558 129406 128722 127217 126225 126216 125439 122602 119182 117432 117423 117624 117313 116935 116975 117915 120560 125072 130033
55051A30033L441J079p24j274m87Q62J172j66j494r78O62J230K58q47j432k095
$$ 130033 133474 134553 133829 132555 132068 132930 134102 133936 132442 131464 132126 133356 133614 132767 131335 129240
55035A29240k729k217m54J221K024K628L704M839N210M327K163m72j942j299M72
$$ 129240 126511 124294 123840 125061 127085 129713 133417 138256 143466 147793 149956 149484 147542 146243 146715
55020A46715J654J789J551J357J332J825K648K589J107l75l99L43M30J98P54J463
$$ 146715 148369 150158 151709 153066 154398 156223 158871 161460 162567 162192 161793 162136 162566 162764 163518 164981
55004A64981R04l65m94M52N67p14j907k108j970j767p83P33J181Q1r17m05Q22
$$ 164981 165885 165520 165026 165478 166045 165331 163424 161316 159346 157579 156796 157529 158710 158791 157874 157469 158291
54987A58291J187N05k27m46o42j553l047l781k458K89K185K101J448J681J882
$$ 158291 159478 159983 159756 159310 158668 157115 154068 150287 147829 148118 150303 152404 153852 155533 157415
54972A57415N51j416j857p55j15o30r46l83l9n94j064m98O69J618K073J702Q0
$$ 157415 157966 156550 154693 153938 153823 153193 152247 151864 151825 151231 150167 149669 150338 151956 154029 155731 155811
54955A55811k006k587q12J686K514J116r41j780r13N89J439J506J590J818J312
$$ 155811 153805 151218 150406 152092 154606 155722 154781 153001 152088 152677 154116 155622 157212 159030 160342
54940A60342j91j425j283m42k22o27q10o73p52r61p58l3J024K326L213K417j65
$$ 160342 160151 158726 157443 157001 156779 156152 155342 154669 153917 152956 152198 152165 153189 155515 158728 161145 160980
54923A60980k642l342k808k331j765m54R16J318J246J703K320K352K497L524M174
$$ 160980 158338 154996 152188 149857 148092 147638 148554 149872 151118 152821 155141 157493 159990 163514 167688
54908A67688K770K16j064n94Q5K19K48j2j091k058j518p4O38Q38J847K923K042
$$ 167688 170458 170674 169610 169016 169101 169320 169568 169556 168465 166407 164889 164815 165453 166291 168138 171061 173103
54891A73103k20q89Q51K392J829L95j98j96l07j42N60J092J259J879K955L209
$$ 173103 172883 171994 172845 175237 177066 177461 177263 177067 176760 176618 177178 178270 179529 181408 184363 187572
54875A87572K291J547J735J992J914K573M264N308M530L275L506N213P060Q382
$$ 187572 189863 191410 193145 195137 197051 199624 203888 209196 213726 217001 220507 225720 232780 241162
54861B41162R236R512R068Q112O706M685K415O04q71k725m642n488n356n745p094
$$ 241162 250398 259910 268978 277090 283796 288481 290896 291500 290629 287904 283262 277774 272418 266673 259579
54846B59579p988p552o804o644o325n093l788l274k700r51J091J465o6j611j478
$$ 259579 251591 244039 237235 230591 224266 219173 215385 212111 209411 208460 209551 211016 210950 209339 207861
54831B07861O7J532J920J485J139J471K514M192O243P679P447O178O058P885R541
$$ 207861 207928 209460 211380 212865 214004 215475 217989 222181 228424 236103 243550 249728 255786 263671 273212
54816B73212Q824O596N307N318M876L127Q54j483m175o692p873p863p964q506
$$ 273212 282036 288632 293939 299257 304133 307260 308114 306631 302456 295764 287891 280028 272064 263558
54802B63558q647q284q259q675q752q213p030m470n37K292J503j615l464l122
$$ 263558 254911 246627 238368 229693 220941 212728 205698 201228 200691 202983 204486 202871 199407 196285
54788A96285k731l149k862j639j404k475k638j215n03j468j677L67K143J016j677
$$ 196285 193554 190405 187543 185904 184500 182025 179387 178172 177669 176201 174524 174891 177034 178050 176373
54773A76373l098l045k835k279p31O00L21m97MJ363J803J255R53J068J002J119
$$ 176373 173275 170230 167395 165116 164385 164985 165306 164809 164813 166176 167979 169234 170187 171255 172257 173376
54757A73376J858K055N12j565j980q55j50l68o5J370K713L019K909L155L368K633
$$ 173376 175234 177289 177801 176236 174256 173401 173251 172883 172818 174188 176901 179920 182829 185984 189352 191985
54741A91985P07j682l205k729l78K272L554L100J689K67n67p03m86j29P47K203
$$ 191985 192692 191010 187805 185076 184698 186970 190524 193624 195313 195580 195013 194310 193824 193695 194442 196645
54725A96645L026K141P13R24K627L453K697K462L918N101M205K734L150N108O458
$$ 196645 199671 201812 202525 203449 206076 209529 212226 214688 218606 223707 227912 230646 233796 238904 245362
54710B45362O657O856P447P721P471P180P026O958P109O925N005J199k289l553
$$ 245362 252019 258875 266322 274043 281514 288694 295720 302678 309787 316712 321717 322916 320627 317074
54696C17074l609m584o386p218o663o036o047o148o013n907n532m211k287r74
$$ 317074 313465 308881 302495 295277 288614 282578 276531 270383 264370 258463 252931 248720 246433 245459
54682B45459p33q82q49p82r76j569k521l259k813j126M68R52J089K094L675M613
$$ 245459 244726 243844 242995 242213 241237 239668 237147 233888 231075 229949 230417 231369 232458 234552 238227 242840
54666B42840M682M665N004N622O638P909Q326O901M297K045M92j344l923o337
$$ 242840 247522 252187 257191 262813 269451 277360 285686 292587 296884 298929 299421 298077 294154 287817
54652B87817p485p253o454o047o334o668o206n008l831k921j972j347j855k966
$$ 287817 280332 273079 266625 260578 254244 247576 241370 236362 232531 229610 227638 226291 224436 221470
54638B21470k917j397m98j758l801m275k915j144J86J067J124k0j690k706k770
$$ 221470 218553 217156 216658 214900 211099 206824 203909 202765 202951 204018 205142 205122 203432 200726 197956
54623A97956k309j493l85O06J191J473J124o30l429n387n192l526j558M74K187
$$ 197956 195647 194154 193769 194375 195566 197039 198163 197533 194104 188717 183525 179999 178441 178915 181102
54608A81102K272L55j713k034r91k7O00J242J365L68j062k005k669l256k839r79
$$ 181102 183374 183729 182016 179982 178991 178964 179564 180806 182171 182539 181477 179472 176803 173547 170708 169729
54592A69729Q75J326J002R27N72m40n77J148K666J784J06P20K989L467J558L34
$$ 169729 170604 171930 172932 173859 174431 173991 173414 174562 177228 179012 179118 179838 182827 186294 187852 188186
54576A88186J408K648K023M75m07r35j882k518j789j95Q68Q13J5q81j288r35j72
$$ 188186 189594 192242 194265 194740 194333 193398 191516 188998 187209 187014 187882 188695 188710 187829 186541 185606 185434
54559A85434N36J270K123K455J720N40j67n39r81q86K62J306R23M7O31K411L273
$$ 185434 185970 187240 189363 191818 193538 194078 193911 193372 192391 191505 191767 193073 193996 194043 194674 197085 200358
54542B00358K715K363K870K779J147r09k165k884l472l255j721K40J322J253O80
$$ 200358 203073 205436 208306 211085 212232 211323 209158 206274 202802 199547 197826 198066 199388 200641 201321
54527B01321M04Q69J707J729K96j534k279k007j766j549n26R37J456Q72M92Q65
$$ 201321 201725 202594 204301 206030 206326 204792 202513 200506 198740 197191 196665 197602 199058 199930 200422 201287
54511B01287J078N64q1m70r51j339p36Q77K195K327J754J209Q26O27P34Q57O55
$$ 201287 202365 202929 202848 202378 201427 200088 199352 200229 202424 204751 206505 207714 208540 209167 209901 210758 211413
54494B11413N75J188J889J588M79l52p06j023q03P28K515K557R48j01M04J086
$$ 211413 211988 213176 215065 216653 217132 216780 216074 215051 214248 214976 217491 220048 220996 220895 221299 222385
54478B22385P76M4l38m50j77Q38J719R70q84j631j007j344l511m937l376k73J585
$$ 222385 223161 223205 222867 222417 222240 223078 224797 225767 224883 223252 222245 220901 217390 212453 209077 208804 210389
54461B10389J802J694J513P60l4k2J94m64j451j277J89J644K264K181J506L03
$$ 210389 212191 213885 215398 216158 216124 216102 216296 215832 214381 213104 213293 214937 217201 219382 220888 221191
54445B21191o40m93K99M58l27j083j033m08K87R56J602J921J555N51n66j194j037
$$ 221191 220551 220058 220357 220815 220488 219405 218372 217964 218251 219207 220809 222730 224285 224836 224270 223076 222039
54428B22039j17J509L543M843L940R76j614j585K56J080k86k190k750k001r49
$$ 222039 221922 223431 226974 231817 235757 236733 235119 233534 233790 234870 234584 232394 229644 227643 226694
54413B26694J8R88J869K632L468M151M066L219K499K477K710K493J608J04j800
$$ 226694 226712 227700 229569 232201 235669 239820 243886 247105 249604 252081 254791 257284 258892 258996 257196
54398B57196l355l659k583q33Q77J910J451o65l062m046l567k673j535L53K146
$$ 257196 253841 250182 247599 246766 247643 249553 251004 250339 247277 243231 239664 236991 235456 235809 237955
54383B37955K046J9j908k547k828l560l933l184k004j152k54R21J480R13K86O63
$$ 237955 240001 240020 238112 235565 232737 229177 225244 222060 220056 218904 218650 219571 221051 221964 222250 222913
54367B22913J478J579Q82l1r34j581j337k41N62M22L28J385L040L838L249J833
$$ 222913 224391 225970 226852 226821 225887 224306 222969 222728 223290 223712 224040 225425 228465 232303 235552 237385
54351B37385K96p48o64O60K555M197N060M675K975J014K42O59Q88M29L15J155
$$ 237385 237681 236933 236269 236929 239484 243681 248741 253416 256391 257405 257647 258306 259194 259623 259938 261093
54335B61093K056K317K577L318L643K670R51n43j640k209j548K19J372O81o91
$$ 261093 263149 265466 268043 271361 275004 277674 278625 278082 276442 274233 272685 272904 274276 274957 274266
54320B74266p00R02K690L687M045M053L681K965K114J320Q46Q44R49P45O05J150
$$ 274266 273566 274468 277158 280845 284890 288943 292624 295589 297703 299023 299869 300713 301662 302407 303012 304162
54304C04162J801J293l05j603k193l102m300m002j550R08J179k47j662k832m304
$$ 304162 305963 307256 306951 305348 303155 300053 295753 291751 290201 291109 292288 292041 290379 287547 283243
54289B83243n483n390m564m269m417l901k513j013K48J363J920J324q6j306j760
$$ 283243 277760 272370 267806 263537 259120 255219 252706 251693 251941 253304 255224 256548 256462 255156 253396
54274B53396j392k80J000J344M05o19l79R69K166K281J156p50k308k408j332n48
$$ 253396 252004 251724 252724 254068 254473 253854 253475 254444 256610 258891 260047 259297 256989 254581 253249 252701
54258B52701o46o75j1N47L12j63l62o66j075p55K37N10k82o63j58n09k329l063
$$ 252701 252055 251380 251369 251916 252228 252065 251703 251037 249962 249207 249444 249954 249672 249009 248851 248342 246013 242950
54240B42950q38J869J467j420l140k489j533j450r17J039L334M583M478L167J062
$$ 242950 242112 243981 245448 244028 240888 238399 236866 235416 234499 235538 238872 243455 247933 251100 252162
54225B52162n78o70M0K9n43k29J095K008J926J660J598J298R62J322J884J259
$$ 252162 251584 250914 250954 250983 250440 250211 251306 253314 255240 256900 258498 259796 260758 262080 263964 265223
54209B65223l97j221k68J401K659L520L972L429J998P39O7p31j768j874l31J959
$$ 265223 264826 263605 263337 264738 267397 270917 274889 278318 280316 281055 281122 280391 278623 276749 276418 278377
54193B78377L748M649M552L122P61j038j284p21p54j606k250j775m44N10N8j407
$$ 278377 282125 286774 291326 294448 295209 294171 292887 292166 291412 289806 287556 285781 285337 285847 285905 284498
54177B84498k357j977j219j342k091k329j955j870k300k458j949j306r63o58k2
$$ 284498 282141 280164 278945 277603 275512 273183 271228 269358 267058 264600 262651 261345 260382 259724 259702
54162B59702Q40J497J447N40m53m75J76o5j441j873j16J648O18k233l299j466
$$ 259702 260542 262039 263486 264026 263573 263098 263274 263209 261768 259895 259779 261427 262045 259812 256513 255047
54146B55047P24J182P00N98M94k16p61l97j2p88k181k567j348N02J670J640R10
$$ 255047 255771 256953 257653 258251 258745 258529 257768 257371 257359 256571 254390 251823 250475 250977 252647 254287 255197
54129B55197M43P25J365J843K228K580K322J252M89J011J780J064o99j264J06
$$ 255197 255640 256365 257730 259573 261801 264381 266703 267955 268444 269455 271235 272299 271600 270336 270442
54114B70442J642J864J471J632K045J718N99o27j590k287k655k605k151j391p51
$$ 270442 272084 273948 275419 277051 279096 280814 281413 280786 279196 276909 274254 271649 269498 268107 267356
54099B67356j051k455l714l399j697L1J041J389R06l97j344q06L62N04l1N84K327
$$ 267356 266305 263850 260136 256737 255040 255071 256112 257501 258407 258010 256666 255860 256222 256726 256695 257279 259606
54082B59606L086K148J366J964K647K104J152R28R45N40N77J796K938K357N56
$$ 259606 262692 264840 266206 268170 270817 272921 274073 275001 275946 276486 277063 278859 281797 284154 284710
54067B84710n76l70L13P84J133J587K269L201L853L444K267J715K218K476J614
$$ 284710 284134 283764 284077 284861 285994 287581 289850 293051 296904 300348 302615 304330 306548 309024 310638
54052C10638O77P00P47m10j897k004j029p32j407j647r33m47q94j392j186j001
$$ 310638 311315 312015 312762 312352 310455 308451 307422 306690 305283 303636 302703 302256 301362 299970 298784 297783
54036B97783j768l007l409k472q61M50R18N78o6l90q7P50J860K897L372L012K176
$$ 297783 296015 293008 289599 287127 286266 286716 287634 288212 288146 287756 287669 288419 290279 293176 296548 299560 301736
54019C01736J666J917K615L175L398L443L411L198K823K561K522K342J711J029
$$ 301736 303402 305319 307934 311109 314507 317950 321361 324559 327382 329943 332465 334807 336518 337547
54005C37547R07J035M40q29j253P4J796J892L96o89j00J399K468K724K549K363
$$ 337547 338454 339489 339929 339100 337847 337921 339717 341609 342005 341316 341216 342615 345083 347807 350356 352719
53989C52719K504L122L843M104L974L980M174M114L924M490O337Q801J0554J0669
$$ 352719 355223 358345 362188 366292 370266 374246 378420 382534 386458 390948 397285 406086 416640 427309
53975D27309R364Q123Q569J0573J2098J1832J1048J1484J2264J0991P626M846
$$ 427309 436673 444796 453365 463938 476036 487868 498916 510400 522664 533655 541281 546127
53963E46127M270M627M352L790L620L119J624J69j29k89k135n345p488o990m841
$$ 546127 550397 555024 559376 563166 566786 569905 571529 571698 571569 571280 569145 563800 556312 549322 544481
53948E44481l279l615n391p040p403o807o492o869p085o428n331m440l540k229
$$ 544481 541202 537587 532196 525156 517753 510946 504454 497585 490500 484072 478741 474301 470761 468532
53934D68532r98p81j707k855l106j898L80K575L726M077M619N621O352O292N636
$$ 468532 467534 466753 465046 462191 459085 457187 457567 460142 463868 467945 472564 478185 484537 490829 496465
53919D96465M284J479k804p102r850j1004j1414j1224r771o933l890k290k716
$$ 496465 500749 502228 499424 492322 482472 471468 460054 448830 439059 432126 428236 425946 423230
53906D23230l918l840j811N85J378M96o33j207j491j460o37N96J176J207K097
$$ 423230 419312 415472 413661 414246 415624 416120 415487 414280 412789 411329 410692 411288 412464 413671 415768
53891D15768M244O038O068N001M408M684N175N531N965O644P488Q153Q168P620
$$ 415768 420012 426050 432118 437119 441527 446211 451386 456917 462882 469526 477014 485167 493335 500955
53877E00955P557Q606R441Q188N458M082N244O843O568M887L710L689M365N794
$$ 500955 508512 517118 526559 534747 540205 544287 549531 556374 562942 567829 571539 575228 579593 585387
53863E85387Q311J1247J3151J3087J1162Q493P023Q177J1010J2916J2801J2225
$$ 585387 593698 604945 618096 631183 642345 650838 657861 666038 677048 689964 702765 714990
53851G14990J2656J3276J2648J0996R344P693N683L961L334L325K935K082J117
$$ 714990 727646 740922 753570 764566 773910 781603 787286 791247 794581 797906 800841 802923 804040
53838H04040k31k167m060n557p390r787j1263j0616r114q943j0300j1693j2497
$$ 804040 803809 801642 797582 792025 784635 774848 763585 752969 743855 734912 724612 712919 700422
53825G00422j3382j4648j5717j6076j5455j3554j0771q606q097q497q636q721
$$ 700422 687040 672392 656675 640599 625144 611590 600819 592213 584116 575619 566983 558262
53813E58262r445j0279j0242r569r102q775q253q067q378p758n250k719k719m744
$$ 558262 548817 538538 528296 518727 509625 500850 492597 484530 476152 468394 463144 460425 457706 452962
53799D52962o078n827n373n115l928k139j973l936n446m514k531j791k070j657
$$ 452962 446884 441057 435684 430569 426641 424502 422529 418593 413147 408633 406102 404311 402241 400584
53785D00584m88j67j351k752k813j323P75K332K623J530l93k032k157m10K004
$$ 400584 400096 399929 398578 395826 393013 391690 392465 394797 397420 398950 398557 396525 394368 393958 395962
53770C95962L168K421Q79k17q89j492j518m56R85J683J616J402J034L17j9Q72
$$ 395962 399130 401551 402430 402213 401324 399832 398314 397858 398843 400526 402142 403544 404578 404895 404876 405748
53754D05748K533L929N057O323O994O080M500M335N887P317P433P158P769R119
$$ 405748 408281 412210 417267 423590 430584 436664 441164 445499 451386 458703 466136 473294 481063 490182
53740D90182J0112R891Q440O925P092R180J0859R835P050N503O180P321P479O917
$$ 490182 500294 510185 518625 525550 532642 541822 552681 562516 569566 575069 581249 588570 596049 602966
53726F02966N791L553Q30n44m06r86l476o049o651n927n664o024o131o212p158
$$ 602966 608757 612310 613140 612596 612190 611204 607728 601679 595028 589101 583437 577413 571282 565070 557912
53711E57912q729r880j0284j0226r547q110o781o545o968o819n951n418n755o260
$$ 557912 549183 539303 529019 518793 509246 501136 494355 487810 480842 474023 468072 462654 456899 450639
53697D50639o079n182m141l487l412l703l916l696k920j590oJ020Q08j85p25l40
$$ 450639 444560 439378 435237 431750 428338 424635 420719 417023 414103 412513 412507 413527 414335 414150 413425 413085
53681D13085J99J48k62n74r41j582k127k115j741j489j382j054l12P30J781K570
$$ 413085 413284 413432 413170 412596 411655 410073 407946 405831 404090 402601 401219 400165 399853 400583 402364 404934
53665D04934L177M035N089N226L468P23q77n56L80P49J053K119L406L810L378
$$ 404934 408111 412146 417235 422461 425929 426652 425775 425219 425599 426348 427401 429520 432926 436736 440114
53650D40114L037L198L581M021M467M474L747L072L740N766P427P112N329M346
$$ 440114 443151 446349 449930 453951 458418 462892 466639 469711 473451 479217 486644 493756 499085 503431
53636E03431N692Q255R379P890N427M342M891N373M474K460K44j479k082j326
$$ 503431 509123 517378 526757 534647 540074 544416 549307 554680 559154 561614 561858 560379 558297 556971
53622E56971j33O3q46j439q64l7r8o68n11O56J854J975P33j174k467k368j520
$$ 556971 556838 556901 556055 554616 553752 553715 553617 552949 552438 553094 554948 556923 557656 556482 554015 551647 550127
53605E50127j293j949k235j117Q88K568L308L072J965O01J99J337K972L466K387
$$ 550127 548834 546885 544650 543533 544421 546989 550297 553369 555334 555935 556134 557471 560443 563909 566296
53590E66296P31m01p00m28J83J065K119K984L237K972K859L308L930M300M675
$$ 566296 567027 566626 565926 565498 565681 566746 568865 571849 575086 578058 580917 584225 588155 592455 597130
53575E97130N176M965L471J944K114L429L500J577l55n75J67O04J211K919M716
$$ 597130 602306 607271 610742 612686 614800 618229 621729 623306 622951 622376 622543 623147 624358 627277 631993
53560F31993M637K643R72J473L706N647N763M432L646M867P009P497N595L576
$$ 631993 636630 639273 640245 641718 645424 651071 656834 661266 664912 669779 676788 684285 689880 693456
53546F93456L727N542O922P017O432N486M063K727K302K398J777K61j007j266
$$ 693456 697183 702725 709647 716664 723096 728582 732645 735372 737674 740072 741849 742110 741103 739837
53532G39837q46m7J335K887L179J361j466l297l293k315j647j721k106k239j930
$$ 739837 738991 738944 740279 743166 746345 747706 746240 742943 739650 737335 735688 733967 731861 729622 727692
53517G27692j387j099j630l059m338l871j428J007J250m78k052k416k550l174
$$ 727692 726305 725206 723576 720517 716179 712308 710880 711887 713137 712659 710607 708191 705641 702467
53503G02467l214j576Q70K369K527K207J955J787J936K491K666J790P03Q66K265
$$ 702467 699253 697677 698547 700916 703443 705650 707605 709392 711328 713819 716485 718275 718978 719844 722109
53488G22109L544M104M665N542N888N238M536M868O020P113P888Q598R164R335
$$ 722109 725653 729757 734422 739964 745852 751090 755626 760494 766514 773627 781515 790113 799277 808612
53474H08612R306R490R896J0474J1803J4441J7589J9393J9101J8126J8283J9608
$$ 808612 817918 827408 837304 847778 859581 874022 891611 911004 930105 948231 966514 986122
53462I86122K0784K1298K1948K3174K4299K4878K5687K7407K9344L0547L1522
$$ 986122 1006906 1028204 1050152 1073326 1097625 1122503 1148190 1175597 1204941 1235488 1267010
53451A267010L3484L6276L8389L8978L8614L8078L7612L7437L7826L8390L8444
$$ 1267010 1300494 1336770 1375159 1414137 1452751 1490829 1528441 1565878 1603704 1642094 1680538
53440A680538L8199L8427L8738L7637L4803L1991L0940L1449L2276L2745L2636
$$ 1680538 1718737 1757164 1795902 1833539 1868342 1900333 1931273 1962722 1994998 2027743 2060379
53429B060379L1633K9983K8964K9579L1200L2212L1587K9430K6687K4795K4759
$$ 2060379 2092012 2121995 2150959 2180538 2211738 2243950 2275537 2304967 2331654 2356449 2381208
53418B381208K5887K6232K4890K2893K1287J9521J6721J3352J0425P876N056K073
$$ 2381208 2407095 2433327 2458217 2481110 2502397 2521918 2538639 2551991 2562416 2570292 2575348 2577421
53406B577421o51l495p091j1079j4545j7212j9155j9940j9318j8325j8389j9636
$$ 2577421 2576770 2573275 2566184 2555105 2540560 2523348 2504193 2484253 2464935 2446610 2428221 2408585
53394B408585k1198k2828k4979k7517k9608l0734l0841k9746k7517k5134k3618
$$ 2408585 2387387 2364559 2339580 2312063 2282455 2251721 2220880 2191134 2163617 2138483 2114865
53383B114865k2612k0904j8247j5576j3536j1891j0291q692p004n241l821k862
$$ 2114865 2092253 2071349 2053102 2037526 2023990 2012099 2001808 1993116 1986112 1980871 1977050 1974188
53371A974188j503R85L851N792O995Q847J1779J4719J6757J8048J9037K0031K1715
$$ 1974188 1972685 1973670 1977521 1983313 1990308 1999155 2010934 2025653 2042410 2060458 2079495 2099526 2121241
53358B121241K4707K8381L1264L2947L4444L6463L8601M0494M2460M4501M5925
$$ 2121241 2145948 2174329 2205593 2238540 2272984 2309447 2348048 2388542 2431002 2475503 2521428
53347B521428M6597M7551M9679N2642N5633N8375O0845O2922O4859O7338P0506
$$ 2521428 2568025 2615576 2665255 2717897 2773530 2831905 2892750 2955672 3020531 3087869 3158375
53336C158375P3674P6409P9028Q1562Q3161Q3315Q2797Q2611Q2657Q2298Q1541
$$ 3158375 3232049 3308458 3387486 3469048 3552209 3635524 3718321 3800932 3883589 3965887 4047428
53325D047428Q0798P9822P7871P4733P0853O6595O1988N7172N2476M8024M3584
$$ 4047428 4128226 4208048 4285919 4360652 4431505 4498100 4560088 4617260 4669736 4717760 4761344
53314D761344L8799L3220K6359J8185R575J791m790j1269j9201k8820l8424m5880
$$ 4761344 4800143 4833363 4859722 4877907 4887482 4889273 4884483 4873214 4854013 4825193 4786769 4740889
53302D740889n0931n5487o1255o7488p1740p2770p2041p2134p4171p6938p8208
$$ 4740889 4689958 4634471 4573216 4505728 4433988 4361218 4289177 4217043 4142872 4065934 3987726
53291C987726p6787p3471p0077o7551o5422o3237o1724o1740o2630o2737o1405
$$ 3987726 3910939 3837468 3767391 3699840 3634418 3571181 3509457 3447717 3385087 3322350 3260945
53280C260945n9465n7696n5879n3517n0577m7233m3681m0474l8140l6238l3584
$$ 3260945 3201480 3143784 3087905 3034388 2983811 2936578 2892897 2852423 2814283 2778045 2744461
53269B744461k9842k6005k3112k1331k0700k1641k3924k6046k6595k5712k4472
$$ 2744461 2714619 2688614 2665502 2644171 2623471 2601830 2577906 2551860 2525265 2499553 2475081
53258B475081k3368k2252k1191k0358j9347j7686j5934j5214j5446j4884j1998
$$ 2475081 2451713 2429461 2408270 2387912 2368565 2350879 2334945 2319731 2304285 2289401 2277403
53247B277403p333l098j047r09q35P34L644O481Q425J0198J2869J6215J9057K1060
$$ 2277403 2270070 2266972 2265925 2265016 2264181 2264915 2268559 2275040 2283465 2293663 2306532 2322747 2341804 2362864
53233B362864K3255K6422K9737L1745L2188L2032L1859L1206K9767K8291K7541
$$ 2362864 2386119 2412541 2442278 2474023 2506211 2538243 2570102 2601308 2631075 2659366 2686907
53222B686907K6977K5317K2209J8593J5374J2566R778O786L312j055o207j1248
$$ 2686907 2713884 2739201 2761410 2780003 2795377 2807943 2817721 2824507 2827819 2826764 2820557 2809309
53210B809309j5312j8359k0891k3280k5704k8295l0967l3461l5749l7993l9914
$$ 2809309 2793997 2775638 2754747 2731467 2705763 2677468 2646501 2613040 2577291 2539298 2499384
53199B499384m0887m1047m1506m2908m4432m4942m4498m3890m3304m2442m1524
$$ 2499384 2458497 2417450 2375944 2333036 2288604 2243662 2199164 2155274 2111970 2069528 2028004
53188B028004m1142m1214m1029m0255l9194l8138l7213l6533l5927l4739l2720
$$ 2028004 1986862 1945648 1904619 1864364 1825170 1787032 1749819 1713286 1677359 1642620 1609900
53177A609900l0812l0062l0113k9707k8465k7019k5597k3717k1335j9155j7599
$$ 1609900 1579088 1549026 1518913 1489206 1460741 1433722 1408125 1384408 1363073 1343918 1326319
53166A326319j6566j6319j7381j9217k0188j9484j8157j7718j8498j9941k1587
$$ 1326319 1309753 1293434 1276053 1256836 1236648 1217164 1199007 1181289 1162791 1142850 1121263
53155A121263k3124k4049k4029k3371k2732k2519k2646k2469k1161j8752j6697
$$ 1121263 1098139 1074090 1050061 1026690 1003958 981439 958793 936324 915163 896411 879714
53144H79714j6390j7176j6965j5157j3616j4155j6192j7768j7945j7235j6368
$$ 879714 863324 846148 829183 814026 800410 786255 770063 752295 734350 717115 700747
53133G00747j5708j5419j5237j4354j2448j0550j0050j0883j1569j1086r933r111
$$ 700747 685039 669620 654383 640029 627581 617031 606981 596098 584529 573443 563510 554399
53121E54399q705q002o724n508n018m947m391l189k253k260k639k498k054k245
$$ 554399 545694 537692 530968 525460 520442 515495 511104 507915 505662 503402 500763 498265 496211 493966
53107D93966l167l946m167m314m601m372l305k265k279l197l985l974l267k299
$$ 493966 490799 486853 482686 478372 473771 469399 466094 463829 461550 458353 454368 450394 447127 444828
53093D44828j507j198j377j745j961j731q18N30J350R92K84O21J785J871m7k396
$$ 444828 443321 442123 440746 439001 437040 435309 434491 435021 436371 437363 437647 438268 440053 441924 441877 439481
53077D39481l065j937m07Q07K054L347L958L601L018K961L222L113K566K347L080
$$ 439481 436416 434479 434072 434879 436933 440280 444238 447839 450857 453818 457040 460153 462719 465066 468146
53062D68146M227M406K974J016J71P13J512J837K150K853L376L246L044L265L028
$$ 468146 472373 476779 479753 480769 480940 481653 483165 485002 487152 490005 493381 496627 499671 502936 505964
53047E05964J173j765l896m328m035m196m708m781m284l815l784l964l909l449
$$ 505964 507137 505372 501476 497148 493113 488917 484209 479428 475144 471329 467545 463581 459672 456223
53033D56223k741k054j626j613j956k214j857r52l07m97r95q88l66o46k160l678
$$ 456223 453482 451428 449802 448189 446233 444019 442162 441210 440903 440406 439411 438523 438157 437511 435351 431673
53017D31673l735k312o02L81L33o12j845k321j497k75k10j707l590m605m624m103
$$ 431673 427938 425626 425024 425405 425738 425126 423281 420960 419463 419188 418978 417271 413681 409076 404452 400349
53001D00349l015j003J543L333L269J560m79j505j015M72J763J852R09K86R59
$$ 400349 397334 396331 397874 401207 404476 406036 405557 404052 403037 403509 405272 407124 408033 408319 409278
52986D09278K137K297J551J746L604N056L753L56k160k135o29O60J255J373J106
$$ 409278 411415 413712 415263 417009 420613 425669 429422 429778 427618 425483 424854 425514 426769 428142 429248
52971D29248P47Q15J115P79j48l04R85K282J758l75k186k426j602q75p34p80l23
$$ 429248 429995 430810 431925 432704 432556 432252 433237 435519 437277 436902 434716 432290 430688 429813 429079 428299 427976
52954D27976Q55K066K252J193k32j134j384j077l2J560K702K597J665Q44L91J09
$$ 427976 428831 430897 433149 434342 434110 432976 431592 430515 430483 432043 434745 437342 439007 439851 440242 440351
52938D40351K73J332K770L228J893p07l229m262k952K36L299M247L188K180K649
$$ 440351 440624 441956 444726 447954 449847 449140 445911 441649 438697 438933 442232 446479 449667 451847 454496
52923D54496L675L483J970P71Q79J413J225P30J080K075K269J249L73P15J466
$$ 454496 458171 461654 463624 464395 465274 466687 467912 468642 469722 471797 474066 475315 475688 476403 477869
52908D77869J448J063J419K269K371J590J009J055J021N44Q9k90j197k488l098
$$ 477869 479317 480380 481799 484068 486439 488029 489038 490093 491114 491658 491747 491457 490260 487772 484674
52893D84674k830k829l585l892k709q00N51J263J678J196q61l502m711l668j450
$$ 484674 481844 479015 475430 471538 468829 468029 468580 469843 471521 472717 471856 468354 463643 459975 458525
52878D58525L06Q01M42M00J444K815K897J366k14n14j03r4k37L78J522K087J654
$$ 458525 458831 459632 460074 460474 461918 464733 467630 468996 468782 468268 468165 468071 467834 468212 469734 471821 473475
52861D73475O50o85k250l413l503k716j659l79J123J995J398l5r16r64r33r68
$$ 473475 474125 473440 471190 467777 464274 461558 459899 459520 460643 462638 464036 464001 463085 462121 461188 460220
52845D60220n47j4n21k057k897j756N40K146K237J282Pj238k205k464j589L08
$$ 460220 459673 459659 459138 457081 454184 452428 452968 455114 457351 458633 458640 457402 455197 452733 451144 451452
52829D51452K267L081K510J524J044R17O42M74R84J824J998J256M24K03L26J42
$$ 451452 453719 456800 459310 460834 461878 462795 463437 463911 464895 466719 468717 469973 470397 470600 470926 471068
52813D71068m00m78Q62L444N403M752J830o61p52M92P78l06j334j629k065l199
$$ 471068 470668 470190 471052 474496 479899 484651 486481 485820 485068 485560 486338 486032 484698 483069 481004 477805
52797D77805m188m066l069k197k128k934m227n289n513m922m038l218k498j839
$$ 477805 473617 469551 466482 464285 462157 459223 454996 449707 444194 439272 435234 432016 429518 427679
52783D27679j146k80M82M15o48j780k076j854j950k301k163j373m57L45J154J723
$$ 427679 426533 426253 426735 427150 426502 424722 422646 420792 418842 416541 414378 413005 412548 412893 414047 415770
52767D15770J570Q28J67l8R0L26M12J24j90J93J081J270N83P02K593M335L517
$$ 415770 417340 418168 418335 418297 418387 418713 419125 419249 419059 419252 420333 421603 422186 422888 425481 429816 433333
52750D33333R20m96J64Q96J79j275k499l698m879n036l741k046r36k82P6l14j282
$$ 433333 434253 433757 433921 434817 434996 433721 431222 427524 422645 417609 413868 411822 410886 410604 410680 410366 409084
52733D09084j698j155o63q68j045o63m94j069j361l19J390K311K012J054j4o43
$$ 409084 407386 406231 405568 404700 403655 402992 402498 401429 400068 399749 401139 403450 405462 406516 406502 405859
52717D05859k97O70J008K19p54j199j650k329k108l59J528K077J904K189K222
$$ 405859 405562 406232 407240 407459 406705 405506 403856 401527 399419 399060 400588 402665 404569 406758 408980
52702D08980P11j226j032J375L082K140j8r52l56M33P77J233K209L291L976M359
$$ 408980 409691 408465 407433 408808 411890 414030 414012 413060 412704 413137 413914 415147 417356 420647 424623 428982
52686D28982M828N319N180L950K207J151J184J475J284J082J590K273J866K54
$$ 428982 433810 439129 444309 448259 450466 451617 452801 454276 455560 456642 458232 460505 462371 462625
52672D62625j191j365p70o86j541k483k357r33P69J397N89p16j337r51p1O06N55
$$ 462625 461434 460069 459299 458613 457072 454589 452232 451299 452068 453465 454054 453338 452001 451050 450979 451585 452140
52655D52140l19j342j470m37Q37J487J659J694J129l65j652j158Q11K120J490
$$ 452140 451821 450479 449009 448572 449409 450896 452555 454249 455378 455013 453361 452203 453014 455134 456624
52640D56624o2q91q37q83j459k013j989j511j036q32q00o58k72J94M75N40M67
$$ 456624 456562 455671 454834 453951 452492 450479 448490 446979 445943 445111 444311 443653 443381 443575 444050 444590 445057
52623D45057K02k26l59J91Q69O57k88m63Q50K132J457o76j822r39K57j3j037r80
$$ 445057 445259 445033 444674 444865 445734 446391 446103 445640 446490 448622 450079 449403 447581 446642 446899 446886 445849 444869
52605D44869J17N64L8L46K575M963N065L118J728K451M076M631L904L206L280
$$ 444869 444986 445550 445588 445934 448509 453472 458537 461655 463383 465834 469910 474541 478445 481651 484931
52590D84931L409K613R87m88j215j581k146k774k950k763k772k918k367q79M66
$$ 484931 488340 490953 491940 491452 490237 488656 486510 483736 480786 478023 475251 472333 469966 469087 469553
52575D69553N10m51j109p03O22K655N238P575Q367P069M542K120L19j289l169
$$ 469553 470063 469612 468503 467800 468422 471077 476315 483890 492257 499326 503868 505988 506307 505018 501849
52560E01849m911n375l960j751p08j364j993p93J753L590L651K592J291j27j627
$$ 501849 496938 491563 487603 485852 485144 483780 481787 480994 482747 486337 489988 492580 493871 493744 492117
52545D92117k713k888k093o39O88P90n04j619q93J052J941R84j60j3O47L21r05
$$ 492117 489404 486516 484423 483784 484472 485262 484758 483139 482246 483298 485239 486223 486063 486050 486697 487018 486113
52528D86113j720j531q27q3P50J764K793L494L374J999l75k682l821l445j938
$$ 486113 484393 482862 482035 481952 482702 484466 487259 490753 494127 496126 495751 493069 489248 485803 483865
52513D83865j06J106J152L33o45j476k067j961r58r7o04j854j855k29R43mk058
$$ 483865 483759 484865 486017 486350 485705 484229 482162 480201 479243 479146 478542 476688 474833 474604 475547 475543 473485
52496D73485l167k796j716l59J119J996J670O88j6m54j021j296o76L35P78Q48
$$ 473485 470318 467522 465806 465447 466566 468562 470232 470920 470904 470450 469429 468133 467457 467792 468570 469418
52480D69418J512K714L369L038K355J695P88k23n37O1P84J058J204J449J196O9
$$ 469418 470930 473644 477013 480051 482406 484101 484889 484666 484129 484190 484974 486032 487236 488685 489881 489950
52464D89950r92o43J129K887L390K806K125J777J317L88m97n78N1N35M10J62M62
$$ 489950 488958 488315 489444 492331 495721 498527 500652 502429 503746 504134 503637 503059 503110 503645 504055 504217 504679
52447E04679J430K729L894M374L793K381O98j125l189m832m949l613k321j955
$$ 504679 506109 508838 512732 517106 520899 523280 523978 522853 519664 514832 509883 506270 503949 501994
52433E01994j610l43R66P57p72j821j396m03k72j253k335k371j291k64k51n32
$$ 501994 500384 500041 501007 501764 500992 499171 497775 497372 497100 495847 493512 491141 489850 489586 489335 488803
52417D88803L95K234K766J166l24M20J972J440q29j464J015M189N401N024M783
$$ 488803 489198 491432 494198 495364 495040 495460 497432 498872 498043 496579 497594 501783 507184 512208 516991
52402E16991M776M013K617J590R79J4j199j694j385j457k599l967m417l978l416
$$ 516991 521767 525780 528397 529987 530966 530980 529781 528087 526702 525245 522646 518679 514262 510284 506868
52387E06868k878j870m03O26M63n73j443j378l33J051J644N30j847l576l191j440
$$ 506868 503990 502120 501717 502343 502806 502233 500790 499412 499079 500130 501774 502304 500457 496881 493690 492250
52371D92250l09l31j33J224K734L047K391J935K053K348K747L354L599K813J525
$$ 492250 491941 491610 491477 492701 495435 498482 500873 502808 504861 507209 509956 513310 516909 519722 521247
52356E21247J027J672K578L098L528M141M617M772M974N350N421N140N496P244
$$ 521247 522274 523946 526524 529622 533150 537291 541908 546680 551654 557004 562425 567565 573061 580305
52342E80305R350R681P266L262l87k665l560l184j694k9K63j461m017n529n230
$$ 580305 589655 599336 606602 609864 609477 606812 603252 600068 598374 598345 598608 597147 593130 587601 582371
52327E82371l600j237J444L555L928K364N9j635k277k095j405m87O36K377M796
$$ 582371 578771 577534 578978 582533 586461 588825 588884 587249 584972 582877 581472 580985 581621 583998 588794
52312E88794O647O461M802M079N396P009O859N428M655M948M770K942N8k337l069
$$ 588794 595441 601902 606704 610783 616179 623188 630047 635475 640130 645078 649848 652790 652848 650511 647442
52297F47442k012q9J509K501L501M692N413N513N797O464O411N183M268M995O361
$$ 647442 645430 645341 646850 649351 652852 657544 662957 668470 674267 680731 687142 692325 696593 701588 707949
52282G07949O616N992O028O958P800Q423R529J0908J1754J2417J3799J5157J4791
$$ 707949 714565 720557 726585 733543 741343 749766 759295 770203 781957 794374 808173 823330 838121
52269H38121J3118J2837J5413J9319K2368K4042K4844K5085K5238K6041K7407
$$ 838121 851239 864076 879489 898808 921176 945218 970062 995147 1020385 1046426 1073833
52258A073833K8378K8704K9189K9988L0183K9674K9855L1469L3262L3892L3791
$$ 1073833 1102211 1130915 1160104 1190092 1220275 1249949 1279804 1311273 1344535 1378427 1412218
52247A412218L3963L4194L3840L3405L3906L5205L6201L6213L5205L3197L0480
$$ 1412218 1446181 1480375 1514215 1547620 1581526 1616731 1652932 1689145 1724350 1757547 1788027
52236A788027K7950K6216K4544K1545J6823J1439O973M340L148J986j48k655m277
$$ 1788027 1815977 1842193 1866737 1888282 1905105 1916544 1923517 1927857 1931005 1932991 1932843 1930188 1925911
52223A925911n180o777r196j0488r296o823m957l722k150o25l11p23J02K769N574
$$ 1925911 1920731 1913954 1904758 1894270 1884974 1878151 1873194 1869472 1867322 1866697 1866386 1865663 1865765 1868534 1874108
52208A874108O920P281Q145J0099J2642J5122J7020J7964J8319J9294K1621K4203
$$ 1874108 1881028 1888309 1896454 1906553 1919195 1934317 1951337 1969301 1987620 2006914 2028535 2052738
52196B052738K5005K3506K1530K1216K2607K3805K3266K1164J8530J5814J2754
$$ 2052738 2077743 2101249 2122779 2143995 2166602 2190407 2213673 2234837 2253367 2269181 2281935
52185B281935R122N168J416j758m553p652j1259j4420j6133j7057j8833k1551
$$ 2281935 2291057 2296225 2297641 2295883 2291330 2283678 2272419 2257999 2241866 2224809 2205976 2184425
52173B184425k3372k3386k3075k3799k4543k3872k2616k2332k2437k1507k0448
$$ 2184425 2161053 2137667 2114592 2090793 2066250 2042378 2019762 1997430 1974993 1953486 1933038
52162A933038k1240k2867k2009j8237j5087j4754j4912j2670q924o484n942n815
$$ 1933038 1911798 1888931 1866922 1848685 1833598 1818844 1803932 1791262 1782338 1775854 1769912 1764097
52150A764097n281m366k631mJ923J627J67q2J211K240K152K302M105O987Q939
$$ 1764097 1758816 1754450 1751819 1751815 1753738 1755365 1755532 1755450 1756661 1758901 1761053 1763355 1767460 1774447 1783386
52135A783386Q442N890L583L655N462O011L931J641J991M030M348J895j134l049
$$ 1783386 1791828 1797718 1801301 1804956 1810418 1816429 1820360 1822001 1823992 1828022 1832370 1834265 1833131 1830082
52121A830082m719p238r738j0761j0218q981p655o759p036q523r940r925q429
$$ 1830082 1825363 1818125 1808387 1797626 1787408 1778427 1770772 1764013 1756977 1748454 1738514 1728589 1720160
52108A720160o360m298k327o48L61O92Q92J557K783L962M308L761L214L466M149
$$ 1720160 1713800 1709502 1707175 1706527 1706888 1707580 1708472 1710029 1712812 1716774 1721082 1724843 1728057 1731523 1735672
52093A735672M201L303K227J858K406L590M945N885O082N907O027O462O565O013
$$ 1735672 1739873 1743176 1745403 1747261 1749667 1753257 1758202 1764087 1770169 1776076 1782103 1788565 1795130 1801143
52079A801143N250M772M517M247M169M857O688R475J2539J5122J6889J8044J8961
$$ 1801143 1806393 1811165 1815682 1819929 1824098 1828955 1835643 1845118 1857657 1872779 1889668 1907712 1926673
52066A926673K0039K2005K5689L0921L6039L9261M0465M0961M1738M2657M3313
$$ 1926673 1946712 1968717 1994406 2025327 2061366 2100627 2141092 2182053 2223791 2266448 2309761
52055B309761M3719M3849M3205M1403L8752L5951L3442L1348K9799K8865K8184
$$ 2309761 2353480 2397329 2440534 2481937 2520689 2556640 2590082 2621430 2651229 2680094 2708278
52044B708278K7007K4947K2668K1364K1150K0343J7130J1817O471K170k136p404
$$ 2708278 2735285 2760232 2782900 2804264 2825414 2845757 2862887 2874704 2881175 2883345 2881209 2873805
52032B873805j2494j5724j7494j9702k2857k5463k6318k5913k5198k4363k3487
$$ 2873805 2861311 2845587 2828093 2808391 2785534 2760071 2733753 2707840 2682642 2658279 2634792
52021B634792k3041k2993k2344k0482j8224j6674j5727j4558j2901j0872q057
$$ 2634792 2611751 2588758 2566414 2545932 2527708 2511034 2495307 2480749 2467848 2456976 2448919
52010B448919m080K05L410N546Q042J1455J4518J6113J7132J9170K2007K3781
$$ 2448919 2444839 2445044 2448454 2454000 2462042 2473497 2488015 2504128 2521260 2540430 2562437 2586218
51998B586218K3574K2579K2333K2933K3407K3012K1358J8042J3172P964L855J046
$$ 2586218 2609792 2632371 2654704 2677637 2701044 2724056 2745414 2763456 2776628 2784592 2788447 2789493
51986B789493j409m217p336j0711j4490j8266k1044k2410k3097k3892k4716k5323
$$ 2789493 2788084 2783867 2776531 2765820 2751330 2733064 2712020 2689610 2666513 2642621 2617905 2592582
51974B592582k6267k8277l0881l2531l2288l0948l0199l0832l1968l2129l0945
$$ 2592582 2566315 2538038 2507157 2474626 2442338 2411390 2381191 2350359 2318391 2286262 2255317
51963B255317k9554k9094k9307k9126k8423k8173k8798k9213k8155k5819k3622
$$ 2255317 2225763 2196669 2167362 2138236 2109813 2081640 2052842 2023629 1995474 1969655 1946033
51952A946033k2599k2577k2716k2440k1900k1759k2539k4032k5572k6793k7848
$$ 1946033 1923434 1900857 1878141 1855701 1833801 1812042 1789503 1765471 1739899 1713106 1685258
51941A685258k8860k9516k9361k8183k6270k4390k3359k3137k2755k1664k0750
$$ 1685258 1656398 1626882 1597521 1569338 1543068 1518678 1495319 1472182 1449427 1427763 1407013
51930A407013k1036k1897k1780k0600j9964k0852k2467k3704k4364k4381k3362
$$ 1407013 1385977 1364080 1342300 1321700 1301736 1280884 1258417 1234713 1210349 1185968 1162606
51919A162606k1629k0377j9875j8853j6609j4452j3710j3494j1894q545m609r91
$$ 1162606 1140977 1120600 1100725 1081872 1065263 1050811 1037101 1023607 1011713 1003168 998559 997568
51907I97568K009L936M612M964N943P037P079O178N438N165M784M272M183M386
$$ 997568 999577 1003513 1008125 1013089 1019032 1026069 1033148 1039326 1044764 1049929 1054713 1058985 1063168 1067554
51893A067554M339M541O160R081J1973J4500J7814K2416K7002L0179L1797L1636
$$ 1067554 1071893 1076434 1082594 1091675 1103648 1118148 1135962 1158378 1185380 1215559 1247356 1278992
51881A278992K8240K0630J0562J526m357p562r427j0462j0775j1130j2583j5112
$$ 1278992 1307232 1327862 1338424 1339950 1335593 1328031 1318604 1308142 1297367 1286237 1273654 1258542
51869A258542j7442j8558j8874j9496k0744k2147k3530k5078k6315k6169k4568
$$ 1258542 1241100 1222542 1203668 1184172 1163428 1141281 1117751 1092673 1066358 1040189 1015621
51858A015621k2903k2322k2303k1568j9597j6671j3339j0596r518r768r372p117
$$ 1015621 992718 970396 948093 926525 906928 890257 876918 866322 856804 847036 837664 830547
51846H30547m210k279q47J452L886M122J718j044k228k513l610n886q397j0252
$$ 830547 826337 824058 823211 824663 828549 832671 834389 833345 831117 828604 824994 819108 810711 800459
51832H00459j1083j0741r455p918o680n529l820j371J022K181J979K027M011P226
$$ 800459 789376 778635 769180 761262 754582 749053 745233 743862 744884 747065 749044 751071 755082 762308
51818G62308Q909P693N488M952O260P700Q318Q239P241N045K554Q77n26k811n196
$$ 762308 771217 778910 784398 789350 795610 803310 811628 819867 827108 832153 834707 835584 835058 832247 827051
51803H27051n673m185k814k559k209r16M08J033J618K375K090J63k089l467m562
$$ 827051 821378 817193 814379 811820 809611 808695 809103 810136 811754 814129 816219 816382 814293 810826 806264
51788H06264o081p141o899o490p484r368j0390j0198r913r943r426p793n579l572
$$ 806264 800183 793042 786143 779653 772169 762801 752411 742213 732300 722357 712931 705138 699559 695987
51774F95987k078r96QJ247K363K475J513P06Q69J001j95k109l024k736k679l419
$$ 695987 693909 692913 692921 694168 696531 699006 700519 701225 702094 703095 702900 700791 697767 695031 692352 688933
51758F88933l718k757j728k026k844k134L61K534K722J868K013L375M183L193
$$ 688933 685215 682458 680730 678704 675860 673726 674087 676621 679343 681211 683224 686599 690782 693975
51744F93975J244N3L57J594K644K550J349N13J416L029K584n22l174k457L71J848
$$ 693975 695219 695272 695629 697223 699867 702417 703766 704279 705695 708724 711308 710786 707612 705155 705526 707374
51728G07374J105J61O2l60j684k614k283j582j319r93k87Q2p7J10P19N92j34P27
$$ 707374 708479 708640 708702 708342 706658 704044 701761 700179 698860 697867 697580 697662 697585 697695 698414 699006 698872 699599
51710F99599M100P550Q488P864Q387J0201J0730Q393M449J131m97q39j173k672
$$ 699599 703699 711249 719737 727601 735988 746189 756919 765312 769761 770892 770395 769556 768383 765711
51696G65711n168p142p656p617q193q889q450p031n995n856n719m637k549r7J705
$$ 765711 760543 753401 745745 738128 729935 721046 712596 705565 699570 693714 687995 683358 680809 680712 682417
51681F82417K088J555J669L047M464M864N161O658Q668R409Q515O914M852K069
$$ 682417 684505 686060 687729 690776 695240 700104 705265 711923 720591 730000 738515 745429 750281 752350
51667G52350l73n48J802M949P419Q875Q675N773P71l699n675n706n304m848m096
$$ 752350 751977 751429 753231 758180 765599 774474 783149 788922 789693 785994 780319 774613 769309 764461 760365
51652G60365l449l523m153m813n468o021n571l369k10K177L124L531M240M721
$$ 760365 756916 753393 749240 744427 738959 732938 727367 723998 723788 725965 729089 732620 736860 741581
51638G41581L836J407j504l740m935n293n081m581m093l565k633j564j607l393
$$ 741581 745417 746824 745320 741580 736645 731352 726271 721690 717597 714032 711399 709835 708228 704835
51624G04835n359n224l077j479j935k802j755J010L439M436M495M125L334K544
$$ 704835 699476 694252 691175 689696 687761 684959 683204 684214 687653 692089 696584 700709 704043 706587
51610G06587K622L813N554P337Q897R903J0287J0594J0974J0277P337K937p76
$$ 706587 709209 713022 718576 725913 734810 744713 755000 765594 776568 786845 794182 797119 796343
51597G96343k752l716m438m643l848k139J42K573M460N391N867O346N932L379
$$ 796343 793591 789875 785437 780794 776946 774807 774949 777522 781982 787373 793240 799586 805518 808897
51583H08897p19m432p250j0500j4432j6921j6256j3648j1457j0150q678o956n973
$$ 808897 808178 803746 796496 785996 771564 754643 738387 724739 713282 703132 694454 687498 681525
51570F81525n667m630k430p52j329l553n093m624l076k123k197k555k784l279
$$ 681525 675858 671228 668798 668046 666717 663164 658071 653447 650371 648248 646051 643496 640712 637433
51556F37433m107m348l224j234N36J644K124J699L74o44kJ844L096L187L383M512
$$ 637433 633326 628978 625754 624520 625056 626700 628824 630523 630897 630253 630251 632095 635191 638378 641761 646273
51540F46273N700O175O793Q614J1023J2664J3354J3684J3224J0821O565K184p77
$$ 646273 651973 658148 664941 673555 684578 697242 710596 724280 737504 748325 754890 757074 756297
51527G56297k112k291j702q69m11k81L01J788L707N465P080Q695R989J0652J1048
$$ 756297 754185 751894 750192 749323 748912 748631 748932 750720 754427 759892 766972 775667 785656 796308 807356
51512H07356J1832J3126J4556J5806J6637J6570J5211J2913J0672R412R744J2118
$$ 807356 819188 832314 846870 862676 879313 895883 911094 924007 934679 944091 953835 965953
51500I65953J6375K1224K5149K8081L1112L4095L4721L1166K4835J9123J5655
$$ 965953 982328 1003552 1028701 1056782 1087894 1121989 1156710 1187876 1212711 1231834 1247489
51489A247489J3161R885N582Q02m247r320j3781j7643k2014k7462l2535l5135
$$ 1247489 1260650 1270535 1276117 1276919 1272672 1263352 1249571 1231928 1209914 1182452 1149917 1114782
51477A114782l4970l3583l2170l0554k8343k5867k3566k1309j8958j7020j6054
$$ 1114782 1079812 1046229 1014059 983505 955162 929295 905729 884420 865462 848442 832388
51466H32388j5719j4977j3315j1309r773q702p470n952m902m837n115m801m140
$$ 832388 816669 801692 788377 777068 767295 758593 751123 745171 740269 735432 730317 725516 721376
51453G21376m266n331n837m352j331J316K083J012o88j843k319k910m034m774
$$ 721376 717110 711779 705942 701590 700259 701575 703658 704670 703982 702139 699820 696910 692876 688102
51439F88102l962j926n8J262K864M584M606K074j078k381j866j317j323r92k04
$$ 688102 684140 682214 682156 683418 686282 690866 695472 697546 696468 694087 692221 690904 689581 688589 688385
51424F88385k57j897m171n647n836n186m449m273m597m524l506k458k627l556
$$ 688385 688128 686231 682060 676413 670577 665391 660942 656669 652072 647548 644042 641584 638957 635401
51410F35401l478j980p85j351k889l624l133k416k151j941j266l88K7r6K4J221
$$ 635401 631923 629943 629158 627807 624918 621294 618161 615745 613594 611653 610387 609999 610026 609930 609954 611175
51394F11175L419N599O726O573N805N535O632Q826J0554J0597R874J0494J2649
$$ 611175 614594 620193 626919 633492 639297 644832 651464 660290 670844 681441 691315 701809 714458
51381G14458J3863J2197Q827O184M713L133J042p33j978l387n020o170o919q113
$$ 714458 728321 740518 749345 755529 760242 763375 764417 763684 761706 758319 753299 747129 740210 732097
51367G32097r644j0251r427q077o917n704m457l993m471m708l747k108q21j59
$$ 732097 722453 712202 702775 694698 687781 682077 677620 673627 669156 664448 660701 658593 657772 657613
51353F57613P8K6J46J152K915M282M622M634N083N693O058O491P161P316O457
$$ 657613 657691 657717 657863 659015 661930 666212 670834 675468 680551 686244 692302 698793 705954 713270 719727
51338G19727N501N597O420O773O512O692P922R584J0760J1195J1202J1334J2190
$$ 719727 725228 730825 737245 744018 750530 757222 765144 774728 785488 796683 807885 819219 831409
51325H31409J4107J6822J9713K2413K5021K7745L0449L2610L3886L4890L7044
$$ 831409 845516 862338 882051 904464 929485 957230 987679 1020289 1054175 1089065 1126109
51314A126109M0847M4358M4203L8667K9366J9570J1300M269k839j0682j8643k5542
$$ 1126109 1166956 1211314 1255517 1294184 1323550 1343120 1354420 1358689 1355850 1345168 1326525 1300983
51302A300983l0812l4847l8080m0190m0694l9973l8876l7455l5041l1585k7989
$$ 1300983 1270171 1235324 1197244 1157054 1116360 1076387 1037511 1000056 965015 933430 905441
51291I05441k4903k2141j9535j7504j6321j5671j5351j5643j6464j6815j5783
$$ 905441 880538 858397 838862 821358 805037 789366 774015 758372 741908 725093 709310
51280G09310j3615j1342r642q459p412o216m974m192m150m355m007l090k359k310
$$ 709310 695695 684353 674711 666252 658840 652624 647650 643458 639308 634953 630946 627856 625497 623187
51266F23187k795l582m489m970m437l102j709m03J225K916L696L276K555K386
$$ 623187 620392 616810 612321 607351 602914 599812 598103 597700 598925 601841 605537 608813 611368 613754
51252F13754K848L765M851N153L717J290K1Q07K074J855K8k191l731l986k817
$$ 613754 616602 620367 625218 630371 634088 635378 635399 636206 638280 640135 640163 637972 634241 630255 627438
51237F27438j187p57j928l158k997j751m29P93K015K757K803K993L882M565M025
$$ 627438 626251 625494 623566 620408 617411 615660 615231 616024 618039 620796 623599 626592 630474 635039 639064
51222F39064K833K260K523L116M035N263N741M460K040k7j240j851j509K15K331
$$ 639064 641897 644157 646680 649796 653831 659094 664835 669295 671335 671308 670068 668217 666708 666923 669254
51207F69254L279L169L540M782N378M084J547p19j942k359k740l886n709o750
$$ 669254 672533 675702 679242 684024 689402 693486 695033 694314 692372 690013 687273 683387 677678 670928
51193F70928n532k518J60J077O66m8p39j436j949k229k619l180l273k382j058
$$ 670928 665396 662878 663038 664115 664781 664733 663994 662558 660609 658380 655761 652581 649308 646926 645868
51178F45868n73j618l567m952m714l051j079K63O44m8j621k959k553l99J531J615
$$ 645868 645295 643677 640110 635158 630444 627393 626314 626577 627221 627173 625552 622593 620040 619641 621172 622787
51162F22787O56N84J812L132L794M204M691M927M838M894N136M884L805K618K283
$$ 622787 623443 624027 625839 628971 632765 636969 641660 646587 651425 656319 661455 666339 670144 672762 675045
51147F75045K952L890M089L095J592R87J797K781K350N56j206k096k365k161j116
$$ 675045 677997 681887 685976 689071 690663 691650 693447 696228 698578 699134 697928 695832 693467 691306 690190
51132F90190N49J644J356K06q15j489k208k943k990j789K16J718J691L95j115
$$ 690190 690739 692383 693739 693945 693130 691641 689433 686490 683500 681711 681927 683645 685336 685731 684616
51117F84616k363l608m522l888j432J108J940J492J400J834J459r3j399j170K36
$$ 684616 682253 678645 674123 670235 668803 669911 671851 673343 674743 676577 678036 677943 676544 675374 675610
51102F75610J564J905J097j18k13J648M134M951L695K238K000K300J961J098M04
$$ 675610 677174 679079 680176 680058 679845 681493 685627 690578 694273 696511 698511 700811 702772 703870 704274
51087G04274j64r22j569j760j940k669l561l748k956j517K51J897K589J814J43
$$ 704274 704110 703188 701619 699859 697919 695250 691689 687941 684985 683468 683719 685616 688205 690019 690162
51072F90162j313j969j777p50Q44K126K378K078K362L387M008L367K141J662K151
$$ 690162 688849 686880 685103 684353 685197 687323 689701 691779 694141 697528 701536 704903 707044 708706 710857
51057G10857K538K067J488K073L756M981M649L447K763K783K529J504L94MK91
$$ 710857 713395 715462 716950 719023 722779 727760 732409 735856 738619 741402 743931 745435 745829 745833 746124
51042G46124P39J090J398J746K213K839L410L545L066K169J253P96J118J970K644
$$ 746124 746863 747953 749351 751097 753310 756149 759559 763104 766170 768339 769592 770388 771506 773476 776120
51027G76120K915L383M293M622L489K007K214M066N181M101K267J664J937J405
$$ 776120 779035 782418 786711 791333 794822 796829 799043 803109 808290 812391 814658 816322 818259 819664
51013H19664J35J48K521N908Q357R452R975J0312J0246R958J0338J2045J4877
$$ 819664 819799 819947 822468 828376 836733 846185 856160 866472 876718 886676 897014 909059 923936
51000I23936J8204K1546K4303K5362K3758J9889J5406J1680Q804O364M626M197
$$ 923936 942140 963686 987989 1013351 1037109 1056998 1072404 1084084 1092888 1099252 1103878 1108075
50988A108075M839N295M423K204m03k262k916k935l372m702o428p827q487q020
$$ 1108075 1112914 1118209 1122632 1124836 1124433 1122171 1119255 1116320 1112948 1108246 1101818 1093991 1085504 1077484
50974A077484o135l667k645m259p204r129r312q679p607n460k435q9Q56J844M508
$$ 1077484 1071349 1067682 1065037 1060778 1053574 1044445 1035133 1026454 1018847 1013387 1010952 1010863 1011719 1013563 1018071
50959A018071Q213J0825J1434J1164J1234J1345J0487Q866Q128R329J1175J1177
$$ 1018071 1026284 1037109 1048543 1059707 1070941 1082286 1092773 1101639 1109767 1119096 1130271 1141448
50947A141448Q718N971N114N581N257L626K120J563J164M65N25K320N238Q138
$$ 1141448 1150166 1156137 1161251 1166832 1172089 1175715 1177835 1179398 1180562 1181027 1181552 1183872 1189110 1197248
50933A197248J0833J3500J5597J6597J7102J8109J9674K1291K3158K5902K9350
$$ 1197248 1208081 1221581 1237178 1253775 1270877 1288986 1308660 1329951 1353109 1379011 1408361
50922A408361L2731L5911L9383M2937M5447M6265M6060M5917M6298M7209M8937
$$ 1408361 1441092 1477003 1516386 1559323 1604770 1651035 1697095 1743012 1789310 1836519 1885456
50911A885456N2100N7158O4006P1854P9416Q5604R0329R4552R9403J05178J11028
$$ 1885456 1937556 1994714 2058720 2130574 2209990 2295594 2385923 2480475 2579878 2685056 2796084
50900B796084J15456J17239J16196J13087J08571J02457R4315Q4638P4833O5716
$$ 2796084 2911540 3028779 3144975 3258062 3366633 3469090 3563405 3648043 3722876 3788592
50890C788592N6513M5868L3641K1220R988M1r194j7513k3728k7059k8295k9326
$$ 3788592 3845105 3890973 3924614 3945834 3955822 3955863 3946669 3929156 3905428 3878369 3850074 3820748
50878C820748l1606l5161l8820m1356m2590m3531m5314m8007n0768n3083n5389
$$ 3820748 3789142 3753981 3715161 3673805 3631215 3587684 3542370 3494363 3443595 3390512 3335123
50867C335123n8254o1527o4628o7310o9680p1814p3644p5118p6067p6196p5324
$$ 3335123 3276869 3215342 3150714 3083404 3013724 2941910 2868266 2793148 2717081 2640885 2565561
50856B565561p3380p0179o5740o0982n7221n4627n1953m8359m4538m1308l8102
$$ 2565561 2492181 2422002 2356262 2295280 2238059 2183432 2131479 2083120 2038582 1997274 1959172
50845A959172l4156l0412k8661k8949k9206k7521k3774j9102j4890j2224j1137
$$ 1959172 1925016 1894604 1865943 1836994 1807788 1780267 1756493 1737391 1722501 1710277 1699140
50834A699140j0288q349n741l828k617p36K088M334N077N575P440J0397J3061
$$ 1699140 1688852 1680503 1674762 1670934 1668317 1667581 1669669 1674003 1679080 1684655 1692095 1702492 1715553
50821A715553J5006J6900J9127K1476K3821K6094K7779K8409K8617K9838L2777
$$ 1715553 1730559 1747459 1766586 1788062 1811883 1837977 1865756 1894165 1922782 1952620 1985397
50810A985397L6717M0617M4329M8285N2291N5366N7138N8855O2288O7736P4079
$$ 1985397 2022114 2062731 2107060 2155345 2207636 2263002 2320140 2378995 2441283 2509019 2583098
50799B583098Q0866Q9162R9520J10336J19668J28058J37999J50798J65459J80564
$$ 2583098 2663964 2753126 2852646 2962982 3082650 3210708 3348707 3499505 3664964 3845528
50789C845528J95568K09857K22193K31991K40106K47527K53948K58196K59251
$$ 3845528 4041096 4250953 4473146 4705137 4945243 5192770 5446718 5704914 5964165
50780E964165K56367K48835K36260K18600J95737J67727J35729J01933O8169L5231
$$ 5964165 6220532 6469367 6705627 6924227 7119964 7287691 7423420 7525353 7593522 7628753
50770G628753L756k5135n0517p2155q9867j03028j11096j14055j12179j06182
$$ 7628753 7632509 7607374 7556857 7484702 7394835 7291807 7180711 7066656 6954477 6848295
50760F848295r7848q9654q3308p9314p8027q0122q5602r3446j02845j13908j26603
$$ 6848295 6750447 6660793 6577485 6498171 6420144 6340022 6254420 6160974 6058129 5944221 5817618
50749E817618j39737j51723j61757j69911j76499j81565j84341j83362j78018
$$ 5817618 5677881 5526158 5364401 5194490 5017991 4836426 4652085 4468723 4290705
50740D290705j69929j61496j53049j42999j30988j19107j09197j00676r2053q3115
$$ 4290705 4120776 3959280 3806231 3663232 3532244 3413137 3303940 3203264 3111211 3028096
50730C028096p4439o6012n7718n0159m3704l7543l0928k4662k0299j8373j8195
$$ 3028096 2953657 2887645 2829927 2779768 2736064 2698521 2667593 2642931 2622632 2604259 2586064
50719B586064j8604j8276j6379j3924j3327j5453j8104j8608j7035j5586j5809
$$ 2586064 2567460 2549184 2532805 2518881 2505554 2490101 2471997 2453389 2436354 2420768 2404959
50708B404959j7686k0573k3507k5077k4489k2388j9810j6998j4292j2938j3366
$$ 2404959 2387273 2366700 2343193 2318116 2293627 2271239 2251429 2234431 2220139 2207201 2193835
50697B193835j3565j1012n899p05L120O396J0311J5014K0215K5721L1003L5271
$$ 2193835 2180270 2169258 2163359 2162654 2165774 2172170 2182481 2197495 2217710 2243431 2274434 2309705
50685B309705L8386M1073M4278M8771N4910O2023O8619P4126P9832Q7118R5412
$$ 2309705 2348091 2389164 2433442 2482213 2537123 2599146 2667765 2741891 2821723 2908841 3004253
50674C004253J03141J10104J17435J25412J32635J37318J38591J36866J33786
$$ 3004253 3107394 3217498 3334933 3460345 3592980 3730298 3868889 4005755 4139541
50665D139541J31230J29275J25709J18550J08347R6813Q4106O8905N0416K8880
$$ 4139541 4270771 4400046 4525755 4644305 4752652 4849465 4933571 5002476 5052892 5081772
50655E081772M973j9596m1688n8869p1406q0544q5799q6144q2964p9022p4870
$$ 5081772 5086745 5067149 5025461 4966592 4895186 4814642 4728843 4642699 4559735 4480713 4405843
50644D405843o8995o1417n4221m8304m2639l7497l5450l7972m3513n0234n8223
$$ 4405843 4336848 4275431 4221210 4172906 4130267 4092770 4057320 4019348 3975835 3925601 3867378
50633C867378o7566p6500q3378q8742r3519r6705r6675r3564q8690q2556p5125
$$ 3867378 3799812 3723312 3639934 3551192 3457673 3360968 3264293 3170729 3082039 2999483 2924358
50622B924358o7134n9544n2282m4853l7523l0646k3584j5669p696j102L995Q846
$$ 2924358 2857224 2797680 2745398 2700545 2663022 2632376 2608792 2593123 2585427 2584325 2588320 2597166
50610B597166J4397K0449K6053K9964L1183L0030K8257K7409K7439K7512K7452
$$ 2597166 2611563 2632012 2658065 2688029 2719212 2749242 2777499 2804908 2832347 2859859 2887311
50599B887311K7597K7982K8563K9674L1306L2499L2379L1403L0717L0836L1757
$$ 2887311 2914908 2942890 2971453 3001127 3032433 3064932 3097311 3128714 3159431 3190267 3222024
50588C222024L3754L6990M0724M3955M6630M9499N3039N7243O1977O6731P0428
$$ 3222024 3255778 3292768 3333492 3377447 3424077 3473576 3526615 3583858 3645835 3712566 3782994
50577C782994P2368P3010P3058P2199O9678O5709O1295N6960N2599M8374M4767
$$ 3782994 3855362 3928372 4001430 4073629 4143307 4209016 4270311 4327271 4379870 4428244 4473011
50566D473011M1821L9072L5928L1277K3160J0241o180k2425l4870m1670m2711
$$ 4473011 4514832 4553904 4589832 4621109 4644269 4654510 4648330 4625905 4591035 4549365 4506654
50555D506654l9300l3869k8604k3810j8502j2704q049n721n199n744q000j2985
$$ 4506654 4467354 4433485 4404881 4381071 4362569 4349865 4341816 4336095 4330896 4325152 4317152 4304167
50543D304167k0326k8863l8535n0224o3679p6816q7638r5913j02436j07419j10391
$$ 4304167 4283841 4254978 4216443 4166219 4102540 4025724 3938086 3842173 3739737 3632318 3521927
50532C521927j11199j10213j07600j03266r7607r1683q6298q1347p6264p0754
$$ 3521927 3410728 3300515 3192915 3089649 2992042 2900359 2814061 2732714 2656450 2585696
50522B585696o4832n8589n2202m5873l9594l3361k7641k2871j8308j2387m960
$$ 2585696 2520864 2462275 2410073 2364200 2324606 2291245 2263604 2240733 2222425 2210038 2205078
50511B205078J871O258R073J2474J6627J9745K1271K2950K6236L0376L4002L7053
$$ 2205078 2206949 2213207 2222280 2234754 2251381 2271126 2292397 2315347 2341583 2371959 2405961 2443014
50499B443014L9921M2047M2940M3791M6338N0360N3698N4808N4224N3425N3272
$$ 2443014 2482935 2524982 2567922 2611713 2658051 2708411 2762109 2816917 2871141 2924566 2977838
50488B977838N3788N4580N5133N5295N5567N6587N8258O0029O1944O4714O8773
$$ 2977838 3031626 3086206 3141339 3196634 3252201 3308788 3367046 3427075 3489019 3553733 3622506
50477C622506P4030Q0594Q8792R8034J06705J14027J21244J29904J39446J47789
$$ 3622506 3696536 3777130 3865922 3963956 4070661 4184688 4305932 4435836 4575282 4723071
50467D723071J54206J60145J66713J72712J76238J77209J76862J75235J70861
$$ 4723071 4877277 5037422 5204135 5376847 5553085 5730294 5907156 6082391 6253252
50458F253252J63043J52749J40546J25108J04901Q0493N4018K7077M07k5047m8315
$$ 6253252 6416295 6569044 6709590 6834698 6939599 7020092 7074110 7101187 7101594 7076547 7028232
50447G028232o9656r0059j09041j24153j33260j36485j35208j29903j19893j05000
$$ 7028232 6958576 6868517 6759476 6635323 6502063 6365578 6230370 6100467 5980574 5875574
50437E875574q6694o7501m9514l3528j9307o468M960J4588K1626K4494K1110J0279
$$ 5875574 5788880 5721379 5671865 5638337 5619030 5612562 5617522 5632110 5653736 5678230 5699340 5709619
50425E709619p281k9559n4572q0566j05603j27891j46525j61223j71619j77566
$$ 5709619 5702338 5672779 5618207 5537641 5432038 5304147 5157622 4996399 4824780 4647214
50415D647214j79908j79815j77368j71788j63129j52802j42213j31840j21806
$$ 4647214 4467306 4287491 4110123 3938335 3775206 3622404 3480191 3348351 3226545
50406C226545j12367j03451r4558q5485p6449o7401n8148m9224m1531l4626k6761
$$ 3226545 3114178 3010727 2916169 2830684 2754235 2686834 2628686 2579462 2537931 2503305 2476544
50395B476544j7316q143j471K670N964R585J3652J8282K3666K9028L2820L4580
$$ 2476544 2459228 2451085 2449614 2452284 2458248 2467833 2481485 2499767 2523433 2552461 2585281 2619861
50383B619861L5810L8386M2318M5559M5887M2554L6078K7107J6377N647k506o621
$$ 2619861 2655671 2694057 2736375 2781934 2827821 2870375 2906453 2933560 2949937 2955584 2953078 2946457
50371B946457p605p334o491m721k318l69Q15K229M840Q662J3266J8206K2758K6341
$$ 2946457 2938852 2931518 2925027 2920306 2917988 2917619 2918434 2920663 2925503 2934165 2947431 2965637 2988395 3014736
50357C014736K9527L3695L9386M5907N2762O0279O8381P5874Q1647Q5659Q8193
$$ 3014736 3044263 3077958 3117344 3163251 3216013 3276292 3344673 3420547 3502194 3587853 3676046
50346C676046Q9101Q8367Q6396Q3208P8270P1779O4992N8424N0731M0317K7095
$$ 3676046 3765147 3853514 3939910 4023118 4101388 4173167 4238159 4296583 4347314 4387631 4414726
50335D414726J1898m830k2634m0239n6438p1133q4386r5038j01519j03612j02309
$$ 4414726 4426624 4421794 4399160 4358921 4302483 4231350 4146964 4051926 3950407 3846795 3744486
50324C744486r8377r2229q4678p6513o7415n6616m4582l2929k2558j3010l952
$$ 3744486 3646109 3553880 3469202 3392689 3325274 3268658 3224076 3191147 3168589 3155579 3151627
50313C151627L666Q436R866Q514N175K16o515j5245k5597l6244m5345n1445n4276
$$ 3151627 3155293 3163729 3173595 3182109 3187284 3187500 3180985 3165740 3140143 3103899 3058554 3007109 2952833
50300B952833n5005n5576n7278n9957o3091o7070p2369p7589p9927p8168p3904
$$ 2952833 2897828 2842252 2784974 2725017 2661926 2594856 2522487 2444898 2364971 2286803 2212899
50289B212899o9217o4406n8957n3343m8390m3772l8668l3311k8516k4066j9053
$$ 2212899 2143682 2079276 2020319 1966976 1918586 1874814 1836146 1802835 1774319 1750253 1731200
50278A731200j3656r194o402m748l570k828k432j722jK726N701P908Q879R227
$$ 1731200 1717544 1708350 1701948 1697200 1693630 1690802 1688370 1686648 1686647 1689373 1695074 1702982 1711861 1721088
50264A721088R992J1296J2265J2531J2820J3516J3782J2952J1821J1354J1012
$$ 1721088 1731080 1742376 1754641 1767172 1779992 1793508 1807290 1820242 1832063 1843417 1854429
50253A854429R779Q121P360P551P633P460P969R246J0031R635R092R847J2084
$$ 1854429 1864208 1872329 1879689 1887240 1894873 1902333 1910302 1919548 1929579 1939214 1948306 1958153 1970237
50240A970237J4884J7331J9186K0908K3240K6387K9690L2246L3248L1330K4535
$$ 1970237 1985121 2002452 2021638 2042546 2065786 2092173 2121863 2154109 2187357 2218687 2243222
50229B243222J2249l138j7573k8205l4270l6046l4388l1025k7654k4583k1211
$$ 2243222 2255471 2252333 2234760 2206555 2172285 2136239 2101851 2070826 2043172 2018589 1997378
50218A997378j7600j4326j1054o863k037K042M938P643J0782J3876J6758K0031
$$ 1997378 1979778 1965452 1954398 1947535 1945498 1947540 1952478 1960121 1970903 1984779 2001537 2021568
50206B021568K3466K5576K5772K5521K6170K6716K5128K1244J7107J4690J4316
$$ 2021568 2045034 2070610 2096382 2121903 2148073 2174789 2199917 2221161 2238268 2252958 2267274
50195B267274J5067J5802J5580J3779J0165M807j858q902j5147j9815k2796k4377
$$ 2267274 2282341 2298143 2313723 2327502 2337667 2342474 2340616 2331714 2316567 2296752 2273956 2249579
50183B249579k4907k4644k3440k0727j6458j2010r482r975j3064j7824k3554k9358
$$ 2249579 2224672 2200028 2176588 2155861 2139403 2127393 2117911 2107936 2094872 2077048 2053494 2024136
50171B024136l3931l6329l6538l5139l2793l0126k7547k5021k2481k0413j9578
$$ 2024136 1990205 1953876 1917338 1882199 1849406 1819280 1791733 1766712 1744231 1723818 1704240
50160A704240k0047k1059k1806k1864k1080j9686j8388j7620j6893j5579j4094
$$ 1704240 1684193 1663134 1641328 1619464 1598384 1578698 1560310 1542690 1525797 1510218 1496124
50149A496124j3307j3011j2167j0629r381q861q327p188n836m764l985l773m797
$$ 1496124 1482817 1469806 1457639 1447010 1437629 1428768 1420441 1413253 1407417 1402653 1398668 1394895 1390098
50136A390098o929q859r484q839p301n105l061k489l484m407m008l013k642k672
$$ 1390098 1383169 1374310 1364826 1355987 1348686 1343581 1340520 1338031 1334547 1330140 1326132 1323119 1320477 1317805
50122A317805k266j711j815k249j973j005k62R2O54J241Q95l26r37K2J806L338
$$ 1317805 1315539 1313828 1312013 1309764 1307791 1306786 1306524 1306616 1307270 1308511 1309406 1309080 1308143 1308165 1309971 1313309
50106A313309M750O682Q835J0174J0382J0386J1488J4318J8384K2274K4715K5930
$$ 1313309 1318059 1324741 1333576 1343750 1354132 1364518 1376006 1390324 1408708 1430982 1455697 1481627
50094A481627K7785L2001L8212M4306M8511N0745N2025N3302N4991N6771N7387
$$ 1481627 1509412 1541413 1579625 1623931 1672442 1723187 1775212 1828514 1883505 1940276 1997663
50083A997663N5447N1055M6210M2851M0947L9206L7096L4995L2627K8653K2022
$$ 1997663 2053110 2104165 2150375 2193226 2234173 2273379 2310475 2345470 2378097 2406750 2428772
50072B428772J2681R95j2178k4667l3985l9915m4759n0080n4607n6454n5888n4277
$$ 2428772 2441453 2442448 2430270 2405603 2371618 2331703 2286944 2236864 2182257 2125803 2069915 2015638
$$ [...]
##END NTUPLES=NMR SPECTRUM
##END=
