
##TITLE=UV1010_M1-1003-1002_6268756_ErISKLIoeB
##JCAMPDX= 6.0         $$ Bruker NMR JCAMP-DX V2.0
##DATA TYPE= NMR SPECTRUM
##DATA CLASS= NTUPLES
##ORIGIN= BRUKER
##OWNER= Administrator
$$ 1.72 TOPSPIN		Version 2.1
$$ 2012-06-02 07:42:04.078 -0500  Administrator@TOPSPIN
$$ Compression mode = diff/dup
##.OBSERVE FREQUENCY= 400.13188235
##.OBSERVE NUCLEUS= ^1H
##.ACQUISITION MODE= SIMULTANEOUS (DQD)
##.ACQUISITION SCHEME= undefined
##.AVERAGES= 8
##.DIGITISER RES= 22
##SPECTROMETER/DATA SYSTEM= spect
##.PULSE SEQUENCE= zg30
##.SOLVENT NAME= COFFEE_calctemp
##.SHIFT REFERENCE= INTERNAL, COFFEE_calctemp, 1, 14.98061
##AUDIT TRAIL= $$ (NUMBER, WHEN, WHO, WHERE, PROCESS, VERSION, WHAT)
$$ ##TITLE= Audit trail, TOPSPIN		Version 2.1
$$ ##JCAMPDX= 5.01
$$ ##ORIGIN= Bruker BioSpin GmbH
$$ ##OWNER= Administrator
$$ $$ C:\Bruker\TOPSPIN/data/COFFEE/nmr/UV1010_M1-1003-1002_6268756_ErISKLIoeB/10/pdata/1/auditp.txt
$$ ##AUDIT TRAIL=  $$ (NUMBER, WHEN, WHO, WHERE, PROCESS, VERSION, WHAT)
(   1,<2012-06-02 07:41:55.890 -0500>,<Administrator>,<TOPSPIN>,<go>,<TOPSPIN 2.1>,
      <created by zg
	started at 2012-06-02 07:40:49.312 -0500,
	POWCHK enabled, PULCHK disabled,
       configuration hash MD5:
       D5 CA 7A 23 FE 6B EE E2 50 67 74 61 24 F7 5E 3B
       data hash MD5: 64K
       C7 99 9F DB B6 F2 11 95 CA FF 6C 5A 0F 7B D8 2B>)
(   2,<2012-06-02 07:42:00.046 -0500>,<Administrator>,<TOPSPIN>,<proc1d>,<TOPSPIN 2.1>,
      <Start of raw data processing
       efp LB = 0 FT_mod = 6 PKNL = 1 PHC0 = 0 PHC1 = 0 SI = 32K 
       data hash MD5: 32K
       2A B5 23 03 7C CB D3 7E 5F A5 2C 0F 9C E5 0D 82>)
(   3,<2012-06-02 07:42:00.359 -0500>,<Administrator>,<TOPSPIN>,<proc1d>,<TOPSPIN 2.1>,
      <pk PHC0 = 205.8563 PHC1 = 0 
       data hash MD5: 32K
       2F 37 49 9C BE 31 91 B4 7D 08 7F A3 97 EA 59 0D>)
(   4,<2012-06-02 07:42:00.421 -0500>,<Administrator>,<TOPSPIN>,<proc1d>,<TOPSPIN 2.1>,
      <abs ABSG = 1 
       data hash MD5: 32K
       53 2D 23 AB AD 93 2F 7B 12 5F E1 EE 00 20 90 DF>)
(   5,<2012-06-02 07:42:00.453 -0500>,<Administrator>,<TOPSPIN>,<proc1d>,<TOPSPIN 2.1>,
      <abs ABSG = 2 
       data hash MD5: 32K
       3A AA C6 B0 2E 13 3B 93 3F C4 35 89 47 02 79 CD>)
(   6,<2012-06-02 07:42:00.484 -0500>,<Administrator>,<TOPSPIN>,<proc1d>,<TOPSPIN 2.1>,
      <abs ABSG = 3 
       data hash MD5: 32K
       DB 1B 73 11 0D A3 89 9B 0D 61 75 E0 15 B7 5F F2>)
(   7,<2012-06-02 07:42:00.500 -0500>,<Administrator>,<TOPSPIN>,<proc1d>,<TOPSPIN 2.1>,
      <abs ABSG = 4 
       data hash MD5: 32K
       25 AF F5 A7 06 4D A3 29 C8 D2 59 C4 42 B1 4A CC>)
(   8,<2012-06-02 07:42:00.546 -0500>,<Administrator>,<TOPSPIN>,<proc1d>,<TOPSPIN 2.1>,
      <abs ABSG = 5 
       data hash MD5: 32K
       55 F7 94 0A 22 B8 8C 1F A8 30 F6 20 7B EC 93 25>)
$$ ##END=
$$ 
$$ $$ hash MD5
$$ $$ 07 6F 1D CD E8 DB AD 9C 0F 7E 05 9F D7 E8 0B EE
##$RELAX= 
##$RELAX= 
##$RELAX= 
##$RELAX= 
##$RELAX= 
##$RELAX= 
##$RELAX= 
$$ Bruker specific parameters
$$ --------------------------
$$ [...]
150 150 150 150 150 150 150 150
##$TP07= 0
##$TPNAME0= <>
##$TPNAME1= <>
##$TPNAME2= <>
##$TPNAME3= <>
##$TPNAME4= <>
##$TPNAME5= <>
##$TPNAME6= <>
##$TPNAME7= <>
##$TPOAL= (0..7)
0.5 0.5 0.5 0.5 0.5 0.5 0.5 0.5
##$TPOFFS= (0..7)
0 0 0 0 0 0 0 0
##$TUNHIN= 0
##$TUNHOUT= 0
##$TUNXOUT= 0
##$USERA1= <user>
##$USERA2= <user>
##$USERA3= <user>
##$USERA4= <user>
##$USERA5= <user>
##$V9= 5
##$VALIST= <valist>
##$VCLIST= <CCCCCCCCCCCCCCC>
##$VD= 0
##$VDLIST= <DDDDDDDDDDDDDDD>
##$VPLIST= <PPPPPPPPPPPPPPP>
##$VTLIST= <TTTTTTTTTTTTTTT>
##$WBST= 2048
##$WBSW= 25
##$XGAIN= (0..3)
0 0 0 0
##$XL= 0
##$YL= 0
##$YMAX_a= 527842
##$YMIN_a= -658989
##$ZGOPTNS= <>
##$ZL1= 120
##$ZL2= 120
##$ZL3= 120
##$ZL4= 120
##$ABSF1= 14.98061
##$ABSF2= -5.57192
##$ABSG= 5
##$ABSL= 3
##$ALPHA= 0
##$AQORDER= 0
##$ASSFAC= 0
##$ASSFACI= 0
##$ASSFACX= 0
##$ASSWID= 0
##$AUNMP= <proc_prof1d_extract_pilot.lims>
##$AXLEFT= 0
##$AXNAME= <>
##$AXNUC= <1H>
##$AXRIGHT= 0
##$AXTYPE= 0
##$AXUNIT= <>
##$AZFE= 0.1
##$AZFW= 0.1
##$BCFW= 0
##$BC_mod= 0
##$BYTORDP= 0
##$COROFFS= 0
##$CY= 15
##$DATMOD= 1
##$DC= 0
##$DFILT= <>
##$DTYPP= 0
##$F1P= 0
##$F2P= 0
##$FCOR= 0.5
##$FTSIZE= 32768
##$FT_mod= 6
##$GAMMA= 0
##$GB= 0
##$INTBC= 1
##$INTSCL= 1
##$ISEN= 128
##$LB= 0
##$LEV0= 0
##$LPBIN= 0
##$MAXI= 10000
##$MC2= 0
##$MEAN= 0
##$ME_mod= 0
##$MI= 0
##$NCOEF= 0
##$NC_proc= -8
##$NLEV= 6
##$NOISF1= 0
##$NOISF2= 0
##$NSP= 0
##$NTH_PI= 0
##$NZP= 0
##$OFFSET= 14.98061
##$PC= 1
##$PHC0= 205.8563
##$PHC1= 0
##$PH_mod= 1
##$PKNL= yes
##$PPARMOD= 0
##$PPDIAG= 0
##$PPIPTYP= 0
##$PPMPNUM= 2147483647
##$PPRESOL= 1
##$PSCAL= 4
##$PSIGN= 0
##$PYNMP= <proc.py>
##$REVERSE= no
##$SF= 400.13
##$SI= 32768
##$SIGF1= 0
##$SIGF2= 0
##$SINO= 400
##$SIOLD= 32768
##$SPECTYP= <>
##$SREGLST= <1H.CDCl3>
##$SSB= 0
##$STSI= 32768
##$STSR= 0
##$SW_p= 8223.68421052632
##$SYMM= 0
##$S_DEV= 0
##$TDeff= 65536
##$TDoff= 0
##$TI= <>
##$TILT= no
##$TM1= 0
##$TM2= 0
##$TOPLEV= 0
##$USERP1= <user>
##$USERP2= <user>
##$USERP3= <user>
##$USERP4= <user>
##$USERP5= <user>
##$WDW= 1
##$XDIM= 32768
##$YMAX_p= 466249357
##$YMIN_p= -693976
##$CURPLOT= <Network HP LaserJet P1505>
##$CURPRIN= <$Network HP LaserJet P1505>
##$DFORMAT= <normdp>
##$LAYOUT= <+/1D_H.xwp>
##$LFORMAT= <normlp>
##$PFORMAT= <normpl>
##$SURQMSG= 1
$$ End of Bruker specific parameters
$$ ---------------------------------
##NTUPLES= NMR SPECTRUM
##VAR_NAME=  FREQUENCY,     SPECTRUM/REAL,   SPECTRUM/IMAG
##SYMBOL=    X,             R,               I
##VAR_TYPE=  INDEPENDENT,   DEPENDENT,       DEPENDENT
##VAR_FORM=  AFFN,          ASDF,            ASDF
##VAR_DIM=   32768,         32768,           32768
##UNITS=     HZ,            ARBITRARY UNITS, ARBITRARY UNITS
##FACTOR=    0.250966925370066, 1,           1
##FIRST=     8223.43324360095, 102806,       205618
##LAST=      0,             8714,            -290839
##MIN=       0,             -693976,         0
##MAX=       8223.43324360095, 466249357,    0
$$ Real data points
##PAGE= N=1
##DATA TABLE= (X++(R..R)), XYDATA
$$ [...]
23835 -101126 -68448 137994 247165 62174 -130463 -137905 43920 331349 90230 352966 -143502
23823 -98024 371099 48908 62290 255866 403393 -81643 -138358 294333 319185 -78949 -141880
23812 -141880 114802 -6826 21595 165976 420046 -36374 -224998 391449 -13122 -204605
23802 -204605 185230 160373 -121775 -93786 -190412 107434 366252 283832 19486 -20965 -129490
23791 -129490 -83839 -260741 40728 -4213 69473 149220 -316303 -5912 -99718 200752 13838
23779 274559 -54773 -40781 66754 -2457 -118991 -108402 -43249 -110305 194720 -11698 -82964
23768 -82964 276456 60655 37595 297801 -130500 243742 -87133 12095 -98879 -129070 56579
23756 20623 121855 -260584 200245 25470 -85774 29385 21016 -346502 41570 99670 37312
23744 -143854 127401 185333 168346 245186 -91602 -251644 323003 85866 66133 -7603 -93564
23733 -93564 -568749 80433 114771 -191962 48935 398689 307770 -13957 73940 -311653 -224783
23722 -224783 -155068 9410 23930 -157212 228312 -42685 94986 125666 -88638 -311863 -208270
23711 -208270 213532 167051 -97926 -60225 -262349 -33340 56467 59450 18233 6225 161711
23700 161711 25773 97755 101209 -155941 -98866 -147207 -68485 -53329 -11071 -27841 -212574
23689 -212574 -381401 156160 96120 -101489 -194991 209368 219558 24616 -1717 -4971 -151813
23678 -151813 -283504 70368 -73747 -335665 -135851 -76234 151117 -19249 308691 -111909
23667 -167063 -53573 -73982 -173142 -9066 352926 -444853 23866 -216543 -72846 -36128 53391
23655 -62912 -212634 -23986 -42774 8058 -288101 110999 -226496 80590 186748 -161860 99751
23643 170983 -34302 129838 -245992 100077 -226526 -17751 34746 -68182 -16300 -8034 49247
23631 32249 258895 18155 120020 -57982 -291328 -282791 -241384 66061 140020 -115454 -181661
23620 -181661 -391733 197051 -143799 123681 14579 -22179 -216738 5943 -170494 -144797
23610 -144797 -35469 103237 82134 -22897 66686 -175493 7786 -115698 -6280 105494 146846
23599 146846 2748 -97308 -5065 21327 -55201 41379 18599 43712 -25426 -81830 54955 278276
23587 278276 -268936 -314567 180367 246938 20699 -229420 12818 350662 4450 -7994 -138087
23576 -138087 -162746 -52639 388398 -24 -125578 162448 97365 -231617 155013 201777 99588
23564 -16046 97490 135081 -63727 -326419 73446 163721 -31516 -271306 5433 -129741 36619
23552 -131914 -193576 -99798 -124402 51287 107925 -118978 -224834 -111889 63222 -199206 348228
23540 -183210 748 94945 164033 225253 -12301 -204947 194116 141722 249624 -94812 -19766
23528 -162966 -68158 254407 60237 -60797 -10501 318880 74735 -193016 160339 7833 -342187
23516 170938 42758 -133431 -93558 107993 -349014 -192596 67935 -267253 -147659 34557
23505 -114413 70464 236228 -34261 -184152 53348 -79775 110461 12060 124655 89311 -14280
23493 -312181 -31370 -161578 -110496 -23147 -91130 -213805 189396 112744 -91151 -6942 -127306
23482 -127306 -100387 120439 64006 198524 262107 264057 -64049 -502958 132324 84842 -49761
23470 -75729 -11496 -17665 -18753 -27376 252986 -44899 40926 65559 -282724 -156863 -327027
23459 -327027 -112161 76294 -91512 -187280 -359768 350661 -124199 -203004 103440 -53231
23448 49106 -90930 -16790 -52230 -212055 365731 -54647 11733 269091 -441595 121838 19015
23436 287723 35371 -295773 -58278 -264977 168736 120475 152619 -228525 76120 -243788
23425 369752 196698 103149 119208 -261123 -132143 205693 195397 146683 -328492 139944
23414 277811 -166038 -131300 294416 134032 101237 -35044 -126063 268291 48945 195277
23404 195277 200023 -328062 -33713 189048 -106354 -58604 -47251 162378 42430 83596 -78560
23392 -241552 239005 343429 39895 -300634 -172342 -13289 -11413 28300 103422 92781 -277911
23380 84503 -350855 168877 40644 -118056 -218558 31562 -50082 261802 -271850 -128382
23369 -221110 197955 -86607 -39671 -34777 -27114 -135062 -147861 297226 33283 -206138 -123624
23358 -123624 47875 -202557 -15616 4031 77745 -188254 226903 297235 12299 -157112 -73175
23346 -64382 -52928 120066 43178 -101148 1652 -123280 19038 -272786 -190472 -39501 192727
23334 6287 56091 -35907 1051 32807 -266076 180338 -156448 -232805 174511 57370 133101
23323 133101 -365257 14077 18080 362859 202263 -216263 71886 -221328 -116043 -433192
23313 -433192 -232655 195048 119619 11033 -201270 17160 365921 -126985 -249412 72701
23302 -140590 -162455 -96517 -144560 -160414 -10944 165827 237602 -151033 -30904 56671 98076
23291 98076 -300535 20179 185671 320323 -54177 50633 7562 -28521 -87114 168643 -74650
23279 92547 105293 271159 -82432 153916 -30131 152346 -122096 -159055 -2654 17861 -344116
23267 -169578 145429 -149162 30610 -372986 29823 -54804 171947 -331577 -220131 -182051
23257 -182051 139009 -150678 53796 -79565 -7863 -239148 23959 -44764 100769 -189676 -59853
23245 -76994 -58281 167118 54760 25669 -50680 -49540 325511 52409 -57240 155360 136040
23234 136040 -184916 -76391 250924 -98452 -59782 -173379 34565 -197109 -20362 126549
23223 30956 -259901 -40288 -124573 -173892 154315 165797 128011 -52134 80978 102895 137151
23212 137151 -80525 6659 -49040 -248020 -217084 -80938 -406142 -9436 -254365 183541 -183570
23200 -51722 123304 53488 -51018 45926 -107648 -236052 -33654 -65850 99711 120514 -193192
23188 -84272 -5006 -344144 -102059 -162168 134813 194459 -122659 182672 -215999 200507
23177 141367 234936 202464 71939 -243931 97530 81154 -32023 -57530 -271214 69835 -52562
23165 189688 -52318 -206601 -7332 -83711 -62641 125671 49822 168002 -76003 -79546 -79735 -98081
23153 -98081 -33608 -307093 -89027 220781 -124777 -78526 -11941 -235908 4111 -386514 -101767
23141 52499 -116191 -105190 30590 352973 -448393 187242 -99061 -15379 20288 175665 1105
23129 -9021 124460 -24458 -20397 -31173 65529 -12441 52034 270789 -7221 -282772 -136779
23117 -37137 295959 -125225 117555 -65448 -120202 -379031 46740 66790 9195 -263873 71955
23105 -153176 -49650 -179226 149582 -69645 -328869 -161541 -34158 -28558 -270199 351535
23094 -104038 -78003 -54212 44660 93925 -207548 -164682 66231 166897 -6224 -352393 -70290
23082 21286 -92929 30734 -37352 -82525 -21433 -26097 136842 74002 -244464 20855 11125 -117493
23069 -126124 239528 -339242 176274 371426 -151000 -331594 -165655 -179872 67348 -57034
23058 72131 37785 12519 -112132 209544 95038 -87037 -74790 -277196 29298 251579 71716
23046 -92947 260795 20461 121416 106445 -71152 -506081 152026 -133852 721 -15020 -157530
23035 -157530 -213672 162078 -112388 -51031 250156 61586 110770 42336 177882 28931 13756
23023 227387 -369566 70460 124536 171614 18111 -84562 65320 34529 -77399 240046 -277111
23011 -105510 -425455 -57924 108030 -151344 47692 -73590 -274882 205049 -10014 -249143
23001 -249143 234434 -534014 169862 268684 86186 3770 280747 -231914 -193625 -64561 83229
22989 111896 20351 -19904 182379 262306 416658 14032 18298 70915 -145585 407431 151817
22977 110163 -96980 165922 56958 4841 167151 -151853 31640 69794 344795 138994 -945
22965 -161858 12962 82891 -70561 1944 -476500 -223356 -204272 38368 130046 -278671 90257
22953 -328320 223661 -117591 -139584 -12502 -116576 -269121 97400 -118236 30972 -68824
22942 -249530 243814 155038 -221410 -397980 2692 41062 -205496 -172725 -169885 -49207 -155139
22931 -155139 -201717 -82800 376444 -180990 54123 171213 158257 -153776 -197568 -301794
22921 -301794 92208 191881 -124243 72618 15280 318005 -83389 251952 -161772 173041
22910 -69768 196775 -83658 -234226 -140051 -3679 666738 211581 -194616 -25103 -138098 -167102
22899 -167102 116730 -31547 -245343 221644 27931 297 -243761 -22352 -113766 -35261 -25658
22888 -25658 -293968 -55819 -145491 128602 55874 -39045 -62431 -79031 66618 91519 -357480
22876 -228299 -116174 -245073 -2010 32169 -36638 -122430 182630 88170 239159 -51760 -62219
22865 -62219 233310 -186748 -255287 -40981 73399 -222884 -51780 176301 13543 -84373 7767
22853 -153050 -148542 -132549 -140549 -293637 -166703 -12431 172619 119658 55780 -140177 -126403
22842 -126403 57489 65902 -324717 13850 -216364 -67388 -38791 -198451 265448 81517 -6867
22830 169988 -177356 -122498 -667319 -269183 -116875 -187510 72818 -51506 -116830 111978
22819 11057 -17339 -220381 -295144 224868 -203079 -171227 50066 -125636 -169721 452655 -346481
22807 -92345 299623 91582 -80746 -441639 33233 -76054 250782 -62471 74018 109181 -481399
22795 59346 -163166 6667 -33296 -96040 -101839 58828 4979 35794 -305589 -71125 142211 -101440
22782 -120015 -49948 -22219 97689 114194 -133602 -18433 227719 2864 -181853 -135568 -308209
22771 -308209 85890 258365 162119 -89972 -136809 28830 -37119 -209268 106502 -62735 -262324
22760 -262324 -70826 -195591 86609 -136413 122643 269666 20119 -88136 -27487 237452
22749 -148681 -50902 -96199 -371396 86766 241195 -254765 118658 57416 11297 194732
22739 194732 -226284 24337 94610 123525 25792 -241380 201617 -115799 -191689 -91930 -142035
22728 -142035 -214195 223916 67289 -107065 -71923 -24416 -119593 153730 -165774 282640
22717 4958 -63497 86037 -21747 61991 -224946 -93980 -71193 166195 26584 -228870 7024
22705 22694 54912 121351 -130021 347096 52632 -728 -87013 -213574 -114148 32372 88808
22694 88808 -233284 67846 211217 -113864 -2828 -112659 81860 77890 31689 233970 -281085
22682 -290276 172023 -64092 72842 -12037 -30935 -364455 -105648 -188047 -133462 -374307 -218780
22671 -218780 55475 36811 -27202 44160 -168516 -276772 -240878 83843 47643 -21620 -62577
22660 -62577 240950 292899 -30656 454370 87934 367587 21093 -169489 660 169513 377090
22649 377090 78598 182164 -141850 -7370 -175047 397973 -101779 -352138 -107274 242453
22638 -128435 195833 171357 -247254 -13926 -331967 -242419 -136126 -18971 -191730 231274
22627 -102247 -213922 -109552 15947 -76183 -69077 197592 355160 -411687 -103964 -223804
22617 -223804 -39785 -193348 323735 -7922 -133567 58307 12055 -182895 -356003 -177972
22606 -115698 -116746 -212374 -35426 514882 -20545 -411750 -92046 -46590 9678 -23203 204769
22594 254446 -33923 -116535 -50226 -142629 173676 -33306 296220 -89408 231763 -188656 -28725
22582 259183 8513 264223 29998 17406 -197699 -32614 152284 78862 -324871 -295616 61981
22570 50746 -145181 84745 -90618 5046 -32144 -238751 201859 128064 45827 -240452 -30060
22558 -27035 99988 102259 -6208 197487 -14435 86582 5425 -341216 -92409 55217 -82259 -148258
22546 -148258 -25340 -338633 -116229 18229 -226223 130091 -275591 51615 104998 -179194
22535 -163088 -102462 25832 -183052 111280 -79577 -456589 70404 -29851 -47176 -175499 96584
22523 -8129 -68079 -263253 -119091 158228 113538 112130 28556 -190234 380569 -104222 -162339
22512 -162339 164233 112615 -395682 -193376 165538 -330714 208798 -4409 103982 64727
22502 64727 -295854 12866 -208693 -64422 -31916 122078 77761 -220225 -57301 -49137 -28327
22491 -28327 -13515 -101579 225483 92646 -83877 135049 100724 79001 235833 -115245 179153
22479 -162577 -453024 -76585 57246 -53475 -351506 -102631 60969 74912 -139399 103185
22468 -484233 -127967 229979 -217526 92189 -344223 147618 -193134 4829 177060 -56616
22457 -10993 -14683 22609 -3330 -252605 83848 174356 -229080 -111738 -80068 -277539 -151511
22446 -151511 -283070 -157255 465923 -21591 109427 -19322 202680 -116124 75069 -252724
22435 151895 73978 -37704 -53169 -123442 -344063 -15184 56733 -77206 255114 113869 27587
22423 -187576 -241714 113267 -121484 -180288 -59715 208038 -240276 31050 155724 25417
22412 193475 43151 -79151 -248228 -145111 83352 158827 39136 60242 276483 139560 332942
22401 332942 99162 -72956 -336445 246566 228974 -217050 -202216 -194897 317985 148719 -183941
22389 -23546 -281006 3284 -279471 -119610 59804 102456 -125675 -216465 195660 147239 243748
22378 243748 -19977 -237981 174693 55402 -195674 -100792 32203 90227 -3629 138465 -128082
22366 -102658 -376300 -154001 236338 -166495 -50540 84572 -216283 38438 324895 279382
22356 279382 58391 103669 -149214 -167117 -187823 -83868 -105470 -254601 165965 -16684 301712
22344 82785 -231981 -110798 -114636 -443203 -17865 -245349 54172 -17968 195084 38303 -279170
22332 -97440 -60674 51664 -252806 -77166 45569 62847 41344 -343630 -43042 -69206 384672
22320 26119 -21007 20475 70857 96975 -100764 -149175 -273619 51003 -525348 75269 505482
22309 505482 116703 22992 -139254 -69044 44182 -2640 230898 -13126 320418 -224690 -239303
22298 -239303 18499 108372 18013 374451 -152846 -106398 66745 -76587 468709 -32618 -113204
22287 -113204 -121950 81872 -74688 -11624 -261116 -194315 -193760 -73795 46755 271010 -117338
22275 290169 -39753 -117431 13991 248651 191837 -65503 -10459 198084 118865 -53819 -365248
22264 -365248 -103971 -70503 -53355 52446 -33526 1325 -341161 80872 121228 242987 101323
22252 141399 -176599 -187004 265535 63867 202899 -55912 -27601 157280 153473 71354 -483892
22240 -317499 -88388 -52011 -141980 91190 318105 -37973 79855 205505 -120054 245930 -18150
22228 41038 -314341 254457 244116 86415 266206 21581 -56335 -383361 -517793 -156986
22217 -124343 -26529 -175053 -224626 -222483 137822 -84946 114006 -53136 -237397 -63295 -86163
22206 -86163 -8657 49575 227120 -53817 19354 123535 -44851 65665 -357798 -350531 17510
22194 180261 -294021 -457103 157753 189869 -68482 -103 29753 -387742 -96137 106296 85923
22183 85923 -375517 -188167 49650 -87802 137373 -147498 14380 -130560 -324263 230273
22172 17497 -295843 -93185 -106469 -181130 249471 120770 90726 152744 -82101 -348000 -52923
22160 263527 -104326 111981 30654 198021 151412 -136896 -376413 -273025 -180645 7659
22149 -225525 -79378 -8402 -147279 -187466 70465 77851 116783 77450 313238 31831 -352276
22137 64903 110220 208851 21782 65615 -49428 124957 134377 201661 -145720 -18846 -315614
22126 -315614 -201558 -217393 -69369 47141 -132303 -94224 -111176 145779 407921 -230981
22115 -251103 -110364 164038 -155908 -34260 55362 -176215 -90432 -202476 326879 -181585
22104 93603 58310 121939 -72680 -136891 -326107 85207 -79221 108138 -220530 220290 -475800
22092 296383 42955 -183048 -195114 89295 258162 -26180 52037 -258546 -70844 60377 -138024
22080 187330 -112892 6448 -153437 -157251 -124466 -192238 -191761 -226192 -444819 -7057 79940 -262309
22067 -49537 56221 149995 165774 -60100 120024 128108 -36943 -126923 214874 -108682 -267239
22056 -267239 123131 44346 -47382 -211385 -96634 4495 -89685 241344 -34121 -97677 223562
22044 56851 -63616 -43922 57349 -167004 -240868 110917 -25758 140307 66208 -159499 -36132
22032 -195505 -49757 -19486 3104 229886 -129065 -240815 -43880 -219076 -134734 -288192 188553
22020 78811 -44522 -79081 -76113 -31250 75673 286932 439572 -115360 -129845 -78605 67179
22008 -44722 143912 -325128 58426 -170004 -46353 100523 150407 -57272 -174521 -184516 -94051
21997 -94051 -226524 1283 -117950 -148741 104411 207858 195745 87548 -211150 16517 -105383
21985 -235897 -106679 -88098 358028 91436 -124860 421815 -31191 94057 -41587 -161991
21975 -161991 -262713 -17879 -425885 165509 -134308 -92917 -269654 -32720 -125843 214362
21964 -122388 -28460 -277904 -422940 -62353 131238 -268846 -78432 41261 8313 -321065 10972
21952 -47862 92632 -145708 -314730 212366 -240808 158482 196693 196387 -403184 -32984 -114324
21941 -114324 -172880 270912 -214951 582160 -272056 9487 -167925 41299 279863 -54874
21930 -177269 41104 99825 -83430 -291204 211317 292307 -28919 -343472 -40587 10459 19941
21919 19941 -259423 118794 157761 -78016 -423863 55302 -91161 180385 -69381 -53844 21784
21907 68597 -281274 -267309 -298301 -47044 142833 -75782 43925 612082 -233578 -220478 -238617
21896 -238617 73864 -162366 -168352 -469342 -223884 -78966 -37798 -124204 -8733 -146781 82861
21884 40976 -293065 -49533 -182084 -22772 -264043 -136484 -310319 -512313 -122593 116545
21873 50617 -154406 -116507 -84216 -237519 -307715 -135584 -174401 38922 -150306 149295 -175690
21861 94710 94877 -56125 68718 164280 89712 79830 243091 -327877 -192691 107644 -226433
21849 156271 36919 1642 -18350 -80901 -249488 59079 82236 -210462 62871 20337 75977
21838 75977 280207 -129742 121824 33676 255306 -205493 -133007 110467 -61816 -128751
21828 -128751 -333763 -96509 158066 23450 64224 147709 77418 145400 -234825 15922 -101515
21816 -112832 -445888 106555 -75734 19172 119910 32606 131412 -317232 -190286 -356082
21806 -356082 -147463 -102888 223842 -285009 -224766 -36234 35824 103881 174251 276344 311255
21795 311255 -25213 163237 -300444 -373600 -80033 9125 343732 -108563 -93966 -156311 -176037
21784 -176037 151169 67200 55299 58570 224077 -63223 39278 607 229285 -99696 -278836
21773 -278836 335770 -276720 227046 -140938 236771 -119872 -188888 113766 -51581 -302748
21763 -302748 -278094 209173 -71298 -255570 53993 71344 -155951 33793 126879 -108652 47219
21751 -44047 130588 484976 275747 -26665 124743 -111910 100581 32775 -68914 -65801 -135251
21740 -135251 -67804 199123 127693 41465 -186065 175304 -20760 -139718 -10489 -113073
21730 -113073 -47077 -279449 396253 171381 -169380 232941 -145299 -69265 -404956 153616
21719 112253 28601 -180696 -46752 -285863 -231693 144451 -396560 148741 -209932 -122077
21709 -122077 29643 -174272 -28336 168299 -288832 148083 -262113 -226507 14300 178163
21699 178163 12044 -282775 -115173 34348 -77777 -33234 154860 -1511 190361 -243719 -458478
21688 -458478 -71667 123566 -336445 135154 92698 97894 71476 -95590 -177588 53791 -29624
21676 -21918 -49544 69535 66663 247009 -185570 134419 -188949 147446 -121269 12781 -136843
21664 -219737 -84621 -276618 -458569 -263535 -33419 71028 368873 -92751 34017 -323197
21653 -194639 -60990 -101465 -111285 -288644 -238730 178875 -422601 -41318 -72297 21604 -135123
21641 -277201 -155809 -222978 6128 -3364 109837 -214613 -8184 81725 -357008 -151296 172126
21629 183312 -132404 -266863 -1933 -77433 129433 72472 101262 -105386 -57258 -77445 326
21617 150027 140963 -3842 -82899 265399 -63649 -345940 -115372 187374 -267416 -95885 -115964
21606 -115964 305337 -53925 -136970 -122149 399818 -335626 -40866 26665 -34528 -159948 -259174
21595 -259174 -131237 48347 -95851 -319128 -191700 -55166 59828 -55688 -92672 -124623 -105390
21584 -105390 -261473 -94006 138384 -242217 -271564 -56520 209189 130921 -195657 -236707
21574 -236707 7707 -261829 200470 -99821 233272 -229218 -67409 43352 -98658 -158187 -24890
21562 -263592 -122695 -131778 147206 -237787 -168256 -276713 -45473 73786 -43229 -114319 77104
21550 146306 -89105 5945 -399084 -110835 18264 -161961 172944 -22294 -187433 172355
21539 79499 -316823 113092 -165290 -89692 -148162 -36218 -246032 -63284 -54519 198595 124912
21528 124912 -190375 -186974 32189 -56689 290010 -134155 -16507 96206 -77938 96795 207895
21517 207895 -117035 242364 -200824 -49828 -121070 -3667 174433 39376 6030 90035 -250996
21505 119141 79095 31578 -603 -32373 -881 -49779 180357 -186422 179645 -48759 35816 179574
21493 179574 -357196 -24139 218319 28349 20044 -122975 -60447 -242353 -93301 -26656 265194
21481 -103260 -207378 -182670 91288 -96568 -66321 -222211 -1615 -231415 100662 27553 -244169
21469 197154 209079 -429191 235765 -112397 -118797 98658 105865 -211788 -103091 71458 230991
21458 230991 -131836 16857 -101608 24377 -115681 -358576 -319632 -55045 -30368 -71260 -124778
21447 -124778 203484 1734 -238987 -21324 -257637 229653 -39962 -212304 -164863 204809
21436 133435 227684 -130033 -122385 99878 101849 -123835 -93934 -124717 381329 -18026 409472
21424 226996 -5321 176893 322883 423601 306281 19520 -86119 -58587 284673 -593132
21413 60150 46740 -31952 297530 -198333 23323 77362 -55686 -133132 25629 -226574 -152886
21402 -152886 30163 80734 27729 -198454 -70781 42118 -225746 -111068 -168311 -140528 -87199
21391 -87199 18951 -35573 -81313 -58176 155561 135604 -635608 22341 -237569 -12761 -306042
21380 -306042 -173700 -229867 -319158 -19025 114048 -193368 -94046 -113300 67498 -148216 73057
21368 62488 39975 -190201 247889 204981 42178 298838 47605 -336351 63432 74304 -142250
21356 69894 366234 134161 24074 -36808 -357367 -438446 -1556 109088 -191283 55916 -66675
21344 -138974 -344230 -312883 -21351 -16846 52606 -85810 76064 -16809 -127740 8808 -120829
21332 -19231 -122081 -248994 19649 -67695 -74263 126228 -316220 303096 70653 -427621 -247083
21321 -247083 -208748 89834 139721 -200339 -167905 -45873 151552 -112092 -277688 -87920 37408
21309 97278 -147291 41890 175536 -134477 -249576 -215805 93877 -33623 14110 263685 -24925
21297 373627 -10528 -161988 -165823 -151028 -246935 -389794 -78872 -402382 -75275 132650 -200556
21285 -95464 -161962 143490 332541 -175046 235748 -16260 -153747 53098 -128945 -301075
21275 -301075 3654 -316423 -135491 -221153 390993 -312853 -5907 -87139 30748 234017 177697
21264 177697 5161 -242845 -189089 251789 -158223 80281 -66977 -163859 -233080 2262 176925
21253 176925 -123705 -106624 -86071 81826 -500782 -5844 2370 -239160 82154 -447680 -25161
21241 -108881 -89951 63685 -112477 -28793 189658 -245500 279396 77199 -251058 76347
21230 858 221585 -196326 -216016 -248234 84840 -291903 16222 -30361 -137360 -200948 48725
21218 -116811 35321 61443 179573 -28334 -220203 20081 301002 -22267 97802 30150 96948
21207 96948 114930 366912 -217150 -181082 -197395 -444809 -224518 105641 -71163 -22847 -258696
21196 -258696 -219178 -35686 -267271 172236 -162010 245791 44925 7148 -118367 -25313 -5485
21184 -122125 -81326 -63317 17834 202481 -87677 -196542 -242690 50652 -78336 303301 27826
21172 -37256 305628 55378 -107130 81992 -200822 -107532 -241623 4492 -329113 -409398 8740
21160 486257 39635 -29424 144180 -28213 196307 -81787 150549 -38424 -316191 -217741 129658
21148 -167166 -7582 -293382 -40993 207190 139665 -285321 -117863 -419470 -33569 -99396 -154590
21137 -154590 136787 -66613 -481 -143736 -207652 -108074 -241492 -295933 -32933 101272 -122606
21125 -122334 57323 -154074 -454259 287536 -30437 241258 -153571 -20677 -29728 -3428 -114294
21114 -114294 -23241 89320 -117469 -354699 -232915 -128887 86986 -163577 -108347 64448
21103 164466 -283888 -142940 233602 -138556 -94286 -138633 19514 -25973 -171347 -125776
21093 -125776 -131695 -105932 153016 -158973 -1905 -11614 -12532 -281996 227821 -132965 -75936
21082 -75936 89947 -74243 170730 -460138 -91353 117454 -288397 -28733 94134 -405966 -146383
21070 -156887 -195763 -39666 -256761 315874 -232774 -27667 -201274 -294562 80219 -89233 -1214
21058 61725 -64062 311075 15722 15965 -11846 -180116 -142973 -147781 -324548 193550 -84078
21046 -177535 97104 -212156 -164033 -150457 278757 7186 -190545 -180643 96234 -33880 -80518
21035 -80518 35882 -70052 -290558 103158 -222409 -103262 15159 -172771 170572 15090
21024 -19325 137885 71299 71269 89147 -114589 46467 42619 -23697 -16260 104715 138723 108559
21012 108559 14983 103602 71555 -192552 109610 268506 -63069 55964 -152340 -135934 -43514
21000 -91974 -112027 -79928 315140 -187321 -339906 53818 125837 -293739 107883 -72196 122519
20988 924 1261 -290431 -41968 132205 -47215 -80806 70251 -112178 -191973 -113003 56182 -149754
20975 -330579 -55074 32502 -154978 -11430 64031 -132596 -342290 -229356 121568 -188738
20964 -99935 110940 112682 -195120 -232212 151133 -315969 122319 275142 -100869 -62437
20954 -62437 -177885 -53155 270935 -16376 -83613 47936 98703 116175 -39430 -90500 -26061
20942 -73617 -112978 249222 -260623 83698 -22976 -40311 153113 -37295 -76546 -216046 5042
20930 -184822 -25619 136151 -183210 -80223 -183678 252367 178773 110592 150031 -54741 -96553
20919 -96553 75256 151829 106849 10182 -122881 152452 -72276 233827 285898 128471 -386273
20907 -238634 67780 157843 -88764 -202773 186207 -126740 11117 104957 -14305 -273581 -12158
20895 435512 -538071 65741 -141779 8590 455652 137617 247889 54437 -118154 -544936
20885 -544936 85879 135200 -472495 -219835 -100563 8282 -284250 166283 403738 29716
20874 -161159 -263026 -129014 -117466 -107389 -23390 -251609 143041 -76623 216323 -45423
20863 -166464 141703 -226912 -136716 80838 130882 -240121 31850 -322894 -6617 -266889 128970
20851 -253738 150132 -132767 -252408 21821 -169436 -366080 90634 -131111 -238870 -108347
20840 -132171 -75088 -54101 18211 280448 -159387 94787 56136 66940 73543 -32518 -61981
20829 -61981 14168 -59891 -81763 19617 -107514 -529290 165538 -173796 309033 -351701
20818 -459627 9417 -69113 -215953 20600 -186170 -163436 297282 -351823 -17680 -107508 -67880
20807 -67880 -108793 -36251 -266289 -259893 -24934 42236 -39415 -102921 344744 -361434 122779
20795 -32300 131142 -170967 -70179 -112377 68229 -52915 -354883 -43838 52902 -43850 33423
20783 135821 -137808 -18321 289139 -147065 -176658 -283030 -45965 179272 84305 -167822
20772 50056 -248676 -74096 -165591 -247555 -345560 -63117 366813 -15536 78220 79320 -597930
20760 -32494 -96254 -401940 -423083 138590 -30509 22501 -85309 46117 -160251 -359704 80938
20748 219209 -382301 76240 24165 87689 -73282 148552 135632 -281847 11887 -226639 149080
20736 -78074 -31541 -115570 -175238 272202 254552 2938 -104211 115435 -22150 -43150 38603
20724 -158219 62276 -103542 137647 -14682 144899 164038 -59089 -293007 136221 142882 68353
20712 68296 -146413 -44815 -152842 224942 -134036 43713 -441986 4943 -92390 -3175 -65691
20701 -65691 55896 91452 -73154 73822 38074 76085 4469 121428 201803 -42175 64019 182620
20689 182620 62248 -294458 -10889 42241 -22933 -361600 -312220 -37482 55324 49326 -293420
20677 -28361 -78033 -88773 -131518 -128168 202156 -62992 -272836 -219544 -346006 -22166 -146507
20666 -146507 -249986 -252904 167402 61140 128338 -247782 -98632 -159003 273547 -132399 -149406
20655 -149406 -207997 36260 -87402 -87907 -138679 -251718 185906 -260102 -133289 -475024 -71963
20643 -80011 21964 -75184 145814 -185371 -303713 -160997 -180390 111247 113162 62119 -210031
20631 -19467 -86832 28394 149066 -7261 -227617 -92754 -95021 17381 -190274 280672 -190275
20619 80318 -89935 124265 -43639 -107168 -71039 -6323 -58430 -208124 12208 24335 -102286
20607 -177711 236854 90158 200860 -95699 -167128 8339 -83471 86910 -104518 -483559 299744
20595 -18302 136684 -441575 -69086 -264277 -122211 -9001 -45251 186443 -30457 27535 179680
20584 179680 132275 -88292 -133131 -266700 -140523 -232287 -152522 66270 -121710 -125339 -28263
20572 105614 -100372 152552 -35008 -156129 61193 -211598 190692 -425209 120527 -47654
20561 -8105 90425 -149872 14943 379334 -90244 -107701 106346 112 4437 153344 -14524 -211341
20549 -211341 -482102 -223774 -328682 -159997 14219 111813 28857 7699 -152966 195536
20538 -15356 -15111 -15017 142610 -83579 -95435 136220 -15739 -248707 59566 92301 -306985 91598
20525 108637 -240754 164414 215497 -131636 -340834 -265235 -103617 -329340 -422237 -170771
20514 186193 -36135 126597 -437507 -281002 -196172 108436 -188814 -80031 -169972 -183909
20504 -183909 -149491 199553 -160413 17950 142127 209411 45428 202196 190254 148887 166739
20493 166739 -12314 -80959 4549 -135946 -376625 66507 -216289 -321920 -128519 -285304
20483 -285304 250425 28493 -31855 266007 259004 -110534 166303 208983 114212 97017 -43271
20471 129451 -286409 104946 -18619 -127337 -103207 155596 -55410 56205 190653 -330735
20460 -73963 205495 -274609 -238160 -215692 154297 -84659 125081 -394193 -41947 123433
20449 -32641 -187649 -141676 51599 -117036 -84152 44859 192011 -162322 253811 177129 158828
20438 158828 -252084 93899 17700 143878 2797 46758 -32984 -232031 -108916 -100851 -155589
20427 -155589 -57495 -85644 -177779 -272486 -245347 -25997 -8866 939 322692 -93587 -51576 -196892
20415 -196892 22815 -17320 52387 296077 43064 -276795 -339264 -7180 -56144 75815 10842
20403 -220532 -123123 322580 -136320 185569 -65277 -109747 -144813 -123938 100807 84450 317378
20392 317378 -90977 260600 -296021 -101937 69724 -111153 -77114 30282 103658 -240874
20381 97604 -285143 -114972 -40282 -141640 -213499 -101063 69351 -149050 -210860 -99860 -13768
20369 153566 -143633 -326623 97938 -69130 5741 -22943 3439 -248769 -13674 -73176 -155476
20358 -155476 171983 37802 159147 -411350 -105565 -79078 -78662 -337152 42848 42457 211486
20347 211486 -19816 225703 163555 268730 -235235 -264906 -20113 -30785 201312 186960 117333
20336 117333 -228670 -264813 -239925 82893 26073 17081 -115518 264349 82442 -358324 -30929
20324 -90081 -258890 -453786 210427 146475 -121847 -147214 191749 -16208 -416075 193299
20313 81030 -40563 -406295 -269237 88768 68853 147469 18589 -194935 -8423 -68692 -112542
20302 -112542 -169528 3397 -90466 37069 -403047 53108 13158 93241 -31465 -111189 7542 -115746
20289 -65595 44612 -69298 -312779 -65873 22548 12569 -257300 -294102 -3318 -21370 77758 -66902
20276 282698 116692 -154982 -123806 -30136 131652 28803 -159250 -200435 -113676 -131788 -53320
20264 99457 -31380 -154562 255483 1982 -265070 -270188 -298989 -294248 -160879 63763 181975
20253 181975 -27138 164270 24437 253281 9660 -436866 -101979 312230 -19995 178150
20242 37745 -22271 -11072 -232213 -85238 -159244 -153834 203323 -409466 -72573 76498 -186003
20230 -185112 -140797 22152 52277 -14777 -55353 -236477 162389 -162181 -575508 -46794 -314036
20219 -314036 142706 -63556 169732 104293 17525 154219 -213151 -69095 -273460 -4812 165668
20207 -164887 -5952 -433198 1616 -316998 -112090 -173864 -39178 159669 -74669 -238246 -316412
20196 -316412 32753 24901 12398 -57648 -1924 154538 389643 867 -115190 -190810 78125 72167
20184 72167 23766 -230243 -77528 -228288 -213912 -169452 -112489 -110959 -132185 -16264 11169
20172 99827 -114679 -201730 -108151 -24083 -413582 -69229 193203 -112599 167690 -223261
20161 -214104 454 17494 20576 -324174 -109674 -259814 -9508 161599 -2793 219975 -121206
20149 68413 -200844 -194585 89822 54718 -54049 152574 72795 127983 -245390 -19681 28358
20137 225386 -31020 32749 157316 33944 -40363 -24158 -297329 -55842 429263 59481 4967
20125 137855 99515 -148722 -176612 -274888 92761 -93474 23975 34323 -167897 -68795 140458
20113 -284279 109232 75761 89782 -34273 142833 -221161 108199 135697 -174167 -80338
20102 229614 -288579 -109634 120495 68752 -43991 -155803 -124914 -161087 37644 -109246
20091 -87595 96786 -214296 31430 -55374 -261959 123599 -224732 -202665 165376 119436 -126300
20079 63741 236903 -53734 -54492 50116 -76891 -8494 -10089 91310 -4849 337907 74676 -168469
20066 -130967 -26200 110540 43014 79928 -52743 -56440 -37168 -42847 80519 45261 -207414
20054 -706 -88805 50126 -201043 -201775 100683 1729 267745 -22983 -34265 31082 -77112 -104578
20042 -104578 169529 -6286 -142694 67201 165080 -397520 -193943 103008 332655 -211324
20031 -86377 71999 7536 -157848 17528 46674 -130072 -77000 -115848 10952 -139196 -172675
20020 -172675 242458 64066 -115816 -49174 -71031 -253530 99862 -2737 -94010 -146735 70817
20008 102897 79075 61343 45821 -47610 -4370 -91397 -231086 -80133 8348 -104538 -40274
19996 -59139 15697 252910 309779 -12953 174040 -135601 -138238 -17928 -328414 -250001 160220
19984 144633 -286764 -193146 22195 -153203 22580 -77548 112691 -24996 93860 -138711 -196360
19973 -196360 -11660 -113278 223132 -135927 -124662 162844 209088 104726 -75057 -327546
19963 -327546 -1646 -223908 79236 -563775 -272667 -130717 -12857 -104925 107172 -141444
19952 -185176 -11395 -135844 -85623 -125269 -197987 29032 95718 -75792 -95251 8258 13573 229320
19940 229320 -112891 -69579 -193895 83146 162994 -181124 -202 -119553 85416 -64685 19743
19928 23826 -230201 -248754 -428232 -251205 232920 134386 -270428 -402395 -272889 -101289
19917 -49571 -29046 -180966 149460 -126672 -27849 -170006 -263408 -248577 -199840 -235441 -166805
19906 -166805 -58988 -410420 123942 148309 -385640 196237 204647 -198845 39442 -245079
19895 -21929 266864 -106954 108109 -387613 -262480 -62371 -281564 -1741 -125680 -70759
19885 -70759 -41053 -70657 156368 -117257 -109477 -174651 -182134 54288 152750 -151699 126524
19873 -243775 84016 -31350 55040 103437 -241380 383860 201492 90808 -142189 -9805 -103585
19862 -103585 -42064 -99875 -236444 -123814 -280943 271760 -13463 -347731 -103031 -177803
19852 -177803 -158994 -243904 92888 3603 -55676 171213 -314309 -356904 -132277 -349802 -209791
19841 -209791 -38841 -321381 -103851 -67348 46503 15609 -263997 108123 77917 35061 78543
19830 78543 -39337 -48472 -177190 -15213 19 151591 36757 -77193 -103020 -229267 -250127 123045
19817 -383267 75558 -378613 -39653 -66019 -38439 -91481 -127172 -47976 -249098 -55619 132190
19805 138668 -101033 -251609 -75603 91762 -14133 12958 202937 -382479 -66749 -137964 -90461
19794 -90461 -273275 -212846 -51227 47069 1718 63858 69020 -37212 42026 -71274 174386 21142
19781 57221 -184243 -60147 -324592 205763 -162817 -258864 112771 -36381 15107 -421712
19770 -108765 -36258 88534 -86122 20098 -167523 53657 -275588 162390 14651 -278266 98858
19758 231425 99222 287556 -192449 112069 -157263 54022 -70051 -110992 148475 98473
19748 98473 104807 -86749 -22914 -57754 61057 55329 -262128 120517 -237727 106351 -9295
19736 2015 2236 -142427 -21729 195856 96337 91366 -63264 161446 -338418 118412 -284192
19724 -49662 -105442 -108335 299698 -138841 51855 89733 118061 99022 -153126 -227294 73535
19712 -48851 378511 187719 282567 97371 280048 297832 83870 77030 -121208 133309 -281017
19700 -93308 -122452 -213704 -47351 -115478 -9650 -30557 18590 -230596 -18860 84546 -139251
19688 209192 166838 39714 -12712 -9338 -342701 88355 94143 45991 -126875 -337506 -50438
19676 -295635 -218693 114467 -264498 -24488 -195970 156312 -49251 68848 -119937 -104069
19666 -104069 -102777 -211081 -111672 352864 81909 10818 -303392 -120986 -108865 -166347 4949
19654 86676 -104257 199143 50537 -687 -355009 62709 173707 -155624 -370034 35989 -135476
19642 -8010 -323786 -33453 -395561 -258011 -268273 177701 41557 -344120 -60329 -236126 172548
19630 -57620 -145979 -111723 -292550 -449061 -175503 -298465 14480 -106831 1682 110552 219410
19619 219410 146741 -119541 -95079 200996 -230383 -20827 303905 -69547 261317 -51849
19608 13045 19317 38743 -42128 -184825 127473 -282902 -350936 -158295 -91976 -157145 -177544
19597 -177544 -149874 -249682 -123659 144847 -158225 -25194 -39513 -4710 151442 -310029 -181115
19586 -181115 70069 -277893 -191560 11562 84601 -92578 -191654 -190034 69481 -55633 -134198
19575 -134198 72877 234261 -225173 -65161 38016 -92958 217286 -250275 -482718 164821
19564 -204177 242069 159353 -203842 -97917 -46158 -28230 -242800 -307266 -177808 -16687 64329
19552 82630 -66292 -158146 -47418 -99961 127338 176326 -67888 -205983 -342301 70210 264950
19541 264950 -38493 -53026 -129828 161585 -74506 -80533 107346 8579 177633 -176233 69424
19529 -220538 -102598 234914 -256634 -207822 -185364 -260806 -81678 -44458 116814 71793 -67849
19517 -338474 -196783 12068 -104098 -172432 -9662 -392267 223633 26520 134359 -139382
19506 -19507 47626 207498 76655 -160659 -315360 14360 -109871 -244314 -144611 -220939 -58794
19494 -437106 -162829 -57698 -15746 -183152 -53679 -491438 -289050 219816 115413 190640
19484 190640 44406 41568 -30499 -347205 150806 -286233 46292 -343301 -9518 -142757 215009
19472 -78105 89538 -7532 -198490 -322743 -120191 8783 185937 52293 -157645 -99674 -77683
19461 -77683 -134936 169939 235753 -87832 -196662 -77664 280750 517 78084 264644 -358997
19449 -26862 -2371 -43964 -152624 25807 513067 -98667 -30914 269133 -202129 -365908 -55326
19437 -220050 39502 -28893 -158419 89275 -218988 37424 -76217 177580 148758 -131301 32520
19425 -390092 -135163 121713 54426 -377798 -78016 72638 189906 137529 -109381 15272
19414 -170945 -23771 -30045 -484067 148111 -420712 332002 -310421 -246627 -58355 -65199 91587
19402 -411063 -36848 -41002 -11908 -4597 -237182 -5893 -263303 32066 -12329 125965 222481
19391 222481 -53412 -170819 -178541 -25862 -111366 85042 200591 66415 -7073 -14345 -105378 -263341
19379 -263341 -543977 -90786 43017 -229298 -259851 -62334 85958 -308441 96033 -277211 -257497
19368 -257497 -58117 -4310 -289287 224037 -138983 -104237 -361199 -441488 16895 57550 -228252
19356 -246905 19475 -7481 71943 52410 45653 -281173 58499 108889 -207804 -11809 -309248
19345 -309248 55609 156686 -93456 213744 -50916 -514423 17372 -366271 195418 -56854
19334 3295 -103867 -161795 91264 -247087 165504 298393 -91208 9680 -8811 -462180 113983
19322 58401 177489 -160268 57882 206744 185458 -225750 367913 154844 86762 354242
19312 354242 -328755 -59380 307975 -123935 -32378 -106802 -51615 189885 66493 -76805 -62901
19301 -62901 53278 67148 38417 65559 186480 -171225 -277924 39653 -41073 126557 -186547
19289 103660 -195378 -333263 -57518 -281854 -105570 165336 -1864 -187441 101074 346955
19279 346955 135219 -211212 -5487 19633 -18138 -18918 19769 275395 413845 6370 57564
19268 57564 -110261 107082 73887 -159001 -85465 -30787 -158262 121837 107254 -37010 -93663
19257 -93663 -160075 -68583 -111494 -124227 -170365 -239469 -196702 191868 -331811 -25843 -28073
19246 -28073 32634 -129859 -62904 70468 101337 -292326 -177814 -88856 -177801 -232025 71377
19234 -221604 -268286 -171615 816 32899 -301212 -249022 -398081 6511 -168172 -209843 4071 -367426
19221 -207515 -364 -117403 169480 -196267 146708 -225256 -52390 -99233 -75554 -175418 -74617
19209 -365354 -107717 176190 -83633 -151395 11167 -75117 -149545 116256 123236 -266063 -159731
19198 -159731 75330 52726 261088 -30586 -184776 -49182 -190494 -19026 -70272 -98873 -289786
19187 -289786 -90939 -83057 -383508 57150 219501 122333 -62345 76089 34196 -267942 -30230
19175 -350690 65841 -221729 185608 135699 185039 -195857 206737 -418325 -273539 -260924
19165 -260924 -81311 -121537 -56359 78860 -127466 -438441 378056 -88407 -29671 -273072 -317286
19154 -317286 217279 34481 -211162 -307758 14649 89231 99538 -32328 -11802 -125850 39919
19142 -438089 131978 181146 -29257 -165947 -278413 -28527 60612 -11063 -237964 291015
19131 99039 218717 141512 -301230 220796 79432 -473068 176204 154211 -72848 -1788 101447
19119 -144514 -87389 -143839 -263580 -83201 -174508 -384118 -302143 -7740 -94262 -240435 -374944
19108 -374944 -357106 -282936 93246 -253677 -243717 -136529 -179090 -270273 102218 -127256 -429064
19097 -429064 -73397 5186 -350445 -67063 -109882 48905 423782 -137231 -294945 81180 20502
19085 -191677 36938 4199 344629 67313 251770 -15716 -64437 214108 111473 -91106 204457
19073 219701 -78831 -193597 -67467 -240304 77928 -62719 12761 -131734 -70475 -157514 -163699
19062 -163699 -197222 62165 -247435 -113429 -7124 -212060 -89743 -102901 -153868 57768 -65813
19050 -155764 -176101 14452 -95722 117928 528748 167603 131299 75076 35913 46251 -257912
19038 -62061 -166587 -290257 -130133 119306 -5646 174406 63056 -319613 -232837 -326290 122692
19026 -237553 106781 116931 -95208 29656 80728 12451 100751 -75901 55603 67352 -127208
19014 181366 50581 -155263 -235398 -123785 152523 103596 27146 325740 534035 141981
19003 -109897 196788 -203990 -10453 -127067 -81451 -44507 -70074 -201531 -122275 -26351 86100
18991 -144977 -31718 -94581 -63397 -151790 -8227 189696 194274 -10921 -162342 269748 -199246
18979 96426 -329753 -336511 104812 -229783 -53914 18843 125698 4644 140237 -5674 -222354
18968 -222354 227665 -96985 -112707 -278444 -19761 -100649 -57591 217693 8043 -193419 -167097
18957 -167097 98582 -236991 -37298 -107922 26322 -68075 -103831 -439815 -60297 159249 -159959
18945 -227903 -76725 -194332 16480 304901 -270209 -20201 11428 115767 -89117 101270
18934 40639 -24003 -153905 203231 48963 34902 -264236 -198652 -242724 -100761 -96093 141252
18922 -317475 -203058 186504 -10897 178028 -90022 -375667 18554 492753 -165842 -102556
18912 -102556 83258 211756 7747 -160911 -197632 -13722 125084 206658 119730 -199379 6384
18900 181701 88344 -60021 -45745 -67756 -35724 -2696 -157122 160039 -64306 -168467 -379297
18889 -379297 -154736 -8578 -81905 -117573 -35650 105139 -18134 126293 -251100 162301 -113864
18877 -151971 -249015 58502 -112092 136014 -126127 69346 -366074 -134460 185557 -53680
18866 17130 347048 104840 -262587 -266063 -130318 -97394 118130 -236819 250993 169668
18856 169668 160318 -271423 135343 -66989 -75463 -157316 149867 151242 -142676 -231780 -384641
18845 -384641 -231906 -131362 60508 -148309 103435 176185 -147958 -296090 49304 -406027
18834 -88546 -9106 -279297 -27072 65839 -22420 -57154 -785 -45870 -201011 92477 -59762 125758
18821 -66793 -26664 -102972 154512 -186918 -176855 156945 -309683 102249 -32585 -161536
18811 -161536 129931 45254 -134013 18793 5863 86346 -148575 19533 -84670 -200063 101602
18799 376738 196406 113600 125252 36163 154471 -62313 -27951 -6857 20812 32801 111058
18788 111058 -55134 -206581 229568 -61691 -64181 67033 -163331 -26935 -99281 45660 -40107
18776 68774 -116530 -53739 -108901 -315100 36509 310293 -305380 -95000 -27518 -222177 -256315
18765 -256315 83287 -52112 -115885 -195102 76327 8142 -52250 -143761 96194 -112837 -255611
18754 -255611 28931 22737 -238784 -180787 -304915 173929 94252 -58596 73392 -91961 -198877
18743 -198877 -12820 -407752 -287468 67387 -127374 -155424 -38150 -223655 152021 -311592
18732 -121599 -215267 37532 -105197 -61741 -101599 406732 142235 -66803 -67662 145793 53540
18720 121018 -325546 -413713 -61213 122370 -42520 -98449 236414 -211881 -159342 -94456 -241240
18709 -241240 285513 208425 158355 172768 -2168 -66236 -75577 -118878 5188 275834 -390287
18697 -389276 -98310 -127413 97198 -326550 -34534 -36194 156546 223971 147788 -65922 -138366
18686 -138366 -108274 5783 149745 -38145 -115008 108042 -40754 -52563 -24817 65117 34527
18675 34527 7143 -346718 -43843 -6152 -7126 -254533 -22173 20189 -67488 29960 -190007 -68675
18662 -484122 -32066 -152515 -184321 -120179 -88201 319324 -139513 -60620 -351780 103873
18651 258820 -266907 -247141 -32124 -98428 -104084 95746 -110662 -42390 7952 122490 97816
18640 97816 167251 203504 -137008 -214817 -132968 -112210 -23783 -106511 196916 32662 -176963
18628 130964 -351684 17058 -255968 -97142 70967 -47606 13003 164079 -10253 -269267 -154681
18617 -154681 -27874 -62483 29624 124003 104641 -32778 291098 -154234 -237444 -20392 172144
18605 276810 -385625 -58586 29362 -138858 1468 -43566 126601 -22465 -233179 -55030 -306385
18594 -306385 -227936 -210751 -142841 5700 64409 -188898 -213331 -43549 -252623 27061 91040
18583 91040 53060 -220446 -46084 -253051 -172193 -49528 -396526 160760 95979 119502 -22957
18571 -252688 131274 -85461 8899 -32410 -282951 66428 -93175 -236296 60062 295267 163415
18560 163415 277073 -225521 -98237 -254705 -39391 -357903 -197441 247114 -183220 -16467
18549 -304577 -7164 -198185 -44719 -129283 -62610 351202 -31781 -43365 95294 -21968 -59127
18538 -59127 161244 123938 -244362 6812 -6634 -142509 155718 -307599 -82422 98377 -250579
18526 7017 -262818 255950 130770 177097 -140955 -82856 45024 -328351 120215 -39301 50931
18514 -121373 -35160 -269032 -145917 -38626 -102564 79320 -135966 146722 -465172 46779
18503 57541 -358304 126125 73674 50213 -304713 36870 -78356 11884 71838 -336296 -54982
18491 -102146 -38322 -164579 -198381 -264964 -94363 23794 64116 -43695 410701 236670 -10151
18479 129141 -223052 -148450 -147202 192013 -69349 -242705 -3625 119045 -284571 -165702 -190427
18468 -190427 84687 -53644 -92247 -369 -186057 -300805 -121771 -302509 -82181 -275849 -279690
18457 -279690 -111323 146682 -162495 -279013 254071 214844 84075 11898 27850 -75506
18446 -146400 -50039 48558 -186732 186691 -171150 -239070 -67461 27257 -204376 -167950 -233761
18435 -233761 161035 -28241 -407462 273071 236220 -213233 -90449 107201 -86127 -24628
18424 150850 8842 -92217 -51927 -96206 -158624 81463 135204 -96360 -96836 -136381 -73889 -115458
18412 -115458 -287682 -87018 178511 -433291 -111741 -24647 137525 -138772 -124504 -12280
18401 -107228 21513 -78301 85448 -149902 -41590 149245 -89922 -77065 338359 -4101 80130
18389 -95412 -79405 108926 98728 -15059 -37355 -201271 257772 -309317 -74366 -49642 -78655
18378 -78655 137928 -171248 -311616 313699 -198181 144881 -36547 -56807 112027 224745
18368 224745 66613 -196492 -5637 40222 -93454 -436023 -11649 -185425 279019 -239636 -114621
18356 -320587 13502 81287 173694 75181 169733 158385 306324 -66392 122304 -233581 -74799
18344 -175322 30539 25471 -96996 29243 173215 -287912 83536 244232 45419 114163 -36150
18332 34610 130314 -81506 99237 -77582 -113820 -206409 37053 -116490 -200085 -257485 95180
18320 86456 -82197 -24632 -9125 -100095 -203523 -32150 -151719 -171832 36587 -174719 5566
18308 -13431 194571 -579793 40507 -27056 67617 -133929 -177203 271580 -176850 -26475 -204283
18297 -204283 155006 163840 -257748 -14051 -350391 -117597 46547 197730 -119184 133635
18286 210289 -67157 100982 -347884 342026 9596 178347 89890 31296 -183128 10004 -11119
18274 -77398 -7016 58761 -115287 -90994 118718 -94720 208264 22526 43195 -202926 -283935
18263 -283935 -199864 -245947 72798 181326 -147051 -176089 386273 -286 -110558 11687 -132618
18251 -145195 -217195 -107988 37084 -31906 -62084 -44720 -207408 -28603 -26775 70567 173016
18240 173016 -333636 99827 -1984 -244429 113888 -316169 -115707 -38879 -139544 64028
18229 -119860 -142360 213304 -95141 72227 -93000 -217662 -176703 -131517 100274 -287345 -188425
18218 -188425 -407394 -64138 -104769 121577 -20198 97754 101005 118955 -134500 215203 223655
18207 223655 99340 -95488 147657 -109339 217665 53708 -157379 -67675 -151474 -159824 -234567
18196 -234567 -95056 83118 -139609 -248994 -145453 -109479 229120 201986 219526 -184550
18185 41778 -67239 37926 -135636 11390 185046 65898 435236 355149 -314563 -43948 25258
18173 -312572 263315 21974 16123 -129094 -18823 -121967 5163 174662 63892 273573 106818
18161 -90935 -113443 -235677 46772 153923 25084 -102095 99754 -70251 35964 161836 138862
18150 138862 -73290 -125171 108165 -102177 -161053 -116089 139407 -19456 9057 -32502 11808
18138 161776 -143523 -202629 -20938 50353 118544 -106365 -321277 -122384 -78290 86223 -80811
18126 -51086 -52019 102893 37837 23977 68406 -4904 -77927 -11859 101303 -267598 139335
18114 117513 -1007 -368667 12975 -191970 -59095 136452 -88633 -64926 -293256 268113 308232
18103 308232 198344 -342805 -118866 226749 -18822 -52998 -202061 -147124 71181 65517 -324204
18091 -125770 13398 77800 -115163 -119740 -264210 -232253 -321550 -296940 85965 -73871 40640
18079 300915 -26981 160043 -262239 328991 -99288 -71199 -17426 -87961 -85415 -312746 -59967
18067 -78133 30464 -163119 139626 9041 287236 91910 -257777 -169969 199320 18340 218001
18056 218001 -3904 237710 -42099 -87428 -294133 -255375 -126852 -20917 -69148 -91645 175761
18044 -166578 -275905 -192596 -195399 -223068 84158 -117976 18804 44303 198957 -115986 -174967
18033 -174967 -548287 15046 40228 273086 250641 236037 -187878 171428 -23900 -390878
18023 -390878 -114029 -161595 -34050 291419 -128217 327672 88413 -68692 -114991 89965 -125537
18011 -147955 -116463 161808 -180795 -146670 138515 50359 -303392 44849 -133220 -85179
18001 -85179 14404 42669 -75270 65177 -2054 385127 18793 258011 97621 55491 -195027
17989 -154458 -20907 -127344 40405 68077 155821 140707 17164 170484 -174325 -248955 162406
17977 -48131 33281 -284664 -110569 -291870 -59576 319773 -2513 335863 -148626 192138
17966 48028 -68404 -108479 -233418 -280715 -28382 362903 65576 -191490 -95589 -50462 11099
17954 285935 313856 -17389 -227282 -296071 -211023 -109782 146311 260830 77619 -1599 203971
17942 -8236 -79861 118644 78744 -125898 -99632 -53720 -516676 101266 -101852 -32830 -309495
17931 -309495 55864 -177972 13206 -4385 -34971 -79438 -67500 85276 40397 137629 -671241
17919 -150512 93616 -33473 -61882 144078 -145006 77542 78004 -15502 -289652 28486 -372564
17907 -94248 133246 73958 8288 107632 175676 41723 233854 24063 -154253 -333866 -88096
17895 410091 -164415 -29328 -51319 3364 -114419 28655 -256115 -151752 62437 -261877 -157347
17884 -157347 -312074 -114079 71226 -236399 -41744 187725 -86273 -167866 -87239 51501 -262368
17872 -371511 351702 327859 11397 290322 143947 -188656 101802 293267 38178 -222840
17861 4937 -7462 224172 86533 -72978 48915 -87097 -63846 77191 -66417 -78667 -49951 197382
17848 -53996 -152936 -83105 -10607 -134491 -85539 306484 -26889 -118073 -188889 -31923 -241601
17837 -241601 -113768 99778 471549 -22981 263740 145794 -63125 -260716 188029 -38796
17826 127211 73669 252518 42517 -174095 13962 -387816 206407 76885 95059 6391 190821
17815 190821 194191 -385244 -73205 152091 392407 89867 -250950 -93946 -38071 225830 -96651
17803 -100552 88830 262969 -101668 103893 -110744 -104370 329562 -190325 -87327 110791
17792 -27396 242008 -8540 324915 -88033 -210704 108521 40544 -265380 -324429 31137 -120843
17780 -116640 -258716 307967 -348104 169048 182171 -172429 -41881 -9430 -453255 302880
17769 -9836 218098 -98029 -27455 -239379 -179661 -43077 -158124 -245373 -48245 99142 -206742
17757 162712 -92326 181521 262158 69585 -376041 93319 24425 -16252 94749 -2736 122970
17745 253787 -186686 9617 -58172 50299 253515 67667 -108479 307131 -167498 -349749
17735 -349749 1720 -397718 235605 -186653 119123 283665 41282 -289087 -149804 -38570
17724 -180966 -62320 -60421 224289 -55513 73477 -93329 -157296 -118184 149677 -195186 -116680
17713 -116680 -115118 25406 60326 -73928 41062 251831 -38691 -286321 56245 131082 -79091
17701 78181 137284 89303 -90691 -104286 -49577 -26237 -124538 -25245 82424 125658 -210826
17689 -17583 165732 326137 -413081 117605 216583 9269 52680 400229 237934 -91925 73095
17677 -131991 122515 -253739 405635 118683 15861 117888 152480 -233899 337805 91145
17666 -135071 186676 160654 91246 88545 -45265 -93038 64875 8362 347551 -163722 -114293
17655 -114293 205809 227364 27211 -46627 -133849 75516 -97521 -119469 -136145 344456 191200
17644 191200 47376 -163073 -256596 296584 62275 205445 -361605 -181435 56278 -47287
17633 71032 -29829 59199 -408224 104598 105803 131589 56213 -288661 -90503 116901 -86460
17621 205600 40195 -383935 158825 -209389 -22979 -318104 383127 112883 19899 77155
17611 77155 323431 97902 81036 -4635 131899 150280 -30742 -239759 145779 -22814 12558
17599 85128 4884 -61915 139915 -115615 13333 75697 192577 -220713 -152587 250130 33837
17587 -57056 -492744 73558 215954 111808 406267 -9817 91857 33310 -215656 67169 9867
17575 -21872 52259 101369 -316293 -140477 121858 -200611 166584 247735 -220168 399725
17564 50151 107146 166913 -171442 18752 -130276 -8684 -146748 216026 -202238 41372 207334
17553 207334 -69401 119393 -81088 64686 -305136 -4232 58441 223264 221402 126835 121159
17542 121159 100441 71207 -14178 184197 199588 173510 -120192 117507 -329317 376848
17531 -71016 8104 362719 -104924 -196006 39519 192695 18920 -125719 120576 -118631 -232319
17520 -232319 164335 88639 -86397 -127813 147830 -3641 101177 100292 168628 272166 94944
17508 -10157 11545 237154 169839 236870 84053 222692 184733 566972 -9896 343610 70594
17496 112370 56279 107299 12199 83633 -30695 351155 296159 -91570 90165 -19834 70457
17484 397589 275485 -21850 -14012 110461 423257 70944 229273 -1283 119974 250483 -178396
17472 11386 298362 89772 66543 -849 167083 267094 344120 130834 187537 319359 66836
17460 -17004 185674 169321 -37432 180836 270669 -24084 414748 444497 176074 20852 94268
17449 94268 162105 138609 -4506 72690 221230 20864 367141 235835 -7273 38398 146912
17438 146912 4019 288310 242372 267897 531114 66078 396500 201628 116114 671705 311323
17426 141504 70646 111576 449286 60545 222519 259416 152573 482483 287419 381539
17416 381539 245120 237933 251273 307473 195496 25863 10410 232538 87616 323711 232507
17405 232507 -28762 375505 19706 393967 277437 531299 41545 222433 178384 288124
17395 288124 289451 -41588 68580 639838 18820 281350 173267 -17097 31117 130604 130848
17384 130848 -162466 196944 187069 45673 219858 -44388 -259826 104714 47285 -54873 91470
17372 99042 364290 203481 -209684 105130 304587 -3075 241216 356340 -22776 116049
17361 104335 258651 56101 273510 220040 109120 88615 74040 221096 196841 85070 -38793
17349 131324 139264 115045 289120 21095 -55877 -166390 163558 229545 73907 -152184 190754
17337 -248619 162932 408262 316688 146982 320681 38869 182611 432642 363013 65023
17326 209852 213269 15124 234588 121739 125805 204219 142998 588767 85869 376307 118962
17314 218861 350233 348914 29108 125512 246588 224757 428178 -25314 145413 21769 -80392
17302 45787 33543 -26815 208751 378162 96439 53727 486614 125512 164840 -68735 192087
17290 369742 9472 -39122 -24741 -153624 212094 100584 -100310 215766 245820 521419
17280 521419 -177877 109036 195696 309231 -167901 394079 344204 33726 154578 458926
17270 458926 281816 -21409 379296 308293 -70408 -113841 74758 241357 361383 20471 31317
17259 31317 5840 116947 295233 3434 -26557 120352 280511 351562 67734 259273 166744
17248 166744 100377 375569 -118351 459788 315741 321900 -57052 214214 268779 -52520 282816
17236 74588 265945 -39615 355899 239013 291150 501728 88173 453944 40954 385762
17226 385762 198590 256228 696616 629792 115095 99504 92234 150603 267225 74991 124856
17215 124856 30786 393097 -33615 83791 408668 243361 63554 -145556 142302 443182
17205 443182 133032 424945 157331 103859 305353 71592 307269 618847 122298 61098
17194 221791 297745 394121 65462 224539 388175 321423 252471 364783 188480 124965 228354
17183 228354 428295 366078 102888 2392 213700 99634 503867 47975 195009 485130
17173 485130 223495 136015 337400 140401 357587 356713 562429 321458 322221 37962 395238
17162 395238 350640 352074 70711 338525 46027 26142 202225 359564 502030 400056 400676
17151 400676 24685 449655 150583 209782 253980 316510 216878 93580 306132 451268 141267
17139 506616 584652 130351 461742 296886 174598 392877 302365 219606 488554 116132
17128 249853 744287 249069 120697 258855 82560 424111 -129265 329309 161177 800952
17118 800952 255389 258754 433230 248681 454729 509443 393461 226430 572981 328199
17108 328199 10623 241975 619068 324198 395489 521971 161192 705886 503785 651438
17098 651438 267328 172285 651803 426409 341665 653842 157975 244148 528986 524471
17088 524471 699324 724402 248592 185819 507910 465830 515777 686185 626550 300108
17077 368486 474346 250577 384371 401723 229891 309313 444832 372616 -42696 344630
17066 404558 540902 541162 481816 608355 517850 471530 251231 617033 440348 274320 496375
17055 496375 388091 639294 576031 465485 850338 200640 306244 465796 526552 657514
17045 657514 549319 487212 350712 803716 870030 553303 590390 341114 642871 878717
17035 878717 462835 447912 480009 361501 680810 795240 618660 596379 355766 590546
17025 590546 519221 677246 371961 1022536 769177 313690 725434 567047 736572 687944
17015 687944 509280 876083 941908 662616 985919 733885 573549 369067 545494 560916
17005 560916 909124 569269 813371 774835 807963 1011779 818075 922519 790888 639114
16995 639114 873551 950947 765125 770123 921729 675313 913324 486411 836847 688490
16985 688490 940548 614654 833737 801128 691285 571457 1071229 654229 717162 1125530
16975 1125530 799998 1011204 883402 808621 953645 823394 1152743 1107088 735558 949778
16965 949778 708462 1056581 1028732 521466 1014613 931913 863719 1188211 1021857 977519
16955 977519 1119093 1208894 1024934 1112006 1209520 1279988 722873 1013792 1244502 786633
16945 786633 1039303 951124 825022 1081634 1022355 1128320 1216919 1119766 1137129 857310
16935 857310 1421451 1286494 1241296 1453731 897300 1309420 1182795 1181338 1363414 1161966
16925 1161966 1235764 1180530 1246222 1376917 1383831 1003470 1190688 1522987 1212326 1220219 1305848
16914 1305848 1353141 1322331 1468475 1823090 1723840 1769419 1390959 1672987 1518299 1251877
16904 1251877 1677987 1425911 1757908 1711447 1584009 1647121 1795196 1782679 1500776 1642621
16894 1642621 1659419 1737564 1834848 1758567 1932368 1873973 1727072 2118853 1763144 2169196
16884 2169196 1893346 1863570 2098280 1813392 1874145 2432004 2130144 2085741 2421115 2222591
16874 2222591 2157366 2454728 2239479 2472565 2069881 2399945 2395509 1817990 2427415 2250799
16864 2250799 2319579 2460272 2427074 2569142 2513013 2628772 2479739 2687150 2859845 2814474
16854 2814474 2521229 2914854 2878696 3314013 2934448 2836705 2908771 3129542 3033614 3237840
16844 3237840 3203493 3240426 3247472 3555429 3159713 3282925 3576775 3587443 3618698 3742589
16834 3742589 3812337 3500534 4038465 3678853 3824726 3983089 3927015 4303063 4183072 4311419
16824 4311419 4491162 4609665 4477991 4740375 4478230 4597378 4893086 4951471 4950408 5291994
16814 5291994 5018775 5498287 5365115 5376518 5490900 5754925 5645767 6058802 5954257 5898680
16804 5898680 6046842 6235071 6522698 6581627 6676095 6817439 7185979 7447015 7285687 7483144
16794 7483144 7698109 7687275 7998973 8399531 8461732 8455689 8764584 9071914 9193290 9460687
16784 9460687 9524155 10159236 10186254 10172114 10707559 10382523 11128231 11556598 11596896 12157488
16774 12157488 12566340 12740676 13077126 13564666 13859649 14427209 14717585 14839513 15688628
16765 15688628 15940651 16567218 17074851 17457423 17873736 18883070 19484090 19809764 20731595
16756 20731595 21386646 21835375 22545567 23566191 24700996 25408176 26230787 27432308 28287634
16747 28287634 29557707 30758338 31636298 33774346 34922702 35785960 37993950 39618665
16739 39618665 41241951 43478043 45260964 47319336 50137536 52315134 55036844 57836846
16731 57836846 60842853 63789074 67293836 70863144 74868405 78787130 83350647 88077493
16723 88077493 92957276 98253090 103642540 109265492 115298300 121773912 128141893 134666877
16715 134666877 140912974 147936898 153894012 159892982 165863258 170838078 175542777 179663794
16707 179663794 182271649 184647707 185568315 185275414 184684311 182505190 179470738 175728315
16699 175728315 170891373 165986254 160081910 154175388 147944446 141474537 135055441 128590743
16691 128590743 122105397 116204255 110146055 104053664 98671840 93006549 87918320 83178060
16683 83178060 78568176 74784729 70496192 66325044 62938456 59740820 56625789 53754664
16675 53754664 51171536 48798333 46086037 43724118 41628613 39918092 38091179 36307220
16667 36307220 34776621 33110270 31342473 30119724 29214459 27728128 26672438 25627514
16659 25627514 24598036 23406857 22886255 22063739 21279750 20521010 19632387 18716579 17951467
16650 17951467 17679143 16855136 16289277 15830132 15252624 14885146 14086298 14012022 13501257
16641 13501257 12975302 13040163 12149322 11948669 11477646 10859139 10727932 10871514 10184844
16632 10184844 9900899 9584593 9460123 9598398 8961631 8885155 8177185 8162549 7790174 7814409
16622 7814409 7739595 7247813 7394312 7140831 6921428 6890729 6536220 6528517 6495957 6809163
16612 6809163 6115576 6193505 5911941 5738943 5394299 5286848 5530571 5393536 5268782 4976132
16602 4976132 5199626 4689738 4878128 4775332 4611986 4421774 4378005 4175717 4219506 4177726
16592 4177726 4175145 4035811 3753066 3754238 4060148 3812995 3615793 3746279 3471222 3592890
16582 3592890 3606758 3201908 3401670 3259145 3295941 3389064 3002958 2717358 2775762 2983838
16572 2983838 3139312 2853928 2808607 2933223 2446223 2784296 2690396 2462194 2610903 2458518
16562 2458518 2433705 2471305 2097052 2258485 2382680 2233497 2278058 2639774 2120899 2030195
16552 2030195 2272718 2228452 1988432 2184006 1582732 1790920 1913353 2179106 1857784 2477904
16542 2477904 1690353 1876449 1722202 1804520 1651909 1937066 1608424 1631429 1688371 1649528
16532 1649528 1236994 1518609 1486809 1852922 1505144 1396643 1551312 1382982 1705060 1018955
16522 1018955 1491579 1407627 1217032 1299193 1184021 1534260 1467458 1234706 1199277 1278362
16512 1278362 1060040 1420593 1161150 1477931 1132196 1491274 1391795 1156784 1064315 1278310
16502 1278310 1556487 1239413 940875 1343049 1172987 1109900 1232072 722736 958709 1134455
16492 1134455 774675 946369 821066 928659 817598 707260 1466654 1114187 1074495 736677
16482 736677 939506 991733 959767 836965 539536 856231 1046234 869030 848653 1027716
16472 1027716 902898 746418 1020738 1137636 675874 935408 894073 895642 596698 780153
16462 780153 813786 702431 1034223 669332 717939 310237 537896 390442 734136 670306
16452 670306 842383 943926 925866 713133 730952 659362 698833 528797 733267 704057
16442 704057 485580 675916 830907 967826 532869 614759 721785 325332 639133 760873
16432 760873 530567 637452 566598 638826 420127 250261 677819 737331 489056 226406
16421 223885 500441 437585 513310 594734 145443 586975 499720 217148 163757 284814
16411 284814 362352 484424 318004 241197 490809 252755 465233 515155 477962 882008
16401 882008 329698 411265 469496 410078 349264 373365 440632 418145 174600 67391 269285
16390 269285 734795 427936 575042 650973 243533 431188 436001 238551 684387 592494
16380 592494 534861 50476 193935 381113 360004 303822 256784 474901 559782 -104076 445411
16368 476930 582182 -4403 486063 189915 265177 136136 168244 422084 111593 578963
16358 578963 313551 333120 -81663 102270 165212 313978 194316 455066 501904 402361
16348 402361 276060 304862 458811 303175 322636 274703 182676 279456 292401 153959 -20054
16336 253443 243690 230991 -62784 -2704 625966 310321 356230 360084 328108 103105 221303
16325 221303 915320 264082 203050 250845 468386 156907 70608 -60603 408520 332196
16315 332196 188125 331147 -49817 346810 -160583 -79893 400866 275295 156098 102814
16305 102814 135194 -20242 234370 194858 165867 567051 73841 435518 121434 293400
16295 293400 355409 96185 177358 92947 238072 146716 250176 117209 84892 319802 321262
16284 321262 175763 102774 -7051 -15536 219595 368879 408939 71245 545860 248302 42091
16272 273672 14025 375848 -285368 52326 73728 -181492 258835 246766 440812 325704
16262 325704 -3387 494737 -123139 71756 -295837 100580 435491 91067 424603 111556
16251 87656 117105 148377 41266 -159204 501650 116266 234341 300751 5925 -100705 25663
16239 174613 164841 99457 58650 -109046 206710 205933 236134 -153478 22673 332306 269624
16228 269624 77403 95456 71603 43644 458575 -12327 200556 24732 -127943 -98819 135579
16216 199587 -100029 -30515 -56268 357951 48059 16380 -121257 214658 204099 -100770
16205 61592 -333024 248605 -104159 -240313 425307 255986 29310 138541 -84675 123615
16194 284774 43758 4630 -92584 76874 257856 -343157 39151 11092 -182837 -225550 348893
16182 137541 -186935 243835 116720 -43277 -51120 -135009 -240301 268127 51757 31835 -18614
16170 -237131 9096 86636 -201914 317768 -183733 310069 -245026 -15238 -85152 218133
16159 -320398 -106393 200872 363960 4361 -188518 46809 -71572 -143969 59187 -289820 -95064
16147 137094 -380943 417708 39579 172676 202963 177016 62148 312558 -11873 -94469 43001
16135 -1993 -466221 46949 -4607 -73242 37348 -246815 -217663 -176830 -22568 350442 -129775
16123 49318 12559 109341 110296 -98055 -93927 160286 232982 54327 117839 -141915 -32920 392323
16110 -53818 -43071 -131460 -74408 -205776 53343 98998 445728 125247 -376854 80356 144242
16099 144242 371183 -63768 103272 176047 65760 -53261 190202 213695 60277 -32629 -81868
16088 -81868 -119604 245215 472728 -6944 -26295 184404 24207 -90293 253085 101228 2960
16076 -205368 4876 -140429 11484 158389 -90878 -29250 142160 304587 -185796 93958 -57244
16064 241396 -37747 18013 152786 -219911 104055 292517 -182389 -123766 -32596 20640
16053 -21465 313519 -92768 -22928 -135157 52741 -143804 -45231 -108421 242442 225000 115759
16042 115759 -120689 153691 -60759 -48645 -287041 -183302 -7652 -44422 55727 -57048 -115659
16031 -115659 194491 -370677 -172561 -381535 -32858 109677 -271694 71941 -189647 -47838
16020 -136704 -62371 200965 244608 -110478 169400 -363828 65786 365404 -94349 81269
16009 -299672 65862 267783 126588 -62010 93368 -483 99559 93905 -139506 -323245 -78853
15997 -274304 -155510 -114232 147067 267325 43176 421559 -23943 136440 -123085 -94183
15987 -94183 404926 -46 -415371 -289306 385953 -78758 88423 -256175 -176319 246254 -210982
15975 -44083 51371 -88434 158102 90025 333392 358688 327943 497484 383633 190271 115332
15964 115332 339869 172973 147262 -4740 361039 -119006 -23708 -284966 -195617 -71670 41046
15952 12333 -184295 116087 93213 -271777 121242 128817 -83085 179465 -113350 -260 -142011
15941 -142011 -32487 -165868 -134184 75184 -280010 229428 -135016 100431 -186438 33704
15930 296063 -9990 -128229 -44581 -153466 -194121 -183221 58208 172351 87838 -282531 -142118
15919 -142118 -62796 -74317 58837 194545 -212914 88073 128634 276276 143679 -77427 3530
15907 288754 -9259 -38107 -236559 -90966 -197666 80808 -77973 -71548 1779 -84537 -64841 -114579
15895 -114579 -179703 -9401 -184274 -53222 44109 35548 -290677 -89446 77526 272287 -101133
15883 -40693 -59505 439215 29967 4146 58474 -117349 -28621 -54431 95250 -149961 -147662
15872 -147662 -225359 209177 206131 186541 19778 -254208 133906 -167164 -95295 -71948 81617
15860 92498 -169610 -360529 -46908 8939 -220321 -88432 94038 -55445 -201865 15034 -2870
15848 -209963 63875 37531 78186 364836 135578 -100755 155453 158127 150931 -126219 286573
15836 -129904 292558 -122270 163972 -37077 -27059 129189 -140376 -48222 -120859 -23008
15825 -37144 -96204 -100424 46152 -5792 -34331 -189563 304135 225565 71295 -94631 -437346
15814 -437346 -67360 -126116 -223446 -108678 -165812 30867 -112452 -26828 146062 107403 -177127
15802 -153079 154353 -162252 20909 -154812 -40111 -320351 -5100 -2507 42940 -115265 29010
15790 -226155 1161 -108898 15280 76958 177568 111994 40999 -1196 -312298 6129 -26869
15778 120501 176535 -76271 -147433 7643 -44040 358309 79173 -91973 -243167 90053 -138659
15766 -406277 -122711 116805 -74544 -84292 147189 173193 -112427 -147062 340374 -150390
15755 -126502 -201495 -84063 216620 205253 -76185 -36465 141055 -227440 172449 46066 -173393
15743 -115358 -49109 -46449 19355 5906 228814 -62258 -129376 64291 258035 -222618 71251
15731 71994 -4015 72461 136681 195308 -163803 -142016 -174324 -263295 -154888 -155492 -133768 -43740
15718 52335 -36659 -233291 24873 181510 188693 56598 54189 134250 -174808 93879 -19342
15706 -136121 -213680 10522 -355023 -221464 -126767 -79315 93317 -141708 -312462 17181 -252199
15694 -203289 -99919 69310 -10334 55613 -83773 -157721 -258550 78111 4836 -69556 -113908
15683 -113908 -74280 34320 -1703 -170045 256622 153305 -336293 255891 69915 322092
15673 322092 -168304 222500 -242126 -43513 -380202 171443 140287 -173374 -218306 57789
15662 -66408 -47017 -39762 126011 -28902 22437 34355 169775 -100070 -147947 51491 -27937
15650 121445 177052 -130055 -230932 7980 109734 139833 -30347 290490 -357716 1919 77959
15639 77959 -113447 -45939 -246459 104936 -197979 -23909 118663 37462 -81617 138441
15628 779 306526 117517 99618 -125593 -245264 -286973 -246382 -112179 -171602 -166353 57915
15616 5475 197680 69102 -6224 -222994 -209794 83010 -13727 -223236 77733 -191025 161561
15604 249047 -9162 -76808 67392 16252 -297286 49397 -12780 153403 70708 -232574 -82589
15592 131646 44186 -405683 -316603 -14763 4544 -483127 -34155 54443 81503 70457 91750
15581 91750 -86825 -20390 57652 29672 -218678 212255 -181777 -61873 -17173 108485 -97723
15569 117781 61652 337321 -31207 84661 172439 -112108 252458 55429 196781 -134374
15558 168773 -65481 45308 -154856 -128304 183003 224017 55731 -201821 -458192 -97229 181534
15546 61337 8881 -62428 48293 89656 -19118 -227167 121300 159717 -215214 5261 68367
15535 68367 174324 142191 -244615 93555 -94785 -192237 -18169 -86232 -54587 -89367 44231
15523 -116341 -91115 246622 -47683 -67069 -19698 4033 -5081 53721 -31778 -99127 -22344 121430
15510 -115143 -17348 -249624 -205118 -47594 -259269 -311877 142598 78274 -126631 -5817 126657
15498 100635 36855 -87325 66076 -254998 27663 -6931 115840 77907 83430 5577 146718
15487 146718 -74146 -338113 -25503 -67854 138682 -23098 -126341 82420 61007 -276738 -258976
15476 -258976 134561 -274070 523090 -398373 -223690 -90869 -203149 -169755 -248187 -57678
15465 -216758 137187 -43739 197606 -169001 -13806 234487 -52401 111201 23406 -45895
15454 -93977 185109 -29796 120689 -185169 -138011 -64595 -218540 10649 -103929 -97826 -165006
15443 -165006 -44471 58289 197289 -263861 140622 94781 -128537 -193787 -302769 122714
15432 -245899 -1425 278910 -56322 -305905 -1577 178038 -200011 27583 -297507 -140534 31743
15420 -14905 413126 106538 -9663 261386 -15522 260452 -150279 -120729 -44886 101795 136790
15409 136790 -187283 379046 -307312 -114063 59387 58808 80770 -107085 -472028 -66637 -100663
15398 -100663 48166 55099 22373 111180 21708 247205 -49814 -65248 -121441 -26968 173358
15386 -44069 52979 -100667 136561 72306 -34367 165812 63699 -396355 53481 54084 226494
15375 226494 -113632 -216321 51998 -90546 -65077 -126687 15584 119248 -298556 -43157 210310
15363 268100 5327 -14553 38267 264355 204895 15266 -9167 -152153 174354 152367 48851
15351 98861 267144 -179776 74261 -51498 -481059 74865 -8268 -159133 63538 -356589 146442
15339 298861 93271 3329 -50585 112621 -18800 265300 -128194 90611 214242 118011 -65815
15327 9075 106929 105322 174716 162621 74333 150946 -109053 -128645 203671 90166 171031 373684
15315 373684 -230935 -150833 137260 145369 165632 133526 248964 -206513 191152 141098 113695
15304 113695 -180873 -39400 -405782 19169 -225973 -77774 -288823 98019 -23243 -189552
15294 -189552 231226 -35091 101882 13188 147153 228795 -193034 155019 58267 5166 152454
15283 152454 137815 19398 248608 -55976 -166255 47940 218317 4043 166712 113063 233100
15272 233100 194944 211529 -178925 69066 157651 -3839 153802 144252 -40858 -39733 -102940 53135
15259 53959 156189 -94469 79444 57667 190141 109254 267829 -80773 160167 -257126 145918
15247 193551 -72401 272131 186503 247732 19752 242475 -4976 28707 102192 47856 -78529
15235 328569 310674 613286 1377616 1163805 1259315 916078 733698 313819 398206 65449
15224 61398 -174983 205207 312026 105760 344561 187337 -46281 269432 33142 -96852
15213 -209225 33519 129856 -337793 224920 -34262 368944 237015 121396 435860 173138
15202 171373 95208 141813 -371441 -99011 43547 91713 -86427 212142 23174 -6440 -195809
15191 -195809 97717 96979 -78419 154242 -6514 122742 20755 -325068 28297 -94009 156277
15179 32688 -52406 108288 -18561 11721 217413 -186721 245030 68685 253112 173108 107310
15168 107310 179072 377446 45190 -204947 -203510 -46323 -22500 113141 -147773 177635 -43908
15156 -98223 280757 318316 -49416 145443 108552 -197122 -142529 91756 240554 -291174 -45132
15144 103158 59587 241545 -273114 -148555 -128806 -40256 222574 215558 -192184 242526
15133 -21512 -48570 242576 54116 155803 -185203 132911 74866 334953 314973 138991
15122 136109 373130 -13925 125759 164784 10230 -6171 70280 -105006 157276 74452 -34712
15110 135847 130430 -29006 214379 117928 354300 293134 -18879 134668 -41148 124990 -205052
15098 52132 -303071 -287052 -114778 146648 134374 -52112 169392 360008 397179 151900
15087 76936 193908 285844 118575 298150 40592 -126869 113524 273202 251411 273396
15077 273396 -40432 230787 31332 46512 272740 138531 282571 176278 87180 397778
15067 397778 -18909 109022 56238 -36661 144589 453116 292184 168111 84197 -115379
15056 -350622 74846 73729 341472 356916 -74207 648384 24966 220267 208560 251744 -108077
15044 185297 229130 -57729 306861 313412 -42180 45738 16255 233601 421917 -72060 194416
15032 349883 215190 161693 139870 99255 177802 293810 -276174 262759 337849 -34457 105396
15020 536225 339862 120820 182307 331240 99769 110353 -101595 109972 130685 834 71359
15009 71359 -234216 341966 -73864 200413 448289 266069 264875 39407 110303 246874 -215214
14997 336579 262230 116198 443526 307192 270010 310068 -8544 99457 96124 -23816 219404
14985 150396 204633 343589 172320 280442 397383 153292 77042 -46050 205056 408417
14975 408417 214711 442510 183367 368721 164879 123474 185689 387413 -837 176970
14964 -54384 71304 -23483 432161 381403 190438 142537 289533 112230 42367 228138 131606
14953 131606 420539 82321 113714 363824 71705 152958 187408 284429 72849 292923 401783
14942 401783 193656 274511 271724 449525 5479 -155084 303586 364678 424608 185167 521414
14931 521414 220398 -10286 99943 -195320 458383 51708 296512 520216 351384 121227
14920 186046 332548 370203 108180 420378 173297 503573 451723 290820 365400 270001
14910 270001 164497 382936 317523 360260 285367 511940 588906 186912 289481 357737
14900 357737 207118 471134 374563 238596 270161 594139 76657 91114 190119 74520 149988
14889 149988 269673 299903 344959 597378 490710 482270 364279 305943 -216673 418335
14878 434058 258952 438513 350914 207519 257416 376112 722025 186095 323025 338835
14868 338835 39196 299015 235005 419340 234576 337434 219192 492307 248154 570221
14858 570221 651325 260655 436377 103119 526926 193759 508793 417583 398505 456399
14848 456399 184781 230587 691579 311902 388026 341151 325407 504825 190020 479168
14838 479168 325392 205289 527350 438773 379744 342251 200094 578402 381767 653264
14828 653264 468589 467509 642512 300947 211679 545415 477707 260516 141946 173698
14818 173698 503292 199059 224407 647064 383469 675430 314670 118025 380616 539587
14808 539587 601943 564512 428687 531333 484268 427578 661699 490835 380211 872302
14798 872302 563259 391784 686504 328311 424924 126971 212903 511673 662541 457705
14788 457705 474922 581350 387388 416258 287952 779413 561311 672220 546682 587632
14778 587632 698488 438575 895722 707255 596380 319391 439169 562557 539707 367941
14768 367941 377233 703702 620423 469714 727743 597391 652818 570186 726935 523922
14758 523922 527777 496483 715864 585460 1020112 589912 874364 564115 567649 688314
14748 688314 515183 306292 695019 774799 717440 563353 724465 909789 888288 273465
14737 488280 727683 384395 594425 700378 743635 646921 422629 688807 740654 365597
14726 591725 755121 755390 435646 822259 913835 589254 725451 708443 446259 915600
14716 915600 849187 578689 758401 1177103 674225 950512 762743 1073648 913191 723890
14706 723890 745786 667138 611466 972555 582765 783763 950036 745778 537855 817738
14696 817738 548980 879862 969632 1087237 753292 801869 993818 801251 672602 962014
14686 962014 892822 501032 734410 564088 831786 1289361 706592 842710 643407 1010297
14676 1010297 859062 829508 1178037 854953 905470 1145658 991449 1056882 1042293 1047673
14666 1047673 993402 1373870 796164 1084642 1073443 1097839 1121567 1267633 904035 1160247
14656 1160247 788925 928963 1284468 1068958 1213040 1074526 1065009 1058497 1300393 1139508
14646 1139508 1090893 882504 1042063 1098832 1109394 1161449 1096960 1152680 1198185 981328 1237192
14635 1237192 1365711 1178766 1109670 1323083 1000161 1148205 1390314 1180015 969273 1389747
14625 1389747 1031752 1177440 1325694 1443279 1419962 1225317 1398592 1259897 1335180 1348126
14615 1348126 1354281 1403109 1165117 1504052 1295968 1075329 1556873 1338763 1202802 1290253
14605 1290253 1078763 1645016 1621967 1185137 1326463 1509082 1589616 1572065 1763442 1590416
14595 1590416 1436854 1608850 1536377 1423806 1626999 1414496 1637221 1735352 1432660 1616865
14585 1616865 1574739 1938581 1786330 1691778 1843986 1775673 1802761 1526010 1800833 1763693
14575 1763693 2138595 1616132 1962508 2110511 2110988 2063793 2000032 2054375 2032046 1692278 1960414
14564 1960414 2077907 2077049 1925982 2197353 2208408 2453737 2336407 2394778 2237056 2249038
14554 2249038 2252198 2418807 2339144 2565746 2584842 2989971 2645292 2750929 2446646 2883862
14544 2883862 3003561 3080015 3118598 3404152 3878093 4163528 4729896 5228036 6604222 8646757
14534 8646757 11060387 15029842 22843384 32367098 30205759 18441450 11483075 6791519
14526 6791519 5406235 4305532 3568112 2824552 3133163 2724277 2317000 2577474 2130900
14517 2130900 2475750 2405412 2412952 2662521 2390928 2425380 2322252 2332701 2380171 2434336 2598174
14506 2598174 2528499 2489264 3104030 2173485 2926604 2700499 2692948 2840878 2541848 2754318
14496 2754318 2730117 2424376 3136139 3086139 3113174 2859322 3029579 2928971 2982484 2956128
14486 2956128 3212786 3385687 3098582 3498157 3222858 3148990 3431531 3398877 3453725 3186807
14476 3186807 3379178 3494827 3430921 3586775 3591476 3658594 3245459 3648702 3643903 3818533
14466 3818533 3806366 3713378 4143967 4280827 3936139 4623657 4478227 4085663 4397400 4345821
14456 4345821 4659173 4397770 4928614 4537638 4683035 4656193 4621524 4781879 5068176 4930156
14446 4930156 5065413 4968423 5054963 5272728 5331840 5285994 5410497 5368017 5296333 5712648
14436 5712648 5499883 5521996 5925615 5751091 5965094 6197890 5943178 5964155 6267671 6163766
14426 6163766 6367234 6144996 6387031 6285020 6549548 6659508 6973997 6698569 7003840
14417 7003840 6934271 7110953 7196826 7278756 7632928 7636422 7535054 7812223 7611926 8185064
14407 8185064 8024614 8351370 8017364 8288239 8557729 8484053 8819960 8972397 9027548 9087301
14397 9087301 9309712 9429415 9399818 9622099 9788924 9906246 10000622 10686352 10477433 10636836
14387 10636836 10660476 10913877 10918075 11179850 11323164 11299744 11744982 12003271 12590757 12515549
14377 12515549 12384523 12919238 13070972 13224410 13615083 13692640 14205730 14513826 14418604 14665383
14367 14665383 14712476 15752072 15246468 16055936 16399198 16430493 16975992 17303879 17857416
14358 17857416 17858353 18142026 18320532 19282880 19227145 19839136 20438281 20796429 21541142 21793508
14348 21793508 22338361 22420176 23093153 23604404 23917034 24624262 25528433 26099317 26529196
14339 26529196 27014482 27596424 28405560 29084663 29573484 30603238 31427554 32207968 33010272
14330 33010272 33962225 34847673 35740225 36876669 37660454 38790067 40060920 41136207 42199620
14321 42199620 43171401 44623330 46195107 47251509 48648733 50444853 51488524 53502932
14313 53502932 55087434 57174760 58856145 60682907 62932899 65269270 67377351 69539576
14305 69539576 71996916 74985132 77902137 80388792 83679442 87085100 90611075 93990512
14297 93990512 97808107 101828722 106331113 110670897 115579728 120918248 126151298 131812393
14289 131812393 137912204 144407500 151166732 158115419 165980996 174031345 182287830 191283351
14281 191283351 201182689 211022630 221643755 232963521 244897920 257154849 270339809
14274 270339809 283868336 298156416 313204306 328493025 344078326 360005324 375784827
14267 375784827 391515312 405699826 419689240 432195316 443516882 453179277 460995734
14260 460995734 464540559 465257858 465787253 466249357 466096431 462212602 451976182 448026773
14252 448026773 438917539 428239563 415350767 402411897 391832995 379297503 367661068
14245 367661068 354865115 340878538 326932630 313215264 299087188 285318399 271833737
14238 271833737 258429634 245195941 232769059 221067799 210368997 199826809 189678039
14231 189678039 180598301 172134427 164081548 156389839 148949519 141954523 135417119 129175620
14223 129175620 123587106 118011172 112913764 108138945 103392538 98935640 95402903 92093443
14215 92093443 87836817 84625094 81091728 78182395 75048871 72464585 69701062 67156557
14207 67156557 64490743 62448077 60491143 58463218 56667517 54550822 52918395 51256594
14199 51256594 49752320 48300071 46599575 45229491 43896522 42512143 41792182 40777982
14191 40777982 39356172 38280447 37040553 35773568 35145841 34129704 33477864 32712765
14183 32712765 31617415 30789561 30146172 29221312 28560000 28004234 27495440 26521383 25561601
14174 25561601 25076035 24650178 24210206 23596086 22964791 22961925 22292082 22019767 21180639 20929103
14164 20929103 20377434 19987688 19496832 19177308 18926840 18141678 17973324 17639596 17222031
14155 17222031 17129394 16684221 16243098 15944818 15647258 15484030 15397135 14949684 14742848 14294878
14145 14294878 14177267 13971603 13450565 13480796 13329278 12646648 12930277 12749470 12113103
14136 12113103 12205462 12229437 11663219 11599178 11270672 11048944 11072333 10876581 11009108 10586706
14126 10586706 10029878 10132234 9968842 9978690 10024123 9422247 9370402 9139934 9236884 8668866
14116 8668866 9010823 8752093 8843873 8668313 8488663 8446223 8302886 8354410 7977276 8003778
14106 8003778 7699905 7271526 7468196 7694953 7503181 7544259 6931920 7131127 6984168 6825063
14096 6825063 6925759 6675595 6563056 6655284 6542257 6303071 6559811 6509513 6499561 6202899
14086 6202899 6117972 6284060 5865170 5767563 5601541 5863096 5548642 5376179 5634192 5413043
14076 5413043 5392404 5442494 5284427 5263584 5406363 5121457 5134797 5035935 4816236 4927154
14066 4927154 4443612 4692253 4906401 4676567 4702141 4695500 4430168 4623492 4605726 4673558
14056 4673558 4207577 4306655 4333308 4376189 4281282 4136035 3981521 4148621 4159372 4258485
14046 4258485 3996293 4218575 4265161 3972772 4280228 3908935 3976777 3859420 3770986 3592012
14036 3592012 3552715 3764625 3503511 3511676 3638524 3110059 3614151 3395247 3403633 3274701
14026 3274701 3470303 3656160 3234868 3143558 3331817 3307679 2973528 3068661 3175275 3153194
14016 3153194 3143310 3049544 3115064 3201283 2818178 2575323 2880758 3103421 2730876 2849063
14006 2849063 2739393 2929765 2657649 2620881 2705185 2651098 2547857 2528150 2488298 2541594
13996 2541594 2385027 2632679 2519907 2540820 2780656 2349273 2335019 2459365 2180917 2229970
13986 2229970 2376457 2598855 2366257 2097066 2349216 2606378 2529166 2618305 2937588 2793956
13976 2793956 3660812 5204828 7166249 10229890 17400236 28176442 30007757 20075675
13968 20075675 13529629 9507602 7402715 6055501 5512363 4413683 4039117 3586642
13960 3586642 3316416 3525141 3025898 3059622 2809202 2749485 2571945 2420177 2489157 2385829
13950 2385829 2368441 2354632 2294776 2391079 2498047 2000812 2522106 1963840 2030289 1963483
13940 1963483 1976525 1794028 2157551 2114628 1742640 2143153 1913698 2070910 2053616 2072579
13930 2072579 1817017 1622537 1870928 1384877 2269187 1658887 1935383 2070103 1561449
13921 1561449 1710874 1733396 2020121 1763410 1782209 1418653 1605042 1662948 1463170 1548522
13911 1548522 1469967 1611393 1707928 1711121 1726509 1721675 1364551 1275410 1370651 1570170 1468710
13900 1468710 1629581 1634851 1328667 1381866 1435192 1620761 1306379 1198784 1142134 1479776
13890 1479776 1352923 1605592 1205757 1424474 1458130 1411944 1483699 1115204 1564698 1333604
13880 1333604 1121800 1530432 1243106 1401222 1312852 1233621 1160569 1111445 1311512 1578541
13870 1578541 1077211 1277324 945721 1220103 1127388 1230708 1347532 1058044 1316584 1257147
13860 1257147 880700 1109268 1094800 1125110 853211 1136591 1032454 950726 1145157 1151260
13850 1151260 1373633 808035 1163551 833710 1177600 1203763 1208446 929366 970351 989734
13840 989734 1174337 1208510 1316216 912661 1050694 1282516 1252089 817005 824290 832407 899979
13829 899979 972906 1154529 1019878 1053681 844543 1024441 1042963 945008 813566 1151932
13819 1151932 888433 1014748 875600 1006267 1150228 841479 818692 553315 919011 885232
13809 885232 876087 746251 747730 956198 1050518 681035 862012 782066 494585 869486 794699
13798 794699 1160030 872612 645283 1234314 1024733 811446 904309 506452 716386 800861
13788 800861 894634 908015 644271 888145 935461 630488 1157100 982976 969952 620850
13778 620850 582299 918818 1105446 497265 575054 704168 915824 931018 545150 450729
13768 450729 864835 779326 514894 429472 730134 790864 823998 756586 859258 625802
13758 625802 695073 630202 527155 513036 834026 709091 760625 767549 842673 754832 605237
13747 605237 883794 744524 652942 289962 589074 610427 616411 741469 861921 406380
13736 694316 686414 728662 555960 658956 688512 507772 515940 551919 173638 857165 967761
13725 967761 684163 524149 653998 863321 507348 667388 851276 594622 511934 342210
13715 342210 608411 601049 680411 597593 453965 118601 598345 533407 497369 511578 134394
13703 737763 558731 681798 882942 869795 556265 875131 980744 463292 623239 439891
13693 439891 680344 402883 433550 529126 426259 406793 425891 399201 311406 139683 530815
13682 530815 579469 327736 730437 466996 394742 608477 451697 128402 654436 532943
13672 532943 400051 617643 590040 550636 509681 221057 585960 626848 406116 418569
13662 418569 508671 692726 360158 179112 740784 356730 237505 299299 479626 369901
13652 369901 510684 400416 198319 399680 633375 459479 404163 479720 191565 470955
13642 470955 252340 546805 577865 477059 635637 553982 177646 201353 367046 247097
13632 247097 422567 767972 255726 500989 597368 139373 502845 417025 468505 246592
13622 246592 573108 632072 577191 351389 519406 322649 510382 608763 97881 332582
13612 332582 532123 322461 77856 803931 341958 383281 105765 290890 279506 89825
13601 549414 414685 240318 452942 164756 608905 594630 283293 155939 301799 402276
13591 402276 356047 209681 508982 439626 265731 393205 785289 342850 277617 283574
13581 283574 318828 653976 514042 379107 296630 688382 91204 108188 24747 173128
13571 173128 348247 597877 273232 486948 513844 504099 458511 322428 300901 633629
13561 633629 525449 320453 118505 278451 314059 135038 407484 595376 293040 410774
13551 410774 116050 542991 294527 305223 446519 237741 711168 166323 488097 445802
13541 445802 484765 457463 144221 233817 402324 460893 124308 272154 389204 133005
13530 243161 377562 472790 220768 441600 211382 145318 141631 88170 12199 650533 213513
13518 322452 387020 258338 262280 179055 396338 574898 246559 242144 210580 404435 214349
13507 214349 386170 288709 389075 263679 276592 553201 197478 311369 191823 481929
13497 481929 234306 295223 282732 486256 426550 365877 570073 141005 436602 509645
13487 509645 357874 290958 173703 268745 151493 415230 226351 217956 293453 361105 -42661
13475 348788 245133 233993 321089 162518 52465 359233 156537 154805 283925 31903 423482
13464 423482 495090 352076 480165 -67268 173064 459478 383231 392445 131138 173201 167725
13453 167725 632077 304842 337670 146838 193248 429861 350747 394728 313133 -29204 275454
13441 576495 229777 -40974 85292 263980 56488 167732 -43222 132471 396289 319676
13431 319676 224274 51163 156675 228087 -82557 528922 198894 364945 251475 256631 195400
13420 195400 218656 434150 125032 408665 -62054 325029 229225 129279 288309 245354
13410 245354 374523 281788 284055 29686 366904 343925 91235 242203 412325 304398 267025
13399 267025 227804 -70066 159199 318876 153175 246976 378843 172710 144347 346110
13389 346110 62949 465317 -113968 305938 280957 246893 181273 214842 -119799 -33586 -104214
13378 -104214 110240 364951 235273 441665 -159234 443269 -12117 380604 133300 480327
13368 480327 190843 123948 -9105 -30533 326912 -80940 305909 241655 94682 276593 288347
13357 288347 309862 150558 292555 201910 592284 119703 72899 441157 -5860 332828
13346 253756 164509 15904 91503 -15842 377552 9647 277838 -10163 403092 -50482 231022
13334 443144 -919 95039 25576 190175 236567 344478 66282 87663 191991 252367 321645
13323 321645 180721 209603 171256 -48669 265422 -176711 106165 309437 270474 286817
13313 286817 611629 296388 -41984 424956 281728 127985 336398 262874 210604 152950
13303 152950 117013 509375 -142892 141530 155943 210098 -112757 159555 206269 292608
13293 292608 127749 92433 427207 187335 -10136 384040 76724 -153096 148465 104155
13283 104155 -25744 228701 406206 13666 295724 -25993 101528 -159940 74131 -166923
13272 -63207 -118754 -236926 343390 176740 15688 365860 -141365 260184 215626 239197
13262 239197 -116875 282724 195628 194759 251581 -121690 -3338 176460 98381 196961 185039
13251 185039 104525 143586 324115 81275 260336 25171 170213 -187923 316849 99135
13240 68990 325052 -366767 173825 122445 -4775 -14405 276926 320874 332010 214338 340151
13229 340151 888 22895 106146 4029 444277 72216 -65191 -46288 215032 -2338 126110 112754
13217 112754 251280 -4306 277004 397311 219577 124478 341397 162209 224743 -41226
13206 162506 215267 108072 -289025 -131053 -26318 -54296 -26813 228667 108434 397071
13196 397071 10019 103719 68405 105867 155339 115158 286223 66907 194862 39424 481208
13185 481208 80946 19596 100041 65997 -4088 99741 162418 256214 107322 151355 42000
13173 258535 49344 -59611 354590 -20612 -39486 -121570 394200 -14522 95236 70026 300071
13162 300071 -208114 -69101 45447 44653 -24377 246956 78402 175205 160038 134919 104645
13151 104645 4487 39784 255224 -124619 181305 -44639 138774 87800 310870 363130 91617
13139 337860 68016 292865 110770 130714 167607 26854 143597 124681 337558 -198680
13128 -19823 24533 151486 92353 30959 145960 -3262 40719 144462 -79088 -378283 276535
13116 -84843 -55162 190732 -100233 -73223 13945 40689 251822 237048 82147 -2852 265782
13104 266875 -47163 390197 133796 -154659 84651 -56728 -105115 -146412 20398 56268 27987
13092 -38262 -55651 4164 349253 177497 209532 -15854 138308 203878 -124562 -6335 -95311
13081 -95311 194585 6151 101168 -20373 -241257 -198576 107389 -40819 194374 -31297 -36371
13070 -36371 198639 52196 -139295 -158111 64306 -15214 229666 -22697 134298 -4893 -192869
13059 -192869 370278 232554 248447 166740 -281748 10181 -34014 95873 100065 184722 284254
13048 284254 -244091 -35078 314617 -23000 48587 149404 277014 231282 -145386 -240335
13038 -240335 293055 -153084 21772 289559 -52919 98847 227072 -131142 115557 185309
13028 185309 -131818 282055 309508 -145132 -118673 345401 236312 276112 -19471 158508
13017 413127 201261 50508 227900 235489 -96695 -81196 273232 234458 107786 531959 -58632
13005 340363 32184 -87991 508970 -115947 156516 319703 16388 238049 85863 -7360 98727
12993 -15531 120129 11454 256806 73263 -135653 11574 324490 48858 125167 265557 22732
12981 -1271 -243751 -139550 366071 493511 253434 87212 155872 169030 150774 3410 167917
12970 167917 103394 -129678 81152 139643 246446 -58484 -83681 50816 77586 410527 84639
12958 10508 151480 -6236 88137 -40367 149076 -8216 -95719 340962 -73220 -204390 87196
12946 199751 42509 44846 -42021 -13992 1639 166277 -132156 124111 -473838 74364 -152933
12934 -17276 35952 -87310 -99440 195086 -257764 108357 -149209 79317 208606 -44758 -194143
12923 -194143 -135678 1441 95207 65299 144838 -429809 -258799 200283 288677 -29510 -86503
12912 -86503 -67395 -448707 -181931 -124828 86551 -221199 516581 -326638 256879 -37595
12901 57981 15498 -127302 41111 -63579 -84076 134288 160239 -117142 21081 127353 123906
12890 123906 -25512 69871 -247505 93444 -84702 -282838 -34589 71731 113109 159121 -202141
12878 -261877 -75580 22788 -6768 -398840 -44407 15641 -222104 -31884 -213014 -56024 87763
12866 68544 243142 138317 -251654 -303413 69098 125240 120147 68321 165851 -98350 -162501
12855 -162501 19015 -193754 -56331 335523 -20132 47180 246481 -254637 -21052 243642
12844 -17681 -5488 273555 228503 123283 87420 342687 30353 98384 -117654 77414 -70595
12832 51630 69106 -218505 -11238 -160431 317607 -43021 129152 255884 71943 76847 90354
12821 90354 81192 -15037 269335 -260352 -28769 213581 -143742 -150275 143141 161580 219848
12810 219848 -1037 128521 74841 45407 -290468 60775 -204226 -174743 16851 -95530 159934
12798 -406494 -35792 358683 -94056 142729 20346 96132 29103 -152135 -13072 136676 87347
12787 87347 27033 343332 -50978 135441 -61775 91129 -47242 -94280 214238 127258 -101410
12775 -39340 88894 15793 994 198193 -180595 -118923 -113664 -50213 246038 -68543 164679
12763 311126 -198198 -17721 207552 -299134 18862 -64713 17026 140054 -31891 -229266
12753 -229266 51133 56633 70722 -23160 179139 180862 -136466 37457 -153522 -120538 -121783
12742 -121783 131768 268153 -59777 -96200 -164639 165169 -42342 -157959 -185049 -102931 148725
12730 186544 36639 57631 106439 33288 -40243 -8054 -74401 -269716 171765 82223 230561
12719 230561 135601 -202758 133270 177126 190480 183841 -3950 19172 -45314 -2444 -95633 126397
12706 -146620 346108 -148263 140545 220100 -30919 203423 94784 71527 -39513 87852 148954
12695 148954 -16993 232393 6256 38165 96298 80322 251058 -175044 43065 267241 21773
12683 153668 -37509 28941 75886 142392 -83390 229623 -1751 2730 371342 161523 -105974
12671 258008 46301 14638 -107546 -159632 -95351 86693 70274 25015 -77762 56786 20768
12659 -3479 291019 110725 513790 15087 -2066 29286 239857 141165 103929 192440 63152
12647 44400 394464 80993 90912 226977 96501 -130660 242544 -64236 -23162 169451 -113091
12635 150045 -8321 194240 -115183 180313 330324 153562 170502 -31902 91113 203633
12625 203633 289539 -4154 7229 122709 12465 -244274 150501 97345 391033 98600 149957
12614 149957 98 247658 107802 301027 86336 62245 55761 -24635 -66811 -5067 269902 -4491
12601 105559 -37926 217323 221486 248349 -36178 389093 248045 -28357 140419 -35623 -73740
12590 -73740 -130835 154911 38866 306271 91743 218914 -4677 -180179 176631 312578 100089
12578 175567 298527 -34682 -7731 77534 -170387 -271240 -200028 18656 -277846 -380694 -209056
12567 -209056 -155194 -430171 113796 -1975 153806 258673 -29183 103600 19617 105270 137207
12556 137207 -67941 -106112 176350 -252719 -23632 -237455 -106976 -52755 112165 58733
12546 58733 108604 406274 -123509 -13812 -68263 -209479 -97072 46433 -31170 127348 -115786
12534 124805 -176913 12786 -72257 9481 -92420 -45845 16766 -75099 -188029 32326 1731
12522 165897 -122581 -126606 194334 145595 154647 -3432 33227 292545 182071 -52963 -112877
12511 -112877 -38595 375329 -65699 -7718 119399 -237415 103344 60702 82600 24354 135558
12500 135558 -513227 -57451 245922 -27664 -88199 -80579 -320728 156245 -35851 4929 -55875
12488 -15838 223798 -81657 200371 63051 168328 27870 162604 -51357 -119179 101930 77439
12477 77439 83930 -257067 139307 -13210 142008 239841 -75798 -107226 -23574 159189 474529
12466 474529 -222200 -190403 -122747 124487 -32496 25139 -98382 -34895 -77833 221691 85915
12454 31711 -211921 102221 -83407 -369810 96788 204138 36030 -152308 42647 -196112
12443 92816 -69623 -82188 80724 -156028 146675 356415 63226 -953 -278751 -380734 -96032
12431 105004 317032 959 -13639 -53906 7094 -208614 93475 -6424 42455 -233921 1838 -24427
12418 197791 228046 -62312 191210 277384 -237501 -215419 20938 33658 200868 54901 87189
12407 87189 156243 -313362 -55354 115668 -228009 -273736 266280 -240873 162680 -214181
12396 -384266 -111513 364939 -332010 -36598 -217384 -99220 241895 -113487 119693 -67964
12385 -159500 -72142 184374 39650 195413 47144 -75038 -105875 -114962 220355 140323 22028
12373 193850 50945 -21259 216845 310780 -161538 -226366 37598 137977 -151092 -10356 98
12361 -21643 136136 201188 31784 144990 -55761 -184935 1712 -414499 201726 -310896 -215247
12350 -215247 61744 -179761 -50482 -307201 269541 -66230 -207347 -83662 -230228 -23943
12339 75238 37869 -174204 -193624 -96687 -178741 -123810 169464 81394 52640 -489697 248402
12327 4862 -47356 -170660 -17000 1072 -78125 85672 154781 73810 285599 5998 -79101 -214507
12315 -214507 205289 -105659 354303 -113606 48322 -53043 157159 55315 20660 -116829
12304 -114024 104880 66197 -302763 37689 310262 706726 84621 -191001 -348105 167628
12293 193344 123269 145849 167898 -228645 -277059 -127994 150401 58474 -244543 77801 57475
12282 57475 44885 39324 -63156 -335708 162358 225250 24848 -184364 7063 -311273 237087
12270 -184533 -30055 33882 -118135 151232 65050 46830 475197 218952 114146 244283
12260 244283 244771 46063 207209 443603 354835 242201 17039 166161 -25336 18800 318886
12249 318886 -100813 268771 128643 96786 200452 119048 67537 487103 69643 197886
12239 197886 43824 204211 -154356 51187 -8754 164754 276566 164144 260820 319750 171770
12228 171770 230842 259897 183270 63111 48753 232006 6450 79236 -127556 83587 117015
12217 117015 364042 77918 275272 243705 -87703 285790 535895 119998 206084 196113 -76200
12205 261205 427045 218095 392951 474531 311617 36660 -42355 247948 20325 81650
12195 81650 383549 -261307 -202322 158552 277451 344147 377790 -84849 13747 160129 -153160
12183 219747 215422 316421 -6951 251616 512172 84644 65416 155490 139143 44911 264378
12172 264378 -83254 -28301 -25301 -239810 122029 144176 -294193 162557 -47705 207116 190353
12161 190353 -11528 155671 -127857 303963 -206784 61043 -98418 19110 -290605 -121997
12150 372034 280521 273654 310607 -370515 312863 -75172 255621 -12377 242762 336574 -135440
12138 -109383 46388 310589 112829 -96651 283766 131492 130699 189411 99126 31154 -451242
12126 15855 130623 -28887 -50596 44225 141025 64427 -65435 -178842 -75971 -31611 -23386
12115 -23386 -32653 -32309 194142 -32391 -56536 236982 -221088 628 5598 -91638 180730 -54532
12102 20067 50625 269502 -110656 -126398 154244 31641 242419 -241380 4667 100213 304843
12091 304843 -217768 74509 -15268 -47309 55487 -457087 -229807 104766 -91597 71108 -31808
12079 -46850 -102270 -85794 14931 -120564 96105 105574 -206061 121350 -229255 -131894 85877
12067 -227492 -58560 432897 564924 863112 1167739 847654 381292 327479 9121 170486
12057 170486 58999 -79580 665 -16674 75279 375647 -18323 -149450 26631 116229 65077
12046 65077 -12990 166033 296942 149962 7725 120304 -69491 -289598 110962 -136304
12035 -51573 -70176 119650 263975 -22861 -36842 -259502 -163102 -40664 257928 -12901 -324426
12024 -324426 58816 153854 -35071 -100318 -106126 -34771 -259676 -266855 -173523 -238146 -80915 159092
12011 -61026 254112 -9238 -37540 -4854 2546 -113937 223318 53423 -366164 -117007 203290
11999 92515 -25 186649 -24144 1813 4933 120431 -64840 -87330 182161 -334656 431297 215771
11987 215771 -42769 159878 -107119 87582 83377 110292 125823 -133864 -30952 74613 100930
11976 100930 -144835 -137221 296439 -26405 -46536 190767 37579 236384 15701 -72274 68993
11964 159332 -144551 237609 -170952 197935 -91148 -67334 -64160 88772 -31418 -4318 235524
11952 242547 215727 -191737 9987 -21867 -109256 17685 -97058 160335 -90666 241475 -332185
11940 87902 -197384 -284487 -372649 -5081 133141 2014 -319663 87012 -220672 163956 -126198
11928 178232 -105025 746 -189189 98255 -497392 -229319 5141 182778 -335633 62492 -66165
11916 142700 -37299 -358593 -208197 -157500 403192 3490 -168060 17865 66822 84350 -210164
11904 91084 63126 45659 -8523 63695 -132671 -136002 66043 -229955 -211199 -130028 3232 173245
11892 173245 -234772 -135009 109101 -31794 125414 -80747 -124139 136946 -438094 -62721
11881 -147590 -420814 -60474 84816 221684 -50367 170665 199078 -174083 -85146 -38866 -188644
11870 -188644 135610 -228088 -302435 -405590 97161 53605 -232906 -269419 18161 39239 -128434
11858 -118297 84662 -184932 56507 29583 -98773 -8060 -300048 -328871 -208753 -106414 -39909
11846 126235 273233 -437144 -65569 -319912 68045 -385356 181463 -144126 15574 422216
11836 422216 202517 -16500 116453 149466 56331 122670 -47210 -103655 148590 -52869 294257
11824 11971 -177105 -1773 145496 28111 -144819 -183284 -1909 -348106 -266915 -190105 -244574
11813 -244574 -449244 -227934 115789 397914 -178623 150404 64711 84275 49852 -65787
11802 170185 -89597 -220579 -88060 1123 16712 28380 -7161 -140231 25543 -118066 111270
11790 -138471 -206789 -5177 -45857 -140331 -441560 15453 12765 710 31785 39619 -318636 300421
11777 101883 -9809 89282 7943 13279 -87875 32379 -121436 264343 37008 -384876 -259062
11766 -259062 83665 115659 -109509 196609 107796 -117458 79141 -139190 318096 -35962
11755 -428452 21273 75557 -143634 35075 103293 38406 -270738 -129848 71067 -34000 -171443
11744 -171443 -8491 -356403 -131397 -16032 75399 169828 93441 135123 -48153 -204417 -127121
11733 -127121 -248147 113328 -39773 -647768 57524 149995 -147583 41670 -200336 -33455
11722 -58000 -107565 193867 230312 43643 184086 60703 155968 78063 -92233 25152 -104711
11710 -94430 22522 66685 18912 149060 231243 272385 -197158 118730 -139311 -260447 -182505
11699 -182505 5026 47073 168370 273657 349081 -32910 177824 284520 72390 98794 69877
11688 69877 -432908 46180 -37182 38237 18141 -102508 78586 -230080 -29147 -58168 -112502
11677 -112502 40792 -103231 -168071 -84886 -19911 -42039 232616 90343 -116577 -137274 -60777
11665 -44229 -4112 -32283 99218 353842 -27651 143811 394768 -82938 -20861 333066 -223785
11653 -25214 286313 145268 67175 279670 -97231 -311999 38941 14815 -219884 -94887 51104
11641 -27825 -48357 101463 205444 47280 185124 -317144 47231 -160262 25853 -61155 94156
11629 -59197 -110202 -95012 -142170 -193263 69714 -99363 75025 -83713 -247773 -102766 -192475
11618 -192475 -128656 -104248 143154 188974 -97967 192292 56219 112524 38683 -269706 -193908
11607 -193908 206345 -98320 107932 -205352 -153953 25902 57408 -72724 285839 1184 21256
11596 21256 221839 553788 389388 -40596 78780 -303893 5993 110677 15883 41027 10710
11584 -240938 439192 64608 218262 148317 -416712 -60247 396585 -12316 106804 -232089
11573 129938 1942 -39150 2989 218889 68527 347916 74744 99531 256649 -140421 363225
11561 -199001 139959 -247462 67179 -345747 113631 25046 232257 169970 240117 380609
11551 380609 426931 65146 114418 -83472 -74213 205618 139420 99609 207476 -54941 39639
11539 177829 1568 124581 30755 -125596 322243 42389 113436 97174 154625 -51592 139407
11527 137410 78967 -70388 6717 17231 206169 132237 172080 -129273 56512 -226149 231379
11515 157893 165237 37780 -93906 -72220 -32352 71615 113737 -121251 131025 -7284 200746
11503 133250 311629 310410 180501 -58555 12465 -39826 15151 -347682 157812 -26955 171849
11491 108948 156067 -39923 -25389 -13454 184922 -13011 8450 329696 -251558 484223 -57567
11479 -222835 65258 -117641 42480 199105 397522 -18023 205061 490690 153926 40954
11468 442162 -24788 -181342 297227 218093 41771 314899 361364 409265 228489 318581 -46946
11456 -18788 93565 222551 363586 117401 39481 -3855 125637 223256 318557 55018 429838
11445 429838 -101245 105701 260741 202698 -366362 -89508 -82943 -51226 -48060 -230028 7535
11433 305623 -105218 183168 -73157 8963 -318789 62737 53313 254799 207054 531164 -48073
11421 155426 198265 -54632 97604 -282254 -14787 -12312 23770 -239339 57129 -62146 42077
11409 74249 -190450 -190799 -176966 89570 -169811 245237 119370 22275 -117583 455891 114738
11397 274224 60395 -104254 -270307 71198 -135072 361903 -229504 141788 315428 -121079
11386 -202243 382310 -236300 48516 -61558 -173449 51251 -105992 -36465 128577 -62487
11375 42313 -18563 -7582 64305 146445 -351395 -92087 -82153 231961 217959 -238129 -51643
11363 166775 -114095 141323 120766 -199703 131676 124225 -85742 -43729 -252603 -245894 -151328
11352 -151328 218933 -188625 31134 105619 514113 130634 108121 -165186 -3099 -258349
11342 -258349 -100759 3085 -457508 -83702 -12511 -207505 -93768 -280705 -146201 166526
11331 214224 93914 95256 89922 197943 182810 95948 87879 -24199 158882 -18098 94772 -160967
11318 -248442 153320 146354 -168684 -127850 224095 -183947 55808 127425 108579 32959 -64513
11306 -137292 215979 -17795 -298308 -68164 92596 -340959 -442456 34957 145110 -82228
11295 -78335 47322 101984 44913 -130130 108158 -79125 -116856 275380 51607 50560 19262
11283 151191 -287140 -323453 -223300 -300309 114351 22561 -39540 151764 -155015 -87960
11273 -87960 65597 43849 -96505 95556 -96799 -15226 -78165 147689 128954 192601 -225558
11261 -51868 -330857 -113976 -178056 39806 -125427 122343 -72690 -91493 -85937 -212446 -328294
11250 -328294 44417 96292 -334303 128931 132434 -174933 -351729 -122790 -409437 -33577
11239 106220 274494 -346713 -95783 93802 -140283 188667 -98962 -99773 -30209 -55561 16315
11227 165272 -111724 -285359 -110764 -41720 135072 150534 -30019 53025 276452 -42842
11216 44810 -176759 -47533 30907 -310426 9474 -81475 -202534 58291 267428 -869 156112
11204 30869 -160914 -105446 -262614 33884 158027 -142279 -194306 58988 -65598 -207355 -244534
11193 -244534 65119 -44962 -188808 -401718 194756 -234702 183828 -508211 64296 -160573
11182 38286 -257632 -376197 -191837 17297 110677 185429 146001 263386 -205667 -250659 131885
11170 -116618 -143157 212167 122702 50991 51658 -158726 -73749 -328965 195404 -170788 -255962
11159 -255962 -51197 -25376 5874 45611 116593 22273 -27330 -113781 204980 129997 -306080
11147 -156493 -26320 158784 -54792 -54389 28196 49484 -155273 91841 -137967 62591 83393
11136 83393 -54300 21676 21923 -57566 -43178 -81562 -175939 -5813 2290 106843 253313 -169727
11123 -82542 261848 365107 279955 230133 -261276 -165390 -161034 -115853 114269 329915 187400
11112 187400 -219948 2606 164984 80884 -200995 93184 -19138 54438 -104554 73544 -84289
11100 -216722 36316 -207261 115491 47187 44962 -173805 -123400 391450 70976 -87390 -105198
11089 -105198 81795 173108 243095 -55536 -93475 -36949 583324 370659 -147331 186254 124022
11078 124022 88703 83051 205777 -157891 69557 266068 105323 102900 257038 271030 105887
11066 60521 352056 169420 257811 -53470 353311 90649 161595 241702 174598 555041 147708
11054 219220 368663 466077 46391 473281 337139 96429 441743 526616 299017 393749
11044 393749 287790 479122 928437 408368 591194 746814 637939 449479 864759 913162
11034 913162 777259 526296 688590 814009 380244 611752 586107 463911 658245 664034
11024 664034 863701 482809 682034 963095 545446 671453 877242 650976 597532 613995
11014 613995 578872 539749 702208 245330 847842 659858 781794 553411 810556 489313
11004 489313 512089 458177 271138 544528 353993 679046 600768 610790 679058 454202
10994 454202 787819 375863 506029 643307 804229 616150 696422 746968 291601 687966
10984 687966 507171 608159 764279 744943 915769 781175 481855 561666 814678 677104
10974 677104 636499 913535 956434 1131222 760039 853492 1001686 1378884 966044 1112006
10964 1112006 1108766 1383404 1233679 1738055 1597046 1864949 2395296 2443074 2480076 2706348
10954 2706348 2384740 2133058 2253577 1859301 1947221 1842941 1738470 1767385 1480016 1478586
10944 1478586 1244627 1368872 1700235 1793342 1993725 1694421 1314490 1497035 1601112 927211
10934 927211 945355 789165 824764 627479 185751 472085 325496 299392 413609 139180
10923 108462 516130 306339 507921 168360 -4530 65700 125401 43323 52288 179878 351400
10912 351400 108379 367948 39220 -86533 232037 -57287 -217874 77625 242859 106412
10901 -85501 -153483 -307881 -74179 56121 94086 -206726 254809 -19441 -20635 191029 139302
10890 139302 -20359 120020 -58368 86084 78317 198171 -175524 210825 -73727 -412448 -116426
10878 -281616 -32456 -160490 -37375 -379715 -226385 -23157 220986 -198158 14443 -423058
10867 -85338 -49907 -339891 -112890 -69423 -121350 -3882 31944 181288 -99189 382960 116005
10855 170150 -44558 -149619 9859 113736 -91806 142998 -142063 32168 -33473 -9750 -104232
10844 -104232 129682 385820 93382 78612 466071 35408 -102454 -32666 -224379 -132383
10834 -132383 277754 95651 -90731 -333768 55943 -269318 365073 86600 -74381 79453 188262
10823 188262 192408 -3577 -48413 -53836 241868 115586 19982 -33018 -36920 143669 -165891
10811 -141402 -82104 67619 248275 -10603 -234774 -272628 10148 -2840 374998 -72549 158610
10799 39776 -132683 -103599 135737 -43530 -29872 -199367 -155785 -224877 74599 -191481 -223832
10788 -223832 -268871 -32450 -248460 -137485 -76590 -310161 -134377 -39196 -185475 -12147
10777 -109300 -155133 170522 -122451 9212 78642 -386982 -29421 -296538 117575 64527 -113163
10765 -184841 -157178 -298704 107791 -162000 -248719 -441422 -197431 141517 -315307 51038
10754 -136420 -160653 -98964 -194206 -106981 57967 25848 -475577 -82640 -7500 -128502 106224
10742 -20535 -101044 -152155 -89480 -4947 340186 -164480 132358 -88817 54983 3104 -150927
10730 -88763 55221 34804 -8360 171607 -71144 12788 -109874 -383734 -40496 120717 44402
10718 56275 -47960 -147626 -244415 -148537 -275772 -219747 -229418 122333 7374 -9243 -225767 9427
10705 -185007 364666 167035 -167171 154761 287190 89896 -43292 42901 58218 -39678
10694 -149852 201873 88513 78851 5775 31341 -169769 196216 -29737 -89693 -69774 17418
10682 -171583 -399991 -55297 -168357 -111530 -242433 -2853 -439633 28027 247758 -61031 -108497
10671 -108497 36436 -273927 -93109 139095 22867 -41234 -119882 -85797 -154136 -47537 175011
10659 15884 267181 285801 6551 72697 -141039 -224478 -251668 -468935 -60940 -236043 119450
10647 45193 -15522 -198021 -168560 -180751 311275 -220635 -196530 -16862 43839 -34815 47418
10635 -238345 211584 -343368 160643 252215 110056 -18433 -73377 -227653 -154953 93800
10624 115945 -221741 43467 48455 -428312 -61982 30392 61660 -310968 55292 142846 64065
10612 135601 -84426 189589 -67525 -84823 -33589 -217534 -337416 -123873 426040 -73169
10601 -137025 -829 -12978 -25013 -65102 -141080 -75464 80499 -161428 -102026 -59559 206366
10589 177451 -70289 -34246 -115646 -299877 63779 -268755 -348630 146541 223118 -378055 -300430
10578 -300430 -90330 -193240 30565 -53260 80052 -121738 -191029 319103 252420 -271493 -88972
10566 44283 -135864 -302943 231503 -102947 -2443 -90817 151981 -45507 -172760 143917
10555 -11960 170220 -332711 -27163 -125142 -111150 -157843 183601 -89345 -244688 -133515 141236
10543 -72996 -291518 249500 49436 324787 -117585 174962 130107 11976 -60652 26085 -232435
10531 211110 -85920 -11271 53682 121781 46564 106345 -162656 -73564 -152804 101308 -137568
10519 64898 182273 -312052 -300762 -4611 88914 -21082 183122 -214593 228549 309211 362687
10508 362687 -15625 163228 53941 202942 -22545 -124126 7671 -301907 -61154 -181986 15458
10496 -178534 -326840 -83819 -236019 -109849 -68026 -23386 -292531 -296118 226933 160606 -221135
10484 -193884 -171804 16740 -130623 140640 185194 -141618 -336360 -223328 -237228 5343 -144226
10472 -26858 -43769 -113798 128231 -165299 59305 277536 -33257 418802 784441 302864
10461 280827 105663 192028 106332 -206548 218310 74169 51952 293129 136475 87848
10451 87848 57224 273438 66095 298029 -151028 -199382 248936 -47070 5968 -15828 327592
10439 -6834 -91905 -13062 -102737 -134892 262596 -82595 -130138 -126908 -239746 -156235 -109186 -107410
10427 -107410 208983 -120203 -205934 165786 -166015 -75446 -232892 153808 231872 189253
10417 189253 102895 -125250 -168348 81241 39230 -365204 112405 -166582 -93881 32767 -233680
10405 13253 -142035 384659 -247419 -175435 -73614 53053 -18529 -16382 22372 230178 -99883
10393 -384594 -53670 -214775 58359 169263 4691 -54069 13376 -21621 -78717 136966 243855
10382 243855 -139648 67666 56194 -385237 26166 -8678 40660 88693 26853 -74477 -74420 -4471
10369 331891 -7425 491515 4646 -114768 30045 -40616 187384 70663 73106 265948 598012
10358 598012 121580 384932 296305 343566 428252 134604 561218 276820 120217 301638
10348 301638 169672 496637 91555 523754 193843 302411 111456 -23234 412251 336546
10338 336546 110381 470452 286237 302958 243739 396096 411527 482781 97697 79951 708522
10327 708522 152502 2427 15952 74787 523827 207503 202309 292468 233997 65923 -151635
10315 -140808 -65820 -161085 -106374 -89905 390224 295937 187928 -1971 68092 76693 187117
10304 187117 288475 97049 87291 181186 63593 70589 225565 97585 73748 -220061 66522
10292 -298161 -202736 21592 -178266 254411 39875 -29119 158314 -31882 -140119 471802
10281 61007 -161205 162581 169200 -292883 73946 378393 198618 185167 67580 -367642 -57895
10269 138888 120832 -147906 -248935 255482 152975 -129182 -89760 324109 -197501 -206397
10259 -206397 -406925 -349421 -161769 91785 -20034 33628 -65670 -281930 20816 356835 28242
10247 -112860 224172 -581697 295033 135317 145389 -33642 181071 -61865 389420 219716
10237 219716 -90776 -145614 241417 -54748 -47442 -22462 -39612 -228563 451718 -90304 112190
10225 -130533 8263 -337398 138655 -76283 -179979 108524 -181972 202450 120572 -52498
10214 -289836 -95254 -352395 138619 -98223 6046 15675 159968 162365 -147879 -104798 -557589
10203 -557589 -102340 -113959 -346986 -9831 -329617 3312 -155351 -148075 -148504 -137843 226631
10191 -22334 115232 91974 -115652 -296337 -115042 -94490 -78858 -343412 -67167 160832
10180 -194164 25595 -12927 -99219 114022 300045 -211197 -382568 -124751 105449 -82565
10169 198544 -70784 -34514 -283328 111023 -269124 -80569 210324 -163405 -155381 -256013
10159 -256013 -24555 179553 114397 -92851 -166624 111087 92307 -24089 -77346 -241967 -64259
10147 -20924 -131077 -103761 -22659 257415 -171591 -9106 -31347 -101991 -327459 60177 99295
10136 99295 -199300 -91438 99461 -100981 24895 -234280 -130782 217768 -92292 -343564
10126 -343564 109946 244275 -244119 -157377 193547 -14191 -64916 -54277 227319 87816
10115 -185990 1995 -115479 -210245 -456813 -24740 -337964 12578 -120225 -69712 251610 26127
10103 -256081 -37130 139138 -52176 -80455 -36571 -205094 -341513 -271685 -8391 72807 175265
10092 175265 30774 -292115 -123320 277298 162655 159076 7883 -10465 -3166 -48039 -68535
10081 -68535 24579 -122743 170130 -216527 11444 -95933 -104941 -143858 -78984 -31990 141375
10069 -114672 -225485 -11185 13396 -13482 11298 60206 -181698 -314056 -85706 -222639 67694
10057 120735 73378 -212300 -132820 -219852 135048 -198640 129207 -147416 -101489 -82639
10047 -82639 240299 110551 26164 -463465 153194 -198616 -2775 91679 -7626 85232 -160803
10035 56966 -89664 -39309 31592 -35069 -123733 -83506 -23631 -21279 -336068 -267293 -167102
10024 -167102 -480949 56121 -12934 -97604 -104320 -100966 199228 20825 -125359 57715 62765
10013 62765 -193150 -209893 -50572 -46475 -133530 -318778 -266474 -39731 -6217 -330713 -153296
10001 326479 -124811 65543 -17692 -116681 34164 -277433 126052 -193858 88383 1459 69088
9990 69088 63890 -91631 56907 34192 -229460 -336342 -97403 -269320 -152221 106819 101807
9979 101807 -33998 33679 -492672 60544 -167116 59624 74400 198448 -42566 -93132 -158576
9968 -158576 -169992 5431 -142298 -126851 -79596 363733 -186199 -182309 -307428 -240949 771 79354
9956 79354 351924 32816 -129442 37659 -72499 -67759 -156601 -80629 -92643 -16865 -484152
9945 -484152 -286808 -187785 -107338 -324156 76159 -120118 -137474 -123444 -197287 -73947 -137033
9934 -137033 308131 -168917 -70092 -42658 -202073 -125828 177533 -334547 254213 236015
9924 236015 -25275 75885 -57189 -332253 174420 -176694 149106 -373075 13394 -359431
9913 -144711 68453 -25919 -303653 -128628 160335 -422709 187902 198356 -55133 -320934
9903 -320934 462167 -173882 22722 -126577 39395 62876 178631 -1299 -52974 -388969 30842
9891 -295384 -80416 193710 -46956 -81603 9051 35422 196202 -166350 -363689 -109883 719
9879 -59760 -41449 -252450 -135637 4038 -47603 64888 -145810 126501 26264 -261101 -287858
9868 -287858 -73457 18947 -494619 -107506 257269 285687 -139450 -2720 106527 26950 42904
9857 42904 234031 -430658 261419 -62728 -75847 -22063 -404127 -17519 -151134 68217 -253577
9845 -171109 83134 -239850 108930 1759 237638 276306 10621 -270545 -175917 -187822 -79576
9833 -114242 -26375 48526 -205033 197781 -107981 -155738 107445 -33435 -206192 -240603 348143
9821 -110365 120979 -7665 -372574 70077 -118927 -128348 -50307 -3332 -213786 279574 -1448
9809 -270044 -295635 89276 71465 -85269 133902 93360 -198881 -138516 -66248 52803 93534
9798 93534 -24438 -414191 53791 -59821 41663 -201552 -193907 -275741 -217206 228481 923 70445
9786 70445 -24072 28116 125267 -36985 -126295 -38751 -240842 -368055 115634 188580 21848
9774 -35320 -39402 151245 -272405 301405 -136255 -134827 -58558 120236 124541 10049 292461
9763 292461 157471 -218695 -19882 -160954 -129040 -21474 6052 -167476 138205 -229152 173679
9751 264063 40109 -120969 12642 -130966 11899 235763 -110403 -289162 -241451 -273822 32495
9739 84518 -200032 120460 34442 -242932 -79041 138598 70088 11473 -42417 192997 103852
9728 103852 -58769 -35823 -267382 -8055 143373 -6415 -163189 -151143 236138 281542 -162438
9716 -43408 -432963 -386146 -211186 -262858 13777 -188259 -58368 85140 -195161 -112176 104031
9704 -143890 -296389 -175205 93299 61287 249474 -138738 -132786 -391369 -42827 -204142 122423
9692 -460939 -211556 -41000 18043 -95197 -334412 -49973 107283 104214 -3925 -103701 -61177
9681 -61177 -347176 324411 -192552 -20255 147402 -129206 -118107 219224 146407 -128253
9670 -301639 -74823 11771 -2638 -166699 -140133 43901 -444798 399915 -74109 -331762 88101
9658 -67614 -10696 312246 -277589 -204403 322260 67482 -127716 -118125 124562 248577 167228
9647 167228 238090 -375331 384905 -22717 -483868 113154 -396043 -116733 -55509 -46880 -311252
9636 -311252 -193713 -143352 44182 -96262 207282 229946 13958 148761 142084 58492 -236907
9624 -358438 -65875 -197454 -95312 -46452 -24087 -44407 -121474 -15974 -101883 -480663 140644
9612 -132985 -49860 102609 -398374 -32166 -61223 -188134 24779 -199027 -188492 42282 11496
9600 191893 -645 280318 -131347 -148507 -236338 96622 22207 -325034 -303157 -213441 -7431 174558
9587 239151 -128968 -380523 64887 -479418 161547 -263242 -287934 -34842 106821 162503
9577 162503 -186345 -251361 352734 77131 -128716 -143675 -13348 -218696 248435 -214778
9566 37447 -70940 75111 -334598 -46154 189375 -304498 21608 -176372 5437 -115270 -333611
9555 -333611 -145019 117193 -125098 -282109 -262538 2506 149804 194546 -330707 -263020 133359
9543 -219711 -354194 -481558 -409757 -3847 -105099 -24476 -263124 259031 -69693 -83298 -259860
9532 -259860 -111675 -18763 80523 -74798 -424042 79033 155926 -26303 -113005 -397629 -385573
9521 -385573 -70755 83620 177506 -5311 -131523 -258043 -163575 -132437 -184410 152445 -365367
9509 5541 -136363 -19496 -38710 -50950 112811 -88175 -76368 -44703 -211820 159166 122672
9498 122672 17463 -142444 10661 154293 54108 -21255 25748 -28632 -67977 -243247 -97467
9486 27917 -278301 -181037 -69162 5555 -167351 -295524 251490 73256 -247960 143645 -285450
9474 32176 71992 -43681 40892 -35 -108401 -207456 -247495 121903 -376414 -284496 111101 -175791
9461 -197362 -304621 -139826 -150303 199622 -167164 -109585 122598 -218027 244726 -39126
9450 -255621 -180685 -965 -115857 -186406 -182442 -91122 154773 306 1313 -207911 60112 66626
9438 66626 -11670 39474 31699 198864 198786 -16697 140340 47590 86692 -137206 -39830 -257176
9426 -257176 -82169 -338187 -282663 -14797 1995 122965 7671 -196963 -149506 52080 -86407
9414 -162574 75699 82869 -306703 -152354 194775 471 -28774 63788 56408 -144305 -152256 285033
9401 291453 101523 -72347 -171034 -401509 32430 122747 -54152 -119928 -123019 137829 -546507
9389 -219155 -156868 25671 164816 2694 123422 -39677 74472 94779 120576 276381 -160201
9377 32038 -200152 14428 -607311 -143673 109146 138343 259006 -282616 -348364 -83569 -83540
9366 -83540 17952 -163311 -78329 -184245 -43394 -37436 -134353 -107172 -261454 -26138 -259655
9355 -259655 -94982 -237444 42845 -126936 97334 313704 90347 -319871 -95918 -169518 67444
9343 -68923 -220160 -61817 -457132 29501 -66584 -64183 253610 -144173 317545 -101842 -138073
9332 -138073 24426 -162160 -90257 -129546 102092 -146939 -148127 -35143 -98335 -132804 -44689
9320 125366 112941 -25030 -280512 -86398 341764 -387631 -90739 184221 -80925 -13275 114846
9308 121501 121627 127629 -93630 23449 162491 -107101 -214540 -137531 111053 -195629 154690
9296 67167 -230819 1692 -179881 -307451 75744 -20860 -297871 145511 -92065 -137989 27558
9284 -62389 -237156 204650 -92841 -284906 39978 -118490 -122521 -178337 273786 -23900 -365154
9273 -365154 254136 -155258 -48883 26664 -183270 38576 -76756 -133983 -117608 -115145 -216525
9262 -216525 -178878 -187765 -73537 -79582 -113442 -85059 -111136 -164465 -233327 -55445 -39056 79356
9249 106149 -68696 140683 -109732 88167 -55300 -220198 -147229 -231483 -250004 196892 -327307
9237 -81212 4130 50339 -341277 -169306 143885 -190951 -108550 110367 -195801 93394 310781
9226 310781 -76260 -261145 -209090 -176845 -57676 41651 -130070 -290410 -157771 -135550 -229263
9215 -229263 106904 -199629 -40598 -286593 -29793 -140646 -421560 163820 -190593 -85259
9204 -52901 209561 65990 -20332 -212481 126594 -123354 92524 -376431 10391 -74869 -119487
9193 -119487 -340717 -3038 -119023 79879 -9504 -213636 -343110 -73890 -143689 -14694 229036
9181 -35629 -175743 -234477 160188 -128830 -42053 -318657 153881 -121514 -243136 -136567
9171 -136567 -33168 163308 -67808 87980 -257987 -276815 -44372 -190340 -367293 42627 -102623
9159 -91351 -176333 96881 80606 -184643 -131097 57026 22404 -289168 -140463 57069 -58858
9147 54145 -219233 31756 17918 375656 19282 -209761 169723 250609 -44244 231587 253187
9136 253187 -58914 44651 -179818 -80121 -31909 -177831 184287 73680 28331 161760 -127264
9124 237441 -99299 -102511 135062 16879 179127 -114839 -51025 -352588 -87909 16035 73257
9113 73257 -194031 -147406 -165252 65685 33251 -58773 64539 -123195 226006 -55080 133800
9101 44229 216851 -67548 754 105407 129560 21092 -192941 -2194 -113437 -59920 265061
9089 -111339 41217 109520 186527 -285096 -313090 2016 -351238 46476 -146416 -318695 -9317
9077 -194217 -59919 -411339 -81854 18708 -145576 6260 -423153 223360 18921 462096 -283700
9065 -29459 -63457 122693 24388 -91803 -223517 -13539 -87515 438135 252619 181667 -114933
9053 -244172 123323 41127 68323 -65182 -75771 -80971 85705 186319 202930 56563 -53442
9041 -98435 -59837 -281249 -108235 -379905 -120776 22124 190784 -324518 133134 -147475
9030 129692 60668 -73803 -10995 -296161 258342 -280498 -129139 -81537 13092 -29779 40550
9018 243944 -409585 -262508 153425 5471 -136808 -237977 -3011 -38883 38011 -36416 91548
9006 37952 -26742 9535 221161 -105524 -241358 7400 166536 -140432 -318818 -63055 28946
8994 -47761 -219204 204169 -151612 16845 -130365 -259031 17398 187596 -154090 -76841
8983 -40631 180043 -144745 -9616 -122904 -319529 168846 -188694 -127048 86857 -137351 81728
8971 188047 -10536 22919 -82895 -174840 212535 -98345 -199714 -205294 65831 -165007 32265
8959 144996 -83754 62745 -100897 -27430 74233 -116724 -56863 192798 -16653 414355 -54130
8947 14978 -87017 48299 -77152 -256244 123712 -33922 187523 297849 -324945 -183838 231709
8935 240290 228533 -259412 -145807 -50755 123060 -55428 -118358 -24439 -150535 81973 44251
8924 44251 20648 219921 -56620 5913 242466 410409 380688 -86626 162000 70220 471373
8913 471373 135711 -145969 728950 907881 1867368 2211542 3771083 8403788 9631390
8904 9631390 4533846 2583397 1423170 1066899 965227 434301 278340 -59290 184299
8894 121087 316698 271230 442698 34317 -47257 58770 244344 102506 -74475 -148497 188750
8882 -250880 186647 -54794 -234083 -860 -361814 -141233 23783 -62861 21145 -192916 50654
8870 -75932 232795 -174448 266355 -388895 30589 -249811 203973 -82121 -135538 -52100 89343
8858 -229739 -71606 -148533 26779 -35599 234799 -20245 -104249 79326 25800 -199378 -293972
8847 -293972 -91770 -13179 -87247 -158681 -407656 57797 -72528 21165 257976 51858 -37956
8835 -543480 128041 -20960 20752 -138236 -99042 -204242 -210817 258228 -10295 -72897 -82439
8824 -82439 308929 -100731 66382 40650 -326928 246099 -78500 -90905 130050 -227783 106563
8812 -236978 106159 116953 -193627 -149459 23307 18584 -284007 202325 -360182 172680 19474
8800 -199512 -95153 380179 -293397 -45606 651 -89608 -134434 -387820 -78405 -382405 -116327
8788 145208 97031 33882 61107 97770 -190630 13521 -183861 -53061 -372974 -113490 119396
8776 -72630 -267176 137470 -1640 -140418 -129816 -166622 -59262 -22384 263044 -120282 20031
8764 -359857 197932 114012 188291 -96444 -2599 -163118 75633 -232655 -130406 -180829 -56150
8752 -62309 -70857 -17148 66689 26477 96711 -310130 48212 -71237 90542 -38563 -51230 32900
8739 -42885 7743 -168025 -467321 -276389 -133770 155143 214522 -27579 -32884 -172332 122475
8727 46486 -133869 81269 -33637 -195933 -210510 -5518 -71582 -141878 115891 -34134 -53310
8716 -53310 190623 107461 46305 136137 -152722 -32301 285515 -140531 -62287 98602 -98651
8704 -53248 -230185 -21774 51905 -101231 -144241 -269080 -238801 -2136 64799 161049 -272522
8692 -123453 -220168 68823 -259536 -42635 -137343 209775 -58265 -4699 -1825 373588 -8548 -51062
8680 -51062 -224805 -170749 49273 -255877 -229885 209671 279881 -212613 30699 152818 237527
8669 237527 13506 -151040 2213 113743 -81663 -462764 -273567 -186296 -169904 -74709 165438
8657 83750 -102621 -210999 -71756 -191871 122464 20598 -88682 -230056 -46971 -34289 -100336
8646 -100336 67655 -4595 -51591 -35018 -30111 -102369 247016 13375 -150866 -68666 188935
8634 -42069 153115 -51484 -2183 -49277 146147 -353250 4520 -57948 -25493 200282 99472
8622 -273595 -88128 -49283 -102115 15528 -94727 -19990 -6690 79040 -83388 -260966 -239738 -235087
8610 -235087 -211497 -43225 -114575 148589 19876 -211298 -8750 203360 162144 -173840 -85449
8598 -56617 -160330 -160512 43310 141706 2673 -290612 -133327 392171 -48707 78376 -66417 32319
8585 -30992 -222381 303866 45072 -128239 -168607 5572 458029 -237388 29313 -142184 -132387
8574 -132387 95283 3207 160897 340855 -89205 -293771 97133 -86595 -61896 -138618 -138800 -23197
8561 48867 154594 191798 -207676 327509 -297404 -49797 258444 145646 -151325 -49667
8550 -383025 44026 -37476 -116591 -203219 -118210 80970 252709 230745 -134798 -73983 77375
8538 387451 -30223 87829 -43148 32799 46222 -133047 -380074 -182879 -131014 -148015 -98822
8527 -98822 101301 12900 185868 -198173 20831 214557 -166809 -77080 272543 104958
8516 -12970 -36093 123917 73417 -236996 174554 -61325 -104262 -196126 -450918 23071 9520
8504 18051 -141383 -159016 70414 -99792 114305 -143177 80404 38993 -400888 -361643 -395695
8493 -395695 -136649 -80467 -92657 -160983 -98729 -31390 95634 246101 143225 -135305 -119259
8482 -119259 2358 -191537 -31573 -254472 -216487 -207300 116219 -28129 -388687 -62744 171514
8470 -25441 -133147 -27529 -126387 -249862 54285 46828 -64432 54753 -73744 120544 -70345
8458 -65551 235006 77742 -297427 -250426 150338 86332 106258 -85361 16239 -17224 -55226
8447 -55226 110564 203817 205406 -1405 -183984 -267005 -135591 -364880 -204619 230943 9016
8435 84295 -294577 -68613 50264 -348985 105257 85770 2350 -40929 -180683 22625 47528
8424 47528 -693 72761 235006 103759 -307363 132358 -227060 -221037 -83067 -80011 -4204 -252394
8412 -252394 -350508 -216018 -6618 -268837 167437 103437 118552 -480117 -171353 -141538 -121383
8401 -121383 -149983 146859 -366842 297968 -238005 29955 -219767 57040 -194976 42710
8390 123349 -68781 -215878 71609 87622 -155939 -311473 -8517 -206249 -58096 72095 -292994
8378 139188 12369 -13725 18275 318174 -197316 -153200 48816 -119642 -68535 -39503 -105810
8367 -105810 363215 84307 -195438 10598 -361996 -84158 70976 156809 -188877 -65243 39463
8355 -78891 -61992 206433 38680 -309799 -252800 36864 276740 -216540 228827 167936 123357
8344 123357 106045 -109557 -58254 10172 -256287 -240072 -422424 15919 -122780 65697 30916
8332 -67796 -60478 -15158 -7268 44953 -369514 -17502 199518 -43484 -155098 -125213 26777 -11311
8319 -2135 300479 104518 -51058 179634 19442 -217396 -33364 -96253 240660 -483839 -19577
8307 147583 -111596 -146242 216375 -275256 -21289 -164617 -97938 -89141 119596 -15951 -156024
8296 -156024 -305643 -357267 -249881 -267902 -87233 -253354 -335612 40462 122853 -62166 -200021
8285 -200021 -89390 -426609 67638 32481 -24717 -265036 -58193 -11549 109623 52851 -18624
8273 78159 -371938 -426971 114538 150286 -237930 -159449 -2492 21038 -48527 -152849 -165205
8262 -165205 -306820 -64917 -71879 -61357 -290137 147207 81987 106517 8464 -41576 -117890
8251 -117890 -70947 51218 114797 -170556 33617 -45375 -251441 -67236 68481 7242 322574
8240 322574 263379 -48724 -318104 -61204 -322500 249152 -300088 56312 -228606 138744
8229 -60964 140404 -6190 2774 -202434 -7701 -241430 72779 -122731 -216586 -60386 -20283 -168100
8217 -168100 189934 -148469 -194867 -102865 -119159 -136303 -449882 -140838 53768 -350879 -52717
8205 -143379 28440 207907 -203752 -94747 110674 55041 -228591 -304986 -35010 272510 -15238
8193 -32049 177789 -34049 -303777 -128946 -78448 -76026 125920 112956 12627 -321781 -21166
8181 169292 -33793 -282415 -74886 111724 77120 -217729 -366376 33163 -125701 237387
8170 81210 -173382 -148289 193705 57157 -519363 248417 165325 192606 235671 -30721 85790
8158 -149320 -250652 -317247 -196611 -131987 -121206 -189246 -518277 21688 88122 38805 -197974
8146 -125896 287735 -34239 276550 34738 -154617 -504429 373598 84980 -97141 -347307
8136 -347307 27538 -93303 -450003 -17903 -286245 -113722 243162 33775 -59934 164839 -156488
8124 -31675 -171481 -69236 43395 183627 52275 324661 46594 -268306 -48254 -249556 25070
8112 190411 -121697 -33388 222690 180677 196661 89679 -158885 246633 -238129 93230 -78126
8100 19203 27129 -235034 -137908 -77248 88158 -73981 96701 -148831 -342281 -165262 -67407
8088 240971 68292 -154327 -101380 -10161 31687 5067 43449 -182003 -116925 -162628 83202
8076 86107 65822 284838 -180685 -530224 70919 -125152 229157 -19379 -41998 136621 -241543
8064 -109774 -136986 168904 33990 -27784 -72045 36058 -7398 -204183 -66132 301299 -240826
8052 60728 -36143 1599 -84579 -139307 -97681 -28061 261855 -157484 136911 -125023 -370451
8041 -370451 -131592 -88686 128075 -187930 287996 95757 -63764 125241 -250631 250815
8030 -7679 102287 93400 34245 -373705 -161424 -141251 -36822 -5308 -155775 -262067 -82651
8018 -81907 -47901 38789 102884 -140310 -134074 -140497 -34781 -100310 -201619 -59369 -149155 -213038
8006 -213038 -99016 55347 -118326 37599 -125526 -7751 18017 -229394 -184722 233745 212112
7995 212112 -339604 198874 -435976 330194 -114370 -474514 -130921 175415 -307873 162054
7984 -220594 201006 -174686 158763 -67505 -15094 -174590 13916 -113149 -110636 -229712 -324165
7973 -324165 -201348 188360 -3607 332991 6742 45771 -31938 -197281 -44421 258777 -2665
7961 40751 -266916 -206854 -86845 -12418 56253 -249277 9633 51666 -167152 -100605 -16491
7949 -105073 -518092 94596 -207270 -123786 63561 172702 80715 214441 78002 239178 -106325
7937 9246 -329296 6929 -113085 5052 -179373 270016 -241267 -96530 149926 -21707 -17431
7926 -17431 -132815 -339563 381626 -216700 1978 69238 -51607 274188 63998 236907 158635
7915 158635 -88957 55273 -78401 381007 -180990 34176 -116575 -177352 82789 206335 7889
7903 56605 202638 165268 186809 -203136 -89197 -89829 191320 -416856 -116385 -41335 237775
7891 9589 -33076 -3406 -49959 -184635 -183360 -45795 58960 114992 -59161 -95605 -21743 -124367
7879 -124367 100213 168597 -2068 -53473 -235757 50582 -316305 -69788 140071 151929 260201
7868 260201 -232537 -119948 28312 76188 -377496 -288906 118835 -154583 99140 64091 -48549
7856 58951 86141 60106 350901 -62102 -96157 -348660 -186805 61533 -11965 -69590 89534
7844 75385 116649 -228831 42721 -220952 -103040 304746 -693976 -297228 -322359 -89135 -91606
7833 -91606 -27571 -40690 -171657 -330921 -83218 -108529 -44400 -52288 -59195 69465 -223533 155125
7820 121190 -88757 -460637 -204620 -184998 -13406 -250832 97483 -201834 -109741 -167790 173036
7808 187607 55025 2790 526631 325164 -154198 -10558 56082 -99500 -157884 -91380 3709
7796 -214756 44863 139363 -345341 272783 192324 59437 -116254 2261 242220 -62836 188734
7784 299760 -143402 117562 -161775 -93046 -329097 -93446 -193506 -159812 -103458 148132
7773 -138082 22175 -272268 -227183 -2044 -169907 -97508 -145525 -181845 -286672 -176742 -179991
7762 -179991 133402 45203 121860 105147 1029 92843 -231986 12459 -123550 -409865 -122386
7750 -223750 -256363 -184726 -128012 66940 49150 199834 197654 -311253 118223 -81240 -202633
7739 -202633 22684 114078 -377669 -45936 -103193 48595 -40303 -222779 10717 68707 58647
7728 58647 -98580 -384354 202679 211481 -134611 -39143 -12614 156885 375962 -137188 -51196
7716 -115904 131694 -15530 -164778 255118 -3152 -200945 -21403 162655 -74363 -82684 -102631
7705 -102631 460685 25090 -58249 201354 -93443 49060 242516 -200318 251520 298362 39755
7693 -74458 93174 155293 78339 17102 -319509 145777 -50279 -60656 5006 54507 147510 -111303
7680 -166146 166228 38309 -124375 -299072 34691 -44837 -20925 -18126 -176376 -301457 -132765
7668 -235994 68306 243538 -146449 546 5873 9901 -6603 -277905 -31994 226815 -35771 -351804
7656 -351804 -65852 -156377 -83552 -132341 -29746 -425745 -7244 213570 211438 -49704 106600
7644 -149196 30688 160754 136459 181107 139277 20597 156159 -448042 -146892 49731 181980
7633 181980 29124 15193 -15906 72041 281643 -13746 -160908 -158976 107678 43127 -108384
7621 86369 5048 65169 -67136 144543 55772 -84002 374419 -241439 -38575 -162015 -142513
7610 -142513 20624 -120538 -21261 -292935 -95067 -224352 142003 -60944 52145 171184 -306934
7598 141832 120982 7950 86676 -164079 -24032 147251 280653 -34038 -54473 -19526 -282093
7587 -282093 -4911 179889 16712 -118394 -95821 14052 -173130 -29432 -178848 292871 103256
7575 63409 279611 -257897 -30378 -13525 162405 82644 -168777 348898 -47635 150876 168365
7564 168365 -393427 -122843 10725 301068 -8738 -88181 -186796 -12116 -145504 -96575 -59670
7553 -59670 292934 -75056 8201 -222190 -135665 -31965 154637 206030 -427038 -243674 85473
7541 -112265 -66540 189100 8696 3128 301019 -5700 -93417 159287 -66163 -64991 41003 159911
7529 159911 -197110 -33848 -109689 37191 -256361 -231739 -253866 -127001 -292233 -31013 41083
7517 668 -335467 -120568 -208351 -107007 -164289 242607 17182 -184794 -315651 25634 144445
7506 144445 -304644 268112 -63258 123846 -139801 202761 106248 -98020 -104843 152471 168069
7495 168069 -61859 291580 -174203 -113537 -164008 -28177 46703 -248785 -97093 28905 -46166
7483 29275 -301390 206949 -155863 -121241 -87101 53482 -89812 -128371 129807 136438 170293
7472 170293 -110696 -417389 -343341 -78325 -10527 219246 69088 -60261 -32255 201604 -340626
7460 172644 -18394 -42900 -296770 70774 124574 80770 -97131 -173534 -10953 -62077 -67181 -118116
7448 -118116 -197168 -90671 -237348 -224999 115479 26070 57769 136790 48733 -197634 49844
7436 94306 -40318 54565 157150 121698 39799 -143975 -89852 223892 -176133 151539 -326288
7424 176994 -407688 11407 81798 166131 90123 -517859 80442 386360 -255632 67947 -281530
7412 124710 -90044 -218458 -196247 170615 -272044 53512 -28653 16520 180207 63589 -72390
7400 -97574 -24726 -54065 113466 -157828 93794 -151579 149024 -238470 169744 157358 -268144
7388 251039 72222 -192181 82522 29781 -101563 -219431 36551 77662 -362603 78626 -218865
7376 -36784 58256 425330 101116 15722 18343 -212716 12665 326337 -59548 -43315 -196657
7365 -196657 178058 -66747 59310 -218768 -48275 -98978 -282220 -155565 13575 180343 -166665
7353 19349 13104 155623 -214066 -114337 -3095 -20465 -290516 -62264 139499 53855 -194296
7341 305056 127453 115806 -79390 -195801 98183 -374072 8406 -399534 116095 185450 32453
7329 91698 54744 122516 -69151 223124 -189248 -256774 -135696 -149641 45498 -38311 -18380
7317 2343 264196 -25061 -66962 326749 -226037 -235835 16048 169632 -289179 237133 1766
7305 38061 -110854 187371 -175462 -304763 609416 -296138 87987 -124733 -20095 -74058
7295 -74058 -37020 -19909 179095 -184398 -253296 126578 17250 -396462 51075 -153577 -77058
7284 -77058 -322288 -113284 104638 -288506 181884 -30344 294294 -226337 156274 -19504
7273 -49241 33122 -71162 100713 -93737 -85133 -75827 -408361 463513 -284874 -93050 116096
7261 -193901 93697 -267886 60556 3694 -187609 -176278 65552 -68795 267964 351399 128065
7249 68279 62276 -2667 162286 132407 -119801 126100 51172 -21667 -206285 -104983 51585
7237 -11993 -30426 -13615 -181453 118111 -181306 16311 163108 108900 -77085 172285 -259078
7225 -104763 121774 15195 -109236 -163868 -491181 191262 -76521 287125 -126989 -301331
7215 -301331 -28698 -206153 -179881 386086 -71284 -137611 35083 -389069 106725 -155230 327606
7203 -188632 70581 -132664 -260682 -74520 12138 167296 -340022 12336 -131422 80366 7276
7191 -211345 109297 123497 79792 -170438 159636 4725 19081 42735 -50627 21782 -42150
7179 110244 -100167 54453 117395 6074 -259475 285587 296354 -145117 -145168 143486 14830
7167 -67140 -105222 -175083 -189185 134793 -227663 -243270 -61347 118843 87848 -40861 -183975
7156 -183975 -254558 155972 -204898 44505 -152740 203635 191529 215854 -384644 180881
7145 7191 -356522 66011 204621 -107956 107710 -355125 163849 41677 128969 -27988 -174245
7134 -174245 172968 213351 260853 345088 277937 106129 -161435 -331871 220552 194408 -80149
7122 -80791 -134124 153509 148217 162643 173762 112174 265356 152321 18998 -98239 -54036
7111 -54036 144740 -233518 15779 -168387 -357069 46005 -164211 351228 -155346 -249225
7101 -249225 -209802 232907 98883 -90218 -129590 -285255 131632 -145991 311953 -293911
7090 286480 -224743 -206878 187785 57636 -424617 -12216 92067 167627 -110824 -41393 -181880
7079 -181880 5438 28774 275321 29003 -121069 -45376 -36544 -156569 80982 169393 194229
7068 194229 124094 6515 105149 -251112 -76077 -294170 -233728 -55662 149361 20667 -181373
7056 58330 -114503 -67752 93132 158638 -142274 -28816 238011 -397151 82306 173825 -410490
7044 -127904 51146 -371877 -206474 -97675 62131 -53899 -171433 -45038 -54385 -338047 -2816
7032 -1059 280417 132981 -146581 -234052 112598 186543 168654 16205 -91632 -259970 -64019
7020 -306199 47984 -279505 76107 -139118 233957 99041 -631 -214628 89770 -308864 -112745
7008 -48158 -22022 50776 -110551 276703 -259615 -42642 18024 273387 -170767 -22913 -180225
6997 -180225 35116 -256705 103525 -223159 -191008 23886 -7797 127092 -332552 -64066 98690
6985 46417 -87245 180699 -181234 -138271 -128756 26359 7610 -58992 10798 -14252 -366222 167824
6972 19843 47571 -125603 -145758 98400 289132 212328 -50285 -61916 -68157 51446 -147899
6960 246704 -101413 -78870 212780 225787 -95037 6002 94071 259094 -336854 50143 33316
6949 33316 38761 -11390 -148970 -370523 -27373 112248 -262894 37964 34511 -70443 220506
6937 -204598 21422 11690 -180367 21550 -33757 37361 -161832 -201199 343910 -152875 49525
6925 41395 152104 71950 -166976 -47262 -97223 22476 -4336 -61076 -166534 215444 -114109
6913 -254176 -73508 27221 65733 -84773 -35119 155590 -68705 -254367 5973 -283440 44114
6901 -83986 115822 -88097 -301808 -2014 -17917 -201657 17145 29814 244032 13246 -82805
6889 -425348 -269568 -13401 -221376 -213814 -28978 -51982 38214 -25285 -149246 -115259 61001
6877 -56584 217324 -111211 156321 14974 50940 78847 -86258 -140334 321104 158294 -235402
6865 -94550 -215601 -276141 107734 -237151 119400 -200903 -66596 -72980 -58624 -254694 11851
6853 -39326 -405765 -178716 -192886 -34991 -249798 333977 110404 -302108 -78448 -169965 156480
6841 160510 -81110 -68961 111491 -33065 58239 -16028 -49715 144503 -97523 48388 257816
6830 257816 38361 -161017 -158577 -161538 -361579 -230897 143826 -195453 -11345 134449 49618
6818 -36181 126201 506183 314318 -422630 67378 -60988 255881 122769 52664 -203015
6807 108588 -281154 -63464 -192225 -186020 375726 436737 -7238 233259 -294405 -2977 -206745
6796 -206745 -129198 52437 -133659 239918 86720 22118 -243953 -273433 -178899 -85920 -33877
6784 -139278 143773 -93128 221489 -8757 42251 76754 -122494 201913 -101354 58482 79021
6773 79021 424 3823 90694 -127829 19910 38117 -32820 -210859 -32970 -121691 -23947 199802
6760 80007 -84984 88857 -45769 325975 -128119 272660 259131 -443346 356475 -288334 42312
6748 272776 -91665 -115364 114574 62896 15903 -48461 -108676 262932 39118 -261984 -104196
6736 -110512 -235070 -60217 -372598 77303 -51815 27737 243 169996 -206283 36205 352954
6725 352954 -51299 50813 216379 -87331 23300 -233662 147293 -223075 -61273 -92760 -55000
6714 -55000 1334 35692 49705 62307 12782 20253 -302501 46174 80620 -66693 -35504 -331292
6702 -331292 -271491 -77163 108134 173677 -219574 -218919 -243876 86827 -138987 -7295 -35343 154415
6689 -229884 190995 60278 76482 132457 51104 171625 -99801 -174028 -5912 -19104 77769
6677 24882 -111783 78959 -110811 -33638 53889 -124069 169668 347963 -143126 20643 -387362
6665 -182794 81316 -166828 113604 45170 57573 102805 -193814 -129510 36385 -79579 -351996
6654 -351996 239040 -154870 206437 -20659 -53054 -295095 -204252 -279668 143360 56483 11425
6642 -73457 20464 246796 -115782 -19264 -62246 94760 -93133 -24246 -54801 105468 -105090
6630 -35126 -12252 -72190 251754 268124 -154576 -299262 -256659 -22658 -79208 -211437 -163788
6619 -163788 -186238 251170 -52057 -83854 104395 -353885 -101641 249684 -73718 -549008
6609 -549008 20275 -219278 23124 63178 495070 -132383 543528 -35724 61037 -101095 -109093
6598 -109093 101417 45252 -186634 -139846 349220 -155081 -355972 -38639 -138854 124290
6587 63578 2881 -99916 63718 -281716 66269 60989 -219565 179998 326273 -45871 -83006
6576 -83006 85830 444164 -303751 -194923 -129920 59466 138457 -31661 106852 -132629 391623
6564 -182077 191515 -124160 126842 -309918 173949 -115375 150163 67894 -80201 103301
6553 -48875 72318 -485996 245315 26020 -26534 226255 -213141 -63136 -278192 -244441 -487895
6542 -487895 44811 -226035 118862 336182 -84216 -24760 149767 -224071 197270 -383680
6531 -121787 12635 50684 -58621 -152298 70641 -150372 -210192 129901 236738 17020 -146532
6519 164211 -79966 -19361 -258868 -362110 -35152 179055 -123386 -204908 -173087 -259385 4550
6507 -7089 -177083 -131997 -275015 235842 18244 113405 -177063 -85659 -230139 -57788 109628
6495 -132824 -88694 208701 -200577 74899 60677 163239 17843 21209 -89396 -25775 8230
6483 272544 5187 26918 -149998 111147 10293 -216207 82085 -283912 465435 115537 -37868
6471 -348322 33774 99738 254818 21531 -78751 103972 191778 -14256 257615 -157780 136469
6459 53658 -73296 49689 -4625 192726 67279 -137385 105498 -33194 54655 42430 -142327
6447 -112185 -51224 -158687 24448 237978 264245 125351 -241956 112859 76374 -71644 -368745
6436 -368745 -135318 -201476 33905 -14756 -220513 -363427 234488 -116243 -103059 -116919 -118827
6425 -118827 150845 -106345 118349 -120954 287191 138289 -213163 139864 -9317 -196084
6415 -196084 -94517 519662 126315 195398 -110156 -169865 -241485 6471 22374 50495 55242
6404 55242 -174178 -238371 61509 348605 -117617 -103513 322683 -119136 -124064 29351 -109969
6392 154234 120980 -27099 257767 -44568 111256 133845 16243 123759 -207587 152598 -187608
6380 -17456 -385966 -138050 401911 -241823 34389 116664 31932 249423 -26692 -348330 -204506
6369 -204506 -136319 -144302 154242 -364764 -274325 -95028 -3343 -105939 128671 101807 -140112
6357 221791 -237182 126443 167552 -8214 -197744 -36844 -141010 98146 202328 26028 -13708
6345 11315 6002 -170603 -279751 -166652 -148084 157876 -87976 -68262 -113379 -150710 -104469
6334 -104469 -65107 -90871 -12336 -192369 -13365 -38604 95978 -111903 329808 84099 248407
6323 248407 -155524 -246427 -89327 -38184 340044 -59563 -5774 217597 267228 58450 -12170
6311 -238783 980 159816 -139516 136393 -128969 237376 -187907 96015 -74251 -153738 354864
6299 -12620 196259 92686 99133 -85756 236459 -47792 -294504 233326 429837 -385492 147889
6287 -252132 216727 50509 -89035 28006 110655 -25033 32097 -18776 -341871 -147422 115557
6275 -221077 -83346 121042 -28193 -31418 -96344 -331990 99506 13266 -164872 -160315 -75615
6263 150390 -407460 127441 134502 83026 -34443 33404 159096 73088 77764 -20814 197916
6251 -92420 44566 299924 -120445 19426 -92217 35890 -158875 24391 -41546 151697 -166619
6239 363320 64594 -42577 271175 118377 192815 -113017 -38945 -8136 396614 221396 208583
6228 208583 -129901 -305515 116512 163806 -195158 37645 -213531 -126103 12819 303688
6218 303688 -143231 300290 -302609 -23636 -129406 -14351 8549 -144821 264400 -5717 93760
6206 -185496 -36556 6225 -19581 -71377 15747 129008 -121803 -270531 165358 -50423 32248
6194 -192762 82399 72845 -82336 82323 -43635 165904 -60888 118325 -69378 -41622 -14523
6182 176371 155871 21712 68827 227731 136041 -100128 73297 148339 255805 -47815 107819
6170 -279322 -192465 -249990 17019 -196155 -88879 -90396 -375931 -212610 -149241 -37194 298111
6158 192476 76458 -198107 -341979 -168436 104393 102332 -173381 1469 -153225 -70965 -93578
6147 -93578 -32849 -237988 -190909 -92638 -74106 76395 277642 68479 -169663 -236233 -233429
6136 -233429 -90302 165981 -69105 -51897 -103686 -204527 -165517 -85511 -12155 131970 90852
6125 90852 370938 288732 24800 254916 -149525 247409 -1523 -50687 -168485 218767 154285
6114 154285 -230159 47631 -34740 -238176 24727 223484 -173909 -42025 -25045 61054 -83966
6102 -19560 -203738 106000 121865 -16367 -344831 -297060 273892 -150660 -189724 -306529 345607
6090 -230125 187573 80851 8010 -254529 -115873 -167655 74057 236343 105296 41609 -45468
6078 66698 32048 165395 -155944 358579 35166 486242 -112467 -49464 124104 71460 148960
6067 148960 32477 12876 -179477 -119736 56630 -214112 232755 -114179 202272 229247 260975
6056 260975 182176 177593 -373349 -135362 -59732 181802 104596 -99229 -78946 -263194 62083
6044 -62921 -359084 125595 155562 -436241 -5838 220646 234590 96320 4120 76216 190587
6033 190587 -152173 -54910 121548 -136448 -53028 -268829 55295 -328813 93912 -41026 -60963
6022 -60963 -39797 -259022 -348184 5258 -29265 -23322 -22496 -218716 139150 47257 -64425 -181069
6010 -181069 -57359 118423 134810 -165332 -251082 -208063 101996 -187149 -90362 13658 68745
5999 68745 46324 171196 15687 200739 244661 -139876 -21407 -271146 278663 114048 156834
5988 156834 -118096 103753 -10108 -10269 52689 -179455 45902 -228897 -111990 -11766 -116670
5977 -116670 -48867 43437 68032 25259 -191782 440885 -211306 -69999 -67121 36482 -302337
5965 -201808 133210 71865 -105477 238953 32276 163798 -249681 -144267 -153183 11688 297106
5954 297106 544 38674 -324639 68615 37675 -110402 61513 -280146 -192771 -392888 -87082
5942 -109959 -56305 74059 -29525 15536 -315361 -302335 -110112 50460 34696 -105695 -111248
5931 -111248 -112466 -42231 20073 -43231 240667 9729 14352 -75739 103703 354170 -147331
5919 58154 191577 128503 -419285 -148038 151500 -75324 65757 346594 38013 209530 255511
5908 255511 59893 -1818 -62329 -155262 112528 -27190 219585 196524 -142161 -132460 -279325
5897 -279325 -92986 184385 10095 109714 -3465 -126295 84911 -53135 -157526 157738 43101
5885 -3342 -207257 47805 -64385 65568 -182252 62062 234565 -28110 -71880 -208091 118587
5873 87612 -51075 -211163 111778 43493 -78755 402207 -204366 -153200 -43896 100451 -206245
5861 81085 -128685 -13091 -332798 -11539 -203425 -1434 133373 115164 48942 -143642 119640
5849 533856 210509 57972 -200000 58220 -11687 -166564 92460 -233388 -271249 57719 -117295
5837 177237 95405 -36108 341822 188569 32196 110026 30964 114801 13459 -251471 -195216
5826 -195216 -118639 -265004 -103390 298912 -305640 -107070 258523 256549 -409097 100653
5815 212822 -43893 -269799 5235 64573 -268624 -128701 190024 184355 179928 91401 60298
5804 60298 176273 151424 -543160 188949 134951 184485 -21909 -127060 -43734 312103 -6803
5792 -230330 -116217 19218 -97733 46593 105969 -108538 296732 -300740 84971 -30492 70441
5780 -32781 119077 115402 -57750 -30545 216371 -83324 259454 12362 75977 -276604 59476
5768 -7327 425289 -162310 236774 -315217 -109413 18824 -300393 -163466 -346336 -69662
5757 -80245 161454 221760 -322552 82163 194131 -16188 -96494 241529 -169037 51003 172347
5746 172347 155527 68427 -26657 -192238 97546 -366228 73856 -90110 -123649 -31512 115248
5734 -182983 -241636 -168107 334030 299803 -45988 -36609 -345123 134110 70333 184024 188942
5723 188942 112808 -101843 279182 96776 -451650 -225000 100564 295391 -200710 -97622
5712 -69356 -214775 -49202 66116 -175949 44225 -191832 255212 55807 214275 333427 -105422
5700 -114520 -256121 114447 -133551 -10089 132461 -51949 109567 253741 157610 200383
5690 200383 -203570 259620 20333 -60852 -274332 213697 135331 130389 -135222 186011 248235
5679 248235 -235250 68079 -234175 78483 -135403 23055 -88996 65438 223248 22480 75505
5668 75505 -136979 -185967 162090 80444 -15849 -207445 -394144 -37708 88894 -380738 -76652
5656 89976 308936 159716 82447 121562 -143802 -8305 114719 152524 -32518 -30068 244805
5644 203573 -4374 279425 56251 -211094 280996 -164839 237677 -373723 139270 -46616
5633 -111837 -14408 -255520 -315157 -189809 250377 -71463 235038 -138397 78653 -160682
5622 -30081 17587 72496 178555 143497 -138802 -22393 -84794 113204 -83083 -40027 -104996
5611 -104996 47303 217885 68326 234614 248907 -441311 -159629 88291 -106885 -97568 174328
5599 137574 150130 -76197 -294634 379980 -164542 31710 154954 -183973 3420 -106306 51981
5587 124853 -81172 -35333 68462 -12358 187608 -33192 -5642 -27599 -55415 277796 89005
5575 -55506 -84491 -102706 48856 -174651 293052 -201532 290325 -87523 -43040 197145 -132215
5563 272213 -42198 229458 61444 52276 89901 -149812 -81274 85515 -264534 -17672 255415
5551 -370713 100375 12796 358865 50726 99932 -116347 -353944 -175189 -183113 202911 -204878
5539 -194841 255 220272 -187740 224706 1435 265970 -1551 -138828 -344744 170509 -407150
5527 -85272 37162 -98410 -121793 32713 67442 -265374 144834 82295 20345 -32005 268522
5515 -179523 78892 111326 -160633 272020 -93106 14837 -235440 248866 -179523 -58994 193996
5503 11060 80953 147099 -98285 35018 -270922 63071 -17647 63739 332234 159625 117606
5492 117606 149625 -58198 -79948 31815 28991 -187183 -198795 -64716 32785 21426 -84463 -210165
5480 -210165 28236 71502 -22724 -331399 -220930 201187 -5785 10563 20012 148303 217260
5469 217260 -168338 76275 -24720 -110771 -450464 249115 -111687 284122 111890 102928 -42399
5457 -98804 91997 -262470 -243359 -2965 184280 -45692 -145777 38413 124245 339067 -222977
5445 -199713 -97910 -438850 136345 -87779 -283460 133717 100397 189487 -97398 -411114 -60338
5433 27032 207116 -59508 -86377 -115246 -81470 -21197 242461 15414 -116896 85666 18538
5421 61466 -167608 54594 64013 66692 -171173 238404 454675 600309 -127812 -36697 -153041
5410 -153041 27997 219761 -92779 -27415 129927 124213 -235310 -217529 35532 161798 -35767
5398 39146 53076 222883 -236981 92989 53633 -299731 198665 206102 45783 -118458 -103195
5387 -103195 -83225 22321 34710 -189632 26184 142206 -78969 92057 60100 4003 167938
5376 167938 -69991 -11421 222328 -16459 -61227 -179332 51189 -142134 196802 162715 62260
5364 241606 -94729 -248451 37797 233276 -42957 181886 -113484 25979 -135787 105896
5353 -68300 49760 -372129 6518 86131 -150890 -137230 7355 187020 118596 -182 -87732 331033
5340 80303 6178 62486 18221 -51889 141967 -91837 -82980 67971 102215 293570 84862 179660
5328 179660 185858 -310672 212882 340501 8583 2396 387527 -825 -246759 -164807 215227
5316 97794 249329 -16950 194818 131513 -126472 -11867 123072 229975 12622 34504 -9230
5304 -4053 129594 -66756 -13971 -68121 47406 142514 109956 -177923 -95603 -345261 -277051
5293 -277051 -25398 12372 182039 24282 98752 -108744 289179 226515 -249819 52362 -54790
5281 -100543 190004 -37184 118237 -176276 145338 -264028 -106280 163732 65037 7825
5270 45880 -68011 -175889 -408503 125670 -20367 -33596 50825 8378 10923 219160 -229154
5258 -119722 -65279 -126322 49659 146472 219869 171167 -222744 27818 -179728 277305 -173154
5246 -98497 69857 -149625 -77896 90205 14362 59167 211619 195565 405560 -95120 -94666 -129156
5234 -129156 -3995 -26410 111616 -41479 -132169 95083 17397 197108 -110969 155713 -130329
5222 -18236 -64188 21263 -48105 466670 -179456 27957 -75145 40172 3820 -97777 -93148 -132562
5210 -132562 279496 -68985 243912 62625 -105737 -72036 136807 -193510 78846 59330 74780
5199 74780 147688 -80072 48852 41352 -109327 -39941 79904 30223 -11397 -743 114546 -64356
5186 -370142 -44016 -134587 -160977 -19517 -3733 -83080 -83323 -142094 21800 -244158 -70838 -206355
5174 -206355 -199933 -34990 -287619 1582 -40788 -67127 143648 262505 8564 -368340 257815
5162 171431 33257 61127 47964 8855 -398 145769 85718 108958 -345651 -118604 24536 -297896
5149 -167568 -147250 -451204 -14378 219691 25241 153243 -48794 264928 157720 322203
5139 322203 447605 7218 41789 55898 108286 127892 -61727 90394 53608 347163 -265573
5127 204426 -177604 107255 -77366 -43075 231293 -143796 77669 -115792 -140027 123002
5116 342780 192029 -21268 88641 40126 94365 -115533 -187733 -144292 -185525 -185831 -102649 -39795
5103 -121833 -23262 -22895 -95625 -41369 -152649 140929 29720 -120817 107668 -19711 122741
5091 -101276 90184 -110491 -313248 -178871 -46316 19579 -144161 232929 -201034 6608 -57577
5079 36932 21058 -101315 -4217 -188959 -232839 108010 -14740 4027 234160 90628 -93543
5067 174900 -122475 -262800 -221760 -222195 93018 -187365 -183457 294421 2867 145583 -210466
5055 -144619 -156208 -36510 85822 116095 338986 36531 -182988 -309801 -22364 -270492 48713
5043 215727 -30583 175849 -226378 -137355 -58023 81465 47426 51128 -116363 -26250 224405
5031 27713 -8909 144868 20283 79580 378182 -28674 335931 115289 33820 15305 -87518
5019 -342524 -415846 -57301 -369219 144617 246863 224083 -207790 -133236 -20701 65383 -6060
5007 137932 -91125 161289 -88671 -60197 157130 -91260 -268440 139306 69737 -36550 271378
4995 -25968 193222 119036 -279832 -88819 126262 262715 -53161 208631 -103200 -225586
4985 -225586 -120826 35776 -3305 53140 5000 -17164 -181742 83615 446154 19460 55640
4974 55640 -142553 -207323 124507 156410 202233 265515 247870 -80616 44798 283509 228080
4963 228080 -24423 -134106 -26690 176709 -252362 -7231 242745 -11174 -106509 47639 95394
4952 95394 -35295 160751 -25930 -32347 154332 211776 -220905 21791 67456 45435 -48166
4940 57592 -228708 -27987 131621 -111813 402530 -54220 -266648 347801 25184 91035 87038
4929 87038 -43834 -26473 -45549 30679 192060 -52843 89877 97312 -287028 -69624 -155257 -149426
4917 -149426 -22749 121190 1995 112948 358196 -32300 383827 10818 -218244 -31674 134100
4905 -211280 323221 -22991 127271 131851 254982 -6709 -29729 104073 75311 -193522 124135
4893 486916 -243613 -76635 -177679 -107406 -40279 140604 87469 -51804 -104112 -162808 88943
4881 146258 128659 -48251 142189 146531 93804 71601 -176316 -151314 -51890 -57679 -81547 107236
4868 -76363 16504 -221972 114821 -28505 309708 -171409 -45610 -165780 -202440 -23375 148177
4856 186384 -17763 -20616 89050 23441 -49100 33628 44586 101106 -248279 114856 16339
4844 -181666 -11733 20742 60757 -153260 120158 81372 -20576 -60552 -425817 -118766 -17777
4832 -150846 73129 -27639 175953 119188 -159394 206795 112868 -198763 -90153 -8542 -221360
4821 -221360 38772 -231980 328193 39898 -299653 15532 241575 29191 166944 -141627
4810 88577 105627 15448 -99600 -130767 352550 -28448 296284 263244 200979 138019 -19921
4798 86675 -206273 -67612 70546 4062 281129 -66672 436859 -27196 241407 -83053 286920
4786 17612 -128952 143297 -94737 -169129 155565 -387087 -110249 -243954 -11086 190034
4775 -134606 138713 305401 69241 187154 -308855 -39015 331441 -265328 273083 -161360
4764 -49329 -85195 63178 283393 -274198 -119832 -107453 26693 213110 -46939 -4667 -41537
4753 -41537 63505 43085 321130 203723 152598 -78749 174532 133001 -78504 -98949 -180349
4742 -180349 -32673 138104 -3695 59177 -114910 -256278 -33002 93044 -138524 521793 241947
4730 -337426 -112150 -41482 249573 22370 315283 296875 -15869 -40659 -70861 -40191 -211663
4719 -211663 -126246 162746 -66530 -22058 70112 -63284 -185308 -48576 20973 131503 -35289
4707 141358 25840 -6120 -165445 -150989 240816 -209094 30242 -2917 -87241 -224724 22691
4695 -133189 206828 98363 293954 -78766 -65436 66029 121835 -31616 196508 -40042 135703
4683 195894 123637 173839 116231 27218 -35500 -245877 105831 92749 181207 -75852 37263
4671 117324 418630 -97801 -50844 -48240 206863 15031 34606 390360 -105749 -112453 -90108
4660 -90108 -148500 -102487 345267 299763 -92474 55246 138695 -1942 -277718 85795 121402 19731
4647 -29365 62005 212592 15313 121616 -106860 -148710 301395 17450 -128340 322756 -51780
4635 26704 102899 250839 -334991 170916 46567 -8777 -146848 -53564 -119960 165093 100293
4624 100293 218583 -16974 119538 -81116 -212261 -15301 -93813 123186 -76341 31613 154466
4613 154466 -5008 -89056 -126481 -258700 -118624 -331286 -211532 -154425 -27619 190340 -146938
4601 389218 76462 40043 21598 121252 91267 -171962 -301889 249913 -49891 -231020 185632
4589 149996 45369 -202107 -91124 -113238 -115307 -153023 70694 -203365 244848 286204 216720
4578 216720 171450 -41519 117864 29113 -99672 -28376 31020 -192320 15543 35931 85878
4567 85878 17167 -154351 22838 -127054 70337 -69391 9413 -37518 -163365 255329 -179056
4555 -216540 -156142 410497 -282455 124083 219329 23264 -176609 196221 92526 101109 233377
4544 233377 384473 -97999 223789 304989 189656 -137895 -34974 32984 40683 -352291 31127
4532 -120620 324465 205942 -269725 107284 14957 -79675 -38966 13125 -104254 -235825
4522 -235825 104867 97448 137017 60759 79477 -129874 -13156 -240743 -240289 -118748 200679
4510 260231 59798 -141484 30861 -74600 196432 71483 416902 -27401 73386 -6958 530492
4498 130490 80361 80376 -147504 129672 -32791 3461 -37915 -131136 248393 -64651 241781 -178810
$$ [...]
##END NTUPLES=NMR SPECTRUM
##END=
