
##TITLE=UV1010_M1-1003-1002_6268756_ErISKLIoeB
##JCAMPDX= 6.0         $$ Bruker NMR JCAMP-DX V2.0
##DATA TYPE= NMR SPECTRUM
##DATA CLASS= NTUPLES
##ORIGIN= BRUKER
##OWNER= Administrator
$$ 1.72 TOPSPIN		Version 2.1
$$ 2012-06-02 07:55:07.796 -0500  Administrator@TOPSPIN
$$ Compression mode = diff/dup
##.OBSERVE FREQUENCY= 400.13188235
##.OBSERVE NUCLEUS= ^1H
##.ACQUISITION MODE= SIMULTANEOUS (DQD)
##.ACQUISITION SCHEME= undefined
##.AVERAGES= 64
##.DIGITISER RES= 22
##SPECTROMETER/DATA SYSTEM= spect
##.PULSE SEQUENCE= noesygpps1d.comp
##.SOLVENT NAME= COFFEE_calctemp
##.SHIFT REFERENCE= INTERNAL, COFFEE_calctemp, 1, 14.96696
##AUDIT TRAIL= $$ (NUMBER, WHEN, WHO, WHERE, PROCESS, VERSION, WHAT)
$$ ##TITLE= Audit trail, TOPSPIN		Version 2.1
$$ ##JCAMPDX= 5.01
$$ ##ORIGIN= Bruker BioSpin GmbH
$$ ##OWNER= Administrator
$$ $$ C:\Bruker\TOPSPIN/data/COFFEE/nmr/UV1010_M1-1003-1002_6268756_ErISKLIoeB/12/pdata/1/auditp.txt
$$ ##AUDIT TRAIL=  $$ (NUMBER, WHEN, WHO, WHERE, PROCESS, VERSION, WHAT)
(   1,<2012-06-02 07:55:02.796 -0500>,<Administrator>,<TOPSPIN>,<go>,<TOPSPIN 2.1>,
      <created by zg
	started at 2012-06-02 07:43:32.546 -0500,
	POWCHK enabled, PULCHK disabled,
       configuration hash MD5:
       D5 CA 7A 23 FE 6B EE E2 50 67 74 61 24 F7 5E 3B
       data hash MD5: 64K
       79 A0 DB B9 98 0D 9B 23 77 E4 CD 16 B8 0A 1A B0>)
(   2,<2012-06-02 07:55:05.484 -0500>,<Administrator>,<TOPSPIN>,<proc1d>,<TOPSPIN 2.1>,
      <Start of raw data processing
       efp LB = 0.3 FT_mod = 6 PKNL = 1 PHC0 = 0 PHC1 = 0 SI = 128K 
       data hash MD5: 128K
       6C C6 C2 DF 4A C8 71 EE 68 E9 1B 2A 18 1F E0 C6>)
(   3,<2012-06-02 07:55:06.765 -0500>,<Administrator>,<TOPSPIN>,<proc1d>,<TOPSPIN 2.1>,
      <pk PHC0 = 27.8009 PHC1 = 0 
       data hash MD5: 128K
       27 FB 31 73 39 A9 40 29 76 17 A5 A6 89 17 92 8B>)
(   4,<2012-06-02 07:55:07.453 -0500>,<Administrator>,<TOPSPIN>,<proc1d>,<TOPSPIN 2.1>,
      <abs ABSG = 1 
       data hash MD5: 128K
       17 89 02 E7 A2 55 96 36 38 7C 97 85 E9 C9 AE 1D>)
(   5,<2012-06-02 07:55:07.531 -0500>,<Administrator>,<TOPSPIN>,<proc1d>,<TOPSPIN 2.1>,
      <abs ABSG = 2 
       data hash MD5: 128K
       27 05 D2 43 89 98 91 14 FC 11 C8 E0 61 51 AB 87>)
(   6,<2012-06-02 07:55:07.593 -0500>,<Administrator>,<TOPSPIN>,<proc1d>,<TOPSPIN 2.1>,
      <abs ABSG = 3 
       data hash MD5: 128K
       6C D3 F7 AC 65 6E 31 BC D8 A4 74 C4 64 1E 88 3D>)
(   7,<2012-06-02 07:55:07.656 -0500>,<Administrator>,<TOPSPIN>,<proc1d>,<TOPSPIN 2.1>,
      <abs ABSG = 4 
       data hash MD5: 128K
       01 C8 AE 7A 09 71 63 47 54 78 7A 2B 65 8F 26 78>)
(   8,<2012-06-02 07:55:07.718 -0500>,<Administrator>,<TOPSPIN>,<proc1d>,<TOPSPIN 2.1>,
      <abs ABSG = 5 
       data hash MD5: 128K
       26 1D 61 3F A4 D7 70 6B DE F4 9F F9 4A 26 3E 04>)
$$ ##END=
$$ 
$$ $$ hash MD5
$$ $$ 35 14 FB FF 91 8A B1 04 76 AC AA 71 67 3B DE 7B
##$RELAX= 
##$RELAX= 
##$RELAX= 
##$RELAX= 
##$RELAX= 
##$RELAX= 
##$RELAX= 
##$RELAX= 
$$ [...]
##$TP07= 0
##$TPNAME0= <>
##$TPNAME1= <>
##$TPNAME2= <>
##$TPNAME3= <>
##$TPNAME4= <>
##$TPNAME5= <>
##$TPNAME6= <>
##$TPNAME7= <>
##$TPOAL= (0..7)
0.5 0.5 0.5 0.5 0.5 0.5 0.5 0.5
##$TPOFFS= (0..7)
0 0 0 0 0 0 0 0
##$TUNHIN= 0
##$TUNHOUT= 0
##$TUNXOUT= 0
##$USERA1= <user>
##$USERA2= <user>
##$USERA3= <user>
##$USERA4= <user>
##$USERA5= <user>
##$V9= 5
##$VALIST= <valist>
##$VCLIST= <CCCCCCCCCCCCCCC>
##$VD= 0
##$VDLIST= <DDDDDDDDDDDDDDD>
##$VPLIST= <PPPPPPPPPPPPPPP>
##$VTLIST= <TTTTTTTTTTTTTTT>
##$WBST= 2048
##$WBSW= 25
##$XGAIN= (0..3)
0 0 0 0
##$XL= 0
##$YL= 0
##$YMAX_a= 11502667
##$YMIN_a= -6645026
##$ZGOPTNS= <>
##$ZL1= 120
##$ZL2= 120
##$ZL3= 120
##$ZL4= 120
##$ABSF1= 14.96696
##$ABSF2= -5.58557
##$ABSG= 5
##$ABSL= 3
##$ALPHA= 0
##$AQORDER= 0
##$ASSFAC= 0
##$ASSFACI= 0
##$ASSFACX= 0
##$ASSWID= 0
##$AUNMP= <proc_prof1d_extract.lims>
##$AXLEFT= 0
##$AXNAME= <>
##$AXNUC= <1H>
##$AXRIGHT= 0
##$AXTYPE= 0
##$AXUNIT= <>
##$AZFE= 0.1
##$AZFW= 0.1
##$BCFW= 0
##$BC_mod= 0
##$BYTORDP= 0
##$COROFFS= 0
##$CY= 15
##$DATMOD= 1
##$DC= 0
##$DFILT= <>
##$DTYPP= 0
##$F1P= 0
##$F2P= 0
##$FCOR= 0.5
##$FTSIZE= 131072
##$FT_mod= 6
##$GAMMA= 0
##$GB= 0
##$INTBC= 1
##$INTSCL= 1
##$ISEN= 128
##$LB= 0.3
##$LEV0= 0
##$LPBIN= 0
##$MAXI= 10000
##$MC2= 0
##$MEAN= 0
##$ME_mod= 0
##$MI= 0
##$NCOEF= 0
##$NC_proc= -3
##$NLEV= 6
##$NOISF1= 0
##$NOISF2= 0
##$NSP= 0
##$NTH_PI= 0
##$NZP= 0
##$OFFSET= 14.96696
##$PC= 1
##$PHC0= 27.8009
##$PHC1= 0
##$PH_mod= 1
##$PKNL= yes
##$PPARMOD= 0
##$PPDIAG= 0
##$PPIPTYP= 0
##$PPMPNUM= 2147483647
##$PPRESOL= 1
##$PSCAL= 4
##$PSIGN= 0
##$PYNMP= <proc.py>
##$REVERSE= no
##$SF= 400.130005462082
##$SI= 131072
##$SIGF1= 0
##$SIGF2= 0
##$SINO= 400
##$SIOLD= 131072
##$SPECTYP= <>
##$SREGLST= <1H.CDCl3>
##$SSB= 0
##$STSI= 131072
##$STSR= 0
##$SW_p= 8223.68421052632
##$SYMM= 0
##$S_DEV= 0
##$TDeff= 65536
##$TDoff= 0
##$TI= <>
##$TILT= no
##$TM1= 0
##$TM2= 0
##$TOPLEV= 0
##$USERP1= <user>
##$USERP2= <user>
##$USERP3= <user>
##$USERP4= <user>
##$USERP5= <user>
##$WDW= 1
##$XDIM= 131072
##$YMAX_p= 449352691
##$YMIN_p= -217005529
##$CURPLOT= <Network HP LaserJet P1505>
##$CURPRIN= <$Network HP LaserJet P1505>
##$DFORMAT= <normdp>
##$LAYOUT= <+/1D_H.xwp>
##$LFORMAT= <normlp>
##$PFORMAT= <normpl>
##$SURQMSG= 1
$$ End of Bruker specific parameters
$$ ---------------------------------
##NTUPLES= NMR SPECTRUM
##VAR_NAME=  FREQUENCY,     SPECTRUM/REAL,   SPECTRUM/IMAG
##SYMBOL=    X,             R,               I
##VAR_TYPE=  INDEPENDENT,   DEPENDENT,       DEPENDENT
##VAR_FORM=  AFFN,          ASDF,            ASDF
##VAR_DIM=   131072,        131072,          131072
##UNITS=     HZ,            ARBITRARY UNITS, ARBITRARY UNITS
##FACTOR=    0.0627417313425165, 1,          1
##FIRST=     8223.62146879498, -6674,        -110396
##LAST=      0,             -5906,           -112021
##MIN=       0,             -217005529,      0
##MAX=       8223.62146879498, 449352691,    0
$$ Real data points
##PAGE= N=1
##DATA TABLE= (X++(R..R)), XYDATA
$$ [...]
61215A110925l252k005j206n22P04K279L237L254L140L706M876O324Q162J0296
61201A149918J1692J1211Q982O297M290L325L413M247M898M378K955K089K686
61188A220381L880M014K422r0k036k300j005L00K4j448j922l20J584J529M3l40
61172A224716J156K674K945L343N547Q753J0867J1475J1871J2614J2826J2050
61160A320837J1138J0853J0776J0307R677R265Q725P630O413N699N207M258L209
61147A423994L270M789O607P505P567P727Q625J0338J2597J4644J5387J4572J3453
61134A551075J3408J3924J2921R287M339L64j638k390l097m376o067p628q728
61121A571394r619j0701j1761j2183j2020j2143j2887j3319j2521j1082j0541
$$ y = [1110925, 1107673, 1105668, 1104462, 1103940, 1104644, 1106923, 1110160, 1113414, 1116554, 1120260, 1125136, 1131460, 1139622, 1149918, 1161610, 1172821, 1181803, 1188100, 1192390, 1195715, 1199128, 1203375, 1208273, 1212651, 1215606, 1217695, 1220381, 1224261, 1228275, 1230697, 1230607, 1228571, 1226271, 1225266, 1225566, 1225590, 1224142, 1222220, 1221900, 1223484, 1225013, 1225056, 1224716, 1225872, 1228546, 1231491, 1234834, 1240381, 1249134, 1260001, 1271476, 1283347, 1295961, 1308787, 1320837, 1331975, 1342828, 1353604, 1363911, 1373588, 1382853, 1391578, 1399208, 1405621, 1411320, 1416527, 1420785, 1423994, 1427264, 1432053, 1438660, 1446165, 1453732, 1461459, 1470084, 1480422, 1493019, 1507663, 1523050, 1537622, 1551075, 1564483, 1578407, 1591328, 1600615, 1604954, 1605318, 1603680, 1601290, 1598193, 1593817, 1587750, 1580122, 1571394, 1561775, 1551074, 1539313, 1527130, 1515110, 1502967, 1490080, 1476761, 1464240, 1453158, 1442617]
61110A442617j1557j3335j4521j4209j2509j0781j0754j2499j3714j2192q684
61099A307862o042n593n704m319j510J192K939L981M535M298L121J559N29N18
61085A307366J096J324R15P98K207N275Q937J1985J3723J3975J3269J2944J4211
61072A408025J7015K0371K3619K6501K8501K9365L0232L2748L6807M0491M2748
61061A736423M4669M7490N0582N2499N3071N3444N4540N6160N7270N6856N4997
61050B318001N3114N2290N1534M9014M4858M0850L7137L1739K4250J7427J3203
61039B733417R339K570o507j4449j9842k4294k9009l3163l6003l8276m0789m3167
61027B459827m4505m4298m2638m0564l9678m0203m0123l7842l4787l3332l2990
$$ y = [1442617, 1431060, 1417725, 1403204, 1388995, 1376486, 1365705, 1354951, 1342452, 1328738, 1316546, 1307862, 1301820, 1296227, 1290523, 1286204, 1284694, 1285886, 1288825, 1292806, 1297341, 1301639, 1304760, 1306319, 1306848, 1307366, 1308462, 1309786, 1310701, 1311499, 1313706, 1318981, 1327918, 1339903, 1353626, 1367601, 1380870, 1393814, 1408025, 1425040, 1445411, 1469030, 1495531, 1524032, 1553397, 1583629, 1616377, 1653184, 1693675, 1736423, 1781092, 1828582, 1879164, 1931663, 1984734, 2038178, 2092718, 2148878, 2206148, 2263004, 2318001, 2371115, 2423405, 2474939, 2523953, 2568811, 2609661, 2646798, 2678537, 2702787, 2720214, 2733417, 2742756, 2745326, 2738819, 2724370, 2704528, 2680234, 2651225, 2618062, 2582059, 2543783, 2502994, 2459827, 2415322, 2371024, 2328386, 2287822, 2248144, 2207941, 2167818, 2129976, 2095189, 2061857, 2028867]
61016B028867l1323k8183k5923k5271k4188k1616j9238j8234j7164j4845j2722
61005A790160j2260j2165j0490p773n603l593l37L571O163P272Q677J1218J3946
60992A788786J6210J8603K1385K3756K5332K7023K9851L3729L7889M1774M5233
60981B109571M8408N1621N5036N8511O2104O6246P0872P5079P8575Q2833Q9618
60970B848474R8655J07970J16413J24528J33007J41718J50846J61764J75895J93236
60960D252506K12803K34437K59688K90633L27734L68979M11509M54290M99106
60951G311685N49350O08602O79924P65124Q64407R78157J109173J261274J435860
60942A5563556J632575J851813K087172K308246K458171K483815K374032K160372
$$ y = [2028867, 1997544, 1969361, 1943438, 1918167, 1893979, 1872363, 1853125, 1834891, 1817727, 1802882, 1790160, 1777900, 1765735, 1755245, 1747472, 1741869, 1738276, 1737939, 1741510, 1747673, 1754945, 1763622, 1774840, 1788786, 1804996, 1823599, 1844984, 1868740, 1894072, 1921095, 1950946, 1984675, 2022564, 2064338, 2109571, 2157979, 2209600, 2264636, 2323147, 2385251, 2451497, 2522369, 2597448, 2676023, 2758856, 2848474, 2947129, 3055099, 3171512, 3296040, 3429047, 3570765, 3721611, 3883375, 4059270, 4252506, 4465309, 4699746, 4959434, 5250067, 5577801, 5946780, 6358289, 6812579, 7311685, 7861035, 8469637, 9149561, 9914685, 10779092, 11757249, 12866422, 14127696, 15563556, 17196131, 19047944, 21135116, 23443362, 25901533, 28385348, 30759380, 32919752]
60934C2919752J877283J535166J145532P61770M66805L04826K34620J63801K5646
60925C9435201j88239m62761p98968j201095j634638k020595k281677k390003
60917B8457225k369536k263841k109891j934349j757402j591288j438469j295900
60909A3696549j160867j032629r11668q00003p01056o17399n49150m94858m52352
60900F976567m17991l87018l56430l26490k98473k72366k47947k26509k09328
60891D234015j95339j82238j69448j58293j49510j42217j35368j28707j22200
60882B850695j15642j09028j02452r5671q8643q2195p7239p3549p0233o6996o3892
60871A905155o0300n5597n0546m6549m3624m0721l7917l6427l6061l4661l0940
$$ y = [32919752, 34797035, 36332201, 37477733, 38239503, 38706308, 39011134, 39245754, 39409555, 39435201, 39246962, 38784201, 37985233, 36784138, 35149500, 33128905, 30847228, 28457225, 26087689, 23823848, 21713957, 19779608, 18022206, 16430918, 14992449, 13696549, 12535682, 11503053, 10591385, 9791382, 9090326, 8472927, 7923777, 7428919, 6976567, 6558576, 6171558, 5815128, 5488638, 5190165, 4917799, 4669852, 4443343, 4234015, 4038676, 3856438, 3686990, 3528697, 3379187, 3236970, 3101602, 2972895, 2850695, 2735053, 2626025, 2523573, 2427902, 2339259, 2257064, 2179825, 2106276, 2036043, 1969047, 1905155, 1844855, 1789258, 1738712, 1692163, 1648539, 1607818, 1569901, 1533474, 1497413, 1462752, 1431812]
60860A431812k6404k3439k2737k3413k4301k4205k2227j9161j7381j7965j8902
60849A191677j7690j4751j2482j1645j0777r047p560p402q128q878r584j0325
60837A063408j0671j0494j0503j1090j1460j0704r070p263n254k844j042j537
60825I71476m555q127r955r529q058o731n668m549l635l489l769l158j050J279
60811I00482K124J654J689L081M596M923M535M634N139N008L995K802J720M29
60797I46811q85j441j183j022j323j227j48R84Q66l67j496k077l025n196q135
60782I21136j0562j1780j2190j2491j2646j1932j0091q095p315p961q885q966
60770G98222q125o868n545m511m331n100n909n697m508l333k928l381m527n948
$$ y = [1431812, 1405408, 1381969, 1359232, 1335819, 1311518, 1287313, 1265086, 1245925, 1228544, 1210579, 1191677, 1173987, 1159236, 1146754, 1135109, 1124332, 1115285, 1107725, 1100323, 1092195, 1083317, 1073733, 1063408, 1052737, 1042243, 1031740, 1020650, 1009190, 998486, 989416, 982153, 976899, 974055, 973013, 971476, 966921, 958794, 948839, 939310, 931252, 924521, 918853, 914304, 910669, 907180, 903411, 900253, 899203, 900482, 902606, 904260, 905949, 909030, 913626, 918549, 923084, 927718, 932857, 937865, 941860, 944662, 946382, 946811, 945926, 944485, 943302, 942280, 940957, 939730, 939582, 940566, 941432, 941065, 939569, 937492, 934467, 929271, 921136, 910574, 898794, 886604, 874113, 861467, 849535, 839444, 831349, 824034, 816073, 807188, 798222, 790097, 783229, 777684, 773173, 768842, 763742, 757833, 752136, 747628, 744295, 741367, 737986, 733459, 727511]
60756G27511o616n599l440k049k642m341n268m615l117j802r35j20J051K548L840
60741F94406M317L912L182K614K065J229M52M94J447K377K314J174n21k460m491
60726G12511n927n724l767j501o06j140j660j334j140k355m401n244l913j663
60712F72136k37R8J93L97L36n3l86q21k003l662m255k793l22J331J757J906K130
60695F65752J709N12j61P36K326K838J912Q96J013K114L325M038L917K687N78
60680F94192j394k147j594p05m83r75j283o11O96J373P79r5K50J796K903K405
60664F95107J013J78L12Q37J349J888K338K383K017J345L4k110m164m636l316
60649F94575j688j131j520k068k701l768m908n246m633l866l602l562l100k099
$$ y = [727511, 720895, 715296, 711856, 709807, 707165, 702824, 697556, 692941, 689824, 688022, 687087, 686967, 688018, 690566, 694406, 698723, 702635, 705817, 708431, 710496, 711725, 712177, 712671, 714118, 716495, 718809, 719983, 719462, 717002, 712511, 706584, 700860, 697093, 695592, 694986, 693846, 692186, 690852, 689712, 687357, 682956, 677712, 673799, 672136, 671899, 671997, 672190, 672587, 672923, 672870, 672484, 671663, 669660, 665998, 661743, 658950, 658628, 659959, 661716, 663622, 665752, 667461, 667973, 667812, 668548, 670874, 673712, 675624, 676520, 677533, 679647, 682972, 687010, 690927, 693614, 694192, 692798, 690651, 689057, 688352, 687869, 686894, 685611, 685000, 685696, 687069, 687848, 687753, 688003, 689799, 692702, 695107, 696120, 696298, 696610, 697447, 698796, 700684, 703022, 705405, 707422, 708767, 708801, 706691, 702527, 697891, 694575, 692887, 691756, 690236, 688168, 685467, 681699, 676791, 671545, 666912, 663046, 659444, 655882, 652782, 650683]
60635F50683j141q67j347j958j927j143l16k46r42j564j131O76L174N015N302
60620F52268M611M495N627O907O874N549M108L113K099Q41r1l81n40q79p92J43
60604F93952R93M32j502l435m240l776k305k58J374J526M28k89O38K797M948O386
60588F97669O909O230M309J908j23j868l831n714o616o375n583m373k361j06Q53
60573F80928O4r06n90L50M75m1Q7Q32Q22k46r22k48Q87J339J287J283R97J67k50
60554F86315O25J850J865J031J159K598L605L106K285K405K641J541k79p66N72
60539G10553J909J699O51N07J792L585M838N160M617L629L016L346M127M166K983
60524G56578J372L72K74R95K667N085O954O887N246L989M429O029P787R596J1432
$$ y = [650683, 649542, 648675, 647328, 645370, 643443, 642300, 641984, 641738, 640796, 639232, 638101, 638777, 641951, 646966, 652268, 656879, 661374, 667001, 673908, 680782, 686331, 690439, 693552, 695651, 696492, 696401, 696020, 695480, 694601, 693809, 693952, 694945, 695377, 693875, 690440, 686200, 682424, 680119, 679861, 681235, 682761, 683189, 682900, 683538, 686335, 691283, 697669, 704578, 710808, 715117, 717025, 716902, 715034, 711203, 705489, 698873, 692498, 686915, 682542, 680181, 680075, 680928, 680992, 680086, 679496, 679846, 680321, 680280, 680367, 681199, 682021, 681775, 680853, 680605, 681492, 682831, 684118, 685401, 686398, 686565, 686315, 686940, 688790, 690655, 691686, 692845, 695443, 699048, 702154, 704439, 706844, 709485, 711026, 710747, 709981, 710553, 712462, 714161, 714812, 715319, 717111, 720696, 725534, 730694, 735311, 738940, 741956, 745302, 749429, 753595, 756578, 757950, 758322, 758596, 759591, 762258, 767343, 774297, 781184, 786430, 790419, 794848, 800877, 808664, 818260, 829692]
60509H29692J2291J1474J0278J0797J3082J5021J5211J4311J3131J1088P689M103
60497I68168J805O07m62j037l2J991L046K678K913N487R366J2192J3291J4085
60483A034098J5904J8447K0495K1468K1983K3227K5906K9688L3496L6127L6577
60472A317416L4259K9662K4584K0776J8041J4427Q679J834m058q118j0929j3228
60460A433345j5119j6376j6762j6090j4433j2132r322n811j933J082K426L182
60448A332057N473J0068J5610K0433K4379K8447L3299L8640M3818M8552N2952
60437A653728N6884N9465N9637N7536N4695N2244M9377M4776L9261L5457L4340
60426B197400L3477K9690K2535J4088O088j408q986j7018k5935l6134m7127n7437
$$ y = [829692, 841983, 853457, 863735, 874532, 887614, 902635, 917846, 932157, 945288, 956376, 964065, 968168, 969973, 970580, 970118, 969081, 969049, 971040, 974086, 976764, 979677, 985164, 994530, 1006722, 1020013, 1034098, 1050002, 1068449, 1088944, 1110412, 1132395, 1155622, 1181528, 1211216, 1244712, 1280839, 1317416, 1351675, 1381337, 1405921, 1426697, 1444738, 1459165, 1467844, 1469678, 1465620, 1457502, 1446573, 1433345, 1418226, 1401850, 1385088, 1368998, 1354565, 1342433, 1333111, 1327300, 1325367, 1326449, 1328875, 1332057, 1337530, 1347598, 1363208, 1383641, 1408020, 1436467, 1469766, 1508406, 1552224, 1600776, 1653728, 1710612, 1770077, 1829714, 1887250, 1941945, 1994189, 2043566, 2088342, 2127603, 2163060, 2197400, 2230877, 2260567, 2283102, 2297190, 2303278, 2301870, 2292884, 2275866, 2249931, 2213797, 2166670, 2109233]
60414B109233o5723p1493p4781p5779p4941p2622o8594o2744n6400n1742m9359
60403A385055m7440m4151l9809l5798l2396k9127k6439k5195k4674k2913j9419
60392A037694j5892j3799j2698j1722j1179j1514j1883j1222r930r163q974q518
60380I01200p639o873o122m752k945j764j770k704m319o178o820m900j461P02
60366H43655M90l25j07L19l75j456j375m01l7m72o01k26k09m42M13K516M020L501
60348H48888J976J381J971K464K253K179K956L927L977L217K902L675M636M683
60334H91085M115M032M470M351L421K905L730N254O496P494Q459Q655P459N777
60320I67703M998N113N184N090N338N677N562N555O484P420O485L860J987K317
$$ y = [2109233, 2043510, 1972017, 1897236, 1821457, 1746516, 1673894, 1605300, 1542556, 1486156, 1434414, 1385055, 1337615, 1293464, 1253655, 1217857, 1185461, 1156334, 1129895, 1104700, 1080026, 1057113, 1037694, 1021802, 1008003, 995305, 983583, 972404, 960890, 949007, 937785, 927855, 918692, 909718, 901200, 893561, 886688, 880566, 875814, 872869, 871105, 869335, 866631, 862312, 856134, 849314, 844414, 842953, 843655, 844145, 843820, 843713, 844032, 843657, 842201, 840826, 840425, 840388, 839916, 839315, 839089, 838880, 838438, 838851, 841367, 845387, 848888, 850864, 852245, 854216, 856680, 858933, 861112, 864068, 867995, 871972, 875189, 878091, 881766, 886402, 891085, 895200, 899232, 903702, 908053, 911474, 914379, 918109, 923363, 929859, 937353, 945812, 954467, 961926, 967703, 972701, 977814, 982998, 988088, 993426, 999103, 1004665, 1010220, 1016704, 1024124, 1030609, 1034469, 1036456, 1038773]
60306A038773L654M362M418M444M323L924L980N070O741Q430J0347J2558J4238
60293A125262J4630J3931J2564J0516Q076O037M419K157j036l795n134o046p723
60280A173858r375r476q306p538p719p853p344o872p079p473p025n432l669l275
60266A075422m594n831m942k562j328j872j454K025O727R446R823R698R733R466
60252A109757R777J2132J5475J6753J4987J2389J0974J0394R765R278Q948P743
60240A248372N096J795j470n044q985j2415j5005j7412j9352j9120j6404j3834
60228A126222j3910j5580j5782j3619j1033r735r353q905q457q615r226r414q721
60215I83872p733p363p619p458o201m664m161m656m854m119l163k544j653J05
$$ y = [1038773, 1042427, 1046789, 1051207, 1055651, 1059974, 1063898, 1067878, 1072948, 1079689, 1088119, 1098466, 1111024, 1125262, 1139892, 1153823, 1166387, 1176903, 1184979, 1191016, 1195435, 1197592, 1196556, 1192761, 1187627, 1181581, 1173858, 1164483, 1155007, 1146701, 1139163, 1131444, 1123591, 1116247, 1109375, 1102296, 1094823, 1087798, 1082366, 1078697, 1075422, 1070828, 1064997, 1060055, 1057493, 1056165, 1054293, 1052839, 1054864, 1061591, 1071037, 1080860, 1090558, 1100291, 1109757, 1119534, 1131666, 1147141, 1163894, 1178881, 1191270, 1202244, 1212638, 1222403, 1231681, 1240629, 1248372, 1253468, 1255263, 1253793, 1248749, 1239764, 1227349, 1212344, 1194932, 1175580, 1156460, 1140056, 1126222, 1112312, 1096732, 1080950, 1067331, 1056298, 1046563, 1037210, 1028305, 1019848, 1011233, 1002007, 992593, 983872, 976139, 968776, 961157, 953699, 947498, 942834, 938673, 934017, 929163, 925044, 921881, 919337, 917684, 917789]
60201I17789J928K243M78k220l846l083m36K163L285L250L016K502J252Q3L08
60186I28712J478J730N91l84j69M80R31J764K991L216J845M33L82J045J537K730
60170I49312N416Q053Q640P802P701Q597Q819P757O581O086N987O487Q485J1651
60156A057374J4024J4206J2856J1611J1492J2612J4295J5277J4720J3286J2333
60145A204086J2175J1928J0958R381P308M893L099L081M531N755N640M551L058
60132A290444J005j727m509o524p434p216o035m499l460l357m087n314o362o300
60118A224625m986l645l406l630k864j116J43Q6p53j811l081m247m715m782n402
60103A180416o553p105o589n721m891l574j627K17J592K786L438K650Q81l4M12
$$ y = [917789, 919717, 921960, 922438, 920218, 916372, 913289, 912853, 915016, 918301, 921551, 924567, 927069, 928321, 928404, 928712, 930190, 931920, 932511, 932127, 931958, 932438, 933369, 935133, 938124, 941340, 943185, 943618, 944000, 945045, 946582, 949312, 954728, 962781, 971421, 979223, 986924, 995521, 1004340, 1012097, 1018678, 1024764, 1030751, 1037238, 1045723, 1057374, 1071398, 1085604, 1098460, 1110071, 1121563, 1134175, 1148470, 1163747, 1178467, 1191753, 1204086, 1216261, 1228189, 1239147, 1248528, 1255836, 1260729, 1263828, 1266909, 1271440, 1277195, 1282835, 1287386, 1290444, 1291449, 1289722, 1285213, 1278689, 1271255, 1264039, 1258004, 1253505, 1250045, 1246688, 1242601, 1237287, 1230925, 1224625, 1219639, 1215994, 1212588, 1208958, 1206094, 1204978, 1205121, 1205207, 1204454, 1202643, 1199562, 1195315, 1190600, 1185818, 1180416, 1173863, 1166758, 1160169, 1154448, 1149557, 1145983, 1144356, 1144573, 1146165, 1148951, 1152389, 1155039, 1155920, 1155886, 1156298]
60088A156298N32o33j431j01K425M007M335M588N022M923M447M587N451O094O102
60073A206646O033O306O705O905O585N314L320K024K650M543N919O092N810N696
60059A280548N643N747O522P908R059R440R342R185R007Q696Q059O819N221M314
60045A385510M637N025L971K071J489K815M080L546J957R38M80n60k153k987k638
60030A408181k603m520q082j1324j2791j2903j2995j3357j2969j1317r721r969
60018A285630j2015j4004j4638j4376j4050j3481j2281j1030j0638j0943j1017
60007A147157j0572j0037r277p482m743k813l372n914q074q097o435m918m791
59994A060632n747o442n625l048K71K708L261K353J317J115J705K529L294M139
$$ y = [1156298, 1156830, 1156197, 1154766, 1154665, 1157090, 1161097, 1165432, 1170020, 1175042, 1179965, 1184412, 1188999, 1194450, 1200544, 1206646, 1212679, 1218985, 1225690, 1232595, 1239180, 1244494, 1247814, 1249838, 1252488, 1257031, 1262950, 1269042, 1274852, 1280548, 1286191, 1291938, 1298460, 1306368, 1315427, 1324867, 1334209, 1343394, 1352401, 1361097, 1369156, 1375975, 1381196, 1385510, 1390147, 1395172, 1399143, 1401214, 1402703, 1405518, 1409598, 1413144, 1415101, 1416039, 1416519, 1415959, 1413806, 1410819, 1408181, 1405578, 1401058, 1392976, 1381652, 1368861, 1355958, 1342963, 1329606, 1316637, 1305320, 1295599, 1285630, 1273615, 1259611, 1244973, 1230597, 1216547, 1203066, 1190785, 1179755, 1169117, 1158174, 1147157, 1136585, 1126548, 1117271, 1109789, 1105046, 1102233, 1098861, 1092947, 1084873, 1076776, 1070341, 1065423, 1060632, 1054885, 1048443, 1042818, 1039770, 1040041, 1042749, 1046010, 1048363, 1049680, 1050795, 1052500, 1055029, 1058323, 1062462]
59980A062462N231O259O417N011K355k41j694k233k700l148k872j894j375k190
59966A069388l969n980q055r921j0590r543p955p451p950p938o844n753n596n809
59952I66034n500m836m554m664m506l813l030k625k581k573k352j932j489j168
59938I20411r94q72n60K99J733K896K692J334N99J726L645M417L915L687M262
59923I49190M415L463K592K841L326K751J620J234J247J08k210l761l344k173
59909I61299k043k930l433k917k090j586r84K97J734K027P78p43r77O4R56Q44
59893I50296M55P50J467J769J792K414L657M297L315J084j059j863p84J704M133
59878I73427N043M358L400L296L898M527N171O373Q183R743R905Q170N185K418
$$ y = [1062462, 1067693, 1073952, 1080369, 1085380, 1087735, 1087494, 1085800, 1083567, 1080867, 1077719, 1074847, 1072953, 1071578, 1069388, 1065419, 1059439, 1051384, 1041463, 1030873, 1021330, 1013375, 1005924, 997974, 990036, 983192, 977439, 971843, 966034, 960534, 955698, 951144, 946480, 941974, 938161, 935131, 932506, 929925, 927352, 925000, 923068, 921579, 920411, 919417, 918545, 917985, 918284, 920017, 922913, 925605, 926939, 927538, 929264, 932909, 937326, 941241, 944928, 949190, 953605, 957068, 959660, 962501, 965827, 968578, 970198, 971432, 972679, 972787, 970577, 966816, 963472, 961299, 959256, 956326, 952893, 949976, 947886, 946300, 945316, 945613, 947347, 949374, 950152, 949409, 948432, 948496, 949452, 950296, 950751, 951501, 952968, 954737, 956529, 958943, 962600, 966897, 970212, 971296, 970237, 968374, 967590, 969294, 973427, 978470, 982828, 986228, 989524, 993422, 997949, 1003120, 1009493, 1017676, 1027419, 1037324, 1045494, 1050679, 1053097]
59864A053097J002P82Q01P08J041J970K651K419J978K542M153N738O579O839O680
59849A098980N781M016J976M45k05l2M98M63q35k744l548k416n51K70j31m44J77
59832A101700J281K232L117M089M618M197L389L451M921P072Q703R130Q555P940
59818A174395Q338R735J0527Q953N249J710K33N29J210J807K654L424L137J733
59804A233634M03Q9N93J461K653L815M018L099K413L201M807N724N901O681Q566
59789A287058J0430J1240J1329J1378J1077R531O629L435J405J413L090M997N765
59776A378777N184L786J684j284m315n919n970o304q200j0236r998p458n222n374
59762A319151p236q600q236o576m595k824j380m37k42o50j020r80j164k540m818
$$ y = [1053097, 1054099, 1054881, 1055682, 1056390, 1057431, 1059401, 1062052, 1064471, 1066449, 1068991, 1073144, 1078882, 1085461, 1092300, 1098980, 1104761, 1108777, 1110753, 1111198, 1110993, 1110961, 1111459, 1111922, 1111087, 1108343, 1104795, 1102379, 1101828, 1102098, 1101967, 1101523, 1101700, 1102981, 1105213, 1108330, 1112419, 1117037, 1121234, 1124623, 1128074, 1132995, 1140067, 1148770, 1157900, 1166455, 1174395, 1182733, 1192468, 1202995, 1211948, 1217197, 1218907, 1219140, 1219669, 1220879, 1222686, 1225340, 1228764, 1231901, 1233634, 1234037, 1234126, 1234719, 1236180, 1238833, 1242648, 1246666, 1249765, 1252178, 1255379, 1260186, 1265910, 1271811, 1278492, 1287058, 1297488, 1308728, 1320057, 1331435, 1342512, 1352043, 1358672, 1362107, 1363512, 1364925, 1368015, 1373012, 1378777, 1383961, 1387747, 1389431, 1388147, 1383832, 1377913, 1371943, 1365639, 1357439, 1347203, 1337205, 1329747, 1324525, 1319151, 1311915, 1303315, 1295079, 1288503, 1283908, 1281084, 1279704, 1279267, 1279025, 1278375, 1277355, 1276375, 1275211, 1272671, 1267853]
59747A267853o320n959m626l940m070l826k530q89O8J7p46j687k239k284k420
59732A226402l060l441k521q81m37j835l375l393k693l386n846q088q186o284
59718A172976m031k830k951l738m168l470j672N08K416M049N706P188P731O937
59704A184651N572N054O027P727R005R593J0107J0984J2050J3053J4065J5037
59692A302925J5388J4403J2158R887R168J0378J1908J1454Q524N189L810M425
59680A419617N196N008M524M599M953M838M162L300K423J532P03p8r01j543j645
59665A456688j476j741k447k752k310j843j920k170k220k289k090m20K973O282
59651A442265P829Q397R765J1725J2559J2072J1932J2883J3771J3887J4318J6019
$$ y = [1267853, 1261533, 1255574, 1250948, 1247008, 1242938, 1239112, 1236582, 1235693, 1235761, 1235778, 1235032, 1233345, 1231106, 1228822, 1226402, 1223342, 1219901, 1217380, 1216499, 1216062, 1214227, 1210852, 1207459, 1204766, 1201380, 1195534, 1187446, 1179260, 1172976, 1168945, 1166115, 1163164, 1159426, 1155258, 1151788, 1150116, 1150624, 1153040, 1157089, 1162795, 1169983, 1177714, 1184651, 1190223, 1195277, 1201304, 1209031, 1218036, 1227629, 1237736, 1248720, 1260770, 1273823, 1287888, 1302925, 1318313, 1332716, 1344874, 1354761, 1363929, 1374307, 1386215, 1397669, 1406193, 1411382, 1415192, 1419617, 1424813, 1429821, 1434345, 1438944, 1443897, 1448735, 1452897, 1456197, 1458620, 1460152, 1460855, 1460777, 1459876, 1458333, 1456688, 1455212, 1453471, 1451024, 1448272, 1445962, 1444119, 1442199, 1440029, 1437809, 1435520, 1433430, 1433010, 1435983, 1442265, 1450094, 1458491, 1468256, 1479981, 1492540, 1504612, 1516544, 1529427, 1543198, 1557085, 1571403, 1587422]
59639A587422J8159J9451J9762J9345J7789J5068J2572J1495J0932R140O301M384
59627A751820M188M013J867k004n482p072p374q104r956j1756j1972j0786r949
59614A677433j0510j1513j1559j0748j0218j0202r701p865m868j521J155K159
59602A592042J393M04J212M068P152Q730Q801Q267P472O211M530K687N93k024
59588A651538n058q076j0831j3367j5701j7668j8960j9279j8778j8295j8641j9448
59576A467436j9421j8072j6458j5685j5472j5048j4744j5459j6901j7669j7236
59565A285271j6677j7046j7942j8206j7291j5506j3522j2095j1745j2104j2013
59554A121124j0689q532o430m851l877l616l966m432m667m760m549l257o41K089
$$ y = [1587422, 1605581, 1625032, 1644794, 1664139, 1681928, 1696996, 1709568, 1721063, 1731995, 1741135, 1747436, 1751820, 1756008, 1760021, 1761888, 1759884, 1754402, 1747330, 1739956, 1731852, 1721896, 1710140, 1698168, 1687382, 1677433, 1666923, 1655410, 1643851, 1633103, 1622885, 1612683, 1602982, 1595117, 1590249, 1588728, 1589883, 1592042, 1593435, 1593839, 1595051, 1599119, 1606271, 1615001, 1623802, 1632069, 1639541, 1645752, 1650282, 1652969, 1653562, 1651538, 1646480, 1638404, 1627573, 1614206, 1598505, 1580837, 1561877, 1542598, 1523820, 1505525, 1486884, 1467436, 1448015, 1429943, 1413485, 1397800, 1382328, 1367280, 1352536, 1337077, 1320176, 1302507, 1285271, 1268594, 1251548, 1233606, 1215400, 1198109, 1182603, 1169081, 1156986, 1145241, 1133137, 1121124, 1110435, 1101903, 1095473, 1090622, 1086745, 1083129, 1079163, 1074731, 1070064, 1065304, 1060755, 1057498, 1056857, 1058946]
59540A058946L418L254K583J778M58j016j357r9J574K326K199J973J836J400N23
59525A079796o09j902l163l938m056m041m282m256l361k188k000k936l711l308
59511A036045k126j159p37o07o59q97j069r14o70p60j095j179r80j100j850k543
59495A017700k157n72J270K538L496M974O984Q383Q259P399P720J0170J3695J6559
59481A106418J8244J9451K0562K0947J9873J7189J2897O981M41m310n341l381
59469A229971j130k91k91r7K7o69j804k219j609p92n17q69j807l427n478p242
59453A201756q250q711r056r411r702r862r690q753o770m107j856j168k207l677
59439A108536l894k517q11R2N10J198J897J929J713K356L824M874M978N053N865
$$ y = [1058946, 1062364, 1065618, 1068201, 1069979, 1070437, 1069421, 1068064, 1067965, 1069539, 1071865, 1074064, 1076037, 1077873, 1079273, 1079796, 1079187, 1077285, 1074122, 1070184, 1066128, 1062087, 1057805, 1053549, 1050188, 1048000, 1046000, 1043064, 1039353, 1036045, 1033919, 1032760, 1032023, 1031416, 1030757, 1029860, 1028791, 1027877, 1027207, 1026447, 1025352, 1024173, 1023193, 1022093, 1020243, 1017700, 1015543, 1014971, 1016241, 1018779, 1022275, 1027249, 1034233, 1042616, 1050875, 1058274, 1065994, 1076164, 1089859, 1106418, 1124662, 1144113, 1164675, 1185622, 1205495, 1222684, 1235581, 1242562, 1243003, 1238693, 1233352, 1229971, 1228841, 1228550, 1228259, 1228162, 1228189, 1227520, 1225716, 1223497, 1221888, 1221096, 1220579, 1219710, 1217903, 1214476, 1208998, 1201756, 1193506, 1184795, 1175739, 1166328, 1156626, 1146764, 1137074, 1128321, 1121551, 1117444, 1115588, 1114420, 1112213, 1108536, 1104642, 1102125, 1101314, 1101406, 1101916, 1103114, 1105011, 1106940, 1108653, 1111009, 1114833, 1119707, 1124685, 1129738, 1135603]
59424A135603O934P528P774Q005P906P127O120N558N372N001M175K936J377j48
59410A211268j022j107j001j221j631k026k396k176k86L124N949O316M945M180
59396A222916N237P483R853J1513J1521R400O241M006L564M254N089N254L798
59383A310129O50k143k198j98M37j780m117l349j05K378K642K032K056K909M479
59368A313822O793R063J0120J0300J1343J3776J5962J6684J7274J9687K3594K6931
59356A495349K8779L0071L1646L3180L3990L3393L0103K3040J3418M613r49l642
59344A752991m691l971j248J824L057K504J719M16l804j1778k0773k7206k9992
59331A659048l0239k8980k6517k3216j9632j6217j3590j2420j2273j1397q722
$$ y = [1135603, 1142537, 1150065, 1157839, 1165844, 1173750, 1180877, 1186997, 1192555, 1197927, 1202928, 1207103, 1210039, 1211416, 1211268, 1210246, 1209139, 1208138, 1206917, 1205286, 1203260, 1200864, 1198688, 1198402, 1201526, 1207475, 1213791, 1218736, 1222916, 1228153, 1235636, 1245489, 1257002, 1268523, 1277923, 1284164, 1288170, 1291734, 1295988, 1301077, 1306331, 1310129, 1310779, 1308636, 1306438, 1306240, 1306677, 1304897, 1300780, 1297431, 1297326, 1299704, 1302346, 1304378, 1306434, 1309343, 1313822, 1320615, 1329678, 1339798, 1350098, 1361441, 1375217, 1391179, 1407863, 1425137, 1444824, 1468418, 1495349, 1524128, 1554199, 1585845, 1619025, 1653015, 1686408, 1716511, 1739551, 1752969, 1757582, 1756633, 1752991, 1748300, 1744329, 1743081, 1744905, 1747962, 1750466, 1752185, 1752601, 1748797, 1737019, 1716246, 1689040, 1659048, 1628809, 1599829, 1573312, 1550096, 1530464, 1514247, 1500657, 1488237, 1475964, 1464567, 1455845]
59320A455845n426l341k484j513k00K49n19r52M73L188N247N516M589L813M003
59305A468488N117O771Q697J0574J1808J2030J1809J2164J3191J3885J3635J3103
59293A601272J3155J3701J4303J5211J6821J8590J9473J9117J7881J6032J3753
59282A779309J1556R766P844N189K280P9j604m070q006j2528j6120j7973j8440
59269A737282j8598j9176j9690j9231j8332j8914k1523k3894k3638k1388j9617
59258A513281j9136j8713j7643j6483j5433j4150j3295j4045j5619j5448j2576
59247A340740q957o482m618k048J073L876O388Q954J1106J2240J2468J1695Q953
59234A395388L937j733o034q680j0532j1686j1511j0035p924n472k727l80P85
$$ y = [1455845, 1450419, 1447078, 1444594, 1443081, 1442881, 1443130, 1442611, 1441659, 1442132, 1445320, 1450567, 1456083, 1460672, 1464485, 1468488, 1473605, 1480376, 1489073, 1499647, 1511455, 1523485, 1535294, 1547458, 1560649, 1574534, 1588169, 1601272, 1614427, 1628128, 1642431, 1657642, 1674463, 1693053, 1712526, 1731643, 1749524, 1765556, 1779309, 1790865, 1800631, 1808475, 1813664, 1815944, 1816023, 1814419, 1810349, 1802343, 1789815, 1773695, 1755722, 1737282, 1718684, 1699508, 1679818, 1660587, 1642255, 1623341, 1601818, 1577924, 1554286, 1532898, 1513281, 1494145, 1475432, 1457789, 1441306, 1425873, 1411723, 1398428, 1384383, 1368764, 1353316, 1340740, 1331783, 1325301, 1320683, 1318635, 1319708, 1323584, 1329972, 1338926, 1350032, 1362272, 1374740, 1386435, 1395388, 1399325, 1397592, 1391558, 1382878, 1372346, 1360660, 1349149, 1339114, 1331190, 1325718, 1322991, 1322611, 1323396]
59221A323396J197K235M554P500J0155J2310J4282J6284J8027J8871J8554J7795
59209A465160J7559J7625J6836J5198J4587J6337J8856J8910J5092R178M078J193
59197A630609k39j814m057n842n971n177n632q155j0997j2052j1407j0759j1006
59184A537501j1541j1561j1102j0798j1231j2412j3586j3842j3123j2081j0854
59173A405370q924o560n226n734o948p319o806o327o081n723n564o299p779r076
59159A311004r518q879p055m481k333j312o98L46J178O20r05j653r07K62P38P19
59143A277126J036J882K655K614J686P97J079K353L034K054K10j053j424j458
59129A292591j383j277j686k815l678l326k400k221k844l381l666m106m377l960
$$ y = [1323396, 1324593, 1326828, 1331382, 1338882, 1349037, 1361347, 1375629, 1391913, 1409940, 1428811, 1447365, 1465160, 1482719, 1500344, 1517180, 1532378, 1546965, 1563302, 1582158, 1601068, 1616160, 1625338, 1629416, 1630609, 1630370, 1628556, 1624499, 1618657, 1612686, 1607509, 1601877, 1593722, 1582725, 1570673, 1559266, 1548507, 1537501, 1525960, 1514399, 1503297, 1492499, 1481268, 1468856, 1455270, 1441428, 1428305, 1416224, 1405370, 1396446, 1389886, 1384660, 1378926, 1371978, 1364659, 1357853, 1351526, 1345445, 1339722, 1334158, 1327859, 1320080, 1311004, 1301486, 1292607, 1285552, 1281071, 1278738, 1277426, 1276728, 1277074, 1278252, 1278872, 1277967, 1276314, 1275407, 1275669, 1276407, 1277126, 1278162, 1280044, 1282699, 1285313, 1286999, 1287796, 1288875, 1291228, 1294262, 1296316, 1296526, 1295473, 1294049, 1292591, 1291208, 1289931, 1288245, 1285430, 1281752, 1278426, 1276026, 1273805, 1270961, 1267580, 1263914, 1259808, 1255431, 1251471]
59115A251471l576m368n806o281n695n521o089n952m438k905k581k871k831k814
59101A189743l389l906l495k773l188n038p091q036p696o888o495o597o430n464
59087A113257m351m255n396o808p413o748n104l709m254o916r271q636n357k215
59073A032824p34J5Q27R38R5r3J695M521O834Q722J0980J3035J3740J3558J4117
59058A121074J5626J6403J5249J3086J1747J1862J2513J2526J1699J0708R988
59047A262481R087P445N459M029L229K298J002o5p49j761l327m501m587m276m577
59032A271187n352n824n797n490m765l547k552k565l266l650l526l761n079p086
59018A208927q561q406o562m352l531m571o171o778o189n253m591m206m027m117
$$ y = [1251471, 1247895, 1243527, 1237721, 1231440, 1225745, 1220224, 1214135, 1208183, 1203745, 1200840, 1198259, 1195388, 1192557, 1189743, 1186354, 1182448, 1178953, 1176180, 1172992, 1167954, 1160863, 1152827, 1145131, 1138243, 1131748, 1125151, 1118721, 1113257, 1108906, 1104651, 1099255, 1092447, 1085034, 1078286, 1073182, 1069473, 1065219, 1058303, 1049032, 1040396, 1035039, 1032824, 1032090, 1032105, 1032932, 1033870, 1033965, 1033872, 1035567, 1040088, 1046922, 1055644, 1066624, 1079659, 1093399, 1106957, 1121074, 1136700, 1153103, 1168352, 1181438, 1193185, 1205047, 1217560, 1230086, 1241785, 1252493, 1262481, 1271568, 1279013, 1284472, 1288501, 1291730, 1294028, 1295030, 1294965, 1294216, 1292455, 1289128, 1284627, 1280040, 1275764, 1271187, 1265835, 1260011, 1254214, 1248724, 1243959, 1240412, 1237860, 1235295, 1232029, 1228379, 1224853, 1221092, 1216013, 1208927, 1200366, 1191960, 1185398, 1181046, 1177515, 1172944, 1166773, 1159995, 1153806, 1148553, 1143962, 1139756, 1135729, 1131612]
59004A131612m402m584m382l763l183l428m677n814n559m309l732m273m410l092
58990A072004j471j045j263o10P53J222L83l79q0N57N57J54J17M52N48J19n66
58973A071452j064r28K47K436N035P333R078J0410J1415J2019J2262J2452J2830
58960A164977J3175J2931J1871J0425R104P765N886L505J400J81l93r85j855k646
58946A235341k757j915n61N01J133K277M526O602O396L774J183Q45K350L779M231
58931A267705M169L862L015J912J647K731M204M733M258M036N130P219R178J0631
58917A334430J2463J5433J8743K0608K0224J8496J6775J5626J5056J5098J5584
58906A518536J5793J4923J2879J0241P628N218K798J61k459m630o648r557j3516
$$ y = [1131612, 1127210, 1122626, 1118244, 1114481, 1111298, 1107870, 1103193, 1097379, 1091820, 1087511, 1083779, 1079506, 1075096, 1072004, 1070533, 1069488, 1068225, 1067615, 1068368, 1069590, 1069973, 1069594, 1069514, 1070071, 1070628, 1070782, 1070899, 1071351, 1071899, 1072018, 1071452, 1070388, 1069460, 1069707, 1072143, 1077178, 1084511, 1093589, 1103999, 1115414, 1127433, 1139695, 1152147, 1164977, 1178152, 1191083, 1202954, 1213379, 1222483, 1230248, 1236134, 1239639, 1241039, 1241220, 1240827, 1239842, 1237987, 1235341, 1232584, 1230669, 1230108, 1230609, 1231742, 1234019, 1238545, 1245147, 1251543, 1255317, 1256500, 1257345, 1259695, 1263474, 1267705, 1271874, 1275736, 1278751, 1280663, 1282310, 1285041, 1289245, 1293978, 1298236, 1302272, 1307402, 1314621, 1323799, 1334430, 1346893, 1362326, 1381069, 1401677, 1421901, 1440397, 1457172, 1472798, 1487854, 1502952, 1518536, 1534329, 1549252, 1562131, 1572372, 1580000, 1585218, 1588016, 1588177, 1585718, 1581088, 1574440, 1564883, 1551367]
58893A551367j6802j7762j7436j8453k1142k2605k0610j6731j4223j3968j4158
58882A357477j3250j1521r853q465p145n777m305k741j324l34J68J99k85j136
58868A291708j972k572k802k080J03K723L502J576j050j880r24q7k05k81N84K096
58852A288439L761N545P191Q047Q264R197J1751J4897J6704J6691J6387J7344
58840A424218J9115J9828J8683J7163J7238J8905K0364K0425J9564J8616J7621
58829A631740J6597J6285J7243J8740J9475J8945J7601J6095J4909J4096J2920
58818A814646J0409O872M043L041K981K334Q12j094l363n965p776p613o093n257
58804A807977o267q560j1050j3092j4448j5333j6562j8597k0544k1067k0302j9815
$$ y = [1551367, 1534565, 1516803, 1499367, 1480914, 1459772, 1437167, 1416557, 1399826, 1385603, 1371635, 1357477, 1344227, 1332706, 1322853, 1314388, 1307243, 1301466, 1297161, 1294420, 1293096, 1292762, 1292930, 1293129, 1292844, 1291708, 1289736, 1287164, 1284362, 1282282, 1282385, 1285108, 1288610, 1290186, 1289136, 1287256, 1286332, 1286245, 1286040, 1285759, 1286343, 1288439, 1292200, 1297745, 1304936, 1312983, 1321247, 1330444, 1342195, 1357092, 1373796, 1390487, 1406874, 1424218, 1443333, 1463161, 1481844, 1499007, 1516245, 1535150, 1555514, 1575939, 1595503, 1614119, 1631740, 1648337, 1664622, 1681865, 1700605, 1720080, 1739025, 1756626, 1772721, 1787630, 1801726, 1814646, 1825055, 1831927, 1835970, 1839011, 1841992, 1844326, 1845138, 1844044, 1840681, 1834716, 1826940, 1819327, 1813234, 1807977, 1801710, 1793150, 1782100, 1769008, 1754560, 1739227, 1722665, 1704068, 1683524, 1662457, 1642155, 1622340]
58792A622340k0533k1642k1860k1016k0018j9684j9935j9894j8785j6845j5141
58781A406987j4355j4255j4441j4876j5215j4585j2808j1044j0263r808q479o359
58769A260499m400k849j347j80k3n94q13k23P29J623K336K684K764L255M292M524
58753A272277K617o50l158m036m072l930l640l732m999o887p795p408p139p808
58739A209640q471q267p818p837p632o233m181k968l065l470k936j041J769M593
58725A152083O501O991O343N608O070Q115J0407J0915R160O789N419M711L472
58712A242584J599k96k397n270q355j0362j0958j0785j0253r711j0215j2269j4126
58699A139186j3378j0350p841p304p226n819l379j234k4J95m37j083o53O61J527
$$ y = [1622340, 1601807, 1580165, 1558305, 1537289, 1517271, 1497587, 1477652, 1457758, 1438973, 1422128, 1406987, 1392632, 1378377, 1363936, 1349060, 1333845, 1319260, 1306452, 1295408, 1285145, 1275337, 1266858, 1260499, 1256099, 1253250, 1251903, 1251723, 1251700, 1251106, 1250293, 1250070, 1250799, 1252422, 1254758, 1257442, 1260206, 1263461, 1267753, 1272277, 1274894, 1274244, 1271086, 1267050, 1262978, 1259048, 1255408, 1251676, 1246677, 1239790, 1231995, 1224587, 1217448, 1209640, 1201169, 1192902, 1185084, 1177247, 1169615, 1163382, 1159201, 1156233, 1153168, 1149698, 1146762, 1145721, 1147490, 1152083, 1158584, 1165575, 1171918, 1177526, 1183596, 1191711, 1202118, 1213033, 1222193, 1228982, 1234401, 1239112, 1242584, 1244183, 1243887, 1241490, 1236220, 1227865, 1217503, 1206545, 1195760, 1185507, 1175796, 1165581, 1153312, 1139186, 1125808, 1115458, 1107617, 1100313, 1093087, 1087268, 1083889, 1082655, 1082631, 1082826, 1082389, 1081306, 1080653, 1081314, 1082841]
58684A082841J543J746K614L253L232L523M787O261P249Q100Q812Q341O492M925
58670A153719M892N347M784L707L626M602N409N480N252N031M844M922N318N495
58656A222428N188M983N196M997L771K359J718J099q66l949o643q454j0301j2775
58642A208751j5355j7551j9577k1537k2808k2706k1350j9636j8535j8267j8055
58631I93374j6919j4960j3339j2805j2867j2672j1870j0275p700m874l542m508
58619H67043o220o355m493k154n92L65J376K510L429M031M603N440O392O906O814
58604H89095O843P658Q527P924N596K948R95r35l664o413p585o765n162m434n454
58589H89174p591q984q360o820o570p595p263m194p30N2j543k653j945q07p38
$$ y = [1082841, 1084384, 1086130, 1088744, 1091997, 1095229, 1098752, 1103539, 1109800, 1117049, 1125149, 1133961, 1142302, 1148794, 1153719, 1158611, 1163958, 1168742, 1172449, 1176075, 1180677, 1186086, 1191566, 1196818, 1201849, 1206693, 1211615, 1216933, 1222428, 1227616, 1232599, 1237795, 1242792, 1246563, 1248922, 1250640, 1251739, 1250873, 1246924, 1240281, 1231827, 1221526, 1208751, 1193396, 1175845, 1156268, 1134731, 1111923, 1089217, 1067867, 1048231, 1029696, 1011429, 993374, 976455, 961495, 948156, 935351, 922484, 909812, 897942, 887667, 879967, 875093, 871551, 867043, 860823, 854468, 849975, 847821, 847229, 847594, 848970, 851480, 854909, 858940, 863543, 868983, 875375, 882281, 889095, 895938, 903596, 912123, 920047, 925643, 928591, 929586, 928651, 924987, 918574, 910989, 904224, 899062, 894628, 889174, 881583, 872599, 864239, 857419, 850849, 843254, 835991, 831797, 831067, 831119, 829576, 826923, 824978, 824171, 823433]
58574H23433j480k057k162k067k067k308k595k414j690j233j747k677k849j978
58560G94109p93M7M89P91J430K926N054O595O650N868N588O170O957P499P912
58545H57292Q146P825O810N415M155L533L616L597K514Q96P29K911N753P076O975
58530I27243P196Q451R879J0870J1836J3061J4163J4922J5586J6057J5674J4218
58518A079156J2562J1972J3004J5001J6481J6336J5012J4115J4568J5701J6686
58507A240594J7952K0285K3222K5524K6911K8115K9319K9581K8093K5261K2184
58496A517041J9485J6757J3038P957K444k008m706n887n788m664l756m844q248
58483A536821j2463j6245j9703k2771k4326k4114k3942k5375k7418k8065k7056
$$ y = [823433, 821953, 819896, 817734, 815667, 813600, 811292, 808697, 806283, 804593, 803360, 801613, 798936, 796087, 794109, 793316, 793363, 793852, 794643, 796073, 798999, 804053, 810648, 817298, 823166, 828754, 834924, 841881, 849380, 857292, 865438, 873263, 880073, 885488, 889643, 893176, 896792, 900389, 902903, 903799, 904528, 907439, 913192, 920268, 927243, 934439, 942890, 952769, 963639, 975475, 988536, 1002699, 1017621, 1033207, 1049264, 1064938, 1079156, 1091718, 1103690, 1116694, 1131695, 1148176, 1164512, 1179524, 1193639, 1208207, 1223908, 1240594, 1258546, 1278831, 1302053, 1327577, 1354488, 1382603, 1411922, 1441503, 1469596, 1494857, 1517041, 1536526, 1553283, 1566321, 1574278, 1576722, 1574714, 1570008, 1564121, 1558333, 1553669, 1549913, 1545069, 1536821, 1524358, 1508113, 1488410, 1465639, 1441313, 1417199, 1393257, 1367882, 1340464, 1312399, 1285343]
58472A285343k5460k3529k0979j8605j7517j7065j5468j2467r726q620r028j0153
58460A096726j1155j1152r966q741q557q724p800n900m503m115l785k840j701
58447A007787q99o23j184k602l750l231j133J219L026M289M673L717K118J375
58433A014782K026L415N096P188R490J1514J3206J4541J4902J4288J4356J6440
58421A141244J9070J9605J7991J6531J6131J5348J3466J1704J0500Q216L976l59
58409A293423k651l190l374l285k384j493k121m152n644m907j980J752M753O401
58395A271148P337Q506R839J0453J0041R042P342M152l29m340o485p377q559j0434
58381A300336j2060j2420j1318r367p579o610o099n123l458j853q22J94K127N155
$$ y = [1285343, 1259883, 1236354, 1215375, 1196770, 1179253, 1162188, 1146720, 1134253, 1124527, 1115907, 1106879, 1096726, 1085571, 1074419, 1064453, 1055712, 1047155, 1038431, 1030631, 1024731, 1020228, 1016113, 1012328, 1009488, 1007787, 1006888, 1006265, 1005081, 1002479, 998729, 995498, 994365, 995584, 998610, 1002899, 1007572, 1011289, 1013407, 1014782, 1016808, 1020223, 1025319, 1032507, 1041997, 1053511, 1066717, 1081258, 1096160, 1110448, 1124804, 1141244, 1160314, 1179919, 1197910, 1214441, 1230572, 1245920, 1259386, 1271090, 1281590, 1289806, 1293782, 1293423, 1290772, 1287582, 1284208, 1280923, 1278539, 1277046, 1274925, 1270773, 1265129, 1260222, 1258242, 1259994, 1264747, 1271148, 1278485, 1286991, 1296830, 1307283, 1317324, 1326366, 1333708, 1337860, 1337531, 1333191, 1326706, 1319329, 1310770, 1300336, 1288276, 1275856, 1264538, 1255171, 1247592, 1240982, 1234883, 1229760, 1226302, 1224449, 1223627, 1223821, 1225948, 1231103]
58367A231103Q485J0867J1309R776P362N417M375L625K406N32j524l038l757m399
58353A282539n865p832q938q711q182q048p546n936l843j992o9J960K895K345
58339A222777K213M080O435O852N871N993P540Q326P248N621M845N057O061P374
58325A306293P522N722M039N294Q803J1007J0482R402R446R504Q532P841Q776
58312A412663J0303J0666R852R094R185J0313J2291J4213J5099J5316J5933J6588
58300A561516J5832J3839J2558J2642J2457J0869Q887P653O919O465P025Q654
58288A685316R977J0147R963J0265J0773J1276J2230J3558J4597J5703J7961K0909
58276A842675K2745K3260K4056K5259K4786K1942J9048J8055J8115J7974J8171
$$ y = [1231103, 1239588, 1250455, 1261764, 1271540, 1278902, 1284319, 1288694, 1292319, 1294725, 1295257, 1293733, 1290695, 1286938, 1282539, 1276674, 1268842, 1259904, 1251193, 1243011, 1234963, 1227417, 1221481, 1217638, 1215646, 1215577, 1217537, 1220432, 1222777, 1224990, 1229070, 1235505, 1242357, 1248228, 1254221, 1261761, 1270087, 1277335, 1282956, 1287801, 1292858, 1298919, 1306293, 1313815, 1319537, 1323576, 1328870, 1337673, 1348680, 1359162, 1368564, 1378010, 1387514, 1396046, 1403887, 1412663, 1422966, 1433632, 1443484, 1452578, 1461763, 1472076, 1484367, 1498580, 1513679, 1528995, 1544928, 1561516, 1577348, 1591187, 1603745, 1616387, 1628844, 1639713, 1648600, 1656253, 1663172, 1669637, 1676662, 1685316, 1695293, 1705440, 1715403, 1725668, 1736441, 1747717, 1759947, 1773505, 1788102, 1803805, 1821766, 1842675, 1865420, 1888680, 1912736, 1937995, 1962781, 1984723, 2003771, 2021826, 2039941, 2057915, 2076086]
58265B076086J9083J9131J7158J4673J3677J3832J3810J4007J5792J9002K1915
58254B258166K3232K2984K2137K2047K3459K5596K7116K7986K9113L0375L0924
58243B543135L1299L2877L5246L6541L6592L7023L8108L8427L7951L8400M0005
58232B945604M1202M2150M4854M8983N1341N0918N0687N2792N5643N7530N9356
58221C501060O1658O2619O1530O0982O3079O6425O9145P1889P5586P9201Q1955
58210D255129Q4933Q8424R0733R1534R3278R7179J01161J03727J06473J10761
58200E223332J15617J20812J27938J36350J42385J45061J48223J54447J61502
58191F475667J67482J74441J83639J92357J99130K07213K19017K32030K44195
$$ y = [2076086, 2095169, 2114300, 2131458, 2146131, 2159808, 2173640, 2187450, 2201457, 2217249, 2236251, 2258166, 2281398, 2304382, 2326519, 2348566, 2372025, 2397621, 2424737, 2452723, 2481836, 2512211, 2543135, 2574434, 2607311, 2642557, 2679098, 2715690, 2752713, 2790821, 2829248, 2867199, 2905599, 2945604, 2986806, 3028956, 3073810, 3122793, 3174134, 3225052, 3275739, 3328531, 3384174, 3441704, 3501060, 3562718, 3625337, 3686867, 3747849, 3810928, 3877353, 3946498, 4018387, 4093973, 4173174, 4255129, 4340062, 4428486, 4519219, 4610753, 4704031, 4801210, 4902371, 5006098, 5112571, 5223332, 5338949, 5459761, 5587699, 5724049, 5866434, 6011495, 6159718, 6314165, 6475667, 6643149, 6817590, 7001229, 7193586, 7392716, 7599929, 7818946, 8050976, 8295171]
58182H295171K58167K76000K94973L13341L34878L62532L92738M21306M50005
58173A1399111M82009N16043N50524N88211O30927O74987P17687P62846Q14013
58164A7136358Q68276R23232R83787J055078J135257J222585J322673J440386
58156B6087632J571438J710796J862886K035032K228451K445267K696702K994508
58148D3632712L341912L740942M196293M699741N224603N754403O311048O943476
58140H3845130P700326Q623363R742813J1052521J2506616J4070772J5771248
58133A63312789J7685866J9920457K2594953K5726426K8966091L1460593L2154885
58126C41822060L0369741K6078537J9649577J1511750K235150p182016j5423561
$$ y = [8295171, 8553338, 8829338, 9124311, 9437652, 9772530, 10135062, 10527800, 10949106, 11399111, 11881120, 12397163, 12947687, 13535898, 14166825, 14841812, 15559499, 16322345, 17136358, 18004634, 18927866, 19911653, 20966731, 22101988, 23324573, 24647246, 26087632, 27659070, 29369866, 31232752, 33267784, 35496235, 37941502, 40638204, 43632712, 46974624, 50715566, 54911859, 59611600, 64836203, 70590606, 76901654, 83845130, 91545456, 100168819, 109911632, 120964153, 133470769, 147541541, 163312789, 180998655, 200919112, 223514065, 249240491, 278206582, 309667175, 341822060, 372191801, 398270338, 417919915, 429431665, 431666815, 424484799, 409061238]
58119D09061238k1453453k5013761k6537197k6669171k5916291k4613981k3016123
58112B35841261k1316769j9622896j7960737j6320262j4698535j3120939j1634973
58105A21166150j0283954r087882q049571p166929o428269n804374n260162m774036
58097F4310973m339556l954313l616457l326839l083456k875146k688028k515600
58089C7911578k356356k205886k059090j916990j783885j659846j542022j430563
58081B2956940j327260j231089j141028j060503r93073r35919q83083q32809p86567
58072A3765609p43324p00314o57708o17500n79447n42427n07814m77172m48575
58063H491328m19376l90617l64813l41699l19924l00286k83246k66006k46541
$$ y = [409061238, 387607785, 362594024, 336056827, 309387656, 283471365, 258857384, 235841261, 214524492, 194901596, 176940859, 160620597, 145922062, 132801123, 121166150, 110882196, 101794314, 93744743, 86577814, 80149545, 74345171, 69085009, 64310973, 59971417, 56017104, 52400647, 49073808, 45990352, 43115206, 40427178, 37911578, 35555222, 33349336, 31290246, 29373256, 27589371, 25929525, 24387503, 22956940, 21629680, 20398591, 19257563, 18197060, 17203987, 16268068, 15384985, 14552176, 13765609, 13022285, 12321971, 11664263, 11046763, 10467316, 9924889, 9417075, 8939903, 8491328, 8071952, 7681335, 7316522, 6974823, 6654899, 6354613, 6071367, 5805361, 5558820]
58054E558820k27866k13614k01958j88845j75003j64420j57642j51943j46755
58045C930774j43520j40848j35145j26087j16949j09496j02618r5899r0478q6129
58035B783605q1300p6346p3271p1976o9925o5957o1537n7947n4850n1938m9582
58024B068976m7609m5508m3822m3376m3317m1974l9408l7309l6557l6502l6172
58013A617422l4893l2445k9882k8961k9537k9198k6933k4907k4614k3906k0734
58002A311412j7392j7299j9377j9735j7770j6457j7112j8043j8403j9433k1202
57991A109189k1573j9421j6288j3982j2809j2600j3284j4020j3716j2690j2098
57980I46708j1879j1194j0461j0625j0768r136o532n872q035j0694j1766j1586
$$ y = [5558820, 5330954, 5117340, 4915382, 4726537, 4551534, 4387114, 4229472, 4077529, 3930774, 3787254, 3646406, 3511261, 3385174, 3268225, 3158729, 3056111, 2960212, 2869734, 2783605, 2702305, 2625959, 2552688, 2480712, 2410787, 2344830, 2283293, 2225346, 2170496, 2118558, 2068976, 2021367, 1975859, 1932037, 1888661, 1845344, 1803370, 1763962, 1726653, 1690096, 1653594, 1617422, 1582529, 1550084, 1520202, 1491241, 1461704, 1432506, 1405573, 1380666, 1356052, 1332146, 1311412, 1294020, 1276721, 1257344, 1237609, 1219839, 1203382, 1186270, 1168227, 1149824, 1130391, 1109189, 1087616, 1068195, 1051907, 1037925, 1025116, 1012516, 999232, 985212, 971496, 958806, 946708, 934829, 923635, 913174, 902549, 891781, 882645, 876113, 870241, 862206, 851512, 839746, 828160]
57968H28160j1089j0298r453r475j0270j0301q842p108o427o758p599q847j0004
57955G11689r994q606p057o434o506o553o399o114n493m347k919j826j761k801
57941F34879l789l184j212p7j086k828l413l165l337l463k272l73M30L4rP92J433
57924F09360J519J530J061q31l283l966k298l31K00n0L93J711K890K855J218j110
57908F10868k178j014Q86J381M56m22r61j952l060l068k217k037k779l374l804
57893E86725m952o063n173k619j175j893k597j673n14o12q95Q5J471J773J584
57878E63472K435M261N800O485O308M935K619R08P39P88o83l230n134o001o602
57863E77100o842n994m731m899o951r131r671q586o960n530m572m201m060l198
$$ y = [828160, 817071, 806773, 797320, 787845, 777575, 767274, 758432, 751324, 744897, 738139, 730540, 721693, 711689, 701695, 693089, 686032, 679598, 673092, 666539, 660140, 654026, 648533, 644186, 641267, 639441, 637680, 634879, 631090, 627906, 626694, 626617, 625531, 622703, 619290, 616125, 612788, 609325, 607053, 606680, 607110, 607144, 607135, 607927, 609360, 610879, 612409, 613470, 612639, 609356, 605390, 603092, 602761, 602961, 602911, 603304, 605015, 607905, 610760, 611978, 610868, 608690, 607676, 608562, 609943, 610399, 609977, 609016, 607064, 604004, 600936, 598719, 596682, 593903, 590529, 586725, 581773, 575710, 570537, 567918, 566743, 564850, 562253, 560580, 560066, 559454, 558559, 558644, 560115, 561888, 563472, 565907, 570168, 575968, 582453, 588761, 593696, 596315, 597223, 597962, 598750, 598067, 594837, 589703, 583702, 577100, 570258, 564264, 559533, 554634, 547683, 538552, 528881, 520295, 513335, 507805, 503233, 499032, 494972, 491774]
57849D91774j128J129J813N07j124j239j38K30r65k368k710k741l708m959m854
57834D69519l435k347k126j548K1J391J366M14k48j07P23K036L245L508K686J523
57818D76621N50l64j133j190m36M68J186K129L544N015O119O704O539N628M823
57803E16203M939N386N088M479M844N757N382L633K667L456M150L039R93m68j555
57788E67993k927l834l456k773l064l628k971j470q79j625k286j584M00K743M310
57773E44949M296L075K052J871J596M15q83j273j106r64j20K124M469M997L931
57758E69429L187L506L922L770L350K496L90k763n399o409o202n635m983m310
57744E54349l917m110m984o448p777p645n568l023j938k252k296j488j166k316
$$ y = [491774, 490646, 491775, 493588, 494095, 492971, 491732, 491594, 491824, 490859, 488491, 485781, 483040, 479332, 474373, 469519, 466084, 463737, 461611, 460063, 460084, 461475, 462841, 463255, 463007, 462900, 463623, 465659, 468904, 472412, 475098, 476621, 477171, 476807, 475674, 474484, 474048, 474516, 475702, 477831, 481375, 486390, 492509, 499213, 505752, 511380, 516203, 521142, 526528, 531616, 536095, 540939, 546696, 552078, 555711, 558378, 561834, 565984, 569023, 570016, 569548, 567993, 565066, 561232, 557776, 555003, 551939, 548311, 545340, 543870, 542991, 541366, 539080, 537496, 537896, 540639, 544949, 549245, 552320, 554372, 556243, 557839, 558254, 557371, 556098, 554992, 554028, 553908, 556032, 560501, 565498, 569429, 572616, 576122, 580044, 583814, 587164, 589660, 590050, 587287, 581888, 575479, 569277, 563642, 558659, 554349, 550432, 546322, 541338, 534890, 527113, 519468, 513900, 510877, 508939, 506687, 504391, 502903, 501737, 499421]
57730D99421l811l721j678P34J653O46r75j407k13J245J480O34M5M46J311J759
57714D97569J445N76l52r38j357k113l065l389k873k365k276j738l55M37o92k489
57698D76025k517o04J098J418J479K328L226L185K754L123M417N796O616O758
57684E15102O332N691N382N732O593P487P750O764M684K675J814J913K150K394
57670E82463K951L456L284K900L339M336M416L096J605R73Q07M94K46J88l23j535
57654F12696k443k057q28Q7K90L3p03j999l181l218j927k89N44K39m96n59N00
57637E96689J993K953L308L647L952L495K150Q84N61J048J890L089M646O020O693
57622F43018O860P145Q042R856J2548J5354J7259J8324J9918K3236K8167L3843
$$ y = [499421, 495610, 491889, 490211, 490945, 492598, 493244, 492269, 490862, 490649, 491894, 493374, 494008, 494053, 494499, 495810, 497569, 499014, 499590, 499238, 498300, 496943, 494830, 491765, 488376, 485503, 483138, 480862, 479124, 478769, 479206, 478514, 476025, 473508, 472904, 474002, 475420, 476899, 479227, 482453, 485638, 488392, 491515, 495932, 501728, 508344, 515102, 521434, 527125, 532507, 538239, 544832, 552319, 560069, 566833, 571517, 574192, 576006, 577919, 580069, 582463, 585414, 588870, 592154, 595054, 598393, 602729, 607145, 610241, 611846, 612819, 613626, 614120, 614366, 614554, 614231, 612696, 610253, 608196, 607368, 607455, 607745, 607778, 607075, 605076, 601895, 598677, 596750, 596461, 597005, 597244, 596748, 596189, 596689, 598682, 601635, 604943, 608590, 612542, 616037, 618187, 619071, 619632, 620680, 622570, 625659, 630305, 636325, 643018, 649878, 657023, 665065, 674921, 687469, 702823, 720082, 738406, 758324, 781560, 809727, 843570]
57610H43570L9311M3161M3562L9900L3861K7757K1906J4482M016q586k0515k9175
57598A053250l3879l5869l6768l7031l6038l3479k9976k6244k2314j8046j3892
57587G29714j0763r274r228r529q771o548m134l088l285l234k323j478j406j653
57573F55000j858k485l481l618k268o58j38k65mJ86q72k815l957l594k579j807
57557F24787j382j241j336j187l97M54M77o0q2O23J251J459J715K048J782P78
57541F29689j25k55K09Q68J396J120m43k380k958j832n21k33m40k11L14P68J655
57524F26621L384M883M499K114n33j571n34J528K901K473O70r98j569j309p19
57509F41840K52J450J938J175P3j43M42R59J433K513L790L849K368Q96J009K501
$$ y = [843570, 882881, 926042, 969604, 1009504, 1043365, 1071122, 1093028, 1107510, 1111526, 1102940, 1082425, 1053250, 1019371, 983502, 946734, 909703, 873665, 840186, 810210, 783966, 761652, 743606, 729714, 718951, 709677, 700449, 690920, 682149, 675601, 671467, 668379, 665094, 661860, 659537, 658059, 656653, 655000, 653142, 650657, 647176, 643558, 641290, 640632, 640494, 640229, 640225, 640411, 639539, 636724, 632767, 629173, 626594, 624787, 623405, 622164, 620828, 619641, 619244, 619698, 620175, 620115, 620033, 620656, 621907, 623366, 625081, 627129, 628911, 629689, 629564, 629309, 629518, 630386, 631782, 632902, 632459, 630079, 627121, 625289, 624768, 624535, 624095, 623884, 624198, 624966, 626621, 630005, 634888, 639387, 641501, 640968, 639397, 638863, 640391, 643292, 645765, 646435, 645437, 643868, 642559, 641840, 642092, 643542, 645480, 646655, 646728, 646585, 647027, 647986, 649419, 651932, 655722, 659571, 661939, 662835, 663844, 666345]
57493F66345L994M548M218L601L497M530O527Q490R534R591R003P969O823O285
57479G54955O782P778Q370Q345Q075P583O600N509N374O562Q003Q413P872P523
57465H57744P921Q334P837O542N419N143N478N782N802N823O223P036P946Q537
57451I51567Q512P930P329P489Q633R934J0139Q916P251O363O515P227Q212R524
57437A065541J0820J1188J0181Q704Q336R624J1250J1277R329P235P039Q536R491
57424A188551Q455O519N617N942O129N532M916M919N232N632O523P727P884O121
57410A275699L609K393L147M906O522P489P727P565P784Q764R817J0228J0744
57397A366394J2695J5691J7444J6548J4358J3330J4175J5527J6113J6189J6621
$$ y = [666345, 670339, 674887, 679105, 682706, 686203, 690733, 697260, 705750, 715284, 724875, 733878, 741847, 748670, 754955, 761737, 769515, 777885, 786230, 794305, 801888, 808488, 813997, 819371, 825933, 833936, 842349, 850221, 857744, 865665, 873999, 881836, 888378, 893797, 898940, 904418, 910200, 916002, 921825, 928048, 935084, 943030, 951567, 960079, 968009, 975338, 982827, 991460, 1001394, 1011533, 1020449, 1027700, 1034063, 1040578, 1047805, 1056017, 1065541, 1076361, 1087549, 1097730, 1106434, 1114770, 1124394, 1135644, 1146921, 1156250, 1163485, 1170524, 1179060, 1188551, 1197006, 1203525, 1209142, 1215084, 1221213, 1226745, 1231661, 1236580, 1241812, 1247444, 1253967, 1261694, 1269578, 1275699, 1279308, 1281701, 1284848, 1289754, 1296276, 1303765, 1311492, 1319057, 1326841, 1335605, 1345422, 1355650, 1366394, 1379089, 1394780, 1412224, 1428772, 1443130, 1456460, 1470635, 1486162, 1502275, 1518464, 1535085]
57386A535085J7231J6874J5167J3546J3932J6436J9012J9688J8548J7153J6714
57375A719386J7296J8367J9202J9078J7895J6543J6014J6313J6767J7075J7317
57364A911253J7264J6631J5845J5661J6071J6515J6965J7745J8426J8159J7256
57353B097791J7106J8177J9354J9743J9987K1061K2677K3708K3454K1951J9690
57342B324699J7625J6821J7578J9271K1283K3345K4860K5034K4080K3300K3451
57331B561347K4042K4659K5691K7062K7581K6689K5732K6264K7961K9357K9909
57320B856294L0149L0445L0772L1171L1439L0969K9744K8703K8263K7598K6494
57309C182041K6598K9129L2473L4006L3450L2362L1167K9240K7534K8159L0869
$$ y = [1535085, 1552316, 1569190, 1584357, 1597903, 1611835, 1628271, 1647283, 1666971, 1685519, 1702672, 1719386, 1736682, 1755049, 1774251, 1793329, 1811224, 1827767, 1843781, 1860094, 1876861, 1893936, 1911253, 1928517, 1945148, 1960993, 1976654, 1992725, 2009240, 2026205, 2043950, 2062376, 2080535, 2097791, 2114897, 2133074, 2152428, 2172171, 2192158, 2213219, 2235896, 2259604, 2283058, 2305009, 2324699, 2342324, 2359145, 2376723, 2395994, 2417277, 2440622, 2465482, 2490516, 2514596, 2537896, 2561347, 2585389, 2610048, 2635739, 2662801, 2690382, 2717071, 2742803, 2769067, 2797028, 2826385, 2856294, 2886443, 2916888, 2947660, 2978831, 3010270, 3041239, 3070983, 3099686, 3127949, 3155547, 3182041, 3208639, 3237768, 3270241, 3304247, 3337697, 3370059, 3401226, 3430466, 3458000, 3486159, 3517028]
57298C517028L2627L1624K9554K8740K8958K8608K7533K7005K7722K9216L0809
57287C839424L2105L2825L2838L2210L0977K9269K7710K7013K7155K7625K8404
57276D167555K9658L0699L0555K9746L0022L1985L4382L6086L7328L8379L8651
57265D535046L8002L7546L8148L9167L9589L9261L8242L6214L3606L1988L2160
57254D938969L2840L2402L0934K9531K8637K8390K9393L1678L3815L4647L5077
57243E286313L6529L8312L8497L6893L5314L4777L4327L2910L0970K9574K9048
57232E663464K8974K8871K8514K8114K8217K8999K9717K9339K7661K5466K3887
57221E971223K3812K5205K6646K6388K4463K2800K2578K2605K1314J9182J7819
$$ y = [3517028, 3549655, 3581279, 3610833, 3639573, 3668531, 3697139, 3724672, 3751677, 3779399, 3808615, 3839424, 3871529, 3904354, 3937192, 3969402, 4000379, 4029648, 4057358, 4084371, 4111526, 4139151, 4167555, 4197213, 4227912, 4258467, 4288213, 4318235, 4350220, 4384602, 4420688, 4458016, 4496395, 4535046, 4573048, 4610594, 4648742, 4687909, 4727498, 4766759, 4805001, 4841215, 4874821, 4906809, 4938969, 4971809, 5004211, 5035145, 5064676, 5093313, 5121703, 5151096, 5182774, 5216589, 5251236, 5286313, 5322842, 5361154, 5399651, 5436544, 5471858, 5506635, 5540962, 5573872, 5604842, 5634416, 5663464, 5692438, 5721309, 5749823, 5777937, 5806154, 5835153, 5864870, 5894209, 5921870, 5947336, 5971223, 5995035, 6020240, 6046886, 6073274, 6097737, 6120537, 6143115, 6165720, 6187034, 6206216, 6224035]
57210F224035J7698J8348J9862K2437K5102K6707K7607K8592K8728K6444K2377
57199F487937J8864J6587J4002J0351O973M985L895L392M458P557J1367J4633
57187F605001J7783K1421K4583K6087K6733K8434L1547L4389L5409L4767L3545
57176F919699L2099K9667K5555K0496J6264J3617J1148O939R13n407j1008j6045
57164G043937k0665k4682k8484l2830l7309m0348m1000l9584l6462l1642k6011
57153F684920k1272j7891j4650j0981q206p398p491p047o789q611j2531j6264
57141F545789j7917j7876j7718j7974j7559j5103j0583n441j178J822L888N145
57129F435295N689O085O782P349P274P054P432Q015Q034P960Q767R863R641P993
$$ y = [6224035, 6241733, 6260081, 6279943, 6302380, 6327482, 6354189, 6381796, 6410388, 6439116, 6465560, 6487937, 6506801, 6523388, 6537390, 6547741, 6554714, 6559699, 6563594, 6566986, 6571444, 6579001, 6590368, 6605001, 6622784, 6644205, 6668788, 6694875, 6721608, 6750042, 6781589, 6815978, 6851387, 6886154, 6919699, 6951798, 6981465, 7007020, 7027516, 7043780, 7057397, 7068545, 7075484, 7076397, 7070990, 7059982, 7043937, 7023272, 6998590, 6970106, 6937276, 6899967, 6859619, 6818619, 6779035, 6742573, 6710931, 6684920, 6663648, 6645757, 6631107, 6620126, 6611920, 6604522, 6597031, 6589984, 6583195, 6574584, 6562053, 6545789, 6527872, 6509996, 6492278, 6474304, 6456745, 6441642, 6431059, 6425618, 6424440, 6426262, 6430150, 6435295, 6440984, 6447069, 6453851, 6461200, 6468474, 6475528, 6482960, 6490975, 6499009, 6506969, 6515736, 6525599, 6535240, 6543233]
57115F543233O302M664J201n261j3806k3418l4635m8187o3565p9833r6645j13678
57103F076372j30225j45894j60464j72780j81215j85465j86196j82738j73334
57094D558061j58316j40995j24603j10227r8376r0409q7253q8562r3951j03091
57084C462278j13911j22975j28720j32255j34292j33960j31562j29712j30189
57075B304702j32262j35308j40270j47005j53184j57725j62520j68987j76035
57066I31406j83328j93194k06711A27027a07083k47409k63835k83321l05018l30250
57056a536916l59897l91583m22666m53741m86491n21057n58237o00828o49706
57047e981122p02329p58435q23325r02145r95516j104826j236902j399656j600138
$$ y = [6543233, 6549535, 6554199, 6555400, 6550139, 6536333, 6512915, 6478280, 6430093, 6366528, 6286695, 6190050, 6076372, 5946147, 5800253, 5639789, 5467009, 5285794, 5100329, 4914133, 4731395, 4558061, 4399745, 4258750, 4134147, 4023920, 3925544, 3835135, 3747882, 3659320, 3565369, 3462278, 3348367, 3225392, 3096672, 2964417, 2830125, 2696165, 2564603, 2434891, 2304702, 2172440, 2037132, 1896862, 1749857, 1596673, 1438948, 1276428, 1107441, 931406, 748078, 554884, 348173, 127027, -107083, -354492, -618327, -901648, -1206666, -1536916, -1896813, -2288396, -2711062, -3164803, -3651294, -4172351, -4730588, -5331416, -5981122, -6683451, -7441886, -8265211, -9167356, -10162872, -11267698, -12504600, -13904256, -15504394]
57038a5504394j853731k187925k624144l153870l741354m361215n045778n897258
57030d4369669p021300q394685r783982j0851883j1416205j1620613j1826152
57023a15284489j2326571j3156847j4096859j4747492j4601281j3200348j0413149
57016b07827036o617872k560621J035054L786024N693776O995217P992186Q929496
57008a82573776R920157J0934076J1855686J2559131J2948101J2967974J2619582
57001i8769069J1965372J1105272J0137543R137905Q159789P236773O383998N606743
56993b9035674M909316M292820L749301L266178K835579K454615K119200J823459
56985c585206J563704f83468D59698R75530Q33627P15542O15920N29134M53580
$$ y = [-15504394, -17358125, -19546050, -22170194, -25324064, -29065418, -33426633, -38472411, -44369669, -51390969, -59785654, -69569636, -80421519, -91837724, -103458337, -115284489, -127611060, -140767907, -154864766, -169612258, -184213539, -197413887, -207827036, -214444908, -217005529, -215970475, -212184451, -206490675, -199495458, -191503272, -182573776, -172653619, -161719543, -149863857, -137304726, -124356625, -111388651, -98769069, -86803697, -75698425, -65560882, -56422977, -48263188, -41026415, -34642417, -29035674, -24126358, -19833538, -16084237, -12818059, -9982480, -7527865, -5408665, -3585206, -2021502, -683468, 459698, 1435228, 2268855, 2984397, 3600317, 4129451, 4583031]
56976D583031L89539L35066K87469K46434K11678J79740J47385J16712R2704P6444
56966F666202O3846M9773L0176K079l4013p1720j02201j20532j27474j26634j22470
56955F107032j19444j19401j19876j17259j11226j04166r7557r1495q6641q3702
56945E056265q1616p8644p4831p1183o7292o2168n6704n2695m9872m6306m1520
56934D373434l6905l3269k9981k6611k3567k1120j9214j8254j8906k1331k5357
56923D098919l0708l6420m1235m5403n0628n7317o3747o9054p4685q1212q6192
56912C462318q7596q6949q6370q4690p9974p3923o9900o7690o4113n8252n2279
56901B650582m7275m2176l7087l4097l3922l4896l6220l9418m5396n2364n7878
$$ y = [4583031, 4972570, 5307636, 5595105, 5841539, 6053217, 6232957, 6380342, 6497054, 6589758, 6666202, 6730048, 6779821, 6809997, 6812076, 6778063, 6706343, 6604142, 6483610, 6356136, 6229502, 6107032, 5987588, 5868187, 5748311, 5631052, 5519826, 5415660, 5318103, 5226608, 5139967, 5056265, 4974649, 4896005, 4821174, 4749991, 4682699, 4620531, 4563827, 4511132, 4461260, 4414954, 4373434, 4336529, 4303260, 4273279, 4246668, 4223101, 4201981, 4182767, 4164513, 4145607, 4124276, 4098919, 4068211, 4031791, 3990556, 3945153, 3894525, 3837208, 3773461, 3704407, 3629722, 3548510, 3462318, 3374722, 3287773, 3201403, 3116713, 3036739, 2962816, 2892916, 2825226, 2761113, 2702861, 2650582, 2603307, 2561131, 2524044, 2489947, 2456025, 2421129, 2384909, 2345491, 2300095, 2247731, 2189853]
56890B189853o1246o3028o3883o4460o4945o4197o0791n5147m9207m4048l9331
56879A559570l4912l1051k7135k2114j6389j1514q118n935n564p975j2366j6875
56867A359622k1477k7729l5317m1376m3950m3953m3039m1625l9710l7603l5084
56856I48759l1724k8579k7572k8524k8872k6977k3779k0552j7397j4783j4151
56845F85849j5557j6816j6322j4951j3849j2415j0027p948p476p590o274l197
56833E53427M18L764O823R559J2067J4775J7560J9341J9427J8230J6009J2161
56821G03561O831J874j116k663m058n272n550n033m273k916l36K974N940Q363
56807F98326J0695J2951J5070J7749K1608K5826K8758K9659K8827K6401K2128
$$ y = [2189853, 2128607, 2065579, 2001696, 1937236, 1872291, 1808094, 1747303, 1692156, 1642949, 1598901, 1559570, 1524658, 1493607, 1466472, 1444358, 1427969, 1416455, 1408337, 1402402, 1396838, 1388863, 1376497, 1359622, 1338145, 1310416, 1275099, 1233723, 1189773, 1145820, 1102781, 1061156, 1021446, 983843, 948759, 917035, 888456, 860884, 832360, 803488, 776511, 752732, 732180, 714783, 700000, 685849, 670292, 653476, 637154, 622203, 608354, 595939, 585912, 577964, 570488, 562898, 556624, 553427, 553845, 557609, 564432, 573991, 586058, 600833, 618393, 637734, 657161, 675391, 691400, 703561, 710392, 712266, 711150, 708487, 704429, 699157, 693607, 688574, 684301, 681385, 681049, 684023, 689963, 698326, 709021, 721972, 737042, 754791, 776399, 802225, 830983, 860642, 889469, 915870, 937998]
56796I37998J6200R442K603l878r594j4086j6885j7422j5444j1741p637l539J147
56783H67164O368J0968J4613J8774K4680L1417L7324M2144M6288M8759M7651M2470
56771A238620L4401K4438J2671m34j3385k4547l2916l7941l9577l8565l5927l2104
56759A054734k7229k2082j7810j4597j1392p054j183O154J4599K3107K9933L3552
56747A060732L3345K9528K2775J4018M178o118j6396k5860l3292l7567l8324l6239
56735I70780l2738k9210k6305k3925k1786j9617j6864j2741o990m28N533R860
56723G95569J2451J3865J4577J4304J2204P805J626n270j2022j7998k2670k5987
56711G88454k8378k9860k9700k7694k5132k3467k2552k1318j9673j8375j7379
$$ y = [937998, 954198, 963640, 966243, 962365, 952771, 938685, 921800, 904378, 888934, 877193, 869556, 866017, 867164, 873532, 884500, 899113, 917887, 942567, 973984, 1011308, 1053452, 1099740, 1148499, 1196150, 1238620, 1273021, 1297459, 1310130, 1309696, 1296311, 1271764, 1238848, 1200907, 1161330, 1122765, 1086838, 1054734, 1027505, 1005423, 987613, 973016, 961624, 954570, 953387, 959541, 974140, 997247, 1027180, 1060732, 1094077, 1123605, 1146380, 1160398, 1164576, 1158458, 1142062, 1116202, 1082910, 1045343, 1007019, 970780, 938042, 908832, 882527, 858602, 836816, 817199, 800335, 787594, 780604, 780176, 785709, 795569, 808020, 821885, 836462, 850766, 862970, 870775, 872401, 867131, 855109, 837111, 814441, 788454, 760076, 730216, 700516, 672822, 647690, 624223, 601671, 580353, 560680, 542305, 524926]
56700E24926j5866j3768j1869j0420r125q281q255q063o308l798l008m537o159
56687D15469o044m938m270m031l650l192k582j248L82O91p40k195k344j895j615
56672C77798q14O98J269l3j311n40J216J579N15k14j67l13o89l15R90K579M114
56655C86362N042M047J090j254r63Q9j131l732m012j268J197J236M16L98K31j129
56639C86619k426k327j879k638l937m077l036k091j541n73R47K033J824M34j224
56624C66108j958j102O19J629J369R86J621K746K921J689Qr12n73O70J942K474
56608C80237K220J734J462J529K121L384M805N341M457K705J103K82L21R05J453
56593D14059J517J120N25j77q62j063m41N96J209J079O22M73J004J943K272J157
$$ y = [524926, 509060, 495292, 483423, 473003, 463878, 455597, 447342, 439279, 432971, 429173, 426165, 421628, 415469, 409425, 404487, 400217, 396186, 392536, 389344, 386762, 385514, 385896, 386587, 385847, 383652, 381308, 379413, 377798, 376984, 377682, 378951, 378918, 377607, 377067, 378283, 379862, 380377, 380163, 379996, 379683, 378994, 378679, 379669, 382248, 386362, 391404, 395451, 396541, 395287, 394324, 394413, 393282, 389550, 385538, 384270, 385467, 386703, 387119, 387517, 387748, 386619, 384193, 381866, 379987, 377349, 373412, 369335, 366299, 364208, 362667, 362094, 363041, 365074, 366898, 367332, 366108, 364150, 363048, 363667, 365296, 366665, 367651, 369272, 372018, 374939, 376628, 376636, 375724, 375151, 375821, 377763, 380237, 382457, 384191, 385653, 387182, 389303, 392687, 397492, 402833, 407290, 409995, 411098, 411380, 411701, 412606, 414059, 415576, 416696, 417221, 417044, 416182, 415119, 414678, 415274, 416483, 417562, 418184, 418657, 419661, 421604, 423876, 425033]
56577D25033o10j033N04K137K008P19k8k10r63j984j651K46J904J961R27j51q39
56560D27970p87L75J973K406J016j140k777l591l672k940j737j011j291k210l188
56545D09396l844l683k483j042m05l27L55J764K823L152L401L457K097p38k975
56530D10948k827r71P17J545K062K578K771K339J301j7q91o34N37J612J937J662
56514D24669J068M06L62J553L378M463M526M591N289O235P295Q894J0648J1214
56500D94591J0219Q937Q344P913O952N746M590L127J496P55J181J596J247R30
56486E57624J103N85j405l366l386j876p11n59p38r94j559j864j072J46o3k352
56470E39513n206o638o093m608l652l824m389m166l022j948j611j660j681j815
$$ y = [425033, 424423, 423390, 423894, 426031, 428039, 428758, 428730, 428520, 427557, 425573, 423922, 424168, 426072, 428033, 428960, 428809, 427970, 427183, 427558, 429531, 431937, 432953, 431813, 429036, 425445, 421773, 418833, 417096, 416085, 414794, 412584, 409396, 405552, 401869, 399386, 398344, 397939, 397612, 397967, 399731, 402554, 405706, 409107, 412564, 414661, 413923, 410948, 408121, 407150, 407867, 409412, 411474, 414052, 416823, 419162, 420463, 420446, 419555, 418921, 419458, 421070, 423007, 424669, 425737, 426143, 426505, 428058, 431436, 435899, 440425, 445016, 450305, 456540, 463835, 472729, 483377, 494591, 504810, 513747, 522091, 530004, 536956, 542702, 547292, 550419, 551915, 552670, 553851, 555447, 556694, 557624, 558727, 559312, 557907, 554541, 551155, 549279, 548568, 548009, 547271, 546277, 544718, 542854, 541782, 541928, 541865, 539513, 534307, 527669, 521576, 516968, 513316, 509492, 505103, 500937, 497915, 495967, 494356, 492696, 491015, 489200]
56456D89200j988j776j504k163l411l273j095Q01J09k038k675j238O1k29j115
56441D67666j274r66j030j349j291q92p48r77r32m4J228J658P97j50K11J319J232
56424D64458m02j505m81J425J871N33r29j279p18M6N84P72R26J497K045J324q18
56407D69349k577k376r43J5K68O27R45L53q44j418j131p43j69J500L946N354M749
56390D76905L207K161J696J240P48M08r1j117k282k694j916m08Q78J276R87P39
56374D81737Q38Q35L67k18n47q82j395j405k82J212J591N32q03j352j250j150
56358D77828j196q75L00K015L048K360N25o23k59L52k36j502j838r79k33m78j183
56341D77026j464j088k41P73J381J053J40k31O04K037K896K732K177J976J885
$$ y = [489200, 487212, 485436, 483932, 481769, 478358, 475085, 473990, 474791, 474900, 472862, 470187, 468949, 469010, 468781, 467666, 466392, 465426, 464396, 463047, 461756, 460864, 460116, 459139, 458207, 458163, 459391, 461049, 461846, 461696, 461907, 463226, 464458, 464056, 462551, 462070, 463495, 465366, 465899, 464970, 463691, 462973, 463019, 463603, 464375, 465301, 466798, 468843, 470167, 469349, 466772, 464396, 463453, 463468, 463736, 464363, 465308, 465661, 464817, 463399, 462268, 461525, 461356, 462856, 466802, 472156, 476905, 480112, 482273, 483969, 485209, 485957, 486365, 486274, 485157, 482875, 480181, 478265, 477857, 478735, 480011, 480998, 481737, 482575, 483410, 483777, 483559, 483012, 482130, 480735, 479330, 479048, 480260, 481851, 482383, 481580, 480228, 478978, 477828, 476632, 475757, 476057, 478072, 481120, 483480, 484005, 483382, 483123, 483475, 483239, 481737, 479899, 478920, 478687, 478209, 477026, 475562, 474474, 474233, 475006, 476387, 477440, 477580, 477349, 477953, 479990, 482886, 485618, 487795, 489771, 491656]
56326D91656R80p23j623l91J919K946K154J386K058L342L851L566L073K196P07
56311E17097o16q40j19Q59J861K668K780K402K644L688M074L042K145K953M445
56296E49083M553L262K157J755J377J131J842L108L489K629J671J542K205L310
56282E83114M297M217K915J867K388L598L861L493M049N486O289O175O312O720
56268F44781N864L345R19J35O24J308J806K032J911J974K998M591N373M842L875
56253F86378L292L201L789N248O743O970O025N358N773O853Q248R877J0748R711
56239G78214P705P332R420J1848J2677J2559J2943J3532J3118J1952J1637J3029
56227I15966J5296J7015J7592J7636J8180J9444K0664K1372K2241K3922K5754
$$ y = [491656, 492636, 491913, 490290, 489899, 491818, 494764, 496918, 498304, 500362, 503704, 507555, 511121, 514194, 516390, 517097, 516481, 515641, 515522, 516381, 518242, 520910, 523690, 526092, 528736, 532424, 536498, 539540, 541685, 544638, 549083, 553636, 556898, 559055, 560810, 562187, 563318, 565160, 568268, 571757, 574386, 576057, 577599, 579804, 583114, 587411, 591628, 594543, 596410, 598798, 602396, 606257, 609750, 613799, 619285, 625574, 631749, 638061, 644781, 650645, 653990, 654909, 655044, 655668, 656976, 658782, 660814, 662725, 664699, 667697, 672288, 677661, 682503, 686378, 689670, 692871, 696660, 701908, 708651, 715621, 721646, 727004, 732777, 739630, 747878, 757755, 768503, 778214, 785919, 793251, 802671, 814519, 827196, 839755, 852698, 866230, 879348, 891300, 902937, 915966, 931262, 948277, 965869, 983505, 1001685, 1021129, 1041793, 1063165, 1085406, 1109328, 1135082]
56216A135082K6695K7041K7958K9839L2394L5783M0071M4039M6428M8094N1079
56205A544503N5692O0456O4893P0174P6868Q4195R1911J00792J10653J20016J28580
56194B508733J38055J49539J61806J73356J84465J95890K06762K15189K20237
56185D154032K22301K22044K19554K14035K04075J88833J69001J45791J19407
56176E859073Q9778N8391K7572k134l2081o2580r1510j16424j36596j52555j64993
56165E275941j74661j82046j86735j88153j86977j84531j80832j74924j67176
56156C649906j59486j52917j46700j39887j32420j24476j16360j09130j03534
56147B464996r8386r1885q4546p8661p4750p0870o5716o0091n4891m9997m5657
$$ y = [1135082, 1161777, 1188818, 1216776, 1246615, 1279009, 1314792, 1354863, 1398902, 1445330, 1493424, 1544503, 1600195, 1660651, 1725544, 1795718, 1872586, 1956781, 2048692, 2149484, 2260137, 2380153, 2508733, 2646788, 2796327, 2958133, 3131489, 3315954, 3511844, 3718606, 3933795, 4154032, 4376333, 4598377, 4817931, 5031966, 5236041, 5424874, 5593875, 5739666, 5859073, 5948851, 6007242, 6034814, 6032680, 6000599, 5938019, 5846509, 5730085, 5593489, 5440934, 5275941, 5101280, 4919234, 4732499, 4544346, 4357369, 4172838, 3992006, 3817082, 3649906, 3490420, 3337503, 3190803, 3050916, 2918496, 2794020, 2677660, 2568530, 2464996, 2366610, 2274725, 2190179, 2111518, 2036768, 1965898, 1900182, 1840091, 1785200, 1735203, 1689546]
56136A689546m2558l9930l6009l1103k7747k6883k6388k4353k1536j9395j7916
56125A375728j6603j5591j4695j3270j1707j1039j0510q155m460k502l212l572
56113A260412j179K227L867L985M488N661O501O815O977P064P709J0230J4441
56100A339198J8103J9949K1340K3602K5830K7020K8208L0589L3351L5347L7288
56089A639825M0504M4981N0263N6635O4057P1495P8742Q6993R6213J03894J07935
56078B441537J08881J07876J04534R8455R0781Q2561P3528O4018N5878M9836M4132
56067C322017L7388L0608K4659J8281J0451K269n357j3560k3110l2799m2055n2421
56055C276371o4277p4979q2549q8261r3068r4713r1501q5940q1098p6058o8580
$$ y = [1689546, 1646988, 1607058, 1571049, 1539946, 1512199, 1485316, 1458928, 1434575, 1413039, 1393644, 1375728, 1359125, 1343534, 1328839, 1315569, 1303862, 1292823, 1282313, 1274158, 1269698, 1267196, 1263984, 1260412, 1259233, 1261460, 1265327, 1269312, 1273800, 1279461, 1285962, 1292777, 1299754, 1306818, 1314527, 1324757, 1339198, 1357301, 1377250, 1398590, 1422192, 1448022, 1475042, 1503250, 1533839, 1567190, 1602537, 1639825, 1680329, 1725310, 1775573, 1832208, 1896265, 1967760, 2046502, 2133495, 2229708, 2333602, 2441537, 2550418, 2658294, 2762828, 2861283, 2952064, 3034625, 3108153, 3172171, 3228049, 3277885, 3322017, 3359405, 3390013, 3414672, 3432953, 3443404, 3445673, 3440316, 3426756, 3403646, 3370847, 3328792, 3276371, 3212094, 3137115, 3054566, 2966305, 2873237, 2778524, 2687023, 2601083, 2519985, 2443927, 2375347]
56044B375347n9803n2345m5854l8465l1009k5754k2277j8339j3958j1024r730
56033B046789q504o714m670j895J899N271O953P920R229R702Q434P584R411J2510
56019B103919J4168J4775J6396J8692J9945K0725K2848K5738K7384K8053K9751
56008B342394L2713L5456L7445L8898L9006L7218L5342L5579L7450L8945L9373
55997B749819L9027L7782L6410L7055L9939M2007M1484M1117M3898M8268N0913
55986C207719N1662N2154N2318N1872N2569N5259N7376N7029N6647N8796O1635
55975C815036O2811O4379O9091P4934P8519Q0846Q4551Q8338Q9572Q9701R1748
55964D689526R4963R7249J00111J05739J12107J16516J20967J28417J36968J43772
$$ y = [2375347, 2315544, 2263199, 2217345, 2178880, 2147871, 2122117, 2099840, 2081501, 2067543, 2056519, 2046789, 2038285, 2031571, 2026901, 2025006, 2026905, 2032176, 2039129, 2047049, 2056278, 2065980, 2074414, 2081998, 2091409, 2103919, 2118087, 2132862, 2149258, 2167950, 2187895, 2208620, 2231468, 2257206, 2284590, 2312643, 2342394, 2375107, 2410563, 2448008, 2486906, 2525912, 2563130, 2598472, 2634051, 2671501, 2710446, 2749819, 2788846, 2826628, 2863038, 2900093, 2940032, 2982039, 3023523, 3064640, 3108538, 3156806, 3207719, 3259381, 3311535, 3363853, 3415725, 3468294, 3523553, 3580929, 3637958, 3694605, 3753401, 3815036, 3877847, 3942226, 4011317, 4086251, 4164770, 4245616, 4330167, 4418505, 4508077, 4597778, 4689526, 4784489, 4881738, 4981849, 5087588, 5199695, 5316211, 5437178, 5565595, 5702563, 5846335]
55954E846335J51171J62391J74645J83381J90184J99278K09556K17529K25028
55945G559498K36193K49831K62467K75719K92705L10719L26121L42975L67465
55936A0223693L96896M23861M48449M76649N09422N43470N79983O22392O68038
55927A4892853P12275P57937Q10417Q67114R22872R81980J052958J135470J224839
55918B3358715J324775J441906J572286J708139J853824K020525K210561K423376
55910C7914107K671254K971082L326217L734620M206410M750335N350471N982781
55902G0907277O651091P383554Q202653R126371J0187349J1417876J2830222J4452152
55894A51158545J6365991J8663865K1377838K4485342K7884877L1187181L3529107
$$ y = [5846335, 5997506, 6159897, 6334542, 6517923, 6708107, 6907385, 7116941, 7334470, 7559498, 7795691, 8045522, 8307989, 8583708, 8876413, 9187132, 9513253, 9856228, 10223693, 10620589, 11044450, 11492899, 11969548, 12478970, 13022440, 13602423, 14224815, 14892853, 15605128, 16363065, 17173482, 18040596, 18963468, 19945448, 20998406, 22133876, 23358715, 24683490, 26125396, 27697682, 29405821, 31259645, 33280170, 35490731, 37914107, 40585361, 43556443, 46882660, 50617280, 54823690, 59574025, 64924496, 70907277, 77558368, 84941922, 93144575, 102270946, 112458295, 123876171, 136706393, 151158545, 167524536, 186188401, 207566239, 232051581, 259936458, 291123639, 324652746]
55887C24652746L3836005L1469455K6574325J9714589J1329273J776298q160290
55880D41192401j7152519k3937746k8006130k9659200k9552878k8310768k6438436
55873B58134724k4329934k2222656k0191523j8234400j6349628j4545315j2836082
55866A29425186j1258205r860089q664163p657452o819712o134416n570722n084102
55858F8376325m644848m248052l892751l571339l282567l034127k825524k643404
55850D0233713k477615k327265k188394k051065j912662j780759j659249j543559
55842B4293145j432042j329986j239459j156202j078830j010576r50067q90920
55834A5205063q32371p80131p34848o90000o43153n99261n60552n22819m84502
$$ y = [324652746, 358488751, 389958206, 416532531, 436247120, 447576393, 449352691, 441192401, 424039882, 400102136, 372096006, 342436806, 312883928, 284573160, 258134724, 233804790, 211582134, 191390611, 173156211, 156806583, 142261268, 129425186, 118166981, 108306892, 99642729, 91985277, 85165565, 79031149, 73460427, 68376325, 63731477, 59483425, 55590674, 52019335, 48736768, 45702641, 42877117, 40233713, 37756098, 35428833, 33240439, 31189374, 29276712, 27495953, 25836704, 24293145, 22861103, 21531117, 20291658, 19135456, 18056626, 17046050, 16095983, 15205063, 14372692, 13592561, 12857713, 12167713, 11524560, 10925299, 10364747, 9841928, 9357426]
55825I357426m50121m21591l94604l66711l41276l20408l01366k82723k67113
55816F211513k55171k43277k29871k17882k08584j99175j88547j79606j73575
55807D315825j67524j59730j52266j46336j39939j31961j24057j17142j10320
55798C066550j04047r9783r6178r0445q3744p9910p8619p5631p0277o6580o5948
55787B155388o4839o1235n7513n5129n2130m8024m5650m5812m5122m1580l7688
55776A600666l5696l4246l2114l0906l1472l1477k9051k5645k3230k1850k1467
55765A283512k2676k4154k2993j9230j6547j6914j8092j7836j6890j6229j5071
55754A076880j3514j3479j5059j5237j2276q258n567l946k760k872m194m394k195
$$ y = [9357426, 8907305, 8485714, 8091110, 7724399, 7383123, 7062715, 6761349, 6478626, 6211513, 5956342, 5713065, 5483194, 5265312, 5056728, 4857553, 4669006, 4489400, 4315825, 4148301, 3988571, 3836305, 3689969, 3550030, 3418069, 3294012, 3176870, 3066550, 2962503, 2862720, 2766542, 2676097, 2592353, 2512443, 2433824, 2358193, 2287916, 2221336, 2155388, 2090549, 2029314, 1971801, 1916672, 1864542, 1816518, 1770868, 1725056, 1679934, 1638354, 1600666, 1564970, 1530724, 1498610, 1467704, 1436232, 1404755, 1375704, 1350059, 1326829, 1304979, 1283512, 1260836, 1236682, 1213689, 1194459, 1177912, 1160998, 1142906, 1125070, 1108180, 1091951, 1076880, 1063366, 1049887, 1034828, 1019591, 1007315, 999057, 993490, 989544, 986784, 983912, 979718, 975324, 973129]
55741I73129O25K276L398M718M947K927l83l577o347q197q124o834o748q487r825
55726I33498r216p867p154o637n882n603n723m852k706n19J928O718J3976K0502
55712I20463K3566K3330K0434J4274N218m365j2917k0863k7708l1090l0478k8734
55700H51130k8096k7425k5317k2974k1753k0773j9225j8462j9231j9357j6803
55689F11714j2891r995q116o254n080n469o068n154l549l107l612l652l460m346
55675E30961o042p015o916o835p435q346q913q465o608m239l252m153n102m379
55661D43261k526j046m05l36o46n82J104M219O776P695Q079Q724Q348N852K341
55646D90858p97l899p239r123q227o293o026p297p867p090o498p013p687p356
$$ y = [973129, 973754, 976030, 979428, 984146, 989093, 992020, 991637, 988060, 981713, 973516, 965392, 958558, 951810, 943323, 933498, 924282, 916415, 909261, 902624, 896742, 891139, 885416, 880564, 877858, 877339, 879267, 885985, 899961, 920463, 944029, 967359, 987793, 1002067, 1007285, 1002920, 990003, 969140, 941432, 910342, 879864, 851130, 823034, 795609, 770292, 747318, 725565, 704792, 685567, 667105, 647874, 628517, 611714, 598823, 588828, 580712, 574458, 569378, 563909, 557841, 552687, 549138, 546031, 542419, 538767, 535307, 530961, 524919, 517904, 510988, 504153, 496718, 488372, 479459, 470994, 464386, 460147, 456895, 452742, 447640, 443261, 440735, 439689, 439284, 438948, 438302, 437720, 438824, 443043, 449819, 457514, 465593, 474317, 482665, 488517, 490858, 490061, 486162, 478923, 469800, 461573, 455280, 449254, 441957, 434090, 427000, 420502, 413489, 405802, 398446]
55632C98446o087m815m392m782m744l056m56R09N65O07K478M575M573K678Q89
55617C87388K11K38O07J181J522J473J527J727J216j18r31n13j10q72j928k002
55601C90616j452j068k92J501L241L622L228L287L389K439Q42k86j198k726m287
55586D00856m801m848n620o380n353k943j629k556m331n488o199o999p514p197
55572C28998o190m970l872l121k653k026j229j094k047l010k749j806j820l173
55558B89238m528m629l475j931j052j524k836l520l051k853m183n859n622l254
55544B40921p09N94R89J129R80N14N3m70j418k431k537j600o97o29r28o73L03
55527B33391J360J667P56j101k828l233j965K52K247L259L459L740M635N519N391
$$ y = [398446, 392359, 387544, 383152, 378370, 373626, 370570, 370114, 371023, 371588, 372195, 374673, 379248, 383821, 386499, 387388, 387599, 387837, 388444, 389625, 391147, 392620, 394147, 395874, 397090, 396972, 396041, 395528, 395418, 394546, 392618, 390616, 389164, 388096, 387804, 389305, 392546, 396168, 399396, 402683, 406072, 408511, 409353, 409067, 407869, 405143, 400856, 396055, 391207, 385587, 379207, 373854, 370911, 369282, 366726, 362395, 356907, 350708, 343709, 336195, 328998, 322808, 317838, 313966, 310845, 308192, 306166, 304937, 303843, 301796, 298786, 296037, 294231, 292411, 289238, 284710, 280081, 276606, 274675, 273623, 272099, 269263, 265743, 262692, 259839, 255656, 249797, 244175, 240921, 240212, 240806, 241795, 242924, 243904, 244418, 244471, 244001, 242583, 240152, 237615, 236015, 235318, 234689, 233761, 233088, 233391, 234751, 236418, 237174, 236073, 233245, 230012, 228047, 228299, 230546, 233805, 237264, 241004, 245639, 251158, 256549]
55512B56549M413L831M319N376O413P248P246N522K679Q24Q05P78j213m403o530
55497B93857o911o682o667o573o116n536m938m163l260k463j840j363r91l45R00
55482B36909K098K079R47J74L54M01k53l86P91J829J229j21o23q07k283m627n691
55465B32020m728l202k606l199m602n992n902l533k85J496J168k7j070j810j962
55450A95766j173j89k95j428k209j898j121o15m96p35j311j841k032k212k592
55435A75619k557j703q76r70j484j616j823k571k555l57K802M299L709K871K579
55420A75367J836M88l1Q18J766J997K240K813K759J778J031R65K31j966m127m382
55404A83583k852q12J111K629K899J449n94j483o12J302L149L837K687K70j766
$$ y = [256549, 260962, 264793, 269112, 274488, 280901, 288149, 295395, 300917, 303596, 304420, 305225, 306003, 304790, 300387, 293857, 286946, 280264, 273597, 267024, 260908, 255372, 250434, 246271, 243011, 240548, 238708, 237345, 236354, 236009, 236909, 239007, 241086, 242033, 242207, 242561, 242962, 242709, 242323, 243114, 244943, 246172, 246051, 245428, 244621, 242338, 237711, 232020, 227292, 224090, 221484, 218285, 213683, 207691, 201789, 198256, 197971, 199467, 200635, 200608, 199538, 197728, 195766, 194593, 194404, 194109, 192681, 190472, 188574, 187453, 186838, 186342, 185607, 184296, 182455, 180423, 178211, 175619, 173062, 171359, 170483, 169513, 168029, 166413, 164590, 162019, 159464, 159107, 161909, 166208, 169917, 172788, 175367, 177203, 177691, 177660, 178478, 180244, 182241, 184481, 187294, 190053, 191831, 192862, 193827, 194058, 192092, 187965, 183583, 180731, 179919, 181030, 183659, 186558, 188007, 187413, 185930, 185318, 186620, 189769, 193606, 196293, 196563, 194797]
55389A94797k377k083j729j259l92K80j8r36j300n77N61J016L09j012j892j883
55373A81505j583j605j558q16K06O55Q05J550K462K045L24n71Q19L375N154N784
55357A98551N996N954N341M401L647K887J612K8j143j697k015k275k282j962j602
55342B15441j501j728k132k449k522k441k275j783q54m6j35j116k198k668k281
55327A89312j033O28J581J053j78n31K90J005N89n23j274j086K0J401J827N96
55311A93677j132j370K6R07l32k668l925l368j999j039r41j409j754j553j218
55296A71902j425j913j657l70J029J771J985J864J118j86j240j524j395j206p46
55281A68007j18k0n33n73O13K169K606J489m60k179k689j532M90J813J800J209
$$ y = [194797, 192420, 190337, 188608, 187349, 186957, 187237, 187219, 186283, 184983, 184406, 184967, 185983, 186292, 185280, 183388, 181505, 179922, 178317, 176759, 175943, 176149, 176804, 177609, 179159, 181621, 183666, 183990, 183419, 184238, 187613, 192767, 198551, 204547, 210501, 215842, 220243, 223890, 226777, 228389, 228417, 227274, 225577, 223562, 221287, 219005, 217043, 215441, 213940, 212212, 210080, 207631, 205109, 202668, 200393, 198610, 197756, 197710, 197575, 196459, 194261, 191593, 189312, 188279, 188907, 190488, 191541, 191363, 190832, 191122, 192127, 192716, 192193, 190919, 189833, 189853, 191254, 193081, 193677, 192545, 191175, 191201, 192108, 191776, 189108, 185183, 181815, 179816, 178777, 177836, 176427, 174673, 173120, 171902, 170477, 168564, 166907, 166537, 167566, 169337, 171322, 173186, 174304, 174118, 172878, 171354, 169959, 168753, 168007, 167889, 167869, 167336, 166763, 167376, 169545, 172151, 173640, 173180, 171001, 168312, 166780, 167270, 169083, 170883, 172092]
55265A72092O10m09j824k295r64R20J485O76j54m07o15r72r43m13q3l80p96o23
55247A64905J01O43M67JL29J721K725J663r16k471j595K72J035O50N16J066J445
55230A72557J175Q05R15J361J660J449O51l54r86j275j892k978l519k614p90P29
55214A66894J517J914K021J670J147J016J352J768J981J840J162J33n53n98n86
55199A82678r35j045l61M58N68M44J122K244K368J178mj56K27K01l33q40r22m87
55181A86405K45O30P1j180k160k281j730r26j75O7n71j610j920j104j05Mo53j160
55163A71847j107r19r54r48n27J55P07J216K050K827K370K99j901k350j106Q6
55147A71745K49M0J9m05j433j800n23J315J940J361R61J200J340J158J217J355
$$ y = [172092, 172702, 172293, 170469, 168174, 167210, 168130, 169615, 170291, 170137, 169730, 169115, 168143, 167200, 166787, 166704, 166324, 165528, 164905, 165006, 165649, 166116, 166117, 166446, 168167, 170892, 172555, 171639, 169168, 167573, 167845, 168880, 169530, 170046, 171112, 172557, 173732, 174537, 175452, 176813, 178473, 179922, 180573, 180219, 179233, 177958, 176066, 173088, 169569, 166955, 166165, 166894, 168411, 170325, 172346, 174016, 175163, 176179, 177531, 179299, 181280, 183120, 184282, 184415, 183862, 183264, 182678, 181743, 180698, 180337, 180795, 181363, 181807, 182929, 185173, 187541, 188719, 188715, 188559, 188786, 188987, 188654, 187814, 186892, 186405, 186650, 187280, 187351, 186171, 184011, 181730, 180000, 179074, 178899, 178966, 178395, 176785, 174865, 173761, 173656, 173660, 173007, 171847, 170740, 169821, 168867, 167919, 167392, 167547, 168254, 169470, 171520, 174347, 176717, 177016, 175115, 172765, 171659, 171745, 171994, 172034, 172053, 171648, 170215, 168415, 167892, 169207, 171147, 172508, 173469, 174669, 176009, 177167, 178384, 179739]
55131A79739O18r02j603m84J355K131J467L36m39q27j098j301j217o47K01O73
55115A78002L87j91l55k07l00m68kR48J284O71K49R24J892J780N83n21q28n91
55097A83257q0P45J551J577N86p29j599j932j954j625q07K61J126J490J205J52
55081A83224j314k035r38J576L754M253L340J988N13j192k539k573j435m86n56
55066A85580q81l92O70J142N72l30p06k92P33J985K819K626J510L04l33m73m92
55049A94042l42K58J098J472J085N79O59Q77K7j985l399k449L39K512K412P89
55033A97974l84l2J387K693K991K177R92L78N75J040J247J191J046Q55P70J065
55017B15965J629J859J407O76K26O0j88o79j239j567j413q40l82m52o14j33P73
$$ y = [179739, 180357, 179455, 177852, 177368, 178723, 180854, 182321, 182657, 182218, 181391, 180293, 178992, 177775, 177128, 177329, 178002, 178389, 178198, 177843, 177636, 177336, 176868, 176866, 177814, 179098, 179769, 180018, 180942, 182834, 184614, 185197, 184676, 183848, 183257, 183177, 183922, 185473, 187050, 187636, 186907, 185308, 183376, 181422, 179797, 178990, 179251, 180377, 181867, 183072, 183224, 181910, 179875, 178937, 180513, 184267, 188520, 191860, 193848, 194361, 193169, 190630, 188057, 186622, 186136, 185580, 184699, 184307, 184977, 186119, 186691, 186361, 185655, 185363, 186096, 188081, 190900, 193526, 195036, 195340, 195007, 194534, 194042, 193700, 193958, 195056, 196528, 197613, 198192, 198851, 199728, 199755, 197770, 194371, 191922, 192261, 194773, 197185, 197974, 197590, 197558, 198945, 201638, 204629, 206806, 207798, 208176, 208751, 209791, 211038, 212229, 213275, 214130, 214900, 215965, 217594, 219453, 220860, 221536, 221762, 221822, 221634, 220955, 219716, 218149, 216736, 215896, 215514, 215062, 214448, 214315, 215088]
55000B15088J088O21L28N34O1j904m036m319k756j207q04p96k29N51N89j20n32
54983B02157J87J691K752K384O47j533l066l099j368J176K509J413p85j559l67
54968B03139Q86R52R78K112L079K030l19j492p12M08N04j23q20j562k098j704
54952B05258m45N71Q55J208K089K394R95j304k445j524K88J219P21k41m85PJ75
54935B09336n68j416j276l71J79J23L10R93J084l08k364l277k141L53K635L347
54919B06639K262N87K0J035K385K595J666Q48R29J378J208L40l12o5N56N11k02
54902B22380l58P85K349L003K701K283J737K24k080l444k566k47J603K009J384
54887B31763M85l05q23r67p29q1J030K314L023K569J294J36l78n13n84l38O25
$$ y = [215088, 216176, 216797, 217125, 217659, 217720, 215816, 211780, 207461, 204705, 203498, 202694, 201898, 201669, 202220, 202809, 202689, 202157, 202344, 204035, 206787, 209171, 209818, 208285, 205219, 202120, 200752, 201928, 204437, 205850, 205065, 203506, 203139, 204025, 204977, 205955, 208067, 211146, 213176, 212857, 211365, 210653, 211061, 211565, 211442, 210622, 209060, 206962, 205258, 204813, 205384, 206239, 207447, 209536, 211930, 212925, 211621, 209176, 207652, 207940, 209159, 209880, 209639, 209154, 209161, 209336, 208768, 207352, 206076, 205705, 205884, 206007, 206317, 207310, 208394, 208086, 205722, 202445, 200304, 200657, 203292, 206639, 208901, 209488, 209508, 210543, 212928, 215523, 217189, 218037, 218966, 220344, 221552, 221892, 221580, 221515, 222071, 222582, 222380, 222022, 222807, 225156, 228159, 230860, 233143, 234880, 235104, 233024, 229580, 227014, 226767, 228370, 230379, 231763, 232248, 231943, 231120, 230153, 229424, 229343, 230373, 232687, 235710, 238279, 239573, 239709, 239331, 238818, 238234, 237896, 238521]
54870B38521K071L232L776M194N013O065O862P330P583P333O366N414N560O583
54856C15903O967N886M135K579Q19j687m141n345n510n905o996q001q229p752
54842B82723o829n570m187k874j556l33J15o10j696j935j171j04R55K032K635
54827B61595K223J362J195J829K488L070M083N197N504N442O550Q813J0017Q718
54813C28086O183M267K765M07k546m419m560m162m705o422q403r477r078p740
54799B80196o596o124n720m790l689k997k465j535n27m19j444k663l082k708k268
54784B33169k170j987j095M09J602J689P87m66j702k722l090k528j554q74l63
54769B19105M79J224Q79m15j259r69m65o49j051q07p3L97M39M23N54R24J693K617
$$ y = [238521, 240592, 243824, 247600, 251794, 256807, 262872, 269734, 277064, 284647, 291980, 298346, 303760, 309320, 315903, 322870, 328756, 332891, 335470, 336289, 334602, 330461, 325116, 319606, 313701, 306705, 298704, 290475, 282723, 275894, 270324, 266137, 263263, 261707, 261374, 261489, 260879, 259183, 257248, 256077, 255973, 256928, 258960, 261595, 263818, 265180, 266375, 268204, 270692, 273762, 277845, 283042, 288546, 293988, 300538, 309351, 319368, 328086, 334269, 338536, 341301, 341708, 339162, 334743, 330183, 326021, 321316, 314894, 306491, 297014, 287936, 280196, 273600, 267476, 261756, 256966, 253277, 250280, 247815, 246280, 245753, 245334, 243890, 241227, 238145, 235437, 233169, 230999, 229012, 227917, 228326, 229928, 231617, 232404, 231938, 230236, 227514, 224424, 221896, 220342, 219468, 219105, 219584, 220808, 221687, 221272, 220013, 219044, 218579, 217930, 216879, 216072, 215999, 216396, 216835, 217258, 217812, 218736, 220429, 223046]
54751B23046K865J989O04m14r66j369j557j211l50P51J840K533K379J451M00l95
54735B31596j115j659j359l9J485K517L212L639L201J870R36J280J757Q04q94
54720B47231r96J410M704O861P351O655N227L644K930L792N765P558Q311Q297
54706C18740Q380Q837Q822P395M919K789J605M19j571l495l952l166k808l719
54692C43195m940n215m596m073m217m732n125n324n460n325m471l004j915j994
54678B82804k614k349q45P60J448J465J513J706J888K211K747L294M103N846Q176
54663C12153R295Q058N694M235L910L342J830K3j467k764m078n371o695p920q316
54648C11929p421o067n536n765n575m551l457k747j962r50m56r91j956k422k099
$$ y = [223046, 225911, 227900, 228504, 228090, 227124, 225755, 224198, 222987, 222637, 223388, 225228, 227761, 230140, 231591, 231991, 231596, 230481, 228822, 227463, 227424, 228909, 231426, 234638, 238277, 241478, 243348, 244284, 245564, 247321, 248125, 247231, 246235, 247645, 252349, 259210, 266561, 273216, 278443, 282087, 285017, 288809, 294574, 302132, 310443, 318740, 327120, 335957, 344779, 352174, 357093, 359882, 361487, 361906, 360335, 356840, 352888, 349722, 346914, 343195, 338255, 333040, 328444, 324371, 320154, 315422, 310297, 304973, 299513, 294188, 289717, 286713, 284798, 282804, 280190, 277841, 276996, 277756, 279204, 280669, 282182, 283888, 285776, 287987, 290734, 294028, 298131, 303977, 312153, 321448, 329506, 335200, 339435, 343345, 346687, 348517, 348540, 347073, 344309, 340231, 334860, 328165, 320245, 311929, 304508, 298441, 292905, 287140, 281565, 277014, 273557, 270810, 268848, 267898, 267442, 266451, 264495, 262073, 259974]
54633B59974j278m20k0l24j000j576k075k623k798k331k129l212m671m271j580
54618B29666R68R40j300l461l972k817p34J247J988J196Q9K41J815L536M201L543
54602B37146J843m96k770m044l799k381o47O55J149P60k62j206j159R7J560J882
54586B28328R99K26M81J117J092M34k93j202k412k847j403Q40J378l31k024j743
54570B22640j61J092J817K627L266L103K519K181J649K88r14k44K018L440K336
54555B47657m48k950m043l520j657N44J595R87q2j30R17J982K201J503L06o92
54539B44170q53m03l52j094j618j019r4k51j228j460o27j33o24q20K16J289J016
54522B36115K60P13J900J827L31n76jM65l26r45K67K242K638J329M62J221K355
$$ y = [259974, 258696, 258276, 258256, 257932, 256932, 255356, 253281, 250658, 247860, 245529, 243400, 240188, 235517, 231246, 229666, 230634, 231574, 230274, 226813, 222841, 220024, 219290, 220537, 222525, 223721, 223810, 224051, 225866, 229402, 233603, 237146, 238989, 238493, 235723, 231679, 227880, 225499, 224852, 225507, 226656, 227416, 227154, 225948, 224789, 224886, 226446, 228328, 229327, 229553, 230034, 231151, 232243, 232677, 232384, 231182, 228770, 225923, 224520, 225360, 226738, 226407, 224383, 222640, 222479, 223571, 225388, 228015, 231281, 234384, 236903, 239084, 240733, 241021, 240107, 239863, 241881, 245321, 247657, 247209, 244259, 240216, 236696, 235039, 235583, 237178, 238165, 238083, 237953, 238870, 240852, 243053, 244556, 244862, 244170, 243317, 242914, 242562, 241468, 239850, 238831, 238737, 238486, 237258, 235798, 235171, 235038, 234414, 233594, 233810, 235099, 236115, 236375, 237088, 238988, 240815, 241146, 240570, 240569, 241034, 240708, 239763, 240030, 242272, 244910, 246239, 246701, 247922, 250277]
54505B50277K141M26j666k965k834j477n9K25m21n83M67J800K211J875J914K641
54489B53972L017K062L00o38K9J166J146M7l61R49K805L348K102o5k217l499l003
54472B61160r13P82L70j124j313j63j49k309m332l750j199R77J931K294K093Q18
54456B55173q69j460p99k89o72j073p17j87j83j30Q85K495L340K777J465M31J41
54439B60328M33P92O98J76j55O4K08m74j486j509l54N86M42K63J274K656K578
54422B66520J086J50O88J306O74m27n96J9L96N54J130J736J396M73M36J590K498
54405B79629K080J064Q03J601K781L575L459K320P55k81n06n17r29j843l095m214
54389B86682m227k546k27Q06P8j004j379j584k120k086p30P76O81p81j774j512
$$ y = [250277, 252418, 252844, 251178, 248213, 245379, 243902, 243843, 244068, 243647, 243064, 243531, 245331, 247542, 249417, 251331, 253972, 256989, 259051, 259351, 258713, 258742, 259908, 261054, 261101, 260740, 261689, 264494, 267842, 269944, 269879, 267662, 264163, 261160, 260247, 261029, 261399, 260275, 258962, 258799, 258650, 256341, 252009, 248259, 247060, 248037, 249968, 252262, 254355, 255173, 254304, 252844, 252045, 251756, 251084, 250011, 249294, 249107, 248924, 248794, 249679, 252174, 255514, 258291, 259756, 260187, 260328, 260761, 261553, 262251, 262427, 262272, 262336, 262544, 262070, 260584, 259075, 258721, 259307, 259749, 260012, 261286, 263942, 266520, 267606, 267756, 268444, 269750, 270424, 269997, 269401, 269420, 269816, 270370, 271500, 273236, 274632, 275105, 275541, 277131, 279629, 281709, 282773, 283576, 285177, 287958, 291533, 294992, 297312, 298067, 297786, 297280, 296763, 295834, 293991, 290896, 286682, 282455, 279909, 279682, 280488, 280566, 279562, 278183, 276599, 274479, 272393, 271663, 272439, 273120, 272339, 270565, 269053]
54373B69053j069j346j629p19J279L006L271K061L39q15r66l87L78Q52O69j59
54357B73818q54l71J267K554J967k60k211k059L01L076L974K255m11j621q95J40
54341B80670L03L71J247K012J231m56q63P52K770L591L416L140K788J996J171
54326C04139J034J478J798J777J703J474O70l69l71J351L788N196M989M132L798
54311C36587M165M593M432L371J521m79j774k165k388l073l711l315j918p02n03
54296C34641q32o93J26Q65O11q21k669l805l749k990k172j393o91n55j170j695
54280C13008j424j239k448m382m870l341j567q05j52J165J852O06j333j749n76
54265B92745N19J011J692K381J816O1j039n47K85J92k83j90j2p25j909k241j414
$$ y = [269053, 267984, 266638, 265009, 264290, 265569, 268575, 271846, 273907, 274246, 273431, 272465, 272078, 272456, 273308, 273977, 273818, 272964, 272593, 273860, 276414, 278381, 278121, 275910, 273851, 274152, 277228, 281202, 283457, 283046, 281425, 280530, 280670, 280973, 281344, 282591, 284603, 285834, 285378, 284515, 285267, 288037, 291628, 295044, 298184, 300972, 302968, 304139, 305173, 306651, 308449, 310226, 311929, 313403, 314073, 313704, 313333, 314684, 318472, 323668, 328657, 332789, 336587, 340752, 345345, 349777, 353148, 354669, 354190, 352416, 350251, 347863, 344790, 341079, 337764, 335846, 335144, 334641, 333809, 333116, 333242, 334107, 334718, 333897, 331228, 327423, 323674, 320684, 318512, 317119, 316428, 315873, 314703, 313008, 311584, 310345, 307897, 303515, 298645, 295304, 293737, 292932, 292780, 293945, 295797, 296403, 295070, 293321, 292745, 293264, 294275, 295967, 298348, 300164, 300225, 299186, 298639, 298924, 299116, 298833, 298643, 298631, 297906, 295997, 293756, 292342]
54248B92342m10l4j80n26j141k146l233l851l684k772j264P83L111M806M661K543
54232B89005L8r91m51J21k40q13o16M2K20p0O0R04J651J582J001O45N93L52j56
54213B92877k90L37J074R34K1l90N94K374L659L945L607K910J720K05r37j201
54197C11439p45N1J024J904K064J178p5m46N14J843K168J233J12j21M25Q79Q11
54180C24258M66K3n78j006p61k30o27k168l341k917j893k147l610m207k644N2
54164B98670J982K286J372J66m44k13R2l52j046o57Q90J978J423j36j562k744
54148C01705l841m027k505j63J148Q93J64j95m56q05n11R47K747L498K805J520
54132C02924O43M43M68Q6q33j590j268O3J123R37K77Q13K790M452M158K318M89
$$ y = [292342, 291932, 291898, 291718, 291192, 290051, 287905, 284672, 280821, 277137, 274365, 273101, 273884, 276995, 281801, 286462, 289005, 289043, 288052, 287601, 287722, 287482, 286669, 286053, 286095, 286315, 286245, 286305, 287209, 288860, 290442, 291443, 292088, 292681, 293033, 292877, 292587, 292924, 293998, 294932, 294953, 294563, 295157, 297531, 301190, 305135, 308742, 311652, 313372, 313577, 312640, 311439, 310694, 310745, 311769, 313673, 315737, 316915, 316840, 316394, 316908, 318751, 320919, 322152, 322264, 322143, 322568, 323447, 324258, 324724, 324747, 324169, 323163, 322402, 322172, 321545, 319377, 316036, 313119, 311226, 309079, 305469, 301262, 298618, 298670, 300652, 302938, 304310, 304476, 304032, 303819, 303911, 303559, 302513, 301856, 302746, 304724, 306147, 306011, 304449, 301705, 297864, 293837, 291332, 291169, 292317, 293210, 293374, 293179, 292723, 291918, 291407, 292354, 295101, 298599, 301404, 302924, 303567, 304010, 304478, 304564, 303731, 302141, 300873, 300936, 302059, 302996, 303273, 304086, 306876, 311328, 315486, 317804, 318293]
54115C18293p50j985l250l518k308o88L0k30q53j793l188m221l670j635K86P58
54099B91278q4j161j390j46K183L909L380J013r63j151m56l39p72q72o57q64j447
54082B91461j516p64J41P22J329K333L332L568K814J614Q92J213K176K680K187
54067C14182J460J588K536L345L564L569L484K839J709J169J911L120L600L488
54053C51564L799M456L994J556j721l956m542m266l838l305k794k769l075k594
54039C32509p90R49P05j214k233q25J198Q85k019m777n134l609j894l61J607L585
54023C18582L995K248o3p24P97K988L981L301K126K025L283M433L747J312q00
54008C51231p26J229L176L825L470K994K691K310J637O75m19j264j427j011o84
$$ y = [318293, 317543, 315558, 312308, 308790, 306482, 305794, 305824, 305594, 304741, 302948, 299760, 295539, 291869, 290234, 290520, 291278, 291194, 290033, 288643, 288497, 290680, 294589, 297969, 298982, 298019, 296868, 296412, 296073, 295301, 294429, 293772, 292908, 291461, 289945, 289181, 289322, 290044, 291373, 293706, 297038, 300606, 303420, 305034, 305926, 307139, 309315, 311995, 314182, 315642, 317230, 319766, 323111, 326675, 330244, 333728, 336567, 338276, 339445, 341356, 344476, 348076, 351564, 355363, 359819, 363813, 365369, 363648, 359692, 355150, 350884, 347046, 343741, 340947, 338178, 335103, 332509, 331719, 332668, 333373, 332159, 329926, 329101, 330299, 331184, 329165, 324388, 319254, 315645, 313751, 313390, 314997, 318582, 322577, 324825, 324762, 324038, 324835, 327823, 331804, 335105, 337231, 339256, 342539, 346972, 350719, 352031, 351231, 350505, 351734, 354910, 358735, 362205, 365199, 367890, 370200, 371837, 372512, 372093, 370829, 369402, 368391, 367707]
53993C67707o72j13J903M735O562O589O055O383P094O598M895M062N598Q266R595
53978D45257Q926P835P736Q339Q815R275J0229J1256J1359J0412R333Q714Q086
53965E65572O774M891L234K457K583L036L041K274J082l8j055k125k962l192l247
53950E82325m052n600o627o230n153m882n879p334q392q874q863q307p205n870
53936D89057m741l992l381k407p48J273K701K631J055q51j467o7K457M395M952
53921D90867M782M688M461L490J862m3k399n239p305p202n645m931n712n943l890
53906D61841p41Q86J09j641k521j807j64Q50K51r52p52R78K103J513J017K460
53890D63430M647N175M063L255L431L862M726O806R022R136P242N990O725P887
$$ y = [367707, 367035, 366922, 368825, 373560, 380122, 386711, 392766, 399149, 406243, 412841, 417736, 421798, 427396, 435662, 445257, 454183, 462018, 469754, 478093, 486908, 496183, 506412, 517668, 529027, 539439, 548772, 557486, 565572, 572346, 577237, 580471, 582928, 585511, 588547, 591588, 593862, 594944, 594906, 593851, 591726, 588764, 585572, 582325, 578273, 572673, 566046, 559816, 554663, 549781, 543902, 536568, 528176, 519302, 510439, 502132, 494927, 489057, 484316, 480324, 476943, 474536, 473788, 475061, 477762, 480393, 481448, 480597, 479130, 479063, 481520, 485915, 490867, 495649, 500337, 504798, 508288, 510150, 510107, 507708, 502469, 495164, 487962, 482317, 477386, 471674, 465731, 461841, 461100, 461986, 462095, 460454, 457933, 456126, 455962, 456812, 457063, 456111, 455359, 456337, 458440, 459953, 460970, 463430, 468077, 473252, 477315, 480570, 484001, 487863, 492589, 499395, 508417, 517553, 524795, 530785, 537510, 545397]
53876E45397Q038P916Q323Q326P161N955N825N978N415N013N979P529Q125Q074
53862F43054Q786J0050J0200Q834P512P676R221J1222J2776J3156J2381J1618
53850G66486J1874J2398J1544R167O817N458M453L082J722P59l69k138l824m461
53836H22968m444n095o831q681r781j0424j1243j1962j1815j0976j0629j1312
53824G09775j2053j1748j0744j0104r812q927p471o801p728r407j0566j0910j0666
53811E82838r865q794q180q138p776o735o120o803p795p668o795o527o669n669
53797D79304l323j459j478k661l639m235m892n257m530k923j798k145l309l567
53783D34088j941N59J878J147m96j497j694j838j975j489m79J30L6J7N68J074
$$ y = [545397, 553435, 561351, 569674, 578000, 585161, 591116, 596941, 602919, 608334, 613347, 619326, 626855, 634980, 643054, 651840, 661890, 672090, 680924, 688436, 696112, 705333, 716555, 729331, 742487, 754868, 766486, 778360, 790758, 802302, 811469, 818286, 823744, 828197, 831279, 833001, 833760, 833391, 831253, 827429, 822968, 818524, 813429, 806598, 797917, 788136, 777712, 766469, 754507, 742692, 731716, 721087, 709775, 697722, 685974, 675230, 665126, 655314, 646387, 638916, 632115, 624387, 614980, 604414, 593504, 582838, 572973, 564179, 555999, 547861, 540085, 533350, 527230, 520427, 512632, 504964, 498169, 491642, 484973, 479304, 475981, 474522, 473044, 470383, 466744, 462509, 457617, 452360, 447830, 444907, 443109, 440964, 437655, 434088, 432147, 432706, 434584, 435731, 435235, 433738, 432044, 430206, 428231, 426742, 426263, 426393, 426429, 426446, 427014, 428088]
53767D28088R18N91R62J871K197J286k34j144q43J23P32O00L62R23K501M543O289
53750D49765P265P473P399P523P637P128O173N945P036Q361Q574Q022Q122R139
53736E55562R876R564Q775Q153P457O400N476N213N278M917L937K715J664J011
53722F35998O87J43j375l905o404p555o913n235l936m078n471o831p266p367q226
53707E62266r615j0103q986p191n979n572n452n231m782m139l660l858m694n475
53693D77529n601n023l934k679j855j697j340J61J909J628j308m517n240l475
53679D44558j527j106j840k199j119R41K109R91j264j864m0J604O91j450j748
53664D36737J37J731J807J868L099M221L655K124J505K136K752K490J652Q95P30
$$ y = [428088, 429006, 429597, 430559, 432430, 434627, 435913, 435679, 434535, 433692, 433815, 434547, 435147, 435509, 436432, 438933, 443476, 449765, 457030, 464503, 471902, 479425, 487062, 494190, 500363, 506308, 513344, 521705, 530279, 538301, 546423, 555562, 565438, 575002, 583777, 591930, 599387, 605787, 611263, 616476, 621754, 626671, 630608, 633323, 634987, 635998, 636685, 636828, 635453, 631548, 625144, 617589, 610676, 605441, 601505, 597427, 591956, 585125, 577859, 570492, 562266, 552651, 542548, 533562, 526371, 520392, 514820, 509368, 504137, 499355, 495216, 491556, 487698, 483004, 477529, 471928, 466905, 462971, 460292, 458437, 456740, 455400, 455561, 457470, 459098, 457790, 453273, 448033, 444558, 443031, 441925, 440085, 437886, 436767, 437708, 439817, 440808, 439544, 437680, 437640, 439244, 439935, 438485, 436737, 436874, 438605, 440412, 442280, 445379, 449600, 453255, 455379, 456884, 459020, 461772, 464262, 465914, 466809, 467539]
53649D67539J599L415N044N202L989K886L080M299N413N671N156M448M090M206
53635E26037M561N032N800O798P235O384M827M082M620N010L740J420J16N82J323
53620E87567P82n87j204o70q3l19j115j866k394k618k293j554j055j126j321j200
53604E68944r59p50o4J390K719K744J652P46O26N61q9p91o45K98J204J587J710
53587E80883J970K321K476K480K761L521M208M041L095K396K619L244L460L305
53573F22780L202K844J697L55J55J261K364K634K821L769M933N238M621L795L220
53558F65689L114L812N101N886N633N490O632Q055P730N669L988L748L698K783
53544G37028J965K395L304L214K207J446J212R50O94R13J228P69j82l84L90Q89
$$ y = [467539, 469138, 472553, 477597, 482799, 486788, 489674, 492754, 497053, 502466, 508137, 513293, 517741, 521831, 526037, 530598, 535630, 541430, 548228, 555463, 561847, 566674, 570756, 575376, 580386, 584126, 585546, 585662, 586244, 587567, 588349, 587762, 586558, 585888, 585805, 585486, 584371, 582505, 580111, 577493, 575200, 573646, 572591, 571465, 570144, 568944, 567985, 567235, 567171, 568561, 571280, 574024, 575676, 576422, 577048, 577609, 577520, 576729, 576084, 576382, 577586, 579173, 580883, 582853, 585174, 587650, 590130, 592891, 596412, 600620, 604661, 607756, 610152, 612771, 616015, 619475, 622780, 625982, 628826, 630523, 630878, 631033, 632294, 634658, 637292, 640113, 643882, 648815, 654053, 658674, 662469, 665689, 668803, 672615, 677716, 683602, 689235, 694725, 701357, 709412, 717142, 722811, 726799, 730547, 734245, 737028, 738993, 741388, 744692, 747906, 750113, 751559, 752771, 753721, 754415, 755328, 756556, 757325, 757143, 756759, 757149, 758038]
53528G58038J77j179k103k185j529l72O44N99p72k766m440n124m439k795j766
53513G29988k602m244m337k611j422k047k460m59K587L379J276j095j593p11K47
53498G13896J112K129K904L014K730K345J674Q00M78J106J918J968J432J376K602
53483G41484N088Q019R974R733P563N453N438P720J0687J2528J2640J1825J1428
53470H59580J2098J3277J4064J4422J5138J6665J8685K0779K2694K3973K4217
53459A055592K4038K4721K6470K8073K8873K9969L2376L5031L6060L5520L5375
53448A392098L6773L8702L9533L8857L7332L5625L4134L3248L3337L4496L6357
53437A790492L8087L8742L8000L6438L4805L3292L1897L1004L0868L0890L0344
$$ y = [758038, 758215, 757036, 754933, 752748, 751219, 750847, 751491, 752090, 751318, 748552, 744112, 738988, 734549, 731754, 729988, 727386, 723142, 718805, 716194, 714772, 712725, 710265, 709806, 712393, 715772, 717048, 715953, 714360, 713649, 713896, 715008, 717137, 720041, 723055, 725785, 728130, 729804, 730604, 731082, 732188, 734106, 736074, 737506, 738882, 741484, 746572, 754591, 764565, 774298, 781861, 787314, 792752, 800472, 811159, 823687, 836327, 848152, 859580, 871678, 884955, 899019, 913441, 928579, 945244, 963929, 984708, 1007402, 1031375, 1055592, 1079630, 1104351, 1130821, 1158894, 1187767, 1217736, 1250112, 1285143, 1321203, 1356723, 1392098, 1428871, 1467573, 1507106, 1545963, 1583295, 1618920, 1653054, 1686302, 1719639, 1754135, 1790492, 1828579, 1867321, 1905321, 1941759, 1976564, 2009856, 2041753, 2072757, 2103625, 2134515, 2164859]
53426B164859K9612K9624L0150K9885K8460K7070K6502K5848K4150K2241K1504
53415B459905K1485K0289J7223J3612J0759Q362N431J715k421o626j0262j2301
53403B527171j2540j2454j3697j5873j7000j6346j5698j7151k0480k3546k4981
53392B337405k5370k5877k6540k6546k5778k5227k5721k6679k6722k5381k3551
53381B054013k1979k0024j6724j2651r541q025o879m886k424m41J120K882M713
53368A959154O053P118Q612J0451J2002J3390J5380J7952K0343K2658K6000L0466
53356B149579L4403L6397L6903L7089L7277L7555L8873M1992M5919M8815N0317
53345B595119N1689N3882N6579N9200O1736O4330O7004P0014P3637P7426Q0396
$$ y = [2164859, 2194471, 2224095, 2254245, 2284130, 2312590, 2339660, 2366162, 2392010, 2416160, 2438401, 2459905, 2481390, 2501679, 2518902, 2532514, 2543273, 2551635, 2557066, 2558781, 2556360, 2549734, 2539472, 2527171, 2514631, 2502177, 2488480, 2472607, 2455607, 2439261, 2423563, 2406412, 2385932, 2362386, 2337405, 2312035, 2286158, 2259618, 2233072, 2207294, 2182067, 2156346, 2129667, 2102945, 2077564, 2054013, 2032034, 2012010, 1995286, 1982635, 1973094, 1965069, 1958190, 1953304, 1950880, 1950439, 1951559, 1954441, 1959154, 1965207, 1972325, 1980937, 1991388, 2003390, 2016780, 2032160, 2050112, 2070455, 2093113, 2119113, 2149579, 2183982, 2220379, 2257282, 2294371, 2331648, 2369203, 2408076, 2450068, 2495987, 2544802, 2595119, 2646808, 2700690, 2757269, 2816469, 2878205, 2942535, 3009539, 3079553, 3153190, 3230616, 3311012]
53334C311012Q2245Q3549Q4532Q4546Q3336Q1970Q1689Q2190Q1862P9653P6103
53323D212687P2546O9649O6892O3250N8452N3482M9558M6477M2513L6404K8966
53312D800876K2019J5972R381J159p817j5865k2711k9553l7201m5034n1957n7551
53300D581718o1904o5043o7121o8765p0598p2580p4219p5121p4968p3364p0468
53289C807567o7520o5920o5731o5713o4873o3373o1862o0634n9488n7960n5637
53278C118856n2782n0429m9081m7593m4463m0221l7143l6225l5838l4030l0913
53267B660138k7956k6034k5194k5349k6044k6288k5685k5016k4741k3891k1743
53256B382197j9539j8867j9004j7831j5013j2287j0546q753o103l431j652m05
$$ y = [3311012, 3393257, 3476806, 3561338, 3645884, 3729220, 3811190, 3892879, 3975069, 4056931, 4136584, 4212687, 4285233, 4354882, 4421774, 4485024, 4543476, 4596958, 4646516, 4692993, 4735506, 4771910, 4800876, 4822895, 4838867, 4848248, 4849407, 4841590, 4825725, 4803014, 4773461, 4736260, 4691226, 4639269, 4581718, 4519814, 4454771, 4387650, 4318885, 4248287, 4175707, 4101488, 4026367, 3951399, 3878035, 3807567, 3740047, 3674127, 3608396, 3542683, 3477810, 3414437, 3352575, 3291941, 3232453, 3174493, 3118856, 3066074, 3015645, 2966564, 2918971, 2874508, 2834287, 2797144, 2760919, 2725081, 2691051, 2660138, 2632182, 2606148, 2580954, 2555605, 2529561, 2503273, 2477588, 2452572, 2427831, 2403940, 2382197, 2362658, 2343791, 2324787, 2306956, 2291943, 2279656, 2269110, 2260357, 2254254, 2250823, 2249171, 2248766]
53244B248766R72K399L799N654Q073J0404J2547J5393J9075K2104K3456K4374
53232B397016K6547K9386L0762L0025K8610K7742K7148K6359K5801K5786K5476
53221B700658K3736K0597J7160J4221J1465Q088L849o38m571p691j0245j2401
53209B764228j4271j6404j9613k3930k8275l1750l4670l7702m0345m1365m0640
53198B435263l9683l9991m1552m3252m4169m4053m3067m1730m0798m0640m0667
53187A975661l9924l8315l6878l6573l7132l7429l6830l5660l4368l2786l0689
53176A579077k8638k7660k8010k8789k8816k7598k5366k2662k0117j8305j7495
53165A305621j7571j8208j8954j9260j8958j8593j8751j9182j9280j9396k0624
$$ y = [2248766, 2249738, 2252137, 2255936, 2261590, 2269663, 2280067, 2292614, 2308007, 2327082, 2349186, 2372642, 2397016, 2423563, 2452949, 2483711, 2513736, 2542346, 2570088, 2597236, 2623595, 2649396, 2675182, 2700658, 2724394, 2744991, 2762151, 2776372, 2787837, 2795925, 2799774, 2799136, 2794565, 2786874, 2776629, 2764228, 2749957, 2733553, 2713940, 2690010, 2661735, 2629985, 2595315, 2557613, 2517268, 2475903, 2435263, 2395580, 2355589, 2314037, 2270785, 2226616, 2182563, 2139496, 2097766, 2056968, 2016328, 1975661, 1935737, 1897422, 1860544, 1823971, 1786839, 1749410, 1712580, 1676920, 1642552, 1609766, 1579077, 1550439, 1522779, 1494769, 1465980, 1437164, 1409566, 1384200, 1361538, 1341421, 1323116, 1305621, 1288050, 1269842, 1250888, 1231628, 1212670, 1194077, 1175326, 1156144, 1136864, 1117468, 1096844]
53154A096844k2841k4167k3268k1249k0126k0128j9878j8816j7891j7716j7626
53143H73138j6975j6162j5758j5611j5467j5581j5985j6026j5406j4869j4983
53132G00315j4986j3994j2684j2453j3241j3566j2752j1664j1038j0385r103p555
53120E56894o372n618n257n535o061n528l391j180q49k234l396l287k765k882
53106E02539l474l813l708l422l241l496m251m772m103k593j799k296k599j238
53092D57734R17J714N97q60j298j155j518k362k658j794k57J001J409R84Mj251
53076D51207k321k431j051J276L155L620K958J981J049K38J2R20K651M020M056
53061D71340K868J426P93J371K562L165K476R46l93r55q89o92p95j180j198k33
$$ y = [1096844, 1074003, 1049836, 1026568, 1005319, 985193, 965065, 945187, 926371, 908480, 890764, 873138, 856163, 840001, 824243, 808632, 793165, 777584, 761599, 745573, 730167, 715298, 700315, 685329, 671335, 658651, 646198, 632957, 619391, 606639, 594975, 583937, 573552, 564449, 556894, 550522, 544904, 539647, 534112, 528051, 522523, 519132, 517952, 517103, 514869, 511473, 508186, 505421, 502539, 499065, 495252, 491544, 488122, 484881, 481385, 477134, 472362, 468259, 465666, 463867, 461571, 458972, 457734, 458651, 460365, 460962, 460102, 458804, 457649, 456131, 453769, 451111, 449317, 449060, 450061, 451470, 452454, 452458, 451207, 448886, 446455, 445404, 446680, 449835, 453455, 456413, 458394, 459443, 459681, 459693, 460613, 463264, 467284, 471340, 474208, 475634, 476427, 477798, 480360, 483525, 486001, 486947, 486554, 485599, 484710, 484018, 483223, 482043, 480845, 480612]
53045D80612J104J144q68l522m767m208l100k462k209j912j385o00J57J84p39
53030D57429j571j189o8L53k52r22j275j968l027l320k293r66m31m87m35j50L16
53013D39744J040J451M34j832l316k577q22k50j111j794j324m06j43p66j565j425
52997D25338J65K081K304N37q89P1K277L008J745M21K46M03J93L15J159J560M34
52980D41368j413k330j879r01j34K78K93j32p48j110r23j48R39J655J520J088
52964D37423J511K856L658K762Q66m49o85n29n04n48p42j300j787j290K34J559
52948D43035J580M79q00j608j583l60J816L581L596K244J222J223J118K2q64K97
52932D54998L124N000M122J506m38n19O08J732K167J886J328J134J589K264K364
$$ y = [480612, 481716, 482860, 481992, 478470, 473703, 469495, 466395, 463933, 461724, 459812, 458427, 457827, 457984, 458168, 457429, 455858, 454669, 454601, 454954, 454702, 453780, 452505, 450537, 447510, 444190, 441897, 440931, 440500, 440013, 439578, 439428, 439744, 440784, 442235, 442669, 440837, 437521, 434944, 434122, 433872, 432761, 430967, 429643, 429237, 429094, 428328, 426763, 425338, 425503, 427584, 429888, 430425, 429536, 429607, 431884, 434892, 436637, 437058, 437304, 437707, 437900, 438215, 439374, 440934, 441368, 439955, 437625, 435746, 434845, 434711, 434989, 435282, 435150, 434402, 433292, 432369, 432221, 433160, 434815, 436335, 437423, 438934, 441790, 445448, 448210, 449076, 448627, 447942, 447413, 446909, 446361, 445619, 444319, 442532, 441242, 441476, 443035, 444615, 445094, 444294, 442686, 441103, 440743, 442559, 446140, 449736, 451980, 453202, 454425, 455543, 455565, 454701, 454998, 458122, 463122, 467244, 468750, 468312, 467793, 468401, 470133, 472300, 474186, 475514, 476648, 478237, 480501, 482865]
52917D82865J524K09n24J94K122L702L341J125j118j691o37P40J316Q62j09p41
52901D93180n01J50J93o12j407j591j649k035k145j344l36l58j409k380k609k284
52885D72863j602o88j75n88j185n76J288K893L060K056O74n74j079j68J788L216
52869D81203K948J299q07k899m591n133m160k313n09Q57J526R96n87j857j536
52854D64437p5Q76M29p94j715j860j328l81O00J080O20o94k040k326j275J47Q36
52837D56537R20J336K163K415J699J023J370K337K861K556J606J23j493k109r06
52822D72438J377L051L290K689K221K235K397K093J071q4l73M09J377J812J948
52807D97951K073J766Q80L25O95Q78n31k947m477m519m061l643k833j943k194
$$ y = [482865, 484389, 484598, 484074, 484268, 486390, 490092, 493433, 494558, 493440, 491749, 491112, 491852, 493168, 494030, 493921, 493180, 492679, 492829, 493022, 492410, 491003, 489412, 487763, 485728, 483583, 482239, 481903, 481545, 480136, 477756, 475147, 472863, 471261, 470573, 470398, 469810, 468625, 468049, 469337, 472230, 475290, 477346, 478020, 477446, 476367, 476199, 477987, 481203, 484151, 485450, 484643, 481744, 477153, 472020, 467860, 465547, 465038, 465895, 467421, 468417, 467830, 465973, 464437, 464362, 465238, 465667, 464873, 463158, 461298, 459970, 459589, 460189, 461269, 461889, 461195, 459155, 456829, 455554, 455701, 456537, 457457, 458793, 460956, 463371, 465070, 466093, 467463, 469800, 472661, 475217, 476823, 476946, 475453, 473344, 472438, 473815, 476866, 480156, 482845, 485066, 487301, 489698, 491791, 492862, 492778, 492405, 492814, 494191, 496003, 497951, 500024, 501790, 502670, 502995, 503690, 504568, 504037, 501090, 496613, 492094, 488033, 484390, 481557, 479614, 477420]
52792D77420l485l864k339p23j274l650n678o242n865m981l406j526n35j003k155
52777D30694k877k775j980p64L61P77M62J73N97J590K417K491J725M92n94j118
52761D31671j194j127p78J93J349J498K26j159r45Q46K492K741K140J890K139
52746D41982K063J222M1j004j858k476k625k446k667l667m643m304k401j10J118
52731D18225P73n43j688j719n72P09Q82o9o76M08K747M446M062J854q31k871l835
52714D21302l637k339l67J417K195J757O80j00l6N11O19r3q48n68O81J679J684
52697D24537J428J916K822K891J819O90M70R16J326J541J674J522R66N07P30J518
52681D47273K417L385M385M579L026L29j429r27Q60J875J304J68j56O26J696K069
$$ y = [477420, 473935, 470071, 467732, 467009, 465735, 462085, 456407, 450165, 444300, 439319, 435913, 434387, 433852, 432849, 430694, 427817, 425042, 423062, 422298, 422659, 423436, 423898, 424071, 424668, 426258, 428675, 431166, 432891, 433383, 432789, 431671, 430477, 429350, 428572, 428765, 430114, 431612, 431838, 430679, 429734, 430580, 433072, 435813, 437953, 439843, 441982, 444045, 445267, 445308, 444304, 442446, 439970, 437345, 434899, 432232, 428565, 423922, 419618, 417217, 417107, 418225, 418998, 418455, 416767, 415048, 414476, 415185, 416067, 415998, 415322, 415730, 418477, 422923, 426985, 428839, 428008, 425137, 421302, 417665, 415326, 414959, 416376, 418571, 420328, 421008, 420908, 420872, 421383, 422002, 421909, 421061, 420493, 421174, 422853, 424537, 425965, 427881, 430703, 433594, 435413, 436103, 436573, 437489, 438815, 440356, 442030, 443552, 444518, 445025, 445755, 447273, 449690, 453075, 457460, 462039, 465065, 465394, 463965, 463038, 463898, 465773, 467077, 467245, 467089, 467715, 469411, 471480]
52665D71480J397Q1j094j499r49K02J219J392O03n26j157r91m49j75l70n80k59
52648D68325L37Q1j658l748m196k536l61Q94J613K563L035J925k2r70p19p87j563
52631D62213j498Q4J432R78j39Q3J286J414K4j180j082n17m77n98k57P4m31j494
52613D59915j986j342j09P85Q77L58k54n97n47R4J627L783N402N415M129K884
52597D80434K480K470K074J176K76n4L43R13P53k32q48j38R92P95p37j697r40
52580D88060M24Q26K90j33k6L44O95P41K15k88N17K657M127L323J335L59N82L69
52562E04417r07k141k562k691k971l100l136l624m049k799L50L054K918M09j819
52547D81349j899k11J589K210J656R92R78J022K44n84L78L127N112M480K433J055
$$ y = [471480, 472877, 472958, 471864, 470365, 469416, 469618, 470837, 472229, 472832, 472306, 471149, 470158, 469709, 469534, 469164, 468584, 468325, 468662, 468743, 467085, 463337, 459141, 456605, 456244, 457138, 458751, 461314, 464349, 466274, 466252, 465282, 464563, 463776, 462213, 460715, 460799, 462231, 463209, 463070, 463153, 464439, 465853, 465877, 464697, 463615, 463098, 462621, 462023, 461766, 461840, 461409, 459915, 457929, 456587, 456478, 457263, 458140, 458498, 458244, 457647, 457100, 457194, 458821, 462604, 468006, 473421, 477550, 480434, 482914, 485384, 487458, 488634, 488910, 488856, 489199, 490112, 490865, 490633, 489785, 489647, 490639, 491434, 490697, 489000, 488060, 488484, 489310, 489600, 489467, 489441, 489785, 490480, 491221, 491436, 491148, 491665, 494322, 498449, 501772, 503107, 503466, 504048, 504417, 503510, 501369, 498807, 496116, 493145, 490045, 486909, 483285, 479236, 476437, 476787, 479841, 482759, 483168, 481349, 479450, 479239, 480828, 483038, 484694, 485686, 486664, 487686, 487930, 487346, 487724, 490851, 495963, 500443, 502876, 503931]
52531E03931K81j166k845k936j192N91J216J315J611J688J200P86R28J006M44
52516E06858j64M7P69Q56k17j819k885k789j787p98m92n47k80J11k79j573k668
52499D92343k660j844r22q2N34L66o66j451r10L36N38r12k625k836j341N79J686
52482D80133J831J461P50k14o09O91L326N017M004J362m04o10o85j280j194K19
52466D93798J474J037l40q50p7J064J928K274J644K66j51J693M385N166L526J680
52450E18517J404K114K487K327K023J465M12r00k198l512m575m699l700k377j589
52435E07199j440j566j494o64J038K515K255L32j400j564p20n7K29M75N57L36
52419E06031K94P51J143R95R45J731K776K881J881N83n23j399j587n32J311K720
$$ y = [503931, 504212, 503046, 500201, 497265, 496073, 496664, 497880, 499195, 500806, 502494, 503694, 504480, 505408, 506414, 506858, 506694, 506741, 507510, 508366, 508149, 506330, 503445, 500656, 498869, 498071, 497579, 497032, 496752, 496863, 496584, 495011, 492343, 489683, 487839, 486917, 486835, 487369, 487735, 487069, 485618, 484708, 485044, 485582, 484670, 482045, 479209, 477868, 478447, 480133, 481964, 483425, 484175, 483961, 483352, 484043, 487369, 492386, 496390, 497752, 497348, 496738, 496053, 494773, 493579, 493798, 495272, 496309, 495969, 495119, 495042, 496106, 498034, 500308, 501952, 502218, 502067, 503760, 508145, 513311, 516837, 518517, 519921, 522035, 524522, 526849, 528872, 530337, 530749, 529849, 527651, 524139, 519564, 514865, 511165, 508788, 507199, 505759, 504193, 502699, 502035, 503073, 505588, 507843, 508175, 506775, 505211, 504491, 504434, 504663, 505138, 505695, 506031, 506325, 507076, 508219, 509214, 510159, 511890, 514666, 517547, 519428, 520011, 519488, 518089, 516502, 515970, 517281, 520001]
52403E20001L124K926K529J947J386J259J439J280N04n16j313j580j100k01L9
52388E31724r93k318k541j932j910k533k232m78R76N20j005j659j075n45j012
52373E12987k187l250l504k593r59K32L30K0K97J271K656M575O666P171M741R83
52357E29436o62J034L705M682M118L842M471N074N024M695M449M167L941M279
52343E82255N260O133O029M702K482m2k183l462m048m553n251n748n554m544k755
52328E68721k25K509M213L976K325P07j97q94j699j713k4K547L974L413K249K324
52312E92206L746N066N197M429L638L199K960K830L052L858M955N463M680L058
52298F48337J990K219K840K558J559J212J922K478J982J315J881L671N535O799
$$ y = [520001, 523125, 526051, 528580, 530527, 531913, 533172, 534611, 535891, 536395, 535879, 534566, 532986, 531886, 531685, 531724, 530731, 528413, 525872, 523940, 522030, 519497, 517265, 516787, 517763, 518283, 517278, 515619, 514544, 513999, 512987, 510800, 507550, 504046, 501453, 500494, 500726, 501056, 501076, 501373, 502644, 505300, 509875, 516541, 523712, 528453, 529436, 528774, 529808, 533513, 538195, 542313, 546155, 550626, 555700, 560724, 565419, 569868, 574035, 577976, 582255, 587515, 593648, 599677, 604379, 606861, 606819, 604636, 601174, 597126, 592573, 587322, 581574, 576020, 571476, 568721, 568496, 571005, 575218, 579194, 581519, 582226, 582029, 581135, 579436, 577723, 577699, 580246, 584220, 587633, 589882, 592206, 595952, 601018, 606215, 610644, 614282, 617481, 620441, 623271, 626323, 630181, 635136, 640599, 645279, 648337, 650327, 652546, 655386, 657944, 659503, 660715, 662637, 665115, 667097, 668412, 670293, 673964, 679499, 686298]
52284F86298P513P465O306M746M360N667P305P761P300P505R311J2139J4733J6345
52270H04754J7108J7650J8369J9122J9662K0337K1772K3800K5263K5338K4571
52259A037746K4188K4848K6497K8823L1117L2231L1738L1000L1808L3928L5105
52248A369029L4045L2198L1760L2779L3396L2553L1145L0304K9721K8343K6062
52237A711335K3858K2421K1294J9524J6653J2883Q663M576J396l60j076j773k945
52224A836449m065m534m696n248n970n851m610l226k472j688L08L417O186P571
52210A811571Q041Q596R315R446Q906Q896J0594J3460J5674J6399J6938J8935
52198A956771K1947K3824K3509K2286K1825K2011K1474J9629J7153J4844J2846
$$ y = [686298, 693811, 701276, 707582, 712328, 716688, 722355, 729660, 737421, 744721, 752226, 761537, 773676, 788409, 804754, 821862, 839512, 857881, 877003, 896665, 917002, 938774, 962574, 987837, 1013175, 1037746, 1061934, 1086782, 1113279, 1142102, 1173219, 1205450, 1237188, 1268188, 1299996, 1333924, 1369029, 1403074, 1435272, 1467032, 1499811, 1533207, 1565760, 1596905, 1627209, 1656930, 1685273, 1711335, 1735193, 1757614, 1778908, 1798432, 1815085, 1827968, 1836631, 1841207, 1842603, 1842243, 1841167, 1839394, 1836449, 1832384, 1827850, 1823154, 1817906, 1811936, 1806085, 1801475, 1798249, 1795777, 1794089, 1794397, 1797814, 1804000, 1811571, 1819612, 1828208, 1837523, 1846969, 1855875, 1864771, 1875365, 1888825, 1904499, 1920898, 1937836, 1956771, 1978718, 2002542, 2026051, 2048337, 2070162, 2092173, 2113647, 2133276, 2150429, 2165273, 2178119]
52187B178119J0937Q751N831K194j260l613n196p129r717j2198j4191j6246j8572
52174B117710k0317k0847k0860k1436k2531k3254k3168k2484k1365j9897j8477
52163A883074j7359j6091j4273j2693j2479j3172j2906j0984q980q445q522p167
52151A740003m193j703j362k437l049k372r57M57J515J959J766J638K533M352
52137A738150N754N745M931M644N296O255P017P553P578O430M060J459l98j611
52123A802863k958m845o952q591r141q608q017q621j0249j1041r564o768m926
52110A702582m759m648k847K30K469K366N54q66l99J490L108L484L109K692K027
52095A710592P66m19m71M35J030O40k9N5J259L344N595O810O174M565M003N254
$$ y = [2178119, 2189056, 2197807, 2203638, 2205832, 2204572, 2200959, 2195763, 2188634, 2178917, 2166719, 2152528, 2136282, 2117710, 2097393, 2076546, 2055686, 2034250, 2011719, 1988465, 1965297, 1942813, 1921448, 1901551, 1883074, 1865715, 1849624, 1835351, 1822658, 1810179, 1797007, 1784101, 1773117, 1764137, 1755692, 1747170, 1740003, 1735810, 1734107, 1732745, 1730308, 1727259, 1724887, 1723930, 1724387, 1725902, 1727861, 1729627, 1731265, 1733798, 1738150, 1743904, 1749649, 1754580, 1759224, 1764520, 1770775, 1777792, 1785345, 1792923, 1799353, 1803413, 1804872, 1804474, 1802863, 1799905, 1795060, 1788108, 1779517, 1770376, 1761768, 1753751, 1745130, 1734881, 1723840, 1714276, 1707508, 1702582, 1697823, 1693175, 1690328, 1690558, 1693027, 1695393, 1695947, 1695081, 1694682, 1696172, 1699280, 1702764, 1705873, 1708565, 1710592, 1711358, 1710939, 1710468, 1710903, 1711933, 1712573, 1712544, 1712599, 1713858, 1717202, 1722797, 1729607, 1735781, 1740346, 1744349, 1749603]
52079A749603O799O800N444M482M976O374P740R094J1268J4693J8616K1730K3590
52066A891209K5046K6963K9069L0828L2880L6267M0245M2419M1628L9502L8358
52055B274414L8616L9124L9037L8231L6655L4474L2496L1426L0852K9702K7380
52044B652407K4014K0204J7045J5577J5297J4145J0994P231M634K629o56n330
52032B778191r781j3450j7313k1480k4431k5394k5532k5855k5602k3920k1755
52021B543678k0546k0011j8769j6689j5081j4597j4179j2404r128n324j794J497
52009B396653M788P684R438J0195J1238J3443J5977J7346J7463J7698J8933K0553
51997B561409K1448K1098J9533J7226J5205J4310J4004J2722R701N586J162l350
$$ y = [1749603, 1756402, 1763202, 1768646, 1773128, 1778104, 1784478, 1792218, 1801312, 1812580, 1827273, 1845889, 1867619, 1891209, 1916255, 1943218, 1972287, 2003115, 2035995, 2072262, 2112507, 2154926, 2196554, 2236056, 2274414, 2313030, 2352154, 2391191, 2429422, 2466077, 2500551, 2533047, 2564473, 2595325, 2625027, 2652407, 2676421, 2696625, 2713670, 2729247, 2744544, 2758689, 2769683, 2776914, 2781548, 2784177, 2783521, 2778191, 2768410, 2754960, 2737647, 2716167, 2691736, 2666342, 2640810, 2614955, 2589353, 2565433, 2543678, 2523132, 2503121, 2484352, 2467663, 2452582, 2437985, 2423806, 2411402, 2402274, 2396950, 2395156, 2396653, 2401441, 2409125, 2418563, 2428758, 2439996, 2453439, 2469416, 2486762, 2504225, 2521923, 2540856, 2561409, 2582857, 2603955, 2623488, 2640714, 2655919, 2670229, 2684233, 2696955, 2706656, 2712242, 2713404, 2710054]
51985B710054p509j0493j2323j4133j6608j9096k0856k2004k2766k3058k3555
51974B517653k5592k8950l1156l0459k8245k7040k7243k7585k7678k8022k8094
51963B207589k6899k5295k5483k7750k9664k9187k7064k5359k4967k5324k5545
51952A915052k4980k3527k1980k1498k2194k3028k3342k3760k5037k6877k8348
51941A650481k8874k8362k7032k5575k4831k4751k4312k2964k1543k1058k1090
51930A380089k0290j8334j6614j6799j9040k1737k3027k2406k0966k0073k0071
51919A160732k0459k0812k0919k0215j8014j4593j1377r537q753p726n687l112
51907I99528r80L80J518K942M215M507M003L961M977O055O087N485N352N648N473
$$ y = [2710054, 2702545, 2692052, 2679729, 2665596, 2648988, 2629892, 2609036, 2587032, 2564266, 2541208, 2517653, 2492061, 2463111, 2431955, 2401496, 2373251, 2346211, 2318968, 2291383, 2263705, 2235683, 2207589, 2180690, 2155395, 2129912, 2102162, 2072498, 2043311, 2016247, 1990888, 1965921, 1940597, 1915052, 1890072, 1866545, 1844565, 1823067, 1800873, 1777845, 1754503, 1730743, 1705706, 1678829, 1650481, 1621607, 1593245, 1566213, 1540638, 1515807, 1491056, 1466744, 1443780, 1422237, 1401179, 1380089, 1359799, 1341465, 1324851, 1308052, 1289012, 1267275, 1244248, 1221842, 1200876, 1180803, 1160732, 1140273, 1119461, 1098542, 1078327, 1060313, 1045720, 1034343, 1024806, 1016053, 1008327, 1002640, 999528, 998548, 998928, 1000446, 1003388, 1007603, 1012110, 1016113, 1020074, 1025051, 1031106, 1037193, 1042678, 1048030, 1053678, 1059151]
51892A059151M946N298P080R518J1860J4219J6844J9607K2467K5337K7251K6816
51880A250394K3857J9481J4305Q122J641l197n678p551j0442j3495j5079j5651
51868A246707j6986j9274k1105k2014k3030k4493k5221k4474k3214k2591k2331
51857A001974k1549k0297j9270j8499j7219j4943j2015r190p060n877n424n001
51845H45630l842j871KN16o83k467l164k256r78j024k814n224o835p287p370p937
51829G92396q748q585o766m267k810k806k897j650R45L902O336P664P489O145
51815G86348M837M451M614M561M409M628M699L518J108j152k221k417k494k585
51801H12304k438k038j441n19O83J582J539N96n02j027r03o99j024j961l185m623
$$ y = [1059151, 1064097, 1069395, 1076475, 1085993, 1097853, 1112072, 1128916, 1148523, 1170990, 1196327, 1223578, 1250394, 1274251, 1293732, 1308037, 1316159, 1317800, 1314603, 1308925, 1301374, 1290932, 1277437, 1262358, 1246707, 1229721, 1210447, 1189342, 1167328, 1144298, 1119805, 1094584, 1070110, 1046896, 1024305, 1001974, 980425, 960128, 940858, 922359, 905140, 890197, 878182, 868992, 861932, 856055, 850631, 845630, 841788, 839917, 839919, 840435, 839752, 837285, 834121, 831865, 830887, 829863, 827049, 821825, 814990, 807703, 800333, 792396, 783648, 775063, 768297, 764030, 761220, 758414, 755517, 753867, 754812, 758714, 765050, 772714, 780203, 786348, 791185, 795636, 800250, 804811, 809220, 813848, 818547, 822065, 823173, 822021, 819800, 817383, 814889, 812304, 809866, 807828, 806387, 805868, 806551, 808133, 809672, 810268, 809766, 808739, 807836, 807137, 806113, 804152, 800967, 796344]
51785G96344o448q344r431r408r080r152r098q102o568n461m620l196j509q83
51771G05044j377j430k70R20J074Q54J068R95j71j408j239j48K69N7O68K173K892
51754G09971K031P06k27j259k339k016J13J886J363k15k57J300K166J278p1o84
51738G13746r48j447j924k202k572k656j457O96J897J203j05o80r33j364r71Q33
51722G01116K221J238q90j321J66J148O13J59P42J188R92J847M722P606Q298P676
51706G37521P992R171R243P600N422L186K65k852m285l459k274k680m431o114
51692G54305p147p721p768p161o408o115o062n575m505l137j460O11K449L045
51678F97351K370J677K110L548N102O298P106P182O052M141K849L020L921M369
$$ y = [796344, 789896, 781552, 772121, 762713, 753633, 744481, 735383, 727281, 720713, 715252, 710632, 707436, 705927, 705044, 703667, 702237, 701967, 702887, 703961, 704815, 705883, 706878, 706707, 705299, 704060, 703912, 704181, 704238, 704906, 707079, 709971, 712002, 712708, 712481, 711222, 708883, 706867, 706980, 708866, 710229, 710014, 709757, 711057, 713223, 714501, 714430, 713746, 712798, 711351, 709427, 707225, 704653, 701997, 700540, 701236, 703133, 704336, 704231, 703551, 702618, 701254, 700283, 701116, 703337, 704575, 703685, 702364, 702530, 703678, 704291, 704450, 705192, 706380, 707372, 709219, 713941, 721547, 729845, 737521, 745513, 754684, 763927, 771527, 776949, 780135, 780400, 777548, 773263, 769804, 767530, 764850, 760419, 754305, 747158, 739437, 731669, 724508, 718100, 711985, 705923, 700348, 695843, 692706, 691246, 691857, 694306, 697351, 699721, 701398, 703508, 707056, 712158, 718456, 725562, 732744, 738796, 742937, 745786, 748806, 752727, 757096]
51664G57096M350M615M955M098J584j247k792k895k513k468l045m186n206m958
51650G47388l276j788k214l988m749l235o84R57J263J233J610K072J956J146J20
51635G37811p08j353j919k217k163k360l516n167n807m739l003j842j138k50M73
51620G02102L23j04N64K278L418L095K252J963J882J320Q97J962M620P322Q596
51605G42490Q554Q398Q670Q533P086M896L403K698J157k036n122n773m054j882
51591G77018j75J639L463M038L057J978J886K006J170o21k912n696q532j0055
51577G68264r683q796q903r572r449q495p683p127o097m585l392k827k647l037
51563F75971m245n303m661k424n77n73j739k568k562k224k024k047k157k147j947
$$ y = [757096, 761446, 766061, 771016, 775114, 776698, 775451, 772659, 769764, 767251, 764783, 761738, 757552, 752346, 747388, 744112, 742324, 740110, 736122, 731373, 728138, 727454, 728411, 729674, 730907, 732517, 734589, 736545, 737691, 737811, 737103, 735750, 733831, 731614, 729451, 727091, 723575, 718408, 712601, 707862, 704859, 703017, 701879, 701629, 702102, 702425, 702321, 702885, 705163, 708581, 711676, 713928, 715891, 717773, 719093, 719990, 721952, 726572, 733894, 742490, 751044, 759442, 768112, 776645, 783731, 788627, 792030, 794728, 795885, 793849, 788727, 782954, 778900, 777018, 776843, 778482, 781945, 785983, 789040, 791018, 792904, 794910, 796080, 795459, 792547, 786851, 778319, 768264, 758581, 749785, 740882, 731310, 721861, 713366, 705683, 698556, 692459, 687874, 684482, 681655, 679008, 675971, 671726, 666423, 661762, 659338, 658761, 658188, 656449, 653881, 651319, 649095, 647071, 645024, 642867, 640720, 638773]
51548F38773j775j686j160J53J445J673J438K683N939R162J0192R432R013R892
51534F95174J0986J1020R980Q497O664M174J296q84j469q08j52j85l16J98J045
51519G45220J567K337M685Q472J1604J2488J1951J1835J2581J3305J3667J4176
51507H63888J4895J5115J4509J3635J3136J3341J4740J7730K1625K4877K6783
51496A054274K8063K9244K9402K7383K3510J9167J5132J1171P034K904r94m578
51484A241712p810j0954j4539j8515k1847k3849k5478k8099l1065l1926k9445
51473I98185k5235k1857k0242j9584j8843j7557j5782j4061j3095j2765j2040
51462H07124j0396q833q645r624j0271r568p772n735m225l679l896m018l454k606
$$ y = [638773, 636998, 635312, 634152, 634305, 635750, 637423, 638861, 641544, 647483, 656645, 666837, 676269, 685282, 695174, 706160, 717180, 727160, 735657, 742321, 746495, 747791, 746907, 745438, 744630, 744478, 744293, 743977, 744175, 745220, 746787, 749124, 753809, 762281, 773885, 786373, 798324, 810159, 822740, 836045, 849712, 863888, 878783, 893898, 908407, 922042, 935178, 948519, 963259, 980989, 1002614, 1027491, 1054274, 1082337, 1111581, 1140983, 1168366, 1191876, 1211043, 1226175, 1237346, 1244380, 1247284, 1246290, 1241712, 1233902, 1222948, 1208409, 1189894, 1168047, 1144198, 1118720, 1090621, 1059556, 1027630, 998185, 972950, 951093, 930851, 911267, 892424, 874867, 859085, 845024, 831929, 819164, 807124, 796728, 787895, 779250, 769626, 759355, 749787, 742015, 736280, 732055, 728376, 724480, 720462, 717008, 714402]
51448G14402k126j890j576j702k823l952l288p91J426J786J096R40J368J329N33
51433G04732l51j056j977k989l019j342J210K840K547R93m52j362k472m146n326
51418F87830m858l425l027m328n712n587m541m211m811n032m141k871k101j723
51404F31462j307j041j311j886k123j847j401q77J19J704L193L794L654L658M228
51389F40019M914N429O383Q436J1082J3103J4044J4436J4587J3956J2059R343
51377G67791O724M634K874J076r81l216n227o692p869r286j0793j1453j0708r265
51363G07609q414q597q956q239o059l360j524q79l27J131K937L722L259K652K637
51348F77592K794K757L028M032N202N687N349M615L925L739M356N405O223P035
$$ y = [714402, 712276, 710386, 708810, 707108, 704285, 700333, 697045, 696254, 697680, 699466, 700562, 701502, 702870, 704199, 704732, 704381, 703325, 701348, 698359, 695340, 693998, 695208, 698048, 700595, 701588, 701136, 699774, 697302, 693156, 687830, 682972, 679547, 676520, 672192, 666480, 660893, 656352, 652141, 647330, 642298, 638157, 635286, 633185, 631462, 630155, 629114, 627803, 625917, 623794, 621947, 620546, 619669, 619788, 621492, 624685, 628479, 632133, 635791, 640019, 644933, 650362, 656745, 665181, 676263, 689366, 703410, 717846, 732433, 746389, 758448, 767791, 774515, 779149, 782023, 783099, 782118, 778902, 773675, 766983, 759114, 749828, 739035, 727582, 716874, 707609, 699195, 690598, 681642, 673403, 667344, 663984, 662460, 661581, 661254, 662385, 665322, 669044, 672303, 674955, 677592, 680386, 683143, 686171, 690203, 695405, 701092, 706441, 711056, 714981, 718720, 723076, 728481, 734704, 741739]
51334G41739Q591J0338J0412Q442O869Q055J1138J3465J4343J5438J7861K0816
51322H87507K3241K5194K7101K9002L0979L3226L5320L6341L6031L4909L3041
51311A231892K9631K4177J7179R446J607n488j0965j5028j8994k3641k8305l2048
51299A179463l4933l7383l8976l8728l6436l3114l0089k7843k5719k2763j9078
51288H34401j6000j4462j3515j1522q624o855p490r465j0918j1214j0723r638
51276G03975q108o811o348o407o418o581p203p436n932k861k00M19o18j808k376
51261F35287k613k797k494j110J178L238L738K191n43k774l150j612P06K535L410
51246F35190L493K768R91j378k940k752j664j407k327k939k008k18P45K73p20
$$ y = [741739, 750330, 760668, 771080, 779522, 786391, 794446, 805584, 819049, 833392, 848830, 866691, 887507, 910748, 935942, 963043, 992045, 1023024, 1056250, 1091570, 1127911, 1163942, 1198851, 1231892, 1261523, 1285700, 1302879, 1312325, 1313932, 1308444, 1297479, 1282451, 1263457, 1239816, 1211511, 1179463, 1144530, 1107147, 1068171, 1029443, 993007, 959893, 929804, 901961, 876242, 853479, 834401, 818401, 803939, 790424, 778902, 770278, 763423, 755933, 746468, 735550, 724336, 713613, 703975, 695867, 689056, 682708, 676301, 669883, 663302, 656099, 648663, 642731, 639870, 639670, 640089, 639471, 637663, 635287, 632674, 629877, 627383, 626273, 627451, 630689, 634427, 636618, 636075, 633301, 630151, 628539, 629245, 631780, 635190, 638683, 641451, 642442, 641064, 638124, 635372, 633708, 632301, 629974, 627035, 625027, 624809, 625554, 625827, 625107]
51231F25107j102o23L25J333K138K482K235J658J374J802K671L310L501L743M467
51216F54421N187M957L582J972J157J213J362J013O53J396L469N292M816K031
51202F92521p14j403n92j24m56o32m81j097k813m198l818k059n47m28j722l583
51186F67854m730m303k815j634j239r47n88j126k776l832k746n40L61p12k175
51171F38052k589k194j871j835j755j296k91J008J812J644J261J835L214M030
51157F41025L724L273L494L790L401K936L429M543M929M273L709M004M490M238
51143F95258L434K819K371J448Qj222j887k441l120l258k245o20N06Q47R39R54
51127F93791M76m39r28n67j79p62k099l088l151k573j711o89J10J05o17j020k88
$$ y = [625107, 624005, 623382, 623707, 625040, 627178, 629660, 631895, 633553, 634927, 636729, 639400, 642710, 646211, 649954, 654421, 659608, 664565, 668147, 670119, 671276, 672489, 673851, 674864, 675517, 676913, 680382, 685674, 690490, 692521, 691807, 690404, 689812, 689688, 689232, 688600, 688119, 687022, 684209, 680011, 676193, 674134, 673587, 673159, 671437, 667854, 663124, 658821, 656006, 654372, 653133, 652186, 651598, 650472, 647696, 643864, 641118, 640578, 640939, 640227, 638052, 635463, 633269, 631398, 629563, 627808, 626512, 626221, 627229, 629041, 630685, 631946, 633781, 636995, 641025, 644749, 648022, 651516, 655306, 658707, 661643, 665072, 669615, 674544, 678817, 682526, 686530, 691020, 695258, 698692, 701511, 703882, 705330, 705338, 704116, 702229, 699788, 696668, 693410, 691165, 690545, 691051, 691898, 692837, 693791, 694267, 693828, 692900, 692333, 692154, 691392, 689293, 686205, 683054, 680481, 678770, 678081, 678191, 678296, 677679, 676659, 676371]
51110F76371J041J607Q96j00j13Q50J681J730J561J810K067J634J004J394K759
51095F96192L476K539R94L88O19M30n55j565k139k529k557j546J87R83n2j594
51079F93271j733m56O35P18N26P29Q72M53k2J18N42N89O65J831M032N818O105
51062G14693N322M437L618K547J418Q10Q52J165J460J651J579J256J128J500J943
51047G45379J919J707J869K059J416J75l11O22K070K956L254L392L362L185L329
51032G76383L893M051L185J962J413J469J336Q64N86O83R43J506K553L399L041
51017H07267J711Q77J413K723M000N317O841P872P552O279N581O581R018J1721
51003H84753J3761J5106J6371J7932J9308J9667J8889J7765J6946J6102J4413
$$ y = [676371, 677412, 679019, 679915, 679815, 679702, 680552, 682233, 683963, 685524, 687334, 689401, 691035, 692039, 693433, 696192, 699668, 702207, 703201, 703589, 704208, 704638, 704083, 702518, 700379, 697850, 695293, 693747, 693934, 694917, 694865, 693271, 691538, 691082, 691717, 692435, 692961, 693690, 694562, 695015, 694993, 695111, 695653, 696242, 696907, 698738, 702770, 708588, 714693, 720015, 724452, 728070, 730617, 732035, 732845, 733697, 734862, 736322, 737973, 739552, 740808, 741936, 743436, 745379, 747298, 749005, 750874, 752933, 754349, 754524, 754213, 754835, 756905, 759861, 763115, 766507, 769869, 773054, 776383, 780276, 784327, 787512, 789474, 790887, 792356, 793692, 794556, 795142, 795825, 796768, 798274, 800827, 804226, 807267, 808978, 809855, 811268, 813991, 817991, 823308, 830149, 838021, 845573, 851852, 857433, 864014, 873032, 884753, 898514, 913620, 929991, 947923, 967231, 986898, 1005787, 1023552, 1040498, 1056600, 1071013]
50992A071013J1637Q286N044K467J129J401K773L762L019N39k357m325n167n739
50978A093482o849q380r408r116p566n623m191l641l948n015o493p552p450o368
50964A001882n073l631j281K008M832O035O474P966J0790J3472J4800J4798J3608
50951A086680J0986P447M686L900M527N251N544N512N132M465L967L771L304K473
50937A157645K500M404P175Q696Q363P727Q572J1207J4607J7448J9065K0170K2474
50924A310053K6850L1936L5412L6593L6838L7479L8427L9161M0096M2300M6241
50913A721386N1198N5795N9025O1151O3623O7729P3279P8976Q3955Q8514R3375
50902B498006R8681J03711J07155J07751J05243J00788R5992R1448Q6384P9603
$$ y = [1071013, 1082650, 1090936, 1095980, 1098447, 1099576, 1100977, 1103750, 1107512, 1110531, 1111070, 1108713, 1104388, 1099221, 1093482, 1086633, 1078253, 1068845, 1059729, 1052163, 1046540, 1042349, 1038708, 1034760, 1029745, 1023252, 1015700, 1008250, 1001882, 996809, 993178, 991897, 993905, 998737, 1004772, 1011246, 1019212, 1030002, 1043474, 1058274, 1073072, 1086680, 1097666, 1105113, 1109799, 1113699, 1118226, 1123477, 1129021, 1134533, 1139665, 1144130, 1148097, 1151868, 1155172, 1157645, 1160145, 1164549, 1171724, 1180420, 1188783, 1196510, 1205082, 1216289, 1230896, 1248344, 1267409, 1287579, 1310053, 1336903, 1368839, 1404251, 1440844, 1477682, 1515161, 1553588, 1592749, 1632845, 1675145, 1721386, 1772584, 1828379, 1887404, 1948555, 2012178, 2079907, 2153186, 2232162, 2316117, 2404631, 2498006, 2596687, 2700398, 2807553, 2915304, 3020547, 3121335, 3217327, 3308775, 3395159, 3474762]
50892C474762P0528N9718M8727L8972L0306K1198J0924R70o546j1251j4358j6868
50880C707082j9154k1841k5527k9690l3235l6042l8660m0749m1553m1943m3894
50869C334794m7480n0395n1438n2560n5995o0983o4970o6991o8058o8923o9274
50858B677727o8907o8178o7198o5620o3242o0108n6234n2031m8501m6088m3644
50847B037976l9750l4884l1060k9294k8553k7482k6065k5050k4452k3352k0914
50836A727120j7285j3570j0990r815r097p683n400k932p04J503L870N998P278
50823A668293P612P603Q207J0022J2716J5250J6971J8383K0479K3460K6534K8994
50811A864524L1038L3391L6437L9994M3767M7777N2235N7143O2156O6877P1190
$$ y = [3474762, 3545290, 3605008, 3653735, 3692707, 3723013, 3744211, 3755135, 3756105, 3749559, 3738308, 3723950, 3707082, 3687928, 3666087, 3640560, 3610870, 3577635, 3541593, 3502933, 3462184, 3420631, 3378688, 3334794, 3287314, 3236919, 3185481, 3132921, 3076926, 3015943, 2950973, 2883982, 2815924, 2747001, 2677727, 2608820, 2540642, 2473444, 2407824, 2344582, 2284474, 2228240, 2176209, 2127708, 2081620, 2037976, 1998226, 1963342, 1932282, 1902988, 1874435, 1846953, 1820888, 1795838, 1771386, 1748034, 1727120, 1709835, 1696265, 1685275, 1675460, 1666363, 1658680, 1653280, 1650348, 1649644, 1651147, 1655017, 1661015, 1668293, 1675905, 1683508, 1691715, 1701737, 1714453, 1729703, 1746674, 1765057, 1785536, 1808996, 1835530, 1864524, 1895562, 1928953, 1965390, 2005384, 2049151, 2096928, 2149163, 2206306, 2268462, 2335339, 2406529]
50800B406529P5289P9756Q5719R4342J05432J17025J27385J37279J49052J63269
50790C541077J77543J89393J99094K08598K18511K27374K33591K36869K37693
50781E469743K36188K31636K22763K08753J90304J69155J46184J20757R2675O3812
50771G151970L6532J1181j3228l6126n5062o8569p7693q4014q7573q7742q5088
50760F604588q1194p7214p3706p1534p1890p5277q1124q8470r6717j05638j15096
50749E666728j24815j34357j43263j51210j57935j62991j65811j65902j62902
50740D297542j56661j47751j37821j28697j20831j13036j04034r3937q3987p5177
50730C135610o7470o0186n2899m5916l9914l5134l1173k7740k5278k4256k4040
$$ y = [2406529, 2481818, 2561574, 2647293, 2741635, 2847067, 2964092, 3091477, 3228756, 3377808, 3541077, 3718620, 3908013, 4107107, 4315705, 4534216, 4761590, 4995181, 5232050, 5469743, 5705931, 5937567, 6160330, 6369083, 6559387, 6728542, 6874726, 6995483, 7088158, 7151970, 7188502, 7199683, 7186455, 7150329, 7095267, 7026698, 6949005, 6864991, 6777418, 6689676, 6604588, 6523394, 6446180, 6372474, 6300940, 6229050, 6153773, 6072649, 5984179, 5887462, 5781824, 5666728, 5541913, 5407556, 5264293, 5113083, 4955148, 4792157, 4626346, 4460444, 4297542, 4140881, 3993130, 3855309, 3726612, 3605781, 3492745, 3388711, 3294774, 3210787, 3135610, 3068140, 3007954, 2955055, 2909139, 2869225, 2834091, 2802918, 2775178, 2749900, 2725644, 2701604]
50719B701604k3282k1464j9415j8138j7755j7862j8244j8973k0308k2650k5831
50708B477682k8288k8024k5111k2315k2125k3773k4387k2749k0433j9153j8458
50697B222866j6793j3824j0531p471m047L43N248R760J3806J8325K4131L0910
50685B272723L7514M3090M7779N2385N7547O3304O9285P5239Q1275Q7563R3927
50674B981631R9929J05453J10843J16159J20546J22955J23444J23269J23348J22947
50664D150524J20173J13803J04509R4240Q4225P3465N9614M1700K1598K213j5345
50653D850719l1796m7158n9673o7717p1600p2687p1741o9011o5066o0337n4547
50642D179386m7813m1814l8341l7094l6397l6184l8549m4839n3550o1956o8677
$$ y = [2701604, 2678322, 2656858, 2637443, 2619305, 2601550, 2583688, 2565444, 2546471, 2526163, 2503513, 2477682, 2449394, 2421370, 2396259, 2373944, 2351819, 2328046, 2303659, 2280910, 2260477, 2241324, 2222866, 2206073, 2192249, 2181718, 2174247, 2170200, 2170543, 2175791, 2185551, 2199357, 2217682, 2241813, 2272723, 2310237, 2353327, 2401106, 2453491, 2511038, 2574342, 2643627, 2718866, 2800141, 2887704, 2981631, 3081560, 3187013, 3297856, 3414015, 3534561, 3657516, 3780960, 3904229, 4027577, 4150524, 4270697, 4384500, 4489009, 4583249, 4667474, 4740939, 4800553, 4842253, 4863851, 4866064, 4850719, 4818923, 4771765, 4712092, 4644375, 4572775, 4500088, 4428347, 4359336, 4294270, 4233933, 4179386, 4131573, 4089759, 4051418, 4014324, 3977927, 3941743, 3903194, 3858355, 3804805, 3742849, 3674172]
50631C674172p3824p7581p9787q0516q0143p8943p7057p4421p0356o3974n5627
50620B861943m7182m0003l3279k5427j6621q586k102L793R867J5356J9291K2072
50608B759122K4819K7670K9724L0418L0213K9806K9370K8731K7949K7343K7122
50597C072287K7253K7778K8881L0399L1514L1515L0872L0959L2388L4267L5599
50586C413712L6743L8709M1565M4605M7785N1655N5859N8999O0468O1218O2038
50575C973356O2199O0722N8179N5999N4464N2599M9885M6955M4285M1029L5686
50564D535358K7685J8020Q373l71q612j6855k4217k8777k9735k8435k6682k4664
50552D401088k1364j6663j2077r373r180j0921j3651j6962k1462k8174l7051m6589
$$ y = [3674172, 3600348, 3522767, 3442980, 3362464, 3282321, 3203378, 3126321, 3051900, 2981544, 2917570, 2861943, 2814761, 2774758, 2741479, 2716052, 2699431, 2690845, 2688743, 2692536, 2702403, 2717759, 2737050, 2759122, 2783941, 2811611, 2841335, 2871753, 2901966, 2931772, 2961142, 2989873, 3017822, 3045165, 3072287, 3099540, 3127318, 3156199, 3186598, 3218112, 3249627, 3280499, 3311458, 3343846, 3378113, 3413712, 3450455, 3489164, 3530729, 3575334, 3623119, 3674774, 3730633, 3789632, 3850100, 3911318, 3973356, 4035555, 4096277, 4154456, 4210455, 4264919, 4317518, 4367403, 4414358, 4458643, 4499672, 4535358, 4563043, 4581063, 4589436, 4589065, 4580453, 4563598, 4539381, 4510604, 4480869, 4452434, 4425752, 4401088, 4379724, 4363061, 4350984, 4341611, 4332431, 4321510, 4307859, 4290897, 4269435, 4241261, 4204210, 4157621]
50540D157621n5548o4437p4255q4191r1975r6537r8951j00417j00746r9521r7464
50529C193579r5484r3150q9268q3694p7549p1710o5953n9693n3003m6667m1438
50518B415970l7223l2974k7619k1360j5652j1607q684n371r08M144Q806J2642
50506B280164J5809J8652K1510K4632K8011L1360L4282L6586L8413M0141M2106
50495B611666M4412M6904M9175N0711N1382N1921N3442N6122N8699N9817N9555
50484C193806N9116N9351O0459O2834O7046P2709P8414Q3463Q8860R5997J04764
50473D026819J13526J20640J25642J29393J33560J39512J47112J54697J60554
50464E251455J64179J65993J66332J65055J61747J55748J46336J33311J17294
$$ y = [4157621, 4102073, 4037636, 3963381, 3879190, 3787215, 3690678, 3591727, 3491310, 3390564, 3291043, 3193579, 3098095, 3004945, 2915677, 2831983, 2754434, 2682724, 2616771, 2557078, 2504075, 2457408, 2415970, 2378747, 2345773, 2318154, 2296794, 2281142, 2269535, 2260851, 2255480, 2254572, 2258716, 2267522, 2280164, 2295973, 2314625, 2336135, 2360767, 2388778, 2420138, 2454420, 2491006, 2529419, 2569560, 2611666, 2656078, 2702982, 2752157, 2802868, 2854250, 2906171, 2959613, 3015735, 3074434, 3134251, 3193806, 3252922, 3312273, 3372732, 3435566, 3502612, 3575321, 3653735, 3737198, 3826058, 3922055, 4026819, 4140345, 4260985, 4386627, 4516020, 4649580, 4789092, 4936204, 5090901, 5251455, 5415634, 5581627, 5747959, 5913014, 6074761, 6230509, 6376845, 6510156, 6627450]
50455F627450R9202P9779N9707L9534J9124k293k4837m7130o7157q3806r7064
50444F602509j07149j13932j17048j16047j10600j00896q7749p2254n5653l9668
50434E681513k6075j5354o350K026Q973J2241J0109K396j0055k6215m5248o6494
50422E521467q8914j10462j28609j42234j52446j60807j67047j69422j67155j61591
50412D072780j54918j48447j42233j35618j27844j18611j08526r8815r0290q2583
50402B864895p4400o4866n4605m5259l7662l0944k4047j7583j2955r760n753J67
50390B487228O445J1184J4688J8449K2741K6667K9838L2476L4270L4490L3207
50379B751683L1277K9042K5916K1147J4611P220R42k448l204l312l626k665O74
$$ y = [6627450, 6726652, 6806431, 6866138, 6905672, 6924796, 6922503, 6897666, 6850536, 6783379, 6699573, 6602509, 6495360, 6381428, 6264380, 6148333, 6037733, 5936837, 5849088, 5776834, 5721181, 5681513, 5655438, 5640084, 5633734, 5635760, 5644733, 5656974, 5667083, 5669479, 5659424, 5633209, 5587961, 5521467, 5432553, 5322091, 5193482, 5051248, 4898802, 4737995, 4570948, 4401526, 4234371, 4072780, 3917862, 3769415, 3627182, 3491564, 3363720, 3245109, 3136583, 3037768, 2947478, 2864895, 2790495, 2725629, 2671024, 2625765, 2588103, 2557159, 2533112, 2515529, 2502574, 2492814, 2487061, 2487228, 2493673, 2504857, 2519545, 2537994, 2560735, 2587402, 2617240, 2649716, 2683986, 2718476, 2751683, 2782960, 2812002, 2837918, 2859065, 2873676, 2880896, 2881838, 2879390, 2876186, 2872874, 2869248, 2866583, 2867257]
50366B867257M771P415Q947J1233J4482J7480K0367K4601L0338L6150M1383M6659
50354C131083N2046N7040O2276O8792P5387P9363Q0407Q0953Q2096Q1961P9231
50343C930635P5317P1385O5909N7327M6881L6534K5911J3613N3j3466k7135m1611
50331D241353n5568o6714p4825q1508q7309r0946r1293q8369q2617p4707o5809
50320C381688n6681m6804l5728k4767j5972r902n749k913j057M78J396o12p469
50307C175908j7615k7374l5156m2091m8770n3893n6594n7765n8394n8514n8525
50296B661217n9641o2147o4775o6531o7580o7680o5724o1906n8429n6544n4459
50285A975801m9887m3451l7619l3133k8584k3200j8030j4065j0915q037n967n216
$$ y = [2867257, 2872028, 2879443, 2888390, 2899623, 2914105, 2931585, 2951952, 2976553, 3006891, 3043041, 3084424, 3131083, 3183129, 3240169, 3302445, 3371237, 3446624, 3525987, 3606394, 3687347, 3769443, 3851404, 3930635, 4005952, 4077337, 4143246, 4200573, 4247454, 4283988, 4309899, 4323512, 4323565, 4310099, 4282964, 4241353, 4185785, 4119071, 4044246, 3962738, 3875429, 3784483, 3693190, 3604821, 3522204, 3447497, 3381688, 3325007, 3278203, 3242475, 3217708, 3201736, 3191834, 3186085, 3183172, 3182115, 3182593, 3183989, 3183377, 3175908, 3158293, 3130919, 3095763, 3053672, 3004902, 2951009, 2894415, 2836650, 2778256, 2719742, 2661217, 2601576, 2539429, 2474654, 2408123, 2340543, 2272863, 2207139, 2145233, 2086804, 2030260, 1975801, 1925914, 1882463, 1844844, 1811711, 1783127, 1759927, 1741897, 1727832, 1716917, 1708880, 1702913, 1697697]
50273A697697m674k461J566N136O073M939M274N426P244Q189Q444Q982R606R417
50259A769858Q648Q539R376J0154J0275J0267J0522J0602J0220R727R164P988
50247A885340O340N576O726R175J1400J2450J2369J1920J2235J3959J6475J8764
50235B022729K0895K3394K5137K3775J9024J3628R766O078oq203j5597k0221k2540
50222B097859k3538k3183k1134j7708j3678r808o686m383k342j07K195M700Q349
50209A990536J3535J8683K1631K2352K3009K5112K7724K8828K7589K4922K2534
50198B246455K1657K2163K2715K2056K0089J7340J3957R920N668J470l382r450
50186B390658j5508j9587k1639k3448k5585k6267k4204k0988j9292j9691k0663
$$ y = [1697697, 1693023, 1690562, 1692128, 1697264, 1703337, 1708276, 1712550, 1717976, 1725220, 1733409, 1741853, 1750835, 1760441, 1769858, 1778506, 1787045, 1796421, 1806575, 1816850, 1827117, 1837639, 1848241, 1858461, 1868188, 1877352, 1885340, 1891680, 1897256, 1903982, 1913157, 1924557, 1937007, 1949376, 1961296, 1973531, 1987490, 2003965, 2022729, 2043624, 2067018, 2092155, 2115930, 2134954, 2148582, 2158348, 2164426, 2164420, 2156217, 2140620, 2120399, 2097859, 2074321, 2051138, 2030004, 2012296, 1998618, 1988810, 1982124, 1977741, 1975399, 1975292, 1977487, 1982187, 1990536, 2004071, 2022754, 2044385, 2066737, 2089746, 2114858, 2142582, 2171410, 2198999, 2223921, 2246455, 2268112, 2290275, 2312990, 2335046, 2355135, 2372475, 2386432, 2396352, 2402020, 2403490, 2400108, 2390658, 2375150, 2355563, 2333924, 2310476, 2284891, 2258624, 2234420, 2213432, 2194140, 2174449, 2153786]
50175B153786k1173k1829k3650k6805l0612l3927l5576l5154l3577l2261l1656
50164A827566l0938k9238k6784k4703k3863k4003k4013k3161k1883k1048k0711
50153A557221k0201j9321j8429j7154j4343j0077o677o361q419j0048r705q381
50141A408105p575p470p446p270o995o419n438m443l870l611l288k871k663k958
50127A335788l920n384o540o340m637k529j160n72j83O6k40j069j748j713q98
50112A298921N29K207L428L707L668M599O856R315J0896J1903J3262J4996J6404
50099A400691J7568J9613K3186K7484L1252L4234L7155M0693M5019N0034N5260
50088A782189N9516O1534O1239N9955N8981N8228N6694N3986N0869M8303M6418
$$ y = [2153786, 2132613, 2110784, 2087134, 2060329, 2029717, 1995790, 1960214, 1925060, 1891483, 1859222, 1827566, 1796628, 1767390, 1740606, 1715903, 1692040, 1668037, 1644024, 1620863, 1598980, 1577932, 1557221, 1537020, 1517699, 1499270, 1482116, 1467773, 1457696, 1451019, 1444658, 1436239, 1426191, 1416486, 1408105, 1400530, 1393060, 1385614, 1378344, 1371349, 1364930, 1359492, 1355049, 1351179, 1347568, 1344280, 1341409, 1338746, 1335788, 1331868, 1326484, 1319944, 1313604, 1308967, 1306438, 1305278, 1304706, 1304523, 1304589, 1304349, 1303280, 1301532, 1299819, 1298921, 1299450, 1301657, 1305085, 1308792, 1312460, 1317059, 1323915, 1333230, 1344126, 1356029, 1369291, 1384287, 1400691, 1418259, 1437872, 1461058, 1488542, 1519794, 1554028, 1591183, 1631876, 1676895, 1726929, 1782189, 1841705, 1903239, 1964478, 2024433, 2083414, 2141642, 2198336, 2252322, 2303191, 2351494, 2397912]
50077B397912M4498M1655L7299L1312K4015J5902P169k450j3183k4523l5193m3959
50065B480454n0439n4994n7912n8974n8071n5901n3501n1051m7780m3413l9071
50054A909347l6080l4232l2203k9552k7290k6137k5241k3292k0325j7578j5940
50043A621477j5182j4507j3268j1336r420q805j0047j1939j2548j1346r676q912
$$ y = [2397912, 2442410, 2484065, 2521364, 2552676, 2576691, 2592593, 2599762, 2597312, 2584129, 2559606, 2524413, 2480454, 2430015, 2375021, 2317109, 2258135, 2200064, 2144163, 2090662, 2039611, 1991831, 1948418, 1909347, 1873267, 1839035, 1806832, 1777280, 1749990, 1723853, 1698612, 1675320, 1654995, 1637417, 1621477, 1606295, 1591788, 1578520, 1567184, 1557764, 1548959, 1538912, 1526973, 1514425, 1503079, 1493403, 1484491]
$$ [...]
##END NTUPLES=NMR SPECTRUM
##END=
