
##TITLE=UV1011_M1-1003-1002_6268800_U044sgamfu
##JCAMPDX= 6.0         $$ Bruker NMR JCAMP-DX V2.0
##DATA TYPE= NMR SPECTRUM
##DATA CLASS= NTUPLES
##ORIGIN= BRUKER
##OWNER= Administrator
$$ 1.72 TOPSPIN		Version 2.1
$$ 2012-06-02 04:32:22.859 -0500  Administrator@TOPSPIN
$$ Compression mode = diff/dup
##.OBSERVE FREQUENCY= 400.13188235
##.OBSERVE NUCLEUS= ^1H
##.ACQUISITION MODE= SIMULTANEOUS (DQD)
##.ACQUISITION SCHEME= undefined
##.AVERAGES= 8
##.DIGITISER RES= 22
##SPECTROMETER/DATA SYSTEM= spect
##.PULSE SEQUENCE= zg30
##.SOLVENT NAME= COFFEE_calctemp
##.SHIFT REFERENCE= INTERNAL, COFFEE_calctemp, 1, 14.98061
##AUDIT TRAIL= $$ (NUMBER, WHEN, WHO, WHERE, PROCESS, VERSION, WHAT)
$$ ##TITLE= Audit trail, TOPSPIN		Version 2.1
$$ ##JCAMPDX= 5.01
$$ ##ORIGIN= Bruker BioSpin GmbH
$$ ##OWNER= Administrator
$$ $$ C:\Bruker\TOPSPIN/data/COFFEE/nmr/UV1011_M1-1003-1002_6268800_U044sgamfu/10/pdata/1/auditp.txt
$$ ##AUDIT TRAIL=  $$ (NUMBER, WHEN, WHO, WHERE, PROCESS, VERSION, WHAT)
(   1,<2012-06-02 04:32:15.656 -0500>,<Administrator>,<TOPSPIN>,<go>,<TOPSPIN 2.1>,
      <created by zg
	started at 2012-06-02 04:31:08.796 -0500,
	POWCHK enabled, PULCHK disabled,
       configuration hash MD5:
       D5 CA 7A 23 FE 6B EE E2 50 67 74 61 24 F7 5E 3B
       data hash MD5: 64K
       F9 F4 8A 42 D9 AC 26 AD 50 0F CC DB ED B2 67 FF>)
(   2,<2012-06-02 04:32:18.593 -0500>,<Administrator>,<TOPSPIN>,<proc1d>,<TOPSPIN 2.1>,
      <Start of raw data processing
       efp LB = 0 FT_mod = 6 PKNL = 1 PHC0 = 0 PHC1 = 0 SI = 32K 
       data hash MD5: 32K
       DF C3 09 CC 3B 54 41 95 26 1F 84 13 C7 F4 CF E1>)
(   3,<2012-06-02 04:32:18.937 -0500>,<Administrator>,<TOPSPIN>,<proc1d>,<TOPSPIN 2.1>,
      <pk PHC0 = 210.9705 PHC1 = 0 
       data hash MD5: 32K
       DD 4B 61 0B D3 75 4B 57 11 20 DC 02 C4 29 17 DA>)
(   4,<2012-06-02 04:32:19.015 -0500>,<Administrator>,<TOPSPIN>,<proc1d>,<TOPSPIN 2.1>,
      <abs ABSG = 1 
       data hash MD5: 32K
       53 8E 9F 14 A8 EC 58 78 D7 8E D6 0A AF 8D FB F9>)
(   5,<2012-06-02 04:32:19.062 -0500>,<Administrator>,<TOPSPIN>,<proc1d>,<TOPSPIN 2.1>,
      <abs ABSG = 2 
       data hash MD5: 32K
       EA 0E 26 0E 5C DD 7C 4F 57 70 7B F9 33 4D 3E 49>)
(   6,<2012-06-02 04:32:19.093 -0500>,<Administrator>,<TOPSPIN>,<proc1d>,<TOPSPIN 2.1>,
      <abs ABSG = 3 
       data hash MD5: 32K
       65 D9 2E 1E C1 45 B0 F8 12 C2 6A A6 FE C9 E0 B4>)
(   7,<2012-06-02 04:32:19.125 -0500>,<Administrator>,<TOPSPIN>,<proc1d>,<TOPSPIN 2.1>,
      <abs ABSG = 4 
       data hash MD5: 32K
       2F 25 CA E6 B2 46 A6 BF 65 92 51 64 B2 1F 6D 9A>)
(   8,<2012-06-02 04:32:19.156 -0500>,<Administrator>,<TOPSPIN>,<proc1d>,<TOPSPIN 2.1>,
      <abs ABSG = 5 
       data hash MD5: 32K
       AE 19 9A AD 1D 74 D8 FF 32 E8 3D F3 3C A2 AF 8C>)
$$ ##END=
$$ 
$$ $$ hash MD5
$$ $$ 69 8A 91 55 AA 6D 84 EF 66 B1 F5 03 D0 11 94 C4
##$RELAX= 
##$RELAX= 
##$RELAX= 
##$RELAX= 
##$RELAX= 
##$RELAX= 
##$RELAX= 
$$ Bruker specific parameters
$$ --------------------------
$$ [...]
##$TP= (0..7)
150 150 150 150 150 150 150 150
##$TP07= 0
##$TPNAME0= <>
##$TPNAME1= <>
##$TPNAME2= <>
##$TPNAME3= <>
##$TPNAME4= <>
##$TPNAME5= <>
##$TPNAME6= <>
##$TPNAME7= <>
##$TPOAL= (0..7)
0.5 0.5 0.5 0.5 0.5 0.5 0.5 0.5
##$TPOFFS= (0..7)
0 0 0 0 0 0 0 0
##$TUNHIN= 0
##$TUNHOUT= 0
##$TUNXOUT= 0
##$USERA1= <user>
##$USERA2= <user>
##$USERA3= <user>
##$USERA4= <user>
##$USERA5= <user>
##$V9= 5
##$VALIST= <valist>
##$VCLIST= <CCCCCCCCCCCCCCC>
##$VD= 0
##$VDLIST= <DDDDDDDDDDDDDDD>
##$VPLIST= <PPPPPPPPPPPPPPP>
##$VTLIST= <TTTTTTTTTTTTTTT>
##$WBST= 2048
##$WBSW= 25
##$XGAIN= (0..3)
0 0 0 0
##$XL= 0
##$YL= 0
##$YMAX_a= 533426
##$YMIN_a= -645643
##$ZGOPTNS= <>
##$ZL1= 120
##$ZL2= 120
##$ZL3= 120
##$ZL4= 120
##$ABSF1= 14.98061
##$ABSF2= -5.57192
##$ABSG= 5
##$ABSL= 3
##$ALPHA= 0
##$AQORDER= 0
##$ASSFAC= 0
##$ASSFACI= 0
##$ASSFACX= 0
##$ASSWID= 0
##$AUNMP= <proc_prof1d_extract_pilot.lims>
##$AXLEFT= 0
##$AXNAME= <>
##$AXNUC= <1H>
##$AXRIGHT= 0
##$AXTYPE= 0
##$AXUNIT= <>
##$AZFE= 0.1
##$AZFW= 0.1
##$BCFW= 0
##$BC_mod= 0
##$BYTORDP= 0
##$COROFFS= 0
##$CY= 15
##$DATMOD= 1
##$DC= 0
##$DFILT= <>
##$DTYPP= 0
##$F1P= 0
##$F2P= 0
##$FCOR= 0.5
##$FTSIZE= 32768
##$FT_mod= 6
##$GAMMA= 0
##$GB= 0
##$INTBC= 1
##$INTSCL= 1
##$ISEN= 128
##$LB= 0
##$LEV0= 0
##$LPBIN= 0
##$MAXI= 10000
##$MC2= 0
##$MEAN= 0
##$ME_mod= 0
##$MI= 0
##$NCOEF= 0
##$NC_proc= -8
##$NLEV= 6
##$NOISF1= 0
##$NOISF2= 0
##$NSP= 0
##$NTH_PI= 0
##$NZP= 0
##$OFFSET= 14.98061
##$PC= 1
##$PHC0= 210.9705
##$PHC1= 0
##$PH_mod= 1
##$PKNL= yes
##$PPARMOD= 0
##$PPDIAG= 0
##$PPIPTYP= 0
##$PPMPNUM= 2147483647
##$PPRESOL= 1
##$PSCAL= 4
##$PSIGN= 0
##$PYNMP= <proc.py>
##$REVERSE= no
##$SF= 400.13
##$SI= 32768
##$SIGF1= 0
##$SIGF2= 0
##$SINO= 400
##$SIOLD= 32768
##$SPECTYP= <>
##$SREGLST= <1H.CDCl3>
##$SSB= 0
##$STSI= 32768
##$STSR= 0
##$SW_p= 8223.68421052632
##$SYMM= 0
##$S_DEV= 0
##$TDeff= 65536
##$TDoff= 0
##$TI= <>
##$TILT= no
##$TM1= 0
##$TM2= 0
##$TOPLEV= 0
##$USERP1= <user>
##$USERP2= <user>
##$USERP3= <user>
##$USERP4= <user>
##$USERP5= <user>
##$WDW= 1
##$XDIM= 32768
##$YMAX_p= 461393179
##$YMIN_p= -700559
##$CURPLOT= <Network HP LaserJet P1505>
##$CURPRIN= <$Network HP LaserJet P1505>
##$DFORMAT= <normdp>
##$LAYOUT= <+/1D_H.xwp>
##$LFORMAT= <normlp>
##$PFORMAT= <normpl>
##$SURQMSG= 1
$$ End of Bruker specific parameters
$$ ---------------------------------
##NTUPLES= NMR SPECTRUM
##VAR_NAME=  FREQUENCY,     SPECTRUM/REAL,   SPECTRUM/IMAG
##SYMBOL=    X,             R,               I
##VAR_TYPE=  INDEPENDENT,   DEPENDENT,       DEPENDENT
##VAR_FORM=  AFFN,          ASDF,            ASDF
##VAR_DIM=   32768,         32768,           32768
##UNITS=     HZ,            ARBITRARY UNITS, ARBITRARY UNITS
##FACTOR=    0.250966925370066, 1,           1
##FIRST=     8223.43324360095, -1785,        -33638
##LAST=      0,             85873,           -99828
##MIN=       0,             -700559,         0
##MAX=       8223.43324360095, 461393179,    0
$$ Real data points
##PAGE= N=1
##DATA TABLE= (X++(R..R)), XYDATA
$$ [...]
19529a91803j02839A83961k7121G6427L451b7057H186b68146e5564k69178c1587
$$ -191803 -294642 183961 156840 76427 79878 -27057 8186 -268146 -55564 -324742 -31587
19517g7580J008o6518A06086b28022M2981k8970J02459B03628e6028n2805F8234
$$ -77580 -76572 -143090 106086 -228022 -185041 -214011 -111552 203628 -56028 -108833 68234
19505C4570h1220m17363a63562c3036B92851K7063c9630m1225j20946P2123k55341
$$ 34570 -81220 -498583 -163562 -33036 292851 319914 -39630 -80855 -201801 -129678 -385019
19494c85019A5841a05056o4392C57j58d0696j06458m7504L0113f0130k8260A08138
$$ -385019 15841 -105056 -169448 357 199 -40696 -147154 -194658 -164545 -60130 -88390 108138
19481B28668E1270b02501A07867J88084B5283M784b08811h3836k1577l68271H515
$$ 228668 51270 -202501 107867 295951 25283 30067 -208811 -83836 -105413 -473684 8515
19469E1309a67193b6846o4590H6070j4570i6195k02255J03081D201e7030p0427
$$ 51309 -167193 -26846 -91436 86070 71500 -96195 -298450 -195369 4201 -57030 -127457
19458a27457B05555a14012J0103e224A03368c39252J30173J02490A88561a07629
$$ -127457 205555 -114012 -103909 -5224 103368 -339252 -209079 -106589 188561 -107629
19447D23101c38612B26553g5630a0529j870j01162e5317m0813j6431p588J8299
$$ 423101 -338612 226553 -75630 -10529 -12399 -113561 -55317 -96130 -112561 -120149 -101850
19436a01850B50597D2601Q4430b97742g0831B8818i4833G6499g3938B13077g2810
$$ -101850 250597 42601 127031 -297742 -70831 28818 -94833 76499 -73938 213077 -72810
19424a27159j43058A05840b9849A08232a95550B2054K24679j2651D1478A4966
$$ -127159 -270217 105840 -29849 108232 -195550 22054 246733 234082 41478 14966
19413a83303B19997b29139e741A7714a43221D1460d1209m5768D4885c17592J42081
$$ -183303 219997 -229139 -5741 17714 -143221 41460 -41209 -86977 44885 -317592 -175511
19402a75511L6112B19799a56852P2840j89006P5266c2110G9436a59384I2378L1716
$$ -175511 -139399 219799 -156852 -84012 -273018 -197752 -32110 79436 -159384 92378 124094
19391A24094C2a46682D8254P5334a28464A02989c13276J42482a840A02770a4252
$$ 124094 32 -146682 48254 123588 -128464 102989 -313276 -170794 -1840 102770 -14252
19379G3415b47026e5185j94877B89935a83657A20781i7337M2733k85342B3256
$$ 73415 -247026 -55185 -250062 289935 -183657 120781 -97337 -54604 -339946 23256
19368A98678b0575k7694m3765n0442B67820I3674g4943A36339D0344P6631g0156
$$ 198678 -20575 -48269 -92034 -142476 267820 93674 -74943 136339 40344 116975 -70156
19356H0917a61529O2207d0775A3939e0226K2056k26345H1279b47314j43592P2238
$$ 80917 -161529 -99322 -40775 13939 -50226 -28170 -254515 81279 -247314 -390906 -318668
19345c18668J0709O9760b5175L788R964A78974b41259o553I5223R679C2524b82013
$$ -318668 -307959 -238199 -25175 -21387 -11423 178974 -241259 -247812 95223 104902 32524 -282013
19332b61078R4932N0310j69656d0445A83283a95490o9167a26156J4052j00524
$$ -261078 -166146 -115836 -285492 -40445 183283 -195490 -264657 -126156 -112104 -212628
19322b12628A81730b4867K279n9660H0414J63712h5046j32712c0755G8865c1548
$$ -212628 181730 -24867 -22588 -82248 80414 244126 -85046 -217758 -30755 78865 -31548
19310b40668N5038B49254d677j11687D8692a55575k6990d1048q1646r9952C3796
$$ -240668 -185630 249254 -4677 -116364 48692 -155575 -182565 -41048 -122694 -222646 33796
19298A81725b69657P4035L0951q7614R4326c3196l47147a78173A42133c58656
$$ 181725 -269657 -195622 -164671 -252285 -157959 -33196 -380343 -178173 142133 -358656
19287b94249f5551m07427F0941q010O9237g6982a3680j76820e951q948j07751
$$ -294249 -65551 -472978 60941 52931 122168 -76982 -13680 -190500 -5951 -14899 -122650
19276a22650g267j06159B12288J35983F3266c52020B80976f2880j92692H786f2423
$$ -122650 -7267 -113426 212288 348271 63266 -352020 280976 -62880 -255572 8786 -62423
19264b68509b5925j08918A07500g00559C42662A15748R7654a51807l17810A94012
$$ -268509 -25925 -134843 107500 -700559 342662 115748 213402 -151807 -469617 194012
19253a66665N4714A0834a03868q8468d0471A74384q1871a88339f4734j94041B32968
$$ -166665 -111951 10834 -103868 -192336 -40471 174384 92513 -188339 -64734 -258775 232968
19241c46166J43713f7188j82709j52443g6578F6504c9448j15621J2744G6585b78845
$$ -346166 -202453 -67188 -249897 -402340 -76578 66504 -39448 -155069 -142325 76585 -278845
19229a25125k7258A60954b18559A40891a91298A94097d9329l57237h7111A1579
$$ -125125 -152383 160954 -218559 140891 -191298 194097 -49329 -406566 -87111 11579
19218a64857L0333C57214f1361j33204A0598K97172a47377d4079p112E7792J07506
$$ -164857 -134524 357214 -61361 -194565 10598 307770 -147377 -44079 -51191 57792 165298
19207A65298N167b91312P5881r7301J34822K4991A96499a50458B54924c6576A42779
$$ 165298 170465 -291312 -215431 -312732 -177910 -152919 196499 -150458 254924 -36576 142779
19195B05749p2432h1439C7783O6954l1736c07996J06444i7936I5647C1656b58766
$$ 205749 133317 -81439 37783 104737 73001 -307996 -201552 -97936 95647 31656 -258766
19183b33608B641a29098H1671a09080k2060a5819q3330j19281h2601A77323b48180
$$ -233608 2641 -129098 81671 -109080 -131140 -15819 -99149 -218430 -82601 177323 -248180
19171e2830j32968H0192J01100d12145a14301j71048a14387j75360J38545n0251
$$ -52830 -185798 80192 181292 -412145 -114301 -285349 -114387 -289747 -151202 -201453
19161b01453l6897P9857g7996A66405A8238a10331j7590d4652r8891k4188K6540
$$ -201453 -238350 -158493 -77996 166405 18238 -110331 -127921 -44652 -143543 -167731 -141191
19150a41191C48386b61550B18555a33635k36207B48550D1040K5001k3673Q0817
$$ -141191 348386 -261550 218555 -133635 -369842 248550 41040 66041 42368 123185
19140A23185J72932B2995p32e2103A12463a50007b3007A20059b54662J22741k02087
$$ 123185 296117 22995 22263 -52103 112463 -150007 -23007 120059 -254662 -131921 -334008
19129c34008A06661c9983p2172A39549a86254P8379a2005C5255g1540B017e1309
$$ -334008 106661 -39983 -112155 139549 -186254 -107875 -12005 35255 -71540 2017 -51309
19117a64342g1482a769j87482f5945j248j27248D4516A8661J19410b6677C03690
$$ -164342 -71482 -1769 -189251 -65945 -67193 -194441 44516 18661 138071 -26677 303690
19105e6061A48151a63904j05948g5035A36818a35875k12917A61414D6419a02472
$$ -56061 148151 -163904 -269852 -75035 136818 -135875 -348792 161414 46419 -102472
19094a38287D1449K5118K485K45973c8422m15527A62138d299H627l486J64773
$$ -138287 41449 66567 69052 315025 -38422 -453949 162138 -4299 8627 5141 169914
19083A69914b55136j21916a01870f12B39807a05096n1137D5081b3423A65732b00842
$$ 169914 -255136 -377052 -101870 -612 239807 -105096 -156233 45081 -23423 165732 -200842
19071B165a7311j96590a6769A1583J28977K02090i2854d749A56987J54704b66626
$$ 2165 -17311 -213901 -16769 11583 140560 342650 -92854 -4749 156987 311691 -266626
19059b41540j94476B23270d4237B31468C6917a44229M6174A00112C4093B158a01962
$$ -241540 -436016 223270 -44237 231468 36917 -144229 -98055 100112 34093 2158 -101962
19047A03336f4925A40583E734d0694o4268o8369P0584j27913A20530J01291E394
$$ 103336 -64925 140583 5734 -40694 -104962 -173331 -102747 -230660 120530 221821 5394
19035b6867j01318j35141J05816C8602b57356A15679a4013A32026j9741J25805
$$ -26867 -128185 -263326 -157510 38602 -257356 115679 -14013 132026 112285 238090
19025B38090E0546e1947j73161M7340B257e8642b0919B6449a69513E5738K7427
$$ 238090 50546 -51947 -225108 -177768 2257 -58642 -20919 26449 -169513 55738 83165
19014H3165J0750N3570O3762o7679l4410a65429j21727g6487B0381c49972J25147
$$ 83165 93915 147485 211247 143568 109158 -165429 -287156 -76487 20381 -349972 -224825
19003b24825Q755j31418a17781j46487b9194n4408j3082g110F9446O9707n0958
$$ -224825 -216070 -347488 -117781 -264268 -29194 -83602 -96684 -7110 69446 139153 88195
18992H8195g178j12739I8217b0712j41936B79175f4112c1135B12376j7335b50019
$$ 88195 -7178 -119917 98217 -20712 -162648 279175 -64112 -31135 212376 195041 -250019
18980b9305F7253K9816b50794C257K8477N709b43727J07058A74013i1035B1675
$$ -29305 67253 97069 -250794 3257 31734 37443 -243727 -136669 174013 -91035 21675
18968A98515b69897j60106J4219B6973L14224g9952B45752c6914k3876m38878
$$ 198515 -269897 -430003 -415784 26973 341197 -79952 245752 -36914 -60790 -499668
18958d99668K40623E1425d9264j14578J6274l2673k817f2697p3526D9652a22254
$$ -499668 -259045 51425 -49264 -163842 -147568 -180241 -183058 -62697 -136223 49652 -122254
18946a32392H4172b16022A93064b09331B44625b76280B67967a66564A54189h8549
$$ -132392 84172 -216022 193064 -209331 244625 -276280 267967 -166564 154189 -88549
18935B01503f8587k04018h7214B06278r7737a45054O5195o5499j9941f3512h228
$$ 201503 -68587 -272605 -87214 206278 108541 -145054 -79859 -145358 -165299 -63512 -8228
18923a65039C427J38595h3297o10k52395h7201B42119b33749D29793a00764m2541
$$ -165039 3427 142022 -83297 -83907 -336302 -87201 242119 -233749 429793 -100764 -143305
18912a43305k2024A6887R6149b48917i7618K5921B32306l2790b24626P5292P782
$$ -143305 -165329 16887 113036 -248917 -97618 -71697 232306 199516 -224626 -149334 -141552
18901a41552K4548B70679a25632k72672O6820J22135i0704M4114j43000F1835
$$ -141552 -117004 270679 -125632 -398304 -331484 -209349 -90704 -46590 -189590 61835
18890b75164N2763A39686a33637c7433m7528j8386d9745b2918p1928B69586a44006
$$ -275164 -222401 139686 -133637 -37433 -84961 -103347 -49745 -22918 -94846 269586 -144006
18878A53765b0928A89776m4606J05167b29695m2245a25673m9620f4048A2876a02827
$$ 153765 -20928 189776 145170 250337 -229695 -271940 -125673 -175293 -64048 12876 -102827
18866g6693D1545b28162H9372d3395m86088A95765a03287B5070a11509R128j89937
$$ -76693 41545 -228162 89372 -43395 -529483 195765 -103287 25070 -111509 -102381 -292318
18855b92318e3944j53444g1458D7769a14498J8197B04368a82420b1280q6227a6224
$$ -292318 -53944 -207388 -71458 47769 -114498 -96301 204368 -182420 -21280 -107507 -16224
18843C2080a22602D526M0110c44817e0797A51688n1825k9646c3558B19525O0979
$$ 32080 -122602 4526 44636 -344817 -50797 151688 99863 70217 -33558 219525 280504
18832B80504h916j29786k13851a07798n6567Q1361k7759E4108k3714a77497Q6860
$$ 280504 -8916 -138702 -352553 -107798 -164365 -83004 -110763 54108 30394 -177497 -90637
18821i0637f716j47265M7284q9306n5686P0604B8203P8413c7636A9622c1647l8221
$$ -90637 -6716 -153981 -106697 -196003 -251689 -181085 28203 106616 -37636 19622 -31647 -69868
18809f9868L3523A47402a97540A53016J64185j11732i6431k0519A0113c34635
$$ -69868 -36345 147402 -197540 153016 317201 205469 -96431 -116950 10113 -334635
18798C04172J14537f9522A85461a34189A63861l3869P0181j3320H2082M1761d01704
$$ 304172 418709 -69522 185461 -134189 163861 129992 200173 186853 82082 123843 -401704
18786b91602d5635A85563g6106B1674a56402B49352a91460c1003l4480n8780A18388
$$ -291602 -45635 185563 -76106 21674 -156402 249352 -191460 -31003 -65483 -124263 118388
18774C2621L65656d17834A30238e26968a63301c3791B26722B4736L78117a25279
$$ 32621 398277 -417834 130238 -526968 -163301 -33791 226722 24736 402853 -125279
18763E1946M8195a9483B1366J52419B4357M4415d20769a31643c6766j96930E6728
$$ 51946 100141 -19483 21366 173785 24357 68772 -420769 -131643 -36766 -233696 56728
18751a93205d3982j79458b3249q2411j34146E6350f2872n2455F2640e2073b2630
$$ -193205 -43982 -223440 -23249 -105660 -239806 56350 -62872 -115327 62640 -52073 -22630
18739C4525J15796a77051G8055K72329d4438K121j37815a6012A97063A711O741
$$ 34525 150321 -177051 78055 350384 -44438 -42317 -180132 -16012 197063 1711 8452
18728H452b08835o4558B39136b9139p0556b812C8053J14165b31068a5186B65071
$$ 8452 -208835 -273393 239136 -29139 -99695 -2812 38053 152218 -231068 -15186 265071
18716A17876a88081B225b18279G9364a21979k24806A557a26682A33249b02155
$$ 117876 -188081 2225 -218279 79364 -121979 -346785 1557 -126682 133249 -202155
18705a29370H6259a21502j45610d3198A77307B3429a12515H1035a55938q1088
$$ -129370 86259 -121502 -267112 -43198 177307 23429 -112515 81035 -155938 -237026
18695b37026L9184k29441f4348A45836d4649j33401k36B87079A30725c59905C06919
$$ -237026 -197842 -427283 -64348 145836 -44649 -178050 -178286 287079 130725 -359905 306919
18683a90874f6697A42322a68917A25094a39361j07987Q2227a1349j68451k06820
$$ -190874 -66697 142322 -168917 125094 -139361 -247348 -165121 -11349 -179800 -386620
18673c86620F5167J6155b71440J35418L8034A47337a15138d746H2510b53004e5205
$$ -386620 65167 81322 -271440 -136022 -97988 147337 -115138 -4746 82510 -253004 -55205
18661A36199c84974D933M3309i759k23390H4445b00351F1855B7817f0446a6600
$$ 136199 -384974 4933 48242 -9759 -233149 84445 -200351 61855 27817 -60446 -16600
18649A452c56482b0645r2321C0546a425j15436j18979a14921j04127c9299j4879
$$ 1452 -356482 -20645 -112966 30546 -1425 -116861 -235840 -114921 -219048 -39299 -54178
18638e4178q2301c9958r7400O7971b4274j29823F0180i8960r9524M1277F4584
$$ -54178 -136479 -39958 -137358 -69387 -24274 -154097 60180 -98960 -198484 -157207 64584
18626h9563A55435A5304K6474K1379b6921E7460J7755f0548d002k86847a08860
$$ -89563 155435 15304 41778 63157 -26921 57460 75215 -60548 -4002 -290849 -108860
18614C3112b7301n7449G7037i0419K9552A77509A5590b7421A78271a77123d1319
$$ 33112 -27301 -84750 77037 -90419 -60867 177509 15590 -27421 178271 -177123 -41319
18602a07252p6276N6240G573O865a26252L7041G9470Q9006a26041k16897B59893
$$ -107252 -183528 -127288 7573 14438 -126252 -89211 79470 168476 -126041 -342938 259893
18590e8534k18956A49985d12784B15978j9844a15967d7955b1294j96948a649r3025
$$ -58534 -277490 149985 -412784 215978 196134 -115967 -47955 -21294 -218242 -1649 -94674
18579i4674J137L0131l6289j49742a15087o4432B07242H5577a17171A74795b80611
$$ -94674 -93537 -63406 -99695 -249437 -115087 -179519 207242 85577 -117171 174795 -280611
18567g1509D06570b23509L647B09758F0839b50547j13882B7409a90162i1937A10593
$$ -71509 406570 -223509 -219862 209758 60839 -250547 -364429 27409 -190162 -91937 110593
18555A9286J7969c0139G6812d7619j57014J0608b4473m4441L3717k7239A2603
$$ 19286 37255 -30139 76812 -47619 -204633 -194025 -24473 -68914 -35197 -62436 12603
18543A72022c6633C23598E9252f1233b4048B53616g3777j50950R7361A69851b05814
$$ 172022 -36633 323598 59252 -61233 -24048 253616 -73777 -224727 -127366 169851 -205814
18531a47622a7972j06046j22072J13262A03071r183B2327b57643j9478Q1602M1890
$$ -147622 -17972 -124018 -246090 -132828 103071 93888 22327 -257643 -277121 -195519 -153629
18520a53629G8687b85837a09097r3450d0077B78236j15405G722c36689E9317d911
$$ -153629 78687 -285837 -109097 -202547 -40077 278236 162831 7722 -336689 59317 -4911
18508a54451A3192b29775p264R1899N1241A29808c85117O6025D9523f7108F9804
$$ -154451 13192 -229775 -237039 -145140 -93899 129808 -385117 -319092 49523 -67108 69804
18496A2919L3158L3756h3341K3138K9496A37601K0855c27448d2123k4101k50946
$$ 12919 46077 79833 -83341 -60203 -30707 137601 158456 -327448 -42123 -66224 -317170
18485c17170e3052C3907b822C24591G2936a65832m9839D05292F8173b2195q0878
$$ -317170 -53052 33907 -2822 324591 72936 -165832 -215671 405292 68173 -22195 -103073
18474a03073C99556b22108D8967B3392Q6991f5100C1062b20298H8901L7245j6796
$$ -103073 399556 -222108 48967 23392 110383 -65100 31062 -220298 88901 126146 109350
18463A09350a995n6609f708n9420k3293I6418a74294A32682K2638b07764B46144
$$ 109350 -1995 -58604 -6708 -66128 -89421 96418 -174294 132682 155320 -207764 246144
18451H1609J888f5998N431l683B30003E7627J00652c15646A40313b0315r5783
$$ 81609 83497 -65998 -60567 -64250 230003 57627 158279 -315646 140313 -20315 -116098
18440a16098I0741I545c30380h812k73301k2855D2829q373b18375a1951n0334
$$ -116098 90741 9545 -330380 -8812 -282113 -304968 42829 34456 -218375 -11951 -62285
18429f2285C8670N3567a47894A12043b19442a2903B41465e0556A4685e34134c5446
$$ -62285 38670 92237 -147894 112043 -219442 -12903 241465 -50556 14685 -534134 -35446
18417C03401c9156l09999B4780c59411a38872n9170m7348R2490k18776o1121i8221
$$ 303401 -39156 -349155 24780 -359411 -138872 -198042 -245390 -152900 -371676 -432797 -98221
18405c51018a23351A94149F7204K16517e3376a8510E5371O8219m059c33474B77655
$$ -351018 -123351 194149 67204 283721 -53376 -18510 55371 123590 119531 -333474 277655
18393A84204I1387g7055A23091m0881K06924q1804R9250a35794D22944d4725A39386
$$ 184204 91387 -77055 123091 82210 289134 207330 306580 -135794 422944 -44725 139386
18381e95452A77635c0375l60880E7709a20473G4741f6109k44536B05258b44246
$$ -595452 177635 -30375 -391255 57709 -120473 74741 -66109 -310645 205258 -244246
18370g8761B9877J7298b15086n0792G5472k3217L3829c4027p7804B9421l47h6461
$$ -78761 29877 47175 -215086 -265878 75472 52255 86084 -34027 -111831 29421 29074 -86461
18357b375o1708A06047A1464K8326d2815g398G5052J97350b01905l3608L9679
$$ -2375 -64083 106047 11464 39790 -42815 -7398 75052 272402 -201905 -235513 -195834
18346a95834m6956R3712A01276J82485a8322j28276A3012a17055b1509A03711
$$ -195834 -242790 -149078 101276 283761 -18322 -146598 13012 -117055 -21509 103711
18335b19564m0303f7921j54083g2684k20173B83085a55507K0178k71621a68418
$$ -219564 -259867 -67921 -222004 -72684 -292857 283085 -155507 -135329 -406950 -168418
18324d42071A19823j3894a69874L2060A99207h0505A10781b85340a41562o2344
$$ -442071 119823 105929 -169874 -137814 199207 -80505 110781 -285340 -141562 -203906
18314b03906B2721J22521a58111L0831G2306c95964a56437H8961P975b85396C02346
$$ -203906 22721 145242 -158111 -127280 72306 -395964 -156437 88961 96936 -285396 302346
18302c3160r2846A93931h397A71005c067j52732B88098A39047P8773c0380B19883
$$ -33160 -126006 193931 -8397 171005 -3067 -155799 288098 139047 217820 -30380 219883
18290B21635c463I0595C9524b64472c5509A30911B9424a53238A99429c31323B38240
$$ 221635 -3463 90595 39524 -264472 -35509 130911 29424 -153238 199429 -331323 238240
18278a22515a2342E3352b37511A70326L8203a51291q6428p871a00112j72781i5891
$$ -122515 -12342 53352 -237511 170326 208529 -151291 -237719 -245590 -100112 -272893 -95891
18266a12581K070D1360P1712i0957M017p9827a1637C26937c86051A8495J99936
$$ -112581 -110511 41360 113072 -90957 -86940 -166767 -11637 326937 -386051 18495 218431
18255B18431a7321M448j49740c6736B01112a76341F1511a19955A17291a13430
$$ 218431 -17321 -12873 -162613 -36736 201112 -176341 61511 -119955 117291 -113430
18244d7695H8032a10976j88569B4650P6249g5213A50056F6304h6583j65456K902
$$ -47695 88032 -110976 -299545 24650 100899 -75213 150056 66304 -86583 -252039 -249137
18233b49137j0563d7747j68214A00695Q1878b90272A06105i7071A15538a0787
$$ -249137 -259700 -47747 -215961 100695 182573 -290272 106105 -97071 115538 -10787
18222F2401J93602r8928c16848e5142a5574j44766F0419b95456a3012A81251F3185
$$ 62401 256003 157075 -316848 -55142 -15574 -160340 60419 -295456 -13012 181251 63185
18210H6334c66215B50955B2829a40869j95410a56957B57597A1899b65143J01981
$$ 86334 -366215 250955 22829 -140869 -336279 -156957 257597 11899 -265143 -163162
18200a63162B76006A10979L7163l7363c27437E6953J99321e4612l7743m8227A19989
$$ -163162 276006 110979 148142 110779 -327437 56953 256274 -54612 -92355 -140582 119989
18188B13218a33656l8177b0155p6381A37599m8992b11467B59058c26605g4556
$$ 213218 -133656 -171833 -20155 -96536 137599 88607 -211467 259058 -326605 -74556
18177a89444p1918a8359k5221j79314g4301A18355a35051f6984a7049A13583C5740
$$ -189444 -261362 -18359 -43580 -222894 -74301 118355 -135051 -66984 -17049 113583 35740
18165c1660B56677a40515G8277c4612A55238a271H9186J06165c72595H6359a07183
$$ -31660 256677 -140515 78277 -34612 155238 -1271 89186 195351 -372595 86359 -107183
18153B29318H2713c75519g9516A46078a10118j66456B95837C3501M913h525A28157
$$ 229318 82713 -375519 -79516 146078 -110118 -276574 295837 33501 38414 -8525 128157
18141b3941k39303d4338N003j10732B90457r0184B5740a36363j40375B83358c1698
$$ -23941 -263244 -44338 -39335 -150067 290457 200273 25740 -136363 -276738 283358 -31698
18129F2005i7220F9740G373J2012b66592a13145A25679b40839h1039k05040L8453
$$ 62005 -97220 69740 7373 19385 -266592 -113145 125679 -240839 -81039 -286079 -247626
18118b47626a17155H5604d03967g9403n6160j62414A0919c07640B22090E6149
$$ -247626 -117155 85604 -403967 -79403 -135563 -297977 10919 -307640 222090 56149
18107a6626j48341c5415l1956D1703L68b79462g8166A24459d03837a91235B33458
$$ -16626 -164967 -35415 -67371 41703 42071 -279462 -78166 124459 -403837 -191235 233458
18095e6957A33183D2078b19305J6252e1976p5212B93713A4049D172f7012m45g868
$$ -56957 133183 42078 -219305 -203053 -51976 -127188 293713 14049 4172 -67012 -67457 -7868
18082a31843b8305A24682Q1774g3499D2422J6610J02525k3945a98354j47518f1506
$$ -131843 -28305 124682 206456 -73499 42422 59032 161557 137612 -198354 -345872 -61506
18070A62283b5856k96710a16702b1666l4073H0494C3831b77181K2380d0466I7329
$$ 162283 -25856 -322566 -116702 -21666 -55739 80494 33831 -277181 -254801 -40466 97329
18058a58815L0154A30621n7904a20921e9500j07806N3438N1614K5123l91636B25188
$$ -158815 -128661 130621 72717 -120921 -59500 -167306 -113868 -62254 -37131 -428767 225188
18046a09685A06239J8524c26959A16372j0533J7090m8499B7230R4906b5952j30579
$$ -109685 106239 124763 -326959 116372 105839 122929 74430 27230 122136 -25952 -156531
18035a56531H3044K09798J27912a45534O7344J8810A65256a61820E771K41730
$$ -156531 83044 292842 420754 -145534 -78190 -59380 165256 -161820 5771 247501
18025B47501F9448a21799r5264Q3419B41396c3209j2307j66075k00178A45175
$$ 247501 69448 -121799 -217063 -133644 241396 -33209 -45516 -211591 -411769 145175
18014A62004a41059B80711D0575H02a61070k92697H0225b22811Q1421A44243h4133
$$ 162004 -141059 280711 40575 802 -161070 -453767 80225 -222811 -141390 144243 -84133
18002A06705b50899A40206B3633b4028j13377d0362j81536d9177b1482k31840
$$ 106705 -250899 140206 23633 -24028 -137405 -40362 -221898 -49177 -21482 -253322
17992b53322r704b2554K879B45509A11043c9575j50446Q833a7164j40219A8230
$$ -253322 -263026 -22554 -19675 245509 111043 -39575 -190021 -181188 -17164 -157383 18230
17980D7284F425a87335F8868a83293d1355r1218A51398a75273H562R4350a40699
$$ 47284 6425 -187335 68868 -183293 -41355 -132573 151398 -175273 8562 102912 -140699
17968c66852f2002A40208a79071A18927a06132G0851b05244f4924K1001E2264
$$ -366852 -62002 140208 -179071 118927 -106132 70851 -205244 -64924 -43923 52264
17957d9809q3681k54077a64352g8395j25089A67101p4387c72275A1653c09541
$$ -49809 -133490 -387567 -164352 -78395 -203484 167101 92714 -372275 11653 -309541
17946a12467A08868a08110A12267K6048A4388b47000A36961i231B7212N0283J9954
$$ -112467 108868 -108110 112267 138315 14388 -247000 136961 -9231 27212 77495 97449
17935I7449b16839A42557a0924r0102o8748A77175b06311F9633N7872K11523n5961
$$ 97449 -216839 142557 -10924 -101026 -169774 177175 -206311 69633 127505 339028 283067
17924B83067i068k28272D9780R9336k485d6679B79579b31274c2533C17090d6887
$$ 283067 -9068 -237340 49780 149116 146631 -46679 279579 -231274 -32533 317090 -46887
17912a34996b8599I4225j958l9134b9121A1343c4564G1914J27337c4844D5092
$$ -134996 -28599 94225 92267 53133 -29121 11343 -34564 71914 199251 -34844 45092
17900a40126B02323G4361j6712a64294f5959J8958j28764O340j28093e8544a3029
$$ -140126 202323 74361 57649 -164294 -65959 -47001 -175765 -169425 -297518 -58544 -13029
17888c21628H0426b46900i3472o0817M0525F3468a12213E479a42574e6961n940
$$ -321628 80426 -246900 -93472 -154289 -113764 63468 -112213 5479 -142574 -56961 -62901
17877f2901m04076a87177E7092Q4794a80757c7362A50068l8374l8188e9317n7683
$$ -62901 -466977 -187177 57092 141886 -180757 -37362 150068 111694 73506 -59317 -117000
17866a17000l741j31689A445K0628L0476e8665B86505A8325K61888j30687d2583
$$ -117000 -120741 -252430 1445 22073 52549 -58665 286505 18325 280213 149526 -42583
17854b541A51483B3967J76375p4272a3710B4704K55194b1982D63209a36035r4474
$$ -2541 151483 23967 200342 126070 -13710 24704 279898 -21982 463209 -136035 -230509
17843b30509j5964G3658d6798A62708a02115j4870n1367p8134R3681g4449j36879
$$ -230509 -246473 73658 -46798 162708 -102115 -116985 -168352 -246486 -152805 -74449 -211328
17832b11328B52296G1230d52055A63470b13726d8111A90321b40686B48705L9595
$$ -211328 252296 71230 -452055 163470 -213726 -48111 190321 -240686 248705 288300
17822B88300a74073B0603h6595A9638d22096M3144A95819a62553k9864g5279A81192
$$ 288300 -174073 20603 -86595 19638 -422096 -378952 195819 -162553 -192417 -75279 181192
17810a84218j47670A48187i856k20591a8244p5460B25633J04160b3462p6794I7470
$$ -184218 -331888 148187 -9856 -230447 -18244 -93704 225633 329793 -23462 -100256 97470
17798B16830C6294j4255a67541J5032j70161F0088L9535O7290h2707B84656C7424
$$ 216830 36294 22039 -167541 -152509 -322670 60088 99623 166913 -82707 284656 37424
17786E9370b3166F2598b81172O1339k40211G157b9683j44386A20871J13348n0030
$$ 59370 -23166 62598 -281172 -219833 -460044 7157 -29683 -174069 120871 234219 184189
17775A84189a33895J4797E4657a36775A6359d49063C25552g3079R725D644a35197
$$ 184189 -133895 -119098 54657 -136775 16359 -449063 325552 -73079 -63354 4644 -135197
17763B2418a20534B60972j08268a80568a5081k61404m8279A44382e5835o9435
$$ 22418 -120534 260972 152704 -180568 -15081 -276485 -324764 144382 -55835 -125270
17753a25270E2701c4455l2600b5348p3646k51631a28083q3021A81835o185c0986
$$ -125270 52701 -34455 -67055 -25348 -98994 -350625 -128083 -211104 181835 175650 -30986
17741A50904e3446B42254q0999B6748Q6390f0119d968l21764e6233j17289m4347
$$ 150904 -53446 242254 161255 26748 113138 -60119 -4968 -326732 -56233 -173522 -217869
17730b17869P4276N0204G4953L72690f4572H7571f1314L889j89127L2979A66430
$$ -217869 -143593 -93389 74953 447643 -64572 87571 -61314 -57425 -246552 -213573 166430
17718d3608A95341b40300B03192B1965g8935B5651a03566b9554h170C03977b33890
$$ -43608 195341 -240300 203192 21965 -78935 25651 -103566 -29554 -8170 303977 -233890
17706a11385l3174A27127Q0080O3840A31005D4797K5414a04556D12393h4248j82324
$$ -111385 -144559 127127 207207 271047 131005 44797 70211 -104556 412393 -84248 -266572
17695b66572H4360b12737B69241i72k5119C58788c0150j5267A40138g1619A63384
$$ -266572 84360 -212737 269241 -972 -26091 358788 -30150 -45417 140138 -71619 163384
17683A18832k4014L56619j69169C0136a38465l78382a27552I9366D9179J83891
$$ 118832 94818 451437 282268 30136 -138465 -516847 -127552 99366 49179 233070
17673B33070K81058B11106c0794l47066A36490i1975m5217A50076g2036m17l866
$$ 233070 514128 211106 -30794 -377860 136490 -91975 -137192 150076 -72036 -72453 -76319
17662g6319D0753J36945m5636E5203a2569m3249n44a1204L105j62378D43416A58159
$$ -76319 40753 177698 132062 55203 -12569 -55818 -56362 -11204 -8099 -170477 443416 158159
17649B76683k9658a5567C09423f2455j74784A80544R9640g8492D179L56574I6856
$$ 276683 247025 -15567 309423 -62455 -237239 180544 280184 -78492 4179 360753 96856
17637c07995a00631c3752C7181c6263o4974A07766b1027m9679G604L46252B3688
$$ -307995 -100631 -33752 37181 -36263 -101237 107766 -21027 -70706 7604 353856 23688
17625B33629a25421B02101b4527A01765D2931J982J19963c62591B37690A05379
$$ 233629 -125421 202101 -24527 101765 42931 44913 164876 -362591 237690 105379
17614d9163H0343b69578A00507a75916M0210A58641o0374D5792P1535k0648b9739
$$ -49163 80343 -269578 100507 -175916 -135706 158641 98267 45792 117327 96679 -29739
17602a25328d800I0959a66070h734G6469a78201f9444A33742E0017O5838c88572
$$ -125328 -4800 90959 -166070 -8734 76469 -178201 -69444 133742 50017 115855 -388572
17590b31027A97110b17251C17428j43630G7534K16766p0610A5763K11802b85336
$$ -231027 197110 -217251 317428 173798 77534 294300 223690 15763 227565 -285336
17579B28607d1637b0048j08488B89003K2622j48704f9336C1255a08644E3187A3732
$$ 228607 -41637 -20048 -128536 289003 311625 162921 -69336 31255 -108644 53187 13732
17567a7162H8655b13896A05348g0622A39816K01941A66446a58529A85140f2315
$$ -17162 88655 -213896 105348 -70622 139816 341757 166446 -158529 185140 -62315
17556G729e7063k4149G7784Q1928P9559A13513a10684A43637o8379a74387C0393
$$ 7729 -57063 -81212 77784 159712 239271 113513 -110684 143637 75258 -174387 30393
17544A22568b72832M7131f9981A28469h247D2396j4730d0819A88074q2692b22630
$$ 122568 -272832 -225701 -69981 128469 -8247 42396 27666 -40819 188074 105382 -222630
17532a3453j45858A5639J64425q0890b45067C4609K00531L7012m0788P3031j02870
$$ -13453 -159311 15639 180064 99174 -245067 34609 235140 272152 231364 304395 201525
17521B01525j6419A0176a11408G0634f8252A07181K6256C4216i9157h362D5318
$$ 201525 185106 10176 -111408 70634 -68252 107181 133437 34216 -99157 -8362 45318
17509a92858B03034b5532B6121e0460A09547b92169F8050c97111G6788K64169
$$ -192858 203034 -25532 26121 -50460 109547 -292169 68050 -397111 76788 340957
17499C40957G9979K37591A46691K70691j97792H3654h1887A98924F8275N1538
$$ 340957 79979 317570 146691 417382 219590 83654 -81887 198924 68275 119813
17489A19813K24020d15864C32987A1414G17J47327b33185e286r1473J6761C14513
$$ 119813 343833 -415864 332987 11414 717 148044 -233185 -5286 -96759 -79998 314513
17477a89203L2112B12376a08484D89940B7809d420l7702E4546O8633J81175l9693
$$ -189203 -157091 212376 -108484 489940 27809 -4420 -42122 54546 123179 304354 264661
17466B64661j16214b5497B17760A06678J8615l2818K71986M9908m0085p4519a50499
$$ 264661 148447 -25497 217760 106678 125293 92475 364461 414369 374284 299765 -150499
17454A53782h6632B29745G6789L5223K7654n3673M2013n6471K63172A55472b04059
$$ 153782 -86632 229745 76789 112012 139666 85993 128006 71535 334707 155472 -204059
17442B17159N1504j119J84643d0445D92862A37041J70121j01477p6720K23743
$$ 217159 268663 267544 452187 -40445 492862 137041 307162 205685 128965 352708
17432C52708K78429B37449E8189L98955j67770K13989f7523E54353k05320b682
$$ 352708 631137 237449 58189 457144 289374 503363 -67523 554353 349033 -2682
17421C2509J35104A5283K93461A05000Q9125J04785A11306K43573F0192J52840
$$ 32509 167613 15283 308744 105000 194125 298910 111306 354879 60192 213032
17411B13032O2404J32723j48546K26236c0961o8132A88512L227P2575g089A26998
$$ 213032 275436 408159 259613 485849 -30961 -99093 188512 191739 264314 -7089 126998
17399B48614J5830A23524J93218n1437E8218b69255B93284b6485k0955j51350
$$ 248614 264444 123524 316742 265305 58218 -269255 293284 -26485 -47440 -198790
17389a98790F9434a49352P0123D98963a9488A57884J43011f2428l0677A81253
$$ -198790 69434 -149352 -79229 498963 -19488 157884 300895 -62428 -93105 181253
17378C30985A7614O8071J39663c1439A7021g1581F44804F0306L2611m4033b7551
$$ 330985 17614 85685 225348 -31439 17021 -71581 644804 60306 92917 48884 -27551
17366a707A43877J91710A27242J14447A08794a11043M9312B80315R2491p7004
$$ -1707 143877 335587 127242 241689 108794 -111043 -61731 280315 372806 295802
17356B95802J24561j72694A22190J41663k2760d2898B53872p1536F2004b6716
$$ 295802 420363 247669 122190 263853 241093 -42898 253872 182336 62004 -26716
17345B86773a89907f5665B06883J43235l3164D1658K74514F5189f9843G5254k4462
$$ 286773 -189907 -65665 206883 350118 316954 41658 316172 65189 -69843 75254 50792
17334E0792K51276k5068a79793B44689J89942b2674B28157K16054k0308A98334
$$ 50792 302068 277000 -179793 244689 434631 -22674 228157 444211 423903 198334
17323g6732j73097A58089a14707B89929K09447q8749A77399O3154c0443A97594
$$ -76732 -249829 158089 -114707 289929 499376 410627 177399 240553 -30443 197594
17312a46834J5665C58707F5271N08774A13801L7702R0294j0105M1261A05165G389
$$ -146834 -131169 358707 65271 574045 113801 151503 241797 231692 272953 105165 7389
17300A23272M9158B4085J22420P4092J52351j77291q5210K31531l7653J43731
$$ 123272 172430 24085 146505 220597 372948 195657 110447 341978 304325 448056
17290D48056I7901b48130O0076C5925J80671o9914h225C3386h5847E58891A72392
$$ 448056 97901 -248130 -188054 35925 216596 146682 -8225 33386 -85847 558891 172392
17278A57427l0277K46636A460L31351A39552K19798j42541J42253n5241A28178
$$ 157427 127150 373786 1460 332811 139552 359350 216809 359062 303821 128178
17267E60325k44383L42236A06470J87631A05343N312K97749A86450B5399K19651
$$ 560325 315942 658178 106470 294101 105343 110655 408404 186450 25399 245050
17257B45050q438A4501K72088o0140q1955Q3525R183K04223K161k19905K02416
$$ 245050 236612 14501 286589 226449 144494 228019 237202 441425 443586 223681 426097
17246D26097A0032L11922A52268E4050e2172B78355q0951L0293p7016f4848B57502
$$ 426097 10032 321954 152268 54050 -52172 278355 197404 227697 150681 -64848 257502
17234C47543j23824d889A76822J51270K9296r1661r5490L6677C8812L28011G727
$$ 347543 223719 -4889 176822 328092 357388 265727 170237 206914 38812 366823 7727
17222H4124J52524l4331J38181o4020K5853A22579m8615L81263H5930J89945l7891
$$ 84124 236648 202317 340498 276478 302331 122579 73964 455227 85930 275875 237984
17211B37984J77656I185N34483A0342K57869J7300L21110G2199Q0663M28728l4158
$$ 237984 415640 9185 543668 10342 268211 285511 606621 72199 152862 581590 547432
17200E47432j69259C8440O3141N0893K07104A36367b01742B18054A07430J33431
$$ 547432 378173 38440 101581 152474 359578 136367 -201742 218054 107430 240861
17190B40861o6228R6099J7200I5695O1410R9543a628D35603j76957J11334A15286
$$ 240861 174633 270732 287932 95695 157105 256648 -1628 435603 258646 369980 115286
17178B13214P4415n7660K82780j1677k39846a22695B96733O5337P7432p4020A31302
$$ 213214 287629 229969 512749 501072 261226 -122695 296733 362070 439502 365482 131302
17166B44156J73629J19491k65949M81025C55474O3785G9240J12494K9986J0291
$$ 244156 417785 537276 271327 752352 355474 419259 79240 191734 221720 232011
17156B32011J34665j8082J44509R5081B33377G5202K83532A32743J42199q0994
$$ 232011 366676 348594 493103 588184 233377 75202 358734 132743 274942 193948
17146A93948L99829k21008I8672K78119K4124A53124K64600K52075A70781l2281
$$ 193948 593777 372769 98672 376791 400915 153124 417724 669799 170781 138500
17136A38500N4962J16826A07075K80486B3703M42364J79585j18019B53959p9892
$$ 138500 193462 310288 107075 387561 23703 466067 645652 527633 253959 174067
17126A74067K80254A72152M21675K13172B57466r1057R159O08920l60350J92736
$$ 174067 454321 172152 593827 806999 257466 166409 175568 784488 424138 616874
17116F16874j28484H3380K37053p8812K06234k4724O5680P2703n0242Q1822k57017
$$ 616874 488390 83380 320433 241621 447855 423131 488811 561514 511272 593094 336077
17105C36077l992K06954j44369J23309g3204E72404L7323B97257R4703J28232
$$ 336077 332085 539039 394670 517979 -73204 572404 609727 297257 391960 520192
17095E20192J14288j63563P2254K20078l11415N3402B15932K9148P8935K99689
$$ 520192 634480 470917 543171 763249 451834 505236 215932 245080 324015 623704
17085F23704j29625L97147j99036p4084N920j50100m742B19491H4478L51856o5938
$$ 623704 494079 891226 692190 618106 624026 473926 469184 219491 84478 436334 370396
17074C70396j7862j39632K85483J7533p7195j84039K44793M9959j45568J50881
$$ 370396 352534 212902 498385 515918 438723 254684 499477 549436 403868 554749
17064E54749k16146L84983r9353j46663m9914K59710C02106o6606J80611J24025
$$ 554749 338603 723586 624233 477570 427656 687366 302106 235500 416111 540136
17054E40136j57257J61064J34727Q1011l35729J53849A28757L70880k00398K42564
$$ 540136 382879 543943 678670 759681 423952 577801 128757 499637 299239 541803
17044E41803m1500o457J75521C31540c5695D65480K69357n9979M12493m50136
$$ 541803 500303 493846 669367 331540 -35695 465480 734837 674858 1087351 637215
17034F37215j07751k52915L10180K8550k14089O9435K89743p1384K35927D01790
$$ 637215 529464 276549 586729 615279 401190 470625 760368 688984 924911 401790
17023D95692J75025k92333M14674k76618K18280j59289K94046l41395J46477Q2267
$$ 495692 670717 378384 793058 516440 734720 575431 869477 528082 674559 756826
17013G56826j69469J08414j33682K45699o9798l6889J20608D06064L16930K25520
$$ 756826 587357 695771 562089 807788 737990 701101 821709 406064 722994 948514
17003I48514k71379C04293K65453J90781p5393K7703k78540N42998l74939J11215
$$ 948514 677135 304293 569746 760527 685134 712837 434297 977295 602356 713571
16993G13571K60340l26215L92019k98073j21850M49621l67349M64563j79216j56413
$$ 713571 973911 647696 1039715 741642 619792 1069413 702064 1166627 987411 830998
16983H30998q48K40341l61587Q5855m0823l6621K55641k15695j401P7858K21055
$$ 830998 830150 1070491 708904 794759 753936 717315 972956 757261 755860 833718 1054773
16972A054773k09783K4119l28418M36153j15906J4617J58867j65638L7874N03428
$$ 1054773 844990 869109 540691 976844 860938 875555 1034422 868784 906658 1410086
16962A410086F86197M21841j84268K58246l51864L16745j17052j62811N1645J10616
$$ 1410086 686197 1108038 923770 1182016 830152 1146897 1029845 867034 918679 1029295
16952A029295p3633M0959k18877L11184O3587j57615K15564m3064M58k58259j10419
$$ 1029295 955662 996621 777744 1088928 1152515 994900 1210464 1167400 1167858 909599 799180
16941G99180L06168J07519L6847r844k20517J4664p2930K67484K11062l16139
$$ 799180 1105348 1212867 1249714 1239870 1019353 1034017 961087 1228571 1439633 1123494
16931A123494J51069j90081j56059K08140M22928j20101p4876j41517L20193m9295
$$ 1123494 1274563 1084482 928423 1136563 1559491 1439390 1364514 1222997 1543190 1493895
16921A493895q5454l2165j68449J26704N14554m18146j56735N13578m80327j39001
$$ 1493895 1408441 1376276 1207827 1334531 1849085 1430939 1274204 1787782 1307455 1168454
16911A168454O69604l63950L48011m73894L76840P7481J04966j06216q0189j58969
$$ 1168454 1838058 1474108 1822119 1348225 1725065 1802546 1907512 1801296 1721107 1562138
16901A562138j35358L61920o6227L677O6538J70967j1828J22512o8409j79533
$$ 1562138 1426780 1788700 1722473 1726150 1792688 1963655 1951827 2074339 2005930 1826397
16891A826397q0299L90724k97629k8543o9968K92665o8067M2704J39531j25000
$$ 1826397 1746098 2136822 1839193 1810650 1740682 2033347 1965280 2007984 2147515 2022515
16881B022515K14352q1490l7600J54111r0168K78709l29454K9515L90656j05413
$$ 2022515 2236867 2155377 2117777 2271888 2181720 2460429 2130975 2160490 2551146 2445733
16871B445733k86208K28663J32599k61547Q1773J17710q508K48417j77529J59431
$$ 2445733 2159525 2388188 2520787 2259240 2341013 2458723 2450215 2698632 2521103 2680534
16861B680534J06369K56099m92878P78793m01610l15607M06175m27845L61857
$$ 2680534 2786903 3043002 2550124 3328917 2927307 2611700 3017875 2590030 2951887
16852B951887k83029K53701p8826J65731j4668j34462K44731L61908o2615j45938
$$ 2951887 2668858 2922559 2843733 3009464 2994796 2860334 3105065 3466973 3404358 3258420
16842C258420N22798l99823K88275l8667k19443K37624k91725K53157K92113K8658
$$ 3258420 3781218 3381395 3669670 3631003 3411560 3649184 3357459 3610616 3902729 3931387
16832C931387k49426M52160P8069o7228q8980J25836j39012j20190Q86645k95442
$$ 3931387 3681961 4134121 4212190 4144962 4055982 4181818 4042806 3922616 4809261 4513819
16822D513819j42936N34745l07591k6296J89244j3000L32802J66272p4608J67645
$$ 4513819 4370883 4905628 4598037 4571741 4760985 4747985 5080787 5247059 5172451 5340096
16812E340096K95257J90954k03274L00259K15696P0445l13582N00784j08336J32834
$$ 5340096 5635353 5826307 5623033 5923292 6138988 6209433 5895851 6396635 6288299 6421133
16802F421133M6872L5173N37400J29838P9854J97206K26050P1667J33465N1252
$$ 6421133 6468005 6503178 7040578 7170416 7250270 7447476 7673526 7745193 7878658 7929910
16792G929910M5513Q11111k48430j38948O17239L67191k08649L35506K68143L00970
$$ 7929910 7975423 8786534 8538104 8399156 9016395 9383586 9174937 9510443 9778586 10079556
16782A0079556M07491n2207K84756M17170O90985j19368K42156O50108M35215
$$ 10079556 10487047 10434840 10719596 11136766 11827751 11708383 11950539 12600647 13035862
16773A3035862M16182j31729R19275q1057M94513L49944P97756M35066J45261
$$ 13035862 13452044 13320315 14239590 14158533 14653046 15002990 15800746 16235812 16381073
16764A6381073O79058P47872N8814J037918P97759L85571O35075P75396P87784
$$ 16381073 17060131 17808003 17866817 18904735 19702494 20088065 20723140 21498536 22286320
16755B2286320J053002N23877R88529J331536Q01679O58258J155972J271938J373402
$$ 22286320 23339322 23863199 24851728 26183264 26984943 27643201 28799173 30071111 31444513
16746C1444513J166603J388723J388220J775145J214886K219348J905516J903397
$$ 31444513 32611116 33999839 35388059 37163204 38378090 40597438 42502954 44406351
16738D4406351K119144K147204K356836K649613K722998K896819L230437K988214
$$ 44406351 46525495 48672699 51029535 53679148 56402146 59298965 62529402 65517616
16730F5517616L460304M151057L403010M484356M737905M207682N421651M757525
$$ 65517616 68977920 73128977 76531987 81016343 85754248 89961930 95383581 100141106
16722A00141106N709295O023105N798802O408508N819670O603039O303695O300606
$$ 100141106 105850401 111873506 117672308 124080816 129900486 136503525 142807220 149107826
16714A49107826N816529O107160N718049M836016M122042L432053L049378J958135
$$ 149107826 154924355 161031515 166749564 171585580 175707622 179139675 182189053 184147188
16706A84147188P05118n39426j212409j976935l194031l999985m916224n044703
$$ 184147188 184852306 184312880 183100471 181123536 177929505 173929520 169013296 163968593
16698A63968593o130961o128510o244092o541155o329975o723691o239887n975470
$$ 163968593 157837632 151709122 145465030 138923875 132593900 125870209 119630322 113654852
16690A13654852n920506n961122n706716m795556n210098m450755m908281l754191
$$ 113654852 107734346 101773224 96066508 91270952 86060854 81610099 76701818 72947627
16682G2947627m120838l656161l370553l160899l215625k685333k660237k509005
$$ 72947627 68826789 65170628 61800075 58639176 55423551 52738218 50077981 47568976
16674D7568976k382909k134751k160990j635545k046169j643569j531038j721341
$$ 47568976 45186067 43051316 40890326 39254781 37208612 35565043 34034005 32312664
16666C2312664j297224j174390j360551j278934j061261r10319r74471q03294
$$ 32312664 31015440 29841050 28480499 27201565 26140304 25229985 24255514 23452220
16658B3452220r91448r54017n88982p65138j183356l94368r72112j78761q79384
$$ 23452220 22460772 21506755 20917773 20152635 18969279 18574911 17602799 17424038 16544654
16649A6544654l20417n01924l18241q66434r0419o77375q0248q57822K35217j147500
$$ 16544654 16224237 15722313 15404072 14537638 14447219 13769844 13689596 12831774 13066991 11919491
16639A1919491n4210l93699j92290l98610k77322m87200l54503J35156j97444
$$ 11919491 11865281 11471582 11279292 10880682 10603360 10116160 9761657 9896813 9699369
16630I699369n24645K06025o86386j58113m3113k22457k14395n94073M05104n89410
$$ 9699369 9174724 9380749 8694363 8536250 8493137 8270680 8056285 7462212 7867316 7277906
16620G277906R7231j85208p8496o20180n2716J63050m29580j86272l16958k9426
$$ 7277906 7375137 7189929 7111433 6491253 6438537 6601587 6172007 5985735 5668777 5639351
16610E639351J48816J3573l72296k55438j5580k41775K47995k82089j31625k10316
$$ 5639351 5788167 5801740 5429444 5174006 5158426 4916651 5164646 4882557 4750932 4540616
16600D540616k1243K98361k34284l14609K2366j40157O5799m42473K66140o7782
$$ 4540616 4519373 4817734 4583450 4268841 4291207 4151050 4216849 3774376 4040516 3972734
16590C972734K3471J61586l75839j98184J50893j98067m4318M8012N3716l02525
$$ 3972734 3996205 4157791 3781952 3583768 3734661 3536594 3492276 3540288 3594004 3291479
16580C291479J5281k28302J59594j90553k19770K04636O1535m1238Q772j70284
$$ 3291479 3306760 3078458 3238052 3047499 2827729 3032365 3093900 3052662 3061434 2891150
16570B891150l40525L18633j92107j95382j62826M36931m1717l11051L27608m25588
$$ 2891150 2550625 2869258 2677151 2481769 2318943 2755874 2714157 2403106 2730714 2305126
16560B305126R667k07669m9325J90593Q9589J14396k24560j64755j08550j33400
$$ 2305126 2314793 2107124 2057799 2248392 2337981 2452377 2227817 2063062 1954512 1821112
16550A821112L12427j22152j00941l8158M919J33589o14748K89159K15806n8713
$$ 1821112 2133539 2011387 1910446 1872288 1877207 2010796 1396048 1685207 1901013 1842300
16540A842300L44276l19222j83753K21604l7445j27504l9955l29864m9913N85918
$$ 1842300 2186576 1867354 1683601 1905205 1867760 1740256 1700301 1370437 1320524 1906442
16530A906442j33964K57917n87394l78096K61449j27172J39974n8210R2709j6481
$$ 1906442 1772478 2030395 1443001 1064905 1326354 1199182 1339156 1280946 1373655 1357174
16520A357174p1077n3120K87824R3279q5996l50828J66581K26003k69965J83604
$$ 1357174 1286097 1232977 1520801 1614080 1528084 1177256 1343837 1569840 1299875 1483479
16510A483479l8268K1593j94521M6947J86587l63437L22046o31792M75632j22762
$$ 1483479 1445211 1466804 1272283 1319230 1505817 1142380 1464426 832634 1308266 1185504
16500A185504R206j84553j03602J04620j41410L78715j69416k97457K17555k13510
$$ 1185504 1194710 1010157 906555 1011175 869765 1248480 1079064 781607 999162 785652
16490G85652P7179N36145j18702n2272j29349D72403M67493l8751j99484K04209
$$ 785652 862831 1398976 1280274 1228002 1098653 472403 939896 901145 701661 905870
16480I05870L8534j80041k16370M64883p6813O6938j17366j21210K06574k21922
$$ 905870 944404 764363 547993 1012876 936063 1003001 885635 764425 970999 749077
16470G49077j79287J63010j72484J9162J77271k84314M14596Q7065l84676r9469
$$ 749077 569790 732800 560316 579478 756749 472435 887031 974096 589420 489951
16460D89951J38733K35694J3837j75527J06217Q7976k3194j89948j25939K79717
$$ 489951 628684 864378 878215 702688 808905 896881 873687 683739 557800 837517
16450H37517B22747J89444K17289J58117M578m5220j83732R3836B85793M65455
$$ 837517 222747 412191 629480 787597 792175 746955 563223 657059 285793 751248
16440G51248j07978K72674k68700j33747p2470J53474J35834k08508m0289J52151
$$ 751248 643270 915944 647244 513497 441027 594501 730335 521827 481538 633689
16430F33689k88236J69662j13104M57734j92681J6440k21696L5516j09076j41932
$$ 633689 345453 515115 402011 859745 667064 683504 461808 497324 388248 246316
16420B46316K54338J164J00650n1612K9470k20919N6519J27171O2407J35297l47139
$$ 246316 500654 501818 602468 550856 580326 359407 415926 543097 605504 740801 393662
16409C93662k4454J73214j2521k56135L02340m2816J16719j99574L44268C58348
$$ 393662 369208 542422 529901 273766 576106 533290 650009 450435 794703 358348
16398G56822l29712q8240K14158m8073k45706K22219J20433A10306K68656j78321
$$ 756822 427110 338870 553028 504955 259249 481468 601901 110306 378962 200641
16388B00641K31605q1105J10686j61157J60342A9599L16339l4437J2567K8280
$$ 200641 432246 351141 461827 300670 461012 19599 335938 301501 314068 342348
16378C42348a7977C38903O9250O5673j49311o3352l3607L52206k40578K62874
$$ 342348 -17977 338903 408153 473826 324515 261163 227556 579762 339184 602058
16368F02058j94148J4804k05222J26645J07479j34191o4347P1405j56946J06901
$$ 602058 407910 422714 217492 344137 451616 317425 253078 324483 167537 274438
16358B74438L1234K15645A87255J29692Q2188A06147K35368j51858m5834O2839
$$ 274438 305672 521317 187255 316947 399135 106147 341515 189657 143823 206662
16348B06662Q564J66088A67732e3937I9959L32556A24187m678K5962N3968D1218
$$ 206662 215226 381314 167732 -53937 99959 432515 124187 119509 145471 199439 41218
16336b1969E78374A31945P038K7522J88837k3703J50321A14040O1589g0391C76448
$$ -21969 578374 131945 138983 166505 355342 331639 481960 114040 175629 -70391 376448
16324A86812N1663h095B42717l7687Q5993N1570C9680J21759L32141j70352b6210
$$ 186812 238475 -8095 242717 205030 291023 342593 39680 161439 493580 323228 -26210
16312C43114j3966A0064O1206a4065B11334B4386J56789p5470K8790C3981a81790
$$ 343114 329148 10064 71270 -14065 211334 24386 181175 105705 134495 33981 -181790
16300C81462E5246P7467M7910O0164e239D04529G232K50673J36985a58140C80269
$$ 381462 55246 132713 180623 240787 -5239 404529 7232 257905 394890 -158140 380269
16288C83744A11189D0067J10828E0931R7889f7959o4571A50758o6242Q9972Q5000
$$ 383744 111189 40067 150895 50931 148820 -67959 -132530 150758 84516 174488 259488
16277B59488A11050L73517j21124p3781G4507a0016B71439J96658B07850l2304
$$ 259488 111050 484567 363443 289662 74507 -10016 271439 468097 207850 175546
16267A75546L20454b18266d640j08018A16128K1187J45215o1490n5785D5357a8164
$$ 175546 496000 -218266 -4640 -112658 116128 137315 282530 221040 165255 45357 -18164
16255B83709c4967A13014l4260A087J82756P7071c7028A03421J5738L91573a82343
$$ 283709 -34967 113014 78754 1087 183843 260914 -37028 103421 119159 510732 -182343
16243A08315l5132J05822h4570j0759J9502C0372b15243b1302A19532n0828J50187
$$ 108315 73183 179005 -84570 -95329 -75827 30372 -215243 -21302 119532 68704 218891
16232B18891i3681k24529E8125J05186n1145K5838a74422J4379A3333J40004R6631
$$ 218891 -93681 -318210 58125 163311 112166 138004 -174422 -160043 13333 153337 249968
16221B49968o392A18784b43744B62654b329k2061D25421a35224C20942i8795F804
$$ 249968 243576 118784 -243744 262654 -2329 -24390 425421 -135224 320942 -98795 6804
16209B12282n3341d4802A45071m9293A5211O107O2629J94058i4774G8544g1636
$$ 212282 158941 -44802 145071 95778 15211 21318 83947 278005 -94774 78544 -71636
16197A49470a0234D72383b24808B41368A8615J22687D7266K88300a01054A31658
$$ 149470 -10234 472383 -224808 241368 18615 141302 47266 335566 -101054 131658
16186b1708C80688B3071g0495B5546K6940J05488C2324e6897K160J8501A05197
$$ -21708 380688 23071 -70495 25546 52486 157974 32324 -56897 -54737 -36236 105197
16174b45030A27678a48249a2786D23269A75936K02579d6169A58988a32572B6692
$$ -245030 127678 -148249 -12786 423269 175936 378515 -46169 158988 -132572 26692
16163A28132b70735A46101n3228a83044B01360b5584D4195a4029C7939J41913
$$ 128132 -270735 146101 92873 -183044 201360 -25584 44195 -14029 37939 179852
16153A79852R8657h6389B88378B7347P2120b48004E202J55586C0728a2285j96531
$$ 179852 278509 -86389 288378 27347 99467 -248004 5202 160788 30728 -12285 -208816
16142b08816H6533K7615E5190c571D1658F518J77229g6640L7018A40089a59265
$$ -208816 86533 114148 55190 -3571 41658 6518 183747 -76640 -39622 140089 -159265
16130A59342C2228q612Q9501G333b02844P7580A80814J4481D5976M439L09887
$$ 159342 32228 23616 113117 7333 -202844 -125264 180814 195295 45976 50415 360302
16119C60302b8585k0767j50369C597J87039F6886K60178A22425c79777B34039
$$ 360302 -28585 -49352 -199721 3597 190636 66886 327064 122425 -379777 234039
16108E4083k3741R5743N2421D7075J00928B2923K49643b57908A9511J06735g1702
$$ 54083 30342 126085 178506 47075 148003 22923 272566 -257908 19511 126246 -71702
16096B77340b35240F726J42334l7168q891e8885j55532c2947E617J3585j029J06356
$$ 277340 -235240 6726 149060 111892 103001 -58885 -214417 -32947 5617 19202 18173 124529
16084A24529k2763b38219C31072I3823c83448B82736D248K52153H4730L32578
$$ 124529 101766 -238219 331072 93823 -383448 282736 4248 256401 84730 417308
16074D17308i9201j32486G2169a59928B34894A06569R0627F0144b86745A01147
$$ 417308 -99201 -231687 72169 -159928 234894 106569 197196 60144 -286745 101147
16063h346D7408c560A35266J14842O3466C1334r30I996N1149j0159b99990e3773
$$ -8346 47408 -3560 135266 250108 313574 31334 30404 9996 61145 50986 -299990 -53773
16050E9965N6431C0946c84145a74846A84719b12909f2167B82155a25346p9794
$$ 59965 116396 30946 -384145 -174846 184719 -212909 -62167 282155 -125346 -205140
16040b05140a0133k04028B3225b62647A12872C2168a42771B4251e89629b1781
$$ -205140 -10133 -214161 23225 -262647 112872 32168 -142771 24251 -589629 -21781
16029b16646j28165H9141b09582A24420j3691d64647H5508L10572F3890c1701
$$ -216646 -344811 89141 -209582 124420 110729 -464647 85508 396080 63890 -31701
16018b80939J07610f3567m3101M3248j8129C80868G3322a08111N2334k39130E7404
$$ -280939 -173329 -63567 -106668 -63420 -81549 380868 73322 -108111 -55777 -294907 57404
16006A75194A8040J26703E0569J92697b93061h0229A7802c10220j9553b85j1661
$$ 175194 18040 144743 50569 243266 -293061 -80229 17802 -310220 -329773 -285 -11946
15995a1946B20357h6116J5411m0364A21125C7746D792b09110B28529k4710b72911
$$ -11946 220357 -86116 -70705 -111069 121125 37746 4792 -209110 228529 203819 -272911
15983C1709J14615a51344j58143a8097l21240A95814b59693g9G7342N4426b3628
$$ 31709 146324 -151344 -309487 -18097 -339337 195814 -259693 -79 77342 131768 -23628
15971i5958C06171b2815B18443M78057j35329E6220K90954q0756a10226d6018
$$ -95958 306171 -22815 218443 696500 561171 56220 347174 266418 -110226 -46018
15960e6225j96712A55891n635c04464B2379a82483A183i3650A18020J93200a46855
$$ -56225 -252937 155891 150256 -304464 22379 -182483 1183 -93650 118020 311220 -146855
15948a99375j5712A63225b06404e1596j00430A17357k3170H421a31783B5555A0292
$$ -199375 -215087 163225 -206404 -51596 -152026 117357 94187 8421 -131783 25555 10292
15936A46178b75180B08356G8118A1551h0401B32043a49371j74233d8421l03608
$$ 146178 -275180 208356 78118 11551 -80401 232043 -149371 -323604 -48421 -352029
15926c52029I3811a22606D3332b20899B23156a6986o2803j72712K0259l44781
$$ -352029 93811 -122606 43332 -220899 223156 -16986 -79789 -252501 -232242 -577023
15916e77023A70836o0730b39463a346r5223B8749M1595a98704C3250K0715d11218
$$ -577023 170836 110106 -239463 -1346 -96569 28749 70344 -198704 33250 53965 -411218
15904f2782p7969B10545b9781R568j43699A76066b55569B11242J3526e3751j30575
$$ -62782 -140751 210545 -29781 -20213 -163912 176066 -255569 211242 224768 -53751 -184326
15893a84326M6881C11278j18399k6025a27368j07982f5556A746a00001k7447F4467
$$ -184326 -137445 311278 192879 166854 -127368 -235350 -65556 1746 -100001 -127448 64467
15881F9419a84571A26187a54224N8217k49037A87551a00245A43612A9469c1010
$$ 69419 -184571 126187 -154224 -96007 -345044 187551 -100245 143612 19469 -31010
15870C7117c06599a7422B46479C4233b88210d8647j37792P1358n0575A16261a65554
$$ 37117 -306599 -17422 246479 34233 -288210 -48647 -186439 -115081 -165656 116261 -165554
15858A98705D4878J06979J87020b51975c7920A1691J13146a08142J2633J4791
$$ 198705 44878 151857 338877 -251975 -37920 11691 124837 -108142 -95509 -80718
15848h0718A55975a74419A99669h2778b0805A90304C8322J97922f6885k8062c9857
$$ -80718 155975 -174419 199669 -82778 -20805 190304 38322 236244 -66885 -94947 -39857
15836A8827a78242q3348E1700c2641j50222H412P5902K02777A42095j6786b86284
$$ 18827 -178242 -261590 51700 -32641 -182863 8412 84314 287091 142095 125309 -286284
15824B00206m4841J81273j03341a06785j56191A49035J09867a4527j21362I4717
$$ 200206 155365 336638 233297 -106785 -262976 149035 258902 -14527 -135889 94717
15813C4225d0773q0341D6800c04475h2275j9465k43383H9117f6705d220n8469
$$ 34225 -40773 -121114 46800 -304475 -82275 -101740 -345123 89117 -66705 -4220 -62689
15802f2689k91427a75793Q3667A68413i750A6113J38065F7817c7770k18243H3575
$$ -62689 -354116 -175793 -92126 168413 -9750 16113 154178 67817 -37770 -256013 83575
15790A74939m7879a4514F618K3892c1717B46463J22094b31723A87984a22951A85349
$$ 174939 127060 -14514 6618 30510 -31717 246463 368557 -231723 187984 -122951 185349
15778A31632J49836p2117a53299H3301h6466H1960d19585A20301a34164o7563
$$ 131632 281468 209351 -153299 83301 -86466 81960 -419585 120301 -134164 -201727
15768b01727j00287d5665I3609a04673B85523j28372L09718g9157D2321b16759
$$ -201727 -302014 -45665 93609 -104673 285523 157151 466869 -79157 42321 -216759
15757d0944j94374Q1050J2332f0911j61376a8737k80199g6750A94825I6647J8311
$$ -40944 -235318 -154268 -141936 -60911 -222287 -18737 -298936 -76750 194825 96647 114958
15746A14958c15000f4052B84302a5082E6073L29432A43346e9340C92835b0036
$$ 114958 -315000 -64052 284302 -15082 56073 385505 143346 -59340 392835 -20036
15735b93314f2547j05031C64883A56742e7070r0284j49603e0127p1454d4730A87961
$$ -293314 -62547 -167578 364883 156742 -57070 -147354 -296957 -50127 -121581 -44730 187961
15723b3356A01386B2170e08778D1405R1881d3665o6755n4524L7281b3325E5986
$$ -23356 101386 22170 -508778 41405 133286 -43665 -110420 -164944 -127663 -23325 55986
15711h5142j12528l2901I0350c08j24130B39860a06657J4703C8333J42817N8768
$$ -85142 -197670 -230571 90350 -308 -124438 239860 -106657 -91954 38333 181150 239918
15700B39918c57888A68537o0485J43899A5479c86722a24072j4317j08723a00346
$$ 239918 -357888 168537 108052 251951 15479 -386722 -124072 -138389 -247112 -100346
15689E9833j1538a60426B93345E9708a5766p6913A25050A5560K40265a61606L8433
$$ 59833 48295 -160426 293345 59708 -15766 -92679 125050 15560 255825 -161606 -123173
15678a23173A28098a26711j6474d4086A11557d2691j57630A73113E3119M2770
$$ -123173 128098 -126711 -143185 -44086 111557 -42691 -200321 173113 53119 95889
15668I5889J8055f2974n1851k68645I8904a16824b2466j49647B09575A9676L1100
$$ 95889 113944 -62974 -114825 -383470 98904 -116824 -22466 -172113 209575 19676 50776
15657E0776K0978c6789C3000N8919c745o0187C05999A30617d8899B22373a62006
$$ 50776 71754 -36789 33000 91919 -3745 -63932 305999 130617 -48899 222373 -162006
15645A23615k7804a09679A67809B8235c7873I6288a39662B94774e5329p3368C21295
$$ 123615 95811 -109679 167809 28235 -37873 96288 -139662 294774 -55329 -128697 321295
15633a14294m3415A31652b18155j39773B99496D6004O2553D3550a99546A00941
$$ -114294 -157709 131652 -218155 -357928 299496 46004 108557 43550 -199546 100941
15622c2132j361E735a76767A54037j8989b0296m8441K0390A3130K46494I0245
$$ -32132 -33493 5735 -176767 154037 135048 -20296 -68737 -48347 13130 259624 90245
15610a35732I6998e4115j00995C43730a52478O3224F7995i7468A74286J5530B7353
$$ -135732 96998 -54115 -155110 343730 -152478 -89254 67995 -97468 174286 189816 27353
15598a99595J2049A6687L575c9562k4313k56321O0834a14010o8353n7087A566
$$ -199595 -187546 16687 20262 -39562 -63875 -320196 -259362 -114010 -182363 -239450 1566
15586B65502o6191a63019m9206j59227A11215K08275o1676a47482E4647a14573
$$ 265502 199311 -163019 -212225 -371452 111215 319490 257814 -147482 54647 -114573
15575a98670D1252J01673c45242R6467A59799a957r7828A72842a35572C00418
$$ -198670 41252 142925 -345242 -248775 159799 -1957 -99785 172842 -135572 300418
15564c30477A02505O6963o1675K02514r7017a71843B6790a86114f0766J8338m5865
$$ -330477 102505 169468 107793 310307 213290 -171843 26790 -186114 -60766 -42428 -88293
15553h8293C9770f1689G62a40310I3028g5730m8921G0997c77552A28230i4261
$$ -88293 39770 -61689 762 -140310 93028 -75730 -124651 70997 -377552 128230 -94261
15541b89647a31207K008e1682J4283l70200f5090l9307d4667F7683J00860c2037
$$ -289647 -131207 -129199 -51682 -37399 -407599 -65090 -104397 -44667 67683 168543 -32037
15529a16521D1712h4025B44742A5490N8969a61872A09141j6573o119c99809a03648
$$ -116521 41712 -84025 244742 15490 74459 -161872 109141 92568 86449 -399809 -103648
15517A44777g374l36210I579J46126D0480b70302G4279K6473a4447C17859i6878
$$ 144777 -7374 -343584 9579 155705 40480 -270302 74279 100752 -14447 317859 -96878
15505b28128L0487l4396C41187d9226C05023j52296D5599j7489a02780B31013
$$ -228128 -197641 -232037 341187 -49226 305023 152727 45599 28110 -102780 231013
15494c6002A19444J10968M7164c79418A67029a93475O1253j15880N0317D0990
$$ -36002 119444 230412 277576 -379418 167029 -193475 -132222 -248102 -197785 40990
15483B12278a70775D1628N6500b15096D9154d8696J9034A59071F6215b43151I1080
$$ 212278 -170775 41628 98128 -215096 49154 -48696 -29662 159071 66215 -243151 91080
15471A56255J13344c6394j72395m073A88949m3673c28739a37497B8060b39846
$$ 156255 269599 -36394 -208789 -212862 188949 145276 -328739 -137497 28060 -239846
15460A79937b38469O7487a1639F6974f1884A12601a30338B80718l0353B2101a11664
$$ 179937 -238469 -170982 -11639 66974 -61884 112601 -130338 280718 250365 22101 -111664
15448C3600J22341K3825c1629n0250A58896D4396f5107N812b8958A95945m5219
$$ 33600 155941 179766 -31629 -81879 158896 44396 -65107 -59295 -28958 195945 150726
15437A50726J15902e2140a3978E6405J1211g9395K6303k7746o8608o4093k99507
$$ 150726 266628 -52140 -13978 56405 67616 -79395 -53092 -80838 -149446 -213539 -513046
15426e13046G8951a7676A51314l2509J09585n4916a31773F8142l1282N4920b34767
$$ -513046 78951 -17676 151314 118805 228390 173474 -131773 68142 36860 91780 -234767
15414c21959B12789b24507j01063J61235L4336I3828k752f9894j32967O1385j58770
$$ -321959 212789 -224507 -325570 -164335 -129999 93828 91076 -69894 -202861 -141476 -300246
15403c00246d5965j66161Q6109A3426a60570b2799j6531m1526A47645J48881L4804
$$ -300246 -45965 -212126 -126017 13426 -160570 -22799 -39330 -80856 147645 296526 331330
15392C31330C4707J75424H2774c3145j17631j17220J07710H271J7710J53702a72657
$$ 331330 34707 210131 82774 -33145 -150776 -267996 -160286 8271 25981 179683 -172657
15380B33779q4080o472a37821H007R6854g2517B8331e0268B457Q7297i7099L5896
$$ 233779 149699 143227 -137821 8007 104861 -72517 28331 -50268 2457 89754 -97099 -61203
15368f1203p2855M4890r8586F5672J85302l2790E144J74165p5312J14333a29091
$$ -61203 -134058 -89168 -187754 65672 250974 218184 5144 179309 103997 218330 -129091
15356A19125M9995b1511j7753r576B13082a6584H1580K14192b91667j00510e1358
$$ 119125 169120 -21511 -39264 -48840 213082 -16584 81580 295772 -291667 -392177 -51358
15344a05642A5235a1366q4598j61426E0364L2033a89218A54447j5724n9473d4448
$$ -105642 15235 -11366 -95964 -257390 50364 82397 -189218 154447 138723 79250 -44448
15332G6900j5810J19138L515a613A2140e2495j79570A49309a1664F6583N871a84396
$$ 76900 61090 180228 183743 -1613 12140 -52495 -232065 149309 -11664 66583 72454 -184396
15319A98391g8164l7817N4871B01325k9883b54894A75798a10774B69292a08477
$$ 198391 -78164 -115981 -61110 201325 171442 -254894 175798 -110774 269292 -108477
15308i1026A48742F5283J38425L4441p6315a37092q8658B7154f3301C62637b13442
$$ -91026 148742 65283 203708 238149 161834 -137092 -225750 27154 -63301 362637 -213442
15296C8597J7437f9307n24315A414a09680d5100F9554k4124h6621j59231O3147
$$ 38597 56034 -69307 -593622 1414 -109680 -45100 69554 45430 -86621 -245852 -182705
15285a82705A21294f3820p4249j252j9929c7561B56985n6717a31653p1166I6565
$$ -182705 121294 -63820 -138069 -139321 -159250 -37561 256985 200268 -131653 -202819 96565
15273b01991R329D28074a57859A86136o6484O2732L4987K0557r3308j7677b44441
$$ -201991 -192662 428074 -157859 186136 119652 182384 217371 237928 144620 126943 -244441
15261g3243J967A9628L12743h3187B27230R4364n4818j15504k0119O1963H21O1177
$$ -73243 -71276 19628 332371 -83187 227230 321594 266776 151272 131153 193116 821 61998
15249F1998J59778q0067a98549I6777M9708a3645B10619D2597b88365A04788J05709
$$ 61998 221776 141709 -198549 96777 146485 -13645 210619 42597 -288365 104788 210497
15238B10497l3085J77622K1715M63054k12970Q65678m22241L49518j53470o01913
$$ 210497 177412 355034 376749 839803 626833 1492511 1070270 1419788 1266318 664405
15228F64405m2656A56468p6294g5539G3931J01799F2145f3873B62923i0495k1753
$$ 664405 621749 156468 80174 -75539 73931 175730 62145 -63873 262923 -90495 -112248
15217a12248K1504D82106H8036A272L36605A26549m7617B2697a48792B56659R1551
$$ -112248 -90744 482106 88036 1272 337877 126549 78932 22697 -148792 256659 348210
15206C48210o7802j24659o1227L1478J05252h8091E3028L1737e2757A66947E9651
$$ 348210 280408 155749 94522 126000 231252 -88091 53028 84765 -52757 166947 59651
15194b8484B74982j21545P2993a46873B29801b58298i1077H5703B3349K6541B2246
$$ -28484 274982 153437 226430 -146873 229801 -258298 -91077 85703 23349 49890 22246
15182D42844j06741g2570C8961K36174C7664a26000a851A27860J92949G7140M583
$$ 442844 336103 -72570 38961 275135 37664 -126000 -1851 127860 320809 77140 81723
15171H1723b93113B59734g1929o6704K9953G4620a69628H6122K5349F154L75546
$$ 81723 -293113 259734 -71929 -138633 -108680 74620 -169628 86122 111471 6154 381700
15160C81700b4372k16378f9496H5780g5223j38946A45889a11439A92416e7734
$$ 381700 -24372 -240750 -69496 85780 -75223 -214169 145889 -111439 192416 -57734
15149A30054n6117Q403i2216j22040B67574N3409A12266A8933J80948a37566C62475
$$ 130054 73937 82340 -92216 -214256 267574 320983 112266 18933 199881 -137566 362475
15137b7289B68998b76249D6504b06880B51113c141A35903Q856L65241I9534j8743
$$ -27289 268998 -276249 46504 -206880 251113 -3141 135903 144759 510000 99534 80791
15126H0791P7563D4426J50502r5153a24561n5447B24071l4746K815K2573f973
$$ 80791 158354 44426 194928 99775 -124561 -180008 224071 189325 192140 214713 -6973
15114B26526O5478G6517e1284C57238A17198K93380G6155d459B64478n80E0111
$$ 226526 292004 76517 -51284 357238 117198 410578 76155 -4459 264478 263898 50111
15102A99181K23244c69594A53779A1114M19479E3853J25518R1829A6304Q7921
$$ 199181 422425 -369594 153779 11114 430593 53853 179371 271200 16304 104225
15092A04225J82445H2650K3097R3637L77054C3800K70197E0138K32499n9245m7109
$$ 104225 286670 82650 105747 199384 576438 33800 303997 50138 282637 223392 176283
15081A76283d8187C15224j42446J5032R036A9712L3677e344F4584J06315G7559
$$ 176283 -48187 315224 172778 187810 196846 19712 53389 -5344 64584 170899 77559
15069C0423J69559d7285C33526D8523e8226C72178j74302J17772j4191k8416H925
$$ 30423 199982 -47285 333526 48523 -58226 372178 197876 315648 301457 273041 8925
15057B37606c06429i1751A44449K7392K01874j31143O1570p3711a52252C05643
$$ 237606 -306429 -91751 144449 171841 373715 242572 304142 230431 -152252 305643
15046A04999C6386J04100h7763c9118A0383K08358A0390J91387R1046C526a1963
$$ 104999 36386 140486 -87763 -39118 10383 218741 10390 201777 292823 3526 -11963
15034H0359j6755J22814E1516a79540B51893J40131j51017q783K1988m143J23015
$$ 80359 63604 186418 51516 -179540 251893 392024 241007 232224 254212 250069 373084
15023C73084B8393J50418R3876G8425f5198C55749A36212K86472j78125K50510
$$ 373084 28393 178811 272687 78425 -65198 355749 136212 422684 244559 495069
15013D95069i4205A29059I524d3147B59525M24409B08866J4967Q2056a19354B21427
$$ 495069 -94205 129059 9524 -43147 259525 683934 208866 223833 305889 -119354 221427
15001A49349L1076O6927o045H3923R579p88l1513J7963J75519J4144J22882R0059
$$ 149349 180425 247352 241307 83923 93502 92714 61201 79164 254683 268827 391709 481768
14989D81768A87514R2713a3477C39792F0553M420g0558B67967L6252q5633J3613
$$ 481768 187514 280227 -13477 339792 60553 64973 -70558 267967 304219 218586 232199
14978B32199K02832A99070B3542L93343J13976a27862D53321C5862J86622q6066
$$ 232199 435031 199070 23542 416885 530861 -127862 453321 35862 222484 136418
14968A36418h1136A22652J55489J75918a6689p0626B28332K10213K9041A79283
$$ 136418 -81136 122652 278141 454059 -16689 -87315 228332 438545 467586 179283
14957a76996B82692j2637p9625a58718A99718n4749F5920L2523J48781J09811
$$ -176996 282692 270055 190430 -158718 199718 144969 65920 98443 247224 357035
14947C57035j42934A01380J62076E5946J11811N24474A11643K67216K3D600L38031
$$ 357035 214101 101380 263456 55946 167757 692231 111643 378859 378882 4600 342631
14936C42631r0980R9910J4887A38109H490P6775g5312D90427j76035F9572L51183
$$ 342631 251651 351561 366448 138109 8490 85265 -75312 490427 314392 69572 420755
14925D20755A57490P6919B312N07011j15202m6442n7734J51569j60206N0743N3137
$$ 420755 157490 234409 2312 509323 394121 347679 289945 441514 281308 332051 385188
14914C85188Q4492j32966J44168A32798J9163M54362k37291R7525O245r7613j7933
$$ 385188 469680 336714 480882 132798 151961 606323 369032 466557 472802 375189 357256
14903C57256r1724J67602B10866J39003K32712r2171j40817E9625K30873J34618
$$ 357256 265532 433134 210866 349869 582581 490410 349593 59625 290498 425116
14893D25116P6454A0645O48797B26123Q2473B9996J36070K11202J65398k18562
$$ 425116 501570 10645 659442 226123 308596 29996 166066 377268 542666 324104
14883C24104A43506L79964j41703K0064l5959L935j03806A13296P4844J42958
$$ 324104 143506 523470 381767 401831 365872 369807 266001 113296 188140 331098
14873C31098J50985N0685N4094j04763j91948j43950J98371J03034j25715K4117
$$ 331098 482083 532768 586862 482099 290151 146201 344572 447606 321891 346008
14863C46008O4838K31972A93962J93149j69176K61312A70702K28961j50561P8146
$$ 346008 410846 642818 193962 387111 217935 479247 170702 399663 249102 327248
14853C27248A51881K33647n004o6621J56999o3859A28331M18196m7640A96767
$$ 327248 151881 385528 380524 313903 470902 407043 128331 546527 498887 196767
14842C01807K5606L66756A75458J40481K70515j46872j39333J79627J33476A67388
$$ 301807 327413 694169 175458 315939 586454 439582 300249 479876 613352 167388
14831A34885O20483C63733K27755p9148K62009l17923A49377N49217k60727j65116
$$ 134885 755368 363733 591488 512340 774349 456426 149377 698594 437867 272751
14821B72751M5025J19104K24023j51741j88890J76322l8332j42231J09871M484
$$ 272751 317776 436880 660903 509162 320272 496594 458262 316031 425902 430386
14811D30386O1780P3827B26752M02003j75699J2580j57022M81706k80324r0184
$$ 430386 492166 565993 226752 628755 453056 465636 308614 790320 509996 419812
14801D19812k08813L41962m5675J66397J61275C03912J65996J04741j07995L66235
$$ 419812 210999 552961 507286 673683 834958 303912 469908 574649 466654 832889
14791H32889N5628l42139l3744J31839j70367K94795j61263k38610j27958J24161
$$ 832889 888517 546378 512634 644473 474106 768901 607638 369028 241070 365231
14781C65231J35352o7601J36535J13139q3221B61011K98465J14253k50831m3523
$$ 365231 500583 432982 569517 682656 599435 261011 559476 673729 422898 379375
14771C79375R4803K04962k10664K04731M1589K09504m15450J36717J51226n989
$$ 379375 474178 679140 468476 673207 714796 924300 508850 645567 796793 790804
14761G90804O7370j54206j23152K16955B09931M61948j09330k35721L95864j26930
$$ 790804 858174 703968 580816 797771 209931 671879 562549 326828 722692 595762
14751E95762R2073M88083m27877j86180j32928J38232L2274P3491J67042C57038
$$ 595762 687835 1175918 748041 561861 428933 567165 599439 672930 839972 357038
14740G66675j93612L47776C74346L93115j63113J09446K02676j72355J20493C70678
$$ 766675 573063 920839 374346 767461 604348 713794 916470 744115 864608 370678
14729D70132N24030m49059J72425o0136Q6639j02312L58441k35971j49152K69903
$$ 470132 994162 545103 717528 657392 744031 641719 1000160 764189 615037 884940
14719H84940p8897M4373k5193J58621k28881o4498M31237E46730L23559m5717
$$ 884940 806043 850416 825223 983844 754963 690465 1121702 546730 870289 824572
14709H24572Q0590k61816K16715L74305k97590j21255Q0462k67654P4338q1854
$$ 824572 905162 643346 860061 1234366 936776 815521 895983 628329 702667 620813
14699F20813J04119K40001k81043J6367K23354p0818M43896n33511l25672O47987
$$ 620813 724932 964933 683890 700257 923611 852793 1296689 763178 437506 1085493
14689A085493k36240J75063k12198o2867J63044K97225j35461m4674k73493Q2525
$$ 1085493 849253 1024316 812118 749251 912295 1209520 1074059 1029385 755892 838417
14679H38417j00489L61661M5048l30912l4716J36462J11842K6418p4148q830K12994
$$ 838417 737928 1099589 1144637 813725 779009 915471 1027313 1053731 979583 970753 1183747
14668A183747k51829L42725k90866l11227J18858q498K30911j9828O8864J0621
$$ 1183747 931918 1274643 983777 672550 791408 782910 1013821 993993 1062857 1073478
14658A073478l25126L44916j37896K80516M4065p7259m7997J28375J1312l42826
$$ 1073478 748352 1093268 955372 1235888 1279953 1202694 1154697 1283072 1294384 951558
14648I51558j07881L35173J94887l79712P1489j11271L78771j17722R8967j31778
$$ 951558 843677 1178850 1373737 994025 1065514 954243 1333014 1215292 1314259 1182481
14638A182481k64339J74387J6491K7888J8951j24240L85937r8617k28226J81110
$$ 1182481 918142 1092529 1109020 1136908 1155859 1031619 1417556 1318939 1090713 1271823
14628A271823j62617J97516j79353O8679k2733J50986n1808K2853k36209R6736
$$ 1271823 1109206 1306722 1127369 1196048 1173315 1324301 1272493 1295346 1059137 1155873
14618A155873P7663j15016p9633J27617J95179P7189k44702k76691Q57499l50548
$$ 1155873 1233536 1118520 1038887 1166504 1361683 1438872 1194170 917479 1774978 1424430
14608A424430J64859l84999L92331j16762J4156L8437J61331j96905J17654j71440
$$ 1424430 1589289 1204290 1596621 1479859 1494015 1532452 1693783 1496878 1614532 1443092
14598A443092Q0267O7112o5228L64537m92406J58589J39374L9810J3198r8318
$$ 1443092 1523359 1590471 1525243 1889780 1397374 1555963 1695337 1735147 1748345 1650027
14588A650027p1105k97764O01765l28690j73984L62067k06608n8167M03P9242
$$ 1650027 1578922 1281158 1882923 1554233 1380249 1742316 1535708 1477541 1477944 1557186
14578A557186M04885o0799k43179L8262K92542l04139K87228l7854J65248o07190
$$ 1557186 1962071 1901272 1658093 1696355 1988897 1684758 1971986 1934132 2099380 1492190
14568A492190L53044j20908N87415j36332J97213m04937M2233j11214J65766L0645
$$ 1492190 1845234 1724326 2311741 2175409 2372622 1967685 2009918 1898704 2064470 2095115
14558B095115J68066p4263P5610N2025o6259Q448M35982r7345J93068j79715j41502
$$ 2095115 2263181 2188918 2264528 2316553 2250294 2258742 2694724 2597379 2790447 2610732 2469230
14547B469230K42881L79046o9089J09332P0223N70920k36600M62557J03969J021636
$$ 2469230 2712111 3091157 3022068 3131400 3201623 3772543 3535943 3998500 4102469 5124105
14537E124105O64240O85468J813375K903859L986117P155859R459473j464374
$$ 5124105 5788345 6473813 8287188 11191047 15177164 22333023 31792496 30328122
14529C0328122j1780637p183055m554989k053891q76497n61856m43775j50574
$$ 30328122 18547485 11364430 6809441 4755550 3879053 3317197 2873422 2722848
14521B722848j52439N4175m00833J29813k94615M88907J29093m48827K99787k47636
$$ 2722848 2570409 2624584 2223751 2353564 2058949 2547856 2676949 2228122 2527909 2280273
14511B280273N5526M14849p3444j87208j96607K72556j55592N43477o44745K82770
$$ 2280273 2335799 2750648 2677204 2489996 2293389 2565945 2410353 2953830 2309085 2591855
14501B591855k18551K07202K22856J60162j18376j42172Q7097K61350k23719j2860
$$ 2591855 2373304 2580506 2803362 2963524 2845148 2702976 2790073 3051423 2827704 2814844
14491B814844K48806K7992J88720l23868K01099o1047j4275J59010Q0438J39080
$$ 2814844 3063650 3091642 3280362 2956494 3157593 3096546 3082271 3241281 3321719 3460799
14481C460799P9333j83401M3703l2790L37112k53487L81161j96133K82883m72515
$$ 3460799 3540132 3356731 3400434 3367644 3704756 3451269 3832430 3636297 3919180 3446665
14471C446665K69040K66956j53720o2595J77800J11954K5521k29282J36615K04505
$$ 3446665 3715705 3982661 3828941 3766346 3944146 4056100 4081621 3852339 3988954 4193459
14461D193459k280J53423k63523J39410O51078m45015k13496J07911L87636M5258
$$ 4193459 4191179 4344602 4081079 4220489 4871567 4426552 4213056 4320967 4708603 4753861
14451D753861K9061l089M1382l40125J41150O38322j33083Q9394J33777K68450
$$ 4753861 4782922 4779833 4821215 4481090 4622240 5260562 5127479 5216873 5350650 5619100
14441E619100n69236J83830J7732L5997M30759k03096K17304n7004L11148k86389
$$ 5619100 5049864 5233694 5251426 5287423 5718182 5515086 5732390 5675386 5986534 5700145
14431E700145Q2573J43015J46685K18212k98076J69947K82123p9119K75017N7902
$$ 5700145 5782718 5925733 6072418 6290630 5992554 6162501 6444624 6365505 6640522 6698424
14421F698424n7073K97838M83062j92901k28950L30310j37798L72412l3367J76397
$$ 6698424 6641351 6939189 7422251 7229350 7000400 7330710 7192912 7565324 7531957 7708354
14411G708354J7336j03625K43552j6396J38346O3288n4008L09564J20651L36881
$$ 7708354 7725690 7622065 7865617 7849221 7987567 8050855 7996847 8306411 8427062 8763943
14401H763943K6891L08302K36068j65647N72879l67278j54677P07820j6193K5714
$$ 8763943 8790834 9099136 9335204 9169557 9742436 9375158 9220481 9928301 9912108 9937822
14391I937822J98732j49285J95333J91990M93108R7396J63044O5526L08648K19603
$$ 9937822 10136554 9987269 10182602 10374592 10867700 10965096 11128140 11193666 11502314 11721917
14381A1721917J51197J31310L3449Q0374M75312J99427J15870M01673J99104J55067
$$ 11721917 11873114 12004424 12037873 12118247 12593559 12792986 12908856 13310529 13509633 13664700
14371A3664700L86068N1214N00263M93073j03264L24923M10673j48071O33458
$$ 13664700 14050768 14101982 14602245 15095318 14992054 15316977 15727650 15579579 16213037
14362A6213037L24970M38986q9408M42131O11312k11228P82303J69879O25811
$$ 16213037 16538007 16976993 16887585 17329716 17941028 17729800 18512103 18681982 19307793
14353A9307793J18567N09602K66863R09104K47009M12256L80706N86514O54461
$$ 19307793 19426360 19935962 20202825 21111929 21358938 21771194 22151900 22738414 23392875
14344B3392875O84111J47924L48798R34668P37815N19417N71912P75874M98299
$$ 23392875 24076986 24224910 24573708 25508376 26246191 26765608 27337520 28113394 28611693
14335B8611693O62830Q46332R04188M73850R27676J001945P06804J038501L69374
$$ 28611693 29274523 30120855 31025043 31498893 32426569 33428514 34135318 35173819 35543193
14326C5543193J404607J333212Q57612J385706P66027J271981J249704J488617
$$ 35543193 36947800 38281012 39138624 40524330 41290357 42562338 43812042 45300659
14318D5300659J023838J384801J743439J669721J569839J426483K046172J675534
$$ 45300659 46324497 47709298 49452737 51122458 52692297 54118780 56164952 57840486
14310E7840486K250101J819124K082954K358843K092667K434838K679403K955080
$$ 57840486 60090587 61909711 63992665 66351508 68444175 70879013 73558416 76513496
14302G6513496K822835K893753L443703L229804L215062L910321L964488L690391
$$ 76513496 79336331 82230084 85673787 88903591 92118653 96028974 99993462 103683853
14294A03683853M978822M449008M796025N367204N385014N668579O090915O697644
$$ 103683853 108662675 113111683 117907708 123274912 128659926 134328505 140419420 147117064
14286A47117064O815850P014894Q118726Q129628Q953218R251856R433697J0936010
$$ 147117064 153932914 160947808 169066534 177196162 186149380 195401236 204834933 215770943
14278B15770943J0266287J1571299J1954696J2622349J3281386J4024259J4064213
$$ 215770943 226037230 237608529 249563225 262185574 275466960 289491219 303555432
14271C03555432J4795494J5368466J4846114J5150266J3950178J3458822J1753012
$$ 303555432 318350926 333719392 348565506 363715772 377665950 391124772 402877784
14264D02877784J0735599R348173Q829784Q731485P344884N150439L072022K209148
$$ 402877784 413613383 422961556 431791340 440522825 447867709 453018148 456090170 458299318
14256D58299318J820998J272863m420147m211346p543958p614387r738363j2188989
$$ 458299318 460120316 461393179 456973032 452761686 445217728 437603341 427864978 415675989
14248D15675989j2076782j3001983j3944348j3820773j4081187j4008624j4472512
$$ 415675989 403599207 390597224 376652876 362832103 348750916 334742292 320269780
14241C20269780j3580119j3454422j2797463j3453249j2810914j2933161j1780920
$$ 320269780 306689661 293235239 280437776 266984527 254173613 241240452 229459532
14234B29459532j1480468j0982468r839071r759287q704060p938597p948258q025723
$$ 229459532 217979064 206996596 197157525 187398238 178694178 170755581 162807323 154781600
14226A54781600p257756o503573o330062n930487n925107n127839n168316m772568
$$ 154781600 147523844 141020271 134690209 128759722 122834615 117706776 112538460 107765892
14218A07765892m427884m019872l961548l757532l821547l582107k773818l593073
$$ 107765892 103338008 99318136 95356588 91599056 87777509 84195402 81421584 77828511
14210G7828511k722356k794501k639712k264105k245931k547734j885319k221972
$$ 77828511 75106155 72311654 69671942 67407837 65161906 62614172 60728853 58506881
14202E8506881j856838k030853j405463j847322j333998j506028j288043j980121
$$ 58506881 56650043 54619190 53213727 51366405 50032407 48526379 47238336 45258215
14194D5258215j011826r81333q07700j529037j189456j070644j025976j036007
$$ 45258215 44246389 43265056 42457356 40928319 39738863 38668219 37642243 36606236
14186C6606236j364799m01188r50449j107203r02136n66594p64572q54966n19811
$$ 36606236 35241437 34840249 33889800 32782597 31880461 31313867 30549295 29694329 29174518
14177B9174518j174755o27377j45741q30000o38403m88900n83409q19548j88609
$$ 29174518 27999763 27372386 27226645 26396645 25758242 25269342 24685933 23866385 23677776
14168B3677776q10752k46471n99080k16359o22270p68563k58626n43207l04522
$$ 23677776 22867024 22620553 22021473 21805114 21182844 20414281 20155655 19612448 19307926
14159A9307926l24222n56720K37469o81751q3461p04284k78346n61113k9211l13527
$$ 19307926 18983704 18426984 18664453 17982702 17899241 17194957 16916611 16355498 16326287 16012760
14149A6012760l18404l64838o3917n46187k51528L9186o37276K82061p98707o0912
$$ 16012760 15694356 15329518 15265601 14719414 14467886 14507072 13869796 14151857 13353150 13292238
14139A3292238j76270l6217m15761j21144l91722J58130j21739k33839k66188
$$ 13292238 13115968 13079751 12663990 12542846 12151124 12309254 12187515 11953676 11687488
14130A1687488m03461Q6892k15689k96049k00635J42101m15574j60729q7997k64753
$$ 11687488 11284027 11370919 11155230 10859181 10658546 10800647 10385073 10224344 10136347 9871594
14120I871594l67601J30746o192m01929J71852k97026j8435p1714k08671l74250
$$ 9871594 9503993 9634739 9628547 9226618 9398470 9101444 9083009 9011295 8802624 8428374
14110H428374k9179K7008p4432M949k05038k46921j77553J12850n38027j34221
$$ 8428374 8399195 8426203 8351771 8356720 8151682 7904761 7727208 7840058 7302031 7167810
14100G167810J1306r6195m112J8260J42401j60392l49929l5699L0331k63085m7898
$$ 7167810 7179116 7082921 7078809 7097069 7239470 7079078 6729149 6693450 6723781 6460696 6412798
14089F412798l48594L24397M863m3290m29113j14264K0059k65619L24205j70715
$$ 6412798 6064204 6388601 6393464 6350174 5921061 5806797 5826856 5561237 5885442 5714727
14079E714727O1981l70290O0279J10957o7565k36629R469q4950K5018l94470L22599
$$ 5714727 5776708 5406418 5466697 5577654 5510089 5273460 5282929 5197979 5222997 4828527 5151126
14068E151126j66469l0075L32732n56110L74666n71737N15400j56051k36868O6206
$$ 5151126 4984657 4954582 5287314 4731204 5105870 4534133 5049533 4893482 4656614 4722820
14058D722820m13820K30106l23025M93193k68993J20820o37730L65199k53483
$$ 4722820 4309000 4539106 4216081 4709274 4440281 4561101 3923371 4288570 4035087
14049D035087L89271q2224k38219J32279J42925m39807K97642l82339J86849l23377
$$ 4035087 4424358 4342134 4103915 4236194 4379119 3939312 4236954 3854615 4041464 3718087
14039C718087K64992m43096M37073J7608m47835J81942K7833j20747j78861K43569
$$ 3718087 3983079 3539983 3977056 3994664 3546829 3728771 3756604 3635857 3456996 3700565
14029C700565o943k95574j99P4567n9899k27465K71243o6114j21119k3264j56804
$$ 3700565 3693622 3398048 3397849 3472416 3412517 3185052 3456295 3390181 3269062 3245798 3088994
14018C088994K25862j07660p0809L0239n4949K51554m75937L28783n79148K77982
$$ 3088994 3314856 3207196 3136387 3166626 3111677 3363231 2887294 3216077 2636929 2914911
14008B914911J48172j96139J7185j67948R8383j29077j61796K24036k1289q2313
$$ 2914911 3063083 2866944 2884129 2716181 2814564 2685487 2523691 2747727 2726438 2644125
13998B644125J67347k76279J23576n2057k34459J85782j18221j62838P9724K34342
$$ 2644125 2811472 2535193 2658769 2606712 2372253 2558035 2439814 2276976 2356700 2591042
13988B591042n60248M36590k00026J5632j58024L90416J84454j47830M05620P96
$$ 2591042 2030794 2467384 2267358 2282990 2124966 2515382 2699836 2552006 2957626 2958422
13978B958422K37539L42914M34545J224425K005590L538214O494998J0987641
$$ 2958422 3195961 3538875 3973420 5197845 7203435 10741649 17236647 28224288
13970B8224288K778159j0162349p321873m331577k243999j411686p07422m87575
$$ 28224288 31002447 20840098 13518225 9186648 6942649 5530963 4823541 4335966
13962D335966o52635r5565l28894r0232k11344p7928r3700K58288j08241l12723
$$ 4335966 3683331 3587766 3258872 3168640 2957296 2879368 2785668 3043956 2935715 2622992
13952B622992r3623J44337j54467n7044k02500M7265l9462m6033k24785M95498
$$ 2622992 2529369 2673706 2519239 2462195 2259695 2306960 2267498 2221465 1996680 2492178
13942B492178k74499q6346J8767o8143J22771k42218L9529P9062J28308j23490
$$ 2492178 2217679 2131333 2150100 2081957 2204728 1962510 2002039 2081101 2209409 2085919
13932B085919r3349l3833j364l79138M40453k25747q4329j04327j01632L51483
$$ 2085919 1992570 1958737 1957373 1578235 2018688 1792941 1708612 1604285 1502653 1854136
13922A854136j50094q1164n1980L62873j08654k52557j39203M9989J52420p1069
$$ 1854136 1704042 1622878 1570898 1933771 1825117 1572560 1433357 1483346 1635766 1564697
13912A564697J44213l9846p0746O3207K6984j32734l37780J61213L79485N166
$$ 1564697 1708910 1669064 1598318 1661525 1688509 1555775 1217995 1379208 1758693 1763859
13902A763859k74229m0125p3675K81052j40391L55l37519O32730m97197J24339
$$ 1763859 1489630 1449505 1375830 1656882 1516491 1516846 1179327 1812057 1314860 1439199
13892A439199o855j41154l0283J29753J8470j07058r7689L93085k14245J80707
$$ 1439199 1432344 1291190 1260907 1390660 1409130 1302072 1204383 1597468 1383223 1563930
13882A563930k30203q4666N1216P2613r168j43860O9575j03166L44829k2845J25758
$$ 1563930 1333727 1249061 1300277 1372890 1363722 1219862 1289437 1186271 1531100 1508255 1634013
13871A634013m80120K42655m8321l2768j0960K19802k77166Q0114j77922K1331
$$ 1634013 1153893 1396548 1348227 1315459 1304499 1524301 1247135 1327249 1149327 1170658
13861A170658l03254r2529N94090j79047l89892J66478M02189q9377J12403k81791
$$ 1170658 867404 774875 1368965 1189918 800026 966504 1368693 1279316 1391719 1109928
13851A109928J40272n4085j97447L51238k42648J53546k04089L45101j01862m55324
$$ 1109928 1250200 1196115 998668 1349906 1107258 1260804 1056715 1401816 1299954 844630
13841H44630Q0617j66278J6105K03100J49037k01325J45169L56969n55448K58105
$$ 844630 925247 758969 775074 978174 1127211 925886 1071055 1428024 872576 1130681
13831A130681k74676M2696Q0032j61555J45998p3538j4445m5059L84827J6056
$$ 1130681 856005 898701 978733 817178 963176 889638 875193 830134 1214961 1231017
13821A231017k07145J70305E45294M53446O600k60314R5722R5827r2293J76325
$$ 1231017 1023872 1194177 545294 998740 1005340 745026 840748 936575 844282 1020607
13811A020607j95612R6949Q3656j0696o5376k99982L45571K0157J970k06089R2991
$$ 1020607 824995 921944 1005600 994904 929528 629546 975117 995274 997244 791155 884146
13800H84146m3063M0097j3063J90517k84929P073L06066j18598q2090o4947n5714
$$ 884146 841083 881180 868117 1058634 773705 780778 1086844 968246 886156 821209 765495
13789G65495p1403J72447r1203l5684J06286j3169J74743l1727l37261K6780J98069
$$ 765495 694092 866539 775336 739652 845938 832769 1007512 975785 638524 665304 863373
13778H63373j64884M44037n32688O02198l34717J2822k36673J86708j7215l1835
$$ 863373 698489 1142526 609838 1212036 877319 890141 653468 840176 822961 791126
13768G91126K7601r4683k68909k2357N35009K584j01788k21011k18664L95979
$$ 791126 818727 724044 455135 432778 967787 970371 868583 647572 428908 824887
13758H24887j94522j878q6180j6317L56695j98425p5108m4244j36284L65781L3795
$$ 824887 630365 628487 542307 525990 882685 684260 609152 564908 428624 794405 828200
13747H28200k58425J15227J1256k97160M0942K57023o6444J64815j8181j95944
$$ 828200 569775 685002 696258 399098 440040 697063 630619 795434 777253 581309
13737E81309k57691K28709R8813J65454r8697k37088K57907k36654K21614l30078
$$ 581309 323618 552327 651140 816594 717897 480809 738716 502062 723676 393598
13727C93598K77634q0568n285K22871k14770j70045K96946J2604k0412r7639j09923
$$ 393598 671232 590664 585379 808250 593480 423435 720381 732985 712573 614934 505011
13716E05011K15330J80168j03588j98643o3394L98159m28364L31493l23234j81058
$$ 505011 720341 900509 796921 598278 534884 933043 504679 836172 512938 331880
13706C31880J20283B19518K62587J40493J10599m0118k33818L8537j40946P0922
$$ 331880 452163 219518 482105 622598 733197 693079 459261 497798 356852 427774
13696D27774L28266k39511J55994K2009k46809J50530j61529L21967j91135J95289
$$ 427774 756040 516529 672523 694532 447723 598253 436724 758691 567556 762845
13686G62845j19144q3223J54078k14234q9754Q0476K02063l25255K3757N54332
$$ 762845 643701 560478 714556 500322 410568 491044 693107 367852 391609 945941
13676I45941m12485P7147j7673p0855M6720B59876M41124K1815j19267k22893
$$ 945941 533456 610603 592930 522075 568795 259876 701000 722815 603548 380655
13666C80655K98147j58257B52202P8849K56936k79804Q2506R6319Q4880j20045
$$ 380655 678802 520545 252202 331051 587987 308183 390689 487008 571888 451843
13656D51843j24266K48723O81J13395l03180j04650M9512K14945B50863L2268
$$ 451843 327577 576300 576981 690376 387196 282546 332058 547003 250863 283131
13646B83131J70259j95351P7675q576j1289k148J99354J75905K7774k64552M48042
$$ 283131 453390 258039 335714 327138 315849 313701 513055 688960 716734 452182 900224
13635I00224D25666J5230R0968F5071K97697J32176J77541o0162A82084n9447
$$ 900224 425666 440896 531864 65071 362768 494944 672485 612323 182084 122637
13625A22637N54786k42299J73648k96892F7838J18535J91599J04673k27277K83441
$$ 122637 677423 435124 608772 311880 67838 186373 377972 482645 255368 538809
13615E38809q698k32045K2697q3072K10740N5933j3135j58709C453M16013o8625
$$ 538809 530111 298066 320763 237691 448431 504364 491229 332520 3453 419466 350841
13604C50841j16245L00129j12292n7104J09780N6654a63274D56736p9096R518
$$ 350841 234596 534725 422433 365329 475109 531763 -163274 456736 377640 387158
13594C87158M0674A03192M13662j34218J37102l7043R2190k27719m3222J46496
$$ 387158 427832 103192 516854 382636 519738 482695 574885 347166 303944 450440
13584D50440j15180K90376j21086j81575j09032L29500P9975n6784A93907M52939
$$ 450440 335260 625636 504550 322975 213943 543443 623418 566634 193907 646846
13574F46846J38483B25309L03992p7103G9493L77879J00625A44882N4551M9175
$$ 646846 785329 225309 529301 452198 79493 457372 557997 144882 199433 248608
13564B48608J15033j24318N3330Q5296K46917n8265k15187K7175A44987J14112
$$ 248608 363641 239323 292653 377949 624866 566601 351414 378589 144987 259099
13554B59099g1601A03392J63516K58224j63005F6686K63871j42363R1196A37643
$$ 259099 -71601 103392 266908 525132 362127 66686 330557 188194 279390 137643
13543B43980K04516A04564J15096J62304R1137k14954Q1696r6279L87063j38150
$$ 243980 448496 104564 219660 381964 473101 258147 339843 243564 630627 492477
13533D92477A56806L00566j52154N5111E4907K11956R6447A10502M838C7691j4781
$$ 492477 156806 457372 305218 360329 54907 266863 363310 110502 115340 37691 22910
13522B2910L15825l2790C8197K79703L28244B28167j5753J9948I5813I454f217
$$ 22910 338735 305945 38197 317900 646144 228167 212414 232362 95813 9454 -6217
13510D21838G1638K11678J25463L9835A22943J10177E9451J70598o9997A6383
$$ 421838 71638 283316 408779 448614 122943 233120 59451 230049 160052 16383
13499D32306r7107j56502K71947j50122A23145J47067R5572l085A36566J43593
$$ 432306 335199 178697 450644 300522 123145 270212 365784 362699 136566 280159
13489B80159J16478j79796M55595C29304J79503A06962K34915R4854a4205C22494
$$ 280159 396637 216841 672436 329304 508807 106962 341877 436731 -14205 322494
13478a19619E7864K30902J03557A42945c2473E30581k43776c7324A48171K65391
$$ -119619 57864 288766 392323 142945 -32473 530581 286805 -37324 148171 413562
13468D13562j71584J1871l5872F9835C3960R1692A8900L16992j65176M52361A57684
$$ 413562 241978 253849 217977 69835 33960 125652 18900 335892 170716 623077 157684
13456C95914A53389g5989C06410o342j49629k8784J12004F88J28723a4824B38872
$$ 395914 153389 -75989 306410 300068 150439 121655 233659 688 129411 -14824 238872
13444g6815C09160J95467k32423N2039p0287R6991R433m5360j25052m0369K1536
$$ -76815 309160 504627 272204 324243 253956 350947 360380 315020 189968 149599 171135
13433A71135K8052m1892L78468j21498A44347M25493A6653L3073K38203K86505
$$ 171135 199187 157295 535763 414265 144347 569840 16653 49726 287929 574434
13423E74434k11091J43867A14970K27840j15443a56241I133M51250b2131B92652
$$ 574434 363343 507210 114970 342810 227367 -156241 9133 460383 -22131 292652
13412B18707j07367a15187B11702L33573A43789M923J71483Q7478A76971l8363
$$ 218707 111340 -115187 211702 545275 143789 148712 320195 407673 176971 138608
13402A38608D4316L38496F1111J03478J67595A13144K29664g6553A85083O9104
$$ 138608 44316 382812 61111 164589 332184 113144 342808 -76553 185083 254187
13392B54187g7552B65079J4808e7413b4294D1037J84901C6990L97143B10104j9455
$$ 254187 -77552 265079 279887 -57413 -24294 41037 225938 36990 434133 210104 190649
13381A90649b25362I2829j2064M85101H8728J27953J51091o9801A46527K15334
$$ 190649 -225362 92829 80765 565866 88728 216681 367772 297971 146527 361861
13371C61861a22815B37009J83224n4133j15954G3258J3121K21250b28088I09L41019
$$ 361861 -122815 237009 420233 366100 250146 73258 86379 307629 -228088 909 341928
13360C41928G7500K29019r79E7371R6342J46704c625j11195A48420e5884B15401
$$ 341928 77500 306519 305540 57371 153713 300417 -3625 -114820 148420 -55884 215401
13348B14902J00636A18585a29320F9206M85357B48397A2802K23649j16121N10
$$ 214902 315538 118585 -129320 69206 554563 248397 12802 236451 120330 120840
13338A20840j8171Q4638J4846K64448o4595j69668R9154o4625j27488K56892A22627
$$ 120840 102669 187307 202153 466601 402006 232338 331492 266867 139379 396271 122627
13326C95467j07994j03136J31626I5246k1646M54308A62541l9166J87853M5960
$$ 395467 287473 184337 315963 95246 73600 527908 162541 123375 311228 357188
13316C57188P282M116A29504M25139k73186P4192j71575J23683j6369R2544J31491
$$ 357188 364470 368586 129504 554643 281457 355649 184074 307757 291388 383932 515423
13305E15423r9782j53745A10198K10503F952L89375A69381a18608C44422l7881
$$ 515423 415641 261896 110198 320701 6952 396327 169381 -118608 344422 306541
13295C06541f9442I5934L9620M427a15625C56702j53576C8041L58959F204J98955
$$ 306541 -69442 95934 135554 139981 -115625 356702 203126 38041 397000 6204 205159
13284B05159r0366j7333J13733Q8070j45178l6479R0596K45418c2033J246H932
$$ 205159 114793 97460 211193 299263 154085 117606 208202 453620 -32033 -30787 8932
13272A03513g0365A85636L5926a68632D51081j54400I2487J3768K50770c0041
$$ 103513 -70365 185636 221562 -168632 451081 296681 92487 106255 357025 -30041
13261B52274l8940I4847d24561B16740j01296L9502L6508k7864q714j6447n6746
$$ 252274 213334 94847 -424561 216740 115444 154946 191454 163590 154876 138429 81683
13250H1683L6980b362m8164B88640a9756E91046a23764D16820a73538h1338A67505
$$ 81683 118663 -2362 -50526 288640 -19756 591046 -123764 416820 -173538 -81338 167505
13238C41220o3148c0455A1079i2811A11327C2924K32954M1879b37950C28423l3003
$$ 341220 278072 -30455 11079 -92811 111327 32924 265878 307757 -237950 328423 295420
13227B95420B2777J92439J18141a8736j0937G6945N1800M0207J3693J25228H4004
$$ 295420 22777 215216 333357 -18736 -29673 76945 128745 168952 182645 307873 84004
13215A80309m3429J44694H767K1598i8569M6692l0004n5650H4939K43841r6008
$$ 180309 136880 281574 8767 30365 -98569 -51877 -81881 -137531 84939 328780 232772
13204B32772j13138b92722A86519J07094a23590A28017Q0832c30511A19898J0347
$$ 232772 119634 -292722 186519 293613 -123590 128017 208849 -330511 119898 130245
13194A30245L4638K16866p5897a31391a943k6817B51802b1866B61956k1406a96934
$$ 130245 164883 381749 305852 -131391 -1943 -28760 251802 -21866 261956 240550 -196934
13182e7141A64725D3768K66296l4975n7485J72754f28k61007E9814b13645I0940
$$ -57141 164725 43768 310064 275089 217604 390358 -628 -261635 59814 -213645 90940
13170C02936A72R630O1949n450L17674H6507c6733r0944D2274L46213A91257F7295
$$ 302936 172 9802 71751 66301 383975 86507 -36733 -127677 42274 388487 191257 67295
13157I3725R1933L2306j06840J85335a13057J7066A47251J24139j25122d5884
$$ 93725 185658 217964 111124 296459 -113057 -95991 147251 271390 146268 -45884
13146B93591P2708A04910J25020Q3889c080E3464J09195h7737J5866B86683p3571
$$ 293591 366299 104910 229930 313819 -3080 53464 162659 -87737 -71871 286683 213112
13135B13112a37663F9735J35053m7251a93066F1858O2977O9161H7707i2752D58682
$$ 213112 -137663 69735 204788 157537 -193066 61858 124835 193996 87707 -92752 458682
13123A47960K04459a58803B34795A05542K8459a24297L5876j20400k5084A14758
$$ 147960 352419 -158803 234795 105542 134001 -124297 -88421 -208821 -233905 114758
13112A8685K47668F6775I47a5377A46678J37867a66323A64101C2812P0842m8339
$$ 18685 266353 66775 947 -15377 146678 284545 -166323 164101 32812 103654 55315
13101E5315b79885Q7664h3174A58118r515B321J0028b55585G3771K72617d4902
$$ 55315 -279885 -192221 -83174 158118 148603 2321 12349 -255585 73771 346388 -44902
13089B2085O1749H499c0351k39018a19999P189a8172j7295G124K6632K60323A22882
$$ 22085 83834 8499 -30351 -269369 -119999 -112810 -18172 -35467 7124 33756 294079 122882
13076B93458a37361A70551M01477b14263f962B8161J3593L6997K93707B9795c5387
$$ 293458 -137361 170551 572028 -214263 -6962 28161 41754 78751 372458 29795 -35387
13064B54589K10673j03859G4666B4984O874K523J0938B1747l07K5455J66113l2493
$$ 254589 465262 361403 74666 24984 31858 34381 45319 21747 21440 46895 213008 180515
13052A80515m4362a01105C09633o797m4494A06123G486e491j18569O0497l7670
$$ 180515 136153 -101105 309633 302836 258342 106123 7486 -5491 -124060 -63563 -101233
13041a01233D78495k38906Q5085l4432C981J12384A4612J55475c9654p9048K0875
$$ -101233 478495 239589 324674 290242 3981 116365 14612 170087 -39654 -118702 -97827
13030i7827A69073a99723B47810a44470A11822f0871C84731a43901d9744m1124
$$ -97827 169073 -199723 247810 -144470 111822 -60871 384731 -143901 -49744 -90868
13020i0868j71029A57764p2393l6244L08297G1287d5207C52510Q707E13K45291
$$ -90868 -261897 157764 85371 49127 357424 71287 -45207 352510 361217 513 245804
13009B45804D7798a78005B15900K8582i9237o7027F6303Q2438N5100n0086b04314
$$ 245804 47798 -178005 215900 244482 -99237 -166264 66303 148741 203841 153755 -204314
12997B56390J88527f5304A98434R220O0385O5446A6418K8594b09009A65146o5438
$$ 256390 444917 -65304 198434 207654 268039 333485 16418 45012 -209009 165146 99708
12986I9708J74183A17243d33171a09853D9870N03041A90953K0548K097G6591M31134
$$ 99708 273891 117243 -433171 -109853 49870 552911 190953 211501 213598 76591 507725
12975E07725G6980J96682a31567M7624H1888c3390B56228I2200b08266e1203m8604
$$ 507725 76980 273662 -131567 -83943 81888 -33390 256228 92200 -208266 -51203 -99807
12964i9807A62675K09490j81961a29326c1947B49725A10856N903m6555d7193j36757
$$ -99807 162675 372165 190204 -129326 -31947 249725 110856 116759 70204 -47193 -183950
12953a83950q1257c5034G1912J79537k6592G5305R047a6119B38341l0350K32645
$$ -183950 -265207 -35034 71912 251449 224857 75305 84352 -16119 238341 207991 440636
12942D40636a24590N3081L0467j7303D0323c65326J17125P7267q9548a2531A10072
$$ 440636 -124590 -71509 -41042 -58345 40323 -365326 -248201 -170934 -260482 -12531 110072
12930c1386j11203J0981j24985C45492G0517c76800J03316A69814g3421A64247
$$ -31386 -142589 -131608 -256593 345492 70517 -376800 -273484 169814 -73421 164247
12919I7477K05025e4474A75701M8376I6692a18170B39572D1772J44273H7397h2131
$$ 97477 302502 -54474 175701 224077 96692 -118170 239572 41772 186045 87397 -82131
12907d0098a0093B74546e4242A05885e73010D4960J10441i6997C43759B2880j204
$$ -40098 -10093 274546 -54242 105885 -573010 44960 155401 -96997 343759 22880 21676
12896B1676a89442A57348E5317a87987E8197d9656B64038a28020C01283G4599
$$ 21676 -189442 157348 55317 -187987 58197 -49656 264038 -128020 301283 74599
12885I7201J45104n0353D4458d1857C7994b9703k08318C0270L912P5368K3769
$$ 97201 242305 191952 44458 -41857 37994 -29703 -238021 30270 34182 109550 133319
12874A33319K070a22360A98236a51064C45413a74723F9086N1556a47770b2838
$$ 133319 135389 -122360 198236 -151064 345413 -174723 69086 120642 -147770 -22838
12863c42949B98259m883F344K88616r1489C8733b54212A39846b578j84108f0420
$$ -342949 298259 293376 6344 294960 203471 38733 -254212 139846 -2578 -186686 -60420
12851b10617A42475E972P9316C6088i8825j49106L2706a3048A09408J19905b3960
$$ -210617 142475 5972 85288 36088 -98825 -247931 -215225 -13048 109408 229313 -23960
12839a49986d4584b684k85431a20538C9915d1089j70421a3254A78645f5318p7556
$$ -149986 -44584 -2684 -288115 -120538 39915 -41089 -211510 -13254 178645 -65318 -142874
12828a42874j0095A148J19543N5781l3092K63526j72199k4095g1205j26175f1691
$$ -142874 -152969 1148 120691 176472 143380 406906 234707 210612 -71205 -197380 -61691
12816G3785a58349n7544N8357d3757A79000a82491G8209a13681a9999C39471g855
$$ 73785 -158349 -215893 -157536 -43757 179000 -182491 78209 -113681 -19999 339471 -7855
12804a04998A33882b71625B8771a24643N7690j06516E0880M0451N7193e1781A4996
$$ -104998 133882 -271625 28771 -124643 -66953 -173469 50880 91331 148524 -51781 14996
12792B9991J51389d7956C22578a75067B02094P0242A27188o2580h1913A08115
$$ 29991 181380 -47956 322578 -175067 202094 272336 127188 64608 -81913 108115
12781E9267k5393e3791A96192d9235l38862e7464j9506B81986g2442n4593j09959
$$ 59267 33874 -53791 196192 -49235 -388097 -57464 -76970 281986 -72442 -127035 -236994
12770b36994j31189B7489J69893r7010a34842j53432Q9118b2378G608b62451a12897
$$ -236994 -368183 27489 197382 100372 -134842 -288274 -199156 -22378 7608 -262451 -112897
12758a22231A4767O2565a95540c9015B32068H5721a6398r364B5652i9628A62507
$$ -122231 14767 77332 -195540 -39015 232068 85721 -16398 -25762 25652 -99628 162507
12746a7423j8395B49093C7994N5021c9323e703B32585b96636D3790g7176j18336
$$ -17423 -35818 249093 37994 93015 -39323 -5703 232585 -296636 43790 -77176 -195512
12735a95512A93691L42021B22368A04110P3649D2388J34842i7260B64486D5208
$$ -195512 193691 535712 222368 104110 177759 42388 177230 -97260 264486 45208
12724A4166J98501J52057J42909A75761c2256f931G9934L9835j4465a51783A62925
$$ 14166 212667 364724 507633 175761 -32256 -6931 79934 119769 105304 -151783 162925
12712g9773p0860B68387C520a59009p127d7585A75336n7025N8827G1795a79289
$$ -79773 -150633 268387 3520 -159009 -166136 -47585 175336 118311 177138 71795 -179289
12700A06704k5403c73668a41185A50334l4844L58127d9248I805J39349J38039
$$ 106704 81301 -373668 -141185 150334 115490 473617 -49248 9805 149154 287193
12690B87193b82831C02411r6441k8431n3418f0699A58764M6957E0582j3023a13039
$$ 287193 -282831 302411 205970 177539 124121 -60699 158764 205721 50582 37559 -113039
12678C37943A34294g577A28566e7912g958A43912a25706A49399c1664B15686D3148
$$ 337943 134294 -7577 128566 -57912 -7958 143912 -125706 149399 -31664 215686 43148
12666C6960a26220B353K69930a23397B2372p121f4703A20743b2292C8095p70b54151
$$ 36960 -126220 2353 272283 -123397 22372 15251 -64703 120743 -22292 38095 37325 -254151
12653B77715j36645M9786c5891o0272C16532d250B46735A04544J7663J27443b15551
$$ 277715 141070 190856 -35891 -96163 316532 -4250 246735 104544 122207 249650 -215551
12641B41496C566f3196C74819G7074R5121b5645D08093j78178q0374J41240D0446
$$ 241496 3566 -63196 374819 77074 172195 -25645 408093 229915 149541 290781 40446
12629B37974c1750j04095D9512f5931I5687J06528o423o0223b93154F330a37656
$$ 237974 -31750 -135845 49512 -65931 95687 202215 195792 135569 -293154 6330 -137656
12617g4126B57107a6862C68336j53783k2799b6916C87668j52845n8521b22186
$$ -74126 257107 -16862 368336 214553 191754 -26916 387668 234823 176302 -222186
12606C83033i5922j21702A14010a41238O97A95722g2099j06594d3198j85419P7666
$$ 383033 -95922 -217624 114010 -141238 -140541 195722 -72099 -178693 -43198 -228617 -150951
12595a50951O5111C4036L55615C3856M03157F369M95506i8295j4147C04061A05138
$$ -150951 -85840 34036 389651 33856 437013 6369 501875 -98295 -112442 304061 105138
12583a23969A13460A5892a44383B17811l3001a30704H1828K82817A15770J58052
$$ -123969 113460 15892 -144383 217811 184810 -130704 81828 364645 115770 273822
12573B73822A34935N4632J29095B2100a33542e6845K4214L851j49046F9850J61174
$$ 273822 134935 189567 318662 22100 -133542 -56845 -32631 -28780 -177826 69850 231024
12562B31024a0613B2492M67153a87741G0623L053R456K5825a35179B25221A01596
$$ 231024 -10613 22492 489645 -187741 70623 73676 83132 108957 -135179 225221 101596
12550B9355J39263J96214j40569r9958k9596b23164g049A28886e29578A70543
$$ 29355 168618 364832 224263 124305 94709 -223164 -7049 128886 -529578 170543
12539A612K96249A10775c82497b7553B80811b80454a18459B95381a30331A57676
$$ 1612 297861 110775 -382497 -27553 280811 -280454 -118459 295381 -130331 157676
12528g0148C32276A04921A7139a25330L6775A95831f2143l11879B47281C4441
$$ -70148 332276 104921 17139 -125330 -88555 195831 -62143 -374022 247281 34441
12517B25376d0168G0811Q070a35990C05591C2833Q1196c604B75854J8835h3475
$$ 225376 -40168 70811 78881 -135990 305591 32833 114029 -3604 275854 294689 -83475
12505A4493M3847a00912B64832m9392a80917a871j39976O4088n039m0043n0380
$$ 14493 58340 -100912 264832 215440 -180917 -1871 -141847 -77759 -82798 -122841 -173221
12494a73221Q5288p899F31396A68478I605h5183L4016F5916O129J59056G1947
$$ -173221 -87933 -95832 631396 168478 9605 -85183 -51167 65916 72045 231101 71947
12482a24062B61884f5752p047E5174b6334A4338d326B2686K78738C5156A4613
$$ -124062 261884 -65752 -72799 55174 -26334 14338 -4326 22686 301424 35156 14613
12470A09261K37953g3478j65251e8067Q45G0358h0624B31752J70757I1261q152
$$ 109261 347214 -73478 -238729 -58067 -57222 70358 -80624 231752 402509 91261 83109
12459H3109J38827b2836j75168A35328i0817j91787f775E5910J18997D205b88819
$$ 83109 221936 -22836 -198004 135328 -90817 -282604 -6775 55910 174907 4205 -288819
12447f0150l0655q036C9757a25589A20793b69239b09o8861B5845d7710I0850i4340
$$ -60150 -90805 -98841 39757 -125589 120793 -269239 -209 -69070 25845 -47710 90850 -94340
12434C18089a43722A9730J9033R2414C3083c79763F7909b93774a22910a6765I92
$$ 318089 -143722 19730 38763 131177 33083 -379763 67909 -293774 -122910 -16765 992
12422I4144A2216g6016C0829a5792H892a52999r4951B06276G0142a08226B35330
$$ 94144 12216 -76016 30829 -15792 8892 -152999 -247950 206276 70142 -108226 235330
12410a41134o2408o1009i8727C19J40414G872c3950j85292J05365q3900B68273
$$ -141134 -203542 -264551 -98727 319 140733 7872 -33950 -219242 -113877 -197777 268273
12398A95874c2274A30513b32693R0217H4473R7000a56631b6502A61839a29922
$$ 195874 -32274 130513 -232693 -142476 84473 181473 -156631 -26502 161839 -129922
12387A14688J65995F6370a46028K231k10867h3679A95883c6169j9414A18528c04638
$$ 114688 280683 66370 -146028 -143797 -354664 -83679 195883 -36169 -55583 118528 -304638
12375a41535B20946G0963L1694b4239j74755K8409K8305A17657L0000b55993A63869
$$ -141535 220946 70963 102657 -24239 -198994 -170585 -142280 117657 147657 -255993 163869
12363A75535a20046k9495F7072K46408A16321i835I697L12594e1394B03984D5694
$$ 175535 -120046 -149541 67072 313480 116321 -9835 9697 322291 -51394 203984 45694
12351E2846M4826C2783l117P1312j8184J98805E5991k7433J59621a71580k07616
$$ 52846 97672 32783 29666 100978 82794 281599 55991 28558 188179 -171580 -379196
12340c79196A78688a98682J3902G8147k3489k2718L5392i9050B29708d13152C1980
$$ -379196 178688 -198682 -184780 78147 54658 31940 67332 -99050 229708 -413152 31980
12328b00537D3051a68778H6031P5702n439J3796K03299G6318Q4684J66870C3286
$$ -200537 43051 -168778 86031 161733 156294 170090 373389 76318 161002 327872 33286
12316a84653K4957k7152A9476J41998a0662A0727K5984j5733K56737b03089D18887
$$ -184653 -159696 -186848 19476 161474 -10662 10727 36711 20978 277715 -203089 418887
12304A82488f2700B01935b3194A24127J0849a29796C2259K8121h6981A656K1965
$$ 182488 -62700 201935 -23194 124127 134976 -129796 32259 60380 -86981 1656 23621
12293B3621a45362A62768l5669c08174N2688R1199B31960J77497f0388H4730c1446
$$ 23621 -145362 162768 127099 -308174 -255486 -164287 231960 409457 -60388 84730 -31446
12281C9502K05003c49305e7355A98404r5633K70003a00683H7072C3566K1201N2811
$$ 39502 244505 -349305 -57355 198404 102771 372774 -100683 87072 33566 54767 107578
12270A07578P2579J09457I8923R3675j2564a58875B02720M7569A6239p063K48221
$$ 107578 180157 289614 98923 192598 180034 -158875 202720 250289 16239 9176 257397
12259B57397K23174A44618b07826A60765B5449b78887B27647m9697b79046A55982
$$ 257397 480571 144618 -207826 160765 25449 -278887 227647 177950 -279046 155982
12248A48707a56434A84387J49776D8578a02198D13041d2831m7530q9935A69009
$$ 148707 -156434 184387 334163 48578 -102198 413041 -42831 -90361 -180296 169009
12237C65429b66380J06991e255A22203a46159C44316f0784A98015f415C75630
$$ 365429 -266380 -159389 -5255 122203 -146159 344316 -60784 198015 -6415 375630
12226C45757b9870C60395j50335p0148O5787d6837B08028A7482L0754b01252d8532
$$ 345757 -29870 360395 210060 139912 205699 -46837 208028 17482 48236 -201252 -48532
12214F9336A5168i4698q3306C43457A35048j2298i5484B82817H0222Q9918R2169
$$ 69336 15168 -94698 -178004 343457 135048 122750 -95484 282817 80222 170140 262309
12203B62309G2073B0895d5184C51238m4995o8195r8157K17001D9852L08715C9589
$$ 262309 72073 20895 -45184 351238 306243 238048 139891 356892 49852 358567 39589
12191B97844J03531F2288R9300J29171n8621H7585K42275F7414P7369J4789D9041
$$ 297844 401375 62288 161588 290759 232138 87585 329860 67414 144783 159572 49041
12179A19987J22700L676q3933J5556P0047J0221m2603r4050n0107K63503a03796
$$ 119987 242687 246363 162430 177986 248033 258254 215651 121601 71494 334997 -103796
12167G5208a61995A76701N2342k5592q5597K06914a22996l2300B05258q767J60610
$$ 75208 -161995 176701 229043 203451 117854 324768 -122996 -155296 205258 196491 357101
12156C57101c3685A4225d4288C32256a60905C75074n2216c65439E9431A0650K24860
$$ 357101 -33685 14225 -44288 332256 -160905 375074 322858 -365439 59431 10650 235510
12145B35510A12954J00094d9734B91106L1845A36130c73006A40342c7822A55097
$$ 235510 112954 213048 -49734 291106 322951 136130 -373006 140342 -37822 155097
12134B5080L02659r8252c3064A55972c0706j38269b1685B6348K32103m2954G0021
$$ 25080 327739 229487 -33064 155972 -30706 -168975 -21685 26348 258451 215497 70021
12122f1947E9576R6290b49558h3938K5004H6674p922j0669J48344h3763r0633
$$ -61947 59576 155866 -249558 -83938 -58934 86674 78752 68083 216427 -83763 -174396
12111a74396A19127k5302R7740l6583R716b48866g0396a6509P201A74624E6293
$$ -174396 119127 93825 191565 154982 164698 -248866 -70396 -16509 -9308 174624 56293
12099A64111c75989J82379P4571D8311i7851a7908E6381O7996i5763k42132H2977
$$ 164111 -375989 -193610 -119039 48311 -97851 -17908 56381 124377 -95763 -337895 82977
12087b2740F596L3805M22796F2220K6738c13341J24101L4151A20228J54005b3417
$$ -22740 6596 40401 463197 62220 88958 -313341 -189240 -155089 120228 274233 -23417
12075d9032F5897j0249k2718L87702d7118J0823A37229a22781C18918A51434L46905
$$ -49032 65897 55648 32930 420632 -47118 -36295 137229 -122781 318918 151434 498339
12064D98339A78335P62663K16234m63058B89790P2129K3968P6717b38272H683
$$ 498339 178335 940998 1157232 694174 289790 361919 385887 462604 -238272 8683
12053a87190C2519N4646c5375A69585G4505b61423M3737D4889g4728A64453h4545
$$ -187190 32519 87165 -35375 169585 74505 -261423 -217686 44889 -74728 164453 -84545
12041b14571A83777O7049C0524M645h6638C7993J119j618J19309C0452b36666
$$ -214571 183777 250826 30524 35169 -86638 37993 39112 37494 156803 30452 -236666
12029E2477h619j45357A26a58330B7211h1830j20186C8650a58371P6101E1360
$$ 52477 -8619 -153976 126 -158330 27211 -81830 -202016 38650 -158371 -82270 51360
12017B39575f7456I321a8185r6746j5468a3898p9060J0016n2454I3846a75194
$$ 239575 -67456 9321 -18185 -114931 -130399 -13898 -92958 -82942 -135396 93846 -175194
12005A18499m022D1644J02694c96997A94780O7603F5124f6637r0243O2174q9314
$$ 118499 114477 41644 144338 -396997 194780 262383 65124 -66637 -156880 -94706 -184020
11994a84020f2586j78157J9326b4953B02256b6135j97928B2269K36251b7815j96798
$$ -184020 -62586 -240743 -221417 -24953 202256 -26135 -224063 22269 258520 -27815 -224613
11983b24613J06996F952J34491J99760D8784K10595c83941J74902C21976I3901
$$ -224613 -117617 6952 141443 341203 48784 259379 -383941 -209039 321976 93901
11972c0389B08959j0691a05198B73480b46507E3898b58606B98008G9416g8730
$$ -30389 208959 198268 -105198 273480 -246507 53898 -258606 298008 79416 -78730
11961a05376o8627A03012l3879m643J49233e4418j35652A91758J2657C1248a43232
$$ -105376 -174003 103012 69133 64490 213723 -54418 -190070 191758 204415 31248 -143232
11949d3629G2525R1674A0664J30748J62335a28750b1416R208j92831f9879E2709
$$ -43629 72525 164199 10664 141412 303747 -128750 -21416 -12208 -205039 -69879 52709
11937C9121P8189a1042j20737N1424k41484G1905b49708E7242a88153L9533O6174
$$ 39121 117310 -11042 -131779 -80355 -321839 71905 -249708 57242 -188153 -148620 -82446
11926h2446B75221A04702J70332G2740K60072g2730j68181P470h9237A44337C7819
$$ -82446 275221 104702 275034 72740 332812 -72730 -240911 -233441 -89237 144337 37819
11914C4530b92462f8802C36572a44672H1467A8515J13792c85282b8548a830j38408
$$ 34530 -292462 -68802 336572 -144672 81467 18515 132307 -385282 -28548 -1830 -140238
11903a40238A6740J77424h171I9675b86954e2793B32406A1914P8637b62986B7231
$$ -140238 16740 194164 -8171 99675 -286954 -52793 232406 11914 90551 -262986 27231
11891B5149a8695r2542B63080e4856r9052K3579n67A11853f2587A11887N927a61151
$$ 25149 -18695 -111237 263080 -54856 -153908 -130329 -130896 111853 -62587 111887 117814 -161151
11878c04377O2749d4218B615Q3965B9936c5994B30611F8763J6269K03085b47485
$$ -304377 -241628 -44218 2615 86580 29936 -35994 230611 68763 85032 288117 -247485
11866B66696c63317a69087O5336j25128B6454L2857b6711k55708C2259L77636
$$ 266696 -363317 -169087 -103751 -228879 26454 59311 -26711 -282419 32259 409895
11856D09895a4129j53668f9922G0623a38266N8023A04610a53684A26876H958O151
$$ 409895 -14129 -167797 -69922 70623 -138266 -80243 104610 -153684 126876 8958 15109
11845A5109d6921n479r2758A39698b00667K1787B9414a09521D17682a73647j75356
$$ 15109 -46921 -52400 -145158 139698 -200667 -178880 29414 -109521 417682 -173647 -349003
11834c49003c2518k74862g2874J663C248a61128P0808A26747C2317a50423N8415
$$ -349003 -32518 -307380 -72874 -71211 3248 -161128 -90320 126747 32317 -150423 -92008
11823i2008A6394J66603g9465l20325A36647J77346a26561q2599O3486M2274H1626
$$ -92008 16394 182997 -79465 -399790 136647 313993 -126561 -209160 -145674 -103400 81626
11811c17389a25650n859A20951a15995a9519j16600A67534d03737I7263b82202
$$ -317389 -125650 -131509 120951 -115995 -19519 -136119 167534 -403737 97263 -282202
11800B6595b00391A31498a41156C70485b7303D7610f558D454K00556B8630J57223
$$ 26595 -200391 131498 -141156 370485 -27303 47610 -6558 4454 205010 28630 185853
11789A85853L6860a75724g7447B08174m2382G554h5252A54064b99277A00591Q4241
$$ 185853 222713 -175724 -77447 208174 165792 7554 -85252 154064 -299277 100591 184832
11778A84832H9562b5035j49045E8583a42045f8823q5311A11956O7802a29116C2017
$$ 184832 89562 -25035 -174080 58583 -142045 -68823 -154134 111956 179758 -129116 32017
11766b55866g1089j85557N0988j92333a02896C4044L35008a38149G7074R0366
$$ -255866 -71089 -256646 -205658 -397991 -102896 34044 369052 -138149 77074 167440
11756A67440P229q3958J30617h2993j2476m2232O6756A29374Q0688d4018j98772
$$ 167440 174669 90711 221328 -82993 -95469 -137701 -70945 129374 210062 -44018 -242790
11745b42790R7658A61147a96925A5591a56973d5992A60219c22934D7122c50028
$$ -242790 -145132 161147 -196925 15591 -156973 -45992 160219 -322934 47122 -350028
11734a96951d4220P058B57069c48413A05246a23417G5914d84512a42395G532d10325
$$ -196951 -44220 -37162 257069 -348413 105246 -123417 75914 -484512 -142395 7532 -410325
11722C66219c15146A31321m5337J77333h1668E8281b8051j11374A02238N7141
$$ 366219 -315146 131321 85984 263317 -81668 58281 -28051 -139425 102238 159379
11712A59379o8010a93809G801J2137J98389A01900J86451g7611J0132D35293e583
$$ 159379 91369 -193809 7801 19938 218327 101900 288351 -77611 -67479 435293 -5583
11700A17840J26648a90065B05688J71212C8962K02762j02560J77542a80493L8130
$$ 117840 244488 -190065 205688 376900 38962 241724 139164 316706 -180493 -142363
11690a42363M3113o2022M0I6630R329J66445i1565E3730Q8813n8872k2114p135
$$ -142363 -99250 -161272 -161232 96630 105959 272404 -91565 53730 142543 83671 61557 54422
11678E4422g2638H4678Q1955J22698e8461C4343A0745K76295k8300C9773M9445
$$ 54422 -72638 84678 166633 289331 -58461 34343 10745 287040 258740 39773 89218
11667H9218a30096d1614A43341b02645D26272a28448A20470a8304A53968d1355
$$ 89218 -130096 -41614 143341 -202645 426272 -128448 120470 -18304 153968 -41355
11656a50922E71809c53848A0447g609j22236B07589p4236n0267c94763J49501
$$ -150922 571809 -353848 10447 -7609 -129845 207589 133353 83086 -394763 -245262
11646b45262a3029r699c814p1024k9488q0890C5474b7728j95217Q1225j00201
$$ -245262 -13029 -22728 -3814 -74838 -104326 -185216 35474 -27728 -222945 -141720 -241921
11635b41921A9175a07636E4448k3604a13995D0142c0765q6092G6309J32598a92598
$$ -241921 19175 -107636 54448 30844 -113995 40142 -30765 -116857 76309 208907 -192598
11623B0781f8620I7024q33K10706b2673F1099K52204H7213b31862I3399P596q659
$$ 20781 -68620 97024 96191 306897 -22673 61099 313303 87213 -231862 93399 100995 92336
11611I2336C2173J72346I7433a69205C33525g5670A16708b50050B11736c30578
$$ 92336 32173 204519 97433 -169205 333525 -75670 116708 -250050 211736 -330578
11600c9815A93905b57812e6140B49578h829F8767K7672a02825D6799J53420l3094
$$ -39815 193905 -257812 -56140 249578 -8829 68767 96439 -102825 46799 200219 167125
11589A67125a07279E2056a95170A297K0539c0101C65070a77248B09415a5066k13379
$$ 167125 -107279 52056 -195170 1297 21836 -30101 365070 -177248 209415 -15066 -228445
11578b28445F4636f6031E6741J14487C6782M1440h3465A58874K2083H9399J57489
$$ -228445 64636 -66031 56741 171228 36782 78222 -83465 158874 180957 89399 246888
11567B46888o9916a45730G2878K42857a1500o7339a7649H0510M45511A0049O3824
$$ 246888 176972 -145730 72878 315735 -11500 -78839 -17649 80510 526021 10049 73873
11556G3873g7484B06498M5612o0004l1773h2803o951B27770j02258M8500K44928
$$ 73873 -77484 206498 252110 192106 160333 -82803 -89754 227770 125512 174012 418940
11545D18940A5986b26745B30381A14203f8910B14142g0538D0925b1199p3885D67419
$$ 418940 15986 -226745 230381 114203 -68910 214142 -70538 40925 -21199 -95084 467419
11533C93492h7214O197E680J01741K15117a74837j10633d8754C92387B434J60745
$$ 393492 -87214 -81017 5680 107421 322538 -174837 -285470 -48754 392387 2434 163179
11522A63179Q442E5163L45599f1704k82075E0125Q2894n2534b71431A91579o6171
$$ 163179 171621 55163 400762 -61704 -343779 50125 133019 80485 -271431 191579 125408
11511A25408O7120f734k56353G7601P4306d4432B24284N3582q2363J14484j18607
$$ 125408 192528 -6734 -263087 77601 151907 -44432 224284 277866 195503 309987 191380
11500A91380d4696A20784k7338h118A15093h7233C98062B2356J34873J58246C2517
$$ 191380 -44696 120784 93446 -8118 115093 -87233 398062 22356 157229 315475 32517
11488A38475a14613D8751a06824C30507b53382B10073a24583A66449a00551A11972
$$ 138475 -114613 48751 -106824 330507 -253382 210073 -124583 166449 -100551 111972
11477A0725P5653K50904p9161l3430C1554P1629O463C5802b8760B07939Q5175
$$ 10725 86378 337282 258121 224691 31554 103183 109646 35802 -28760 207939 293114
11466B93114k4641O1577H3104L7824N086N7896J76247j8442a43115E9860K06652
$$ 293114 268473 330050 83104 120928 126014 183910 360157 341715 -143115 59860 266512
11455B66512L4584g0339B02170l2589C184e8686E4108J61266d0539a5596D6471
$$ 266512 301096 -70339 202170 169581 3184 -58686 54108 215374 -40539 -15596 46471
11443E907K0198J98788G6039J45986B1112N2364J81315j12067J74952a68423j29251
$$ 5907 26105 224893 76039 222025 21112 73476 254791 142724 317676 -168423 -297674
11432b97674A22053L5953m4848P674a04102c3626B72241I2816J69310E7713i5301
$$ -297674 122053 158006 113158 120832 -104102 -33626 272241 92816 262126 57713 -95301
11420a52505G2242R4762G6335J08705p081J57406D5765L60739q2378b46856J00674
$$ -152505 72242 167004 76335 185040 177959 335365 45765 406504 324126 -246856 -146182
11409a46182P1888j6940q7613d4826a1588A27327r90b26245K3824E5975J01630
$$ -146182 -74294 -91234 -178847 -44826 -11588 127327 126337 -226245 -202421 55975 157605
11398A57605c26125g3015r8633H0465J61230c88366A04911a21518B8244a02458
$$ 157605 -326125 -73015 -171648 80465 241695 -388366 104911 -121518 28244 -102458
11387g2575B14480a90424B00050l8006e4238A84076J722o3379e8322A65507N5411
$$ -72575 214480 -190424 200050 162044 -54238 184076 185798 122419 -58322 165507 220918
11376B20918m5868b60942H658a7550I0125l7837N6808J39992j03512e4827A93490
$$ 220918 175050 -260942 8658 -17550 90125 52288 109096 249088 145576 -54827 193490
11364a29285j01460F411c5918A98411a93928j23199A47475f2502b931A96049P5079
$$ -129285 -230745 6411 -35918 198411 -193928 -317127 147475 -62502 -2931 196049 271128
11353B71128a94200B12148b3295G3867K09463D8912a59708g5331A8423b78115
$$ 271128 -194200 212148 -23295 73867 283330 48912 -159708 -75331 18423 -278115
11342b36946B96740A37966b13801b4142A84909b60411E64130a470B89229g2306
$$ -236946 296740 137966 -213801 -24142 184909 -260411 564130 -1470 289229 -72306
11331f4564L731A50115a99698o0370A37636D4619a12392L4172B9899L3027J62731
$$ -64564 -60833 150115 -199698 -260068 137636 44619 -112392 -78220 29899 62926 225657
11320B25657D4970M2519E203c29389f2709B06253r6572c9349A09350c30462c1603
$$ 225657 44970 87489 5203 -329389 -62709 206253 109681 -39349 109350 -330462 -31603
11308A56289h8865b2628j42877D27492A28476a51373j35710e0829m4774A01411
$$ 156289 -88865 -22628 -165505 427492 128476 -151373 -287083 -50829 -95603 101411
11297b19044O5559L2416E6613a68622A87494b70087A64162A152J05816f7419j62190
$$ -219044 -153485 -121069 56613 -168622 187494 -270087 164162 1152 106968 -67419 -229609
11286b29609B58976B0708a61710H661h5780B88204A15380a85693n1531R6903C2148
$$ -229609 258976 20708 -161710 8661 -85780 288204 115380 -185693 -237224 -140321 32148
11274E1731a54520P6445J0954B6993h6618H9410f8154n2819C60954g7953l55886
$$ 51731 -154520 -78075 -67121 26993 -86618 89410 -68154 -120973 360954 -77953 -433839
11263d33839a69729f4806C30551A06500c9308q1679k25849C62468b95281B85854
$$ -433839 -169729 -64806 330551 106500 -39308 -120987 -346836 362468 -295281 285854
11252b04710C7276J47981q9053b9437j41129K8949B4136a80662q1313a14300q4716
$$ -204710 37276 185257 96204 -29437 -170566 -141617 24136 -180662 -261975 -114300 -199016
11241a99016C46983d3126J9092B780L11278F9046Q3873R4939d911B8173i698j75853
$$ -199016 346983 -43126 -24034 2780 314058 69046 152919 247858 -4911 28173 -9698 -185551
11229a85551L9861N7613m9920A3738Q1963b12323D420d4268B1398a89541a0152
$$ -185551 -145690 -88077 -137997 13738 95701 -212323 4420 -44268 21398 -189541 -10152
11217f6245g038A52727D5590a58249l22475c1540k5993J8925a0558l8838D83443
$$ -66245 -7038 152727 45590 -158249 -480724 -31540 -57533 -38608 -10558 -49396 483443
11205G8762O5455n1757l6367K9365i2909A0915b00820H4371A2015b11631k08779
$$ 78762 144217 92460 56093 85458 -92909 10915 -200820 84371 12015 -211631 -420410
11194d20410h8275I0427i299j45676d9968J1557p0586j87425J44045j0910e0631
$$ -420410 -88275 90427 -9299 -154975 -49968 -38411 -108997 -296422 -152377 -163287 -50631
11182e328j79874h0930k27071i7784A39146D5943c96967P4185F228N0296K10516
$$ -5328 -185202 -80930 -308001 -97784 139146 45943 -396967 -322782 6228 56524 267040
11171B67040b07731b6594p298A08550N4085a35232B1028K02327q1911P4763a55377
$$ 267040 -207731 -26594 -33892 108550 162635 -135232 21028 223355 141444 216207 -155377
11159b06229B60744c9577j34918n8071A21237C4944K9106r481a3195m340C49199
$$ -206229 260744 -39577 -174495 -232566 121237 34944 64050 54569 -13195 -17535 349199
11147F8144a26055b9066G7233a32955H5712D961L97152c3237q9804H3834J15636
$$ 68144 -126055 -29066 77233 -132955 85712 4961 402113 -33237 -123041 83834 199470
11136A99470r4135d4257a814j269n1432p555A91351F9382f0000G8829i4251k4849
$$ 199470 105335 -44257 -1814 -3083 -54515 -62070 191351 69382 -60000 78829 -94251 -119100
11124a19100c0455A20682h4842D06599a43336D85193c73167a02896B437M34883
$$ -119100 -30455 120682 -84842 406599 -143336 485193 -373167 -102896 2437 437320
11114D37320B968Q746a60644D7451a52070c9593F8840d41465G3357J0105Q180
$$ 437320 2968 11714 -160644 47451 -152070 -39593 68840 -441465 73357 83462 91642
11103I1642l8815J72540A8196R9967Q3795a34124D7810J30385a09703I3923N3045
$$ 91642 52827 225367 18196 118163 201958 -134124 47810 178195 -109703 93923 146968
11092A46968b9689B23090B2182K29388j16662a2414D66201a01736C05397H5278
$$ 146968 -29689 223090 22182 251570 134908 -12414 466201 -101736 305397 85278
11081B45116A22025K17320p0389B7713H275J2726K23341O3607l169G0920K28954
$$ 245116 122025 339345 268956 27713 8275 21001 244342 307949 304780 70920 299874
11070B99874A03217L7469j7326a12298k0903I6309K77656a33954E9339M07833
$$ 299874 103217 140686 123360 -112298 -133201 96309 373965 -133954 59339 467172
11060D67172a9453H9862J83430a12452A93674K43597A99006H3670J50088L2469
$$ 467172 -19453 89862 273292 -112452 193674 437271 199006 83670 233758 266227
11050B66227O8480m1417J757J54142J98636B20070L8947L34825A28048N26143
$$ 266227 334707 293290 295047 449189 647825 220070 259017 593842 128048 654191
11040F54191k71277L40203j63280M6841J32894j54815l5025K06694J06493K56198
$$ 654191 382914 723117 559837 606678 739572 584757 549732 756426 862919 1119117
11030A119117j29351j06429k20415j9473J79788j08149k55746J62729J00492L52005
$$ 1119117 989766 883337 662922 643449 823237 715088 459342 622071 722563 1074568
11020A074568m04982Q9130l44284K59543J52315l21132K2264J49288o8565R3482
$$ 1074568 669586 758716 414432 673975 826290 505158 527422 676710 608145 701627
11010G01627j27528K72807J72239m90306j19340J65589j53475P3740M1803k7249
$$ 701627 574099 846906 1019145 528839 409499 575088 421613 495353 537156 509907
11000E09907J88635j80974K3867K7184j79652K72762k10670J86019B01042N18404
$$ 509907 698542 517568 541435 568619 388967 661729 451059 637078 201042 719446
10990G19446N694M304J82385l97526O6761n7315J16449k3803L97983k99098R2791
$$ 719446 725140 729444 911829 514303 581064 523749 640198 616395 1014378 715280 808071
10979H08071n1185k92541K00182o0792j75922N14004k38794J06928K8684K64304
$$ 808071 756886 464345 664527 603735 427813 941817 703023 809951 838635 1102939
10969A102939l99856P15642r3787m08948K07145J43192k6947J18537L07219N65314
$$ 1102939 703083 1418725 1324938 915990 1123135 1266327 1239380 1357917 1665136 2230450
10959B230450k45144L1904O96554o7162j70972J99186k54079J4329k10263o00253
$$ 2230450 1985306 2017210 2713764 2646602 2475630 2674816 2420737 2435066 2224803 1624550
10949A624550J88463O6937k90941j55735N20215l74340J54212m2723k45495M69918
$$ 1624550 1813013 1879950 1589009 1433274 1953489 1579149 1733361 1690638 1445143 1915061
10939A915061o14059K61826k8526l20200j11472j86726j92592k79037j05192M81475
$$ 1915061 1301002 1562828 1534302 1214102 1102630 915904 723312 444275 339083 820558
10929H20558l04645J5510j59769j81765Q6619j8845M7850n3359J62952r7945A53481
$$ 820558 515913 531423 371654 189889 276508 257663 305513 252154 415106 317161 153481
10917h3378B22624M4593e7248m9357D8629b97021C08210g7515c2411p7282e166
$$ -83378 222624 267217 -57248 -106605 48629 -297021 308210 -77515 -32411 -109693 -5166
10905a5285A19103a18478H185c0627r8303G9401g6932h586I0750R559K44802D2280
$$ -15285 119103 -118478 8185 -30627 -128930 79401 -76932 -8586 90750 100309 345111 42280
10892A04796C3911J40990K12527b47061f0166A07021C0903a60742B34454j10888
$$ 104796 33911 174901 387428 -247061 -60166 107021 30903 -160742 234454 123566
10882A23566a94504e0548l11439h2601E6238a45115j85111K4159G2045b9531l58602
$$ 123566 -194504 -50548 -361987 -82601 56238 -145115 -330226 -306067 72045 -29531 -388133
10871c88133j83465A43817b22132A29064J73e4231C25160O7643H0085F611K76580
$$ -388133 -571598 143817 -222132 129064 129237 -54231 325160 392803 80085 6611 283191
10860B83191i2776A15684B299b48716h4781B22075J6710d271o2732D58709q6143
$$ 283191 -92776 115684 2299 -248716 -84781 222075 238785 -4271 -67003 458709 372566
10849C72566f9984A0707a32776p0667B08947J07288h3248m8839C4810e9862j20376
$$ 372566 -69984 10707 -132776 -203443 208947 316235 -83248 -132087 34810 -59862 -180238
10838a80238g1339d42B95169b03377R9881B77385a56896B9319g1247A31186B7569
$$ -180238 -71339 -442 295169 -203377 -103496 277385 -156896 29319 -71247 131186 27569
10826I9681e9642E9237a76155f6882C05961D3873a94607p2167f502p7106F4115
$$ 99681 -59642 59237 -176155 -66882 305961 43873 -194607 -266774 -6502 -83608 64115
10814A3206h6909A74752c6769j48132C5017a16792A03158f9389B77205E0501a06992
$$ 13206 -86909 174752 -36769 -184901 35017 -116792 103158 -69389 277205 50501 -106992
10802D5853j3802b3991B08220m4379R853i6054j94338a4188I7902a77613j91464
$$ 45853 32051 -23991 208220 163841 173694 -96054 -290392 -14188 97902 -177613 -369077
10791c69077a23000q673G0357L9001b02042O8819H3098K50245A63674c37563d8814
$$ -369077 -123000 -131673 70357 109358 -202042 -133223 83098 333343 163674 -337563 -48814
10779a46171l27033a83049j13957i6141E4339L01454b2580l96422f008l2643A32526
$$ -146171 -473204 -183049 -297006 -96141 54339 355793 -22580 -419002 -6008 -38651 132526
10767b85833b0904k71273e3242l2336l62342a20791j85896d6463k00411f4001
$$ -285833 -20904 -292177 -53242 -85578 -447920 -120791 -306687 -46463 -246874 -64001
10756B5259J57891n7302h6388I3297L2851b1653n3985D04L26737E1220a18705
$$ 25259 183150 125848 -86388 93297 126148 -21653 -75638 404 327141 51220 -118705
10744a42261r926B2309L8340b18524R9922A7753J41955c82210a49010f8189o4886
$$ -142261 -152187 22309 60649 -218524 -118602 17753 159708 -382210 -149010 -68189 -133075
10733a33075e1310K0359b62l49861A63612N2150E7977O7205i5501A72015c7511
$$ -133075 -51310 -30951 -262 -350123 163612 215762 57977 125182 -95501 172015 -37511
10721C7311N1092h3819a018F6745a16742A40320f2110D5141b5212A67528n8202
$$ 37311 88403 -83819 -1018 66745 -116742 140320 -62110 45141 -25212 167528 109326
10710A09326b13704B0199a83055j14165K3295a20672j6887b8901r3765M3703F6652
$$ 109326 -213704 20199 -183055 -297220 -273925 -120672 -137559 -28901 -122666 -78963 66652
10698A27974j9049a73374A20391K40257a22360r0770q9850a48565O5571a7339
$$ 127974 108925 -173374 120391 360648 -122360 -213130 -302980 -148565 -82994 -17339
10687a64877n1403A59065E7587k2908o771d6827A19815B6624N9276a74498l39470
$$ -164877 -216280 159065 57587 34679 27908 -46827 119815 26624 85900 -174498 -513968
10676e13968K46151A61093r641m2092d0674j37723c397k9787D0033Q6768a69205
$$ -513968 -267817 161093 151452 109360 -40674 -178397 -3397 -33184 40033 126801 -169205
10664c11204d7608j34737a9787m52287f5033m0858a3309A50757F8733i254F912
$$ -311204 -47608 -182345 -19787 -472074 -65033 -105891 -13309 150757 68733 -9254 6912
10652d4277B724J34259a7926j56747G9741Q1805b58778A45034h8556p7876l2452
$$ -44277 2724 136983 -17926 -174673 79741 161546 -258778 145034 -88556 -166432 -198884
10641a98884l7689M9988J7944A03798M44138b41772J01726A02383a37875o296
$$ -198884 -236573 -186585 -168641 103798 547936 -241772 -140046 102383 -137875 -144171
10631a44171q1507B40667a43618N7264F7978c69292C9546a24852A15441d45646
$$ -144171 -225678 240667 -143618 -86354 67978 -369292 39546 -124852 115441 -445646
10620G2464b64296B29378b17326A07186c50785F6788a44918j10161j4179H5126
$$ 72464 -264296 229378 -217326 107186 -350785 66788 -144918 -255079 -269258 85126
10609a9459l6p5869K5250b4543C02185j35057J15025c52174a24020q4820a2059
$$ -19459 -19495 -95364 -70114 -24543 302185 167128 282153 -352174 -124020 -208840 -12059
10597h4368k29345M8087A20580b32971C1588f3693k16870H7006b58239a08885
$$ -84368 -313713 -265626 120580 -232971 31588 -63693 -280563 87006 -258239 -108885
10586b46632b2713F4669J9570g653D5511a58425A10610k5689e6033B22279a89013
$$ -246632 -22713 64669 84239 -7653 45511 -158425 110610 84921 -56033 222279 -189013
10574b63701e0464k54815H7282b17987F1626J2052g8164j82157A91860h8944A5170
$$ -263701 -50464 -305279 87282 -217987 61626 73678 -78164 -260321 191860 -88944 15170
10562I6747a12835k12276B98132a54446C36029d2263B09763c4424q9219c5348
$$ 96747 -112835 -325111 298132 -154446 336029 -42263 209763 -34424 -123643 -35348
10551H2284J81343a40567q5967A73283b3355j88739l4391A20130b3365B8812m48
$$ 82284 263627 -140567 -226534 173283 -23355 -212094 -246485 120130 -23365 28812 28364
10540B8364b5477A70510a1056A68843a89782R1542A39493a94024C1430b464j8156
$$ 28364 -25477 170510 -11056 168843 -189782 -98240 139493 -194024 31430 -2464 -20620
10529b0620k12294C6505i3674L1058j64275C5029a00117F3000a53147j57542L9330
$$ -20620 -232914 36505 -93674 -62616 -226891 35029 -100117 63000 -153147 -310689 -271359
10518b71359E6543J31718a14595a6473C0830e0701q2881H1456h7655L9215C4109
$$ -271359 56543 188261 -114595 -16473 30830 -50701 -133582 81456 -87655 -48440 34109
10506f8664j9883H9571b53960J11811D7038J49485b0603B15504a79744e8555H8477
$$ -68664 -88547 89571 -253960 -142149 47038 196523 -20603 215504 -179744 -58555 88477
10494D4659J55825c8727A50088b09249l5998a15621b4555E7534J84560c6836B18091
$$ 44659 200484 -38727 150088 -209249 -245247 -115621 -24555 57534 242094 -36836 218091
10482a79822c1950J0135B32944G6761a10940A97212c31909C206a43488K9064C39458
$$ -179822 -31950 -21815 232944 76761 -110940 197212 -331909 3206 -143488 -114424 339458
10470a06549A74761J35636B3568g382B95185j32952Q6603J91007j92941k3492
$$ -106549 174761 310397 23568 -7382 295185 162233 248836 439843 246902 223410
10460B23410Q5492D9230b33319B90133E1245J66353c94892J72252A2614f4716
$$ 223410 308902 49230 -233319 290133 51245 217598 -394892 -222640 12614 -64716
10449g2709G4579J32507a27209G2392b78153k5190b1386j22801B11976a35976
$$ -72709 74579 207086 -127209 72392 -278153 -303343 -21386 -144187 211976 -135976
10438e4215A81445n2089B8377h4074C8516P541J05491b5225B26179c73366A59562
$$ -54215 181445 129356 28377 -84074 38516 46057 151548 -25225 226179 -373366 159562
10426d2802A28166c09526a49549H933b22676a0901q2742A08682E510h6321b0516
$$ -42802 128166 -309526 -149549 8933 -222676 -10901 -93643 108682 5510 -86321 -20516
10414G2110c50731a0572j51636j53559c6151A18498g4173B1218Q6296C3526K5173
$$ 72110 -350731 -10572 -162208 -315767 -36151 118498 -74173 21218 107514 33526 58699
10403E8699A5456f7645k81771A37015a61253m6287d0242j39078B22473E4422M4878
$$ 58699 15456 -67645 -349416 137015 -161253 -207540 -40242 -179320 222473 54422 99300
10392I9300b33521e4829B65445b6813A63100E5644b95811A73888a72904n1453
$$ 99300 -233521 -54829 265445 -26813 163100 55644 -295811 173888 -172904 -224357
10382b24357H886i2834b2801D84075B7019J27452a13582A50482J1238a75167b9110
$$ -224357 8886 -92834 -22801 484075 27019 154471 -113582 150482 161720 -175167 -29110
10370a3280j98980C85586b28972C906e8443A26764n0626N2241J17322A4278P3011
$$ -13280 -212260 385586 -228972 3906 -58443 126764 76138 128379 245701 14278 87289
10359H7289l0107J61640i8814B09405m2388K12239B4484J55782M33712k34844
$$ 87289 57182 218822 -98814 209405 167017 379256 24484 180266 613978 379134
10349C79134n5524J66263k12878R8163d9129C81248m2693D4168a4572H7408L85666
$$ 379134 323610 489873 276995 375158 -49129 381248 338555 44168 -14572 87408 473074
10338D73074A71821K24352M0241I6138M83253j90642k5197j3839J79840j41028
$$ 473074 171821 396173 436414 96138 579391 388749 363552 349713 529553 388525
10328C88525j01878J55898a56187A50938N9574M20450B89799A05834a54454p0946
$$ 388525 286647 442545 -156187 150938 210512 630962 289799 105834 -154454 -225400
10318b25400f360j1647A71294J25788C8303a53145D603J05000a71783C35429C5904
$$ -225400 -6360 -18007 171294 297082 38303 -153145 4603 109603 -171783 335429 35904
10306A53647J37408I660a1343I4378K08518b16805A45629J38395A01434J11395
$$ 153647 291055 9660 -11343 94378 302896 -216805 145629 284024 101434 212829
10296B12829N1914N8030j34173l8692m6132l6608a50268F4267R0216A3416O1072
$$ 212829 264743 322773 188600 149908 103776 67168 -150268 64267 154483 13416 74488
10285G4488A3330a05774E6325h8801j17558e4373B6381L1741h9003J7103A80347
$$ 74488 13330 -105774 56325 -88801 -206359 -54373 26381 58122 -89003 -71900 180347
10273B71599I9802j464g2672A05756e2675j53906i1570j37888A04162c779k25422
$$ 271599 99802 98338 -72672 105756 -52675 -206581 -91570 -229458 104162 -3779 -229201
10262b29201I2837J71085L2288b3310C08518c62745a56354J7663C0409a111A14730
$$ -229201 92837 263922 296210 -23310 308518 -362745 -156354 -138691 30409 -1111 114730
10250i527r4267a9855F5958a55408A11682R563K81726A85356l1355M8901P2544
$$ -9527 -103794 -19855 65958 -155408 111682 121245 402971 185356 154001 202902 275446
10239B75446G9437B9847M5931o91a69905j24688A00617J08876C3964c91818C10846
$$ 275446 79437 29847 75778 75087 -169905 -294593 100617 209493 33964 -391818 310846
10227C3879M1342N7887a89230c8212l3660j39973A91956f7382A79355b26782B35680
$$ 33879 75221 133108 -189230 -38212 -71872 -211845 191956 -67382 179355 -226782 235680
10215a51632K8865d9746j1760K6678A51495b1096l322j3325r5533A03902b40815
$$ -151632 -122767 -49746 -61506 -34828 151495 -21096 -24418 -37743 -133276 103902 -240815
10203B52976A04081g5547J4277l09029J68424a6913k74364G5260b24968A82038
$$ 252976 104081 -75547 -61270 -370299 -201875 -16913 -291277 75260 -224968 182038
10192a28739G3864B653b7782k07209I5510e7370j63434b3732J1376H4736c48222
$$ -128739 73864 2653 -27782 -234991 95510 -57370 -220804 -23732 -12356 84736 -348222
10180a58246B83020b97211f3854k58257f6405a3833o4797k15085e5430j59071
$$ -158246 283020 -297211 -63854 -322111 -66405 -13833 -78630 -293715 -55430 -214501
10170b14501B96117b50975J06630M2198D3430a01282L1414B04889a13516C7862
$$ -214501 296117 -250975 -144345 -102147 43430 -101282 -69868 204889 -113516 37862
10159a15532c2889l16471J30133A44140c73657J78984A11472B5763a74456g5412
$$ -115532 -32889 -349360 -219227 144140 -373657 -194673 111472 25763 -174456 -75412
10148C6378a92435j32140C22282a21041k25011a26699j14973H4578f2166k73433
$$ 36378 -192435 -324575 322282 -121041 -346052 -126699 -241672 84578 -62166 -335599
10138c35599k04098E6585a50405j86448I3435R3564F9697i5217m4372F2202a44867
$$ -335599 -539697 56585 -150405 -336853 93435 186999 69697 -95217 -139589 62202 -144867
10126i2172c8702l4183k09117A4836a2230q418n5787B24678g1048j29981E0342
$$ -92172 -38702 -72885 -282002 14836 -12230 -20648 -76435 224678 -71048 -201029 50342
10114c20882B04132g4284k31115F4096a31792A31031a72927d3924B8537J68497
$$ -320882 204132 -74284 -305399 64096 -131792 131031 -172927 -43924 28537 197034
10104A97034a91626B06940D2740g2274I1810C2213N03h5582A76754a37940a6641
$$ 197034 -191626 206940 42740 -72274 91810 32213 32716 -85582 176754 -137940 -16641
10092i0311J2495l09596a49114k45064d1457k47018C0686d6255B6354b43886j07322
$$ -90311 -77816 -387412 -149114 -394178 -41457 -288475 30686 -46255 26354 -243886 -351208
10081c51208h217I2900l8729a57413e6726H4836f2290Q70b2729B64331o0111n3545
$$ -351208 -8217 92900 54171 -157413 -56726 84836 -62290 -61420 -22729 264331 204220 150675
10069A50675J09138c164j2368r481G0022J10115a81665g8956j11821A75600P8044
$$ 150675 259813 -3164 -15532 -25013 70022 180137 -181665 -78956 -190777 175600 253644
10058B53644A12038g4067H1957J83123a37269q8363C66186B4074b0280B12967
$$ 253644 112038 -74067 81957 265080 -137269 -225632 366186 24074 -20280 212967
10047A90790i6939q697B74706G8592a42463A12624c65612m8593B00830d21970
$$ 190790 -96939 -105636 274706 78592 -142463 112624 -365612 -414205 200830 -421970
10036a86678R2995o1887N9565l58091a04616A82517A3302b13642d4088l989j91647
$$ -186678 -93683 -155570 -96005 -454096 -104616 182517 13302 -213642 -44088 -48077 -239724
10025b39724H4366f0322k4452J525B2935r907J7135c69444A01039P0478G8353
$$ -239724 84366 -60322 -84774 -83249 22935 13028 30163 -369444 101039 171517 78353
10013b51291M5235j2486E1445b12198B26511A4331K2656b81825P0624j5515e8773
$$ -251291 -206056 -218542 51445 -212198 226511 14331 36987 -281825 -211201 -226716 -58773
10001a49510h403H5026b07115Q5260C59248h5255j0982C8635C622Q3976b20443
$$ -149510 -8403 85026 -207115 -121855 359248 -85255 -96237 38635 3622 87598 -220443
9989c1928j9881p4153k67229j06833a18394A88726e6454A01322g7062B47409a18096
$$ -31928 -51809 -125962 -393191 -500024 -118394 188726 -56454 101322 -77062 247409 -118096
9977e6842m12592J41877A75631c5590G6005c1655B0843b15055i1750B87473b58195
$$ -56842 -469434 -327557 175631 -35590 76005 -31655 20843 -215055 -91750 287473 -258195
9965a41147A71499F6029b44629e4979j13720G5194B8142a09332r3789A46577j4424
$$ -141147 171499 66029 -244629 -54979 -168699 75194 28142 -109332 -203121 146577 132153
9954A32153PB2181f7567j12945N0446j13325J14240F9836a44615e7132j70520
$$ 132153 132160 22181 -67567 -180512 -130066 -243391 -129151 69836 -144615 -57132 -227652
9943b27652i5293F58021B84184a1007l0653D399J04962a82787J5379j15637J23822
$$ -227652 -95293 658021 284184 -11007 -41660 4399 109361 -182787 -167408 -283045 -159223
9932a59223b8883k223m8147B1036o45a42099D3259a8040j22954q0097B5572K20876
$$ -159223 -28883 -31106 -79253 21036 20391 -142099 43259 -18040 -140994 -221091 25572 246448
9920B46448a56166D29503a04251j17203j71533J3927L4863f5430F6233a63389
$$ 246448 -156166 429503 -104251 -221454 -392987 -379060 -344197 -65430 66233 -163389
9909d53756H4574a79216j06583h9493m84364e1782P013a7886j68779M1579B9043
$$ -453756 84574 -179216 -285799 -89493 -573857 -51782 -44769 -17886 -186665 -145086 29043
9897a28916r5752a00610c4265H4500M5274a66853k6209B42999l3271E7730c46053
$$ -128916 -224668 -100610 -34265 84500 129774 -166853 -193062 242999 209728 57730 -346053
9885c3210j00797m3499A77675G3887a7714n5921b8624j79603b4331m4313J0304
$$ -33210 -134007 -177506 177675 73887 -17714 -73635 -28624 -208227 -24331 -68644 -58340
9874e8340E0985a1423j05726B3280g528j4867F3983a54662j3931A31805b14905
$$ -58340 50985 -11423 -117149 23280 -7528 -22395 63983 -154662 -168593 131805 -214905
9862a9361F328a30107j73868L2667b5045j07098E329Q8010J33161D7407b37880
$$ -19361 6328 -130107 -303975 -271308 -25045 -132143 5329 93339 226500 47407 -237880
9850a88396L8003K9789r6378n9816q295a38733o9756R637k466C5026e1770j28453
$$ -188396 -150393 -120604 -216982 -276798 -285093 -138733 -208489 -198852 -201318 35026 -51770 -180223
9838a80223K3196m4754l3480j9981a1882l3287G8893b7399k02850k2371H4224
$$ -180223 -157027 -201781 -235261 -255242 -11882 -45169 78893 -27399 -230249 -252620 84224
9826c72769a07230j87128B2483c7264O657r5696B95657a04542E7186c62546B00814
$$ -372769 -107230 -294358 22483 -37264 -30607 -126303 295657 -104542 57186 -362546 200814
9814b11136f8348B63480C7436j8531b3879r3498j47671A39897m4869b66016j1907
$$ -211136 -68348 263480 37436 18905 -23879 -117377 -265048 139897 95028 -266016 -277923
9803b77923D3653b28652G6048A8582d6249o4401G416R6345d02894f7280j58549
$$ -277923 43653 -228652 76048 18582 -46249 -110650 7416 103761 -402894 -67280 -225829
9792b25829c5854O103G902h5297C6218a76166D4317a38289N1324l64550b05674
$$ -225829 -35854 -29751 7902 -85297 36218 -176166 44317 -138289 -86965 -451515 -205674
9780d039D3714O1008f4861I5675B5819a47173e9860A75367a52113m0788k89801
$$ -4039 43714 104722 -64861 95675 25819 -147173 -59860 175367 -152113 -192901 -482702
9769d82702A84Q6927K22024a05160J0837M3247B68892c48959M0682a20798I7802
$$ -482702 184 87111 309135 -105160 -94323 -51076 268892 -348959 -308277 -120798 97802
9757d15536J26075J06795M0647k0085A6950J98461a9911m9946N25j27745N2218
$$ -415536 -289461 -182666 -142019 -162104 16950 215411 -19911 -69857 -69332 -197077 -144859
9746a44859B07135a26395A27677b71359F888c2582H6067l0517L19067c41184R0871
$$ -144859 207135 -126395 127677 -271359 6888 -32582 86067 55550 374617 -341184 -250313
9735b50313B32466a72027C03892a11795F5724b01315J0418K8467A70094f7439
$$ -250313 232466 -172027 303892 -111795 65724 -201315 -190897 -162430 170094 -67439
9724c23489A3499e8077k9941j3564O785G1972l5310b47017b2924B33120A10320
$$ -323489 13499 -58077 -88018 -101582 -94797 71972 36662 -247017 -22924 233120 110320
9712b335A34319b10425A43013m5708P9408i1711I1630F487d4931G4195c15637
$$ -2335 134319 -210425 143013 97305 176713 -91711 91630 6487 -44931 74195 -315637
9700a82456e315l03431a19673m53515E24665G6830D244b51878A0442b30576A41849
$$ -182456 -5315 -308746 -119673 -573188 524665 76830 4244 -251878 10442 -230576 141849
9688a97446R2294f558j09100k37087A55129a81772m8374d6740l05270A01935c24856
$$ -197446 -105152 -6558 -115658 -352745 155129 -181772 -230146 -46740 -352010 101935 -324856
9676a90528f1890j07558Q1756a6259A713f117k36408m2255H6153b07380C5148
$$ -190528 -61890 -169448 -87692 -16259 1713 -6117 -242525 -284780 86153 -207380 35148
9664I4632R31c48217j52455G6497c65360E5385a61565g5886A79326a56266G8711
$$ 94632 95563 -348217 -500672 76497 -365360 55385 -161565 -75886 179326 -156266 78711
9652i2775N401o6096A7076a22898C98539H9210b10187Q1144M285L1360A67683
$$ -92775 -87374 -153470 17076 -122898 398539 89210 -210187 -129043 -124758 -93398 167683
9640A50226a09771k8637p1315B5662a16301A621c40003B33218H6498i4678D6087
$$ 150226 -109771 -138408 -209723 25662 -116301 1621 -340003 233218 86498 -94678 46087
9628c72601h2831F4722L1581a21596J8215j10029B306e19526b47488k41261Q6739
$$ -372601 -82831 64722 96303 -121596 -103381 -213410 2306 -519526 -247488 -488749 -402010
9617d02010E1278d28114a86047b8708j92341b1546G8478g7746E1074J22198a75789
$$ -402010 51278 -428114 -186047 -28708 -221049 -21546 78478 -77746 51074 173272 -175789
9605b20117i3876B76684a75323E8453b33888a03105B23119b42402J16195l81485
$$ -220117 -93876 276684 -175323 58453 -233888 -103105 223119 -242402 -126207 -507692
9595e07692b25220N2131C448a35781B19144F9331a7448m50340a36830O7836C4551
$$ -507692 -225220 -173089 3448 -135781 219144 69331 -17448 -467788 -136830 -68994 34551
9583A39808a96773a3089l18923J32707h4723D03673c84836D318J45045c78903
$$ 139808 -196773 -13089 -332012 -199305 -84723 403673 -384836 4318 149363 -378903
9572B7608a45094E3688b47116A63762b3242m7398A54493a36633j35889C7188a21439
$$ 27608 -145094 53688 -247116 163762 -23242 -70640 154493 -136633 -272522 37188 -121439
9560b07347d5502k03687n1269a40629A13571J09213a31626A30029b59189B02827
$$ -207347 -45502 -249189 -300458 -140629 113571 222784 -131626 130029 -259189 202827
9549c74872J87171m72b3702k6787G5908g3201J7738G8120c3100n44369b53097
$$ -374872 -187701 -188173 -23702 -50489 75908 -73201 -55463 78120 -33100 -577469 -253097
9537A27501a75563m740j92690a47762B68382b8103j09650k09363b9851m85351
$$ 127501 -175563 -180303 -372993 -147762 268382 -28103 -137753 -347116 -29851 -515202
9527e15202e2882k32454g7404q736j35171R0523d5034O903A00905a5489o2499
$$ -515202 -52882 -285336 -77404 -86140 -221311 -130788 -45034 -38131 100905 -15489 -77988
9516g7988K1405K4445j19875A16214i9070j64389D5677a21928G6936b04943A8432
$$ -77988 -56583 -32138 -152013 116214 -99070 -263459 45677 -121928 76936 -204943 18432
9504A77250b37329c8582C51179j42825b48805E7152c14396D4722b34184A16758
$$ 177250 -237329 -38582 351179 208354 -248805 57152 -314396 44722 -234184 116758
9493d47484e229A62332a74502D9192b21940E9375b50603C0423a24375j26180D0347
$$ -447484 -5229 162332 -174502 49192 -221940 59375 -250603 30423 -124375 -250555 40347
9481i6358J4218k05079A61346g3543B64941h011r4809r9129g9034C36039b41768
$$ -96358 -82140 -287219 161346 -73543 264941 -8011 -102820 -201949 -79034 336039 -241768
9469g9341C8792b12076m345d6635j85193A56140c3164J1048k90701k23956h2560
$$ -79341 38792 -212076 -216421 -46635 -231828 156140 -33164 -22116 -312817 -536773 -82560
9457E3982a20696A4860d32752a53326L3757M0963B42427a9569I463d761A30483
$$ 53982 -120696 14860 -432752 -153326 -119569 -78606 242427 -19569 9463 -4761 130483
9445A13512A8072c3603A4242b27700c2855A24873L6720R712b73379G0852K5432
$$ 113512 18072 -33603 14242 -227700 -32855 124873 161593 171305 -273379 70852 96284
9434I6284r73P352c60977h5201A50089a2865o5007K6852p6764p9357J7105n7931
$$ 96284 95311 102663 -360977 -85201 150089 -12865 -77872 -51020 -127784 -207141 -190036 -247967
9422b47967d8367I695a86462g7185K5419K5405A24914a85676R694b2135l59908
$$ -247967 -48367 9695 -186462 -77185 -51766 -26361 124914 -185676 -175982 -22135 -382043
9411c82043A61837B2422a25912A24143l8345f2289j42491m7029B36741c42681
$$ -382043 161837 22422 -125912 124143 85798 -62289 -204780 -251809 236741 -342681
9400c43901A63494j9002e8564j32895J5104l9253d2017d653j32570J2530c0852
$$ -343901 163494 144492 -58564 -191459 -176355 -215608 -42017 -4653 -137223 -124693 -30852
9388H3654g8826k4362m194q0150N4091J0514A08083a83446k0782C260e6026k35940
$$ 83654 -78826 -103188 -107382 -187532 -133441 -122927 108083 -183446 -204228 3260 -56026 -291966
9376b91966k47880C19434b02694J0343B0994c4248j4860G7792h8395k15058a20969
$$ -291966 -539846 319434 -202694 -192351 20994 -34248 -49108 77792 -88395 -303453 -120969
9364I300a06172B31120b13812a1942A81411h4085a7607j58926C6514P98b9005
$$ 9300 -106172 231120 -213812 -11942 181411 -84085 -17607 -176533 36514 37312 -29005
9352A14334n2759b30425g4787a8721A08286e82471A21649b97037J29607P8667
$$ 114334 61575 -230425 -74787 -18721 108286 -582471 121649 -297037 -167430 -88763
9342h8763B3883J12244Q8390j00455b14924j48064A06131e1465k1528q0597b7663
$$ -88763 23883 136127 224517 124062 -214924 -362988 106131 -51465 -72993 -153590 -27663
9330D48458d24233i334j00403I896J75477b83416d4495B18224a38472j4448C89150
$$ 448458 -424233 -9334 -109737 9896 185373 -283416 -44495 218224 -138472 -152920 389150
9318C2397a93470L3603B66489b5217k41464D6954a19203L073c4267A91218D6456
$$ 32397 -193470 -159867 266489 -25217 -266681 46954 -119203 -116130 -34267 191218 46456
9306a03044l8921A01295J41056C5413c3929j55961G4946b9254k86392N4526K4105
$$ -103044 -141965 101295 242351 35413 -33929 -189890 74946 -29254 -315646 -261120 -237015
9295b37015l1124B51253a94728N3560p9121C7848a16666j41216a01525d3592j4946
$$ -237015 -268139 251253 -194728 -141168 -220289 37848 -116666 -257882 -101525 -43592 -58538
9284e8538j19566L5157D8137i9900A08808b73423a14482k9534C06413c63206B02839
$$ -58538 -178104 -142947 48137 -99900 108808 -273423 -114482 -144016 306413 -363206 202839
9272i983A42638a31335k6381A10965a21834A98826B5734a39295E1347b48717J01816
$$ -9983 142638 -131335 -157716 110965 -121834 198826 25734 -139295 51347 -248717 -146901
9261a46901C76718A46657f6207K7449k7536m8936B00415c26881B35088A13641
$$ -146901 376718 146657 -66207 -38758 -66294 -115230 200415 -326881 235088 113641
9250a29671d5422I1378l3668J8134a79505L1849j78623J38544k23123D0127J05749
$$ -129671 -45422 91378 57710 75844 -179505 -147656 -326279 -187735 -410858 40127 145876
9239A45876a92129D2682L1558f9336A14541m6769b49528c4797m47303K26337D4410
$$ 145876 -192129 42682 74240 -69336 114541 67772 -249528 -34797 -482100 -255763 44410
9227b97653d3671J895C4095b08771R7932m97686a73900e4606A54050c6548E1398
$$ -297653 -43671 -41776 34095 -208771 -110839 -608525 -173900 -54606 154050 -36548 51398
9215e1841r3340A27087a58893g2874C14324A01517A2761a58120B0999a50382e4773
$$ -51841 -145181 127087 -158893 -72874 314324 101517 12761 -158120 20999 -150382 -54773
9203C9618d71620a48584B7657K6756j315a98994A19602a76389e122I3185a00436
$$ 39618 -471620 -148584 27657 54413 53098 -198994 119602 -176389 -5122 93185 -100436
9191i4337A09711f4112j46334J03291A54034a60000B70535i0008C88449A7046
$$ -94337 109711 -64112 -210446 -107155 154034 -160000 270535 -90008 388449 17046
9180A4900a72103a9054A83684h568E2921M0500b67886A52372e9175j30978C48287
$$ 14900 -172103 -19054 183684 -8568 52921 93421 -267886 152372 -59175 -190153 348287
9168i9044G9700a21341M0764l66419G5326b8655k47141L6050a02978L9392r096
$$ -99044 79700 -121341 -80577 -446996 75326 -28655 -275796 -239746 -102978 -63586 -72682
9157g2682F9296a41785E6818j4371L02093H0949a05150n9810E3521a62111c4247
$$ -72682 69296 -141785 56818 42447 344540 80949 -105150 -164960 53521 -162111 -34247
9145b8207k83424A34228a1090j21006j21299a12801m9675c9846I9492J72596a87449
$$ -28207 -311631 134228 -11090 -132096 -253395 -112801 -162476 -39846 99492 272088 -187449
9133H7776c8646n1309B9964M1940a78635k22478G7656g9621K9104R082p1240K1478
$$ 87776 -38646 -89955 29964 71904 -178635 -401113 77656 -79621 -50517 -41435 -112675 -91197
9121i1197D05886E4431a62570j64389h0837c7345A83909m9984h9842c0710j59225
$$ -91197 405886 54431 -162570 -326959 -80837 -37345 183909 133925 -89842 -30710 -189935
9110a89935g5903p9916i912n9705p1692A51361D207J53447E999b26320A5714b60072
$$ -189935 -75903 -155819 -9912 -69617 -141309 151361 4207 157654 5999 -226320 15714 -260072
9097g7269A58184d0430k77703A27847K015i1807B3368c25455F4292f515j20246
$$ -77269 158184 -40430 -318133 127847 129862 -91807 23368 -325455 64292 -6515 -126761
9086a26761A21000J07625f2230A14229l8803j6485J56926b28935d3471B4905a12164
$$ -126761 121000 228625 -62230 114229 75426 58941 215867 -228935 -43471 24905 -112164
9074a11251a5452j45659A04316J22199b7195l60096c5947p8313C2994b30999e9462
$$ -111251 -15452 -161111 104316 226515 -27195 -387291 -35947 -114260 32994 -230999 -59462
9062I6551f0141k24556Q9083e1394l786r4959A8852P0201a61419j72767E4595
$$ 96551 -60141 -284697 -195614 -51394 -55180 -150139 18852 89053 -161419 -334186 54595
9050A46545a1811E7357b41426h8417J2280l7638l76265A13783R0371A1449a59934
$$ 146545 -11811 57357 -241426 -88417 -76137 -113775 -490040 113783 204154 11449 -159934
9038B81000C1230a5356j05980A3290d2703r4712j4558k6276A4206b00496g5367
$$ 281000 31230 -15356 -121336 13290 -42703 -137415 -151973 -178249 14206 -200496 -75367
9026g4254j43164G7212f9166H2440a30564e1746e426j76927f3137C63422b60305
$$ -74254 -217418 77212 -69166 82440 -130564 -51746 -5426 -182353 -63137 363422 -260305
9014c29186i0896Q496L7090B74534g9722A38254F2822L00805c1546n5956L5018
$$ -329186 -90896 -82400 -45310 274534 -79722 138254 62822 363627 -31546 -87502 -52484
9003e2484k56610m4543e2947D5112b1291D3130b52995D889d34200a71530k9829
$$ -52484 -309094 -353637 -52947 45112 -21291 43130 -252995 4889 -434200 -171530 -201359
8992b01359o2878i9148j69729a7683k2486j10607C0627k338a92935D04241A07873
$$ -201359 -264237 -99148 -268877 -17683 -40169 -150776 30627 28289 -192935 404241 107873
8980b70719a33202c717k30387i8271D45955a27397A68442a58094e5135m0541m4755
$$ -270719 -133202 -3717 -234104 -98271 445955 -127397 168442 -158094 -55135 -95676 -140431
8969a40431m2093j92031f5077k95190a34923j82506R54R2350O5445k0314Q0332
$$ -140431 -182524 -374555 -65077 -360267 -134923 -317429 -316475 -224125 -158680 -178994 -98662
8958i8662q8861B5465h6260C7274b25844K5642d1786j52585j00278E1246h8638
$$ -98662 -187523 25465 -86260 37274 -225844 -200202 -41786 -194371 -294649 51246 -88638
8946b98583k2443A74267a85643G2240f0928k91752i1725j12416j9336A3479R0744
$$ -298583 -321026 174267 -185643 72240 -60928 -352680 -91725 -204141 -223477 13479 104223
8935A04223Q2636e90438B7493a65648B3920h0902A90834H5122i6161F5631R573
$$ 104223 186859 -590438 27493 -165648 23920 -80902 190834 85122 -96161 65631 75204
8924G5204L3093i2406A92764p0927L38116e4761E89426k78016I6571P7478L36740
$$ 75204 108297 -92406 192764 121837 459953 -54761 589426 311410 96571 174049 510789
8913E10789k09372m711M36150L13259L31381O60686J741032L392910K317409m238776
$$ 510789 301417 296706 732856 1046115 1377496 2038182 3779214 7172124 9489533 5250757
8903E250757B186838n08085o51865C91224K29414A00424a08085C33272p0446q1490
$$ 5250757 2186838 1678753 1026888 391224 620638 100424 -108085 333272 262826 181336
8893A81336a9569E5938K44512A00479g9214K938C68478a66427I5659J28497n4370
$$ 181336 -19569 55938 300450 100479 -79214 -76276 368478 -166427 95659 224156 169786
8882A69786e2792k6417l20922G5862k2713b73852H0833b7063F4020M2947a71697
$$ 169786 -52792 -79209 -400131 75862 53149 -273852 80833 -27063 64020 106967 -171697
8870a11997J3211B76946i372k5067A47641C6255a69847O1755j03066i0735j50064
$$ -111997 -98786 276946 -9372 -34439 147641 36255 -169847 -108092 -211158 -90735 -240799
8859b40799A91319q2437b88678F5787A4920c9987j26105P3819j2300a4635l94768
$$ -240799 191319 108882 -288678 65787 14920 -39987 -166092 -92273 -104573 -14635 -409403
$$ [...]
##END NTUPLES=NMR SPECTRUM
##END=
