
##TITLE=UV1011_M1-1003-1002_6268800_U044sgamfu
##JCAMPDX= 6.0         $$ Bruker NMR JCAMP-DX V2.0
##DATA TYPE= NMR SPECTRUM
##DATA CLASS= NTUPLES
##ORIGIN= BRUKER
##OWNER= Administrator
$$ 1.72 TOPSPIN		Version 2.1
$$ 2012-06-02 04:45:27.125 -0500  Administrator@TOPSPIN
$$ Compression mode = diff/dup
##.OBSERVE FREQUENCY= 400.13188235
##.OBSERVE NUCLEUS= ^1H
##.ACQUISITION MODE= SIMULTANEOUS (DQD)
##.ACQUISITION SCHEME= undefined
##.AVERAGES= 64
##.DIGITISER RES= 22
##SPECTROMETER/DATA SYSTEM= spect
##.PULSE SEQUENCE= noesygpps1d.comp
##.SOLVENT NAME= COFFEE_calctemp
##.SHIFT REFERENCE= INTERNAL, COFFEE_calctemp, 1, 14.96703
##AUDIT TRAIL= $$ (NUMBER, WHEN, WHO, WHERE, PROCESS, VERSION, WHAT)
$$ ##TITLE= Audit trail, TOPSPIN		Version 2.1
$$ ##JCAMPDX= 5.01
$$ ##ORIGIN= Bruker BioSpin GmbH
$$ ##OWNER= Administrator
$$ $$ C:\Bruker\TOPSPIN/data/COFFEE/nmr/UV1011_M1-1003-1002_6268800_U044sgamfu/12/pdata/1/auditp.txt
$$ ##AUDIT TRAIL=  $$ (NUMBER, WHEN, WHO, WHERE, PROCESS, VERSION, WHAT)
(   1,<2012-06-02 04:45:21.921 -0500>,<Administrator>,<TOPSPIN>,<go>,<TOPSPIN 2.1>,
      <created by zg
	started at 2012-06-02 04:33:51.734 -0500,
	POWCHK enabled, PULCHK disabled,
       configuration hash MD5:
       D5 CA 7A 23 FE 6B EE E2 50 67 74 61 24 F7 5E 3B
       data hash MD5: 64K
       EB 4B 45 29 47 E1 A7 4E C0 4A CC DD 69 C9 F9 E7>)
(   2,<2012-06-02 04:45:24.843 -0500>,<Administrator>,<TOPSPIN>,<proc1d>,<TOPSPIN 2.1>,
      <Start of raw data processing
       efp LB = 0.3 FT_mod = 6 PKNL = 1 PHC0 = 0 PHC1 = 0 SI = 128K 
       data hash MD5: 128K
       3D 8C 36 22 A9 EB 05 8C 44 5D 9C 53 7B 2F DE 15>)
(   3,<2012-06-02 04:45:26.062 -0500>,<Administrator>,<TOPSPIN>,<proc1d>,<TOPSPIN 2.1>,
      <pk PHC0 = 33.16223 PHC1 = 0 
       data hash MD5: 128K
       66 F0 21 43 7F 7E A1 BE 65 06 3C 70 07 44 D2 B5>)
(   4,<2012-06-02 04:45:26.750 -0500>,<Administrator>,<TOPSPIN>,<proc1d>,<TOPSPIN 2.1>,
      <abs ABSG = 1 
       data hash MD5: 128K
       6D 47 86 7D FE E6 47 B8 56 2C 1C CF 8D D2 D7 C5>)
(   5,<2012-06-02 04:45:26.843 -0500>,<Administrator>,<TOPSPIN>,<proc1d>,<TOPSPIN 2.1>,
      <abs ABSG = 2 
       data hash MD5: 128K
       5E 0A 64 BD 7E 9D 33 97 CB 5D 24 2D E6 67 35 2D>)
(   6,<2012-06-02 04:45:26.921 -0500>,<Administrator>,<TOPSPIN>,<proc1d>,<TOPSPIN 2.1>,
      <abs ABSG = 3 
       data hash MD5: 128K
       7B 80 11 DA 2D 87 A1 8D 13 C5 9E 54 E9 16 27 54>)
(   7,<2012-06-02 04:45:26.968 -0500>,<Administrator>,<TOPSPIN>,<proc1d>,<TOPSPIN 2.1>,
      <abs ABSG = 4 
       data hash MD5: 128K
       71 D7 21 55 E0 F4 D1 00 44 78 AD 80 05 18 7E D4>)
(   8,<2012-06-02 04:45:27.031 -0500>,<Administrator>,<TOPSPIN>,<proc1d>,<TOPSPIN 2.1>,
      <abs ABSG = 5 
       data hash MD5: 128K
       6D 03 2F 33 40 31 3D 3F 47 E8 79 64 1B 1B A2 8F>)
$$ ##END=
$$ 
$$ $$ hash MD5
$$ $$ 58 72 16 A0 79 02 34 31 7E 53 5B 2A FF FF 1B 49
##$RELAX= 
##$RELAX= 
##$RELAX= 
##$RELAX= 
##$RELAX= 
##$RELAX= 
##$RELAX= 
##$RELAX= 
$$ [...]
##$TP07= 0
##$TPNAME0= <>
##$TPNAME1= <>
##$TPNAME2= <>
##$TPNAME3= <>
##$TPNAME4= <>
##$TPNAME5= <>
##$TPNAME6= <>
##$TPNAME7= <>
##$TPOAL= (0..7)
0.5 0.5 0.5 0.5 0.5 0.5 0.5 0.5
##$TPOFFS= (0..7)
0 0 0 0 0 0 0 0
##$TUNHIN= 0
##$TUNHOUT= 0
##$TUNXOUT= 0
##$USERA1= <user>
##$USERA2= <user>
##$USERA3= <user>
##$USERA4= <user>
##$USERA5= <user>
##$V9= 5
##$VALIST= <valist>
##$VCLIST= <CCCCCCCCCCCCCCC>
##$VD= 0
##$VDLIST= <DDDDDDDDDDDDDDD>
##$VPLIST= <PPPPPPPPPPPPPPP>
##$VTLIST= <TTTTTTTTTTTTTTT>
##$WBST= 2048
##$WBSW= 25
##$XGAIN= (0..3)
0 0 0 0
##$XL= 0
##$YL= 0
##$YMAX_a= 12209384
##$YMIN_a= -6426116
##$ZGOPTNS= <>
##$ZL1= 120
##$ZL2= 120
##$ZL3= 120
##$ZL4= 120
##$ABSF1= 14.96703
##$ABSF2= -5.585501
##$ABSG= 5
##$ABSL= 3
##$ALPHA= 0
##$AQORDER= 0
##$ASSFAC= 0
##$ASSFACI= 0
##$ASSFACX= 0
##$ASSWID= 0
##$AUNMP= <proc_prof1d_extract.lims>
##$AXLEFT= 0
##$AXNAME= <>
##$AXNUC= <1H>
##$AXRIGHT= 0
##$AXTYPE= 0
##$AXUNIT= <>
##$AZFE= 0.1
##$AZFW= 0.1
##$BCFW= 0
##$BC_mod= 0
##$BYTORDP= 0
##$COROFFS= 0
##$CY= 15
##$DATMOD= 1
##$DC= 0
##$DFILT= <>
##$DTYPP= 0
##$F1P= 0
##$F2P= 0
##$FCOR= 0.5
##$FTSIZE= 131072
##$FT_mod= 6
##$GAMMA= 0
##$GB= 0
##$INTBC= 1
##$INTSCL= 1
##$ISEN= 128
##$LB= 0.3
##$LEV0= 0
##$LPBIN= 0
##$MAXI= 10000
##$MC2= 0
##$MEAN= 0
##$ME_mod= 0
##$MI= 0
##$NCOEF= 0
##$NC_proc= -3
##$NLEV= 6
##$NOISF1= 0
##$NOISF2= 0
##$NSP= 0
##$NTH_PI= 0
##$NZP= 0
##$OFFSET= 14.96703
##$PC= 1
##$PHC0= 33.16223
##$PHC1= 0
##$PH_mod= 1
##$PKNL= yes
##$PPARMOD= 0
##$PPDIAG= 0
##$PPIPTYP= 0
##$PPMPNUM= 2147483647
##$PPRESOL= 1
##$PSCAL= 4
##$PSIGN= 0
##$PYNMP= <proc.py>
##$REVERSE= no
##$SF= 400.130005436103
##$SI= 131072
##$SIGF1= 0
##$SIGF2= 0
##$SINO= 400
##$SIOLD= 131072
##$SPECTYP= <>
##$SREGLST= <1H.CDCl3>
##$SSB= 0
##$STSI= 131072
##$STSR= 0
##$SW_p= 8223.68421052632
##$SYMM= 0
##$S_DEV= 0
##$TDeff= 65536
##$TDoff= 0
##$TI= <>
##$TILT= no
##$TM1= 0
##$TM2= 0
##$TOPLEV= 0
##$USERP1= <user>
##$USERP2= <user>
##$USERP3= <user>
##$USERP4= <user>
##$USERP5= <user>
##$WDW= 1
##$XDIM= 131072
##$YMAX_p= 469801347
##$YMIN_p= -51276341
##$CURPLOT= <Network HP LaserJet P1505>
##$CURPRIN= <$Network HP LaserJet P1505>
##$DFORMAT= <normdp>
##$LAYOUT= <+/1D_H.xwp>
##$LFORMAT= <normlp>
##$PFORMAT= <normpl>
##$SURQMSG= 1
$$ End of Bruker specific parameters
$$ ---------------------------------
##NTUPLES= NMR SPECTRUM
##VAR_NAME=  FREQUENCY,     SPECTRUM/REAL,   SPECTRUM/IMAG
##SYMBOL=    X,             R,               I
##VAR_TYPE=  INDEPENDENT,   DEPENDENT,       DEPENDENT
##VAR_FORM=  AFFN,          ASDF,            ASDF
##VAR_DIM=   131072,        131072,          131072
##UNITS=     HZ,            ARBITRARY UNITS, ARBITRARY UNITS
##FACTOR=    0.0627417313425165, 1,          1
##FIRST=     8223.62146879498, 4970,         -111247
##LAST=      0,             8129,            -111245
##MIN=       0,             -51276341,       0
##MAX=       8223.62146879498, 469801347,    0
$$ Real data points
##PAGE= N=1
##DATA TABLE= (X++(R..R)), XYDATA
$$ [...]
63516I90960p707n065k579M05L718O537Q627J0383J1834J2666J3184J4155J5553
$$ 990960 983253 978188 975609 976014 979732 986269 994896 1005279 1017113 1029779 1042963 1057118 1072671
63503A072671J6400J6230J5902J6589J8636K1620K4862K7530K8994K9722L1353
$$ 1072671 1089071 1105301 1121203 1137792 1156428 1178048 1202910 1230440 1259434 1289156 1320509
63492A320509L5234M0811M5718M7519M5507M1094L6241L1201K4248J4284L179
$$ 1320509 1355743 1396554 1442272 1489791 1535298 1576392 1612633 1643834 1668082 1682366 1685545
63481A685545n747j1336j5165j8375j9932j8965j7080j6593j7598j8589j9348
$$ 1685545 1679798 1668462 1653297 1634922 1614990 1596025 1578945 1562352 1544754 1526165 1506817
63470A506817k1296k5097k9715l3994l7692m0664m2342m2489m1350l8937l5355
$$ 1506817 1485521 1460424 1430709 1396715 1359023 1318359 1276017 1233528 1192178 1153241 1117886
63459A117886l1988l0702l1218l0843k7868k3926k1788k1845k2183k1290j9201
$$ 1117886 1085898 1055196 1023978 993135 965267 941341 919553 897708 875525 854235 835034
63448H35034j6369j2980r387o142l597k196k678m908o953o776m756l188l265m027
$$ 835034 818665 805685 796298 790156 786559 784363 781685 776777 769824 763048 758292 755104 751839 747812
63434G47812m404m595m782m197k511q86m05m05L69J710K460K515K851L764M487
$$ 747812 743408 738813 734031 729834 727323 726437 726032 725627 725996 727706 730166 732681 735532 739296 743783
63419G43783M628M563M192K626k79l066m154l507k224j073k34J7o91k046l009
$$ 743783 748411 752974 757166 759792 759513 756447 752293 748786 746562 745489 745255 745272 744581 742535 739526
63404G39526k833j812q04k98r0K39Q78J888L546O109R170J1590J2466J2090J1659
$$ 739526 736693 734881 734077 733779 733689 733928 734806 736694 740240 746349 755519 767109 779575 791665 803324
63389H03324J2153J3732J5919J7964J9158J9472J9856K1348K3827K6342K8596
$$ 803324 815477 829209 845128 863092 882250 901722 921578 942926 966753 993095 1021691
63378A021691L1151L3917L5572L5320L4219L3582L2732K9966K5654K2670K3035
$$ 1021691 1052842 1086759 1122331 1157651 1191870 1225452 1258184 1288150 1313804 1336474 1359509
63367A359509K5472K7322K8022K9410L2859L7492M1448M3852M4836M4360M1925
$$ 1359509 1384981 1412303 1440325 1469735 1502594 1540086 1581534 1625386 1670222 1714582 1756507
63356A756507L7426L1629K5473J9162J2173M175m214j1558j6539j8778j8919j8144
$$ 1756507 1793933 1825562 1851035 1870197 1882370 1886545 1882331 1870773 1854234 1835456 1816537 1798393
63344A798393j7802j9204k3041k8533l3582l6467l7439l8118l9390m0611m0967
$$ 1798393 1780591 1761387 1738346 1709813 1676231 1639764 1602325 1564207 1524817 1484206 1443239
63333A443239m0704m0242l8913l5735l1195k7123k4520k2569k0118j7149j4145
$$ 1443239 1402535 1362293 1323380 1287645 1256450 1229327 1204807 1182238 1162120 1144971 1130826
63322A130826j0888o896k567J176M239P409J0992J4309J6824J8909K1053K3048
$$ 1130826 1119938 1113042 1110475 1111651 1115890 1123299 1134291 1148600 1165424 1184333 1205386 1228434
63310A228434K4473K5503K6539K7412K7778K8159K9618L2266L4836L6320L7417
$$ 1228434 1252907 1278410 1304949 1332361 1360139 1388298 1417916 1450182 1485018 1521338 1558755
63299A558755L9466M2165M3237M0708L4948K8050K1510J5213Q509J592m591r338
$$ 1558755 1598221 1640386 1683623 1724331 1759279 1787329 1808839 1824052 1832561 1834153 1829562 1820224
63287A820224j2690j5013j6652j8026j9717k2096k4976k7916l0844l4116l7821
$$ 1820224 1807534 1792521 1775869 1757843 1738126 1716030 1691054 1663138 1632294 1598178 1560357
63276A560357m1313m3698m4622m4243m2598l9638l5948l2748l0486k7919k3380
$$ 1560357 1519044 1475346 1430724 1386481 1343883 1304245 1268297 1235549 1205063 1177144 1153764
63265A153764j7038j1261q522r302j2062j4785j6314j6803j7319j8770k0776k1817
$$ 1153764 1136726 1125465 1116943 1107641 1095579 1080794 1064480 1047677 1030358 1011588 990812 968995
63253I68995k0761j8152j5563j3875j2583j0906r044p944p898p903o769m725l270
$$ 968995 948234 930082 914519 900644 888061 877155 868111 860167 852269 844366 837597 832872 829602
63240H29602l267l844l873l920n598q920j1645j1851j0110q346p322o434n384
$$ 829602 826335 822491 818618 814698 809100 800180 788535 776684 766574 758228 750906 744472 739088
63227G39088m683m521m356l925l700l916m014l507k772k374k232j941j524j175
$$ 739088 734405 729884 725528 721603 717903 713987 709973 706466 703694 701320 699088 697147 695623 694448
63213F94448o61L34J445J975J928K022K700L732M880O188P322P450O407N456N971
$$ 694448 693787 694121 695566 697541 699469 701491 704191 707923 712803 718991 726313 733763 740170 745626 751597
63198G51597P679R038R343R529J0578J2103J3063J3261J3347J3756J4469J5593
$$ 751597 759276 768314 777657 787186 797764 809867 822930 836191 849538 863294 877763 893356
63186H93356J7310J9324K1122K2871K5237K8121L0462L1677L2633L4605L7760
$$ 893356 910666 929990 951112 973983 999220 1027341 1057803 1089480 1122113 1156718 1194478
63175A194478M1150M3705M4686M3782M1652M0117M0850M3572M6151M6689M5145
$$ 1194478 1235628 1279333 1324019 1367801 1409453 1449570 1490420 1533992 1580143 1626832 1671977
63164A671977M2793M0634L8707L6716L4801L3493L2950L2526L1271K8790K5353
$$ 1671977 1714770 1755404 1794111 1830827 1865628 1899121 1932071 1964597 1995868 2024658 2050011
63153B050011K1225J6234J0185L338l790j0800j7429k3410k8665l3345l7472m0708
$$ 2050011 2071236 2087470 2097655 2100993 2097203 2086403 2068974 2045564 2016899 1983554 1946082 1905374
63141A905374m2726m3511m3060m1109l7594l3146k8805k5218k2344j9741j6933
$$ 1905374 1862648 1819137 1776077 1734968 1697374 1664228 1635423 1610205 1587861 1568120 1551187
63130A551187j3711j0165o418k338K031N952Q637J0486J2698J5381J7063J6796
$$ 1551187 1537476 1527311 1520893 1518555 1520586 1526538 1535175 1545661 1558359 1573740 1590803 1607599
63118A607599J5767J5804J7015J7987J7826J6832J5487J3975J2526J1269R668
$$ 1607599 1623366 1639170 1656185 1674172 1691998 1708830 1724317 1738292 1750818 1762087 1771755
63107A771755P079L642m8m019q652j3697j8574k3384k8457l3070l6004l7327l8238
$$ 1771755 1778834 1782476 1782428 1778409 1769757 1756060 1737486 1714102 1685645 1652575 1616571 1579244 1541006
63094A541006l8991l8538l6506l3979l1719k9119k5749k2624k0775j9620j7940
$$ 1541006 1502015 1463477 1426971 1392992 1361273 1332154 1306405 1283781 1263006 1243386 1225446
63083A225446j5724j3873j2570j1084r081p189o070n499m435k038J265L929M967
$$ 1225446 1209722 1195849 1183279 1172195 1163114 1155925 1149855 1144356 1139921 1137883 1139148 1143077 1148044
63070A148044N233O163P561P963P231P139Q726J0594J0873R718Q612Q187P910
$$ 1148044 1153277 1159440 1167001 1174964 1182195 1189334 1198060 1208654 1219527 1229245 1237857 1246044 1253954
63057A253954P210N811L565J001o02n82K64J037J949L183L565J973p28k673l315
$$ 1253954 1261164 1266975 1270540 1271541 1270939 1270357 1270621 1271658 1273607 1276790 1280355 1282328 1281600 1278927 1275612
63042A275612l263k486o03J431K031J381J221K044K566K401L115N608Q247Q992
$$ 1275612 1272349 1269863 1269260 1270691 1272722 1274103 1275324 1277368 1279934 1282335 1285450 1291058 1299305 1308297
63028A308297Q096P322P509Q272R308J0499J1184J0755R973J0497J2874J5863
$$ 1308297 1316393 1323715 1331224 1339496 1348804 1359303 1370487 1381242 1391215 1401712 1414586 1430449
63016A430449J7972J8966J9535K0082K0476K0885K2246K5358K9620L3255L5252
$$ 1430449 1448421 1467387 1486922 1507004 1527480 1548365 1570611 1595969 1625589 1658844 1694096
63005A694096L6667L9308M3408M7477N0573N3640N7988O3263O7863P1077P3878
$$ 1694096 1730763 1770071 1813479 1860956 1911529 1965169 2023157 2086420 2154283 2225360 2299238
62994B299238P7476Q1786Q5730Q8714R1197R3808R6297R7828R8114R7654R6751
$$ 2299238 2376714 2458500 2544230 2632944 2724141 2817949 2914246 3012074 3110188 3207842 3304593
62983C304593R5010R2243Q9224Q6801Q4719Q2198P9334P6774P4041O9452O2141
$$ 3304593 3399603 3491846 3581070 3667871 3752590 3834788 3914122 3990896 4064937 4134389 4196530
62972D196530N3083M3448L2848K0090N177j0434k5359l9288n2504o5183p7271
$$ 4196530 4249613 4293061 4325909 4345999 4351176 4340742 4315383 4276095 4223591 4158408 4081137
62961D081137q8494r8187j05381j09360j10007j07623j02719r6146q9160q2715
$$ 4081137 3992643 3894456 3789075 3679715 3569708 3462085 3359366 3263220 3174060 3091345
62951C091345p6450o8799n8580m6510l4777k5164j7920j2310p507k797K355P831
$$ 3091345 3014895 2946096 2887516 2841006 2806229 2781065 2763145 2750835 2743328 2740531 2742886 2750717
62939B750717J2983J7544K1776K5299K6781K5815K4285K4438K5977K6531K4840
$$ 2750717 2763700 2781244 2803020 2828319 2855100 2880915 2905200 2929638 2955615 2982146 3006986
62928C006986K1921J8904J5314J0204L642l768j1815k0250k8268l5323m1876m8503
$$ 3006986 3028907 3047811 3063125 3073329 3076971 3073203 3061388 3041138 3012870 2977547 2935671 2887168
62916B887168n4850o0369o5384p0420p4724p6673p5672p2912p0101o8057o6573
$$ 2887168 2832318 2771949 2706565 2636145 2561421 2484748 2409076 2336164 2266063 2198006 2131433
62905B131433o4925o2331n8481n4031n0249m7894m6507m5023m2972m0832l9148
$$ 2131433 2066508 2004177 1945696 1891665 1841416 1793522 1747015 1701992 1659020 1618188 1579040
62894A579040l7634l5610l3165l1194k9950k8426k5926k3569k2935k3523k3060
$$ 1579040 1541406 1505796 1472631 1441437 1411487 1383061 1357135 1333566 1310631 1287108 1264048
62883A264048k0642j8095j7426j8128j8104j6393j3867j1643r986q650p426o304
$$ 1264048 1243406 1225311 1207885 1189757 1171653 1155260 1141393 1129750 1119764 1111114 1103688 1097384
62871A097384n587n679o295o302m979l104k138k587l800n057o093o726o777o368
$$ 1097384 1091797 1086118 1079823 1073521 1068542 1065438 1063300 1060713 1056913 1051856 1045763 1039037 1032260 1025892
62857A025892n795n250n044n682o945p389n824l141j598k176l652m419m187l542
$$ 1025892 1020097 1014847 1009803 1004121 997176 989787 983963 980822 979224 977048 973396 968977 964790 961248
62843I61248k871k346k223k387k092q45P54J602J295L64l45k13R03K364K922J798
$$ 961248 958377 956031 953808 951421 949329 948484 949238 950840 952135 952499 952154 951941 952844 955208 958130 959928
62827I59928l98k118k285j071M52J166O32n50j171o70J39M5j010j965k282k577
$$ 959928 959530 957412 955127 954056 954508 955674 956306 955756 954585 953915 954054 954099 953089 951124 948842 946265
62811I46265l190l055j151J375J909l84l211l778j922K86J393J734J938J813J169
$$ 946265 943075 940020 938869 940244 942153 941769 938558 934780 932858 933144 934537 936271 938209 940022 941191
62796I41191P13J147J997K113J159l3n72n06o09j405k504k981k487j731j506j495
$$ 941191 941904 943051 945048 947161 948320 948287 947715 947209 946600 945195 942691 939710 937223 935492 933986 932491
62780I32491p70O43J677J847J867K168J960O92n71m54P62J787K403L458M990N989
$$ 932491 931721 932364 934041 935888 937755 939923 941883 942575 942004 941550 942312 944099 946502 949960 954950 960939
62764I60939O113O218O735O988O576O228O534P051P495Q626J0923J3364J4769
$$ 960939 967052 973270 980005 986993 993569 999797 1006331 1013382 1020877 1029503 1040426 1053790 1068559
62751A068559J5665J7280J9248J9891J8805J7583J7600J8397J8964J9552K1294
$$ 1068559 1084224 1101504 1120752 1140643 1159448 1177031 1194631 1213028 1231992 1251544 1272838
62740A272838K4471K8049L0807L2526L4162L7008M1477M6545N0810N4143N7790
$$ 1272838 1297309 1325358 1356165 1388691 1422853 1459861 1501338 1547883 1598693 1652836 1710626
62729A710626O2651O8215P3672P9263Q5767R3091J00382J07290J14124J20813
$$ 1710626 1773277 1841492 1915164 1994427 2080194 2173285 2273667 2380957 2495081 2615894
62719B615894J26624J31033J33974J35096J33691J29785J24398J17986J09401
$$ 2615894 2742518 2873551 3007525 3142621 3276312 3406097 3530495 3648481 3757882
62710C757882R7133Q1102O2415M1850J9606l499k5725m5768o3785q0585r6099
$$ 3757882 3855015 3936117 3998532 4040382 4059988 4056489 4030764 3984996 3921211 3840626 3744527
62699C744527j09207j19037j26048j31417j35424j37023j35396j31491j27153
$$ 3744527 3635320 3516283 3390235 3258818 3123394 2986371 2850975 2719484 2592331
62690B592331j22903j17642j10741j03190r6071q9062q1457p3781o7095o1386
$$ 2592331 2469428 2351786 2241045 2137855 2041784 1952722 1871265 1797484 1730389 1669003
62680A669003n5942n0842m6687m3156l9324l5247l1725k8544k4681k0360j7156
$$ 1669003 1613061 1562219 1515532 1472376 1433052 1397805 1366080 1337536 1312855 1292495 1275339
62669A275339j5499j3765j0716p304m961l449j678L44J748K385L065M577P255
$$ 1275339 1259840 1246075 1235359 1228055 1223094 1219645 1217967 1218311 1220059 1222444 1225509 1230086 1237341
62656A237341J0995J4970J8020J9977K1975K4756K7599K9721L1765L4822L8847
$$ 1237341 1248336 1263306 1281326 1301303 1323278 1348034 1375633 1405354 1437119 1471941 1510788
62645A510788M3194M7839N2783N7092O0061O2704O6434P0737P3812P5275P6388
$$ 1510788 1553982 1601821 1654604 1711696 1771757 1834461 1900895 1971632 2045444 2120719 2197107
62634B197107P7603P7677P5483P1127O4856N6334M5646L3734K1247P986n970j9639
$$ 2197107 2274710 2352387 2427870 2498997 2563853 2620187 2665833 2699567 2720814 2728800 2722830 2703191
62622B703191l2176m3587n3935o2719o9643p5158p9771q3425q5910q6976q5833
$$ 2703191 2671015 2627428 2573493 2510774 2441131 2365973 2286202 2202777 2116867 2029891 1944058
62611A944058q1696p5506o9950o6835o5094o2352n7851n2847m8553m4814m0837
$$ 1944058 1862362 1786856 1716906 1650071 1584977 1522625 1464774 1411927 1363374 1318560 1277723
62600A277723l6501l2535k9746k8143k6839k4850k2060j9228j7171j6191j6096
$$ 1277723 1241222 1208687 1178941 1150798 1123959 1099109 1077049 1057821 1040650 1024459 1008363
62589A008363j6279j5859j4346j2210j0248q524o607m708l620l382l031k072j264
$$ 1008363 992084 976225 961879 949669 939421 930897 924290 919582 915962 912580 909549 907477 906213
62576I06213j417k125k398j968j268n66K36J102J666J671J441J841L471N721P074
$$ 906213 904796 902671 900273 898305 897037 896471 896707 897809 899475 901146 902587 904428 907899 913620 920694
62561I20694O884O338O869Q158Q879R001R788J1541J3045J3635J4139J5158J6066
$$ 920694 927578 933916 940785 948943 957822 966823 976611 988152 1001197 1014832 1028971 1044129 1060195
62548A060195J6609J7954K0888K4263K6642K8523L1484L5893M0864M5842N0797
$$ 1060195 1076804 1094758 1115646 1139909 1166551 1195074 1226558 1262451 1303315 1349157 1399954
62537A399954N5199N8202N9775O0662O1397O2125O3005O3742O3067N9653N3369
$$ 1399954 1455153 1513355 1573130 1633792 1695189 1757314 1820319 1884061 1947128 2006781 2060150
62526B060150M4939L4956K4149J3812M641m452j4914k6184l6187m4040n0716n6924
$$ 2060150 2105089 2140045 2164194 2178006 2182647 2178195 2163281 2137097 2100910 2056870 2006154 1949230
62514A949230o1771o4024o3579o1311n8422n6181n5195n4456n2167m7952m3347
$$ 1949230 1887459 1823435 1759856 1698545 1640123 1583942 1528747 1474291 1422124 1374172 1330825
62503A330825l9747l6767l3353k9534k6184k3675k1584j9546j7575j5639j3471
$$ 1330825 1291078 1254311 1220958 1191424 1165240 1141565 1119981 1100435 1082860 1067221 1053750
62492A053750j0949q432o591n852n870n612m252j973K09J321J071j0o64L02K724
$$ 1053750 1042801 1034369 1027778 1021926 1016056 1010444 1006192 1004219 1004428 1005749 1006820 1006810 1006146 1006448 1009172
62477A009172M818M961L602K705L486N454P539R209J0488J1784J3931J7476K1612
$$ 1009172 1013990 1018951 1022553 1025258 1028744 1034198 1041737 1050946 1061434 1073218 1087149 1104625 1126237
62464A126237K4676K6120K7261K9594L3113L6773M0006M3018M5878M8148M9505
$$ 1126237 1150913 1177033 1204294 1233888 1267001 1303774 1343780 1386798 1432676 1480824 1530329
62453A530329N0339N1605N4025N7297O0067O0887N9346N6169N2435M8840M5366
$$ 1530329 1580668 1632273 1686298 1743595 1803662 1864549 1923895 1980064 2032499 2081339 2126705
62442B126705M1180L5237K7705K0661J6480J5459J5805J6045J6592J8622K2460
$$ 2126705 2167885 2203122 2230827 2251488 2267968 2283427 2299232 2315277 2331869 2350491 2372951
62431B372951K7618L3692M0289M6448N1002N3664N5385N7334N9531O0430N8096
$$ 2372951 2400569 2434261 2474550 2520998 2572000 2625664 2681049 2738383 2797914 2858344 2916440
62420B916440N1873M2775L2052J9919O170q482k2764l6246m9477o2682p5282q6689
$$ 2916440 2968313 3011088 3043140 3063059 3069229 3060747 3037983 3001737 2952260 2889578 2814296 2727607
62408B727607r6437j03509j06765j06492j04400j01563r7534r1928q5583p9160
$$ 2727607 2631170 2527661 2420896 2314404 2210004 2108441 2010907 1918979 1833396 1754236
62398A754236p1890o3051n3868m6472m1378l7216l2701k7710k2600j7716j3611
$$ 1754236 1682346 1619295 1565427 1518955 1477577 1440361 1407660 1379950 1357350 1339634 1326023
62387A326023j0763q846p002m820k416K43L108N275N542M017K239J330Q00m15
$$ 1326023 1315260 1306414 1299412 1294592 1292176 1292419 1295527 1300802 1306344 1310361 1312600 1313930 1314730 1314315
62373A314315k571n253q179j1066j3148j3727j3216j2994j3995j5819j7250j7427
$$ 1314315 1311744 1306491 1298312 1287246 1274098 1260371 1247155 1234161 1220166 1204347 1187097 1169670
62361A169670j6351j4659j3163j2464j2589j2880j2536j1429j0213r495r085q388
$$ 1169670 1153319 1138660 1125497 1113033 1100444 1087564 1075028 1063599 1053386 1043891 1034806 1026418
62349A026418p269o088m971l606j912m27K56K20K12J032K865M991O303O540O724
$$ 1026418 1019149 1013061 1008090 1004484 1002572 1002145 1002401 1002621 1002833 1003865 1006730 1011721 1018024 1024564 1031288
62334A031288P797R090R223Q408Q446R962J1217J0731R824J0868J3701J5758J5696
$$ 1031288 1039085 1048175 1057398 1065806 1074252 1084214 1095431 1106162 1115986 1126854 1140555 1156313 1172009
62321A172009J5003J5465J6686J7340J7702J9327K2503K5438K6412K5765K5184
$$ 1172009 1187012 1202477 1219163 1236503 1254205 1273532 1296035 1321473 1347885 1373650 1398834
62310A398834K5648K6911K8678L1241L4661L8231M1474M5059M9837N5321O0150
$$ 1398834 1424482 1451393 1480071 1511312 1545973 1584204 1625678 1670737 1720574 1775895 1836045
62299A836045O3923O7328P0285P1420P0106O7752O5825O3355N7813M8268L6459
$$ 1836045 1899968 1967296 2037581 2109001 2179107 2246859 2312684 2376039 2433852 2482120 2518579
62288B518579K4789J4278M647m555j3423k1697k8897l4608l8876m2200m5152m7906
$$ 2518579 2543368 2557646 2562293 2557738 2544315 2522618 2493721 2459113 2420237 2378037 2332885 2284979
62276B284979m9965n0314m8447m5444m3255m2487m1585l8952l5140l2043l0432
$$ 2284979 2235014 2184700 2136253 2090809 2047554 2005067 1963482 1924530 1889390 1857347 1826915
62265A826915k9433k8138k6623k5396k4827k5145k6237k7366k7770k7376k6441
$$ 1826915 1797482 1769344 1742721 1717325 1692498 1667353 1641116 1613750 1585980 1558604 1532163
62254A532163k4994k3333k2320k2086k1186j8544j5509j4209j4303j3644j1956
$$ 1532163 1507169 1483836 1461516 1439430 1418244 1399700 1384191 1369982 1355679 1342035 1330079
62243A330079j1210j1909j1829r640p195o365n906l829j132l40j326j397P16L436
$$ 1330079 1318869 1306960 1295131 1285491 1278296 1271931 1266025 1262196 1261064 1260724 1259398 1258001 1258717 1262153
62229A262153M998N289M762L605K691L488O148R036J0938J2455J4319J5766J5734
$$ 1262153 1267151 1272440 1277202 1280807 1283498 1286986 1293134 1302170 1313108 1325563 1339882 1355648 1371382
62216A371382J4885J4991J6719J9077K0984K2458K4166K6479K9259L2280L5535
$$ 1371382 1386267 1401258 1417977 1437054 1458038 1480496 1504662 1531141 1560400 1592680 1628215
62205A628215L9083M2703M6002M9110N2920N8126O4058O9076P2172P3676P4370
$$ 1628215 1667298 1710001 1756003 1805113 1858033 1916159 1980217 2049293 2121465 2195141 2269511
62194B269511P4535P3865P1593O6528N7861M6515L4926K4779J5357M869o973j8573
$$ 2269511 2344046 2417911 2489504 2556032 2613893 2660408 2695334 2720113 2735470 2740339 2733366 2714793
62182B714793k8558l7354m6218n5312o3371o9149p2542p4045p3658p1184o7546
$$ 2714793 2686235 2648881 2602663 2547351 2483980 2414831 2342289 2268244 2194586 2123402 2055856
62171B055856o4577o2739n9925n3951m6012m0026l8087l8026l6328l2095k6924
$$ 2055856 1991279 1928540 1868615 1814664 1768652 1728626 1690539 1652513 1616185 1584090 1557166
62160A557166k2030j7481j3777j2014j1938j1596r770p485o109n212l605j585
$$ 1557166 1535136 1517655 1503878 1491864 1479926 1468330 1458560 1451075 1444966 1439754 1436149 1434564
62148A434564m75l56J56J788L857N911Q527J1701J3877J3873J2806J2651J3522
$$ 1434564 1434089 1433733 1433889 1435677 1439534 1445445 1453972 1465673 1479550 1493423 1506229 1518880 1532402
62135A532402J3930J3437J3263J4034J4619J4053J3262J3693J5170J6302J6543
$$ 1532402 1546332 1559769 1573032 1587066 1601685 1615738 1629000 1642693 1657863 1674165 1690708
62124A690708J6501J6494J6062J5104J4363J4363J4595J4329J3652J3275J3771
$$ 1690708 1707209 1723703 1739765 1754869 1769232 1783595 1798190 1812519 1826171 1839446 1853217
62113A853217J5437J8500K2929K8121L3284L8119M2728M6773M9155M8925M6382
$$ 1853217 1868654 1887154 1910083 1938204 1971488 2009607 2052335 2099108 2148263 2197188 2243570
62102B243570M2872L9264L5001K9067K1617J4045P395J338n050j2132j9611k6909
$$ 2243570 2286442 2325706 2360707 2389774 2411391 2425436 2432831 2434169 2429119 2416987 2397376 2370467
62090B370467l3111l7261l9496m1332m3881m6277m6923m5916m4824m4064m2096
$$ 2370467 2337356 2300095 2260599 2219267 2175386 2129109 2082186 2036270 1991446 1947382 1905286
62079A905286l7807l2371k7881k5025k3062k1257j9419j7538j5920j5278j5809
$$ 1905286 1867479 1835108 1807227 1782202 1759140 1737883 1718464 1700926 1685006 1669728 1653919
62068A653919j6417j5772j3976j2256j1150r960q118o039m202k132R01M521P157
$$ 1653919 1637502 1621730 1607754 1595498 1584348 1574388 1566270 1560231 1556029 1553897 1554798 1559319 1566476
62055A566476P428N357K225o37k789m564o178p290p482o979o611p092q502j0355
$$ 1566476 1573904 1579261 1581486 1580849 1578060 1573496 1567318 1560028 1552546 1545567 1538956 1531864 1523362 1513007
62041A513007j2087j3471j4526j4953j4015j1503q618p002o678n827l225j3J795
$$ 1513007 1500920 1487449 1472923 1457970 1443955 1432452 1423834 1416832 1410154 1404327 1401102 1401089 1402884
62028A402884K017K435M431P518J0292J2007J3008J4144J5935J8018J9565K0533
$$ 1402884 1404901 1407336 1411767 1419285 1429577 1441584 1454592 1468736 1484671 1502689 1522254 1542787
62016A542787K2009K4695K7637K9416L0244L1578L3863L6102L7690L9087M0241
$$ 1542787 1564796 1589491 1617128 1646544 1676788 1708366 1742229 1778331 1816021 1855108 1895349
62005A895349L9948L7752L5099L3407L1994K9106K4167J7736J0125J664o177j1759
$$ 1895349 1935297 1973049 2008148 2041555 2073549 2102655 2126822 2144558 2154683 2156347 2150170 2138411
61993B138411j5503j9711k5773l2816l9365m4986m9634n2662n3551n3046n2493
$$ 2138411 2122908 2103197 2077424 2044608 2005243 1960257 1910623 1857961 1804410 1751364 1698871
61982A698871n2364n2155n1545n0797m9964m8334m5047m0131l4783l0560k8040
$$ 1698871 1646507 1594352 1542807 1492010 1442046 1393712 1348665 1308534 1273751 1243191 1215151
61971A215151k6349k4185k1388j9074j8117j8030j7719j6867j5906j4968j3648
$$ 1215151 1188802 1164617 1143229 1124155 1106038 1088008 1070289 1053422 1037516 1022548 1008900
61960A008900j1914j0504j0103j0550j1091j1074j0217q655p106o527p019p339
$$ 1008900 996986 986482 976379 965829 954738 943664 933447 924792 917686 911159 904140 896801
61948H96801o106l403o07J283K362K981L136L066L465M330M412K843Q33L96J518
$$ 896801 890695 887292 886685 887968 890330 893311 896447 899513 902978 907308 911720 914563 915396 915792 917310
61933I17310J887k61m081p343q707q301o957n797n842p090q254q128o940n797
$$ 917310 919197 918936 914855 907512 898805 890504 883547 877750 871908 864818 856564 848436 841496 835699
61919H35699n318n434n976o492n970l915j498m48p66p56M13J488J102j23m76M37
$$ 835699 830381 824947 818971 812479 806509 802594 801096 800648 799882 799126 799539 801027 802129 802006 801530 801967
61903H01967J308J065L50O98K571M628N130L951K755K953M132N105N919P642J0275
$$ 801967 803275 804340 804690 805388 807959 812587 817717 821668 824423 827376 831508 836613 842532 850174 860449
61888H60449J2271J2611J2190J2540J4073J6303J8840K1310K3016K3674K3921
$$ 860449 872720 885331 897521 910061 924134 940437 959277 980587 1003603 1027277 1051198
61877A051198K4264K4160K3103K1926K1711K1867K0820J8404J6054J4435J2458
$$ 1051198 1075462 1099622 1122725 1144651 1166362 1188229 1209049 1227453 1243507 1257942 1270400
61866A270400R146N227K116L02n46p81q20j164j577j001Q74K735L425L941O289
$$ 1270400 1279546 1284773 1286889 1287191 1286645 1285864 1285044 1283880 1282303 1281302 1282176 1284911 1288336 1292277 1298566
61851A298566J0421J3885J4829J4179J4038J4755J4736J2916J0325Q656P945O523
$$ 1298566 1308987 1322872 1337701 1351880 1365918 1380673 1395409 1408325 1418650 1427306 1435251 1441774
61839A441774L416l2j656j300j187l295p005r965j0667r649q483q347r416j0990
$$ 1441774 1445190 1445158 1443502 1442202 1441015 1437720 1430715 1420750 1410083 1400434 1391951 1383604 1374188 1363198
61825A363198j2039j2130j1934j2536j4269j6490j8284j8982j8144j5828j2953
$$ 1363198 1351159 1339029 1327095 1314559 1300290 1283800 1265516 1246534 1228390 1212562 1199609
61814A199609j0864j0149j0225j0053q929o646l483k71K162L837N494P478R396
$$ 1199609 1188745 1178596 1168371 1158318 1149389 1142743 1139260 1138989 1141151 1144988 1150482 1157960 1167356
61801A167356J1116J3334J6566K0203K3308K5868K8486L1200L3451L5078L6431
$$ 1167356 1178472 1191806 1208372 1228575 1251883 1277751 1306237 1337437 1370888 1405966 1442397
61790A442397L7503L7760L6973L5425L3210L0108K6431K3103K0361J7114J2377
$$ 1442397 1479900 1517660 1554633 1590058 1623268 1653376 1679807 1702910 1723271 1740385 1752762
61779A752762O815K086j114l485n696p327p525o221m280k562j027J111M228P310
$$ 1752762 1759577 1761663 1760549 1757064 1751368 1744041 1736516 1730295 1726015 1723453 1722426 1723537 1727765 1735075
61765A735075Q552P273M887L351K941K179j70l905q231j2752j7063k0306k2071
$$ 1735075 1743627 1750900 1755787 1759138 1762079 1764258 1764088 1760183 1751952 1739200 1722137 1701831 1679760
61752A679760k3286k5188k7578k9073k9075k8448k8031k7490k6275k4892k4325
$$ 1679760 1656474 1631286 1603708 1574635 1545560 1517112 1489081 1461591 1435316 1410424 1386099
61741A386099k4549k4534k3551k1770j9665j7571j5981j5425j5663j5583j4321
$$ 1386099 1361550 1337016 1313465 1291695 1272030 1254459 1238478 1223053 1207390 1191807 1177486
61730A177486j2158r988q264o936n965n417n077m558l770k888k001j122n03m19
$$ 1177486 1165328 1155340 1147076 1140140 1134175 1128758 1123681 1119123 1115353 1112465 1110464 1109342 1108839 1108420
61716A108420o00l34P38K222L553M625N672O833Q107R429J0588J1227J1228J0966
$$ 1108420 1107820 1107486 1108224 1110446 1113999 1118624 1124296 1131129 1139236 1148665 1159253 1170480 1181708 1192674
61702A192674J1043J1763J2929J3814J3324J0705O565K824J067Q86L86j728n010
$$ 1192674 1203717 1215480 1228409 1242223 1255547 1266252 1272817 1275641 1276708 1277594 1277980 1276252 1271242
61689A271242q302j1149j3796j6213j7804j8060j7087j5463j3816j2591j1861
$$ 1271242 1262940 1251791 1237995 1221782 1203978 1185918 1168831 1153368 1139552 1126961 1115100
61678A115100j1250j0237q723p162o104n760n981o383o273m923k377P9Q58l30
$$ 1115100 1103850 1093613 1084890 1077728 1071624 1065864 1059883 1053500 1047227 1042304 1039927 1040006 1040864 1040534
61664A040534k124k878k231j232j142k295l891m673m034k641j867k419l744m883
$$ 1040534 1038410 1035532 1033301 1032069 1030927 1028632 1024741 1020068 1016034 1013393 1011526 1009107 1005363 1000480
61650A000480n516n908o188o333o613p444q704r687r867r291q271p180o520o567
$$ 1000480 994964 989056 982868 976535 969922 962478 953774 944087 934220 924929 916658 909478 902958 896391
61636H96391o771o180m783l818m245n461o168n999n531n003l996k451j153q55
$$ 896391 889620 883440 878657 874839 870594 865133 858965 852966 847435 842432 838436 835985 834832 833977
61622H33977j504k632l933n040n309m514l506l334l697l073p68J916L213K977
$$ 833977 832473 829841 825908 820868 815559 811045 807539 804205 800508 797435 796667 798583 801796 804773
61608H04773K366J803O63q17q77J369M002M413K837K123L856O387P296O338M978
$$ 804773 807139 808942 809605 808788 807911 809280 813282 817695 820532 822655 826511 832898 840194 846532 851510
61593H51510M121L514K781J847P51j67k10P46J721J935K092L269M957N546M733
$$ 851510 855631 859145 861926 863773 864524 864357 864147 864893 866614 868549 870641 873910 878867 884413 889146
61578H89146M055M692N783N538L322K46j898k150j349j543l812o881q634q753
$$ 889146 893201 897893 903676 909214 912536 912782 910884 908734 907385 905842 902030 895149 886515 877762
61564H77762q673r064q946p668o157n438n171m720m506n061n664n271m260l966
$$ 877762 869089 860025 851079 843411 837254 831816 826645 821925 817419 812358 806694 801423 797163 793197
61550G93197m791n925o701p057o904o190n547n743o468o600n765m697l991l518
$$ 793197 788406 782481 775780 768723 761819 755629 750082 744339 737871 731271 725506 720809 716818 713300
61536G13300l269l595m229m093k703j075o06j558l115m306m516l703k705k711
$$ 713300 710031 706436 702207 698114 695411 694336 693730 692172 689057 684751 680235 676532 673827 671116
61522F71116l843m786m412l122j861m88J658L970M782L570J755Q03N70J86k72
$$ 671116 667273 662487 658075 654953 653092 652604 654262 658232 663014 666584 668339 669142 669712 669898 669626
61507F69626m1Q99J669J734J443J320J564K336L691M988N176M177L271L372L625
$$ 669626 669585 670484 672153 673887 675330 676650 678214 680550 684241 689229 694405 698582 701853 705225 708850
61492G08850K625P03k19Q90K821L688L067K062J801K333K872K697J931J416J607
$$ 708850 711475 712178 711959 712849 715670 719358 722425 724487 726288 728621 731493 734190 736121 737537 739144
61477G39144J861J367N58N47J149Q39p94j928r96Q66J351K23o88m37m6n05j310
$$ 739144 741005 742372 742930 743477 744626 745465 744671 742743 741747 742613 743964 744187 743499 743062 743016 742511 741201
61460G41201j612j401q67K57J862K926K740K008J894K522L178L431L303K845K322
$$ 741201 739589 738188 737321 737578 739440 742366 745106 747114 749008 751530 754708 758139 761442 764287 766609
61445G66609K310K904L300K993K848L967N886P101P139P024P609Q573R215R076
$$ 766609 768919 771823 775123 778116 780964 784931 790817 797918 805057 812081 819690 828263 837478 846554
61431H46554P669M652Q89j689j939o01Q87J929K526K467J780J346J931K805K371
$$ 846554 854223 858875 859764 858075 856136 855535 856422 858351 860877 863344 865124 866470 868401 871206 873577
61416H73577K57k181l513l597l077k302j337m96l10j004k287l563m336m641n101
$$ 873577 873834 871653 868140 864543 861466 859164 857827 857331 857021 856017 853730 850167 845831 841190 836089
61401H36089o217p508p762o289l659j002J028K381L076L066K480J713J267J607
$$ 836089 829872 822364 814602 808313 804654 803652 804680 807061 810137 813203 815683 817396 818663 820270
61387H20270K875M566N802O254O473O884O918N859M308L795M806O080O255N511
$$ 820270 823145 827711 833513 839767 846240 853124 860042 865901 870209 874004 878810 884890 891145 896656
61373H96656M924M786M483L758L188L233L513L423L016K841L160L688M070M202
$$ 896656 901580 906366 910849 914607 917795 921028 924541 927964 930980 933821 936981 940669 944739 948941
61359I48941M019L337K201J195R54J228Q18j045l413m252k654m5J244M21j152
$$ 948941 952960 956297 958498 959693 960647 961875 962693 961648 958235 953983 951329 951284 952528 952949 951797
61344I51797j677o97R38K335L237L739L924L946M036M087L556K187P55M82J517
$$ 951797 950120 949423 950361 952696 955933 959672 963596 967542 971578 975665 979221 981408 982163 982645 984162
61329I84162K519K130N95o49p25j0Q69J819K685K723J488q3l93R22K594L399L538
$$ 984162 986681 988811 989406 988757 988032 988022 988891 990710 993395 996118 997606 997523 997130 998052 1000646 1004045 1007583
61312A007583L930M620M631L306J214n12j390j829k311k714k658k217j907j854
$$ 1007583 1011513 1016133 1020764 1024070 1025284 1024772 1023382 1021553 1019242 1016528 1013870 1011653 1009746 1007892
61298A007892j367L03K864N076O028O036O094O707P451P545O514M501K328J273
$$ 1007892 1006525 1006828 1009692 1014768 1020796 1026832 1032926 1039633 1047084 1054629 1061143 1065644 1067972 1069245
61284A069245K179M431O087N640L639K098K224L273L821L542L122K914K686K577
$$ 1069245 1071424 1075855 1081942 1087582 1091221 1093319 1095543 1098816 1102637 1106179 1109301 1112215 1114901 1117478
61270A117478L235M517M997L598J216j53L33J790L213M571O077P297P671P451
$$ 1117478 1120713 1125230 1130227 1133825 1135041 1134888 1135221 1137011 1140224 1144795 1150872 1158169 1165840 1173291
61256A173291P402P830Q493R365J0854J3194J5943J8237J9250J8650J6949J5307
$$ 1173291 1180693 1188523 1197016 1206381 1217235 1230429 1246372 1264609 1283859 1302509 1319458 1334765
61244A334765J4462J3701J1525P564L332O34l67j062k612m858o921q323r374j0686
$$ 1334765 1349227 1362928 1374453 1382017 1385349 1385983 1385616 1384554 1381942 1377084 1370163 1361840 1352466 1341780
61230A341780j2458j4085j4696j4269j3911j4493j5241j4410j1496q031n944n613
$$ 1341780 1329322 1315237 1300541 1286272 1272361 1257868 1242627 1228217 1216721 1208690 1202746 1197133
61218A197133n770m916k633J4J257L74j162j039J214L752M913M996M916M573L929
$$ 1197133 1191363 1186447 1183814 1183828 1185085 1185459 1184297 1183258 1184472 1188224 1193137 1198133 1203049 1207622 1211551
61203A211551M418P271J0919J2331J0989R458R477R619P963N188L377K933K530
$$ 1211551 1215969 1223240 1234159 1246490 1257479 1266937 1276414 1286033 1293996 1299184 1302561 1305494 1308024
61190A308024J517N00k86j466l036l756k780r97O4J23J60P27J134O47j58j0J226
$$ 1308024 1309541 1310041 1309755 1308289 1305253 1301497 1298717 1297720 1297784 1297907 1298067 1298794 1299928 1300575 1300417 1300407 1301633
61173A301633K299K447K650M236O870R026R981J0146R774Q769P829Q164R693J0993
$$ 1301633 1303932 1306379 1309029 1313265 1320135 1329161 1339142 1349288 1359062 1367831 1375660 1383824 1393517 1404510
61159A404510J1514J2217J3375J3511J1768R698R045Q989P464M387J717Q53J591
$$ 1404510 1416024 1428241 1441616 1455127 1466895 1476593 1485638 1494627 1502091 1506478 1508195 1509048 1510639
61146A510639L247N033N724M803L800M832P790J0691J2606J4333J6101J6801J5990
$$ 1510639 1513886 1518919 1524643 1529446 1533246 1538078 1545868 1556559 1569165 1583498 1599599 1616400 1632390
61133A632390J4670J3226J0488N965J319j712l519n296o734o690n544n139o516
$$ 1632390 1647060 1660286 1670774 1676739 1678058 1676346 1672827 1667531 1660797 1654107 1648563 1643424 1636908
61120A636908q966j1327j3226j4896j6438j7528j7632j6611j5212j4503j4668
$$ 1636908 1627942 1616615 1603389 1588493 1572055 1554527 1536895 1520284 1505072 1490569 1475901
61109A475901j4893j4615j4208j4169j4417j4765j5262j5502j4549j2234r732
$$ 1475901 1461008 1446393 1432185 1418016 1403599 1388834 1373572 1358070 1343521 1331287 1321555
61098A321555q018o634m854l218k570k226n72K553N491O881P028O778O114M432
$$ 1321555 1313537 1306903 1302049 1298831 1296261 1294035 1293463 1296016 1301507 1308388 1315416 1322194 1328308 1332740
61084A332740J698j281l452m150l413j842oK069M595P289R402J0642J1704J3498
$$ 1332740 1334438 1333157 1329705 1325555 1322142 1320300 1320294 1322363 1326958 1334247 1343649 1354291 1365995 1379493
61070A379493J6015J8360K0072K1971K5067K8736L0917L0714L0000L1442L5295
$$ 1379493 1395508 1413868 1433940 1455911 1480978 1509714 1540631 1571345 1601345 1632787 1668082
61059A668082L9327M1704M2650M3102M3265M3181M3433M4302M4956M4483M3056
$$ 1668082 1707409 1749113 1791763 1834865 1878130 1921311 1964744 2009046 2054002 2098485 2141541
61048B141541M1421L9814L8205L6918L6090L4988L2739K9428K5826K2439J9357
$$ 2141541 2182962 2222776 2260981 2297899 2333989 2368977 2401716 2431144 2456970 2479409 2498766
61037B498766J6545J3737J0710Q104P051P336P027M951K337P18n94l107o193p789
$$ 2498766 2515311 2529048 2539758 2547862 2554913 2562249 2569276 2574227 2576564 2577282 2576688 2573581 2567388 2559599
61023B559599p731q140j0321j3313j5905j8190k0426k2085k2895k3489k4128k3980
$$ 2559599 2551868 2543728 2533407 2520094 2504189 2485999 2465573 2443488 2420593 2397104 2372976 2348996
61011B348996k2469k0412j9050j8837j9677k1234k2422k1786j9228j6337j4339
$$ 2348996 2326527 2306115 2287065 2268228 2248551 2227317 2204895 2183109 2163881 2147544 2133205
61000B133205j2700j0527q013n463k185K298O914J0395J3275J6977K1542K5800
$$ 2133205 2120505 2109978 2101965 2096502 2094317 2096615 2103529 2113924 2127199 2144176 2165718 2191518
60988B191518K9442L3306L7695M1912M5669M9591N4122N8896O3455O7723P1726
$$ 2191518 2220960 2254266 2291961 2333873 2379542 2429133 2483255 2542151 2605606 2673329 2745055
60977B745055P5758Q0692Q7168R4558J01865J09414J18240J27905J36680J44139
$$ 2745055 2820813 2901505 2988673 3083231 3185096 3294510 3412750 3540655 3677335 3821474
60967C821474J51790J60542J69423J77733J86675J97594K10287K24582K41892
$$ 3821474 3973264 4133806 4303229 4480962 4667637 4865231 5075518 5300100 5541992
60958E541992K63217K86933L10926L36119L65671M01341M43025M91219N46973
$$ 5541992 5805209 6092142 6403068 6739187 7104858 7506199 7949224 8440443 8987416
60949H987416O09720O78424P55463Q46424R55409J083708J233521J408517J609089
$$ 8987416 9597136 10275560 11031023 11877447 12832856 13916564 15150085 16558602 18167691
60940A8167691J832121K077022K341583K599983K788820K832403K692892K392301
$$ 18167691 19999812 22076834 24418417 27018400 29807220 32639623 35332515 37724816
60932C7724816J983391J511391J016643N63708K36041P8192M5361K5035q5293
$$ 37724816 39708207 41219598 42236241 42799949 43035990 43114182 43159543 43184578 43099285
60923D3099285l22883o71271j101601j584600k070149k481169k745923k837597
$$ 43099285 42776402 42105131 41003530 39418930 37348781 34867612 32121689 29284092
60915B9284092k779992k620596k403898k163573j924044j699966j496376j313825
$$ 29284092 26504100 23883504 21479606 19316033 17391989 15692023 14195647 12881822
60907A2881822j153128j014363q94413p88755o94956o12781n41942m81437m30159
$$ 12881822 11728694 10714331 9819918 9031163 8336207 7723426 7181484 6700047 6269888
60898F269888l86579l48486l14293k83910k57397k33782k12171j92860j76128
$$ 6269888 5883309 5534823 5220530 4936620 4679223 4445441 4233270 4040410 3864282
60889C864282j61112j47278j35823j27986j22805j18067j12851j07625j02574
$$ 3864282 3703170 3555892 3420069 3292083 3169278 3051211 2938360 2830735 2728161
60880B728161r7364r1983q6485q0477p4209o9286o6720o5118o2461n8811n5436
$$ 2728161 2630797 2538814 2452329 2371852 2297643 2228357 2161637 2096519 2034058 1975247 1919811
60869A919811n2203m8134m3912m1144l9368l6462l2296k9294k8717k8848k7875
$$ 1919811 1867608 1819474 1775562 1734418 1695050 1658588 1626292 1596998 1568281 1539433 1511558
60858A511558k6245k4907k3225k0363j7214j5380j5074j5408j5825j6068j5546
$$ 1511558 1485313 1460406 1437181 1416818 1399604 1384224 1369150 1353742 1337917 1321849 1306303
60847A306303j4050j2563j2278j3119j4087j4609j4695j4132j2502j0099q204
$$ 1306303 1292253 1279690 1267412 1254293 1240206 1225597 1210902 1196770 1184268 1174169 1165965
60836A165965q190j0273j3028j4335j3299j1096r493q833q179p135o368o402o946
$$ 1165965 1157775 1147502 1134474 1120139 1106840 1095744 1086251 1077418 1069239 1062104 1055736 1049334 1042388
60823A042388p543p945p737o623n143m107l405k436j545j544j863j018Q10J515
$$ 1042388 1034845 1026900 1019163 1012540 1007397 1003290 999885 997449 995904 994360 992497 991479 992289 993804
60809I93804J72j274m98K359N277O693O305M798L587L829M883M879L412K211K301
$$ 993804 993976 992702 992204 994563 999840 1006533 1012838 1017636 1021223 1025052 1029935 1034814 1038226 1040437 1042738
60794A042738K232M58k092l401l062j967o11N46J13k624n847p045o378o238p722
$$ 1042738 1044970 1045428 1043336 1039935 1036873 1034906 1034295 1034841 1034954 1032330 1026483 1019438 1013060 1006822 999100
60779I99100r670j1040j2201j3370j3773j3093j2228j1841j1450j0608r925r971
$$ 999100 989430 978390 966189 952819 939046 925953 913725 901884 890434 879826 869901 859930
60767H59930j0105r353p774o225n200m642m553m962n451n362m632l995m136m899
$$ 859930 849825 840472 832698 826473 821273 816631 812078 807116 801665 796303 791671 787676 783540 778641
60753G78641n500n427m784l833k664j566j144j498j676p49Q20J841K192K788L742
$$ 778641 773141 767714 762930 759097 756433 754867 753723 752225 750549 749800 750620 752461 754653 757441 761183
60738G61183L973L114K405K845L679L701L022K467K100J537J049J059J032J15
$$ 761183 765156 768270 770675 773520 777199 780900 783922 786389 788489 790026 791075 792134 793166 793281
60724G93281j450k603k925k892k950l201l733m397m581m039l547l804m160l419
$$ 793281 791831 789228 786303 783411 780461 777260 773527 769130 764549 760510 756963 753159 748999 745580
60710G45580j645l1P75J114J261R99L15k93l38L72J707K906K769J021r58j644
$$ 745580 743935 743904 744679 745793 747054 748053 748368 748075 747737 748109 749816 752722 755491 756512 755554 753910
60694G53910j175o62l20M88J687K445K583K654K534J393o32k019j724o30m39j743
$$ 753910 752735 752073 751753 752241 753928 756373 758956 761610 764144 765537 764905 762886 761162 760532 760093 758350
60678G58350l512m226l333j905j650k957m257l880k047k93M66L98p0l15P23L302
$$ 758350 754838 750612 747279 745374 743724 740767 736510 732630 730583 730290 730756 731154 731084 730769 731492 734794
60662G34794N716N875M029K429K250K473K055J487J473J499P24o16j518j424o37
$$ 734794 740510 746385 750414 752843 755093 757566 759621 761108 762581 764080 764804 764188 762670 761246 760609
60647G60609k9m44j767k636j999q51j175l079m585m562m252m975n852n169l058
$$ 760609 760580 760136 758369 755733 753734 752883 751708 748629 744044 739482 735230 730255 724403 719234 716176
60632G16176j237n61j59R26K306K835K128J098R65J871K761K801K432K593L317
$$ 716176 714939 714378 714219 715145 717451 720286 722414 723512 724477 726348 729109 731910 734342 736935 740252
60617G40252L841L781L356K739K097J976K633L158K396N27j403l094m701n374
$$ 740252 744093 747874 751230 753969 756066 758042 760675 763833 766229 766756 765353 762259 757558 752184
60603G52184m046j666m89p55m62R14J112j085l117j979J485M076M784N083N449
$$ 752184 748138 746472 745983 745228 744766 745680 746792 745707 742590 740611 742096 746172 750956 756039 761488
60588G61488M495J899k79k30J240J952R62r32k545l443m021m848n861o237n308
$$ 761488 765983 767882 767603 767373 768613 770565 771527 770595 768050 764607 760586 755738 749877 743640 738332
60573G38332l362j089J287L726N535N788M626L172J984M37j943m231m891l515
$$ 738332 734970 733881 735168 738894 744429 750217 754843 758015 759999 760436 758493 754262 749371 745856
60559G45856j166Q82K137K520J790J09j142k76K437M456L884K033J694L322M532
$$ 745856 744690 745572 747709 750229 752019 752128 750986 750710 753147 757603 761487 763520 765214 768536 773068
60544G73068L613J730Q94J289J842K234K904L740M251M633N305N673M707K818
$$ 773068 776681 778411 779305 780594 782436 784670 787574 791314 795565 800198 805503 811176 815883 818701
60530H18701J772K375L418L459K727K447K962L492L535L605M330N467O195O092
$$ 818701 820473 822848 826266 829725 832452 834899 837861 841353 844888 848493 852823 858290 864485 870577
60516H70577N348M386L883M963Q294J2695J5601J5774J4824J5104J6699J7651
$$ 870577 875925 880311 884194 889157 897451 910146 925747 941521 956345 971449 988148 1005799
60504A005799J6800J4870J2896J1106R672R071R002Q087N457J859j265k994k929
$$ 1005799 1022599 1037469 1050365 1061471 1071143 1080214 1089216 1097303 1102760 1104619 1103354 1100360 1097431
60491A097431j134J348K988L526M291O228Q717J1025J3607J6941K0337K3155K6131
$$ 1097431 1096297 1097645 1100633 1104159 1108450 1114678 1123395 1134420 1148027 1164968 1185305 1208460 1234591
60478A234591L0005L3716L5671L6218L7144L8862L9726L8293L4959L1070K7326
$$ 1234591 1264596 1298312 1333983 1370201 1407345 1446207 1485933 1524226 1559185 1590255 1617581
60467A617581K3278J7790J0105J055p179j3167j7533k1240k3466k2749j9730j6842
$$ 1617581 1640859 1658649 1668754 1669809 1662630 1649463 1631930 1610690 1587224 1564475 1544745 1527903
60455A527903j5180j3466j0484o838l483r2L875P640J0166J2193J5758K1526K7872
$$ 1527903 1512723 1499257 1488773 1481935 1478452 1478360 1482235 1489875 1500041 1512234 1527992 1549518 1577390
60442A577390L3013L7260M2383M9058N5825O0756O3445O4818O5423O4852O2719
$$ 1577390 1610403 1647663 1690046 1739104 1794929 1855685 1919130 1983948 2049371 2114223 2176942
60431B176942N9292N4949M9724M3810L7785L2031K6589K1798J8102J4855J0283
$$ 2176942 2236234 2291183 2340907 2384717 2422502 2454533 2481122 2502920 2521022 2535877 2546160
60420B546160L306n608j5872k7789m1170n4269o5513p5146q3594q9357r0617q8317
$$ 2546160 2549466 2543858 2527986 2500197 2459027 2404758 2339245 2264099 2180505 2091148 2000531 1912214
60408A912214q5319q2581p8432p1973o4906n9145n4419m9428m4037l9078l4907
$$ 1912214 1826895 1744314 1665882 1593909 1529003 1469858 1415439 1366011 1321974 1282896 1247989
60397A247989l1307k8236k5771k3664k1580j9464j7352j5275j3628j2879j2659
$$ 1247989 1216682 1188446 1162675 1139011 1117431 1097967 1080615 1065340 1051712 1038833 1026174
60386A026174j1880j0196q591p956p793p003n499m228l881m159m320m003l515
$$ 1026174 1014294 1004098 995507 987551 979758 972755 967256 963028 959147 954988 950668 946665 943150
60373I43150l451m077n033n671n530m443k573o69J16p38k547m268n382n437l666
$$ 943150 939699 935622 930589 924918 919388 914945 912372 911703 911819 911081 908534 904266 898884 893447 889781
60358H89781l01K452K473N45m31P56K342K492J792J966L513N625P433Q362Q011
$$ 889781 889480 891932 894405 894950 894519 895275 897617 900109 901901 903867 907380 913005 920438 928800 936811
60343I36811O625N126M033L063K231K364L740N194N514M897M175L499K868K971
$$ 936811 943436 948562 952595 955658 957889 960253 963993 969187 974701 979598 983773 987272 990140 993111
60329I93111M168N355N314M688N040O293O843O238N878O512O768N290L146K666
$$ 993111 997279 1002634 1007948 1012636 1017676 1023969 1030812 1037050 1042928 1049440 1056208 1061498 1064644 1067310
60315A067310M340O192O258M705L187K838L495M449N294N830N763M885L512K349
$$ 1067310 1071650 1077842 1084100 1088805 1091992 1094830 1098325 1102774 1108068 1113898 1119661 1124546 1128058 1130407
60301A130407J993K735M608P116R140R832R683J0069J1497J3076J3928J4245J4270
$$ 1130407 1132400 1135135 1139743 1146859 1155999 1165831 1175514 1185583 1197080 1210156 1224084 1238329 1252599
60288A252599J3200J0139N737J705j177l570n935p592p881p485p774r119j0459
$$ 1252599 1265799 1275938 1281675 1283380 1282203 1278633 1272698 1265106 1257225 1249740 1241966 1232847 1222388
60275A222388j0431q672o173m654n315p614r346q564n741l540l958o017o893n155
$$ 1222388 1211957 1203285 1197112 1192458 1187143 1179529 1170183 1161619 1155878 1152338 1148380 1142363 1135470 1130315
60261A130315k075L89J996L834O260Q307R136R129R300J0311J2308J5006J7459
$$ 1130315 1128240 1128629 1130625 1134459 1140719 1149026 1158162 1167291 1176591 1186902 1199210 1214216 1231675
60248A231675J8343J7141J4893J3289J3080J3570J3495J2074R433O204K760j259
$$ 1231675 1250018 1267159 1282052 1295341 1308421 1321991 1335486 1347560 1356993 1363197 1365957 1364698
60236A364698o312j1894j6620j9669k1661k3516k4848k4331k1542j7779j4820
$$ 1364698 1358386 1346492 1329872 1310203 1288542 1265026 1240178 1215847 1194305 1176526 1161706
60225A161706j3360j2897j2622j2009j0849r308p980p507p915q477q326p144n310
$$ 1161706 1148346 1135449 1122827 1110818 1099969 1090661 1082681 1075174 1067259 1058782 1050456 1043312 1038002
60212A038002l630k915l398m345m598l844l051l104l426k774j282n33j262k076
$$ 1038002 1034372 1031457 1028059 1023714 1019116 1015272 1012221 1009117 1005691 1002917 1001635 1001102 999840 997764
60198I97764j326N84J792J394K25n68n39L57J947L359L375J892M89R18L171N341
$$ 997764 996438 997022 998814 1000208 1000433 999865 999326 999683 1001630 1004989 1008364 1010256 1010745 1011663 1014834 1020175
60182A020175N378L002J14q22R01L650N366N595N146M515L678L050L294M083M367
$$ 1020175 1025553 1028555 1028669 1027847 1028748 1032398 1037764 1043359 1048505 1053020 1056698 1059748 1063042 1067125 1071492
60167A071492M119M601O405Q446R580J0099J0686J0916R963Q387P897R369J1852
$$ 1071492 1075611 1080212 1086617 1095063 1104643 1114742 1125428 1136344 1146307 1154694 1162591 1171960 1183812
60154A183812J3601J3687J2637J1849J2078J2446J1465R323Q248R837J2727J3970
$$ 1183812 1197413 1211100 1223737 1235586 1247664 1260110 1271575 1280898 1289146 1298983 1311710 1325680
60142A325680J2380R476P264O166N324M017K327Q35Ml15p78j794l091m261n357
$$ 1325680 1338060 1347536 1354800 1360966 1366290 1370307 1372634 1373469 1373473 1373158 1372380 1370586 1367495 1363234 1357877
60127A357877o405o854o327n644o016p162p368n794l729k826k996k919k091j230
$$ 1357877 1351472 1344618 1338291 1332647 1326631 1319469 1312101 1306307 1302578 1299752 1296756 1293837 1291746 1290516
60113A290516r25r34j071j665k767l657l732l308k935k537k002k075l493n338
$$ 1290516 1289591 1288657 1287586 1285921 1283154 1279497 1275765 1272457 1269522 1266985 1264983 1262908 1259415 1254077
60099A254077n548l495q83L73K57j33l86o71n49N96K203K919K564K467L499M838
$$ 1254077 1248529 1245034 1244151 1244524 1244781 1244648 1244262 1243591 1243042 1243638 1245841 1248760 1251324 1253791 1257290 1262128
60083A262128N182M410L459L116L528M417N271N530N023M119L376L208L847N193
$$ 1262128 1267310 1271720 1275179 1278295 1281823 1286240 1291511 1297041 1302064 1306183 1309559 1312767 1316614 1321807
60069A321807O504O843N994M733M034M266N091N805N831N331N247O307Q136R805
$$ 1321807 1328311 1335154 1341148 1345881 1349915 1354181 1359272 1365077 1370908 1376239 1381486 1387793 1395929 1405734
60055A405734J0974J1783J2019J1298J0012R062Q630Q206P812Q028Q665Q550O995
$$ 1405734 1416708 1428491 1440510 1451808 1461820 1470882 1479512 1487718 1495530 1503558 1512223 1520773 1527768
60042A527768M465J678q37k233j874p33q13k568m355n011n272n845n935n091m789
$$ 1527768 1532233 1533911 1533074 1530841 1528967 1528234 1527421 1524853 1520498 1515487 1510215 1504370 1498435 1493344 1488555
60027A488555o389q923j0685j1943j3942j6178j6966j6227j5504j5423j5217j4709
$$ 1488555 1482166 1473243 1462558 1450615 1436673 1420495 1403529 1387302 1371798 1356375 1341158 1326449
60015A326449j4665j4896j4167j2531j1693j2281j2557j1013q697p580p755p757
$$ 1326449 1311784 1296888 1282721 1270190 1258497 1246216 1233659 1222646 1213949 1206369 1198614 1190857
60003A190857p040o594p106p767p325n766m372m110m396l882k345j002n82j15
$$ 1190857 1183817 1177223 1170117 1162350 1155025 1149259 1144887 1140777 1136381 1132499 1130154 1129152 1128570 1128455
59989A128455J369K813K376M10n54Q99L281M362L805K884K539K648K645K110J116
$$ 1128455 1129824 1132637 1135013 1135423 1134869 1135768 1139049 1143411 1147216 1150100 1152639 1155287 1157932 1160042 1161158
59974A161158L97O09J123L65k109m693n607n032m681n655p488r014r496r068q587
$$ 1161158 1161555 1162164 1163287 1163652 1161543 1156850 1151243 1146211 1141530 1135875 1128387 1119373 1109877 1100809 1092222
59959A092222q777r277q872p119n140m343m756n258n087m382l517k616j784j199
$$ 1092222 1083445 1074168 1065296 1058177 1053037 1048694 1043938 1038680 1033593 1029211 1025694 1023078 1021294 1020095
59945A020095r28r32j250j963l046m317n257m975k957k07J299Q70J43R71K906
$$ 1020095 1019167 1018235 1016985 1015022 1011976 1007659 1002402 997427 994470 994263 995562 996432 996575 997546 1000452
59930A000452L996L679L383M216N514O270O635P100P176O107M266K548P66j948
$$ 1000452 1004448 1008127 1011510 1015726 1021240 1027510 1034145 1041245 1048421 1054528 1058794 1061342 1062108 1060160
59916A060160n071o497n121k534j253j830k812l029k739k457j973j078l27k50
$$ 1060160 1055089 1048592 1043471 1040937 1039684 1037854 1035042 1032013 1029274 1026817 1024844 1023766 1023439 1023189
59902A023189l75N7Q08J056R62J632L221M177L179J071j52P5N13K85J22Q84J924
$$ 1023189 1022814 1022871 1023679 1024735 1025697 1027329 1030550 1034727 1037906 1038977 1038825 1038900 1039413 1039698 1039820 1040704 1042628
59885A042628J969J081O18J290K310K670K460K400K770L317L880M572N522O698
$$ 1042628 1044597 1045678 1046296 1047586 1049896 1052566 1055026 1057426 1060196 1063513 1067393 1071965 1077487 1084185
59871A084185P828Q351P912P020O663O888O508M788K768K024K575L022K562J845
$$ 1084185 1092013 1100364 1108276 1115296 1121959 1128847 1135355 1140143 1142911 1144935 1147510 1150532 1153094 1154939
59857A154939J817K634L851N059O093P081Q226R108Q664O517L890K186J155k31
$$ 1154939 1156756 1159390 1163241 1168300 1174393 1181474 1189700 1198808 1207472 1213989 1217879 1220065 1221220 1220989
59843A220989j556j420j41O2j750l753m049l186k646k251q00J643L834N180O027
$$ 1220989 1219433 1218013 1217872 1217934 1216184 1212431 1208382 1205196 1202550 1200299 1199499 1201142 1204976 1210156 1216183
59828A216183O506O505O550P319Q447R006R080R565J0419J0448R108P369O331
$$ 1216183 1222689 1229194 1235744 1243063 1251510 1260516 1269596 1279161 1289580 1300028 1309136 1316505 1322836
59815A322836N922N501N026M950N285N309M276K262K43q06q22m06L03J752L773
$$ 1322836 1328758 1334259 1339285 1344235 1349520 1354829 1359105 1361367 1361610 1360804 1359982 1359576 1359879 1361631 1365404
59800A365404N073M669L284K528L095M401N582O165O039N618N862P446R938J2167
$$ 1365404 1370477 1375146 1378430 1380958 1384053 1388454 1394036 1400201 1406240 1411858 1417720 1425166 1435104 1447271
59786A447271J3187J2643J0721Q155N725L338L76k734m319l567j672j57P48J026
$$ 1447271 1460458 1473101 1483822 1491977 1497702 1501040 1501416 1498682 1494363 1490796 1489124 1488967 1489715 1490741
59772A490741k76l402o439p582p938r783j2711j3985j2592j0370q921p796o318
$$ 1490741 1490465 1487063 1480624 1473042 1465104 1455321 1442610 1428625 1416033 1405663 1396742 1388946 1382628
59759A382628m875l535j525Q60J690N1k272l023k108q86j12J24m33j629k284j475
$$ 1382628 1377753 1374218 1372693 1373553 1375243 1375294 1373022 1369999 1367891 1367005 1366893 1367017 1366584 1364955 1362671 1361196
59743A361196J4N36n57k659m859o357o599n950n719o638p750p564o044m677m879
$$ 1361196 1361210 1361746 1361189 1358530 1353671 1347314 1340715 1334765 1329046 1322408 1314658 1307094 1301050 1296373 1291494
59728A291494o682q725r238p659n539n088o474p550o720m925l943l748k908q73
$$ 1291494 1284812 1276087 1266849 1259190 1253651 1248563 1242089 1234539 1227819 1222894 1218951 1215203 1212295 1211422
59714A211422J459L110L887L897L300K662K764L962N990Q304J0333J1715J2684
$$ 1211422 1212881 1215991 1219878 1223775 1227075 1229737 1232501 1236463 1242453 1250757 1261090 1272805 1285489
59701A285489J3844J5128J5579J4695J3440J3158J3890J4649J5004J5354J5648
$$ 1285489 1299333 1314461 1330040 1344735 1358175 1371333 1385223 1399872 1414876 1430230 1445878
59690A445878J4977J2886J0411R014Q828Q507O994M820L284K747K481K138K257
$$ 1445878 1460855 1473741 1484152 1493166 1501994 1510501 1517495 1522315 1525599 1528346 1530827 1532965 1535222
59677A535222K874K770J126q96j593j183j216j886j838q39n43j839l226l009j690
$$ 1535222 1538096 1540866 1541992 1541096 1539503 1538320 1537104 1535218 1533380 1532541 1531998 1530159 1526933 1523924 1522234
59662A522234p70k98Q62K944M836N517M966L879L266L883N424O651O996P422Q990
$$ 1522234 1521464 1521166 1522028 1524972 1529808 1535325 1540291 1544170 1547436 1551319 1556743 1563394 1570390 1577812 1586802
59647A586802J1290J3247J4800J6618J8575J9665J9394J8271J6989J5922J5366
$$ 1586802 1598092 1611339 1626139 1642757 1661332 1680997 1700391 1718662 1735651 1751573 1766939
59636A766939J5454J5710J5295J3764J1234Q084M872K294O34o23k212m253o336
$$ 1766939 1782393 1798103 1813398 1827162 1838396 1846480 1851352 1853646 1854280 1853657 1851445 1847192 1840856
59623A840856q037r023r125q824r181j0740j2760j4066j4292j3832j2951j1675
$$ 1840856 1832819 1823796 1814671 1805847 1796666 1785926 1773166 1759100 1744808 1730976 1718025 1706350
59611A706350j0303r392r096q834p619m925j520P67Q89J13Q12L590O666Q243Q323
$$ 1706350 1696047 1686655 1677559 1668725 1661106 1656181 1654661 1655428 1656317 1656430 1657242 1660832 1667498 1675741 1684064
59596A684064P813P278P214P966Q492O668K151k510n151o970j0327j4705j7445
$$ 1684064 1691877 1699155 1706369 1714335 1722827 1729495 1731646 1729136 1723985 1717015 1706688 1691983 1674538
59583A674538j7925j8427k0512k2890k3663k2826k1481k0070j8529j7212j6509
$$ 1674538 1656613 1638186 1617674 1594784 1571121 1548295 1526814 1506744 1488215 1471003 1454494
59572A454494j6122j5618j5251j5473j6007j6194j6049j6214j6815j7016j6090
$$ 1454494 1438372 1422754 1407503 1392030 1376023 1359829 1343780 1327566 1310751 1293735 1277645
59561A277645j4581j3824j4240j4703j3892j1909r951q782q260q067p942p294
$$ 1277645 1263064 1249240 1235000 1220297 1206405 1194496 1184545 1175763 1167503 1159436 1151494 1144200
59549A144200n660l737k838l131l446k984j960m21J925M260M885L762L032L798
$$ 1144200 1138540 1134803 1131965 1128834 1125388 1122404 1120444 1120023 1121948 1126208 1131093 1134855 1137887 1141685
59535A141685M319K914Q14R1M65N05O53K166L858K921r62m940o667o423n348l933
$$ 1141685 1146004 1148918 1149732 1149823 1150288 1150793 1151446 1153612 1157470 1160391 1159429 1154489 1147822 1141399 1136051 1132118
59519A132118k763k656l241l158k265j951k763l526l620m150n814p217o582m031
$$ 1132118 1129355 1126699 1123458 1120300 1118035 1116084 1113321 1109795 1106175 1102025 1096211 1088994 1082412 1078381
59505A078381j021J422K937L262K494J319K85o12j231j036k1J067J904L053M774
$$ 1078381 1077360 1078782 1081719 1084981 1087475 1088794 1089079 1088467 1087236 1086200 1086179 1087246 1089150 1092203 1096977
59490A096977O353P258P952Q936R924J0609J1383J2649J4248J6189J8841K1813
$$ 1096977 1103330 1110588 1118540 1127476 1137400 1148009 1159392 1172041 1186289 1202478 1221319 1243132
59478A243132K3558K2999K0671J7456J3199P672K044j862l454l591l293l097l277
$$ 1243132 1266690 1289689 1310360 1327816 1341015 1348687 1350731 1348869 1345415 1341824 1338531 1335434 1332157
59465A332157l808m135l672k512j250m17m01j454l351n412p198q790j0103j0699
$$ 1332157 1328349 1324214 1320542 1318030 1316780 1316363 1315962 1314508 1311157 1305745 1298547 1289757 1279654 1268955
59451A268955j0633j0672j1046j0848r500p966p448p423o339m016k143k007k793
$$ 1268955 1258322 1247650 1236604 1225756 1216256 1208290 1200842 1193419 1187080 1183064 1180921 1178914 1176121
59438A176121k690j129P27J499J138P78J290K468L684M881O325P661Q079P502
$$ 1176121 1173431 1172302 1173029 1174528 1175666 1176444 1177734 1180202 1183886 1188767 1195092 1202753 1210832 1218334
59424A218334O846O774O934O751O309N937N423M406L163K497K791L518L662K594
$$ 1218334 1225180 1231954 1238888 1245639 1251948 1257885 1263308 1267714 1270877 1273374 1276165 1279683 1283345 1285939
59410A285939P76m68k61P28J003P0j048j161q0J712L770N664O908P473P870Q392
$$ 1285939 1286715 1286247 1285986 1286714 1287717 1287787 1286739 1285578 1285498 1287210 1290980 1296644 1303552 1311025 1318895 1327287
59394A327287Q720Q611Q362Q254Q132P912P906Q043P446N455K630Q4j742k999
$$ 1327287 1336007 1344618 1352980 1361234 1369366 1377278 1385184 1393227 1400673 1406128 1408758 1408842 1407100 1404101
59380A404101l528k990j862j371k090l078k837j005J268K667L243M259O497R200
$$ 1404101 1400573 1397583 1395721 1394350 1392260 1389182 1386345 1385340 1386608 1389275 1392518 1396777 1403274 1412474
59366A412474J1047J1840J2690J4614J7536K0597K2967K4363K5278K6647K8947
$$ 1412474 1423521 1435361 1448051 1462665 1480201 1500798 1523765 1548128 1573406 1600053 1629000
59355A629000L1748L4415L6704L8008L6763L1842K4213J6044Q429J331m462p259
$$ 1629000 1660748 1695163 1731867 1769875 1806638 1838480 1862693 1878737 1887166 1888497 1884035 1876776
59343A876776o682m333j657J269L996M549J389m535j1028j7025k2516k6973k9460
$$ 1876776 1870094 1865761 1864104 1865373 1869369 1873918 1875307 1870772 1859744 1842719 1820203 1793230 1763770
59330A763770k9943k9182k7439k4442k0585j7065j4658j3023j1375r463p724o645
$$ 1763770 1733827 1704645 1677206 1652764 1632179 1615114 1600456 1587433 1576058 1566595 1558871 1552226
59318A552226n970m713k395PJ204J464K145L311L614L070L938P448J1349J2656
$$ 1552226 1546256 1541543 1539148 1539155 1540359 1541823 1543968 1547279 1550893 1553963 1557901 1565349 1576698 1589354
59304A589354J1606J0761J0988J0917J0123J0303J2471J5080J6096J5634J5377
$$ 1589354 1600960 1611721 1622709 1633626 1643749 1654052 1666523 1681603 1697699 1713333 1728710
59293A728710J6245J7656J8663J8986J9060J9447K0152K0475J9851J8618J7416
$$ 1728710 1744955 1762611 1781274 1800260 1819320 1838767 1858919 1879394 1899245 1917863 1935279
59282A935279J6003J3460R568N176J068k696o165r132j1647j4091j6368j7897
$$ 1935279 1951282 1964742 1974310 1979486 1980554 1977858 1971693 1962561 1950914 1936823 1920455 1902558
59270A902558j8776k0106k2405k4581k5365k5162k5390k6389k7138k7005k6498
$$ 1902558 1883782 1863676 1841271 1816690 1791325 1766163 1740773 1714384 1687246 1660241 1633743
59259A633743k5964k4657k1940j8698j6560j5943j5716j4802j3358j2181j1575
$$ 1633743 1607779 1583122 1561182 1542484 1525924 1509981 1494265 1479463 1466105 1453924 1442349
59248A442349j1249j0787r822q055n520k640K86L470P152J1050J4576J7333J8915
$$ 1442349 1431100 1420313 1410491 1402436 1396916 1394276 1394562 1398032 1405184 1416234 1430810 1448143 1467058
59235A467058J8635J6086J1830O895J733l680q878j2825j4877j5110j3724j0900
$$ 1467058 1485693 1501779 1513609 1520504 1522237 1518557 1509679 1496854 1481977 1466867 1453143 1442243
59223A442243p261l635r1L897Q002J0807J1678J1935J3218J5229J6235J5675J5101
$$ 1442243 1434982 1431347 1431256 1435153 1443155 1453962 1465640 1477575 1490793 1506022 1522257 1537932 1553033
59210A553033J6201J8642K0517K0548J9202J7586J5946J3860J1481R674Q671P422
$$ 1553033 1569234 1587876 1608393 1628941 1648143 1665729 1681675 1695535 1707016 1716690 1725361 1732783
59198A732783M959J738j044l061m879o647p803q071q028q413r431j0736j1635
$$ 1732783 1737742 1739480 1738436 1735375 1730496 1723849 1716046 1707975 1699947 1691534 1682103 1671367 1659732
59185A659732j1536j0638r937j0031j0364j0310j0330j1023j1733j1384j0258
$$ 1659732 1648196 1637558 1627621 1617590 1607226 1596916 1586586 1575563 1563830 1552446 1542188
59174A542188r476r079q342p755q666j0767j1923j1047r404q373p735p051o864
$$ 1542188 1532712 1523633 1515291 1507536 1498870 1488103 1476180 1465133 1455729 1447356 1439621 1432570 1425706
59161A425706p383p450o228m757m468n042n011l766j962n53k04r29j617p54J689
$$ 1425706 1418323 1410873 1404645 1399888 1395420 1390378 1385367 1381601 1379639 1379086 1378882 1377953 1376336 1375582 1377271
59146A377271M036N031N142N161M934M289L795L560K678R88j7O46J755J723Q62
$$ 1377271 1381307 1386338 1391480 1396641 1401575 1405864 1409659 1413219 1415897 1416885 1416868 1417514 1419269 1420992 1421854
59131A421854L52K29M4K26J017J174l36k362l261l592m951o925p646o923o424
$$ 1421854 1422206 1422435 1422479 1422705 1423722 1424896 1424560 1422198 1418937 1415345 1410394 1403469 1395823 1388900 1382476
59116A382476o789o869o079n399n550n965o047n963n843n511n246n491n756n247
$$ 1382476 1375687 1368818 1362739 1357340 1351790 1345825 1339778 1333815 1327972 1322461 1317215 1311724 1305968 1300721
59102A300721m511m831n886n860m341l317m404o543p487o587n151m736n810p612
$$ 1300721 1296210 1291379 1285493 1279633 1275292 1271975 1267571 1261028 1253541 1246954 1241803 1237067 1231257 1223645
59088A223645q859q892q333q151q246p635o073m676m727o335q257q706o662k945
$$ 1223645 1214786 1205894 1197561 1189410 1181164 1173529 1167456 1162780 1158053 1151718 1143461 1134755 1128093 1125148
59074A125148L24J901K449K945L145K644K399L565N589P125Q268J0017J2011J2902
$$ 1125148 1125472 1127373 1129822 1132767 1135912 1138556 1140955 1144520 1150109 1157234 1165502 1175519 1187530 1200432
59060A200432J2866J3593J5482J6888J6709J5908J5726J5965J5798J5014J3768
$$ 1200432 1213298 1226891 1242373 1259261 1275970 1291878 1307604 1323569 1339367 1354381 1368149
59049A368149J2168J0689R881R312P913N674L837L050K593J695L70j437l978o581
$$ 1368149 1380317 1391006 1400887 1410199 1418112 1423786 1427623 1430673 1433266 1434961 1435331 1433894 1429916 1423335
59035A423335p748p089n871n128m501l598l085l584m547n119n204n152n262o038
$$ 1423335 1415587 1408498 1402627 1397499 1392998 1389400 1386315 1382731 1378184 1373065 1367861 1362709 1357447 1351409
59021A351409p824r770j0409r646q850q609p951o502n586o088o839o534n918o413
$$ 1351409 1343585 1333815 1323406 1313760 1304910 1296301 1288350 1281848 1276262 1270174 1263335 1256801 1250883 1244470
59007A244470p573p674o200m340l306l388m249n145n206m437l938m340m732m046
$$ 1244470 1236897 1229223 1223023 1218683 1215377 1211989 1207740 1202595 1197389 1192952 1189014 1184674 1179942 1175896
58993A175896k699j678q31M24J355Q07m21j19J975L258J716j141k181o95J103
$$ 1175896 1173197 1171519 1170688 1171112 1172467 1173274 1172853 1172734 1174709 1177967 1179683 1178542 1176361 1175666 1176769
58978A176769J345P10Q14J720K211J953K003L047M370N192N985P574R579J0859
$$ 1176769 1178114 1178824 1179638 1181358 1183569 1185522 1187525 1190572 1194942 1200134 1206119 1213693 1223272 1234131
58964A234131J1180J1474J2561J4426J6527J7901J7199J3803R017N186L429K991
$$ 1234131 1245311 1256785 1269346 1283772 1300299 1318200 1335399 1349202 1358219 1363405 1366834 1369825
58952A369825K689J999P39j068k639k850j742o65m84m82M13K093L589M316M450
$$ 1369825 1372514 1374513 1375252 1374184 1371545 1368695 1366953 1366288 1365804 1365322 1365735 1367828 1371417 1375733 1380183
58937A380183M453M672N143N434M967L583J684p1r35l65J258K611K875K773L448
$$ 1380183 1384636 1389308 1394451 1399885 1404852 1408435 1410119 1410048 1409113 1408748 1410006 1412617 1415492 1418265 1421713
58922A421713M794N961P031Q823J1267J3334J4568J5472J6387J7170J7853J8376
$$ 1421713 1426507 1432468 1439499 1448322 1459589 1472923 1487491 1502963 1519350 1536520 1554373 1572749
58910A572749J7982J6292J4613J4542J5430J5234J3560J1750R842O190Q30l407
$$ 1572749 1590731 1607023 1621636 1636178 1651608 1666842 1680402 1692152 1701994 1708184 1709014 1705607
58898A705607m546m188n180q273j2397j6553j9877k1322k0936k0395k0919k1657
$$ 1705607 1701061 1696873 1691693 1683420 1671023 1654470 1634593 1613271 1592335 1571940 1551021 1529364
58886A529364k1313k0057j8580j6553j3627j0854r414q775p575n648l828k437
$$ 1529364 1508051 1487994 1469414 1452861 1439234 1428380 1418966 1410191 1402616 1396968 1393140 1390703
58874A390703j272l68L59J428K703K910J479j56n72n85j784l674m242k893j064
$$ 1390703 1389431 1389063 1389422 1390850 1393553 1396463 1397942 1397786 1397214 1396629 1394845 1391171 1386929 1384036 1382972
58859A382972kL67M99O48J398L321N888P786Q466Q586Q896R529J0401J1554J3113
$$ 1382972 1382970 1383337 1383836 1384484 1385882 1389203 1395091 1402877 1411343 1419929 1428825 1438354 1448755 1460309 1473422
58844A473422J5305J8227K1159K2645K2053K0571J9920K0471K1239K1227K0153
$$ 1473422 1488727 1506954 1528113 1550758 1572811 1593382 1613302 1633773 1655012 1676239 1696392
58833A696392J8492J7470J8203K0133K1228K0583J9736K0322K1588K1623K0093
$$ 1696392 1714884 1732354 1750557 1770690 1791918 1812501 1832237 1852559 1874147 1895770 1915863
58822A915863J7963J5415J2006Q515O464N717M411J727r49k108k034j942k434
$$ 1915863 1933826 1949241 1961247 1969762 1976226 1981943 1986354 1988081 1987132 1985024 1982990 1981048 1978614
58809A978614l512n225p453r566j1002j1988j3268j5270j7608j9295j9564j8740
$$ 1978614 1975102 1969877 1962424 1952858 1941856 1929868 1916600 1901330 1883722 1864427 1844863 1826123
58797A826123j8159j8914k0756k2489k3192k2829k2031k1595k1889k2403k2234
$$ 1826123 1807964 1789050 1768294 1745805 1722613 1699784 1677753 1656158 1634269 1611866 1589632
58786A589632k1223k0186j9791j9759j9480j8767j7680j6271j4908j4173j3961
$$ 1589632 1568409 1548223 1528432 1508673 1489193 1470426 1452746 1436475 1421567 1407394 1393433
58775A393433j3440j2308j1304j0895j0266q337n183j807Q59K274K342J691J205
$$ 1393433 1379993 1367685 1356381 1345486 1335220 1326883 1321700 1319893 1320752 1323026 1325368 1327059 1328264
58762A328264R60L90k73Q3J704L385M184M391M277L371J774N60Nr90k608l229
$$ 1328264 1329224 1329614 1329341 1329424 1331128 1334513 1338697 1343088 1347365 1350736 1352510 1353070 1353075 1352085 1349477 1346248
58746A346248k193j589l371o338q033q314q713r438r424q553p530o229m411l371
$$ 1346248 1344055 1342466 1339095 1332757 1324724 1316410 1307697 1298259 1288835 1280282 1272752 1266523 1262112 1258741
58732A258741m385o014n499k684pJ362K761N131P420Q800J0166J2257J3992J3922
$$ 1258741 1254356 1248342 1242843 1240159 1240152 1241514 1244275 1249406 1256826 1265626 1275792 1288049 1302041 1315963
58718A315963J2296J0675J0131J0329R811P151K502k101m846o136p573r506j0996
$$ 1315963 1328259 1338934 1349065 1359394 1369205 1376356 1378858 1376757 1371911 1365775 1358202 1348696 1337700
58705A337700j1677j1969j1772j0706r511r406j0031r852q680p905p997p765o587
$$ 1337700 1326023 1314054 1302282 1291576 1282065 1272659 1262628 1252776 1244096 1236191 1228194 1220429 1213842
58692A213842n473n209n093m251k835j183P48K548L341L280L623M772N693N996
$$ 1213842 1208369 1203160 1198067 1193816 1190981 1189798 1190546 1193094 1196435 1199715 1203338 1208110 1213803 1219799
58678A219799O817Q654R940R284P728P173P588P522O794O728P751Q440P463N318
$$ 1219799 1226616 1235270 1245210 1254494 1262222 1269395 1276983 1284505 1291299 1298027 1305778 1314218 1321681 1326999
58664A326999L498K739K792L480M990O959Q116P506N839M827N114N605N080L571
$$ 1326999 1330497 1333236 1336028 1339508 1344498 1351457 1359573 1367079 1372918 1377745 1382859 1388464 1393544 1397115
58650A397115J629q85m250p733j0148j1545j3275j6272j9797k2225k2794k2482
$$ 1397115 1398744 1397859 1393609 1385876 1375728 1364183 1350908 1334636 1314839 1292614 1269820 1247338
58638A247338k3094k5223k7260k7085k4644k1843j9810j7736j4887j2114j0331
$$ 1247338 1224244 1199021 1171761 1144676 1120032 1098189 1078379 1060643 1045756 1033642 1023311
58627A023311q982p444o741q049j0306j1070r334o105k760k25Q49O24L02N20K66
$$ 1023311 1014329 1006885 1000144 992095 981789 970719 961385 955280 952520 952295 953144 953768 954070 954590 954856
58612I54856j131j914J44M238P238P767P518Q331J0026J1425J1664J0007O049
$$ 954856 953725 951811 951955 956193 963431 971198 978716 987047 997073 1008498 1020162 1030169 1036218
58599A036218Q85l225n038n297n281n358n399n537o013o751p408p500o796n944
$$ 1036218 1037103 1033878 1028840 1023543 1018262 1012904 1007505 1001968 995955 989204 981796 974296 967500 961556
58585I61556o130p468q439p746n997m615l879l169k252j136M93K324K894J497
$$ 961556 955426 947958 939519 931773 925776 921161 917282 914113 911861 910725 911218 913542 916436 917933
58571I17933k21k74R13J362M13r96j999k073n50K190L938L139J324R76K010K651
$$ 917933 917712 917438 918351 919713 920126 919130 917131 915058 914508 916698 920636 923775 925099 926075 928085 930736
58555I30736K822L854N596O595O739O941O743N174L614M488P153Q325O932N278
$$ 930736 933558 937412 943008 949603 956342 963283 970026 975200 978814 983302 990455 998780 1005712 1010990
58541A010990M973M999M627N028O651P804P322O246N650N045M158M237O176R029
$$ 1010990 1015963 1020962 1025589 1030617 1037268 1045072 1052394 1058640 1064290 1069335 1073493 1077730 1083906 1092935
58527A092935J1502J3410J4858J5596J5796J6092J6399J6138J5569J5181J4183
$$ 1092935 1104437 1117847 1132705 1148301 1164097 1180189 1196588 1212726 1228295 1243476 1257659
58516A257659J1779R572R968J2369J3946J4269J5798J9348K2592K4097K5384K7653
$$ 1257659 1269438 1279010 1288978 1301347 1315293 1329562 1345360 1364708 1387300 1411397 1436781 1464434
58504A464434K9670L0558L1617L3438L3976L1512K7233K3072J9074J4714J0606
$$ 1464434 1494104 1524662 1556279 1589717 1623693 1655205 1682438 1705510 1724584 1739298 1749904
58493A749904P057K939k203o662q877r604j0382j1558j3107j5501j8393k0192
$$ 1749904 1756961 1759900 1757697 1751035 1742158 1732554 1722172 1710614 1697507 1682006 1663613 1643421
58481A643421k0408k0798k2884k5997k8670l0267l0367k8592k5988k4514k4269
$$ 1643421 1623013 1602215 1579331 1553334 1524664 1494397 1464030 1435438 1409450 1384936 1360667
58470A360667k3381k1323j9765j9213j7800j4786j2272j1726j1509r841p649o499
$$ 1360667 1337286 1315963 1296198 1276985 1259185 1244399 1232127 1220401 1208892 1199051 1191402 1184903
58458A184903o007n371n202n874o164n459n147n949o080m130j604n77p61r16j101
$$ 1184903 1178896 1173525 1168323 1162449 1156285 1150826 1145679 1139730 1133650 1129520 1127916 1127339 1126578 1125662 1124561
58443A124561j494r75J050L194M250M876N555N178L501K632L854N423N663N926
$$ 1124561 1123067 1122092 1123142 1126336 1130586 1135462 1141017 1146195 1149696 1152328 1156182 1161605 1167268 1173194
58429A173194P976J0659J1964J2376J3485J4946J5569J5894J7127J8732J9454
$$ 1173194 1181170 1191829 1203793 1216169 1229654 1244600 1260169 1276063 1293190 1311922 1331376
58418A331376J9477J9521J9041J7274J4756J2126Q832M678R86j345l243n536p560
$$ 1331376 1350853 1370374 1389415 1406689 1421445 1433571 1442403 1447081 1448067 1446722 1443479 1437943 1430383
58405A430383q857r848r664o321p41K756K238J188L179O815Q976R844J1099J1861
$$ 1430383 1421526 1411678 1402014 1395693 1394952 1397708 1399946 1401134 1404313 1411128 1420104 1429948 1441047 1452908
58391A452908J0361P487M935J788l472r201j2479j3344j3853j4277j3518j1962
$$ 1452908 1463269 1470756 1475691 1477479 1474007 1464806 1452327 1438983 1425130 1410853 1397335 1385373
58379A385373j0854r944q407o850n984m849k785j190r53l37K023M422N166N689
$$ 1385373 1374519 1364575 1356168 1349318 1343334 1338485 1335700 1334510 1333557 1333220 1335243 1339665 1344831 1350520
58365A350520P548R040Q253O844O984P035M298j42l386n434p796r432q481o330
$$ 1350520 1358068 1367108 1375361 1382205 1389189 1396224 1400522 1400380 1396994 1391560 1383764 1374332 1365851 1359521
58351A359521n745o354o089n490o380p729p007m386j774Q17M045O190N562M269
$$ 1359521 1353776 1347422 1341333 1335843 1329463 1321734 1314727 1310341 1308567 1309384 1313429 1319619 1325181 1329450
58337A329450N348P809Q803Q797R948J1071R354N773L913M450N437O670Q870J0028
$$ 1329450 1334798 1342607 1351410 1360207 1370155 1381226 1390580 1396353 1400266 1404716 1410153 1416823 1425693 1435721
58323A435721P940N201O169R856J1418J0048R533J1229J2386J1839J1827J3211
$$ 1435721 1443661 1448862 1455031 1464887 1476305 1486353 1495886 1507115 1519501 1531340 1543167 1556378
58311A556378J3873J2795J1526J0943J0528J0933J3261J5889J6169J5016J5559
$$ 1556378 1570251 1583046 1594572 1605515 1616043 1626976 1640237 1656126 1672295 1687311 1702870
58300A702870J7668J8288J6805J5483J4890J3576J2088J2551J4309J4552J3134
$$ 1702870 1720538 1738826 1755631 1771114 1786004 1799580 1811668 1824219 1838528 1853080 1866214
58289A866214J2430J2710J2246J1409J1981J3084J2639J2076J4268J7664J8160
$$ 1866214 1878644 1891354 1903600 1915009 1926990 1940074 1952713 1964789 1979057 1996721 2014881
58278B014881J6276J6496J9634K1974K2250K3284K5980K7492K6452K4678K2850
$$ 2014881 2031157 2047653 2067287 2089261 2111511 2134795 2160775 2188267 2214719 2239397 2262247
58267B262247J9615J5753J4150J4782J4564J2699J1534J2018J2949J4555J7813
$$ 2262247 2281862 2297615 2311765 2326547 2341111 2353810 2365344 2377362 2390311 2404866 2422679
58256B422679K0732K0536J8942J9762K2072K1891J9927K0962K5781L0271L2592
$$ 2422679 2443411 2463947 2482889 2502651 2524723 2546614 2566541 2587503 2613284 2643555 2676147
58245B676147L4691L6763L6903L6275L7970M0768M0798L9074M0235M4188M6591
$$ 2676147 2710838 2747601 2784504 2820779 2858749 2899517 2940315 2979389 3019624 3063812 3110403
58234C110403M7318N0346N5305N7509N6831N7867O0778O0801N7737N6899N9460
$$ 3110403 3157721 3208067 3263372 3320881 3377712 3435579 3496357 3557158 3614895 3671794 3731254
58223C731254O0882O0278O2041O6584O8929O8470P0657P6707Q1179Q2175Q4477
$$ 3731254 3792136 3852414 3914455 3981039 4049968 4118438 4189095 4265802 4346981 4429156 4513633
58212D513633Q9799R3591R4449R7271J03984J10339J14654J20300J27181J30755
$$ 4513633 4603432 4697023 4791472 4888743 4992727 5103066 5217720 5338020 5465201 5595956
58202E595956J32148J38442J49896J58007J59838J63046J72514J83412J92048
$$ 5595956 5728104 5866546 6016442 6174449 6334287 6497333 6669847 6853259 7045307
58193G045307K02235K15799K27867K36931K48862K65934K82753K97799L17443
$$ 7045307 7247542 7463341 7691208 7928139 8177001 8442935 8725688 9023487 9340930
58184I340930L43471L68464L89184M12726M43892M78361N13757N54842O02023
$$ 9340930 9684401 10052865 10442049 10854775 11298667 11777028 12290785 12845627 13447650
58175A3447650O47563O89012P33335P82281Q27955Q68880R15675R74471J039961
$$ 13447650 14095213 14784225 15517560 16299841 17127796 17996676 18912351 19886822 20926783
58166B0926783J110812J194857J291486J386419J472304J557071J644337J725247
$$ 20926783 22037595 23232452 24523938 25910357 27382661 28939732 30584069 32309316
58158C2309316J799000J881118J980829K090731K209137K350446K521959K713884
$$ 32309316 34108316 35989434 37970263 40060994 42270131 44620577 47142536 49856420
58150D9856420K924426L170144L459360L783252M147541M582765N106338N704747
$$ 49856420 52780846 55950990 59410350 63193602 67341143 71923908 77030246 82734993
58142H2734993O368498P109403P929234Q819174R817087J1018337J2498621J4269254
$$ 82734993 89103491 96212894 104142128 112961302 122778389 133796726 146295347 160564601
58134A60564601J6324552J8657903K1200171K3846071K6594330K9488390L2216801
$$ 160564601 176889153 195547056 216747227 240593298 267187628 296676018 328892819
58127C28892819L3851049L3241289K9760467K3565293J5204237N286193n331130
$$ 328892819 362743868 395985157 425745624 449310917 464515154 469801347 464470217
58120D64470217j5330178k3314830k8510821l1020652l1461676l0510684k8737206
$$ 464470217 449140039 425825209 397314388 366293736 334832060 304321376 275584170
58113B75584170k6593454k4369108k2180789k0069432j8083326j6253865j4561892
$$ 275584170 248990716 224621608 202440819 182371387 164288061 148034196 133472304
58106A33472304j2981195j1522281j0203497r016361p949741p015180o218795
$$ 133472304 120491109 108968828 98765331 89748970 81799229 74784049 68565254
58099F8565254n535199m934769m412445l967456l579288l227334k913825k645791
$$ 68565254 63030055 58095286 53682841 49715385 46136097 42908763 39994938 37349147
58091C7349147k412388k199626k010538j851799j715146j589155j475490j377603
$$ 37349147 34936759 32737133 30726595 28874796 27159650 25570495 24095005 22717402
58083B2717402j286458j192752j101518j020743r46762q73858q07050p52491p05418
$$ 22717402 21430944 20238192 19136674 18115931 17169169 16295311 15488261 14735770 14030352
58074A4030352o59719o19655n90462n66503n39926n12671m89602m68042m43906
$$ 14030352 13370633 12750978 12160516 11594013 11054087 10541416 10051814 9583772 9139866
58065I139866m20180m00012l79186l54229l30167l11798k95055k75357k56556
$$ 9139866 8719686 8319674 7940488 7586259 7256092 6944294 6649239 6373882 6117326
58056F117326k43086k30894k14926j98566j87159j78713j69184j60465j55237
$$ 6117326 5874240 5643346 5428420 5229854 5042695 4863982 4694798 4534333 4379096
58047D379096j50118j41791j33998j30792j28591j22420j14477j09166j04957
$$ 4379096 4228978 4087187 3953189 3822397 3693806 3571386 3456909 3347743 3242786
58038C242786r8393r1173q6347q2327p7065p3094p2193p0386o4733n9623n9507
$$ 3242786 3144393 3053220 2966873 2884546 2807481 2734387 2662194 2591808 2527075 2467452 2407945
58027B407945o0686n7491n1735m8715m8219m6740m4719m4416m4047m0913l7174
$$ 2407945 2347259 2289768 2238033 2189318 2141099 2094359 2049640 2005224 1961177 1920264 1883090
58016A883090l6087l5635l2250k7845k6750k8313k8602k7092k5993k5293k3909
$$ 1883090 1847003 1811368 1779118 1751273 1724523 1696210 1667608 1640516 1614523 1589230 1565321
58005A565321k3422k5351k7070k5485k2421k1451k1783k0395j7965j7577j9372
$$ 1565321 1541899 1516548 1489478 1463993 1441572 1420121 1398338 1377943 1359978 1342401 1323029
57994A323029k1016k1818k2262k1456j8932j6907j7044j7212j5073j2227j1268
$$ 1323029 1302013 1280195 1257933 1236477 1217545 1200638 1183594 1166382 1151309 1139082 1127814
57983A127814j1526j1333j1615j3390j4742j4066j3251j3958j4209j2514j1624
$$ 1127814 1116288 1104955 1093340 1079950 1065208 1051142 1037891 1023933 1009724 997210 985586
57972I85586j3786j5996j4798j2249j2064j3236j2813j1743j2294j2609r833o185
$$ 985586 971800 955804 941006 928757 916693 903457 890644 878901 866607 853998 844165 837980
57960H37980n811p638p343m753l354l771l617k843l528m908m106j543n13j626
$$ 837980 832169 824531 817188 812435 809081 805310 801693 798850 795322 790414 786308 784765 784252 782626
57946G82626k382k105k685m421n363m790l653k053J02Q15j586m599m226q30J737
$$ 782626 780244 778139 775454 771033 765670 760880 757227 755174 755276 756091 754505 749906 745680 744850 746587
57931G46587K032J733J281m84k545k253L5R99n40k354k911l089l413l181k697
$$ 746587 748619 750352 751633 751149 748604 746351 746386 747385 746845 744491 741580 738491 735078 731897 729200
57916G29200l095l674k487J39J820J821J577J552P94l41k48Q50R85j07n03M78
$$ 729200 726105 722431 719944 720083 721903 723724 725301 726853 727647 727306 727058 727908 728893 728786 728283 728761
57900G28761J094l8k196l948m458l541k232k607n044o790n486k877k223l328l430
$$ 728761 729855 729817 727621 723673 719215 715674 713442 710835 705791 699001 693515 690638 688415 685087 681657
57885F81657j952p66l68N68K066K764K928M264O653Q135Q090P597O786M944K949
$$ 681657 679705 678939 678571 679139 681205 683969 686897 691161 697814 705949 714039 721636 728422 733366 736315
57870G36315K373K320M10l094n412n708o022p426q473q132p416p317p592p972
$$ 736315 738688 741008 741418 738324 732912 727204 721182 713756 705283 697151 689735 682418 674826 666854
57856F66854q379p898n936m021l895m309k814j60O07o71r09J059K758K370J199
$$ 666854 658475 650577 644641 640620 636725 632416 629602 629442 630049 629378 628469 629528 632286 634656 635855
57841F35855O59L1j377k632l055l325l697l277j915o44K48J367K194J388m98j267
$$ 635855 636514 636545 635168 632536 629481 626156 622459 619182 617267 616623 616871 618238 620432 621820 621322 620055
57825F20055l70O05J001J741K670K338R89O57J665K188J818K186L293K950J153
$$ 620055 619685 620290 621291 623032 625702 628040 629029 629686 631351 633539 635357 637543 640836 643786 644939
57810F44939J088L982O593O149M494M659O142O581N802N276N095M324L141K366
$$ 644939 646027 650009 656602 662751 667245 671904 678046 684627 690429 695705 700800 705124 708265 710631
57796G10631J772P74r6o3N09R47J468K216K353J323l1p22q73q67o51p65k387n292
$$ 710631 712403 713177 713081 713018 713527 714474 715942 718158 720511 721834 721803 721081 720208 719341 718690 717925 715538 710246
57778G10246p352p198n816m346k226R42L500L761K634K324L287M217M296L802
$$ 710246 702894 695696 689880 685534 683308 684250 687750 691511 694145 696469 699756 703973 708269 712071
57764G12071K990J851P47K72N15J096J516J282M08j15N43J406N99j857l854m335
$$ 712071 715061 716912 717659 717931 718446 719542 721058 722340 722748 722633 723176 724582 725181 723324 719470 715135
57748G15135m689o164p773q044p315o806o683o437o169o130n795m661l345k914
$$ 715135 710446 704282 696509 688465 681150 674344 667661 661224 655055 648925 643130 638469 635124 632210
57734F32210l563m555m865l638q80J886K710J325p36k141k559j646Q72L733M847
$$ 632210 628647 624092 619227 615589 614709 616595 619305 620630 619894 617753 615194 613548 614420 618153 623000
57719F23000M084L511M100M314K915J057K21k3p20j529j693j599j919k308k311
$$ 623000 627084 630595 634695 639009 641924 642981 643202 643179 642459 640930 639237 637638 635719 633411 631100
57704F31100k450l260m289n011n447n034k563J518M473M511L249L337M909N983
$$ 631100 628650 625390 621101 616090 610643 605609 603046 604564 609037 613548 616797 620134 625043 631026
57690F31026N372L672K172K039L712O040P046O320N393N059M201K390J451K632
$$ 631026 636398 640070 642242 644281 647993 654033 661079 667399 672792 677851 682052 684442 685893 688525
57676F88525M173L801K080J112J275J458J389J462J290O12N89J990L132K045j76
$$ 688525 692698 696499 698579 699691 700966 702424 703813 705275 706565 707177 707766 709756 712888 714933 714757
57661G14757q03M27J308Q54K17l7p66j957k073n28J156J522R24M16K67K38K08
$$ 714757 713954 714381 715689 716543 716760 716723 715957 714000 711927 711399 712555 714077 715001 715417 715684 715922 716130
57644G16130N5j70J95J642L360M041L766L803M531N011M750M459M618M591L649
$$ 716130 716185 716015 716210 717852 721212 725253 729019 732822 737353 742364 747114 751573 756191 760782 764431
57629G64431J965K64p80o54O08K130L131M110O097Q869J1029J1916J2262J2919
$$ 764431 766396 766660 765880 765226 765834 767964 771095 775205 781302 790171 801200 813116 825378 838297
57615H38297J4172J6527K0801K6908L3489L9348M4478M9068N2181N2008M7130
$$ 838297 852469 868996 889797 916705 950194 989542 1034020 1083088 1135269 1187277 1234407
57604A234407L7378K3765P943q467k3953l6713m4931m8184m8038m6430m3842l9962
$$ 1234407 1271785 1295550 1303493 1295026 1271073 1234360 1189429 1141245 1093207 1046777 1002935 962973
57592I62973l5568l2211l0048k7415k3107j8021j3900j1260r183o734l914j474
$$ 962973 927405 895194 865146 837731 814624 796603 782703 771443 762260 755526 751612 750138
57580G50138k03k96j152j729j236K47J687J745O4k096l003k388j612j778k467
$$ 750138 749935 749639 748487 746758 745522 745769 747456 749201 749265 747169 744166 741778 740166 738388 735921
57565G35921k754k569k404k334k106j769j558j489j537j718j724j084j32M0r06
$$ 735921 733167 730598 728194 725860 723754 721985 720427 718938 717401 715683 713959 712875 712743 712783 711877
57550G11877j907j963j336n97M05J732K515K086J156P20N24k68j457j992j349
$$ 711877 709970 708007 706671 706074 706479 708211 710726 712812 713968 714688 715212 714944 713487 711495 710146
57535G10146J67J851K614J582m46j289k28P62J3j176p63N39M65j005j767j193
$$ 710146 710313 712164 714778 716360 715914 714625 714397 715159 715172 713996 713233 713772 714237 713232 711465 710272
57519G10272p61j033o95P43J619O08j270k211j798p54K65Q61Q16M29K02j8o46
$$ 710272 709511 708478 707783 708526 710145 710753 709483 707272 705474 704720 704985 705846 706662 707091 707293 707275 706629
57502G06629j164n66R28J934J862J446J239J041J056J977L520M402M405M744N757
$$ 706629 705465 704899 705827 707761 709623 711069 712308 713349 714405 716382 719902 724304 728709 733453 739210
57487G39210N920M253K280K109L613M899M983M726N350O959Q571R125Q431P238
$$ 739210 745130 749383 751663 753772 757385 762284 767267 771993 777343 784302 792873 801998 810429 817667
57473H17667O238N319M274L748M416N552N804N302N470O520O808N369L534L107
$$ 817667 823905 829224 833498 837246 841662 847214 853018 858320 863790 870310 877118 882487 886021 889128
57459H89128M143N458O371O903P110P125P296P645P753P666Q010Q683Q478O793
$$ 889128 893271 898729 905100 912003 919113 926238 933534 941179 948932 956598 964608 973291 981769 988562
57445I88562M857M271N030N881O156O283O722P159O738M937K383P63J236L004
$$ 988562 993419 997690 1002720 1008601 1014757 1021040 1027762 1034921 1041659 1046596 1048979 1049742 1050978 1053982
57431A053982M314M894O033Q003Q938P357M515K942L379M433M900N098N865P177
$$ 1053982 1058296 1063190 1069223 1077226 1086164 1093521 1098036 1100978 1104357 1108790 1113690 1118788 1124653 1131830
57417A131830Q100P777O426N322N561O768P533P254O838P306Q354Q840Q284P352
$$ 1131830 1139930 1147707 1154133 1159455 1165016 1171784 1179317 1186571 1193409 1200715 1209069 1217909 1226193 1233545
57403A233545P010P488Q127Q249Q146Q634R509R475Q267P615Q786J0336J0256
$$ 1233545 1240555 1248043 1256170 1264419 1272565 1281199 1290708 1300183 1308450 1316065 1324851 1335187 1345443
57390A345443R405J0238J2561J3512J2156J1081J2322J4394J4973J4202J3487
$$ 1345443 1354848 1365086 1377647 1391159 1403315 1414396 1426718 1441112 1456085 1470287 1483774
57379A483774J2941J2142J1921J3268J5420J6778J6908J6292J5185J4047J3818
$$ 1483774 1496715 1508857 1520778 1534046 1549466 1566244 1583152 1599444 1614629 1628676 1642494
57368A642494J4390J4145J2596J1836J3438J5569J5537J3874J3138J3703J3755
$$ 1642494 1656884 1671029 1683625 1695461 1708899 1724468 1740005 1753879 1767017 1780720 1794475
57357A794475J2959J3013J4489J5886J6335J6736J7635J8226J8091J7945J7972
$$ 1794475 1807434 1820447 1834936 1850822 1867157 1883893 1901528 1919754 1937845 1955790 1973762
57346A973762J7428J6554J6891J8752K0315K0365K0187K1413K3357K4075K3158
$$ 1973762 1991190 2007744 2024635 2043387 2063702 2084067 2104254 2125667 2149024 2173099 2196257
57335B196257K2020K1833K2358K2708K2465K2022K1982K2279K2075K1048K0222
$$ 2196257 2218277 2240110 2262468 2285176 2307641 2329663 2351645 2373924 2395999 2417047 2437269
57324B437269K0663K1703K1725K0599J9810K0188K0983K1586K2471K3842K4829
$$ 2437269 2457932 2479635 2501360 2521959 2541769 2561957 2582940 2604526 2626997 2650839 2675668
57313B675668K4890K4768K5149K5584K5651K5959K6936K7688K7386K6903K7707
$$ 2675668 2700558 2725326 2750475 2776059 2801710 2827669 2854605 2882293 2909679 2936582 2964289
57302B964289K9642L1186L1613L1579L1702L1735L1348L0776L0410L0341L0539
$$ 2964289 2993931 3025117 3056730 3088309 3120011 3151746 3183094 3213870 3244280 3274621 3305160
57291C305160L0988L1525L1985L2492L3220L3868L3863L3270L2981L3638L4656
$$ 3305160 3336148 3367673 3399658 3432150 3465370 3499238 3533101 3566371 3599352 3632990 3667646
57280C667646L4818L3855L2853L2818L3325L3176L2210L1543L2015L3280L4715
$$ 3667646 3702464 3736319 3769172 3801990 3835315 3868491 3900701 3932244 3964259 3997539 4032254
57269D032254L6190L7473L7897L7478L7332L7947L8061L6580L4715L4361L5088
$$ 4032254 4068444 4105917 4143814 4181292 4218624 4256571 4294632 4331212 4365927 4400288 4435376
57258D435376L4788L3126L2038L2566L3394L3280L2775L2491L1607K9667K8390
$$ 4435376 4470164 4503290 4535328 4567894 4601288 4634568 4667343 4699834 4731441 4761108 4789498
57247D789498K9793L3348L6506L7593L6938L5702L4852L4973L5842L6316L5586
$$ 4789498 4819291 4852639 4889145 4926738 4963676 4999378 5034230 5069203 5105045 5141361 5176947
57236E176947L4403L4086L4554L4327L2484K9825K7919K7645K8775L0389L1469
$$ 5176947 5211350 5245436 5279990 5314317 5346801 5376626 5404545 5432190 5460965 5491354 5522823
57225E522823L1508L0880L0628L1710L4252L7328L9685M1048M2544M5197M8177
$$ 5522823 5554331 5585211 5615839 5647549 5681801 5719129 5758814 5799862 5842406 5887603 5935780
57214E935780M9329M7555M3884L9975L6386L2628K8188K2940J7228J1891P773
$$ 5935780 5985109 6032664 6076548 6116523 6152909 6185537 6213725 6236665 6253893 6265784 6273557
57203F273557M941K905J600J388K100L127M665P718J2542J8235K4296L1274L9224
$$ 6273557 6278498 6281403 6283003 6284391 6286491 6289618 6294283 6302001 6314543 6332778 6357074 6388348 6427572
57190F427572M6870N3301N9227O5396P0743P3464P3217P1040O7638O2946N7001
$$ 6427572 6474442 6527743 6586970 6652366 6723109 6796573 6869790 6940830 7008468 7071414 7128415
57179G128415N0157M2578L4402K6132J8235J0660L286l602r815j5710k1550k6936
$$ 7128415 7178572 7221150 7255552 7281684 7299919 7310579 7313865 7310263 7300448 7284738 7263188 7236252
57167G236252l1247l4056l4920l3761l1726l0362k9418k6894k2054j6791j2884
$$ 7236252 7205005 7170949 7136029 7102268 7070542 7040180 7010762 6983868 6961814 6945023 6932139
57156F932139r456m671J309O761J0840J3983J6742J9544K2888K6430K8766K9237
$$ 6932139 6922683 6918012 6919321 6926082 6936922 6950905 6967647 6987191 7010079 7036509 7065275 7094512
57144G094512K8913K8566K7132K3712J9640J6514J3563R212M087M2k923o183r642
$$ 7094512 7123425 7151991 7179123 7202835 7222475 7238989 7252552 7261764 7265851 7265893 7262970 7256787 7247145
57131G247145j2039j3691j6371k0425k4316k6876k8016k7582k5686k3822k3338
$$ 7247145 7235106 7221415 7205044 7184619 7160303 7133427 7105411 7077829 7052143 7028321 7004983
57120G004983k3164k1260j7850j4779j2493j0631j1127j7170k8726m2131n4698
$$ 7004983 6981819 6960559 6942709 6927930 6915437 6904806 6893679 6876509 6847783 6805652 6750954
57109F750954o6871p9410r1352j01374j08598j11479j08588j00951r1099p9637
$$ 6750954 6684083 6604673 6513321 6411947 6303349 6191870 6083282 5982331 5891232 5811595
57099E811595o5556m9907l5825k4528j4770o599j922m82Q25L468N885P634J0900
$$ 5811595 5746039 5696132 5660307 5635779 5621009 5614410 5612488 5612006 5612831 5616299 5622184 5629818 5640718
57086E640718J6176K0498K2147K3491K7007L1908L6874M2529M9001N4448N8379
$$ 5640718 5656894 5677392 5699539 5723030 5750037 5781945 5818819 5861348 5910349 5964797 6023176
57075F023176O3110O9589P5286P8459Q0726Q2707Q0933P2113N7056L7507J2807
$$ 6023176 6086286 6155875 6231161 6309620 6390346 6473053 6553986 6626099 6683155 6720662 6733469
57064F733469j7300n0136q3691j19415j58667k00170k44051k94315l54016m21711
$$ 6733469 6716169 6666033 6582342 6462927 6304260 6104090 5860039 5565724 5211708 4789997
57054D789997m95418n75357o59920p44321q26728E78542d13028j062454j113537
$$ 4789997 4294579 3719222 3059302 2314981 1488253 578542 -413028 -1475482 -2589019
57045b589019j143698j152991j138319j102335j058712j021581r97490r93369
$$ -2589019 -3732717 -4885708 -6024027 -7126362 -8185074 -9206655 -10204145 -11197514
57037a1197514j019476j072144j121803j128646j062822r06484o59454l60261
$$ -11197514 -12216990 -13289134 -14410937 -15539583 -16602405 -17508889 -18168343 -18528604
57029a8528604p8691J36997K79140L08282Q8617n34480j577309k879671m214113
$$ -18528604 -18607295 -18470298 -18191158 -17882876 -17794259 -18328739 -19906048 -22785719 -26999832
57020b6999832n350665n992803n780554m522008k452650j77829J707068K948420
$$ -26999832 -32350497 -38343300 -44123854 -48645862 -51098512 -51276341 -49569273 -46620853
57012d6620853L632431L952143M024410L873304L497774K926754K238181J546685
$$ -46620853 -42988422 -39036279 -35011869 -31138565 -27640791 -24714037 -22475856 -20929171
57004b0929171R67284N79673M15522M61504O63685R41251J216357J438658J584553
$$ -20929171 -19961887 -19382214 -18966692 -18505188 -17841503 -16900252 -15683895 -14245237 -12660684
56995a2660684J645305J625865J547288J436592J312736J185911J064433R54031
$$ -12660684 -11015379 -9389514 -7842226 -6405634 -5092898 -3906987 -2842554 -1888523
56987a888523Q53807b74071D01805O02344N38051M78848M24389L76116L32456
$$ -1888523 -1034716 -274071 401805 1004149 1542200 2021048 2445437 2821553 3154009
56978C154009K91717K56811K31376K13758K00014J90088J85451J83413J79608
$$ 3154009 3445726 3702537 3933913 4147671 4347685 4537773 4723224 4906637 5086245
56969E086245J74148J69850J66356J61255J54930J48789J40465J25972J04723
$$ 5086245 5260393 5430243 5596599 5757854 5912784 6061573 6202038 6328010 6432733
56960F432733P7168L9910j0066o7001j18503j56152j79142j88688j85403j72733
$$ 6432733 6509901 6549811 6539745 6472744 6354241 6198089 6018947 5830259 5644856 5472123
56950E472123j56953j41713j26499j11178r7905q7710p9111p1068o4023n7727
$$ 5472123 5315170 5173457 5046958 4935780 4837875 4750165 4671054 4599986 4535963 4478236
56940D478236n1495m6725m5368m5674m3419l7827l2477k9757k8275k6484k4948
$$ 4478236 4426741 4380016 4334648 4288974 4245555 4207728 4175251 4145494 4117219 4090735 4065787
56929D065787k3848k1920j9207j7653j7671j7328j6169j6657k0351k5584l0568
$$ 4065787 4041939 4020019 4000812 3983159 3965488 3948160 3931991 3915334 3894983 3869399 3838831
56918C838831l6069m3312n1595n9551o6658p2156p4505p3372p0327o6613o2033
$$ 3838831 3802762 3759450 3707855 3648304 3581646 3509490 3434985 3361613 3291286 3224673 3162640
56907C162640n6829n2476m9650m7391m5269m4184m4184m3685m2147m1324m2633
$$ 3162640 3105811 3053335 3003685 2956294 2911025 2866841 2822657 2778972 2736825 2695501 2652868
56896B652868m5171m7672n0495n4429n9230o4482p0189p5424p8227p8008p6324
$$ 2652868 2607697 2560025 2509530 2455101 2395871 2331389 2261200 2185776 2107549 2029541 1953217
56885A953217p4152p0402o4373n7698n2205m7585m2797l8123l4095k9830k4376
$$ 1953217 1879065 1808663 1744290 1686592 1634387 1586802 1544005 1505882 1471787 1441957 1417581
56874A417581j8615j4113j1100r150q917j1397j6104k1546k7021l2672l8128m2410
$$ 1417581 1398966 1384853 1373753 1364603 1355686 1344289 1328185 1306639 1279618 1246946 1208818 1166408
56862A166408m4957m5918m5669m4731m3686m2684m1474m0160l9098l7826l5324
$$ 1166408 1121451 1075533 1029864 985133 941447 898763 857289 817129 778031 740205 704881
56851G04881l1833k9096k7994k7269k5501k3169k1564k0700j9546j7626j5321
$$ 704881 673048 643952 615958 588689 563188 540019 518455 497755 478209 460583 445262
56840D45262j3150j1654j1343j1897j1906j0210p051l416J55L489O375Q822J1077
$$ 445262 432112 420458 409115 397218 385312 375102 368051 364635 364790 368279 374654 383476 394553
56827C94553J2954J3862J3854J3703J3452J1963Q542M074j40l619o217p493p390
$$ 394553 407507 421369 435223 448926 462378 474341 482883 486957 486817 483198 476981 469488 462098
56814D62098o702o059n183l724j886K74L115O373R078J1160J3965J8294K3107
$$ 462098 455396 449337 444154 440430 438544 438818 441933 448306 457384 468544 482509 500803 523910
56801E23910K7044K9914L1563L0667K6193J9168J1439L334n906j5680k3472k6933
$$ 523910 550954 580868 612431 643098 669291 688459 699898 703232 697326 681646 658174 631241
56789F31241k5839k2055j8033j5041j2340q374k797L370R556J6233K3428L0050
$$ 631241 605402 583347 565314 550273 537933 529559 526762 530132 539688 555921 579349 609399
56777F09399L5618M1176M7352N2608N4608N2404M6086L5423K0468L065j3695k7530
$$ 609399 645017 686193 733545 786153 840761 893165 939251 974674 995142 998207 984512 956982
56765I56982l7741m4387m7660m7706m4525l8443l0991k4397j9488j4938r279k654
$$ 956982 919241 874854 827194 779488 734963 696520 665529 641132 621644 606706 597427 594773
56753E94773L977J0254J6029K0721K4136K6890K8858K8156K3061J4280M204n489
$$ 594773 598750 609004 625033 645754 669890 696780 725638 753794 776855 791135 795339 789850
56741G89850j4394k2418k9423l5248l9107l9601l6346l0896k5264k0382j6700
$$ 789850 775456 753038 723615 688367 649260 609659 573313 542417 517153 496771 480071
56730D80071j4913j4685j3824j0394m999L88M955R062J2514J4449J4465J2467
$$ 480071 465158 450473 436649 426255 421256 421644 426599 435661 448175 462624 477089 489556
56718D89556Q053J418n725j1451j5472j8528k0743k1823k2075k1840k0719j8699
$$ 489556 497609 499027 493302 481851 466379 447851 427108 405285 383210 361370 340651 321952
56706C21952j7126j6987j7126j5852j3462j1389r726p652n546m625m886n405o217
$$ 321952 304826 287839 270713 254861 241399 230010 220284 212632 207086 202461 197575 192170 185953
56693A85953p829r275q935p195o118o429o800o207n100m072l158k547k336j682
$$ 185953 178124 168849 159914 152719 146601 140172 133372 127165 122065 117993 114835 112288 109952 108270
56679A08270K4J462Q62j020j712p28m8o42j133n62J2k19k32Q63K089K283J896
$$ 108270 108294 109756 110618 109598 107886 107158 107110 106468 105335 104773 104785 104566 104334 105197 107286 109569 111465
56662A11465J833J783J095K58K56J051J741J781J366J022J095J250N66j115k255
$$ 111465 113298 115081 116176 116434 116690 117741 119482 121263 122629 123651 124746 125996 126562 125447 123192
56647A23192j213J427L499M055L979L875L231J992J207J445K013K287K574L149
$$ 123192 121979 123406 126905 130960 134939 138814 142045 144037 145244 146689 148702 150989 153563 156712
56633A56712L752M256M609M139K438R16J468L429M033K331M87M23J468K212K505
$$ 156712 160464 164720 169329 173468 175906 176822 178290 181719 185752 188083 188570 188993 190461 192673 195178
56618A95178K412J377j36k59J396K358P42j684j993l06P73Q1j021j120l35N14
$$ 195178 197590 198967 198831 198572 199968 202326 203068 201384 199391 199085 199858 199939 198918 197798 197463 197977
56602A97977R01P50N74J212K617L405K562R64J24J13j61r86j466q76N65K165L220
$$ 197977 198878 199628 200202 201414 204031 207436 209998 210962 211086 211199 211038 210052 208586 207710 208275 210440 213660
56585B13660L116J758j04j409j630j010k59p1m46n36K61J267J406Q10L71q7j488
$$ 213660 216776 218534 218430 217021 215391 214381 214122 214051 213605 213069 213330 214597 216003 216813 217184 217097 215609
56568B15609l389l992k789j382j058j318j493j982k783k734j400j24J42L19J125
$$ 215609 212220 208228 205439 204057 202999 201681 200188 198206 195423 192689 191289 191165 191307 191626 192751
56553A92751J289k23j854j408N85J715J076j81j122j854k267j803n63O77J515
$$ 192751 194040 193817 191963 190555 191140 192855 193931 193750 192628 190774 188507 186704 186141 186818 188333
56538A88333J924J658P89L81J227K289J804k00j784j513J28J781K742L203L687
$$ 188333 190257 191915 192704 193085 194312 196601 198405 198205 196421 194908 195036 196817 199559 202762 206449
56523B06449M333M566L729K179J079Q30O09r0m56L62J980L527M739N526N508M860
$$ 206449 210782 215348 219077 221256 222335 223165 223774 223684 223228 223590 225570 229097 233836 239362 244870 249730
56507B49730M651N380O097N843N091M939N863P887J0731J2983J2723J0010P278
$$ 249730 254381 259761 265858 271701 276792 281731 287594 295481 306212 319195 331918 341928 349206
56494C49206O161N631M453L362L011J915j030l710l392r97J49q86k092k301k485
$$ 349206 355367 360998 365451 368813 371824 373739 372709 368999 365607 364610 364759 363873 361781 359480 356995
56479C56995l106l070k008j357k211l796m689m251k630o84Q3j010k432k073j72
$$ 356995 353889 350819 348811 347454 345243 341447 336758 332507 329877 329193 329276 328266 325834 323761 323589
56464C23589J004M23o07q05o16r45j779k726l803n010n988o523o696o448n721
$$ 323589 324593 325016 324409 323604 322988 322043 320264 317538 313735 308725 302737 296214 289518 283070 277349
56449B77349m919m452m050l311k568k308k221j769j225j090j032m76L14Q58J350
$$ 277349 272430 267978 263928 260617 258049 255741 253520 251751 250526 249436 248404 247928 248242 249100 250450
56434B50450J840J506J47o18O12K698L488K769J807Q72m60j346m46J578K652K166
$$ 250450 252290 253796 253943 253325 253937 256635 260123 262892 264699 265571 265111 263765 263319 264897 267549 269715
56418B69715J211L83m13m68Q97K339J942M32K18J385J614K84m95L86J320R37Q8
$$ 269715 270926 271309 270896 270428 271325 273664 275606 276038 276256 277641 279255 279539 279044 279430 280750 281687 281775
56401B81775k93o41j052m90J018J705P91k93m81o27j238j090L22J228K55j239
$$ 281775 281482 280841 279789 279299 280317 282022 282813 282520 282039 281412 280174 279084 279406 280634 280889 279650
56385B79650j418p02l58n9J074K209J780j7j441j430k87J211K234K171J481J542
$$ 279650 278232 277530 277172 277113 278187 280396 282176 282159 280718 279288 279001 280212 282446 284617 286098 287640
56369B87640K726L636L141K000J466J392J019N86P92J404J667J557J500J432J071
$$ 287640 290366 294002 297143 299143 300609 302001 303020 303606 304398 305802 307469 309026 310526 311958 313029
56354C13029O91P65J347K282L400M049L356J592L09L87Q91O15j52l80J4K59Q5
$$ 313029 313720 314485 315832 318114 321514 325563 328919 330511 330820 331207 332098 332713 332561 332181 332195 332454 332539
56337C32539J05R87K646M128M308L149K108K592M120N005M553L493K454J437P36
$$ 332539 332644 333631 336277 340405 344713 347862 349970 352562 356682 361687 366240 369733 372187 373624 374360
56322C74360Q16J164P32k43m28M55J269J446J643K036J757N64n04o82k32O81K170
$$ 374360 375176 376340 377072 376829 376401 376856 378125 379571 381214 383250 385007 385571 385067 384385 384153 384834 387004
56305C87004L409K975J009n83n18Q61K980N382O524M763J146j089o04O73R22O58
$$ 387004 390413 393388 394397 393814 393296 394157 397137 402519 409043 413806 414952 413863 413259 413932 414854 415512
56289D15512P13N94J90O25K005K624J871J534K696L716L104K034K122K776K919
$$ 415512 416225 416819 417009 417634 419639 422263 424134 425668 428364 432080 435184 437218 439340 442116 445035
56274D45035L254M569N545M675K934K326K961L579L872M377N060N679O513P335
$$ 445035 448289 452858 458403 463078 466012 468338 471299 474878 478750 483127 488187 493866 500379 507714
56260E07714O977N246L860M098N016N330N291N273M594L398L681O280Q773Q667
$$ 507714 514691 519937 523797 527895 532911 538241 543532 548805 553399 556797 560478 566758 575531 584198
56246E84198P034O683Q192J0033J1179J1405J0324Q437P746R292J1307J1837J1634
$$ 584198 591232 597915 606107 616140 627319 638724 649048 657485 665231 674523 685830 697667 709301
56233G09301J2316J3430J3930J4896J7814K1261K2334K0692J8647J7814J8078
$$ 709301 721617 735047 748977 763873 781687 802948 825282 845974 864621 882435 900513
56222I00513J9191K1118K3231K5080K7240K9767L1053L0184K9125L0381L3633
$$ 900513 919704 940822 964053 989133 1016373 1046140 1077193 1107377 1136502 1166883 1200516
56211A200516L6812L9230M1416M3367M5376M8993N4646N9823O2522O4786O9663
$$ 1200516 1237328 1276558 1317974 1361341 1406717 1455710 1510356 1570179 1632701 1697487 1767150
56200A767150P6306Q1860Q6914R4749J05594J16016J24411J33063J43808J55126
$$ 1767150 1843456 1925316 2012230 2106979 2212573 2328589 2453000 2586063 2729871 2884997
56190B884997J64999J73813J82829J91738J99046K03605K04907K02873J97751
$$ 2884997 3049996 3223809 3406638 3598376 3797422 4001027 4205934 4408807 4606558
56181D606558J89369J76782J59551J38688J15101Q8188N7591K5362n609l4494
$$ 4606558 4795927 4972709 5132260 5270948 5386049 5474237 5531828 5557190 5551581 5517087
56171E517087o1963q7720j10718j30982j49072j64272j75375j82514j86391j86727
$$ 5517087 5455124 5367404 5256686 5125704 4976632 4812360 4636985 4454471 4268080 4081353
56161D081353j83493j78563j73798j68537j61321j53055j45922j40081j34018
$$ 4081353 3897860 3719297 3545499 3376962 3215641 3062586 2916664 2776583 2642565
56152B642565j27312j20510j13150j04507r5718q8648q3269p8235p3141o8127
$$ 2642565 2515253 2394743 2281593 2177086 2081368 1992720 1909451 1831216 1758075 1689948
56142A689948o2626n6804n2676n1167m9668m5279l8888l3133k8288k3502k0155
$$ 1689948 1627322 1570518 1517842 1466675 1417007 1371728 1332840 1299707 1271419 1247917 1227762
56131A227762j9895k0859j9922j7605j6666j6921j5765j2952j0583q977o822m761
$$ 1227762 1207867 1187008 1167086 1149481 1132815 1115894 1100129 1087177 1076594 1067617 1060795 1056034
56119A056034m474m686k538J378L755M023M569N846N923M964N360P152P912P585
$$ 1056034 1051560 1046874 1044336 1045714 1049469 1053492 1058061 1063907 1069830 1074794 1080154 1087306 1095218 1102803
56105A102803Q830J2033J4465J5218J6485J9133K1262K2028K2893K4355K5357
$$ 1102803 1111633 1123666 1138131 1153349 1169834 1188967 1210229 1232257 1255150 1279505 1304862
56094A304862K6376K8996L2241L3682L4358L7758M3583M7759M9512N3217O1727
$$ 1304862 1331238 1360234 1392475 1426157 1460515 1498273 1541856 1589615 1639127 1692344 1754071
56083A754071P2761Q3257R2586J00035J03971J05243J06731J08028J05240R7529
$$ 1754071 1826832 1910089 2002675 2102710 2206681 2311924 2418655 2526683 2631923 2729452
56073B729452Q8919Q1813P4001O4196N5295M9173M3046L4209K4374J6205R163
$$ 2729452 2818371 2900184 2974185 3038381 3093676 3142849 3185895 3220104 3244478 3260683 3269846
56062C269846J547o631j5157k4811l4992m3614n1078o0663p3115q4560r1716r5357
$$ 3269846 3271393 3264762 3249605 3224794 3189802 3146188 3095110 3034447 2961332 2876772 2785056 2689699
56050B689699r6983r6024r2237q7087q0849p2185o2006n3664m7817m1566l4104
$$ 2689699 2592716 2496692 2404455 2317368 2236519 2164334 2102328 2048664 2000847 1959281 1925177
56039A925177k8429k5700k2961j8429j4068j0862o765j649J211J154K155N955
$$ 1925177 1896748 1871048 1848087 1829658 1815590 1804728 1797963 1796314 1797525 1798679 1800834 1806789
56027A806789Q736P882O531P731R454R454R868J2650J5232J5262J5243J7942K1255
$$ 1806789 1815525 1823407 1829938 1837669 1847123 1856577 1866445 1879095 1894327 1909589 1924832 1942774 1964029
56014A964029K2178K2156K3928K6417K7119K6698K7302K8834L0259L1936L3875
$$ 1964029 1986207 2008363 2032291 2058708 2085827 2112525 2139827 2168661 2198920 2230856 2264731
56003B264731L4468L3392L2752L3631L4871L6494L9971M3844M4363M2008M1667
$$ 2264731 2299199 2332591 2365343 2398974 2433845 2470339 2510310 2554154 2598517 2640525 2682192
55992B682192M4597M6490M5615M5841M8785N0338M8729M8624N2774N6616N6102
$$ 2682192 2726789 2773279 2818894 2864735 2913520 2963858 3012587 3061211 3113985 3170601 3226703
55981C226703N4307N5220N7261N8131N9847O3929O7521O9212P2438P8473Q2710
$$ 3226703 3281010 3336230 3393491 3451622 3511469 3575398 3642919 3712131 3784569 3863042 3945752
55970C945752Q2966Q4410R0766R7642J00422J01790J05451J09390J11643J15772
$$ 3945752 4028718 4113128 4203894 4301536 4401958 4503748 4609199 4718589 4830232 4946004
55960D946004J24139J32543J37866J44018J54122J64239J71353J79710J92462
$$ 4946004 5070143 5202686 5340552 5484570 5638692 5802931 5974284 6153994 6346456
55951F346456K05099K14419K25571K42589K60496K74900K90756L12946L36888
$$ 6346456 6551555 6765974 6991545 7234134 7494630 7769530 8060286 8373232 8710120
55942H710120L57462L78628M05122M33435M60453M91894N32146N74665O12414
$$ 8710120 9067582 9446210 9851332 10284767 10745220 11237114 11769260 12343925 12956339
55933A2956339O48691O87902P25862P59784P97499Q45731R00048R57113J024433
$$ 12956339 13605030 14292932 15018794 15778578 16576077 17421808 18321856 19278969 20303402
55924B0303402J105535J188315J261746J331405J404997J476790J542019J612024
$$ 20303402 21408937 22597252 23858998 25190403 26595400 28072190 29614209 31226233
55916C1226233J698269J795818J899981K023557K178651K357530K551387K771213
$$ 31226233 32924502 34720320 36620301 38643858 40822509 43180039 45731426 48502639
55908D8502639L029829L323185L652921M046436M527946N089706N717257O418128
$$ 48502639 51532468 54855653 58508574 62555010 67082956 72172662 77889919 84308047
55900H4308047P198582Q046046Q973631J0051199J1351892J2902888J4727670
$$ 84308047 91506629 99552675 108526306 118577505 129929397 142832285 157559955
55893A57559955J6879741J9372433K2135688K5099263K8168390L0898998L2265283
$$ 157559955 174439696 193812129 215947817 241047080 269215470 300114468 332379751
55886C32379751L1091455K6911147K0282231J2169571L223400o149240j5216362
$$ 332379751 363471206 390382353 410664584 422834155 426057555 419908315 404691953
55879D04691953k2833989k8051113l0648065l1045098k9873338k7721582k5097973
$$ 404691953 381857964 353806851 323158786 292113688 262240350 234518768 209420795
55872B09420795k2387141j9795764j7402635j5256037j3386775j1771658j0356848
$$ 209420795 187033654 167237890 149835255 134579218 121192443 109420785 99063937
55865I9063937r113745q035789p101004o279847n566465m965616m459241m016362
$$ 99063937 89950192 81914403 74813399 68533552 62967087 58001471 53542230 49525868
55857D9525868l624704l284914k985308k709345k458084k240478k050191j873898
$$ 49525868 45901164 42616250 39630942 36921597 34463513 32223035 30172844 28298946
55849B8298946j713094j576320j458535j348497j248046j164555j092070j018711
$$ 28298946 26585852 25009532 23550997 22202500 20954454 19789899 18697829 17679118
55841A7679118r45688q81320q23218p63493p05046o56002o14065n72182n33692
$$ 17679118 16733430 15852110 15028892 14265399 13560353 12904351 12290286 11718104 11184412
55832A1184412n06027m84827m59827m31844m09073l90859l69710l45813l25525
$$ 11184412 10678385 10193558 9733731 9301887 8892814 8501955 8132245 7786432 7460907
55823G460907l08321k88327k66361k48331k34056k18941k04242j94836j89484
$$ 7460907 7152586 6864259 6597898 6349567 6115511 5896570 5692328 5497492 5308008
55814E308008j83475j77922j76431j75890j70740j63268j59472j57638j51301
$$ 5308008 5124533 4946611 4770180 4594290 4423550 4260282 4100810 3943172 3791871
55805C791871j40858j32212j26119j18637j10200j04891j02157r7943r2458q8846
$$ 3791871 3651013 3518801 3392682 3274045 3163845 3058954 2956797 2858854 2766396 2677550
55795B677550q6234q1936p8030p7774p8219p4512o8821o6580o6580o3493n7935
$$ 2677550 2591316 2509380 2431350 2353576 2275357 2200845 2132024 2065444 1998864 1935371 1877436
55784A877436n5071n4962n2933m8271m4347m1287l6597l1772l0500l1247k9243
$$ 1877436 1822365 1767403 1714470 1666199 1621852 1580565 1543968 1512196 1481696 1450449 1421206
55773A421206k4760k2172k2009k1290k0374k1903k4103k2798j9243j8478k0662
$$ 1421206 1396446 1374274 1352265 1330975 1310601 1288698 1264595 1241797 1222554 1204076 1183414
55762A183414k1415k0108k0244k1996k1811j9460j8455j9233j8645j6360j5271
$$ 1183414 1161999 1141891 1121647 1099651 1077840 1058380 1039925 1020692 1002047 985687 970416
55751I70416j5434j3896j0577q168o414k735J633K576K28j065J5O09k30m79k73
$$ 970416 954982 941086 930509 922341 915927 913192 914825 917401 917629 916564 916579 917188 916958 916479 916206
55736I16206j957m858n994o056q452j2397j3451j1329j0448j2003j2165r473p417
$$ 916206 914249 909391 903397 897341 888889 876492 863041 851712 841264 829261 817096 807623 800206
55723H00206p852q058o348m908m915m122j492P43J814M381R536J4271J6023J5683
$$ 800206 792354 784296 777948 773040 768125 764003 762511 763254 765068 769449 778985 793256 809279 824962
55709H24962J4147J0038K930m846j1539j7755k3444k6599k6596k5545k4907k3844
$$ 824962 839109 849147 852077 847231 835692 817937 794493 767894 741298 715753 690846 667002
55697F67002k1930k0448j9824j8819j7014j5294j3481j0636p774o861p001n465
$$ 667002 645072 624624 604800 585981 568967 553673 540192 529556 521782 514921 507920 502455
55685E02455k654j913l985n866n871n545n628m494j916m47j451l241m362n323
$$ 502455 499801 497888 493903 488037 482166 476621 470993 466499 464583 464136 462685 459444 455082 449759
55671D49759o076n426l955l991n547n851l926j936j152l82N21j88k123k123N49
$$ 449759 443683 438257 434302 430311 424764 418913 414987 413051 411899 411517 412038 411850 409727 407604 408153
55656D08153K482J650Q43L044O811Q919Q686P125M411P25k498m341n750p544q979
$$ 408153 410635 412285 413128 416172 422983 431902 440588 447713 452124 452849 450351 446010 440260 432716 423737
55641D23737r589j0179j0816j0174q132o518o004m812k143k50j269m048n948n968
$$ 423737 414148 403969 393153 382979 374847 368329 362325 357513 355370 355120 353851 349803 343855 337887
55627C37887m620k566p45k20n45Q5K115L788L801K913K145J382N99M94Q67L45
$$ 337887 333267 330701 329956 329736 329191 329276 331391 335179 338980 341893 344038 345420 346019 346513 347380 347725
55611C47725j423k944l035k134r88J80Q24L18o22o40P4L07M15J845M151N239M727
$$ 347725 346302 343358 340323 338189 337201 337381 338205 338523 337901 337261 337335 337642 338057 339902 344053 349292 354019
55594C54019M276M323L493J636M38L03l37j973l110l136l232l809l957m016n526
$$ 354019 358295 362618 366111 367747 368185 368488 368151 366178 363068 359932 356700 352891 348934 344918 339392
55579C39392p989q952q072p709q601q564o608m736m205l595k237j954l467m486
$$ 339392 331403 322451 314379 306670 298069 289505 282897 278161 273956 270361 268124 266170 262703 258217
55565B58217l573k652l416m225l184j560j541k816l742l904l552k457j094r52
$$ 258217 254644 251992 248576 244351 241167 239607 238066 235250 231508 227604 224052 221595 220501 219549
55551B19549k020k234q93p4j063k067j339R6P78J191J777J220j001k940l289l660
$$ 219549 217529 215295 214402 214328 213265 211198 209859 209955 210733 211924 213701 214921 213920 210980 207691 204031
55535B04031n342o441m877k001l55O6O41J122O42L1M58J179J019O29J033J533
$$ 204031 198689 192248 187371 185370 185015 185081 185722 186844 187486 187517 187975 189154 190173 190802 191835 193368
55519A93368J300J379K778M278M435M069M371M386L017J773K589M302M260K433
$$ 193368 194668 196047 198825 203103 207538 211607 215978 220364 223381 225154 227743 232045 236305 238738
55505B38738J034R39J038N76k33j252k068j504M91J571j39k972l922k909k315
$$ 238738 239772 240711 241749 242325 242092 240840 238772 237268 237759 239330 239191 236219 232297 229388 227073
55490B27073l065l788l564l028k760k584k533k827k938k089o37K69J36n63j089
$$ 227073 224008 220220 216656 213628 210868 208284 205751 202924 199986 197897 197260 197529 197665 197102 196013
55475A96013p98L45J127K34j407j241J056K377K84l603o028o092n062l846k732
$$ 196013 195215 195560 196687 196921 195514 194273 195329 197706 197990 194387 188359 182267 177205 173359 170627
55460A70627k225k302k020j221j108j810j523K50J037q33l082k842r55p6k85J05
$$ 170627 168402 166100 164080 162859 161751 159941 158418 158668 159705 158872 155790 152948 151993 151917 151632 151737
55444A51737Q93M79r67j887k140k551k560j169N44P68O8L69J514J687O75j89p29
$$ 151737 152630 153109 152142 150255 148115 145564 143004 141835 142379 143147 143215 143584 145098 146785 147460 147271 146542
55427A46542j659k159p58J633K621K145K279L354L331J444n45j372j814k475k495
$$ 146542 144883 142724 141966 143599 146220 148365 150644 153998 157329 158773 158228 156856 155042 152567 150072
55412A50072j466m96m92r91j362j638j722j249m83m0K57Q23R40l26k129k608j518
$$ 150072 148606 148110 147618 146627 145265 143627 141905 140656 140173 140133 140390 141213 142153 141827 139698 137090 135572
55395A35572k52N22J247J643P32j162k372k174j409p04J65R93R89J75m73l41N18
$$ 135572 135320 135842 137089 138732 139464 138302 135930 133756 132347 131643 131808 132801 133790 133965 133492 133151 133669
55378A33669J967L274K725l24l565m038j933O6P33J220K216K898K920L081L531
$$ 133669 135636 138910 141635 141311 137746 133708 131775 131841 132574 133794 136010 138908 141828 144909 148440
55363A48440L502L116L346L871L110Q47j205j837j421l62J451L253L657K770K078
$$ 148440 151942 155058 158404 162275 165385 166232 165027 163190 161769 161407 162858 166111 169768 172538 174616
55348A74616J938J158o00k186l065l760l938k583n79l38k022k894j616l51r48
$$ 174616 176554 177712 177112 174926 171861 168101 164163 161580 161001 160663 158641 155747 154131 153780 152832
55333A52832j802p83R64Q26j193k758k761k220k091k129j809r35N07K042K524
$$ 152832 151030 150247 151211 152037 150844 148086 145325 143105 141014 138885 137076 136141 136648 138690 141214
55318A41214J376l25r46j70R32J326P20o51k052k374j119P67J681J049j66o62
$$ 141214 142590 142265 141319 141149 142081 143407 144127 143476 141424 139050 137931 138698 140379 141428 141262 140600
55302A40600j89K70k83j543k109j207K80R84Q06P64J400K134K106J005p26k084
$$ 140600 140411 140681 140398 138855 136746 135539 135819 136803 137609 138373 139773 141907 144013 145018 144292 142208
55286A42208k168j186l06j16l1K44j20j416k203j255M00J038Q43J101J740J819
$$ 142208 140040 138854 138548 138432 138401 138645 138525 137109 134906 133651 134051 135089 135932 137033 138773 140592
55270A40592J677K219K661J522l93p85L82P19n82j420l72J039R86P4j20M74P74
$$ 140592 142269 144488 147149 148671 148278 147493 147875 148594 148012 146592 146220 147259 148245 148319 148199 148673 149447
55253A49447K80o95j537j502l78P26N80j22M64K382L630L228K361J840P57j296
$$ 149447 149727 149032 147495 145993 145615 146341 146921 146799 147263 149645 153275 156503 158864 160704 161461 160165
55237A60165k838k693j797j482j575j417j199j068m77M22L18r91j617l28J397
$$ 160165 157327 154634 152837 151355 149780 148363 147164 146096 145619 146041 146359 145368 143751 143423 144820
55222A44820J649Q57N12M63m58k141l480m121m225l223p45J824K566J623Q61J105
$$ 144820 146469 147326 147838 148301 147843 145702 142222 138101 133876 130653 129908 131732 134298 135921 136782 137887
55206A37887J273L45j107j768j065M17J471J322N05L24J162J938J620M95n81j327
$$ 137887 139160 139505 138398 136630 135565 135982 137453 138775 139280 139604 140766 142704 144324 144819 144238 142911
55190A42911j718j562j101j131j672j605n46J12o75j632r90O39J213N82P04K316
$$ 142911 141193 139631 138530 137399 135727 134122 133576 133688 133013 131381 130391 131030 132243 132825 133529 135845
55174A35845L519K439j34j884j845j005n09l81k09k18r54k057k244r35O28P18
$$ 135845 139364 141803 141669 139785 137940 136935 136426 136045 135836 135618 134664 132607 130363 129428 130056 130774
55158A30774p06k051k182j449n43N24J743K416J925O29n81j222j221o02K99P97
$$ 130774 130068 128017 125835 124386 123843 124367 126110 128526 130451 131080 130499 129277 128056 127454 127753 128550
55142A28550O30M13P88J394J189k37j944k395r87J162K348K280K216K801K845
$$ 128550 129180 129593 130381 131775 132964 132727 130783 128388 127401 128563 130911 133191 135407 138208 141053
55127A41053J317n63q01M47J229P67M7l58j023j915k028j263p54p65k01J056J462
$$ 141053 142370 141807 141006 141453 142682 143449 143496 143138 142115 140200 138172 136909 136155 135390 135189 136245 137707
55110A37707M46k69O96K336L210L574L987L577J702j39k86L15l64j986k254n21
$$ 137707 138153 137884 138580 140916 144126 147700 151687 155264 156966 156827 156541 156856 156492 154506 152252 151731
55094A51731J322J735J394J582K186K025M75j741l127k865j759j285j458p12J525
$$ 151731 153053 154788 156182 157764 159950 161975 162450 160709 157582 154717 152958 151673 150215 149503 151028
55079A51028L363K833P10o15l95J2l50p99m99K91R51J397J722J680J116M64L86
$$ 151028 154391 157224 157934 157319 156924 156936 156586 155787 155288 155579 156530 157927 159649 161329 162445 162909 163295
55062A63295R63J386O10j462l458l754k326p60k24k32J16O02M85J6K66J535K725
$$ 163295 164258 165644 166254 164792 161334 157580 155254 154494 154270 154038 154154 154756 155241 155257 155523 157058 159783
55045A59783K506P82j093j581n99L68J58m75k7J345J968J188K79L49Q02N99j75
$$ 159783 162289 163071 161978 160397 159798 160166 160324 159849 159822 161167 163135 164323 164602 164951 165753 166352 166177
55028A66177q67j273j306o23N09J013N41K37J041K134K078P08r69k012j866m02
$$ 166177 165310 164037 162731 162108 162617 163630 164171 164408 165449 167583 169661 170369 169400 167388 165522 165120
55012A65120J535K444J938J305J553J941J479O15K55N2q27j924k030j000J61P62
$$ 165120 166655 169099 171037 172342 173895 175836 177315 177930 178185 178237 177410 175486 173456 172456 172617 173379
54996A73379Q91P63N13K78j08r83j825j288Q74K879K947J400k48j365k147k351
$$ 173379 174270 175033 175546 175824 175716 174733 172908 171620 172494 175373 178320 179720 179472 178107 175960 173609
54980A73609j582m09R0l57j153j704j664q49L78J237J570J884K051J252k41r16
$$ 173609 172027 171618 171708 171351 170198 168494 166830 165981 166359 167596 169166 171050 173101 174353 174112 173196
54964A73196m97p00k221k952j029K015L297K493J401Q51L62kJ18q2j452k870k670
$$ 173196 172699 171999 169778 166826 165797 167812 171109 173602 175003 175854 176216 176214 176332 176250 174798 171928 169258
54947A69258j511j419k341k193l32J551K193K151K081J751J204J038J065N22k04
$$ 169258 167747 166328 163987 161794 161462 163013 165206 167357 169438 171189 172393 173431 174496 175018 174814
54932A74814J01J208J470N66J89J307K571K373R99j03m9J095K499K821J454j95
$$ 174814 174915 176123 177593 178159 178348 179655 182226 184599 185598 185495 185446 186541 189040 191861 193315 193120
54916A93120p0J611K418J114o99j097l74J8j64pQ93J848J972J051j99o09K48J320
$$ 193120 193050 194661 197079 198193 197494 196397 196023 196041 195877 195870 196763 198611 200583 201634 201435 200826 201074 202394
54898B02394J223P7o20k2J085J489R27Lo44q78j109j662j893o28J917L642L022
$$ 202394 203617 203694 203074 203052 204137 205626 206553 206556 205912 205034 203925 202263 200370 199742 201659 205301 208323
54881B08323J188K68M59L56m59j008p29n2O75J341J486J146J723M172O892P558
$$ 208323 209511 209779 210238 210594 210135 209127 208398 208346 209021 210362 211848 212994 214717 218889 225781 233339
54865B33339O585O413P610Q335P835P581Q282Q475P191N613M813L908J809q60
$$ 233339 239924 246337 253947 262282 270117 277698 285980 294455 301646 307259 312072 315980 317789 316929
54851C16929k960m462n808o985q099r379r966q378n002k285j553j481r02r74k973
$$ 316929 313969 309507 303699 296714 288615 279236 269270 260892 255890 253605 252052 250571 249669 248695 245722
54836B45722n577o321m629j866N99K018K047J380J621L348N133N540M928M306
$$ 245722 240145 233824 229195 227329 227928 229946 231993 233373 234994 238342 243475 249015 253943 258249
54822B58249L820L686N022P957J0181R475O792M884M533M229L051J714O20j085
$$ 258249 262069 265755 270777 278734 288915 298390 305182 310066 314599 318828 321879 323593 324213 323128
54808C23128l906o836q466q529p927p708q127q419p689o213n287n333n121l706
$$ 323128 319222 312386 303920 295391 287464 279756 271629 263210 255521 249308 244021 238688 233567 229861
54794B29861k194k343l853m567l368j555j010j904k798k522j410o60p76j048p16
$$ 229861 227667 225324 221471 216904 213536 211981 210971 209067 206269 203747 202337 201677 200901 199853 199137
54779A99137j22q3m94m92R4N67N53K76l77j671k739k086Q1J607J264K90O9m7j159
$$ 199137 199015 198932 198438 197946 198040 198607 199160 199436 199059 197388 194649 192563 192644 194251 195515 195805 195874 195827 194668
54760A94668k434k184n10Q28Q36J15m06l14M67J575K062J389M44O29K110L675
$$ 194668 192234 190050 189540 190368 191204 191319 190913 190599 191066 192641 194703 196092 196536 197165 199275 202950
54744B02950M158L420K179J377J444J783J466O20K86N60J44j539l017k703j010
$$ 202950 207108 210528 212707 214084 215528 217311 218777 219397 219683 220243 220387 218848 215831 213128 212118
54729B12118N94J661K450K547J530M51Q55K487L503K978J799J010O53M84P60J805
$$ 212118 212712 214373 216823 219370 220900 221351 222206 224693 228196 231174 232973 233983 234636 235120 235880 237685
54713B37685L547N636P532Q490Q138O975N835N025M523M615N545O731P064N931
$$ 237685 241232 246868 254400 262890 271028 278003 283838 288863 293386 298001 303546 310277 317341 323272
54699C23272L503L94k492m230m713m853n404o114o490o681o918o782n994n140
$$ 323272 326775 327169 324677 320447 315734 310881 305477 299363 292873 286192 279274 272492 266498 261358
54685B61358m748m328l356k399k037j497J90K223K837J804N45j06o61j360j336
$$ 261358 256610 252282 248926 246527 244490 242993 243183 245406 248243 250047 250592 250486 249825 248465 247129
54670B47129R6K463M818O590P536P734P722P910P795O684N013L911L430K445M87
$$ 247129 247225 249688 254506 261096 268632 276366 284088 291998 299793 306477 311490 315401 318831 321276 321763
54655C21763j476k578l314m649o576q222q994r085r002q943q506p093m730k286
$$ 321763 320287 317709 314395 309746 303170 294948 285954 276869 267867 258924 250418 243325 238595 236309
54641B36309o32P9O9n57j449j824j412j060j508k138j933j196j048j486j404m85
$$ 236309 235677 235756 235825 235268 233819 231995 230583 229523 228015 225877 223944 222748 221700 220214 218810 218325
54625B18325K94L38L25R63J738J604K82j498k720k899k401j955j579n93Q90J397
$$ 218325 218619 218957 219282 220245 221983 223587 223869 222371 219651 216752 214351 212396 210817 210224 211114 212511
54609B12511j4k083k932k625k544k736j937k28N73k51j175q77k6L85O95J290J319
$$ 212511 212497 210414 207482 204857 202313 199577 197640 197412 197985 197734 196559 195682 195656 196041 196736 198026 199345
54592A99345K52o63k21N83K26m82M85K772L651J956k18n92M59J253J437J662J628
$$ 199345 199597 198934 198713 199296 199522 199040 199525 202297 205948 207904 207686 207094 207553 208806 210243 211905 213533
54575B13533K65k311m440m700l123o77J533K482J726J40o79p0J232K386L234L449
$$ 213533 213798 211487 207047 202347 199224 198547 200080 202562 204288 204428 203749 203679 204911 207297 210531 213980
54559B13980K240j97j941j403N06J567J103K45k13n63q27l96O27J274J354J719
$$ 213980 216220 216023 214082 212679 213185 214752 215855 216100 215887 215324 214497 214101 214728 216002 217356 219075
54543B19075K322J711n94k742k864j597q65j088j108l01O55R50N17j33k18P61
$$ 219075 221397 223108 222514 219772 216908 215311 214446 213358 212250 211949 212604 213554 214071 213938 213720 214481
54527B14481K203K803K317J994K419K203J02k628l667k686j260m37j31n08j876
$$ 214481 216684 219487 221804 223798 226217 228420 228522 225894 222227 219541 218281 217844 217713 217205 215329
54512B15329l246k998j262L5k01j087j543j493r20O06K661L731L202K318K279
$$ 215329 212083 209085 207823 207858 207657 206570 205027 203534 202614 203220 205881 209612 212814 215132 217411
54497B17411K486J684J8j181j032K32J799K750K507J422N55L71J53p81j843j874
$$ 217411 219897 221581 221599 220418 219386 219618 221417 224167 226674 228096 228651 229022 229175 228394 226551 224677
54481B24677o40R45J922K038J647J331J534K190K666K326J137k90j206j274p51
$$ 224677 224037 224982 226904 228942 230589 231920 233454 235644 238310 240636 241773 241483 240277 239003 238252
54466B38252j58K95P33J046P06m60j748k250j810r06n5K25m76j647j782j56J851
$$ 238252 238094 238389 239122 240168 240874 240414 238666 236416 234606 233700 233645 233870 233394 231747 229965 229809 231660
54449B31660K408J729J440J705Q41j780m273m567k941j106J80J267K117K064J062
$$ 231660 234068 235797 237237 238942 239783 238003 233730 229163 226222 225116 225296 226563 228680 230744 231806
54434B31806N2j75J94N21O08P52J214J981K854L528L631L029K237K076K502K193
$$ 231806 231858 231683 231877 232398 233006 233758 234972 236953 239807 243335 246966 249995 252232 254308 256810 259003
54418B59003Q5k826m138k670M10L200M766M954L904K495K085K800L100K092J058
$$ 259003 259088 256262 252124 249454 249864 253064 257830 262784 266688 269183 271268 274068 277168 279260 280318
54403B80318J425K370K142P99l37j156k526l937l769k118j057j590k282j680l77
$$ 280318 281743 284113 286255 287054 286717 285561 283035 279098 275329 273211 272154 270564 268282 266602 266225
54388B66225K68K7m64p82p50l41q2p01k008l004l324l443l341k318n08Q66J239
$$ 266225 266493 266520 266056 265274 264524 264183 264101 263400 261392 258388 255064 251621 248280 245962 245454 246320 247559
54371B47559J388J848J958J158j5q97j468j556n83J148K192J815J025R61J416
$$ 247559 248947 250795 252753 253911 253896 252999 251531 249975 249392 250540 252732 254547 255572 256533 257949
54356B57949J642J469Q44n08k044k315r06P35J369J636K511L412L270K386J671
$$ 257949 259591 261060 261904 261396 259352 257037 256131 256866 258235 259871 262382 265794 269064 271450 273121
54341B73121J030K9n94R8J331J479O14M93J872L376L477K366J297Q54N58k14j332
$$ 273121 274151 274180 273586 273684 275015 276494 277108 277601 279473 282849 286326 288692 289989 290843 291401 291187 289855
54324B89855k025j755q77j22L86J059J918K540K969L663M340M075K900K084K197
$$ 289855 287830 286075 285198 285076 285462 286521 288439 290979 293948 297611 301951 306026 308926 311010 313207
54309C13207K179J232L73R65K575L605L259J803l65k681m093m036l384l380l920
$$ 313207 315386 316618 316991 317956 320531 324136 327395 329198 328833 326152 322059 318023 314639 311259 307339
54294C07339l890k906j755j338j821k495k138k55J632J104k004m820m914l225
$$ 307339 303449 300543 298788 297450 295629 293134 290996 290741 292373 293477 291473 286653 281739 278514
54280B78514k171k185j960j116m83j99M15J230J378R01O71P57M86m4j39j1l65
$$ 278514 276343 274158 272198 271082 270599 270400 270815 272045 273423 274324 274995 275752 276238 276194 276055 276044 275679
54263B75679o97MR21J39j995k774j218J68p63k451k140j26R36Q4r82q77k55j45
$$ 275679 274982 274986 275907 276046 274051 271277 270059 270227 269464 267013 264873 264747 265683 265767 264785 263908 263653 263508
54245B63508l04q8J82j47p81p38K57J463K144K200J654L75j170j593j6K377L345
$$ 263508 263204 263116 263298 263151 262370 261632 261889 263352 265496 267696 269350 269725 268555 266962 266946 269323 272668
54228B72668K275P78K48L7j066k667l353k858k292k326k358j477N48L116M843
$$ 272668 274943 275721 275969 276006 274940 272273 268920 266062 263770 261444 259086 257609 258157 261273 266116
54213B66116M229J433r60m27K193L473J717j045j982q09Q18J927K669K934K227
$$ 266116 270345 271778 270818 270391 272584 276057 277774 276729 274747 273938 274756 276683 279352 282286 284513
54198B84513Q98J18L60Q90J064J276K038K806K503R83o46j289r09k06L01M81K49
$$ 284513 285411 285529 285889 286779 287843 289119 291157 293963 296466 297449 296803 295514 294605 294399 294700 295181 295430
54181B95430m72j414j967j694o34P68J802J809Q99J30K52L80j052l834n602m631
$$ 295430 294958 293544 291577 289883 289249 290017 291819 293628 294527 294657 294909 295289 294237 290403 284801 280170
54165B80170k095o07j095k129k039o28J099K091J915R67J45L3L22K41n15j589
$$ 280170 278075 277468 276373 274244 272205 271577 272676 274767 276682 277649 277794 277827 278149 278390 277875 276286
54149B76286k421k692k464k129j974j675o41R47K059K029J265L82n80j553j942
$$ 276286 273865 271173 268709 266580 264606 262931 262290 263237 265296 267325 268590 268972 268392 266839 264897
54134B64897j509j056j248j304K7K463M300M468L596K907K783K647J883O06l78
$$ 264897 263388 262332 261084 259780 259807 262270 266570 271038 274634 277541 280324 282971 284854 285460 285082
54119B85082n25k52j79L8J079K185J520j123l492l726k603j798j364n09L78M31
$$ 285082 284557 284305 284126 284164 285243 287428 288948 287825 284333 280607 278004 276206 274842 274333 274711 275142
54103B75142J11L33N08m91j888j796j77J098J176R96J051N54o65j460j229o82
$$ 275142 275253 275586 276094 275603 273715 271919 271742 272840 274016 275012 276063 276617 275952 274492 273263 272581
54087B72581j77Q88K307K605J319O7J81Q15O05j46k76L08Q89J309J849K295K205
$$ 272581 272404 273292 275599 278204 279523 279590 279771 280586 281191 281045 280769 281077 281966 283275 285124 287419 289624
54070B89624J753J404J183Q70M68n0r60k221l128k925j390J294M486O917P556
$$ 289624 291377 292781 293964 294834 295302 295252 294292 292071 288943 286018 284628 285922 290408 297325 304881
54055C04881O851O152N836N182M142L584L421K339J32j422j167l76p52k048l151
$$ 304881 311732 317884 323720 328902 333044 336628 340049 342388 342520 341098 339931 339555 338803 336755 333604
54040C33604m032n040n484m781l883l724l166p31K336L162J267p95j111m99m16
$$ 333604 329572 324532 319048 314267 310384 306660 303494 302763 305099 308261 309528 308733 307622 307123 306707
54025C06707p30n71R2Q17J607K501K975K652K040J896K269K727L021L089K748
$$ 306707 305977 305406 305498 306315 307922 310423 313398 316050 318090 319986 322255 324982 328003 331092 333840
54010C33840J883P50k31p50n57M77J990L096L028J801J67q99p60M13J752K516
$$ 333840 335723 336473 336242 335492 334935 335412 337402 340498 343526 345327 345494 344595 343835 344248 346000 348516
53994C48516K844L312L872L816K890J853J550J887K269K762M157O681R253J0504
$$ 348516 351360 354672 358544 362360 365250 367103 368653 370540 372809 375571 379728 386409 395662 406166
53980D06166J0309R772R697R723R254Q584Q411Q631Q449P677P090P308P991Q427
$$ 406166 416475 426247 435944 445667 454921 463505 471916 480547 488996 496673 503763 511071 519062 527489
53966E27489Q320P761O907O026N324M523L044R40q86j577j104l9Q47P57n39k150
$$ 527489 535809 543570 550477 556503 561827 566350 569394 570334 569448 567871 566767 566728 567575 568332 567793 565643
53950E65643k950l186m071n610o285n627n407o954q711q329o251n110n963p240
$$ 565643 562693 559507 555436 549826 543541 537914 532507 525553 516842 508513 502262 497152 491189 483949
53936D83949p436o837o096m996l475k376k132j940j251j037k344m260m649k607
$$ 483949 476513 469676 463580 458584 455109 452733 450601 448661 447410 446373 444029 439769 435120 432513
53922D32513P17L535M839M696M017M022N181O613P029O133M483K270p41l995o064
$$ 432513 433230 436765 441604 446300 450317 454339 459520 466133 473162 479295 483778 486048 485307 481312 475248
53907D75248o385o197o796p577o947m959l506l540l509j584J451L034K230Q39
$$ 475248 468863 462666 455870 448293 441346 436387 432881 429341 425832 424248 425699 428733 430963 431802
53893D31802P72J705K181K002K273L454M643N011M982N458O509P438P847Q036
$$ 431802 432574 434279 436460 438462 440735 444189 448832 453843 458825 464283 470792 478230 486077 494113
53879D94113Q272Q231P526O537O276P169Q362Q552P420N910N060M973N054M997
$$ 494113 502385 510616 518142 524679 530955 538124 546486 555038 562458 568368 573428 578401 583455 588452
53865E88452N148N921P114P994Q128Q002Q610J0331J2449J3921J4288J3661J2262
$$ 588452 593600 599521 606635 614629 622757 630759 639369 649700 662149 676070 690358 704019 716281
53852G16281J0556R458R583J0324J0483R835R284R215Q570O310L072N59n68j323
$$ 716281 726837 736295 745878 756202 766685 776520 785804 795019 803589 809899 812971 813530 812962 811639
53838H11639k875m980o228n691m082l271m635p777j0850j2128j1438j0209j0185
$$ 811639 808764 803784 797556 791865 787783 784512 779877 772100 761250 749122 737684 727475 717290
53825G17290j1852j3958j4821j4132j3072j2555j2210j1461j0755j0696j0704
$$ 717290 705438 691480 676659 662527 649455 636900 624690 613229 602474 591778 581074
53814E81074r810q477q181r158j0014r683q516p160n728m560m413n217n873n931
$$ 581074 571264 562787 554606 545448 535434 525751 517235 510075 504347 499787 495374 490157 484284 478353
53800D78353o138o661o310m710l662m780o886p535o265m503k925j037Q61J438
$$ 478353 472215 465554 459244 454534 450872 446092 439206 431671 425406 420903 417978 416941 417802 419240
53786D19240M69n71p21q01j751k954l164k246j154o80q53j186j024l5J308K002
$$ 419240 419709 419138 418417 417616 415865 412911 409747 407501 406347 405667 404814 403628 402604 402569 403877 405879
53770D05879J533L20q79j507j240j36J067J453J036P46J153J805K158K389K798
$$ 405879 407412 407732 406853 405346 404106 403970 405037 406490 407526 408272 409425 411230 413388 415777 418575
53755D18575L172L410M149N735P002O332M039K531L431N602O872O978P331Q236
$$ 418575 421747 425157 429306 435041 442043 448375 452414 454945 458376 463978 470850 477828 485159 493395
53741D93395Q189O528N101N904Q257R943J0408J0750J0983R721P095N503O160
$$ 493395 501584 508112 513213 519117 527374 537317 547725 558475 569458 579179 586274 591777 597937
53728E97937O903N236K040J44K01L04p08j916k531l321m960o554o832n922n030
$$ 597937 604840 610076 612116 612260 612461 612765 612057 610141 607610 604289 599329 592775 585943 580021 574991
53713E74991m931n474o211o918p672q609r482r539q286o242m582m083m860o714
$$ 574991 570060 564586 558375 551457 543785 535176 525694 516155 507869 501627 497045 492962 488102 481388
53699D81388q954j0126q975n876k678r95j124k421l882m437l672k440k043k710
$$ 481388 472434 462308 453333 447457 444779 443784 442660 440239 436357 431920 428248 425808 423765 421055
53685D21055l524l723l197j846L12K241K395O39j355k140j969j688j233j82J019
$$ 421055 417531 413808 410611 408765 409077 411318 413713 414352 412997 410857 408888 407200 405967 405785 406804
53670D06804J428R19K60N3J82K89L91R34K270L954M811M159K801K129K328K382
$$ 406804 408232 409151 409411 409464 409646 409935 410326 411260 413530 417484 422295 426454 429255 431384 433712 436094
53654D36094J754J073R81J397K223L585N036N670N590N932O785O588M636K732
$$ 436094 437848 438921 439902 441299 443522 447107 452143 457813 463403 469335 476120 482708 487344 490076
53640D90076K829M202M772M286M177M734M646L430K296K103K136J597Q33M15K76
$$ 490076 492905 497107 501879 506165 510342 515076 519722 523152 525448 527551 529687 531284 532117 532532 532808
53625E32808M58J433K824K972J000j607k650j900q54l56K42J513K752K787J404
$$ 532808 533266 534699 537523 540495 541495 539888 537238 535338 534484 534128 534370 535883 538635 541422 542826
53610E42826l85j237n93Q05J687J721J790K476K868J724n42k073j733j39J465
$$ 542826 542441 541204 540611 541416 543103 544824 546614 549090 551958 553682 553140 551067 549334 549195 550660
53595E50660K361K256J227K15N47K194L272K170l86k222k224j075J19R85J736
$$ 550660 553021 555277 556504 556719 557266 559460 562732 564902 564516 562294 560070 558995 559114 560099 561835
53580E61835K740M263O094P396P438O401N014L739K824K696L422M187M272M168
$$ 561835 564575 568838 574932 582328 589766 596167 601181 604920 607744 610440 613862 618049 622321 626489
53566F26489M569M717L372J321Q88K578M141L944L279L923N117M978L768L412
$$ 626489 631058 635775 639147 640468 641356 643934 648075 652019 655298 659221 664338 669316 673084 676496
53552F76496M239M508L349K137K298L390M222M621N134N805O194O164N880N308
$$ 676496 680735 685243 688592 690729 693027 696417 700639 705260 710394 716199 722393 728557 734437 739745
53538G39745M338L215K422K067J801J315O79P4o56j858l380m372m219l417k835
$$ 739745 744083 747298 749720 751787 753588 754903 755582 755656 755000 753142 749762 745390 741171 737754 734919
53523G34919k402j457m04n85k092l168k700j916k272l018k617j518j411k225k185
$$ 734919 732517 731060 730656 730071 727979 724811 722111 720195 717923 714905 712288 710770 709359 707134 704949
53508G04949p94M69P10O53O55j41j723k273o50J822L251L490L268K552J388J040
$$ 704949 704155 704624 705334 705987 706642 706501 704778 702505 701855 703677 706928 710418 713686 716238 717626 718666
53492G18666K378M014M023K895K816M309N620N546M897M679M597M207M138N040
$$ 718666 721044 725058 729081 731976 734792 739101 744721 750267 755164 759843 764440 768647 772785 777825
53478G77825O350P090P325P904R177J0807J2493J4097J5268J5648J5547J5735
$$ 777825 784175 791265 798590 806494 815671 826478 838971 853068 868336 883984 899531 915266
53466I15266J6529J7560J8601K0040K2115K4077K4682K3623K2128K1829K3176
$$ 915266 931795 949355 967956 987996 1010111 1034188 1058870 1082493 1104621 1126450 1149626
53455A149626K5264K7257K9537L2951L7066L9986M0448L9478L9066L9411L8845
$$ 1149626 1174890 1202147 1231684 1264635 1301701 1341687 1382135 1421613 1460679 1500090 1538935
53444A538935L6839L5472L6590L8662L8572L6077L4201L4744L5808L4953L2821
$$ 1538935 1575774 1611246 1647836 1686498 1725070 1761147 1795348 1830092 1865900 1900853 1933674
53433A933674L1691L2000L2415L2483L2829L3166L2367L0594K9245K8560K7329
$$ 1933674 1965365 1997365 2029780 2062263 2095092 2128258 2160625 2191219 2220464 2249024 2276353
53422B276353K5369K4166K4375K4730K4416K4407K5074K4392K0564J5025J0817
$$ 2276353 2301722 2325888 2350263 2374993 2399409 2423816 2448890 2473282 2493846 2508871 2519688
53411B519688Q775P302N231K789L4l410o921r132j0200j2018j5426j8692j9902
$$ 2519688 2528463 2535765 2540996 2543785 2543819 2540409 2533488 2524356 2514156 2502138 2486712 2468020 2448118
53398B448118j9685k0230k2292k4530k5630k5826k6067k6624k7098k7263k7283
$$ 2448118 2428433 2408203 2385911 2361381 2335751 2309925 2283858 2257234 2230136 2202873 2175590
53387B175590k7160k6611k5582k4450k3415k2053j9915j7296j4843j2644j0320
$$ 2175590 2148430 2121819 2096237 2071787 2048372 2026319 2006404 1989108 1974265 1961621 1951301
53376A951301p985o203m879l099n35J915L567N171P727J0648J2413J2892J3670
$$ 1951301 1943316 1937113 1932234 1929135 1928600 1930515 1934082 1939253 1946980 1957628 1970041 1982933 1996603
53363A996603J5835J8519K0329K1399K3064K5905K9066L1637L3857L6492L9544
$$ 1996603 2012438 2030957 2051286 2072685 2095749 2121654 2150720 2182357 2216214 2252706 2292250
53352B292250M2209M4008M5310M6662M8252N0223N2771N5418N6975N7171N7719
$$ 2292250 2334459 2378467 2423777 2470439 2518691 2568914 2621685 2677103 2734078 2791249 2848968
53341B848968O0579O5245O9137P0818P1517P2976P5168P7086P8674Q0598Q2707
$$ 2848968 2909547 2974792 3043929 3114747 3186264 3259240 3334408 3411494 3490168 3570766 3653473
53330C653473Q4025Q4135Q3457Q2209Q0134P7394P4813P2862P1014O8425O4793
$$ 3653473 3737498 3821633 3905090 3987299 4067433 4144827 4219640 4292502 4363516 4431941 4496734
53319D496734O0290N5124M9475M3563L7555L1571K5872K0677J5648R896K790n365
$$ 4496734 4557024 4612148 4661623 4705186 4742741 4774312 4800184 4820861 4836509 4846405 4849195 4843830
53307D843830j3736k1882k9954l8025m5599n2050n7306o1758o5645o8887p1509
$$ 4843830 4830094 4808212 4778258 4740233 4694634 4642584 4585278 4523520 4457875 4388988 4317479
53296D317479p3773p5670p6816p7085p6868p6321p4818p1833o8066o4959o3323
$$ 4317479 4243706 4168036 4091220 4014135 3937267 3860946 3786128 3714295 3646229 3581270 3517947
53285C517947o3010o3637o4739o5344o4467o2233n9768n7735n5663n2917m9501
$$ 3517947 3454937 3391300 3326561 3261217 3196750 3134517 3074749 3017014 2961351 2908434 2858933
53274B858933m5678m1551l7415l3888l1266k9270k7607k6263k5063k3706k2520
$$ 2858933 2813255 2771704 2734289 2700401 2669135 2639865 2612258 2585995 2560932 2537226 2514706
53263B514706k2345k3286k4263k4288k3573k2781k1855k0213j7802j5300j3406
$$ 2514706 2492361 2469075 2444812 2420524 2396951 2374170 2352315 2332102 2314300 2299000 2285594
53252B285594j2217j1264r982q331o761n419l735j337J175L131M943P259R492
$$ 2285594 2273377 2262113 2252131 2243800 2237039 2231620 2227885 2226548 2227723 2230854 2235797 2243056 2252548
53239B252548J0725J1691J4036J7591K0398K1727K2993K5067K6981K8281L0293
$$ 2252548 2263273 2274964 2289000 2306591 2326989 2348716 2371709 2396776 2423757 2452038 2482331
53228B482331L3465L5514L4311L1025K8412K7151K6024K4396K2219J8591J2927
$$ 2482331 2515796 2551310 2585621 2616646 2645058 2672209 2698233 2722629 2744848 2763439 2776366
53217B776366P068L621K283K78l486p149r316j1265j4662j8919k2401k5029k8179
$$ 2776366 2783434 2787055 2789338 2789616 2786130 2778981 2769665 2758400 2743738 2724819 2702418 2677389 2649210
53204B649210l2391l6438l8732l9123l9017l9827m1550m3254m4645m6209m7639
$$ 2649210 2616819 2580381 2541649 2502526 2463509 2423682 2382132 2338878 2294233 2248024 2200385
53193B200385m7570m5713m3867m3468m3337m1582l8809l7374l7930l8800l8674
$$ 2200385 2152815 2107102 2063235 2019767 1976430 1934848 1896039 1858665 1820735 1781935 1743261
53182A743261l7895l6993l5809l4482l3617l2986l1573k9359k7627k7015k6599
$$ 1743261 1705366 1668373 1632564 1598082 1564465 1531479 1499906 1470547 1442920 1415905 1389306
53171A389306k5407k3677k2105k0968k0409k0454k0453j9540j7946j6823j6667
$$ 1389306 1363899 1340222 1318117 1297149 1276740 1256286 1235833 1216293 1198347 1181524 1164857
53160A164857j7078j8056k0024k2346k3487k3066k2273k1796k0968j9622j9004
$$ 1164857 1147779 1129723 1109699 1087353 1063866 1040800 1018527 996731 975763 956141 937137
53149I37137j9779k0564j9735j7603j5682j4804j4962j6052j7550j8256j7439
$$ 937137 917358 896794 877059 859456 843774 828970 814008 797956 780406 762150 744711
53138G44711j5839j4786j4802j5632j6733j7096j5542j2176q878p469p884q783
$$ 744711 728872 714086 699284 683652 666919 649823 634281 622105 613227 605758 597874 589091
53126E89091r204q849p594n846m781n279o801q105q627q607q234p476o381m978
$$ 589091 579887 571038 563444 557598 552817 547538 540737 532632 524005 515398 507164 499688 493307 488329
53112D88329l225j438l90m54j082j524j626j610j578j645j969k358k426k308k485
$$ 488329 485104 483666 483276 482822 481740 480216 478590 476980 475402 473757 471788 469430 467004 464696 462211
53097D62211k759k371j467j229j962k258j005P58J108k92j975k457j458K56J487
$$ 462211 459452 457081 455614 454385 452423 450165 449160 449918 451026 450734 448759 446302 444844 445100 446587
53082D46587J480O33n3l87j085k118k203o60J349K333K237J765R47l26j162m06
$$ 446587 448067 448700 448647 448260 447175 445057 442854 442194 443543 445876 448113 449878 450825 450499 449337 448931
53066D48931J807M314O151O690N375K610L10J45J493K341J921J201R95R99P72
$$ 448931 450738 455052 461203 467893 473268 475878 476188 476333 477826 480167 482088 483289 484284 485283 486055
53051D86055N06N26P54Q46L19j298l668n328n070l537k578l060m108m447l719
$$ 486055 486561 487087 487841 488687 489006 487708 484040 478712 473642 470105 467527 464467 460359 455912 452193
53036D52193k424j254o99p74j123j535k039k267j425L85J524N24j910l631l579
$$ 452193 449769 448515 447816 447042 445919 444384 442345 440078 438653 439038 440562 441086 439176 435545 431966
53021D31966k573j746j251p72l80m03p87r23j42J516L026L331K556J676Q46p54
$$ 431966 429393 427647 426396 425624 425244 424841 424054 423131 422989 424505 427531 430862 433418 435094 435940 435186
53005D35186l084m540m065k804k413k677k292j179l98k68k66m14j084j561n86
$$ 435186 432102 427562 423497 420693 418280 415603 413311 412132 411734 411466 411200 410786 409702 408141 407555
52990D07555J503K832K493J487Q60L79l31q16o57k82n9M13J323J802R88o33j723
$$ 407555 409058 411890 414383 415870 416730 417109 416778 415962 415305 415023 414964 415377 416700 418502 419490 418857 417134
52973D17134j656q78M6J146K613M001M211K631K12j202q79N7K64k32o70q42p98
$$ 417134 415478 414600 414646 415792 418405 422406 426617 429248 429460 428258 427379 427436 427700 427468 426798 425956 425158
52956D25158j19J198J890R62m33l76R20J425M92k97J50R04R16O48Q02Q83K88l31
$$ 425158 425039 426237 428127 429089 428656 428280 429200 430625 431117 430820 430970 431874 432790 433438 434240 435123 435411 435080
52938D35080L5J251K318K585J937O14n28l86J022K296K376J701J163Q81P52J128
$$ 435080 435115 436366 438684 441269 443206 443820 443292 442906 443928 446224 448600 450301 451464 452345 453097 454225
52922D54225K028K577K218J665J689J832J397P97P00O13k53j331j483j006j164
$$ 454225 456253 458830 461048 462713 464402 466234 467631 468428 469128 469741 469488 468157 466674 465668 464504
52907D64504j859j506M32K444L035K451J717J164P64Q04J095L91k036m719n336
$$ 464504 462645 461139 461571 464015 467050 469501 471218 472382 473146 473950 475045 475436 473400 468681 463345
52892D63345l738k157k045k197j000O70N39j530l017k179k50P71R87J632K240
$$ 463345 459607 457450 455405 453208 452208 452878 453417 451887 448870 446691 446441 447212 448199 449831 452071
52877D52071J042j840l677k420O60K653K336Q17m46j110j593k188k619k250q21
$$ 452071 453113 451273 447596 445176 445836 448489 450825 451642 451196 450086 448493 446305 443686 441436 440615
52862D40615R20J747J420J013J417K055J750L98q92j222q46p32j484k660k999
$$ 440615 441535 443282 444702 445715 447132 449187 450937 451335 450443 449221 448375 447643 446159 443499 440500
52847D40500j604Q81K727L030K595K531K598J839L74n16j87L95k6j299k065j430
$$ 440500 438896 439777 442504 445534 448129 450660 453258 455097 455471 454955 454768 455163 455137 453838 451773 450343
52831D50343M4J177J577J876K615L378L361K483J383M76l63j234j887k103j860
$$ 450343 450387 451564 453141 455017 457632 461010 464371 466854 468237 468713 468350 467116 465229 463126 461266
52816D61266j069K32J305J182P4m57P51L033M739M983L990K321M90j027k103l127
$$ 461266 460197 460429 461734 462916 462990 462533 463284 466317 471056 476039 480029 482350 482840 481813 479710 476583
52800D76583m292n028m689l581k667k379k331k134j903j933k261k654k810k687
$$ 476583 472291 467263 462574 458993 456326 453947 451616 449482 447579 445646 443385 440731 437921 435234
52786D35234k769l631m987n642m844l246j947j017K48J807K594J893L75n90k84
$$ 435234 432465 428834 423847 418205 413361 410115 408168 407151 407399 409206 411800 413693 414068 413478 413194
52771D13194P86J456J049J11j81N15J249J142O55P91J435J510O23m51j078j523
$$ 413194 413980 415436 416485 416596 416415 416930 418179 419321 419976 420767 422202 423712 424335 423884 422806 421283
52755D21283k017j987r69K73M57n46j376o89J372L356L935K979J319k73j668l079
$$ 421283 419266 417279 416310 416583 417040 416494 415118 414429 415801 419157 423092 426071 427390 427117 425449 422370
52739D22370m487n524n610m240j575J084K069J201K94R82K404K222j59k605k934
$$ 422370 417883 412359 406749 402509 400934 402018 404087 405288 405582 406564 408968 411190 411031 408426 405492
52724D05492j413J65R31J289J424Q68k92r99n65L19O18L94M29O74J15j555k987
$$ 405492 404079 404244 405175 406464 407888 408756 408464 407465 406900 407219 407837 408231 408660 409334 409449 407894 404907
52707D04907k647q32N96M97k55j11J119K141J922R16L91Q84J703J867J264O36
$$ 404907 402260 401428 402024 402521 402266 402155 403274 405415 407337 408253 408644 409528 411231 413098 414362 414998
52691D14998O08R96J264J391J860K853L863M178L505K094O18n2N11J667K153J493
$$ 414998 415606 416602 417866 419257 421117 423970 427833 432011 435516 437610 438228 438176 438687 440354 442507 444000
52675D44000O06O18J542K563L205L469L020J327j129k594j761N56K103J604p3
$$ 444000 444606 445224 446766 449329 452534 456003 459023 460350 459221 456627 454866 455422 457525 459129 459056
52660D59056j298j648j943k609k950k357j430j160j457j448r92q45j228j378q97
$$ 459056 457758 456110 454167 451558 448608 446251 444821 443661 442204 440756 439764 438919 437691 436313 435416
52645D35416m11k98K14J722L295L665L014K357J631j1k211l281k467r15OJ47j55
$$ 435416 435005 434707 434921 436643 439938 443603 446617 448974 450605 450594 448383 445102 442635 441720 441726 441873 441718
52628D41718r20j779j561J53J834J601l09j822j584j92J017J411J145O04J54q4
$$ 441718 440798 439019 437458 437611 439445 441046 440737 438915 437331 437139 438156 439567 440712 441316 441470 441386
52612D41386l52p37o70L93J818K195J177J02K43J098J108k22j702j787J9K956
$$ 441386 441034 440297 439627 440020 441838 444033 445210 445312 445555 446653 447761 447539 445837 444050 444069 447025
52596D47025N580O532N432L335J856J577J636J119L48K37P19O61n18j928k379
$$ 447025 452605 459137 464569 467904 469760 471337 472973 474092 474440 474677 475396 476057 475539 473611 471232
52581D71232j986j850k353k621j914p44lM79J647L562N003M980L950L055K686
$$ 471232 469246 467396 465043 462422 460508 459764 459761 460240 461887 465449 470452 475432 479382 482437 485123
52566D85123K392J776P94n92k298l674l953l283k673k717k909k460j198M73J938
$$ 485123 487515 489291 490085 489493 487195 483521 479568 476285 473612 470895 467986 465526 464328 464801 466739
52551D66739K422J441l29j395j200p97j084j227MK004K896K104Q54R4m86j072
$$ 466739 469161 470602 470273 468878 467678 466881 465797 464570 464574 466578 469474 471578 472432 472526 472040 470968
52535D70968r82r3M18j65p06J69J994L279L612L529K936J395k52l64J011J928
$$ 470968 469986 469893 470311 470146 469440 469609 471603 474882 478494 482023 484959 486354 486102 485738 486749 488677
52519D88677J334N49R87J845J405k66j561j809j964k673l139k462j236q88j830
$$ 488677 490011 490560 491547 493392 494797 494531 492970 491161 489197 486524 483385 480923 479687 478799 476969
52504D76969k911k691r49J095J929J155k59j198j687k501l688m205l258j384K97
$$ 476969 474058 471367 470418 471513 473442 474597 474338 473140 471453 468952 465264 461059 457801 456417 456714
52489D56714J411K244K674K132P62k32J37J410K201J712L68r06j571j596j131
$$ 456714 458125 460369 463043 465175 465937 465705 465842 467252 469453 471165 471533 470627 469056 467460 466329
52474D66329l16N90J191J310J305J727K515K842K127R53M73J021J877K437K876
$$ 466329 466013 466603 467794 469104 470409 472136 474651 477493 479620 480573 481046 482067 483944 486381 489257
52459D89257L435L752L363K412J373M70j43j07O86J597J877J558J222J120J064
$$ 489257 492692 496444 499807 502219 503592 504062 503919 503812 504498 506095 507972 509530 510752 511872 512936
52444E12936J029J110J105O92K2n70j241k292l153k704r64L69l27k627m406m081
$$ 512936 513965 515075 516180 516872 516894 516324 515083 512791 509638 506934 505970 506339 506012 503385 498979 494898
52428D94898k174n60l81j002j184q76j049j814j980r88m5k12m96N46K132K209
$$ 494898 492724 492164 491783 490781 489597 488721 487672 485858 483878 482890 482845 482633 482137 482683 484815 487024
52412D87024P74N1J202K957M016M644N040M317K505J615K881M508M133K242R67
$$ 487024 487798 487849 489051 492008 496024 500668 505708 510025 512530 514145 517026 521534 525667 527909 528876
52397E28876N10p60l047m544m327l597l412l164k215j353j504k126k080j303o37
$$ 528876 529386 528626 525579 521035 516708 513111 509699 506535 504320 502967 501463 499337 497257 495954 495317
$$ [...]
##END NTUPLES=NMR SPECTRUM
##END=
