
##TITLE=UV1012_M1-1003-1002_6269707_agI7hXAEby
##JCAMPDX= 6.0         $$ Bruker NMR JCAMP-DX V2.0
##DATA TYPE= NMR SPECTRUM
##DATA CLASS= NTUPLES
##ORIGIN= BRUKER
##OWNER= Administrator
$$ 1.72 TOPSPIN		Version 2.1
$$ 2012-06-07 06:40:57.890 -0500  Administrator@TOPSPIN
$$ Compression mode = diff/dup
##.OBSERVE FREQUENCY= 400.13188235
##.OBSERVE NUCLEUS= ^1H
##.ACQUISITION MODE= SIMULTANEOUS (DQD)
##.ACQUISITION SCHEME= undefined
##.AVERAGES= 8
##.DIGITISER RES= 22
##SPECTROMETER/DATA SYSTEM= spect
##.PULSE SEQUENCE= zg30
##.SOLVENT NAME= COFFEE_meoh
##.SHIFT REFERENCE= INTERNAL, COFFEE_meoh, 1, 14.98061
##AUDIT TRAIL= $$ (NUMBER, WHEN, WHO, WHERE, PROCESS, VERSION, WHAT)
$$ ##TITLE= Audit trail, TOPSPIN		Version 2.1
$$ ##JCAMPDX= 5.01
$$ ##ORIGIN= Bruker BioSpin GmbH
$$ ##OWNER= Administrator
$$ $$ C:\Bruker\TOPSPIN/data/COFFEE/nmr/UV1012_M1-1003-1002_6269707_agI7hXAEby/20/pdata/1/auditp.txt
$$ ##AUDIT TRAIL=  $$ (NUMBER, WHEN, WHO, WHERE, PROCESS, VERSION, WHAT)
(   1,<2012-06-07 06:40:49.765 -0500>,<Administrator>,<TOPSPIN>,<go>,<TOPSPIN 2.1>,
      <created by zg
	started at 2012-06-07 06:39:43.343 -0500,
	POWCHK enabled, PULCHK disabled,
       configuration hash MD5:
       D5 CA 7A 23 FE 6B EE E2 50 67 74 61 24 F7 5E 3B
       data hash MD5: 64K
       0E A1 07 91 17 E0 DC 20 E9 01 95 FD 96 64 D5 33>)
(   2,<2012-06-07 06:40:53.859 -0500>,<Administrator>,<TOPSPIN>,<proc1d>,<TOPSPIN 2.1>,
      <Start of raw data processing
       efp LB = 0 FT_mod = 6 PKNL = 1 PHC0 = 0 PHC1 = 0 SI = 32K 
       data hash MD5: 32K
       7E 3F 28 80 09 EC 6E F5 27 45 7E B7 96 AE A3 9F>)
(   3,<2012-06-07 06:40:54.156 -0500>,<Administrator>,<TOPSPIN>,<proc1d>,<TOPSPIN 2.1>,
      <pk PHC0 = 209.3555 PHC1 = 0 
       data hash MD5: 32K
       63 ED 87 49 1B 90 D9 3E 7D 2C F7 56 A6 B3 1F 0D>)
(   4,<2012-06-07 06:40:54.218 -0500>,<Administrator>,<TOPSPIN>,<proc1d>,<TOPSPIN 2.1>,
      <abs ABSG = 1 
       data hash MD5: 32K
       68 16 F0 E1 0E E0 74 53 19 EA B4 0E A1 9E E6 C5>)
(   5,<2012-06-07 06:40:54.250 -0500>,<Administrator>,<TOPSPIN>,<proc1d>,<TOPSPIN 2.1>,
      <abs ABSG = 2 
       data hash MD5: 32K
       5C 6A 37 9E DB 5C CD 8D 76 FE 8E 55 C8 81 C4 BA>)
(   6,<2012-06-07 06:40:54.281 -0500>,<Administrator>,<TOPSPIN>,<proc1d>,<TOPSPIN 2.1>,
      <abs ABSG = 3 
       data hash MD5: 32K
       34 FA 7A 89 B2 A9 97 41 91 29 2D 83 8C 8B 7F 71>)
(   7,<2012-06-07 06:40:54.312 -0500>,<Administrator>,<TOPSPIN>,<proc1d>,<TOPSPIN 2.1>,
      <abs ABSG = 4 
       data hash MD5: 32K
       CA A6 DD D3 B7 AA C3 6A F1 F6 0E 91 5F 67 90 E2>)
(   8,<2012-06-07 06:40:54.343 -0500>,<Administrator>,<TOPSPIN>,<proc1d>,<TOPSPIN 2.1>,
      <abs ABSG = 5 
       data hash MD5: 32K
       0D D9 8A 91 1E B8 D6 9D 98 30 C4 95 83 F3 C6 36>)
$$ ##END=
$$ 
$$ $$ hash MD5
$$ $$ 2D 8A 43 B2 D4 39 78 F2 70 07 8D 44 4E 27 FD B1
##$RELAX= 
##$RELAX= 
##$RELAX= 
##$RELAX= 
##$RELAX= 
##$RELAX= 
##$RELAX= 
$$ Bruker specific parameters
$$ --------------------------
$$ [...]
150 150 150 150 150 150 150 150
##$TP07= 0
##$TPNAME0= <>
##$TPNAME1= <>
##$TPNAME2= <>
##$TPNAME3= <>
##$TPNAME4= <>
##$TPNAME5= <>
##$TPNAME6= <>
##$TPNAME7= <>
##$TPOAL= (0..7)
0.5 0.5 0.5 0.5 0.5 0.5 0.5 0.5
##$TPOFFS= (0..7)
0 0 0 0 0 0 0 0
##$TUNHIN= 0
##$TUNHOUT= 0
##$TUNXOUT= 0
##$USERA1= <user>
##$USERA2= <user>
##$USERA3= <user>
##$USERA4= <user>
##$USERA5= <user>
##$V9= 5
##$VALIST= <valist>
##$VCLIST= <CCCCCCCCCCCCCCC>
##$VD= 0
##$VDLIST= <DDDDDDDDDDDDDDD>
##$VPLIST= <PPPPPPPPPPPPPPP>
##$VTLIST= <TTTTTTTTTTTTTTT>
##$WBST= 2048
##$WBSW= 25
##$XGAIN= (0..3)
0 0 0 0
##$XL= 0
##$YL= 0
##$YMAX_a= 489061
##$YMIN_a= -598703
##$ZGOPTNS= <>
##$ZL1= 120
##$ZL2= 120
##$ZL3= 120
##$ZL4= 120
##$ABSF1= 14.98061
##$ABSF2= -5.57192
##$ABSG= 5
##$ABSL= 3
##$ALPHA= 0
##$AQORDER= 0
##$ASSFAC= 0
##$ASSFACI= 0
##$ASSFACX= 0
##$ASSWID= 0
##$AUNMP= <proc_prof1d_extract_pilot.lims>
##$AXLEFT= 0
##$AXNAME= <>
##$AXNUC= <1H>
##$AXRIGHT= 0
##$AXTYPE= 0
##$AXUNIT= <>
##$AZFE= 0.1
##$AZFW= 0.1
##$BCFW= 0
##$BC_mod= 0
##$BYTORDP= 0
##$COROFFS= 0
##$CY= 15
##$DATMOD= 1
##$DC= 0
##$DFILT= <>
##$DTYPP= 0
##$F1P= 0
##$F2P= 0
##$FCOR= 0.5
##$FTSIZE= 32768
##$FT_mod= 6
##$GAMMA= 0
##$GB= 0
##$INTBC= 1
##$INTSCL= 1
##$ISEN= 128
##$LB= 0
##$LEV0= 0
##$LPBIN= 0
##$MAXI= 10000
##$MC2= 0
##$MEAN= 0
##$ME_mod= 0
##$MI= 0
##$NCOEF= 0
##$NC_proc= -8
##$NLEV= 6
##$NOISF1= 0
##$NOISF2= 0
##$NSP= 0
##$NTH_PI= 0
##$NZP= 0
##$OFFSET= 14.98061
##$PC= 1
##$PHC0= 209.3555
##$PHC1= 0
##$PH_mod= 1
##$PKNL= yes
##$PPARMOD= 0
##$PPDIAG= 0
##$PPIPTYP= 0
##$PPMPNUM= 2147483647
##$PPRESOL= 1
##$PSCAL= 4
##$PSIGN= 0
##$PYNMP= <proc.py>
##$REVERSE= no
##$SF= 400.13
##$SI= 32768
##$SIGF1= 0
##$SIGF2= 0
##$SINO= 400
##$SIOLD= 32768
##$SPECTYP= <>
##$SREGLST= <1H.CDCl3>
##$SSB= 0
##$STSI= 32768
##$STSR= 0
##$SW_p= 8223.68421052632
##$SYMM= 0
##$S_DEV= 0
##$TDeff= 65536
##$TDoff= 0
##$TI= <>
##$TILT= no
##$TM1= 0
##$TM2= 0
##$TOPLEV= 0
##$USERP1= <user>
##$USERP2= <user>
##$USERP3= <user>
##$USERP4= <user>
##$USERP5= <user>
##$WDW= 1
##$XDIM= 32768
##$YMAX_p= 422714923
##$YMIN_p= -727438
##$CURPLOT= <Network HP LaserJet P1505>
##$CURPRIN= <$Network HP LaserJet P1505>
##$DFORMAT= <normdp>
##$LAYOUT= <+/1D_H.xwp>
##$LFORMAT= <normlp>
##$PFORMAT= <normpl>
##$SURQMSG= 1
$$ End of Bruker specific parameters
$$ ---------------------------------
##NTUPLES= NMR SPECTRUM
##VAR_NAME=  FREQUENCY,     SPECTRUM/REAL,   SPECTRUM/IMAG
##SYMBOL=    X,             R,               I
##VAR_TYPE=  INDEPENDENT,   DEPENDENT,       DEPENDENT
##VAR_FORM=  AFFN,          ASDF,            ASDF
##VAR_DIM=   32768,         32768,           32768
##UNITS=     HZ,            ARBITRARY UNITS, ARBITRARY UNITS
##FACTOR=    0.250966925370066, 1,           1
##FIRST=     8223.43324360095, 1205,         -191504
##LAST=      0,             -125645,         -15164
##MIN=       0,             -727438,         0
##MAX=       8223.43324360095, 422714923,    0
$$ Real data points
##PAGE= N=1
##DATA TABLE= (X++(R..R)), XYDATA
$$ [...]
19542a17573A3557e8878j63329B29424b51884A93660A1076O2581N6042a16101
$$ -117573 13557 -58878 -222207 229424 -251884 193660 11076 73657 129699 -116101
19531b37990c7137j74022g6182k08798Q1693o9161a04882J3883A82119c90044
$$ -237990 -37137 -211159 -76182 -284980 -203287 -272448 -104882 -90999 182119 -390044
19520b14696j41620a4116o1762A37579J5428a48832B81185a70394f1232b6859
$$ -214696 -356316 -14116 -75878 137579 153007 -148832 281185 -170394 -61232 -26859
19509C22365b6549j75026H4845b8521A47259d43034i3978p9214k337f591j62668
$$ 322365 -26549 -201575 84845 -28521 147259 -443034 -93978 -173192 -175529 -6591 -169259
19498a69259E5773a46370B12569Q2015A2042a80294M3440M6591A61222N4828a78133
$$ -169259 55773 -146370 212569 294584 12042 -180294 -136854 -90263 161222 216050 -178133
19486a57883j30368d5937f909k04253A03373L3067a06371C91662A41343M1789
$$ -157883 -288251 -45937 -6909 -211162 103373 136440 -106371 391662 141343 183132
19476A83132i3828j11352A10353g8765A27338a9659B50448b91542G4864N4349
$$ 183132 -93828 -205180 110353 -78765 127338 -19659 250448 -291542 74864 129213
19466A29213c21969B89044A35846b96906A2030b57267D7885b80966m6847k2208
$$ 129213 -321969 289044 135846 -296906 12030 -257267 47885 -280966 -327813 -350021
19456c50021f498A13863E5110c15597J26681n5508A44459a85666I3064a35519
$$ -350021 -6498 113863 55110 -315597 -188916 -244424 144459 -185666 93064 -135519
19445a64325o519D4385L22560j39883a32745m5836e5086k10763g7238E920b86485
$$ -164325 -170844 44385 366945 227062 -132745 -178581 -55086 -265849 -77238 5920 -286485
19433B0022d9065h221F4427b33207h1778D8627a51925E8395a04341B53253a51143
$$ 20022 -49065 -8221 64427 -233207 -81778 48627 -151925 58395 -104341 253253 -151143
19421b11686I6936d43650l0262a4996k2941A5515c86385a89780A44570f7342F8771
$$ -211686 96936 -443650 -473912 -14996 -37937 15515 -386385 -189780 144570 -67342 68771
19409c57149a14715A98324g0704j50371A1171N2337a87159C9184L3460K10194
$$ -357149 -114715 198324 -70704 -221075 11171 63508 -187159 39184 72644 282838
19399B82838c9316B27471a45517H4818d1391B42475a11570j18127J4863k0030
$$ 282838 -39316 227471 -145517 84818 -41391 242475 -111570 -229697 -214834 -234864
19389b34864B43775c3842J0240A45123a12630j18688q7812Q8909O8630f6650A79643
$$ -234864 243775 -33842 -23602 145123 -112630 -231318 -319130 -230221 -161591 -66650 179643
19377B2003b49689m07443a0958F4634b24933H403b61330G5779i9267j3511j32756
$$ 22003 -249689 -657132 -10958 64634 -224933 8403 -261330 75779 -99267 -112778 -245534
19366b45534g9953j78791k5742b2695A44476E7350J11138a06250H3790c41559
$$ -245534 -79953 -258744 -284486 -22695 144476 57350 168488 -106250 83790 -341559
19355D2635a04757H711a00520H1092i1848j18228P3403A63825n1484b77012J20407
$$ 42635 -104757 8711 -100520 81092 -91848 -210076 -136673 163825 112341 -277012 -156605
19344a56605d9152n9278d8546j00052A82386a23740m4660b9289j70285e1483B01822
$$ -156605 -49152 -108430 -48546 -148598 182386 -123740 -168400 -29289 -199574 -51483 201822
19332C8575J15499a14164j06555i6425m0293A11219e4324B6926a67029Q825l7348
$$ 38575 154074 -114164 -220719 -96425 -136718 111219 -54324 26926 -167029 -158204 -195552
19321a95552R770L8035j83854A14893b18797G4630b33262A21834b10602A25882
$$ -195552 -185782 -147747 -331601 114893 -218797 74630 -233262 121834 -210602 125882
19310F3076g8230A20687a80960b4858r7336b0375k34634B6368K51164H6380h1307
$$ 63076 -78230 120687 -180960 -24858 -122194 -20375 -255009 26368 277532 86380 -81307
19298a60922a6904F0154B764b20105E6924J03903p6748L7870b87816p4962B10354
$$ -160922 -16904 60154 2764 -220105 56924 160827 84079 121949 -287816 -362778 210354
19286A34368b02992A16922a43793A33901k8659e52442F3283a3237k78317q5521
$$ 134368 -202992 116922 -143793 133901 105242 -552442 63283 -13237 -291554 -377075
19276c77075E3877a41354K4518B5007P1651a29498B0544h6535K5673G8950b59001
$$ -377075 53877 -141354 -116836 25007 96658 -129498 20544 -86535 -60862 78950 -259001
19264a86802a0079j4962O470j20734B15431F2697a18045k54020f1477A00324c22435
$$ -186802 -10079 -25041 -18571 -139305 215431 62697 -118045 -372065 -61477 100324 -322435
19252A84470D8031b97301C9630a0555A09180d22028A01823P8691b33333j7680
$$ 184470 48031 -297301 39630 -10555 109180 -422028 101823 180514 -233333 -251013
19242b51013a18670l6350j14899a06561G0035a46051C764a33236j32281e2451
$$ -251013 -118670 -155020 -269919 -106561 70035 -146051 3764 -133236 -265517 -52451
19231B16705n5865g0488F3876J30758i6884n8464B99669j22296a7219E8592a37605
$$ 216705 160840 -70488 63876 194634 -96884 -155348 299669 177373 -17219 58592 -137605
19219d1050r770k7679p0052B07990j01210K9751d23206J61873G2734a26482G1894
$$ -41050 -50820 -78499 -148551 207990 106780 136531 -423206 -261333 72734 -126482 71894
19207a63456H910k866j427g1129o1498j16640l1239n2364E8039c54011J44430
$$ -163456 8910 6044 4617 -71129 -132627 -249267 -280506 -332870 58039 -354011 -209581
19196b09581f3856m0696j61235B90515c14056A73850J84701e1233k36500A64572
$$ -209581 -63856 -104552 -265787 290515 -314056 173850 358551 -51233 -287733 164572
19185d0229j64586C9259f9626n8971N3495g174k62245Q9958M5526j38238e3525
$$ -40229 -204815 39259 -69626 -128597 -75102 -7174 -269419 -179461 -133935 -272173 -53525
19173B2063a87262F0277N8603h3943A16516h5479A23236c48211A24873i6761b0346
$$ 22063 -187262 60277 118880 -83943 116516 -85479 123236 -348211 124873 -96761 -20346
19161d9446o9415A94918p7109L1727d25599D0454J07090b15958K7035j6790P0972
$$ -49446 -118861 194918 117809 149536 -425599 40454 147544 -215958 -188923 -205713 -134741
19150a34741f5934q0230A80247g0158k6130C49385A3236b42387a03040K3082b5453
$$ -134741 -65934 -146164 180247 -70158 -96288 349385 13236 -242387 -103040 -79958 -25453
19138B33963a85844F2317j9748J23938a42727O5711a5311A89711b76639J02642
$$ 233963 -185844 62317 42569 166507 -142727 -77016 -15311 189711 -276639 -173997
19128a73997k6367B92700A18140f4191B09350G897c69393B92947G346N7732L7023
$$ -173997 -200364 292700 118140 -64191 209350 7897 -369393 292947 7346 65078 102101
19117A02101a65292H8661b4505p9142C2654g0815m3154N639j05057J05720R204
$$ 102101 -165292 88661 -24505 -103647 32654 -70815 -113969 -108330 -213387 -107667 -98463
19106i8463H6504K52799e559j52891B77525m3343a48282n6184B48471c9476j45425
$$ -98463 86504 339303 -5559 -158450 277525 234182 -148282 -204466 248471 -39476 -184901
19095a84901E8749C392b76655a26158k11688a56685A08983C1660a02255C09251
$$ -184901 58749 3392 -276655 -126158 -337846 -156685 108983 31660 -102255 309251
19084b433n9700l3828A31940a33198F2569g7225I0520f0275a7321B4442c98546
$$ -2433 -62133 -95961 131940 -133198 62569 -77225 90520 -60275 -17321 24442 -398546
19072c12091F4207P3169b22056A27127f3565K6721B55632b19180P5305N0633j12532
$$ -312091 64207 137376 -222056 127127 -63565 -36844 255632 -219180 -143875 -93242 -205774
19061b05774N7804C70857A25877b75106B122M3752K21059b13994N9484E2588a71515
$$ -205774 -147970 370857 125877 -275106 2122 45874 266933 -213994 -154510 52588 -171515
19049a46873o4682J00477j12108F8454L13725j88982b41398A75539q2851k935
$$ -146873 -211555 -111078 -223186 68454 382179 193197 -241398 175539 92688 89753
19039H9753f9085C2264J38259a75404b8773N766C03395a52300j81091L7920A34696
$$ 89753 -69085 32264 170523 -175404 -28773 -23007 303395 -152300 -333391 -295471 134696
19027d9915j9699m2125O2C22192i9705r1108c8862o4358n3607A37958a32131k44674
$$ -49915 -69614 -111739 -111677 322192 -99705 -190813 -38862 -103220 -156827 137958 -132131 -376805
19015c76805J57755A99662a46296f7814n1186A53949e656p4615C26226c6826H1925
$$ -376805 -219050 199662 -146296 -67814 -119000 153949 -5656 -80271 326226 -36826 81925
19003A40133a77641n9982a15018n7578O5914A51881c14407A59153b81787e7346
$$ 140133 -177641 -237623 -115018 -172596 -106682 151881 -314407 159153 -281787 -57346
18992b81454J08149C6924J1593M5022A967a35617A14999a76018A08666d02216
$$ -281454 -173305 36924 48517 93539 1967 -135617 114999 -176018 108666 -402216
18981d6276D6087J76596f6693A59317o9543o414L8546b7106m9092C7675K10310
$$ -46276 46087 222683 -66693 159317 89774 83360 121906 -27106 -76198 37675 247985
18970B47985a16777g800n7961n4314A66343C8422g361j61400j5586A89151a71820
$$ 247985 -116777 -7800 -65761 -120075 166343 38422 -7361 -168761 -184347 189151 -171820
18958A94109H2267h0499F946b30585I5566a0258q479o6033B66853N1089c07030
$$ 194109 82267 -80499 6946 -230585 95566 -10258 -18737 -84770 266853 317942 -307030
18946a36435J001p4287h251j08384I9449N1552k2712E0703L3574J08173M0897
$$ -136435 -135434 -209721 -8251 -116635 99449 151001 128289 50703 84277 192450 233347
18935B33347a87638B1042a35153L119N75M3365k80696i3946j93903C3515a92369
$$ 233347 -187638 21042 -135153 -132034 -131459 -88094 -368790 -93946 -287849 33515 -192369
18923d2045B3788c8758r7837f6160A12544D0534M6608E424g5911j45309a07237
$$ -42045 23788 -38758 -136595 -66160 112544 40534 87142 5424 -75911 -221220 -107237
18911a61340c3148l850k70791J44339A56257a59917A14993b08750K6454e3526
$$ -161340 -33148 -36998 -307789 -163450 156257 -159917 114993 -208750 -182296 -53526
18900a43288E9805a060k4599j42947O7432j52184h0288A14863A7487a4490A9240
$$ -143288 59805 -1060 -25659 -168606 -101174 -253358 -80288 114863 17487 -14490 19240
18888G964M6358J03648a16436B58097b78261g5033j05294L6362j42779A81089
$$ 7964 54322 157970 -116436 258097 -278261 -75033 -180327 -143965 -286744 181089
18877b37668A46181b82603a20045n4323A4579R6503O3224a48858e2492J4488B44483
$$ -237668 146181 -282603 -120045 -174368 14579 111082 174306 -148858 -52492 -38004 244483
18865A2966f6477j383k94723P7958N0375A50838M4644C1272a46024A88610i8108
$$ 12966 -66477 -67860 -362583 -284625 -234250 150838 195482 31272 -146024 188610 -98108
18853E6972b37392B64809b40807A13602c7144p6796o829j98775J43448b6830j63794
$$ 56972 -237392 264809 -240807 113602 -37144 -113940 -120769 -319544 -176096 -26830 -190624
18842a90624j63080A33924D1336c18716i9613A44410b48066A10722j7970A2224
$$ -190624 -353704 133924 41336 -318716 -99613 144410 -248066 110722 92752 12224
18831A64677N5235b15499a1618j90648B026J18690E7020c02461C6659c2012A77096
$$ 164677 219912 -215499 -11618 -202266 2026 120716 57020 -302461 36659 -32012 177096
18819b4230j60201r6625L9186j16003i6182j13129B65729f5618j8209n145n3612
$$ -24230 -184431 -281056 -241870 -357873 -96182 -209311 265729 -65618 -83827 -88972 -142584
18808a42584C23257f4999J7476D05653c6802k31065A84632e0796H6149M4989B5972
$$ -142584 323257 -64999 -47523 405653 -36802 -267867 184632 -50796 86149 131138 25972
18796C35853c459j95209g3177B5927a20245j14321A42043b22153B3828O9841L44444
$$ 335853 -3459 -198668 -73177 25927 -120245 -234566 142043 -222153 23828 93669 438113
18785D38113a53892L5962c6462C2611a46887j12462A67502d3346q7130j58260
$$ 438113 -153892 -117930 -36462 32611 -146887 -259349 167502 -43346 -130476 -288736
18775b88736a28525B18373A0861J31054J153D2863R8322l0223b8244A40168C5849
$$ -288736 -128525 218373 10861 141915 143068 42863 141185 110962 -28244 140168 35849
18763A00001l5260J02125d2328m0830G6476e1644A85277o8427D6415a03401A97387
$$ 100001 64741 166866 -42328 -83158 76476 -51644 185277 116850 46415 -103401 197387
18751B37282a55021O6381A91284p3032a07953A10948g27438L49371P5623I7481
$$ 237282 -155021 -88640 191284 118252 -107953 110948 -727438 -378067 -302444 97481
18740a802G5527b46827D3783Q5671b4493n3698j46378k5342B26729A01079d7109
$$ -1802 75527 -246827 43783 129454 -24493 -78191 -224569 -249911 226729 101079 -47109
18728G6836N85697b72904p1710a10424j66047B43197A4478F017R0407a40794C3088
$$ 76836 662533 -272904 -344614 -110424 -276471 243197 14478 6017 96424 -140794 33088
18716a46773m4378k97316a67635g102o36549d1328A97411b13128B2890c158j89924
$$ -146773 -191151 -488467 -167635 -7102 -643651 -41328 197411 -213128 22890 -3158 -193082
18705a93082h4123l06504C508L6504h484k98572b6241m00158B66294d2043A14838
$$ -193082 -84123 -390627 3508 40012 -8484 -307056 -26241 -426399 266294 -42043 114838
18693b44180n2842J16220H4321J9925B47J28605b70614I9458a06122A55220C1343
$$ -244180 -297022 -180802 84321 104246 247 128852 -270614 99458 -106122 155220 31343
18681c90296B34497j09256f9304K7830j66370h4865r9583o3026b0024j86289M6831
$$ -390296 234497 125241 -69304 -41474 -207844 -84865 -184448 -247474 -20024 -206313 -159482
18670a59482I6436a4222d206E0666f0004m0521m0948a1891C34914j20699H2271
$$ -159482 96436 -14222 -4206 50666 -60004 -100525 -141473 -11891 334914 214215 82271
18658b28984j36006b9624j44117J3628g3485K0882N382j05325A41404c57118A75777
$$ -228984 -364990 -29624 -173741 -160113 -73485 -52603 -47221 -152546 141404 -357118 175777
18646E892N1403a90592i0761j55811L7487j91718A2710b43579F57h8999j85206
$$ 5892 57295 -190592 -90761 -246572 -209085 -400803 12710 -243579 657 -88999 -274205
18635b74205E6389J01746C9655c51878N5625G708K52350D144f8011l1057k83480
$$ -274205 56389 158135 39655 -351878 -296253 7708 260058 4144 -68011 -99068 -382548
18624c82548J02760R1181D5813a45840A01207b28993B8662J12765a38923a6309
$$ -382548 -279788 -188607 45813 -145840 101207 -228993 28662 141427 -138923 -16309
18613b56373d2117D0904K07842P3065C6311h0164j52246g0055j43398J02468j02795
$$ -256373 -42117 40904 248746 321811 36311 -80164 -232410 -70055 -213453 -110985 -213780
18602b13780A28186D7919K15312M1810i5309B19908e40834A69188d7991B04775
$$ -213780 128186 47919 263231 305041 -95309 219908 -540834 169188 -47991 204775
18591C20589G4366b75674E8099a89325A42869b99426e5267C3972d25857D1736
$$ 320589 74366 -275674 58099 -189325 142869 -299426 -55267 33972 -425857 41736
18580g4966A07341N2890f3920a4941r5486R662j7573a7786k16122f4063k41066
$$ -74966 107341 160231 -63920 -14941 -110427 -100765 -118338 -17786 -233908 -64063 -305129
18569c05129C4018b19912R0403M6780j10471b8740G3694R4582c62257f7455a2693
$$ -305129 34018 -219912 -129509 -82729 -193200 -28740 73694 168276 -362257 -67455 -12693
18557b8329j40563P4418E2432g357o2889m43693M7235b3904j21501A75462a37829
$$ -28329 -168892 -94474 52432 -7357 -70246 -513939 -466704 -23904 -145405 175462 -137829
18545a07558D9370a85839d0795n3A33353b71001e3304F6730l3238a34798p3943
$$ -107558 49370 -185839 -40795 -40848 133353 -271001 -53304 66730 33492 -134798 -208741
18534b08741C8238a13551j81145N0992a8849o2180r2362E5766P4416d0309j368
$$ -208741 38238 -113551 -294696 -243704 -18849 -81029 -173391 55766 130182 -40309 -41677
18523d1677A26092b36009L8524F2427e5899o5252A32245e9733j1342M625I0852
$$ -41677 126092 -236009 -197485 62427 -55899 -121151 132245 -59733 -71075 -66450 90852
18511I4175b40900g1758b2610E8647a28301a5526A19884a66472q3988A28908L2314
$$ 94175 -240900 -71758 -22610 58647 -128301 -15526 119884 -166472 -250460 128908 161222
18500A61222E9246b00798b2387o8832e147B2207d3912n3935F0849a53648J4230
$$ 161222 59246 -200798 -22387 -91219 -5147 22207 -43912 -97847 60849 -153648 -139418
18489a39418e0681B62949b32590d1559j41782I7305a42455F4122b09907r6703
$$ -139418 -50681 262949 -232590 -41559 -183341 97305 -142455 64122 -209907 -306610
18479c06610A94757G9893K34874h0441r9557A40814c3269k70470E9152a05474
$$ -306610 194757 79893 314767 -80441 -179998 140814 -33269 -303739 59152 -105474
18468h0867B18447q7640B0338c04024A41960a40152e9858k8905c3753k16969A2730
$$ -80867 218447 130807 20338 -304024 141960 -140152 -59858 -88763 -33753 -250722 12730
18456f14058D31362a2683l82169i2358L6206G7935r106a52718A19691a05289B86637
$$ -614058 431362 -12683 -394852 -92358 -56152 77935 68829 -152718 119691 -105289 286637
18444A85395a66175l9177N922A10688b0924B58836c5540H5780a5190A83598e6727
$$ 185395 -166175 -205352 -199430 110688 -20924 258836 -35540 85780 -15190 183598 -56727
18432A01561C792a36580a7277B83954a3672n4191r7115A5701F700a77516A62022
$$ 101561 3792 -136580 -17277 283954 -13672 -67863 -164978 15701 6700 -177516 162022
18420C04575I0923g2356l85371B74913h6915r1101n8415e94k9070J0729C28867
$$ 304575 90923 -72356 -457727 274913 -86915 -178016 -236431 -594 -29664 -18935 328867
18408F3879M0771c17542J05733m9948A29848a11617k03036B1723b95142A73960
$$ 63879 104650 -317542 -211809 -261757 129848 -111617 -314653 21723 -295142 173960
18397A30956m2889a35728d388A83193K476L7951c6964j6846J8293A02254f7569
$$ 130956 88067 -135728 -4388 183193 185669 223620 -36964 -53810 -35517 102254 -67569
18385B56139O6820e2010D4980b14345A3477K05469a16594B55a02308G4983J08735
$$ 256139 322959 -52010 44980 -214345 13477 218946 -116594 255 -102308 74983 183718
18374A83718c78054J84981c0455D0421M2517C4428M2784c15598B02293a33180
$$ 183718 -378054 -193073 -30455 40421 82938 34428 77212 -315598 202293 -133180
18363b88627b4602A38331h6259B42621c11504J4990A3073a96511h3784k9737j65856
$$ -288627 -24602 138331 -86259 242621 -311504 -296514 13073 -196511 -83784 -113521 -279377
18352b79377A54754a45707B37367D8722J22700i0118A60124c5952B03021m1960
$$ -279377 154754 -145707 237367 48722 171422 -90118 160124 -35952 203021 161061
18342A61061B2846a85354A40622c63451a40076N1772k89629B92603j18912j9861
$$ 161061 22846 -185354 140622 -363451 -140076 -88304 -377933 292603 173691 153830
18332A53830l0482L0662J07256a87163q4725C97350G3240b00363i5619A97032
$$ 153830 123348 154010 261266 -187163 -271888 397350 73240 -200363 -95619 197032
18321b50436N0299k3351c3633k1939n8891L5085B1938K27264B1009P6588J12320
$$ -250436 -200137 -223488 -33633 -55572 -114463 -79378 21938 249202 21009 97597 209917
18310B09917I9956d6857b648k17981R8469d3097B3444f6834A71432d1224A6560
$$ 209917 99956 -46857 -2648 -220629 -122160 -43097 23444 -66834 171432 -41224 16560
18298c4369D2079c57590A7583b17417H4601K2126f6766k4886j50359d6787H1839
$$ -34369 42079 -357590 17583 -217417 84601 106727 -66766 -91652 -242011 -46787 81839
18286a91595M9289N5931j00784D9444c15818J27130f5602j62974B68894b5755
$$ -191595 -142306 -86375 -187159 49444 -315818 -188688 -65602 -228576 268894 -25755
18275h8137M2382H692a26681j40084A55107b18243R1615G0988k2238b12665g7729
$$ -88137 -45755 8692 -126681 -266765 155107 -218243 -126628 70988 48750 -212665 -77729
18263c10079h7811o6803r7756J25820l6248P6080j41790E8889d7162J66B88378
$$ -310079 -87811 -154614 -252370 -126550 -162798 -86718 -228508 58889 -47162 -46996 288378
18251b7143l06397A31084h5618B33226f0914j26427c885B28155a80979P8209k73283
$$ -27143 -333540 131084 -85618 233226 -60914 -187341 -3885 228155 -180979 -102770 -376053
18240c76053P5961d6708n0539j02779H1984a00526M7363k7084o5306C07171A02184
$$ -376053 -300092 -46708 -97247 -200026 81984 -100526 -53163 -80247 -145553 307171 102184
18228A18020d0863E115b7925j03751k8994l7319B23239B1940J50429q4881P9212
$$ 118020 -40863 5115 -27925 -131676 -160670 -197989 223239 21940 172369 87488 166700
18217A66700E496b24202E3227a24403B09927e5204A34121a52186A8727a25586
$$ 166700 5496 -224202 53227 -124403 209927 -55204 134121 -152186 18727 -125586
18206a65668l9946e0344o2143o391A06225a79338l5665H7572a2688B03931h6146
$$ -165668 -205614 -50344 -112487 -118878 106225 -179338 -215003 87572 -12688 203931 -86146
18194D6021f0092p7809L081D6542c19238F485a92606B8078b23012A71598c15916
$$ 46021 -60092 -137901 -134820 46542 -319238 6485 -192606 28078 -223012 171598 -315916
18182I2012a09110A99376h6351B88115F5115g827I6635k6712a33002C26057D8945
$$ 92012 -109110 199376 -86351 288115 65115 -7827 96635 69923 -133002 326057 48945
18170b14278J00178k05726h5452c6101l42460R4789J779k52736b58337C65425
$$ -214278 -114100 -319826 -85452 -36101 -378561 -283772 -281993 -534729 -258337 365425
18159c2572F8596K8883D1228b27442B9214b96478I2446b02524k01759K5886H3324
$$ -32572 68596 97479 41228 -227442 29214 -296478 92446 -202524 -404283 -378397 83324
18147D1031Q9151c20072C8368M5151b05242j8088h5931j21178C99670c5460A68859
$$ 41031 130182 -320072 38368 83519 -205242 -223330 -85931 -207109 399670 -35460 168859
18135B42789b94608a32841b2322C08929C1893K15336B4368R9069k4620k4693c14973
$$ 242789 -294608 -132841 -22322 308929 31893 247229 24368 123437 98817 74124 -314973
18123e8927A44511e9396A92587c93498a50718j6653N1485E421a46918O2184B62150
$$ -58927 144511 -59396 192587 -393498 -150718 -167371 -115886 5421 -146918 -84734 262150
18111A99541b42146r7489B0478a61247a8034p3664k24068A26792J14712b41148
$$ 199541 -242146 -339635 20478 -161247 -18034 -91698 -315766 126792 241504 -241148
18100A21384L9504b91448A33535a5171n1908L2031A67773m2356J03150a13539
$$ 121384 160888 -291448 133535 -15171 -67079 -35048 167773 125417 228567 -113539
18089B3198L9728a07950l4697A36263a45399l8540B11735a07724F5792a9224A7383
$$ 23198 62926 -107950 -142647 136263 -145399 -183939 211735 -107724 65792 -19224 17383
18077b91693B32223I1121a41362A43610b10431k6585A28900b16603k08712g954
$$ -291693 232223 91121 -141362 143610 -210431 -237016 128900 -216603 -425315 -7954
18066c8799j91887i9297A03851B8288P6391b1881p402D9721c26403D4755f3833
$$ -38799 -230686 -99297 103851 28288 104679 -21881 -29283 49721 -326403 44755 -63833
18054C00825h2385A91116b00320E2350Q8364M6453r0195M825O92B1936Q2839A5642
$$ 300825 -82385 191116 -200320 52350 140714 187167 96972 101797 102489 21936 104775 15642
18041b38955A9920b29523E64273A57706G1851J04058N0097a22614A23385J09737
$$ -238955 19920 -229523 564273 157706 71851 175909 226006 -122614 123385 233122
18031B33122f5113A62595b22587A86189b0451A05322K33723p6329R0j23802B3766
$$ 233122 -65113 162595 -222587 186189 -20451 105322 339045 262716 262806 139004 23766
18019c88644a6001j19993f7926j64466F8866a1172j75152N9407k07197A18677
$$ -388644 -16001 -135994 -67926 -232392 68866 -11172 -186324 -126917 -334114 118677
18008B14292h5567C2172d72945a35602J7620A81666J89245a20976B41918a28105
$$ 214292 -85567 32172 -472945 -135602 -117982 181666 370911 -120976 241918 -128105
17997A27371K34722h0318K9739j62573B91350d30637E3877b22914A0321b94512
$$ 127371 362093 -80318 -50579 -213152 291350 -430637 53877 -222914 10321 -294512
17986D0993a11775C29775A43120J15811c2248o2805A51287m7996a21654A14411
$$ 40993 -111775 329775 143120 258931 -32248 -95053 151287 103291 -121654 114411
17975A66014a16914C13999I5244h2142M0774j72805a01909j1903I3648c47155
$$ 166014 -116914 313999 95244 -82142 -41368 -214173 -101909 -113812 93648 -347155
17964a02677p0269h1772b3822o0596L5996H2273J21099a23364J3457A51619f5846
$$ -102677 -172946 -81772 -23822 -84418 -48422 82273 203372 -123364 -109907 151619 -65846
17952E3879d70502a51373k5810p2815g2591F3619i1853G8736a05223j49053A82242
$$ 53879 -470502 -151373 -177183 -249998 -72591 63619 -91853 78736 -105223 -254276 182242
17940E4588a53991H8114a31910A65489a30697o2485G0925B1754m9k883L0186c42520
$$ 54588 -153991 88114 -131910 165489 -130697 -193182 70925 21754 21705 18822 49008 -342520
17927E8504A1420L3341c40642A17608a46206A23190J75526b4844p4826f322k17567
$$ 58504 11420 44761 -340642 117608 -146206 123190 298716 -24844 -99670 -6322 -223889
17916b23889P3124B48107b46602g9639A71498e0415B51795e9819j22777R0906
$$ -223889 -150765 248107 -246602 -79639 171498 -50415 251795 -59819 -182596 -91690
17906i1690D316e00083K15698B88746R2982c54144B91132a21618A35898a56853
$$ -91690 4316 -500083 -284385 288746 381728 -354144 291132 -121618 135898 -156853
17895c05135I736c2827k3457n9418C77215A50526E938K3966a54493J8074N9585
$$ -305135 9736 -32827 -56284 -115702 377215 150526 5938 29904 -154493 -136419 -76834
17884g6834A13732e2649i114A07756a02513D9155J75019a14123H221d6029B20
$$ -76834 113732 -52649 -9114 107756 -102513 49155 224174 -114123 8221 -46029 220
17872a35176c9015I2700a69061C6537K24307a88098b4252C79990f7840B6243J18658
$$ -135176 -39015 92700 -169061 36537 260844 -188098 -24252 379990 -67840 26243 144901
17861A44901a6675j36222N5164j7592b5171k68240J36442A15980J53617a58795
$$ 144901 -16675 -152897 -97733 -115325 -25171 -293411 -156969 115980 269597 -158795
17850c161n2543A19811i2703H9447j3214b92667I236J93323I5968C7019I389b27850
$$ -3161 -55704 119811 -92703 89447 76233 -292667 9236 202559 95968 37019 9389 -227850
17837B16910l5642b22466a09306A80388E8157k2132i2599G4549K7716a23851b3049
$$ 216910 181268 -222466 -109306 180388 58157 36025 -92599 74549 102265 -123851 -23049
17825A29959C6849J28098B7344c601j34758B48035j15134a51424a6320j31163
$$ 129959 36849 164947 27344 -3601 -138359 248035 132901 -151424 -16320 -147483
17815a47483f1789J1927E3694L8537m2813L01259g075k659A5878J46662f1201
$$ -147483 -61789 -49862 53694 92231 49418 350677 -7075 -9734 15878 162540 -61201
17803a16648A05331A1292L64907j55890j6075e2563A36488a30430L7177C49212
$$ -116648 105331 11292 376199 220309 204234 -52563 136488 -130430 -93253 349212
17792B2661a61291j87221a29048f965p971l4312j14652D2949a21989G2921K9738
$$ 22661 -161291 -348512 -129048 -6965 -14936 -49248 -163900 42949 -121989 72921 102659
17781A02659b52102i8586L1884c2034e412A52770B264K50936b34373B62798r6401
$$ 102659 -252102 -98586 -66702 -32034 -5412 152770 2264 253200 -234373 262798 166397
17770A66397B6436J1114d3885A3671d0720k21202H0571l1882L79997c61107A71973
$$ 166397 26436 37550 -43885 13671 -40720 -261922 80571 48689 428686 -361107 171973
17758F25907c7076o108A51091b18413A41850e2321d973B58593e9307p3565M6073
$$ 625907 -37076 -43184 151091 -218413 141850 -52321 -4973 258593 -59307 -132872 -86799
17747h6799j84612A04935Q555K7058a5814k32318A44533a53920M4102A62964J10262
$$ -86799 -271411 104935 113490 140548 -15814 -248132 144533 -153920 -109818 162964 273226
17736B73226r9713B0026a8407I0613b7228A4802a15739j67810B27126d118k47796
$$ 273226 173513 20026 -18407 90613 -27228 14802 -115739 -283549 227126 -4118 -251914
17725b51914O664e8289c07r7970g471A80209C87J9238L1892h8365B10882r8250
$$ -251914 -245250 -58289 -307 -98277 -7471 180209 387 19625 51517 -88365 210882 112632
17713A12632q906k8330e6476F763K97782j40902b69696f1865a5914G3332L5554
$$ 112632 103726 75396 -56476 6763 304545 163643 -269696 -61865 -15914 73332 108886
17702A08886D3779a05965C8136J60125h024F5278a51194J4969j55912a43204e7536
$$ 108886 43779 -105965 38136 198261 -8024 65278 -151194 -136225 -292137 -143204 -57536
17690f2928p3689I9539b63834A4295J70066B178a82667L0356J1617e501A68457
$$ -62928 -136617 99539 -263834 14295 184361 2178 -182667 -152311 -140694 -5501 168457
17678a34124j48621h8511D5538c7037j99642C22439p6774G8134b6006l2957B88172
$$ -134124 -282745 -88511 45538 -37037 -236679 322439 245665 78134 -26006 -58963 288172
17666B67973b64762m293a1027k19079O5610R819d3482p3568G4963b162r9838n2626
$$ 267973 -264762 -269055 -11027 -230106 -164496 -154677 -43482 -117050 74963 -2162 -102000 -154626
17654a54626A31690M373e1329r980k76315A62092o8419A8154a94009E2367J7634
$$ -154626 131690 136063 -51329 -61309 -337624 162092 93673 18154 -194009 52367 70001
17643G0001h2369C7798R6095l6772a45290C57664e25683a4736B23968e4381k08864
$$ 70001 -82369 37798 133893 97121 -145290 357664 -525683 -14736 223968 -54381 -263245
17632b63245g1027l7367C36238a4010j06642k3019j49201a40342E4090D544a51531
$$ -263245 -71027 -108394 336238 -14010 -120652 -143671 -292872 -140342 54090 4544 -151531
17620C0213c05649A61952c53868A58876f8191G3938B7798i0139B87495c4081C27699
$$ 30213 -305649 161952 -353868 158876 -68191 73938 27798 -90139 287495 -34081 327699
17608E4697A125d37883C72403h6334j55316L0042B20804K47783A13640O3064D9577
$$ 54697 1125 -437883 372403 -86334 -241650 -211608 220804 468587 113640 176704 49577
17596A08770m3822i4427j88595A71783I437L56217a13873A27874A2677L53043
$$ 108770 64948 -94427 -283022 171783 9437 365654 -113873 127874 12677 365720
17586C65720F1668J68057a05337A13095B5460R5161O785n819J6218f7260d471
$$ 365720 61668 229725 -105337 113095 25460 120621 127406 121587 137805 -67260 -4471
17574G4184l6676L7916J74073h955H5714e1298B7082J45855k4347h2719A33762
$$ 74184 37508 75424 249497 -8955 85714 -51298 27082 172937 148590 -82719 133762
17562B9492Q1158k3597b65491d3395C60250A64135H1130J55947F4992Q5261h3803
$$ 29492 110650 87053 -265491 -43395 360250 164135 81130 237077 64992 150253 -83803
17550b142B4652J66670L43108b3725p4843d6620j4510G2351a5221C47660c4097
$$ -2142 24652 191322 534430 -23725 -98568 -46620 -61130 72351 -15221 347660 -34097
17538A17365J07752c72246F12838B7324h0678F1446M2379g292C5213J9642a12612
$$ 117365 225117 -372246 612838 27324 -80678 61446 103825 -7292 35213 54855 -112612
17526a4821A56560j4002a06461C50550j62361c14205b3975A34359J3036i2380
$$ -14821 156560 142558 -106461 350550 188189 -314205 -23975 134359 147395 -92380
17515A8414i0742A36483J70216d9596B13401E6955R2424b16670B18821r4822l0137
$$ 18414 -90742 136483 306699 -49596 213401 56955 149379 -216670 218821 123999 93862
17504I3862k6558J518j2751K36835j32491G694J0129J9939J48286a9504A40560
$$ 93862 67304 68822 56071 292906 160415 7694 17823 37762 186048 -19504 140560
17492d32742e7601A89622O426O8062A29409n7432b1995B67678H6437m0019a51993
$$ -432742 -57601 189622 196048 264110 129409 71977 -21995 267678 86437 46418 -151993
17480B30076b20997A20642A3839J14766d5466A07709j7087Q8580a05498A71847
$$ 230076 -220997 120642 13839 128605 -45466 107709 90622 179202 -105498 171847
17469a1217p6295c7402B929J2679J0635J00004J25496J37358a95761B71062I5644
$$ -11217 -87512 -37402 2929 15608 26243 126247 251743 389101 -195761 271062 95644
17457A66785l3996L8924m2186K74890j44293c62727D19911p6454I5782b3420k4595
$$ 166785 132789 171713 129527 404417 260124 -362727 419911 343457 95782 -23420 -48015
17446d8015F4060K92281d324A16471f7275C94311L0230a75787A40520l0454e081
$$ -48015 64060 356341 -4324 116471 -67275 394311 424541 -175787 140520 110066 -5081
17434B05272J02213J09695j94200P0177J16189C4502K61447C4673Q4564M7796
$$ 205272 307485 417180 222980 293157 409346 34502 295949 34673 119237 167033
17424A67033L8596l6873K72455B06180q8431O9972J01230j2088J47321A40321
$$ 167033 205629 168756 441211 206180 117749 187721 288951 276863 424184 140321
17413D07654e5016C36203A4114K53308J60707j32329c3191E34415A40349E381
$$ 407654 -55016 336203 14114 267422 428129 295800 -33191 534415 140349 5381
17402C10210A1636N9128J92542a26955I9992K39223k1860A36086J0365a19052
$$ 310210 11636 70764 263306 -126955 99992 339215 317355 136086 146451 -119052
17391B74890e9735D8745K16128e7710o0803d1676C99687M01c8354F0424K333R0431
$$ 274890 -59735 48745 264873 -57710 -118513 -41676 399687 400088 -38354 60424 62757 153188
17379A53188o5995D1307Q6747m9831a93277C01642A0834J69451M5609N0152H2136
$$ 153188 87193 41307 128054 78223 -193277 301642 10834 180285 225894 276046 82136
17367a15303A53854D9743J01794E1828R2005m0260K2773J62953j03929C4557a74359
$$ -115303 153854 49743 151537 51828 143833 103573 126346 289299 185370 34557 -174359
17355b26957h3393m1564n8044N7157B85129n9911p7074M1566F2883J71007a0786
$$ -226957 -83393 -124957 -183001 -125844 285129 225218 148144 189710 62883 233890 -10786
17343A7136J97246q3639k8924J24650l579p5008i31j20949C67221G0310C4507
$$ 17136 214382 130743 101819 226469 222890 147882 -931 -121880 367221 70310 34507
17331A65922m104C2613N3716a12198B47608i5608C25412O191A11967K16099D611
$$ 165922 161818 32613 86329 -112198 247608 -95608 325412 331603 111967 328066 4611
17319C19886a14362B43447K54345k45649k5845J2053K9311r4467N2602r7450K54416
$$ 319886 -114362 243447 497792 252143 226298 238351 267662 173195 225797 128347 382763
17308C82763n0164A23257R4928e776A50369g5404G3698K04600a50959B26680m0235
$$ 382763 332599 123257 218185 -5776 150369 -75404 73698 278298 -150959 226680 186445
17297A86445e1415C47762E6823c6589B67226e7741j73343B99190F7776K68697
$$ 186445 -51415 347762 56823 -36589 267226 -57741 -231084 299190 67776 336473
17287C36473H5922M09193Q8747f2502B3962a07499F509K89279k3938j6999C597
$$ 336473 85922 495115 583862 -62502 23962 -107499 6509 295788 271850 254851 3597
17275E6738K8702L25762r9788h5668C43757j60625d4280B21790d5512B64080J33312
$$ 56738 85440 411202 311414 -85668 343757 183132 -44280 221790 -45512 264080 397392
17264C97392A0422N591J47099L24195A25949J04848O7087N441F6328M5384J65506
$$ 397392 10422 16013 163112 487307 125949 230797 297884 303325 66328 111712 277218
17253B77218p7875K54749A23304N8990H8256J28317c0343C33637a93985B92865
$$ 277218 199343 454092 123304 182294 88256 216573 -30343 333637 -193985 292865
17242C97540A89984H1499L81880G6992J93224k7373J34196A28145J73043j04351
$$ 397540 189984 81499 463379 76992 270216 242843 377039 128145 301188 196837
17232A96837K15569i8510H9950J35211a0494A9845M50J19284J90088q5327O6715
$$ 196837 412406 -98510 89950 225161 -10494 19845 20295 139579 329667 244340 311055
17221C11055A36739E2911J53917K0775J08988N9817k4199k363j35156p1106a54971
$$ 311055 136739 52911 206828 227603 336591 396408 372209 369846 234690 163584 -154971
17209D55688k07976P0822F9320J3794h1276L962A57555a20723C4949L03068j48939
$$ 455688 247712 318534 69320 83114 -81276 -77314 157555 -120723 34949 338017 189078
17198A89078K41622a29329G3048J59176A14636K97117n1981C0147J21906J26098
$$ 189078 430700 -129329 73048 232224 114636 411753 359772 30147 152053 278151
17188B78151O7994j56490n0877N7812P9853a69119A22676J52350q9934J14638
$$ 278151 346145 189655 138778 196590 276443 -169119 122676 275026 185092 299730
17178B99730j31490L19566A24660L5813L13567A4208K32962J98039j66652D543
$$ 299730 168240 487806 124660 160473 474040 14208 247170 445209 278557 4543
17167C66538j13922B6512Q6807E5631d7317L780D85707H2776L92283H2599L71853
$$ 366538 252616 26512 113319 55631 -47317 -43537 485707 82776 475059 82599 454452
17156D54452A67016n6089M94981B30215Q9892A37445D8525K65760k4945K18744
$$ 454452 167016 110927 605908 230215 320107 137445 48525 314285 289340 508084
17146E08084k07514J03832K3997P77n617j90668G5860N861i267B90367P0100p2512
$$ 508084 300570 404402 428399 429176 423559 232891 75860 81721 -9267 290367 360467 287955
17134B87955j057Q7450A60374J37617l7210J15000o4218K5179j41610j4198L79910
$$ 287955 286898 374348 160374 297991 260781 375781 311563 336742 195132 180934 560844
17123E60844j6408l4208B22588K30242j19331l9970A17364J99035M3079p5917
$$ 560844 544436 510228 222588 452830 333499 293529 117364 316399 359478 283561
17113B83561G3278K82190J4055i2263D44596j5179j83681L59992B06252J26903
$$ 283561 73278 355468 369523 -92263 444596 429417 245736 605728 206252 333155
17103C33155N2447E0683N71658k82915J58659j39968H0901L30256O2695J19301
$$ 333155 385602 50683 622341 339426 498085 358117 80901 411157 473852 593153
17093E93153k52256K06892B33636J12894P6559K4294l5426j3589K92166k25298
$$ 593153 340897 547789 233636 346530 423089 447383 411957 398368 690534 465236
17083D65236l1378J40232j04847k33420K96519B18936J0340m463q8783M40557
$$ 465236 433858 574090 469243 235823 532342 218936 229276 224813 136030 576587
17073E76587j17634j02420j68167L97775B20962K76677A22489N42279l08529J46895
$$ 576587 458953 356533 188366 586141 220962 497639 122489 664768 356239 503134
17063E03134A54818A6876N73780j69111K19633k37895j17889B9692N68981m7016
$$ 503134 154818 16876 590656 421545 641178 403283 285394 29692 598673 551657
17053E51657B67793k0600O240J10681P8193N8846L41178l94398j36724K54695
$$ 551657 267793 247193 253433 364114 442307 501153 842331 447933 311209 565904
17043E65904A98524K52527n5819j81569L45086o0106K52925i690D03745G4779
$$ 565904 198524 451051 395232 213663 558749 498643 751568 -9690 403745 74779
17032E14624J12095l03567L19481k15400K17578B71121O79105l34766P6251C38912
$$ 514624 626719 323152 642633 427233 644811 271121 950226 615460 691711 338912
17021D79681Q4284n5187K48491j99915l1985m4187j80626L96069j14658P1281
$$ 479681 563965 508778 757269 557354 525369 481182 300556 696625 581967 653248
17011F53248J14570j95745q8724K74025k32853J58134R0318j5968j28600K02561
$$ 653248 767818 572073 483349 757374 524521 682655 772973 757005 628405 830966
17001H30966l4432J36512k02873N6753j26855k42624M15755j27392k39170J60824
$$ 830966 796534 933046 730173 786926 660071 417447 833202 705810 466640 627464
16991F27464M5450L8727m397j57885K22997C08010L39466j70272K93260r5236
$$ 627464 672914 711641 707244 549359 772356 308010 647476 477204 770464 675228
16981F75228M4744M1210k66551n0632N83308D47730L82641L4253k77127K62458
$$ 675228 719972 761182 494631 443999 1027307 447730 830371 864624 587497 849955
16971H49955K87057l09674l02995L26480K41457m50462J74281L24179m20078J32935
$$ 849955 1137012 827338 524343 850823 1092280 641818 816099 1140278 720200 853135
16961H53135K55208m17931K73779p4014k6326K76904j76977L366K729J18946m55036
$$ 853135 1108343 690412 964191 890177 863851 1140755 963778 967144 969873 1088819 633783
16950F33783k2812K80665j44157L70698m28478N37122p9281k6360k60409O8151
$$ 633783 610971 891636 747479 1118177 689699 1226821 1147540 1121180 860771 928922
16940I28922L55705j99699m1419j57629k7344M91256n46745J99243p7203M46395
$$ 928922 1284627 1084928 1043509 885880 858536 1349792 803047 1002290 925087 1371482
16930A371482l34265Q7651j45779J66714j55116K23604J27584j16713j14936N7599
$$ 1371482 1037217 1124868 979089 1145803 990687 1214291 1341875 1225162 1110226 1167825
16920A167825k67432J09994J63772p4216J57910J74933r1875k00074n6584J24863
$$ 1167825 900393 1010387 1174159 1099943 1257853 1432786 1340911 1140837 1084253 1209116
16910A209116M22180r7484k85947K85990j47673Q1633k88168J93535L49335L296
$$ 1209116 1631296 1533812 1247865 1533855 1386182 1467815 1179647 1373182 1722517 1725813
16900A725813m45968K37696r6869K6406O2317r3916J87883J31169n1698j68141
$$ 1725813 1279845 1517541 1420672 1447078 1509395 1415479 1603362 1734531 1682833 1514692
16890A514692J42998J1095q6914L11976l82579K47486o017J8354K37309J73776
$$ 1514692 1657690 1668785 1581871 1893847 1511268 1758754 1752737 1771091 2008400 2182176
16880B182176l14292k08471L63393K04411m73359P7617Q4827q712K3713k5050
$$ 2182176 1867884 1659413 2022806 2227217 1753858 1831475 1916302 1907590 1931303 1906253
16870A906253K4437K30502l3740K31744k05254P04o2545J00841o6024J94268j70960
$$ 1906253 1930690 2161192 2127452 2359196 2153942 2154646 2092101 2192942 2126918 2321186 2150226
16859B150226R0434J1451M24730J67317j17367j46292M0969K09954J037j70235
$$ 2150226 2240660 2252111 2676841 2844158 2726791 2580499 2621468 2831422 2832459 2662224
16849B662224N0823L69058l21540M5379P9431M99330m04676J52802l41845J75605
$$ 2662224 2713047 3082105 2760565 2805944 2885375 3384705 2980029 3132831 2790986 2966591
16839B966591P7754M5993L19269l33499L81393q2675r3123N54492n7077m36253
$$ 2966591 3044345 3090338 3409607 3076108 3457501 3374826 3281703 3836195 3779118 3342865
16829C342865K37822L61965j50517K67079k95652J88023k7175K16702O9314J7373
$$ 3342865 3580687 3942652 3792135 4059214 3763562 3951585 3924410 4141112 4210426 4227799
16819D227799K81611j37505K51738k27563J34131L23603j35731N17046k26590
$$ 4227799 4509410 4371905 4623643 4396080 4530211 4853814 4718083 5235129 5008539
16810E008539j8864K66394o6316k88731M61041K49739j31689O971K92982M02726
$$ 5008539 4989675 5256069 5189753 4901022 5362063 5611802 5480113 5487084 5780066 6182792
16800F182792l78007P07918j12555N71931l60903L48012M3504J23573L03843j19843
$$ 6182792 5804785 6512703 6400148 6972079 6611176 6959188 7002692 7126265 7430108 7310265
16790G310265K82201M57718k7176J93041n9273K73380J68224O53519p0460M12451
$$ 7310265 7592466 8050184 8023008 8216049 8156776 8430156 8598380 9251899 9181439 9593890
16780I593890k27872N13462K61378L09351J63749K76788Q7475N91348L05690L01840
$$ 9593890 9366018 9879480 10140858 10450209 10613958 10890746 10978221 11569569 11875259 12177099
16770A2177099N54226J94471K24220J50145Q19756N26743M31462M02287K29966
$$ 12177099 12731325 12925796 13150016 13300161 14119917 14646660 15078122 15480409 15710375
16761A5710375Q64275L82213O29093K39103P85259Q99895P10919O53136Q36433
$$ 15710375 16574650 16956863 17585956 17825059 18610318 19510213 20221132 20874268 21710701
16752B1710701P15379N53951P11892J273863P59833R42100J342600Q08040J323277
$$ 21710701 22426080 22980031 23691923 24965786 25725619 26667719 28010319 28818359 30141636
16743C0141636J332321J413309J537466J390083J578604J859458J381527K217686
$$ 30141636 31473957 32887266 34424732 35814815 37393419 39252877 40634404 42852090
16735D2852090J941939K278360K343945K617977K453628K734548L085569K681674
$$ 42852090 44794029 47072389 49416334 52034311 54487939 57222487 60308056 62989730
16727F2989730L740489L576781L896333M050480M318814M324941N112186M564775
$$ 62989730 66730219 70307000 74203333 78253813 82572627 86897568 92009754 96574529
16719I6574529N199440N405562N488640N626919N716737N391392N701843N863406
$$ 96574529 101773969 107179531 112668171 118295090 124011827 129403219 135105062 140968468
16711A40968468N271824N104440M433314L792251L329987K356174J873435O24451
$$ 140968468 146240292 151344732 155778046 159570297 162900284 165256458 167129893 167754344
16703A67754344l60208o44912j807486k739009l603858l924149m714162n148807
$$ 167754344 167394136 166749224 164941738 162202729 158598871 154674722 149960560 144811753
16695A44811753n209219n963241n516064o154890n675485n793812n390136n350896
$$ 144811753 139602534 133639293 128123229 121968339 116292854 110499042 105108906 99758010
16687I9758010n569107n104879m586613m809076l981816m487394l857092l270386
$$ 99758010 94188903 89084024 84497411 79688335 75706519 71219125 67362033 64091647
16679F4091647l669491k944399l151601k807429k497291k624779k206421k243245
$$ 64091647 60422156 57477757 54326156 51518727 49021436 46396657 44190236 41946991
16671D1946991j855371j566251k316569j595434j323429j573210j636855j167083
$$ 41946991 40091620 38525369 36208800 34613366 33289937 31716727 30079872 28912789
16663B8912789j057104j164543j213763r93594j060607q87452p00238q94435p74860
$$ 28912789 27855685 26691142 25477379 24483785 23423178 22535726 21835488 20941053 20166193
16654B0166193j067951j81199p07766q54943n94113n58533p00541m76583o72520
$$ 20166193 19098242 18917043 18209277 17354334 16760221 16201688 15501147 15024564 14352044
16645A4352044l49763j18935j86809p70859o04883l73871m4768m62835n16764
$$ 14352044 14002281 13883346 13696537 12925678 12320795 11946924 11902156 11439321 10922557
16636A0922557m21747j03289k90338n01192K31875n19141l09728J4994o25608
$$ 10922557 10500810 10397521 10107183 9605991 9837866 9318725 9008997 9023991 8398383
16627H398383j9566j07365l21045j72830m24404J38156j40269l88298j81648p6219
$$ 8398383 8378817 8271452 7950407 7777577 7353173 7491329 7351060 6962762 6781114 6704895
16617F704895j56661J68574n50515L8905p6854k10974Q3294k23530p7329l3361
$$ 6704895 6548234 6716808 6166293 6205198 6128344 5917370 6000664 5777134 5699805 5666444
16607E666444p09416r0683K0550K36148j08395j85330K21287l25486k55582o4104
$$ 5666444 4957028 4866345 4886895 5123043 5014648 4829318 5050605 4725119 4469537 4405433
16597D405433q0318L43118n93552j07348J74129l96741O6346K66614l29629p6893
$$ 4405433 4325115 4668233 4074681 3967333 4141462 3744721 3811067 4077681 3748052 3671159
16587C671159k85687K21704J30771l86061p5955j51272K34726k58794l7938j33657
$$ 3671159 3385472 3607176 3737947 3351886 3275931 3124659 3359385 3100591 3062653 2928996
16577B928996J84927n14628M69574j35763j97752K68062j22358p4332k11404N9707
$$ 2928996 3113923 2599295 3068869 2933106 2735354 3003416 2881058 2806726 2595322 2655029
16567B655029k252j03556j67303n1778K06849R9597l90869n7078j15352J37447
$$ 2655029 2652777 2549221 2381918 2330140 2536989 2636586 2245717 2188639 2073287 2210734
16557B210734j68146m2727K50297j18812N9482J65129n60312L91604l80668M27171
$$ 2210734 2042588 1999861 2250158 2131346 2190828 2355957 1795645 2187249 1806581 2233752
16547B233752j94546k53402Q9563J88335n49966N23333l66091K34166r8819o2320
$$ 2233752 2039206 1785804 1875367 2063702 1513736 2037069 1670978 1905144 1806325 1744005
16537A744005n2760j89605J26802j95666J65746K32963J5867k89898J13710m14690
$$ 1744005 1691245 1501640 1628442 1432776 1598522 1831485 1847352 1557454 1671164 1256474
16527A256474J71305m1881j445J79760J4808o29186L32690P1469M0249k4969m3267
$$ 1256474 1427779 1385898 1384453 1564213 1579021 949835 1282525 1353994 1394243 1369274 1326007
16516A326007j4036K90916k44720l31019L10025r9669K68884j38007k56519P7857
$$ 1326007 1311971 1602887 1358167 1027148 1337173 1237504 1506388 1368381 1111862 1189719
16506A189719k23144J35587J39267O8255j67436J67109k38516M54333m02987j92739
$$ 1189719 966575 1102162 1241429 1309684 1142248 1309357 1070841 1525174 1122187 929448
16496I29448p9328o4132J02749L7397k78580O94984o04707M56547n27532L60540
$$ 929448 850120 785988 888737 926134 647554 1342538 737831 1194378 666846 1027386
16486A027386l63302M43117o1452j42012R2233M6281m12804J78824L81209m81015
$$ 1027386 664084 1107201 1045749 903737 995970 1042251 629447 808271 1189480 708465
16476G08465J29889j0446J17138m7319l67828M5861K03699O9518k88447L47869
$$ 708465 838354 827908 945046 897727 529899 575760 779459 848977 560530 908399
16466I08399l0097j31370j12109J19426j91779J03317j81838L79738r5312k3112
$$ 908399 878302 746932 634823 754249 562470 665787 483949 863687 768375 745263
16456G45263K1557R516J1382N8168J59718k33072j3998O2898N6986j01121j99375
$$ 745263 766820 776336 787718 845886 1005604 772532 758534 821432 878418 777297 577922
16445E77922J61664j96424L64625l0188l80734m317J53197j76050M27128D29791
$$ 577922 739586 543162 907787 877599 496865 492548 645745 469695 896823 429791
16434D22524M3837P5269M617j34459J40350L5668k70965O5124j55179N30460C52304
$$ 422524 466361 541630 546247 411788 552138 587806 316841 381965 226786 757246 352304
16422D48184A53991O33899k69777j70978J33364L4630A37664M79217j11087k00735
$$ 448184 153991 787890 518113 347135 480499 515129 137664 616881 505794 305059
16412C05059K93124j04716Q8690r1545l7929p3304M6572j06424K37338j2510B21502
$$ 305059 598183 493467 582157 490612 452683 379379 425951 319527 556865 544355 221502
16400C05288j34901O38873l4194C41879P9158p2972J49627j56949m3652N6865
$$ 305288 170387 809260 775066 341879 421037 348065 497692 340743 297091 353956
16390C53956p8799J34863J845E0188J50853K03443p8322j7743k6937J98603j48340
$$ 353956 275157 410020 411865 50188 201041 404484 326162 308419 281482 480085 331745
16379C31745p3375P2632K4482J24214K11462B75798J89822j04362J70161k34986
$$ 331745 258370 331002 355484 479698 691160 275798 465620 361258 531419 296433
16369B96433R9381j58155Q1279A46874K89095L036p9452A14102J07308K04760
$$ 296433 395814 237659 318938 146874 435969 439005 359553 114102 221410 426170
16359D26170L7538L0607A68688J83338b6169D60364A53036J02968J82568B01006
$$ 426170 463708 494315 168688 352026 -26169 460364 153036 256004 438572 201006
16348A36585K95899K3873A83527M0499J28880Q2011j79718j5754J11329J37474
$$ 136585 432484 456357 183527 224026 352906 434917 255199 239445 350774 488248
16338D88248J3155j33180E9382M20745j85253a85888B55749o1386i9321B35459
$$ 488248 501403 368223 59382 480127 294874 -185888 255749 194363 -99321 235459
16327C63038A61619K14989B6676R6080d3462B08962J7185P5487J04313A99248
$$ 363038 161619 376608 26676 122756 -43462 208962 226147 301634 405947 199248
16316A20585L5849K18514m1160m022C0960K56902j00413K75452A65243P3027A16784
$$ 120585 156434 374948 333788 329766 30960 287862 187449 462901 165243 238270 116784
16304A01424J7494J14674J68216A56922F2746L3004a51157B52874f8801B11241
$$ 101424 118918 233592 401808 156922 62746 95750 -151157 252874 -68801 211241
16293B14667H5530i3823A37822D9578Q9797m2845a28455C13599k6735L80406C16558
$$ 214667 85530 -93823 137822 49578 139375 96530 -128455 313599 286864 667270 316558
16281D39933e1571F2501M69048k01865D7036J19566L13063b09339C02301j35286
$$ 439933 -51571 62501 531549 329684 47036 166602 479665 -209339 302301 167015
16271A67015E3831Q5383M0015B0650R9100M080K79440A97552m065i6495D4837
$$ 167015 53831 139214 179229 20650 119750 123830 403270 197552 193487 -96495 44837
16259B38583A8300a70937e5172B1612J68644f4214I5698k6217j2544j6765a38923
$$ 238583 18300 -170937 -55172 21612 190256 -64214 95698 69481 56937 40172 -138923
16247B87535K0700N3021j02317K54719g9744o5436h555C42081D4511L30317i3837
$$ 287535 308235 361256 258939 513658 -79744 -145180 -8555 342081 44511 374828 -93837
16235a4838A05488j4617a7809B09787a31746J9037m4728B17178j7762i0761B52930
$$ -14838 105488 90871 -17809 209787 -131746 -112709 -157437 217178 199416 -90761 252930
16223A91314a49294F2102L26911J04177P533A28096K0078C9938g6637B08815F3645
$$ 191314 -149294 62102 389013 493190 500723 128096 148174 39938 -76637 208815 63645
16211I3438J04348c1592A31461J48686e014F7819J08574h268B03085r0539N6959
$$ 93438 197786 -31592 131461 280147 -5014 67819 176393 -8268 203085 112546 169505
16200A69505b4050B54832a9346G2148a7504B11727a65349B01011m8679c50923
$$ 169505 -24050 254832 -19346 72148 -17504 211727 -165349 201011 152332 -350923
16189A00295M15035f1660q9497I3143J37142I2231N546g9325D3131P3807B2800
$$ 100295 515330 -61660 -151157 93143 230285 92231 97777 -79325 43131 116938 22800
16177B04321g3041I1731c07789C60125a47091B167b76223A14309L9505b1213l4913
$$ 204321 -73041 91731 -307789 360125 -147091 2167 -276223 114309 153814 -21213 -56126
16166e6126D0546R2052A7668J57023f1223A70475b5591C23972E3059g6644B61985
$$ -56126 40546 132598 17668 174691 -61223 170475 -25591 323972 53059 -76644 261985
16154g1324l7463H9129b1613B47002m2207q7817Q1891D4241R2013c50159C8570
$$ -71324 -108787 89129 -21613 247002 204795 116978 198869 44241 136254 -350159 38570
16142b60791a5786I055a01045A99405q4204m7113K13416B9430a81091h2291A64611
$$ -260791 -15786 9055 -101045 199405 115201 68088 281504 29430 -181091 -82291 164611
16130d39591d6488A58377J659p951c71601A5545b28356A40641a14262M0829F9142
$$ -439591 -46488 158377 160036 152085 -371601 15545 -228356 140641 -114262 -73433 69142
16118f6446I7580i4338j40172N2330A32743J06512I86J06564L1156J04824f4344
$$ -66446 97580 -94338 -234510 -182180 132743 239255 986 107550 138706 243530 -64344
16106c20875A88400a30401A39332B9869J67620p1773J95826D3249J69550g823
$$ -320875 188400 -130401 139332 29869 197489 125716 321542 43249 212799 -7823
16095H5109M0591h541m6487A95501b9486I2217K1438a08142E4720Q620K34275
$$ 85109 125700 -8541 -55028 195501 -29486 92217 113655 -108142 54720 63340 297615
16084B97615a24345G1831o582A7644a38644A76015N788O0109b38636P648B63889
$$ 297615 -124345 71831 65249 17644 -138644 176015 181803 241912 -238636 -230988 263889
16072A42021L8941J49134G4410a49047c1457I0456a57651D0337a43613P262q3644
$$ 142021 180962 330096 74410 -149047 -31457 90456 -157651 40337 -143613 -136351 -219995
16061b19995a01858j97609b4308G768a31949B09189h013A79057h0522A28443a26786
$$ -219995 -101858 -299467 -24308 7768 -131949 209189 -8013 179057 -80522 128443 -126786
16049G4158P773a93504A6090c39228A26668K7869a67612G2810K2747b5561n3316
$$ 74158 81931 -193504 16090 -339228 126668 154537 -167612 72810 95557 -25561 -78877
16038g8877A99044B4333f9835A16920c2023D8199K9606B6006f5958A30536R1380
$$ -78877 199044 24333 -69835 116920 -32023 48199 77805 26006 -65958 130536 221916
16027B21916g2437j3879B2226d21375f2754a3015j1928F0238c9369A98412i9854
$$ 221916 -72437 -86316 22226 -421375 -62754 -13015 -24943 60238 -39369 198412 -99854
16015I1899C2300A5144P2405R7987k0364p5469j8660a84115k43635h1982A84665
$$ 91899 32300 15144 87549 185536 165172 89703 71043 -184115 -427750 -81982 184665
16003h3145A86064D2808b29031d1152j39q458m22075a6001A51721f1578b222n2085
$$ -83145 186064 42808 -229031 -41152 -41291 -49749 -471824 -16001 151721 -61578 -2222 -54307
15991e4307A82682h8804C5596R0153a06127M1898j85332A91977J69693a28421
$$ -54307 182682 -88804 35596 125749 -106127 -64229 -249561 191977 361670 -128421
15980c4357j43198B2502a24699A31749a64578Q1446H8689a54117k7680I4187Q5767
$$ -34357 -177555 22502 -124699 131749 -164578 -83132 88689 -154117 -181797 94187 179954
15969A79954C4780J00755M60734A66928J5998g0933A32695N558C872L1130M6281
$$ 179954 34780 135535 596269 166928 182926 -70933 132695 138253 3872 35002 81283
15958H1283q559a75969A56645c1878A34542b68770E8427n189J7980d8732o1755
$$ 81283 72724 -175969 156645 -31878 134542 -268770 58427 53238 71218 -48732 -110487
15947a10487j08730m9863m287a09218A5463a37913F1112J4766p043a37416e8195
$$ -110487 -219217 -269080 -273367 -109218 15463 -137913 61112 75878 68835 -137416 -58195
15935h9612j07439q805h1074N534l6843d840A79018a91964N4588I2242j6265b4465
$$ -89612 -197051 -205856 -81074 -75540 -112383 -4840 179018 -191964 -137376 92242 75977 -24465
15922B809a6618n9871g414j01066j5526I4849J86676j12984e1134A98765G0353
$$ 2809 -16618 -76489 -7414 -108480 -124006 94849 281525 168541 -51134 198765 70353
15910d5197l1409b9443l79420O310a57986d3444j34458k1836d9790A20648O6919
$$ -45197 -76606 -29443 -408863 -402553 -157986 -43444 -177902 -199738 -49790 120648 187567
15899A87567d57768g225b956A8251a89196E4798K35199a64517D49625j22071E2992
$$ 187567 -457768 -7225 -2956 18251 -189196 54798 289997 -164517 449625 327554 52992
15887A72024a79463A30642D3986K52841b67431B51375C7231R3651b14689A07681
$$ 172024 -179463 130642 43986 296827 -267431 251375 37231 130882 -214689 107681
15876b41819R3266K5054l6264d0233p3310c6241A10841i5687k76567A14506b05485
$$ -241819 -148553 -123499 -159763 -40233 -113543 -36241 110841 -95687 -372254 114506 -205485
15864G2749b50331l3322A89258h0679j72433a12704o7101j9272q7860A07249a30970
$$ 72749 -250331 -283653 189258 -80679 -253112 -112704 -179805 -199077 -286937 107249 -130970
15852a71954J6060C70263B8299P0135a77589c4500m2616A7142b1680j21992j93831
$$ -171954 -155894 370263 28299 98434 -177589 -34500 -77116 17142 -21680 -143672 -337503
15841c37503D3739G51f293j20906B09873D0258J73311c41491B9099a60446j66013
$$ -337503 43739 751 -6293 -127199 209873 40258 213569 -341491 29099 -160446 -326459
15830c26459f6410C81366G1268R5680q0962K1406C4839b23814j8904l7830B26447
$$ -326459 -66410 381366 71268 166948 85986 107392 34839 -223814 -242718 -280548 226447
15818h679A76771g7373j7306B46644a7482k13452A45163a4694l24137F3350N6764
$$ -8679 176771 -77373 -94679 246644 -17482 -230934 145163 -14694 -338831 63350 120114
15807A20114f6158A0641g3577j14459b9186j92969G8148h5963l65223c4698G1838
$$ 120114 -66158 10641 -73577 -188036 -29186 -222155 78148 -85963 -451186 -34698 71838
15795A2365K7897a48819l5286g147l18756e3485G100a79168Q6104G313O5034d1613
$$ 12365 40262 -148819 -184105 -7147 -325903 -53485 7100 -179168 -93064 7313 72347 -41613
15782A37756r27d06068a54472p93j12208B30507b19535l676m4295A12783E5301
$$ 137756 136829 -406068 -154472 -155265 -267473 230507 -219535 -223211 -267506 112783 55301
15770b3443E9654d3385D4040a62762A65566F5057a21676B6400K01512q3529O738
$$ -23443 59654 -43385 44040 -162762 165566 65057 -121676 26400 227912 144383 151121
15759A51121d02056A37605g3383j61409c150A311a62017O9821E077f4754K4492
$$ 151121 -402056 137605 -73383 -234792 -3150 1311 -162017 -92196 5077 -64754 -40262
15748d0262C1626K37130a04772C4851L00156A4453K31544g9308K3806A19184j9199
$$ -40262 31626 268756 -104772 34851 335007 14453 245997 -79308 -55502 119184 99985
15737I9985c14497a3992I6634L0218J5087E6941l96h2321B20565I6327a64353
$$ 99985 -314497 -13992 96634 126852 141939 56941 56545 -82321 220565 96327 -164353
15725b08877a8123D8022J381i2234G1249a31685E6103b34958K0699A52349a25390
$$ -208877 -18123 48022 49403 -92234 71249 -131685 56103 -234958 -214259 152349 -125390
15713c44192A1331O2147b42718B20287a60192d7519J9241p170j2468j34068K0144
$$ -344192 11331 73478 -242718 220287 -160192 -47519 -28278 -35448 -47916 -181984 -161840
15702a61840o6858E2507a30330n2501Q9547D28171b40891K9513c2521r1795o6816
$$ -161840 -228698 52507 -130330 -182831 -93284 428171 -240891 -211378 -32521 -124316 -191132
15691a91132A6017b3142L343C32188a49804H5189a2301j35683M7328j5780m3597
$$ -191132 16017 -23142 -19799 332188 -149804 85189 -12301 -147984 -100656 -116436 -160033
15680a60033D30c4438F6678L9390a5163C2372K15422b14711O3779E4006j5761
$$ -160033 430 -34438 66678 106068 -15163 32372 247794 -214711 -150932 54006 38245
15669C8245a55413G8943a32303A32574h8623a1662j40382q6664e991E1609f8666
$$ 38245 -155413 78943 -132303 132574 -88623 -11662 -152044 -238708 -5991 51609 -68666
15657A9187b14037I1317a99015j03994B70898b6952M205H9721K8494e3429B0497
$$ 19187 -214037 91317 -199015 -303009 270898 -26952 -22747 89721 118215 -53429 20497
15645A62351h300D155b51129K599A20800E748L05507d2922p4106A27874g2849
$$ 162351 -8300 4155 -251129 -248530 120800 5748 311255 -42922 -117028 127874 -72849
15633a18024G3434K6448a00310K8530j54403R9953A91318c54475a46723D8103
$$ -118024 73434 99882 -100310 -71780 -226183 -126230 191318 -354475 -146723 48103
15622b40242j30620B09728a86756d1322A05401C092a23682I4309L447I588K00571
$$ -240242 -370862 209728 -186756 -41322 105401 3092 -123682 94309 97756 9588 210159
15611B10159r0373J10985A6533K37577J42700b42657B1820J16266b30581O8361
$$ 210159 119786 230771 16533 254110 396810 -242657 21820 138086 -230581 -162220
15601a62220A10215c1677j35707K274F1846M1029c7155o5652B57486a34487d5876
$$ -162220 110215 -31677 -167384 -165110 61846 102875 -37155 -102807 257486 -134487 -45876
15589a87241I3368K17861c4413G8270K85454b54695g5404I1049a48243B31997
$$ -187241 93368 311229 -34413 78270 363724 -254695 -75404 91049 -148243 231997
15578a55168B5812g3358C6661J81802a67164A31191b627A8079d7358j12157J7184
$$ -155168 25812 -73358 36661 218463 -167164 131191 -2627 18079 -47358 -159515 -142331
15567a42331C87891a76197A46395f3291D22593A3654J33652a40562A03266a85261
$$ -142331 387891 -176197 146395 -63291 422593 13654 147306 -140562 103266 -185261
15556G1087c40831a40645e8168A15907b21605A16146b02949A5554c3002k06908
$$ 71087 -340831 -140645 -58168 115907 -221605 116146 -202949 15554 -33002 -239910
15546b39910a17896F9258b08840B06962q4067e0567l46192a08999k07695a49942
$$ -239910 -117896 69258 -208840 206962 122895 -50567 -396759 -108999 -316694 -149942
15535A37281d1700A20512g737j89971c61C3479Q9183b08758I8717a00129m5182
$$ 137281 -41700 120512 -7737 -197708 -361 33479 122662 -208758 98717 -100129 -145311
15524a45311B10753F7746E743J1725o354a32704j25897G6904N0228C3462A5982
$$ -145311 210753 67746 5743 17468 11114 -132704 -258601 76904 127132 33462 15982
15512F7681j8027K70420B6563a99970R5315m3230C47866D399J3543b98209J46465
$$ 67681 49654 320074 26563 -199970 -104655 -147885 347866 4399 17942 -298209 -151744
15501a51744E901g6597I4174B1697g9941k70276L3879i4293n0472a7333k24735
$$ -151744 5901 -76597 94174 21697 -79941 -350217 -316338 -94293 -144765 -17333 -242068
15490b42068a20952A25376b705j04798E6574K9886A478O0568h9197C2706Q2253
$$ -242068 -120952 125376 -2705 -107503 56574 86460 1478 62046 -89197 32706 114959
15479A14959m9442i436D0087b33131A72873a75358O9301A87298c06521Q3110l364
$$ 114959 65517 -9436 40087 -233131 172873 -175358 -106057 187298 -306521 -223411 -226775
15468b26775G6174M7683f5089p4721d4398j09708n7341A6391d4312J4435k62934
$$ -226775 76174 123857 -65089 -139810 -44398 -154106 -211447 16391 -44312 -29877 -292811
15457b92811F619b22535d0479A5869a65687B71835a6180C55544c3127A39687o3056
$$ -292811 6619 -222535 -40479 15869 -165687 271835 -16180 355544 -33127 139687 76631
15446G6631h6539E1218J35213m0469n3966l5687a96595A5613a26803j69643J11627
$$ 76631 -86539 51218 186431 145962 91996 56309 -196595 15613 -126803 -296446 -184819
15435a84819H0289K1361i3014J3526A81954b28940f9882A75135a20026C87732
$$ -184819 80289 101650 -93014 -79488 181954 -228940 -69882 175135 -120026 387732
15424e1513j57296F7148a87832d0822n1963B07126F9755P7417M5588M1953q3512
$$ -51513 -208809 67148 -187832 -40822 -92785 207126 69755 147172 192760 234713 151201
15413A51201k7674j6767h827j49795A82247B7874a81206Q9490A68196a19351j01320
$$ 151201 123527 106760 -8827 -158622 182247 27874 -181206 -91716 168196 -119351 -220671
15402b20671C8365J46165F6568h8419B03387k2992F6023J47761l2090i0407E3451
$$ -220671 38365 184530 66568 -88419 203387 180395 66023 213784 181694 -90407 53451
15390A6325E243J37672C4939a07220a5198j31723O7083J7049l04613E6802N9110
$$ 16325 5243 142915 34939 -107220 -15198 -146921 -79838 -62789 -367402 56802 115912
15379A15912E4119f4707q8983p2525c2678C00302a24537p973I3115m6008J35979
$$ 115912 54119 -64707 -153690 -226215 -32678 300302 -124537 -132510 93115 47107 183086
15368A83086B2390M0031a30278d1064A35994b4j33865B29951a16595A72846b11881
$$ 183086 22390 62421 -130278 -41064 135994 -24 -133889 229951 -116595 172846 -211881
15356a64690C8644O6496k3225C9590J80794a76940o7852A37224a08494n4395F3754
$$ -164690 38644 105140 81915 39590 220384 -176940 -244792 137224 -108494 -162889 63754
15344A27179K7598F4707c5465F1099b01925R6060A12107D144J20912N2701c2760
$$ 127179 154777 64707 -35465 61099 -201925 -105865 112107 4144 125056 177757 -32760
15332i2491A28614J58127i5691A6304J03956a70568F4281m41c2883j32703e5950
$$ -92491 128614 286741 -95691 16304 120260 -170568 64281 63840 -32883 -165586 -55950
15320a24716A44095a45247C1024a16880B43880a88004I0642b88404a22852A11086
$$ -124716 144095 -145247 31024 -116880 243880 -188004 90642 -288404 -122852 111086
15309i5724D052h5230f058I9186D2057K48848a43824K4201G7161f8004A06360
$$ -95724 4052 -85230 -6058 99186 42057 290905 -143824 -119623 77161 -68004 106360
15297a45877B58809h2718B12852a20333c0252n5694n4373f6078B6553J18847J04972
$$ -145877 258809 -82718 212852 -120333 -30252 -85946 -140319 -66078 26553 145400 250372
15286B50372p6292E2972a07783l94709B42284a57418g65A22752k9740q012J09208
$$ 250372 174080 52972 -107783 -502492 242284 -157418 -765 122752 93012 85000 194208
15275A94208a03639A77821K66370A31814b05392A32621K9620e7584J3872A45317
$$ 194208 -103639 177821 444191 131814 -205392 132621 162241 -57584 -43712 145317
15264A38306E1974A1861a45960A35146e4810B76596f9839F6499P92k5228N7878
$$ 138306 51974 11861 -145960 135146 -54810 276596 -69839 66499 67291 42063 99941
15253I9941a9030k82575b0709k5547F3467N0011a63009a4613r5417A24419b7959
$$ 99941 -19030 -301605 -20709 -46256 63467 113478 -163009 -14613 -110030 124419 -27959
15241g9560A08507E416d6783B85124k3618J11573L61501N13424o4736k14498j42553
$$ -79560 108507 5416 -46783 285124 261506 373079 734580 1248004 1183268 968770 826217
15230H26217J16266D25093L5547A06242J61986b94123A20371A3181K18468d0248
$$ 826217 942483 425093 460640 106242 268228 -294123 120371 13181 231649 -40248
15219A8134g5979I7642a41205A25766a04663l4698C00406D9000b55067C80876
$$ 18134 -75979 97642 -141205 125766 -104663 -139361 300406 49000 -255067 380876
15208i3090j67258A36179J0879A4385h6772j50869f8646A18573L25688b83601
$$ -93090 -260348 136179 147058 14385 -86772 -237641 -68646 118573 444261 -283601
15197a75500r9326H2835K28452A21490Q635F4812J15139J10011j03759a68525
$$ -175500 -274826 82835 311287 121490 130125 64812 179951 289962 186203 -168525
15186b6969E9269n873J6878c7109D36200b0059B94522G2661B3897H285K05552
$$ -26969 59269 53396 70274 -37109 436200 -20059 294522 72661 23897 8285 213837
15175B13837M0511g0834A5809C976J02768K40678H6291a22006A49834A3776J26611
$$ 213837 254348 -70834 15809 3976 106744 347422 86291 -122006 149834 13776 140387
15164A40387A6887J34510f5897j14415E5438L0614O8790J87390j63942d1047r1164
$$ 140387 16887 151397 -65897 -180312 55438 86052 154842 342232 178290 -41047 -132211
15153a32211F2740g2039B16488c2432B23610k382J30281b88744A62222a42287
$$ -132211 62740 -72039 216488 -32432 223610 221228 351509 -288744 162222 -142287
15142g2265j37132B89107H1328k7943a30303A7255L07573F7540Q7485J458k8650
$$ -72265 -209397 289107 81328 53385 -130303 17255 324828 67540 155025 156483 127833
15131A27833J39148a40542A08804a2707B63354b17122A38898m6761N1504R0866
$$ 127833 266981 -140542 108804 -12707 263354 -217122 138898 92137 143641 234507
15121B34507n7555Q1480L3281A568K50400p0324J13371l2747A30518J56998a27502
$$ 234507 176952 258432 291713 1568 251968 181644 295015 262268 130518 287516 -127502
15109f1236r1274G5586J5507K80436A70034L1706B9662P050a88866C442J20516
$$ -61236 -152510 75586 91093 371529 170034 201740 29662 36712 -188866 3442 123958
15098A23958L89845A19317K7562b01007G6670B6151h2413E15821a2717j77496
$$ 123958 513803 119317 146879 -201007 76670 26151 -82413 515821 -12717 -190213
15088a90213R3177A6066K54484j33064R3348B0444a35574C07544Q5494f9607j7
$$ -190213 -97036 16066 270550 137486 230834 20444 -135574 307544 393038 -69607 -69624
15077f9624B57166d8056F7909k2602A7648K76087F2675l90k7790L18055A52127
$$ -69624 257166 -48056 67909 45307 17648 293735 62675 62285 34495 352550 152127
15065b1258F1639J30689b887C33472c2748F4529J07853n497J12899o2711b46743
$$ -21258 61639 192328 -2887 333472 -32748 64529 172382 166885 279784 217073 -246743
15053A98114p7560K31001C8253N3397a00591a1382j59958A46439n0754c89775
$$ 198114 120554 351555 38253 91650 -100591 -11382 -171340 146439 95685 -389775
15042E0512N0145J50873G9996k7245J70604N7255a2557B57984B3164a48569A28866
$$ 50512 100657 251530 79996 52751 223355 280610 -12557 257984 23164 -148569 128866
15030A25914A4515L18534C145K30763l0773o82A00910l7275J4447a2258C28393
$$ 125914 14515 333049 3145 233908 203135 202453 100910 63635 78082 -12258 328393
15018A11518a5164I5712C7206K1417N1200K94861A37095k8389J21625D9408M9793
$$ 111518 -15164 95712 37206 58623 109823 404684 137095 108706 230331 49408 99201
15007I9201J2303O1644L6040a37685A3525J22679h5145D44J83643k7557e1562
$$ 99201 111504 173148 209188 -137685 13525 136204 -85145 444 184087 156530 -51562
14995a4255C51833J49234q3743o4657A27212k1246m0824J87904O8376b1637D50612
$$ -14255 351833 501067 417324 352667 127212 105966 65142 253046 321422 -21637 450612
14983h8676M3937b0844A62201b4836B1807g8137A76941K4688b72107B07636J16212
$$ -88676 -44739 -20844 162201 -24836 21807 -78137 176941 201629 -272107 207636 323848
14972C23848R0403P3060A02413J64109A719g82I4039o11L18281R9521B42928p1011
$$ 323848 414251 487311 102413 266522 1719 -782 94039 93428 411709 511230 242928 171917
14960A71917J67720A15933L69654G4893K54889r0174J3916j19116K28604h5230
$$ 171917 339637 115933 485587 74893 329782 239608 253524 134408 363012 -85230
14949B73351j5719L30733m6275j43119A75947K50777j18067j40390a04847F1511
$$ 273351 257632 588365 542090 398971 175947 426724 308657 168267 -104847 61511
14938D23478G9612C17J76203J21703k9722k871j07586J1763N515m0582R7305I6123
$$ 423478 79612 317 176520 298223 268501 265630 158044 169807 175322 134740 232045 96123
14925F2133K59972q1009J98506A21927F0882M45835O239A14251R2517K88316p3344
$$ 62133 322105 241096 439602 121927 60882 506717 512956 114251 206768 495084 421740
14914D21740A98892J1624K32783A24459k4346J21355K26697A79046J55154q8544
$$ 421740 198892 210516 443299 124459 100113 221468 448165 179046 334200 245656
14904B45656M26359k61307C5881L56164F2045K38910P8669C7984K62828A22358
$$ 245656 672015 410708 35881 392045 62045 300955 379624 37984 300812 122358
14893E23500G8217K12514A42373K06372G8257L64381a4042G8486J15129K67318
$$ 523500 78217 290731 142373 348745 78257 442638 -14042 78486 193615 460933
14883D60933j27600K24817B60151K05624C9799L43370J9192j56981J01407K19592
$$ 460933 333333 558150 260151 465775 39799 383169 402361 245380 346787 566379
14873E66379B26554O365L0785L9548l1712J39276M0926A43138J93256m1642j13191
$$ 566379 226554 232919 263704 303252 271540 410816 451742 143138 336394 294752 181561
14862A81561Q7340E8577M12622k35312M81452A9855K76081J12248n7978n4448
$$ 181561 268901 58577 471199 235887 717339 19855 295936 408184 350206 295758
14852B95758Q7365L7404j20487n7094k1281J99899J51271B29830N4253K36279
$$ 295758 383123 420527 300040 242946 221665 421564 572835 229830 284083 520362
14842E20362A85705M71678B26979M0005j5305J23360N4251R2113r3518J17259
$$ 520362 185705 657383 226979 266984 251679 375039 429290 521403 427885 545144
14832E45144J02750B88723J15019J16828l5416A63346J78479J12917j18055J49092
$$ 545144 647894 288723 403742 520570 485154 163346 341825 454742 336687 485779
14822D85779B4183K51018P5423p1645O2976j37939M44317o7640j09298j44609
$$ 485779 24183 275201 350624 278979 341955 204016 648333 580693 471395 326786
14812C26786J05947m8082r2266H2241L28774O358L09333j68636K00094l69926
$$ 326786 432733 384651 292385 82241 411015 417373 726706 558070 758164 388238
14802C88238L6188M8896A62339N19527C31223M80269k16683k8637J8547k34648
$$ 388238 424426 473322 162339 681866 331223 811492 594809 566172 584719 350071
14792C50071J34140M338j28210J29870n4696k05537L0235K06258r8864j5194J13428
$$ 350071 484211 488549 360339 490209 435513 229976 260211 466469 367605 352411 465839
14781D65839j1273j42203J61252j32995K01073j92919A69937J63493K6017j33914
$$ 465839 454566 312363 473615 340620 541693 348774 169937 333430 359447 225533
14771B25533N83572k7375N1013F9489N76032j83844J01293K6576j11821l1288
$$ 225533 809105 781730 832743 69489 645521 461677 562970 589546 477725 446437
14761D46437k0527K86532l2169L97j87516Q8030k31601O9682M16960j02146A81897
$$ 446437 425910 712442 680273 680670 493154 581184 349583 419265 836225 734079 181897
14749C48118L19220m01l09030J66986n3620J61543K10336A95929L00291L40165
$$ 348118 667338 666937 357907 524893 471273 632816 843152 195929 496220 836385
14739H36385J3224j15317j93909k11541P958L05034O28102n15787j10404J67009
$$ 836385 849609 734292 540383 328842 336800 641834 1269936 754149 643745 810754
14729H10754k90994M28502l42288R7839k66290K27978K68345m08943J57376J33829
$$ 810754 519760 948262 605974 703813 437523 665501 933846 524903 682279 816108
14719H16108L6764l20888K04476K83163m30163J45718O17K36661k5819j22692
$$ 816108 852872 531984 736460 1019623 589460 735178 735795 972456 946637 823945
14709H23945j40507J39560o0915N8918k75167J70040l6515j3946J38637K18792
$$ 823945 683438 822998 762083 821001 545834 715874 679359 665413 804050 1022842
14699A022842j87035j59400M8769N0958K6774l09517K69635k80950R2573L88431
$$ 1022842 835807 676407 725176 776134 802908 493391 763026 482076 574649 963080
14689I63080O1225l89595J44692J51622j34342R8113j88296O2511m6339J77748
$$ 963080 1024305 634710 779402 931024 796682 894795 706499 769010 722671 900419
14679I00419j59668P1426L1004j02708J25068L0124j44026L69797J24921m50827
$$ 900419 740751 812177 843181 740473 865541 895665 751639 1121436 1246357 795530
14669G95530j28517J27780L4108K41072j19785p634k24607N20700m17444Q7532
$$ 795530 667013 794793 828901 1069973 950188 942554 717947 1238647 821203 908735
14659I08735j03712J1560n5745L12468k54454Q3685j32984j63339M56637M1859
$$ 908735 805023 816583 760838 1073306 818852 902537 769553 606214 1062851 1104710
14649A104710J93504k61457J66431l27771K46223l47450L79856l59276L44685
$$ 1104710 1298214 1036757 1203188 875417 1121640 774190 1154046 794770 1139455
14640A139455Q9090k56101K47983K0241j70571L2179j26224J60992M3450k58078
$$ 1139455 1228545 972444 1220427 1240668 1070097 1102276 976052 1137044 1180494 922416
14630I22416J95113D86351M05921L50429k46293J04462J58980q9764N6016K97669
$$ 922416 1117529 486351 892272 1242701 996408 1100870 1259850 1170086 1226102 1523771
14620A523771k29801j8005K393j60751O076n4865M41278j60707N8458L43463p02038
$$ 1523771 1293970 1275965 1278358 1117607 1123683 1068818 1510096 1349389 1407847 1751310 1049272
14609A049272m1455O2774n0685K16541J23442j58547n3514M41987k18772R8409
$$ 1049272 1007817 1070591 1019906 1236447 1359889 1201342 1147828 1589815 1371043 1469452
14599A469452J0802k05951K83168o5810J03860k46983L30994j24247j47507K43614
$$ 1469452 1480254 1274303 1557471 1491661 1595521 1348538 1679532 1555285 1407778 1651392
14589A651392l02064p5513M00393k51533K5286K32336j94339R7408P1958R2774
$$ 1651392 1349328 1273815 1674208 1422675 1447961 1680297 1485958 1583366 1655324 1748098
14579A748098N98j92010L54647l13214L41833j22386j14038K12662J44124K8502
$$ 1748098 1748696 1556686 1911333 1598119 1939952 1817566 1703528 1916190 2060314 2088816
14569B088816j69573M5532q2680r5736J11565J56094K28015m16037J77896M4068
$$ 2088816 1919243 1964775 1882095 1786359 1897924 2054018 2282033 1865996 2043892 2087960
14559B087960q8608K28144K58424p30233L19730L15616m06618M52504r0302r6567
$$ 2087960 1999352 2227496 2485920 1755687 2075417 2391033 1984415 2436919 2346617 2250050
14549B250050J97463J58687K12604m14687J69353J33594K71713Q7580N1284M58309
$$ 2250050 2447513 2606200 2818804 2404117 2573470 2707064 2978777 3066357 3117641 3575950
14539C575950K49476N23604N79734M16431J339703J805534L326456N775524Q251483
$$ 3575950 3825426 4349030 4928764 5345195 6684898 8490432 11816888 17592412 25843895
14530B5843895M904321j0441126q100712m430199k233886j371385p87598j56626
$$ 25843895 30748216 20307090 12206378 7776179 5542293 4170908 3383310 3226684
14522C226684k75734l28687k8869k24936l0386k98147L61396l46106k8197O9593
$$ 3226684 2950950 2622263 2593394 2368458 2338072 2039925 2401321 2055215 2027018 2096611
14512B096611J67152l57587P4056N50332k25904k72223P88141l46156M324J16994
$$ 2096611 2263763 1906176 1980232 2530564 2304660 2032437 2820578 2474422 2478746 2595740
14502B595740m8372M7918n7536L33611k34388k632O1264R0129J058N077o466J57906
$$ 2595740 2547368 2595286 2537750 2871361 2636973 2634341 2695605 2785734 2786792 2791869 2785403 2943309
14490B943309M0947j79039L57543l52567M83056l66949K04131k94029M07846q7915
$$ 2943309 2984256 2805217 3162760 2810193 3293249 2926300 3130431 2836402 3244248 3156333
14480C156333l5660J99915K30271k51715j76664q4405M02928k06055O8800N1424
$$ 3156333 3120673 3320588 3550859 3299144 3122480 3038075 3441003 3234948 3303748 3355172
14470C355172J84350k6402j48194J15729L67716n19206N26690K61505j73865o6580
$$ 3355172 3539522 3513120 3364926 3480655 3848371 3329165 3855855 4117360 3943495 3876915
14460C876915o4638M76635k53032L49560n43174L04570J46621k62692K35076J07597
$$ 3876915 3812277 4288912 4035880 4385440 3842266 4146836 4293457 4030765 4265841 4373438
14450D373438P406k13386J49883L90068o0200J72729q2829K50523N3517m8989
$$ 4373438 4380844 4167458 4317341 4707409 4647209 4819938 4737109 4987632 5041149 4992160
14440D992160n4526j63244K20998L7975L49330l89070Q9731L26096K21848j5756
$$ 4992160 4937634 4774390 4995388 5033363 5382693 4993623 5083354 5409450 5631298 5615542
14430E615542Q5937K8279k64578N35811j69061K18871J38420k58360J53249K96996
$$ 5615542 5701479 5729758 5465180 6000991 5831930 6050801 6189221 5930861 6084110 6381106
14420F381106k83775L13455p112L4859J85411K51018k92957K74824N29569j82355
$$ 6381106 6097331 6410786 6403674 6438533 6623944 6874962 6582005 6856829 7386398 7204043
14410G204043O5748m59844M52611K10713J90450j32426K62129J12554P7650L86209
$$ 7204043 7269791 6809947 7262558 7473271 7663721 7531295 7793424 7905978 7983628 8369837
14400H369837k43778L36251J81416O8584j56286J80327O05215m76084K60052M85753
$$ 8369837 8126059 8462310 8643726 8712310 8556024 8736351 9341566 8865482 9125534 9611287
14390I611287j03161K16701j57637O96665K59511J4238m7033K37492m3323K35918
$$ 9611287 9508126 9724827 9567190 10263855 10523366 10537604 10490571 10728063 10684740 10920658
14380A0920658L02651M66774j70017M53002m1436J78717M96468R7294K36347R890
$$ 10920658 11223309 11690083 11520066 11973068 11931632 12110349 12606817 12704111 12940458 12950348
14370A2950348M09445M17572r9523L26838M07809K62521j88304P76879N70122
$$ 12950348 13359793 13777365 13677842 14004680 14412489 14675010 14486706 15263585 15833707
14361A5833707M3759o1540P58382P9503M34007J19650M00914L79366k6803R71634
$$ 15833707 15877466 15815926 16574308 16653811 17087818 17207468 17608382 17987748 17960945 18932579
14351A8932579K09658J38521P47015K52071J098177j92493J007169K44567N5501
$$ 18932579 19142237 19280758 20027773 20279844 21378021 21185528 22192697 22437264 22492765
14342B2492765Q87610M67816L32222Q76199N20458N72808M60089J162782M49599
$$ 22492765 23380375 23848191 24180413 25056612 25577070 26149878 26609967 27772749 28222348
14333B8222348N09081O99739R47095Q30849J013610O08283O21653J155285J076566
$$ 28222348 28731429 29431168 30378263 31209112 32222722 32831005 33452658 34607943 35684509
14324C5684509P05859J103723R95224J068861J264765R47398J708128J320387
$$ 35684509 36390368 37494091 38489315 39558176 40822941 41770339 43478467 44798854
14316D4798854J437458J335601J363965J413731J906898J699316J760135J826391
$$ 44798854 46236312 47571913 48935878 50349609 52256507 53955823 55715958 57542349
14308E7542349J514733K352161K247406K241044K075097K640774K721499K804572
$$ 57542349 59057082 61409243 63656649 65897693 67972790 70613564 73335063 76139635
14300G6139635K889028L275317L527031L120180L397928L862469L882391M282634
$$ 76139635 79028663 82303980 85831011 88951191 92349119 96211588 100093979 104376613
14292A04376613M647216M690632N021517N207115N439294O177677N881315O611461
$$ 104376613 109023829 113714461 118735978 123943093 129382387 135560064 141441379 148052840
14284A48052840P161874P192987Q081408Q353683Q705811R154996R727511J0270263
$$ 148052840 155214714 162407701 170489109 178842792 187548603 196703599 206431110 216701373
14276B16701373J0988440J1000760J1742548J2257358J2750799J3223713J3091309
$$ 216701373 227689813 238690573 250433121 262690479 275441278 288664991 301756300
14269C01756300J3631702J3483365J3623005J2607989J1808292J0549236R783806
$$ 301756300 315388002 328871367 342494372 355102361 366910653 377459889 387243695
14262C87243695Q306620P215852O922747O508384M756878J760747m82061Q0770
$$ 387243695 395550315 402766167 409688914 416197298 420954176 422714923 422232862 422313632
14254D22313632p50390o618388o732144q479176q899529j0702655j0468048j1023065
$$ 422313632 421563242 414944854 408212710 399733534 390834005 380131350 369663302 358640237
14246C58640237j1531228j1388834j2615257j2374968j2581139j2275991j1775989
$$ 358640237 347109009 335720175 323104918 310729950 298148811 285872820 274096831
14239B74096831j2006477j2253011j2204032j1158642j1209163j0450059j0639411
$$ 274096831 262090354 249837343 237633311 226474669 215265506 204815447 194176036
14232A94176036r770490r465960q643240q072423p769904p247032o443006o854674
$$ 194176036 184405546 174939586 166296346 158223923 150454019 143206987 136763981 129909307
14224A29909307o005814n313034n245383m760275m652887m736690l999824l803311
$$ 129909307 123903493 118590459 113345076 108584801 103931914 99195224 95195400 91392089
14216I1392089l450985l903832l082116l332092l072229k659895k607397k458154
$$ 91392089 87941104 84037272 80955156 77623064 74550835 71890940 69283543 66825389
14208F6825389k699694j846288k120009k365704j886141j513501k161132j392606
$$ 66825389 64125695 62279407 60159398 57793694 55907553 54394052 52232920 50840314
14200E0840314j514707j702827j318283j413221j548814j081219j318816j125334
$$ 50840314 49325607 47622780 46304497 44891276 43342462 42261243 40942427 39817093
14192C9817093q22990j004990j461647r24342p92763j301264l42064q75620j023334
$$ 39817093 38994103 37989113 36527466 35603124 34810361 33509097 33167033 32291413 31268079
14183C1268079r86255r08666m20631q17350p38857p24525o46069o70910n21377
$$ 31268079 30281824 29373158 28952527 28135177 27396320 26671795 26025726 25354816 24833439
14174B4833439o75470n05110o89743j92802m47046p81660m02690k58848m52826
$$ 24833439 24157969 23652859 22963116 22770314 22323268 21541608 21138918 20880070 20427244
14165B0427244p64573j24573l95840p79293n8331m92381l36903k31179l43797
$$ 20427244 19662671 19538098 19142258 18362965 18304634 17812253 17475350 17244171 16900374
14156A6900374J00768o76415l62020k12093n05890J55254o82828o282m77721l53078
$$ 16900374 17001142 16324727 15962707 15750614 15244724 15399978 14717150 14710868 14233147 13880069
14146A3880069l12743l34276k4342k66052k88870l49318J74772k87513j45535
$$ 13880069 13567326 13233050 13208708 12942656 12653786 12304468 12479240 12191727 12046192
14137A2046192j06318p02531K67535m33992J82519l74405k49446j44k77763M7802
$$ 12046192 11939874 11237343 11504878 11070886 11253405 10879000 10629554 10629410 10351647 10399449
14127A0399449o24051K21794k04743k25047k9968o6622k30319J07991n29143r1777
$$ 10399449 9775398 9997192 9792449 9567402 9537434 9470812 9240493 9348484 8819341 8727564
14117H727564J11457m63548K9905j27267q7321l9544n00723L63781k08374j697
$$ 8727564 8839021 8375473 8405378 8278111 8190790 8151246 7650523 8014304 7805930 7804233
14107G804233p6528m06320j7614j88629j57448K14573r0879m05854J63831N9903
$$ 7804233 7727705 7321385 7303771 7115142 6957694 7172267 7081388 6675534 6839365 6899268
14097F899268k26989j25756L2385j02185l0499j59173j30423k08069j28318L28720
$$ 6899268 6672279 6546523 6578908 6476723 6446224 6287051 6156628 5948559 5820241 6148961
14087F148961m34186M6734K8334j81357j19583K65111l42893j87730J87241Q5
$$ 6148961 5714775 5761509 5789843 5608486 5488903 5754014 5411121 5223391 5410632 5410717
14077E410717j92380p1947O8257o6907r3526j9715l98617L28331K72415m87095
$$ 5410717 5218337 5146390 5214647 5147740 5054214 5034499 4635882 4964213 5236628 4749533
14067D749533n1742Q549O1858k65655J07290j48792o077J5881k77093M47972m41423
$$ 4749533 4697791 4706340 4768198 4502543 4609833 4461041 4454964 4470845 4193752 4641724 4200301
14056D200301k3147j43405N20971o01080j42173K70695n9644m06455M22731j58351
$$ 4200301 4177154 4033749 4554720 3953640 3811467 4082162 4022518 3616063 4038794 3880443
14046C880443p4328q2181K26504M825k75301K15300m63733J64924J57761n01877
$$ 3880443 3806115 3723934 3950438 3955263 3679962 3895262 3431529 3596453 3754214 3252337
14036C252337K50963l06186K27436O0154k14359J35368l73799l1187m7224K30475
$$ 3252337 3503300 3197114 3424550 3484704 3270345 3405713 3031914 3000727 2953503 3183978
14026C183978J22807k30122k33272L28697l11781L66819O1535m02856J86886J2904
$$ 3183978 3306785 3076663 2843391 3172088 2860307 3227126 3288661 2885805 3072691 3085595
14016C085595n29870J90457k043j09851K15123m0104j29824N0561L9733j3605
$$ 3085595 2555725 2746182 2744139 2634288 2849411 2809307 2679483 2730044 2769777 2756172
14006B756172j51324R8389l6557l23674N12698j70402m17402L65444m18740K478
$$ 2756172 2604848 2703237 2666680 2343006 2855704 2685302 2267900 2633344 2214604 2217082
13996B217082K65070l1924k21165k27338K87929j79766K14102j64934p9107R1484
$$ 2217082 2482152 2450228 2229063 2001725 2289654 2109888 2323990 2159056 2079949 2171433
13986B171433K0883m8478q5125L2027L87951j28617Q7881m3669O79275k22618
$$ 2171433 2192316 2143838 2058713 2090740 2478691 2350074 2437955 2394286 3073561 2850943
13976B850943N06234O59263J415983K600586N100850P348906Q736657p303314
$$ 2850943 3357177 4016440 5432423 8033009 13133859 20482765 29219422 21916108
13968B1916108o886403m784630k257714j862516j054359o05851p58616j18653
$$ 21916108 15029705 10245075 7987361 6124845 5070486 4464635 3706019 3587366
13960C587366j97369k20427j68710n22789J73550l27927P13385m46605k28499
$$ 3587366 3389997 3169570 3000860 2478071 2651621 2323694 3037079 2590474 2361975
13951B361975j67443j80518K95467k51410L17125l06663J07919k16057k11669
$$ 2361975 2194532 2014014 2309481 2058071 2375196 2068533 2176452 1960395 1748726
13942A748726K59463J68166m35268J16663Q4347J12329l03790K40960j82029K0533
$$ 1748726 2008189 2176355 1741087 1857750 1942097 2054426 1750636 1991596 1809567 1830100
13932A830100N8568l16093L15435k96038q0439J93589k49341M33995l20821L5581
$$ 1830100 1888668 1572575 1888010 1591972 1511533 1705122 1455781 1889776 1568955 1604536
13922A604536K99314p2526m67515N0113K44009O9072k23183l216J03405l71884
$$ 1604536 1903850 1831324 1363809 1413922 1657931 1727003 1503820 1500604 1604009 1232125
13912A232125N52251l66458K819k12305M60681N2919N290m30694j15446N35117
$$ 1232125 1784376 1417918 1420737 1208432 1669113 1722032 1727322 1296628 1181182 1716299
13902A716299l73396K06286m10985L96942l9215j71876J08444J06564n50231K10736
$$ 1716299 1342903 1549189 1138204 1535146 1495931 1324055 1432499 1539063 988832 1199568
13892A199568R0056k27442m0483M69116k14510J26032j13839K64067k12878j71262
$$ 1199568 1289624 1062182 1021699 1490815 1276305 1402337 1288498 1552565 1339687 1168425
13882A168425K96116q5788j79416k24204J22075P6488q2250K19619m1550k01094
$$ 1168425 1464541 1378753 1199337 975133 1097208 1173696 1091446 1311065 1269515 1068421
13872A068421m1939N2821K7796m0925L82591l08866J23385o2765j40799N44257
$$ 1068421 1026482 1079303 1107099 1066174 1448765 1139899 1263284 1200519 1059720 1603977
13862A603977l79744O9530l01023p2075L60330r2443k07052J44245l42697L16531
$$ 1603977 1224233 1293763 992740 920665 1280995 1188552 981500 1125745 783048 1099579
13852A099579j32180K14136m9931J34667k14619J82372j58609j40697K27152p6396
$$ 1099579 967399 1181535 1131604 1266271 1051652 1234024 1075415 934718 1161870 1085474
13842A085474q1887p877M9063J69826j02010K80l23395L40285j97925N53273j98603
$$ 1085474 1003587 995710 1044773 1214599 1112589 1112869 789474 1129759 931834 1485107 1286504
13831A286504m43103L10885J72152N5251m33395j47267M8684n0896J40047j82430
$$ 1286504 843401 1154286 1326438 1381689 948294 801027 849711 798815 938862 756432
13821G56432J02086J5552j60582K16610M4451L9147l25460J52307r3855J034j01180
$$ 756432 858518 874070 713488 930098 974549 1013696 688236 840543 746688 747722 646542
13810F46542L20946K28683m2393k2495C22030L16389O0710K17657j00247L47398
$$ 646542 967488 1196171 1153778 1131283 322030 638419 699129 916786 816539 1163937
13800A163937m35705j92682J90621P4782O8047J0114j88975k5586m5773K62767
$$ 1163937 728232 535550 726171 800953 869000 879114 690139 664553 618780 881547
13790H81547l21843K10734N4145L25523j92799k16142M5858k08985K25398C56076
$$ 881547 559704 770438 824583 1150106 957307 741165 787023 578038 803436 356076
13779F44011k23167K97266P8668J5824q7776K3925j00308J81705J46428j20945
$$ 644011 420844 718110 796778 812602 724826 748751 648443 830148 976576 855631
13769H55631k23117L13051l44284Q7333n2445P5366j5916J98754q0910k9984k84595
$$ 855631 632514 945565 601281 688614 636169 711535 695619 894373 813463 783479 498884
13758D98884R7287N1827r274M13212l86337r3024O2602q1752J99519j46230B81070
$$ 498884 596171 647998 638724 1051936 665599 572575 635177 553425 752944 606714 281070
13746H82816l14371j72428K67264j53223J04933r1753J94463N8205l1993l13744
$$ 882816 568445 396017 663281 510058 614991 523238 717701 775906 743913 430169
13736D30169l9320K80871m7271j42581K19188k33331J86202N7930L88j74503J38088
$$ 430169 390849 671720 624449 481868 701056 467725 653927 711857 712245 537742 675830
13725F75830C18846K34049k38881J95036M68375l52440Q7970p3148k08501K46988
$$ 675830 318846 552895 314014 509050 977425 624985 712955 639807 431306 678294
13715F78294j28064K91183l40266k0247m8573k3746q2029M01569o9952j55739
$$ 678294 550230 841413 501147 480900 432327 408581 326552 728121 658169 502430
13705E02430K36494l7427J06656r9251C46277L02196K55643l38097L18579q7448
$$ 502430 738924 701497 808153 708902 346277 648473 904116 566019 884598 797150
13695G97150j12527l15393N1864o2277K12425j16992L69653k11638k36371J56987
$$ 797150 684623 369230 421094 358817 571242 454250 823903 612265 375894 532881
13685E32881L8397j7408B74008N41674C71605Q1964j00925K84609C05775L03516
$$ 532881 571278 553870 274008 815682 371605 453569 352644 637253 305775 609291
13675F09291l8030q279J91935C58990j60456L27317j5973j59940n6172K32839
$$ 609291 571261 562982 754917 358990 198534 525851 509878 349938 293766 526605
13665E26605R4929n5475k26422Q2536Q9022A61126o5984K23772k5569J07414j46117
$$ 526605 621534 566059 339637 422173 511195 161126 95142 318914 293345 400759 254642
13654B54642K54931c1847E87044n5427J2485n610k44331N09194l44786K1020J77528
$$ 254642 509573 -31847 587044 531617 544102 538492 294161 803355 458569 479589 657117
13643F57117j25316A91809K37273J22404A35680K49923j39563L1819K30598M2025
$$ 657117 531801 191809 429082 551486 135680 385603 246040 277859 508457 550482
13633E50482o1974J28762j10543M0853A77962K21287A84650M0804K12551e39A88954
$$ 550482 488508 617270 506727 547580 177962 399249 184650 225454 438005 -539 188954
13621C15663i73E31088J1937A30095L85257J99911k34086J79775B43401o412Q5507
$$ 315663 -973 531088 543025 130095 515352 715263 481177 660952 243401 236989 322496
13610C22496J02434C4676K28380l1703L6572J89201A75569l7144O9397J95303
$$ 322496 424930 34676 263056 231353 267925 457126 175569 138425 207822 403125
13600D03125j14553j03740M0277M5969I7197L94037j81677l02Q0519j28115N0
$$ 403125 288572 184832 225109 271078 97197 491234 309557 309255 389774 261659 261709
13589B61709o5887L61421b8137B45818J78902N7809B8570M97349N1638j64204
$$ 261709 195822 557243 -28137 245818 424720 482529 28570 525919 577557 413353
13579D13353A17594J4746L24020A41099J86289M4077m1192A44436Q8835G9456
$$ 413353 117594 132340 456360 141099 327388 371465 330273 144436 233271 79456
13568C52437m0594A10690K92282r9422j03864J1691m7404J37506l4041L11643
$$ 352437 311843 110690 402972 303550 199686 211377 163973 301479 267438 579081
13558E79081k01853j83867L03235n2968O5109k23153K1256A37960l4267K61114
$$ 579081 377228 193361 496596 443628 508737 285584 306840 137960 103693 364807
13548C64807o7649R7813K1130r3184A55742J09087L70994E7395K85227A43602
$$ 364807 297158 394971 416101 322917 155742 264829 635823 57395 342622 143602
13537A58329M37066A35482J16505j4570J88292N7406j74565o0251P3088A5050
$$ 158329 595395 135482 251987 237417 425709 483115 308550 248299 321387 15050
13526A97521L19117K69518j82628l00290r8301q1323e9669A89014B3162J81837
$$ 197521 516638 786156 603528 303238 204937 123614 -59669 189014 23162 204999
13516B04999J47629K7516j38939L6489N9209j50373o484J84975O0425r9510Q2494
$$ 204999 352628 380144 241205 277694 336903 186530 180046 365021 425446 325936 408430
13505D08430A93953L27682j55957j56270C5936L57397J04700Q4437B62295J22218
$$ 408430 193953 521635 365678 209408 35936 393333 498033 582470 262295 384513
13495C84513m8935o6913n8780f0423C59823d0946A00849J3917M2709J84112k9658
$$ 384513 335578 268665 209885 -60423 359823 -40946 100849 114766 157475 341587 311929
13484C11929J6553J15179m1087j91374M24134p2611E3716K23584a34751A46841
$$ 311929 328482 443661 402574 211200 635334 562723 53716 277300 -134751 146841
13473D66414K848H7771M89669B6447L29667J1356P481j11903J86101j58158A25051
$$ 466414 469262 87771 577440 26447 356114 367470 374951 263048 449149 290991 125051
13461D32301j77113n5926M8920K16805A07077M44276j83832j14269J26232A22796
$$ 432301 255188 199262 248182 464987 107077 551353 367521 253252 379484 122796
13450D23714A95772J74367J02752A39798o916J13303H6295K24473J34096A75025
$$ 423714 195772 370139 472891 139798 132882 246185 86295 310768 444864 175025
13439G6101J0407J61049o2340M03670i1014A55334c923A09567N518L38305A4520
$$ 76101 86508 247557 185217 588887 -91014 155334 -3923 109567 115085 453390 14520
13427C9209J94639G1772J08672K34444N0272j76928p4362j3455j0098r2950J97610
$$ 39209 233848 71772 180444 414888 465160 288232 213870 200415 190317 97367 294977
13416B94977j08083J96603h2056D55189A29794J32717a42597D00871j69805c05740
$$ 294977 186894 383497 -82056 455189 129794 262511 -142597 400871 231066 -305740
13405C19582m6007L9074A22688B0493N18366A69797m7002R9479b876B3832L02997
$$ 319582 273575 312649 122688 20493 538859 169797 122795 222274 -2876 23832 326829
13394C26829j01796a0110j9571B35193A11165K97802I9130Q5877C1773g2818C79254
$$ 326829 225033 -10110 -29681 235193 111165 408967 99130 185007 31773 -72818 379254
13382A59778b0801B95292j13995K18217A69296J13801G6508L72132H4287M2331
$$ 159778 -20801 295292 181297 399514 169296 283097 76508 448640 84287 126618
13372A26618a33466C38189A61843g9321C49980J618K44909k49372j42718j1543
$$ 126618 -133466 338189 161843 -79321 349980 351598 596507 347135 204417 192874
13362A92874K2841E2494J6472J43935K75405k34753A11511M85577j68632d3939
$$ 192874 215715 52494 68966 212901 488306 253553 111511 597088 428456 -43939
13351A22992J5437N7905a59948A19126E3174K85944o6982K17485p7687m8116A73343
$$ 122992 138429 196334 -159948 119126 53174 339118 272136 489621 411934 363818 173343
13339C12621o0972A07898c6272B78875K3972A23238L56560m9303B05227O7978
$$ 312621 251649 107898 -36272 278875 302847 123238 479798 430495 205227 273205
13329B73205J67025A96223G3178J82197l3650N6985j25268J0249d9952B69458
$$ 273205 440230 196223 73178 255375 221725 278710 153442 163691 -49952 269458
13318A34761N9333K5771J36772B2778J60348J63738j19068O8765e0169A94713
$$ 134761 194094 219865 356637 22778 183126 346864 227796 296561 -50169 194713
13307D55915k05856J40630j87102l4783K09197J85105F0097J16387C6286j4560
$$ 455915 250059 390689 203587 168804 378001 563106 60097 176484 36286 21726
13297B1726b1285Q78D17970B05208J65617F2290b12770B26593M8000J38009a73345
$$ 21726 -21285 -20407 417970 205208 370825 62290 -212770 226593 274593 412602 -173345
13285H2717d2327F1543O8036F537M4280J7420J90391m6731f8181A8213J42252
$$ 82717 -42327 61543 129579 6537 50817 68237 258628 211897 -68181 18213 160465
13274A60465J44701d0489m8008A69826C4521L53792a1807B07352J43305M2532
$$ 160465 305166 -40489 -88497 169826 34521 388313 -11807 207352 350657 393189
13264C93189j87621e0220B07093F0955L88895B03236g430l03113A07790a30106
$$ 393189 205568 -50220 207093 60955 449850 203236 -7430 -310543 107790 -130106
13253c6990q1231B73537b96036c5429j2553C3382e0877D8721K88155A16708n5292
$$ -36990 -118221 273537 -296036 -35429 -47982 33382 -50877 48721 336876 116708 61416
13242F1416K27012G1090C356h5065q5366A98354a32268B27642b5510B58453c1839
$$ 61416 288428 71090 3356 -85065 -170431 198354 -132268 227642 -25510 258453 -31839
13230a8027D1913K603j9146L22229B7746i2496A41813J2982f9223K2329B9429
$$ -18027 41913 44516 25370 347599 27746 -92496 141813 154795 -69223 -46894 29429
13218H0835Q6402C4995K19220i7574A90962m5777J36205b302B6732e2495D0831
$$ 80835 167237 34995 254215 -97574 190962 145185 281390 -2302 26732 -52495 40831
13206a08472B35051J30832j80368N0753K4449q7048J69657j61124J08631H7211
$$ -108472 235051 365883 185515 236268 260717 173669 343326 182202 290833 87211
13195A56440J9640B0287J76116a6272p1128B39492b14934A79252g169l7316P605
$$ 156440 176080 20287 196403 -16272 -87400 239492 -214934 179252 -7169 -44485 -36880
13184c6880a0589A58319L1174h7810C3775e0942f355n1152E1197a60151p3296
$$ -36880 -10589 158319 189493 -87810 33775 -50942 -6355 -57507 51197 -160151 -233447
13173b33447B89612o1431I202i9709B26802j12077A5332J0562L48650g9201H703
$$ -233447 289612 228181 9202 -99709 226802 114725 15332 25894 374544 -79201 8703
13161E5788N7270K33767r7873R969J0175L6787b7445q9120D7418K59644N328a75202
$$ 55788 113058 346825 248952 258921 269096 305883 -27445 -116565 47418 307062 312390 -175202
13148B49430c121C65736a78928A21809J6362J03915k2669B1255M07328B07870
$$ 249430 -3121 365736 -178928 121809 138171 242086 219417 21255 428583 207870
13137d0024C03112A2774b437D54212A58810K1319b2879j62617B0849L86971F593
$$ -40024 303112 12774 -2437 454212 158810 180129 -22879 -185496 20849 407820 6593
13125B61314J0480j01292R0534h2441C07663a15654l0745a1882B3802a39053B04308
$$ 261314 271794 170502 261036 -82441 307663 -115654 -146399 -11882 23802 -139053 204308
13113F19002a12830C6132f9774j5314A82790G0381k0765K38709A14255a90583
$$ 619002 -112830 36132 -69774 -85088 182790 70381 49616 288325 114255 -190583
13102B582L24111b08895E7382K6168J89631F4169J24688D0336J37811a80789B72594
$$ 2582 326693 -208895 57382 83550 273181 64169 188857 40336 178147 -180789 272594
13090E2394O1708g1856B29530K0835N9543b55278D6987J94565a46797A69048n4437
$$ 52394 114102 -71856 229530 250365 309908 -255278 46987 241552 -146797 169048 114611
13079A14611I951N4273O1082a1553j5573k6333C67111f0822A61783a35350A29635
$$ 114611 9951 64224 125306 -11553 -27126 -53459 367111 -60822 161783 -135350 129635
13067B26279F6213L79426j84630A2183a90063C20427A30853Q414e828F9642J96001
$$ 226279 66213 445639 261009 12183 -190063 320427 130853 139267 -5828 69642 265643
13056B65643m6555j03508f892A07957J44301p4846J99437K6761F2795f1014D97175
$$ 265643 219088 115580 -6892 107957 252258 177412 376849 403610 62795 -61014 497175
13044A92074h569k04524A89575b61488A54840a7556B41712i0702b2426a0834A53664
$$ 192074 -8569 -213093 189575 -261488 154840 -17556 241712 -90702 -22426 -10834 153664
13032A61205b24608B2768b92615A92175F3795K76503a5875A77885G5013L18867
$$ 161205 -224608 22768 -292615 192175 63795 340298 -15875 177885 75013 393880
13022C93880A9258e0296A66397j4614J9601F9429b00575B23705a40905D8551A1603
$$ 393880 19258 -50296 166397 151783 171384 69429 -200575 223705 -140905 48551 11603
13010D2860M7398K00034C2167c6472A88915a8316A94803L8057B9417L38212c34666
$$ 42860 90258 290292 32167 -36472 188915 -18316 194803 232860 29417 367629 -334666
12998F0279R3537b63132C0505O8398e9403B11731A05031Q0487J21991j6672a23014
$$ 60279 153816 -263132 30505 98903 -59403 211731 105031 185518 307509 290837 -123014
12986C1243e9550b3497A92177k948j9661P6663j0118J59376A70271a8265H5603
$$ 31243 -59550 -23497 192177 189229 169568 246231 236113 395489 170271 -18265 85603
12974a68714B29733K12895A85186E3546J85997D5964a18822m6008B49204b06315
$$ -168714 229733 442628 185186 53546 239543 45964 -118822 -164830 249204 -206315
12963B51587A25431c738p7966I4101b1442m1721A63102N3780M4672r0281g071
$$ 251587 125431 -3738 -81704 94101 -21442 -63163 163102 216882 261554 171273 -7071
12951b277B94736J0588J1348A13142a199B02988g6983C63785c76402F3058b8613
$$ -2277 294736 305324 316672 113142 -1199 202988 -76983 363785 -376402 63058 -28613
12939c08937F8321c59486E9233K5092d5955A10029K80198A25462d0520B41092
$$ -308937 68321 -359486 59233 84325 -45955 110029 390227 125462 -40520 241092
12928B06689K270D1109f0022A89875D1601J04355B6865R0158a23891H1099a90165
$$ 206689 208959 41109 -60022 189875 41601 145956 26865 117023 -123891 81099 -190165
12916F8750J26908r3395k4863L11211d3517E1374i2100l10274A31123m8125a90373
$$ 68750 195658 102263 77400 388611 -43517 51374 -92100 -402374 131123 82998 -190373
12904B8330K85563f1454k9644F3653J56079a78964f3903n1814j5811A34697Q8727
$$ 28330 313893 -61454 -91098 63653 219732 -178964 -63903 -115717 -131528 134697 223424
12893B23424H3591I607c1174f363G0667i1945r3872P8933l822B4159K52237a84733
$$ 223424 83591 9607 -31174 -6363 70667 -91945 -185817 -106884 -110706 24159 276396 -184733
12880D3591b35610d0531k72672D9187L33458a70703P7152A7296K44631d218E028
$$ 43591 -235610 -40531 -313203 49187 382645 -170703 -93551 17296 261927 -4218 5028
12868b02990A72201n6369d9415A83066F7542b03747C9135a5533o4995K4298b5983
$$ -202990 172201 115832 -49415 183066 67542 -203747 39135 -15533 -80528 -56230 -25983
12856i1301B27512C4110L1174b4789j17065I8504h993A61115p1479J48179e9100
$$ -91301 227512 34110 65284 -24789 -141854 98504 -8993 161115 89636 237815 -59100
12844a21361J0907B67113D4907b68480c244l2757C0487a05433B75778d382q602
$$ -121361 -110454 267113 44907 -268480 -3244 -36001 30487 -105433 275778 -4382 -12984
12833a2984k98410E9729a96998C9079J09705J45202G9123b46265A91644a4890
$$ -12984 -311394 59729 -196998 39079 148784 293986 79123 -246265 191644 -14890
12822B1668J37701F6056L9591F52g4012J6924A28956M3410R6674j18005a8062
$$ 21668 159369 66056 105647 652 -74012 -57088 128956 172366 269040 151035 -18062
12810A7370N6072J83436i6841d6064k51839J11061n0524e990B73714r0699q9986
$$ 17370 73442 256878 -96841 -46064 -297903 -186842 -237366 -5990 273714 183015 93029
12799I3029J24368b25165A8861J14288R324a34523B51192a67137h1202d21B41332
$$ 93029 217397 -225165 18861 133149 142473 -134523 251192 -167137 -81202 -421 241332
12787c2298j29280B90374e488C8190f0459o0722j69624F1720O3787L7185a30734
$$ -32298 -161578 290374 -5488 38190 -60459 -121181 -290805 61720 125507 162692 -130734
12775a43652f0661h204j67129D2290A5683J86341a03833A52422C2841e16A18868
$$ -143652 -60661 -8204 -175333 42290 15683 202024 -103833 152422 32841 -516 118868
12763h7444A3208J29645a69411H9541B8849c4342I6679e8957o8590B44091a23310
$$ -87444 13208 142853 -169411 89541 28849 -34342 96679 -58957 -127547 244091 -123310
12751A54180a51644B13245l1420a7645j33233D76875b44823A69851a10966j15400
$$ 154180 -151644 213245 181825 -17645 -150878 476875 -244823 169851 -110966 -226366
12741b26366F8958J40956J4179g3887K2539q0225b3065r155r6052A61419D2101
$$ -226366 68958 209914 224093 -73887 -51348 -131573 -23065 -32220 -128272 161419 42101
12729B26600B5778N9948K07001b10021A09149J98523C5544b23109e512B24760
$$ 226600 25778 85726 292727 -210021 109149 307672 35544 -223109 -5512 224760
12718A72791l1892g5066A91488d0513a9430B55307b2105g032A09238c62317I9932
$$ 172791 140899 -75066 191488 -40513 -19430 255307 -22105 -7032 109238 -362317 99932
12706A96426a09599n7696B8297J63757g8104D2595c0196m098A6794O2299L17061
$$ 196426 -109599 -167295 28297 192054 -78104 42595 -30196 -34294 16794 79093 396154
12695C96154E6517P8751F7608K06473A21181D8553c592G0682A2516J54674I250
$$ 396154 56517 135268 67608 274081 121181 48553 -3592 70682 12516 167190 9250
12683F8473k4429b36862B95206e4955A74151B5881J96775I6479J5941A8019M1710
$$ 68473 44044 -236862 295206 -54955 174151 25881 222656 96479 112420 18019 59729
12672E9729R2040l4116b18283B98122a48666H699J78191F0948K99636A74534d30578
$$ 59729 151769 117653 -218283 298122 -148666 8699 186890 60948 360584 174534 -430578
12660B84748a90860A43198F3187K15878j26258a6463j61660L8679E73806A76298
$$ 284748 -190860 143198 63187 279065 152807 -16463 -178123 -139444 573806 176298
12649B25943B7343b0788l2325l5291k71666B04470P141M7724A29637E399b40639
$$ 225943 27343 -20788 -53113 -88404 -360070 204470 211611 259335 129637 5399 -240639
12637e1881A7281L23027A47169J85961a68152K9545B49579q4644k7784a37176
$$ -51881 17281 340308 147169 333130 -168152 -138607 249579 164935 137151 -137176
12626f1585j29998A26156J31541D9203J27221R97e2523C40353j44049r193O1483
$$ -61585 -191583 126156 257697 49203 176424 177421 -52523 340353 196304 187111 248594
12615B48594A06999L27515A38504o2329K61682j31691a21417N5962A75667R729
$$ 248594 106999 434514 138504 76175 337857 206166 -121417 -65455 175667 185396
12605A85396F1826c742B03421Q118J14401A03814J2848a40960A37926d0722E6952
$$ 185396 61826 -3742 203421 211539 325940 103814 116662 -140960 137926 -40722 56952
12593e9799A24186a30345K248A21946c1440A18419J34881q6022a73424A41680
$$ -59799 124186 -130345 -128097 121946 -31440 118419 253300 167278 -173424 141680
12582a45049j0421A65005a77950d1338A57296F0117a7917A5632R4346D7626N4685
$$ -145049 -155470 165005 -177950 -41338 157296 60117 -17917 15632 109978 47626 102311
12571A02311D422Q1169a12900B08203e8273o9360j72030A78744a29519B7992b64720
$$ 102311 4422 85591 -112900 208203 -58273 -127633 -299663 178744 -129519 27992 -264720
12559B32923C7738e6517B97748a1597B327b31337O3231C63499A8833J53613a72086
$$ 232923 37738 -56517 297748 -11597 2327 -231337 -168106 363499 18833 172446 -172086
12547a81121A49254m8608b67560n0279A67168H0029K01034a39339A05885d287
$$ -181121 149254 100646 -267560 -317839 167168 80029 281063 -139339 105885 -4287
12536a16104m3965b3739D3056b98426C60690B8110j444K45907H1933a28161j60432
$$ -116104 -160069 -23739 43056 -298426 360690 28110 26666 272573 81933 -128161 -288593
12525b88593F908a19781A3744K4282d2294n1585m7285g644j14581G4158J79391
$$ -288593 6908 -119781 13744 38026 -42294 -93879 -141164 -7644 -122225 74158 253549
12514B53549b78397C72153A76671b60149B53467a47859B9421M6522J235j3879
$$ 253549 -278397 372153 176671 -260149 253467 -147859 29421 75943 77178 63299
12504F3299J78041b06484c1679A16041b25974A0879a76055k7699f8862C4470b76145
$$ 63299 241340 -206484 -31679 116041 -225974 10879 -176055 -203754 -68862 34470 -276145
12492C7545c32843A11491Q0285j6926k5290l1865a65587k07429B9730K66186E434
$$ 37545 -332843 111491 191776 174850 149560 117695 -165587 -373016 29730 295916 5434
12480b79556e7710B49676c6298a243I8922J30646c07249k0916i1476I904J20568
$$ -279556 -57710 249676 -36298 -1243 98922 229568 -307249 -328165 -91476 9904 130472
12469A30472M22877A88204b90415A68983H4415P1632b53156A25339a21768D020
$$ 130472 553349 188204 -290415 168983 84415 156047 -253156 125339 -121768 4020
12458f6429A46954b3310k29341A06274m5996J2042k6532J43554P7220E8808O1658
$$ -66429 146954 -23310 -252651 106274 60278 72320 45788 189342 266562 58808 120466
12447A20466m4339L3341P6513p3781E5009j9697a06129A91222n6632a12486I0665
$$ 120466 76127 109468 185981 112200 55009 35312 -106129 191222 134590 -112486 90665
12435e0943j80561E8967a14386d3567A71042c904j30942A02472a74647E4478Q7344
$$ -50943 -231504 58967 -114386 -43567 171042 -3904 -134846 102472 -174647 54478 141822
12424A41822m5871P98c69111i8344B09101L6133L9184G8544c16107h4569j8016
$$ 141822 95951 96749 -369111 -98344 209101 245234 284418 78544 -316107 -84569 -102585
12413a02585B21452r1491n7015b48131A16756a22026k01226c3912A82313i5513
$$ -102585 221452 129961 72946 -248131 116756 -122026 -323252 -33912 182313 -95513
12402a39185A37881h4052K2127A71815A2639J64369A2959e9693n2512A1699R0494
$$ -139185 137881 -84052 -61925 171815 12639 177008 12959 -59693 -112205 11699 102193
12391A02193e7611n7714A04665b2383l28575C4236a58339O3144C63193j65040
$$ 102193 -57611 -115325 104665 -22383 -350958 34236 -158339 -95195 363193 198153
12381A98153c4965a0473A03399d1554F086K13460c44645c6071h818C64365D0068
$$ 198153 -34965 -10473 103399 -41554 6086 219546 -344645 -36071 -8818 364365 40068
12369C53822e1999J9726k8870j33565B54278G9561a99945H5645m994M41646B7016
$$ 353822 -51999 -32273 -61143 -194708 254278 79561 -199945 85645 80651 522297 27016
12357h2834l920K5984A70825g1976k04276J29838j55145a23652B98793a04185
$$ -82834 -86754 -60770 170825 -71976 -276252 -146414 -301559 -123652 298793 -104185
12346A67958E2317L85832B08601b55927I1622j4136l7305N9588a7191r6309j7515
$$ 167958 52317 438149 208601 -255927 91622 77486 40181 99769 -17191 -113500 -131015
12335a31015C8239J28125N5280E5803k6855J25439J07121b02915B4559J50656
$$ -131015 38239 166364 221644 55803 28948 154387 261508 -202915 24559 175215
12325A75215n6131A4878M6440a32363M9274A7546a27835j10654D6923M5288N4221
$$ 175215 119084 14878 61318 -132363 -83089 17546 -127835 -238489 46923 92211 146432
12314A46432o4474K1126K43376B7805b16699A735J23295k7720a04717C7526d2612
$$ 146432 81958 103084 346460 27805 -216699 1735 125030 97310 -104717 37526 -42612
12302b75235g0740A85867A9695N71175a09592n4130a4521c109H2819l1934K2123
$$ -275235 -70740 185867 19695 590870 -109592 -163722 -14521 -3109 82819 50885 73008
12291G3008d3024m9960J9474C1919b90108M436i5787A28559J42016j6169a46462
$$ 73008 -43024 -92984 -73510 31919 -290108 -285672 -95787 128559 270575 254406 -146462
12279A27698J54121a4172H0381b01968A61640M0044a81631O6926A13421l2231
$$ 127698 281819 -14172 80381 -201968 161640 201684 -181631 -114705 113421 81190
12269H1190l9861i2505H7225a76546e6335o8677A2807L63699a46377B57727O4958
$$ 81190 41329 -92505 87225 -176546 -56335 -125012 12807 376506 -146377 257727 322685
12258C22685I6610J95596A44617f7552D7573f5640C83085e1309r581C29496j30040
$$ 322685 96610 292206 144617 -67552 47573 -65640 383085 -51309 -60890 329496 199456
12247A99456b19774f4131j3746E6095J70048p4736Q7771I4965J92892H7475L38797
$$ 199456 -219774 -64131 -77877 56095 226143 151407 239178 94965 287857 87475 426272
12236D26272A09377a58327C822f8893C19134b12902B11788M6159a76754B00487
$$ 426272 109377 -158327 3822 -68893 319134 -212902 211788 257947 -176754 200487
12225a21639H9268I607c7280p936A62389B5276a00735C92443j85120B320J56448
$$ -121639 89268 9607 -37280 -45216 162389 25276 -100735 392443 207323 2320 158768
12214A58768N7304K41554l3363n373G7689B0651J8070J62515M62011A299K40089
$$ 158768 216072 457626 424263 418890 77689 20651 38721 201236 663247 1299 241388
12203B41388p8958l5850a24586A5172M10209k07380B3565b00006C77827G3097
$$ 241388 162430 126580 -124586 15172 425381 218001 23565 -200006 377827 73097
12192D7433K92133G7186a88625A0436K3874L54613r3410A6691i3611A41566K40891
$$ 47433 339566 77186 -188625 10436 34310 388923 295513 16691 -93611 141566 382457
12181C82457j26450I6550l9692j8201c47820A67555b823B12573G9926O7031b5610
$$ 382457 256007 96550 56858 38657 -347820 167555 -2823 212573 79926 146957 -25610
12169A7250e0007A59942F7418c9273A29627R1384F1082R1240k7584Q0332c02639
$$ 17250 -50007 159942 67418 -39273 129627 221011 61082 152322 124738 205070 -302639
12157B09061k9542G5538h3839A69600o6502M0352b98046C7994a97278P2016b1154
$$ 209061 179519 75538 -83839 169600 103098 143450 -298046 37994 -197278 -125262 -21154
12145G027K51052a18444F6782a38649m6909A81240b4557d650A3164J95767D4387
$$ 7027 258079 -118444 66782 -138649 -185558 181240 -24557 -4650 13164 208931 44387
12133b20525g241j82655A58730m5966C3827K45728m7830a71102N5809B33753A13410
$$ -220525 -7241 -189896 158730 112764 33827 279555 231725 -171102 -115293 233753 113410
12121A04647a19146k7174A89818a35340C20138j03695d493H7151a35090N5706
$$ 104647 -119146 -146320 189818 -135340 320138 216443 -4493 87151 -135090 -79384
12111g9384K1429C1687i9682b1146C40563G0267a60187A54281o6776D1659a05075
$$ -79384 -57955 31687 -99682 -21146 340563 70267 -160187 154281 87505 41659 -105075
12099a232F797c37063H4482K41457n4237j32974d2773g492B78630E6981R6847
$$ -1232 6797 -337063 84482 325939 271702 138728 -42773 -7492 278630 56981 153828
12088A53828A3864b13731f076k21660H8841J21190r8600M0227a02046I1544c5426
$$ 153828 13864 -213731 -6076 -227736 88841 210031 111431 151658 -102046 91544 -35426
12076a4262j88430e5186B02572a79846M7778A29036O393j5952c2530A23229h7239
$$ -14262 -202692 -55186 202572 -179846 -132068 129036 135429 119477 -32530 123229 -87239
12064b30048B09745K85443K11806N17488l89006l37395b88383I2292i6655C05910
$$ -230048 209745 495188 706994 1224482 835476 498081 -288383 92292 -96655 305910
12053B3414a15978C9992J02668a24209m5195C9170a55443B10369m5146o2023g0886
$$ 23414 -115978 39992 142660 -124209 -169404 39170 -155443 210369 165223 103200 -70886
12041c1092B12971e7259q2495c9242G1309b70638h9581j46578h148j05492D1400
$$ -31092 212971 -57259 -139754 -39242 71309 -270638 -89581 -236159 -8148 -113640 41400
12029a61065C01163d5695j89364m9208i3585j21500C4417L9930b21695A43038
$$ -161065 301163 -45695 -235059 -284267 -93585 -215085 34417 74347 -221695 143038
12018b56824C43116e00201A22183n4708m17a7773k5426B6169a64451B36267o3199
$$ -256824 343116 -500201 122183 67475 67058 -17773 -43199 26169 -164451 236267 173068
12007A73068j8143a54548H3678c36128D58388e9452a4912H9566b06076b6930r6246
$$ 173068 154925 -154548 83678 -336128 458388 -59452 -14912 89566 -206076 -26930 -123176
11996a23176B39502A3850d7901j7563B46341F2857c82193c3215G1014a76433e5604
$$ -123176 239502 13850 -47901 -65464 246341 62857 -382193 -33215 71014 -176433 -55604
11984A18014a67224E6309h3980r8273B26510c23033A92232E5634a92595a9243
$$ 118014 -167224 56309 -83980 -182253 226510 -323033 192232 55634 -192595 -19243
11973a30827A5276h1807m226A4939h3689A05972a17013M1103I3145a49389B23652
$$ -130827 15276 -81807 -86033 14939 -83689 105972 -117013 -75910 93145 -149389 223652
11961G5951i803A50442E3088h5738k31243C98056b4863j86467F7189R0742m4606
$$ 75951 -9803 150442 53088 -85738 -316981 398056 -24863 -211330 67189 157931 113325
11950A13325g2476A20449C3609d35034e0068j21858a4232j35481F4588a02221
$$ 113325 -72476 120449 33609 -435034 -50068 -171926 -14232 -149713 64588 -102221
11939A59154c19800J09607B44200A17991b4233G3977a55200K2895j95001h0799
$$ 159154 -319800 -210193 244200 117991 -24233 73977 -155200 -132305 -327306 -80799
11928a59931C74184f4551B2264K2631a51276l747A41897d41186f5126A7192F109
$$ -159931 374184 -64551 22264 44895 -151276 -155023 141897 -441186 -65126 17192 6109
11916G0237k1454j7034g2411j86943I1916a68702J1887f7888j82184a6244A42674
$$ 70237 48783 31749 -72411 -259354 91916 -168702 -156815 -67888 -250072 -16244 142674
11904i9475F4760b52232j5317C3319a674j03188A61094h8635c9548n6481H1906
$$ -99475 64760 -252232 -267549 33319 -1674 -104862 161094 -88635 -39548 -96029 81906
11892b1658j442n3066c6806Q64k09537h9990r3291A83215o6703D6063a20363C9853
$$ -21658 -23100 -76166 -36806 -35942 -245479 -89990 -183281 183215 116512 46063 -120363 39853
11879F8083a05429k80860J20244a20848f308C3972e609B21119a70869A7669g623
$$ 68083 -105429 -386289 -266045 -120848 -6308 33972 -5609 221119 -170869 17669 -7623
11867b28759N054c7076k5382E2910J6998k0559e8987A03936k0800J00056b26956
$$ -228759 -223705 -37076 -62458 52910 69908 49349 -58987 103936 83136 183192 -226956
11855a653n3149E2877b83630H764L7963b1832j7620A17383P4926M2842b76711
$$ -1653 -54802 52877 -283630 8764 46727 -21832 -39452 117383 192309 235151 -276711
11843b59677i5492A54692B2960b89138A76303a61461g4501r4479A62465a86527
$$ -259677 -95492 154692 22960 -289138 176303 -161461 -74501 -168980 162465 -186527
11832B60962a13451b2289k5566B0126K09813b1123F7888c21320j03324A05130
$$ 260962 -113451 -22289 -47855 20126 229939 -21123 67888 -321320 -424644 105130
11821a42962D0848a80273h9659B90074J32605b31672a3662I209c2519o7212J1010
$$ -142962 40848 -180273 -89659 290074 422679 -231672 -13662 9209 -32519 -99731 -88721
11810h8721A63660p9778a07916A85559a32587A96591h8328D1863K62440A16042
$$ -88721 163660 83882 -107916 185559 -132587 196591 -88328 41863 304303 116042
11799a40880j432F54K78488b29282E09a84894B17052b42749D6927j0927A0342
$$ -140880 -142312 654 279142 -229282 509 -184894 217052 -242749 46927 36000 10342
11787a11161A3637g7005B08689C4303c75772C52842C3485b4921A23937A0080O1290
$$ -111161 13637 -77005 208689 34303 -375772 352842 33485 -24921 123937 10080 71370
11776G1370c17748f5618j73767B22629f13B97583b86677h7260j25772B4613a60938
$$ 71370 -317748 -65618 -239385 222629 -613 297583 -286677 -87260 -213032 24613 -160938
11764B64187n3935k6286a39137C8899c43317i0507C5035b1794j40843q2391k3278
$$ 264187 210252 183966 -139137 38899 -343317 -90507 35035 -21794 -162637 -245028 -268306
11753b68306B79881c10532g7599B5625N2457B706M1647H276J73938H0918c2742
$$ -268306 279881 -310532 -77599 25625 78082 2706 44353 8276 182214 80918 -32742
11741f1831N049j25032M0296B75084f3877K9562j35700j9878B86726f4617A39401
$$ -61831 -56782 -181814 -141518 275084 -63877 -34315 -170015 -189893 286726 -64617 139401
11729B88754b60796H7620b02241B7033a57499J2268j66075A23891C2160h5737
$$ 288754 -260796 87620 -202241 27033 -157499 -145231 -311306 123891 32160 -85737
11718A5715J75282G635k498g5227A34963k1368J0440k8567L4603e2953j50979
$$ 15715 190997 7635 5137 -75227 134963 113595 124035 95468 130071 -52953 -203932
11707b03932l2966f493A16775N8603a1402H6861L15590B558K45073E5475b52564
$$ -203932 -236898 -6493 116775 175378 -11402 86861 402451 2558 247631 55475 -252564
11695B38910M3301H1286c57168O321F4154O664N0725O5688o1614i7657l7496A89078
$$ 238910 282211 81286 -357168 -350847 64154 70818 121543 187231 125617 -97657 -135153 189078
11682A48375M0259e9372C89429h8085m4381j4044J628b2498E0290E493M9504f0624
$$ 148375 188634 -59372 389429 -88085 -132466 -146510 -144882 -22498 50290 5493 54997 -60624
11669E052J34267J48126F8603K19703I305O9983g0117A25333C2434O5151R1765
$$ 5052 139319 287445 68603 288306 9305 79288 -70117 125333 32434 97585 189350
11658A89350A3518a13968I7319a07157a5474j3528j94562C25871b4270A7916h6590
$$ 189350 13518 -113968 97319 -107157 -15474 -29002 -223564 325871 -24270 17916 -86590
11646e0461q0167C07389i5698I9126b3082m1478A15890h5593c2431l5378K8625
$$ -50461 -130628 307389 -95698 99126 -23082 -64560 115890 -85593 -32431 -67809 -39184
11635c9184j11559C67408b438A23558A101a54660c713F6902c76868a20301b2705
$$ -39184 -150743 367408 -2438 123558 1101 -154660 -3713 66902 -376868 -120301 -22705
11623D1535d7745A85283K9111F5697a4518A75308a57483d8363A2710N6716O0489
$$ 41535 -47745 185283 214394 65697 -14518 175308 -157483 -48363 12710 69426 129915
11612A29915b6437B30332G8000J59502I0539J90092A02332a99713q819B01885
$$ 129915 -26437 230332 78000 237502 90539 280631 102332 -199713 -208532 201885
11601b92950a5094A15469K53888A09753K15243j39194B3554a02511j7721j58527
$$ -292950 -15094 115469 369357 109753 324996 185802 23554 -102511 -120232 -278759
11591b78759B71009a16084g64m4524a9080A69197m421a89907H5246N44227a9969
$$ -278759 271009 -116084 -764 -45288 -19080 169197 164776 -189907 85246 629473 -19969
11579d1196p6382k01976C21992d14829a34745C1503O3153a07956A34021R3529
$$ -41196 -117578 -319554 321992 -414829 -134745 31503 94656 -107956 134021 227550
11569B27550a95524A98149G6027a39807d9689b273E5178b13315b2375A33986a09804
$$ 227550 -195524 198149 76027 -139807 -49689 -2273 55178 -213315 -22375 133986 -109804
11557C6792q386J33347k4515K00195A3095b97223a1480j51434b0763C05699e8084
$$ 36792 28406 161753 137238 337433 13095 -297223 -11480 -162914 -20763 305699 -58084
11545h1773K9067A36626h5812E42340Q8461j56117k09264c6963j72922a04834
$$ -81773 -52706 136626 -85812 542340 630801 474684 265420 -36963 -209885 -104834
11534A05465d0217F2819J12571o0868K0390f7952b0585E8248J92415H9879a34302
$$ 105465 -40217 62819 175390 114522 134912 -67952 -20585 58248 250663 89879 -134302
11522A43106j3071a32032O5537B52335A15415a93760b9997j4360a8352j9130D00251
$$ 143106 130035 -132032 -66495 252335 115415 -193760 -29997 -44357 -18352 -37482 400251
11510A68183c08966B970Q5225J32529E7598f5937H5072L87271A29055O359k9601
$$ 168183 -308966 2970 88195 220724 57598 -65937 85072 472343 129055 135414 105813
11499A05813h5195j84609B19616m2208q4547L80834a81242L6586A89871B4432
$$ 105813 -85195 -269804 219616 177408 92861 473695 -181242 -144656 189871 24432
11488b82634A05556n474g5685B02276a17628A7842J71910k7686G4886L6860J42820
$$ -282634 105556 100082 -75685 202276 -117628 17842 189752 162066 74886 111746 254566
11477B54566K8260i664j97572F2219K68824I4354a1806A13255a01111A19750L4720
$$ 254566 282826 -9664 -207236 62219 331043 94354 -11806 113255 -101111 119750 154470
11466A54470d2942A95012p353J95115A55093b78868I0835K78551j59843m9727
$$ 154470 -42942 195012 187659 382774 155093 -278868 90835 369386 209543 159816
11456A59816J24551a22451a9599j0941l6323c601A82738m7964a03814A77043q4324
$$ 159816 284367 -122451 -19599 -30540 -66863 -3601 182738 134774 -103814 177043 92719
11445I2719J95017N6170d9623L35B13528c5047A02062K93031I0387c2060B1514
$$ 92719 287736 343906 -49623 -49288 213528 -35047 102062 395093 90387 -32060 21514
11433A86719g2210A86404J46538B858O5485c0610B86126a45072A925J8732i1235
$$ 186719 -72210 186404 332942 2858 68343 -30610 286126 -145072 1925 20657 -91235
11421D6042A275N3435J66118c67817a81597C05040A30297i8835b9315j29017H4510
$$ 46042 1275 54710 220828 -367817 -181597 305040 130297 -98835 -29315 -158332 84510
11409a23278A5443a57018O1063A56863b95598f0248A75817A7545b40605J12213
$$ -123278 15443 -157018 -95955 156863 -295598 -60248 175817 17545 -240605 -128392
11399a28392B62141b8679B17205h206l34962J08836I0960c96101a72854E0694
$$ -128392 262141 -28679 217205 -8206 -343168 -234332 90960 -396101 -172854 50694
11388g0793j82328G5730K42649k3829b90549A53819J29794j21072h0221I0290
$$ -70793 -253121 75730 318379 294550 -290549 153819 283613 162541 -80221 90290
11377a78331D1814J79490f84l3568B5242b14132E4091a71731A54693l4540B4380
$$ -178331 41814 221304 -684 -34252 25242 -214132 54091 -171731 154693 120153 24380
11365C1767J80359f4661n3414b2651n3548p1971j65089B33776J07821E8902f214
$$ 31767 212126 -64661 -118075 -22651 -76199 -148170 -313259 233776 341597 58902 -6214
11353b05434b4903q9095C35119A23094a98987J5979B87092j22563n2027K5462
$$ -205434 -24903 -113998 335119 123094 -198987 -183008 287092 164529 112502 137964
11343A37964a6609A72692c5515k30039D8222g9447m5340B02775N466c41217A2228
$$ 137964 -16609 172692 -35515 -265554 48222 -79447 -124787 202775 208241 -341217 12228
11331a17425E5989e0735A08680b8143r7070C08482a38360c8395r0887G0967g9386
$$ -117425 55989 -50735 108680 -28143 -125213 308482 -138360 -38395 -129282 70967 -79386
11319h5462a9825A3573a55627B51428a16963k14846f1504C9121a41986A64913
$$ -85462 -19825 13573 -155627 251428 -116963 -331809 -61504 39121 -141986 164913
11308h678G8484k1555c6589l01669J51496g3764e657C0599J9136a09330B7737
$$ -8678 78484 56929 -36589 -338258 -186762 -73764 -5657 30599 49735 -109330 27737
11296a08841A02638l5081J27276b02149q0549a23332B00377b15272B01301a77452
$$ -108841 102638 67557 194833 -202149 -282698 -123332 200377 -215272 201301 -177452
11285b15151a01857B14061i4678A40755b97247g4600j36850A6206K7024b05895
$$ -215151 -101857 214061 -94678 140755 -297247 -74600 -211450 16206 43230 -205895
11274c44242J50255M9544A8743J06195O6594b5668D5156A879J06798b64448h0535
$$ -344242 -193987 -144443 18743 124938 191532 -25668 45156 1879 108677 -264448 -80535
11262b17908I938a16938j31163J03231k6575A1558e1517p0342d2948B1580o585
$$ -217908 9938 -116938 -248101 -144870 -171445 11558 -51517 -121859 -42948 21580 14995
11251A4995J26543C7073g5375j71269Q3533j33096i9359j89225a0676j46016f8239
$$ 14995 141538 37073 -75375 -246644 -163111 -296207 -99359 -288584 -10676 -156692 -68239
11239b4402q5233A59231B8389e4994H3722e581D9495a7599j30811B15532c3385
$$ -24402 -109635 159231 28389 -54994 83722 -5581 49495 -17599 -148410 215532 -33385
11227b67631A13928a24324N7607k17290b3634A8479b17766P8855f9191A73889
$$ -267631 113928 -124324 -66717 -284007 -23634 18479 -217766 -138911 -69191 173889
11216a26189B40078D7143e915i96A30002C6870a42143A06965B8119J22033F7955
$$ -126189 240078 47143 -5915 -996 130002 36870 -142143 106965 28119 150152 67955
11204g84C06013j49352a55980D7320J1696L42953A7047L7042b29620A46879b5929
$$ -784 306013 156661 -155980 47320 59016 401969 17047 54089 -229620 146879 -25929
11192b89226J41858p2528f5565A20783a80353Q5078B0319b02026b4598l9966k44643
$$ -289226 -147368 -219896 -65565 120783 -180353 -95275 20319 -202026 -24598 -64564 -309207
11181c09207J46806A6466L2804K42430a70975K8804H9640b88115h086j98711C8201
$$ -309207 -162401 16466 49270 291700 -170975 -142171 89640 -288115 -8086 -206797 38201
11169a24056d8972m2903B17065n8871N2710A1429J8167b26565c336j45403M8363
$$ -124056 -48972 -91875 217065 158194 210904 11429 29596 -226565 -3336 -148739 -100376
11158a00376A02356c64852a9733B76149I1285b25231p429P1388A45044A3803d8234
$$ -100376 102356 -364852 -19733 276149 91285 -225231 -232660 -161272 145044 13803 -48234
11146c05273h2220r8845a7299G2172C0449c66269e9432k21610J35177F9524a09955
$$ -305273 -82220 -181065 -17299 72172 30449 -366269 -59432 -281042 -145865 69524 -109955
11134b82116H5699g1797A71143e1396B08773j7106I4110k2535i0229I525i3396
$$ -282116 85699 -71797 171143 -51396 208773 191667 94110 71575 -90229 9525 -93396
11122F6939O2082a4182B9669e1615j59022L6659A59130N6588E3731b77788A37831
$$ 66939 129021 -14182 29669 -51615 -210637 -173978 159130 215718 53731 -277788 137831
11110b76319i4671a0399r7254A80897k4104A8241K39501a13759N1478A01297F958
$$ -276319 -94671 -10399 -107653 180897 156793 18241 257742 -113759 -62281 101297 6958
11098A57384e0921D22840a23651J3738B49266a60333f1702q3834g61b15B56456
$$ 157384 -50921 422840 -123651 -109913 249266 -160333 -61702 -145536 -761 -215 256456
11086A74679l8732g6348F7751c4706D25877B01494Q958p0188J26043G9044L28888
$$ 174679 135947 -76348 67751 -34706 425877 201494 210452 140264 266307 79044 407932
11075D07932A79158K1036m6546L42634k40203O3249j40147E4646L9302b78185
$$ 407932 179158 200194 153648 496282 256079 319328 179181 54646 93948 -278185
11064B57517A26203a27550C99579A39855L02026j99744M9650l9812P4041j17610
$$ 257517 126203 -127550 399579 139855 441881 242137 291787 251975 326016 208406
11054B08406J85564Q4991K64290q2432k37594N3033K12057k80750J37760B11116
$$ 208406 393970 478961 743251 660819 423225 476258 688315 407565 545325 211116
11043D60636j06294J69383o8798j47153N0384j17094L06485J47870j64457J83894
$$ 460636 354342 523725 454927 307774 358158 241064 547549 695419 530962 714856
11033G14856n469L9589r0591B99251K61197r405J85435O6989C85735J44488J37704
$$ 714856 709387 748976 658385 299251 560448 551043 736478 803467 385735 530223 667927
11022F67927r255K31168k93942J96107k48469K9359L3365r5500J80718l30252
$$ 667927 658672 889840 595898 792005 543536 572895 606260 510760 691478 361226
11012C61226K79149j33940L00059l05159L00736k00976L25414C39788L6466J57991
$$ 361226 640375 506435 806494 501335 802071 601095 926509 339788 376254 534245
11002E34245J39082B06910M81351O1284C63552n2904K13110K6506B74110L91559
$$ 534245 673327 206910 688261 749545 363552 310648 523758 550264 274110 665669
10992F65669A63650J12287J31067K08022q8951J61168k70709J7602N52679l64407
$$ 665669 163650 275937 407004 615026 526075 687243 416534 434136 986815 622408
10982F22408L15220l16634o1275j12781J35850l3882J99728K9460m3874j36445
$$ 622408 937628 620994 559719 446938 582788 548906 748634 778094 734220 597775
10972E97775m8368K99292j94772K30298j9746k2955L36538J84629J34117o0686
$$ 597775 549407 848699 653927 884225 864479 841524 1178062 1362691 1496808 1436122
10962A436122k31949N5931N57855j82967N23273M42644l99056m98J36999j72820
$$ 1436122 1204173 1260104 1817959 1634992 2158265 2600909 2201853 2201355 2338354 2165534
10952B165534k75314j45918j16661k91266J10118k19751K25992l28043L04244
$$ 2165534 1890220 1744302 1627641 1336375 1446493 1226742 1452734 1124691 1428935
10943A428935j6626j26466j62410J58228M45106m80398k64821m8302k11480L9619
$$ 1428935 1412309 1285843 1123433 1281661 1726767 1246369 981548 933246 721766 761385
10933G61385j09582m4709K9260j44042P0569j80390j22517J54055P445F8012R0768
$$ 761385 651803 607094 636354 492312 562881 382491 259974 414029 421474 68012 158780
10922A58780E0394K17281p1701q1933L0e628A5956O5926j9995J05349b58025a1546
$$ 158780 50394 267675 195974 114041 114071 -5628 15956 81882 61887 167236 -258025 -11546
10909B77723p5510k0483i9806r8216E8638K29200C6132L28332a24651H7682M5250
$$ 277723 202213 181730 -99806 -198022 58638 287838 36132 364464 -124651 87682 132932
10898A32932K233n4310M16954a00415j47789A00938K12072c781C10473C6608O6706
$$ 132932 135165 80855 497809 -100415 -248204 100938 313010 -3781 310473 36608 103314
10887A03314b53750I3837c97588a6560B6182M9030J09482g5840b1753j7590B4667
$$ 103314 -253750 93837 -397588 -16560 26182 75212 184694 -75840 -21753 -39343 24667
10875i9579q8287G9539R1057b6395A55268n5392L02426G5669e20171a24938B54743
$$ -99579 -187866 79539 170596 -26395 155268 99876 402302 75669 -520171 -124938 254743
10863D9799i8209J0119k14893E1920n214h0329r1426b363j58823A07070m0341
$$ 49799 -98209 -88090 -302983 51920 46706 -80329 -171755 -2363 -161186 107070 66729
10852F6729a0451j36739e8444j62279B45481a4870j75184i2972A6694b19189N9784
$$ 66729 -10451 -147190 -58444 -220723 245481 -14870 -190054 -92972 16694 -219189 -159405
10841a59405P8032C2878L6915J2981a13674A34589b1368j83952A14985b75712
$$ -159405 -81373 32878 69793 82774 -113674 134589 -21368 -205320 114985 -275712
10830B35231a43685A09328b22303N8647B32338D2391J5469a6761I3748m3814a14492
$$ 235231 -143685 109328 -222303 -163656 232338 42391 57860 -16761 93748 49934 -114492
10818B18530a34177N5505j64689a01358r2848Q860L4870A28623a44062E837a5887
$$ 218530 -134177 -78672 -243361 -101358 -194206 -185346 -150476 128623 -144062 5837 -15887
10806c06512C7276c58470h3003F8991a04389A42289b77678B2421Q4875J47064
$$ -306512 37276 -358470 -83003 68991 -104389 142289 -277678 22421 107296 254360
10796B54360G6960f5143A59571B1954M4582i6958J2431A62169B414a03203A05065
$$ 254360 76960 -65143 159571 21954 66536 -96958 -84527 162169 2414 -103203 105065
10784c2677l33923a29724A1785K54590H704J17992d3239E1246c1344E9627c3231
$$ -32677 -366600 -129724 11785 266375 8704 126696 -43239 51246 -31344 59627 -33231
10772b47895J6984A15394n5234O5612B3266K53874F2787g8021A30030I391f6094
$$ -247895 -230911 115394 60160 125772 23266 277140 62787 -78021 130030 9391 -66094
10760A89226d4646K412A44585A5063M4864G173K32847g4636I7745d1679B47972
$$ 189226 -44646 -42234 144585 15063 59927 7173 240020 -74636 97745 -41679 247972
10748H8516d8066A62138o7655a10862A52587M7688F9065N6035K9881e6412F3563
$$ 88516 -48066 162138 94483 -110862 152587 200275 69065 125100 154981 -56412 63563
10736A45013a12804e5647B38796k6561b16503D9793a45419B1414K91334B4868
$$ 145013 -112804 -55647 238796 212235 -216503 49793 -145419 21414 312748 24868
10725H2771c74946G1798b1345k41890a16226B61929d5605B15130c18888l6947
$$ 82771 -374946 71798 -21345 -263235 -116226 261929 -45605 215130 -318888 -355835
10715c55835L489C11350a20308j25420A33376c31006a23565G7724N3709d1845
$$ -355835 -352346 311350 -120308 -245728 133376 -331006 -123565 77724 131433 -41845
10704d00365a98664d1413q3486M8214C94656C5180L8158a13801E472K96790h2675
$$ -400365 -198664 -41413 -124899 -76685 394656 35180 73338 -113801 5472 302262 -82675
10692a08907A62572a21022k27228A07429a83204k07585J73023a6230B20094a51919
$$ -108907 162572 -121022 -348250 107429 -183204 -390789 -217766 -16230 220094 -151919
10681c8718l4936r1028B76836h2032G9767C5342b79564J03939E6907L6466a22145
$$ -38718 -73654 -164682 276836 -82032 79767 35342 -279564 -175625 56907 93373 -122145
10669i8116q661q577J7112r4845d7129j51882j49468A77549b63809C28061h7068
$$ -98116 -106777 -115354 -98242 -193087 -47129 -199011 -348479 177549 -263809 328061 -87068
10657D5245N5945a39906q1570K3021E082J17569c19368C0788a5998A13086A0723
$$ 45245 101190 -139906 -221476 -198455 5082 122651 -319368 30788 -15998 113086 10723
10645c19349B05987o722B0740f6110A06198b69465k00256A76095p6658d994j66860
$$ -319349 205987 199265 20740 -66110 106198 -269465 -469721 176095 99437 -4994 -171854
10634a71854j33351D2557n139a99152A13861H873J72768l8817a12887j18640j88232
$$ -171854 -305205 42557 37418 -199152 113861 8873 181641 142824 -112887 -231527 -419759
10623d19759n527f1188r4935f6404j84544q9455C9757a91649N5885A89133F3818
$$ -419759 -425286 -61188 -156123 -66404 -250948 -340403 39757 -191649 -135764 189133 63818
10611c02062a19709c2936B62751b73909F9964i5718o4376D4921e3648A8352K4928
$$ -302062 -119709 -32936 262751 -273909 69964 -95718 -160094 44921 -53648 18352 43280
10600D3280b71927H5105c26675A57392g6883j01502Q2781o7598C4299c04779J12859
$$ 43280 -271927 85105 -326675 157392 -76883 -178385 -95604 -163202 34299 -304779 -191920
10589a91920g0670r1392A2360c05527L4101j9758d2911C7960j7585d14271H9090
$$ -191920 -70670 -162062 12360 -305527 -271426 -291184 -42911 37960 20375 -414271 89090
10577d7493A18413c47977C2041K56393H6357L1328M8449A3595J2829a0257k55243
$$ -47493 118413 -347977 32041 288434 86357 117685 166134 13595 26424 -10257 -265500
10566b65500D49436f2080B7220a68353k6440R6246b9894m0551J578B03014r3876
$$ -265500 449436 -62080 27220 -168353 -194793 -98547 -29894 -70445 -68867 203014 109138
10555A09138A2970c5641B8485h3125B08229m3739a06906d4622j84341d2572r5431
$$ 109138 12970 -35641 28485 -83125 208229 164490 -106906 -44622 -228963 -42572 -138003
10544a38003B56987a84720A2062J19856J30158k6139F3736h6306A80384k2480
$$ -138003 256987 -184720 12062 131918 262076 235937 63736 -86306 180384 157904
10534A57904d17851G8570J47772b28866J04423B19396c2762B4339J63339i0464
$$ 157904 -417851 78570 226342 -228866 -124443 219396 -32762 24339 187678 -90464
10523F4014N1519J69949j8944I3171a37403i26B22819R1244a84097B9117J24551
$$ 64014 115533 285482 266538 93171 -137403 -926 222819 314063 -184097 29117 153668
10512A53668j0269a25027k13677N5313Q6887H5237a74272D25180A35529F5473
$$ 153668 143399 -125027 -338704 -283391 -196504 85237 -174272 425180 135529 65473
10501H5171h111j80622G4067b63859A67766d02038B20232a07614l3965q8244H3082
$$ 85171 -8111 -188733 74067 -263859 167766 -402038 220232 -107614 -141579 -229823 83082
10489b81467h747B853N00306a33824k30453Q3929B36069a90359p1207C5205a05139
$$ -281467 -8747 2853 503159 -133824 -364277 -280348 236069 -190359 -261566 35205 -105139
10477B30343I2456K74058A26128m6682J51528h7408d112A30348e694B90239b00141
$$ 230343 92456 366514 126128 79446 230974 -87408 -4112 130348 -5694 290239 -200141
10465C35361M651k9447P552B8418K24209A22563R1212a80927k8554A55831b520
$$ 335361 340012 310565 318117 28418 252627 122563 213775 -180927 -209481 155831 -2520
10453f6357k00866a01044N056C0183o005J53067O0117c3862C82673j84647c65799
$$ -66357 -267223 -101044 -95988 30183 24178 177245 237362 -33862 382673 198026 -365799
10441H8032O1431a28036j03099M6719B36217m2865C2452a18476n8367r52A45021
$$ 88032 149463 -128036 -231135 -184416 236217 193352 32452 -118476 -176843 -177795 145021
10429a11876K7258C1654a2376n0200j00949A76090E8570G345a42327e3743k60250
$$ -111876 -84618 31654 -12376 -62576 -163525 176090 58570 7345 -142327 -53743 -313993
10418c13993M2915H5316k7484Q2038a7844l84919a85872j23014I1969a14354M5932
$$ -313993 -271078 85316 57832 139870 -17844 -402763 -185872 -308886 91969 -114354 -68422
10407f8422p996r1599m7432B30754q4272c5515l218B42625n705a3243F5230a41254
$$ -68422 -76418 -168017 -215449 230754 146482 -35515 -38733 242625 236920 -13243 65230 -141254
10394A4776a13770E7418h144I2671K00170a96190a8208B86372n0697b85277R1803
$$ 14776 -113770 57418 -8144 92671 292841 -196190 -18208 286372 235675 -285277 -193474
10383a93474Q0110C8236J0461o847b65180J29055D92409A5045a34300d0780p1722
$$ -193474 -113364 38236 48697 41850 -265180 -136125 492409 15045 -134300 -40780 -112502
10372a12502D4149K11905F5257J61416a22411B9947K04344Q9064j05906k6271
$$ -112502 44149 256054 65257 226673 -122411 29947 234291 323355 217449 191178
10362A91178P7533F8449M1631R3447E5045R8284f2887K3937B79711e5970E00728
$$ 191178 268711 68449 110080 203527 55045 153329 -62887 -38950 279711 -55970 500728
10350E66007k58531J07676B01617D092g3497B99162g174H2323J3201J8549K0618
$$ 566007 307476 415152 201617 4092 -73497 299162 -7174 82323 95524 114073 134691
10339A34691J3636F0935K39513K2046K7383K08621B00006q9268K14902b9433D77388
$$ 134691 148327 60935 300448 322494 349877 558498 200006 110738 325640 -29433 477388
10327A21865J28302J11633o8462j31528J39229J32596a88118A23750M19098a05791
$$ 121865 250167 361800 293338 161810 301039 433635 -188118 123750 542848 -105791
10316D66818A14293g9814H5976l586J01714a16872k56895B41683K78493A48508
$$ 466818 114293 -79814 85976 82390 184104 -116872 -373767 241683 520176 148508
10305a40227b5473B07683h5217j25281A51915b9416k2965A42181d0884A3129h4061
$$ -140227 -25473 207683 -85217 -210498 151915 -29416 -52381 142181 -40884 13129 -84061
10293A70757a43507D3616a66518G517a36966A06434L6649a1646C17188a7554k59368
$$ 170757 -143507 43616 -166518 7517 -136966 106434 143083 -11646 317188 -17554 -276922
10282b76922F5992a27195A78943K0146l5496C5816e3059n3400k7842e7506j860
$$ -276922 65992 -127195 178943 199089 163593 35816 -53059 -106459 -134301 -57506 -59366
10271e9366l56645C7328f4237k7321D0825b52172A32144b29434C31729c9470j3163
$$ -59366 -416011 37328 -64237 -91558 40825 -252172 132144 -229434 331729 -39470 -52633
10260e2633j10064A09686i8874B14353r222K8907a0827D15079F5590N0472G627
$$ -52633 -162697 109686 -98874 214353 205131 234038 -10827 415079 65590 116062 7627
10248f9631p7399B41590A05299F206J89730K0508p1467k2194J77347A46768c95985
$$ -69631 -147030 241590 105299 6206 195936 216444 144977 122783 300130 146768 -395985
10236c8747c075l19421c8938k3527H5609R0361E5486e6964A70528f8840j47548
$$ -38747 -3075 -322496 -38938 -62465 85609 175970 55486 -56964 170528 -68840 -216388
10225b16388k5147P622A56224a62298e0955j92249A4353a94572J6700b5147k90281
$$ -216388 -241535 -233913 156224 -162298 -50955 -243204 14353 -194572 -177872 -25147 -315428
10214c15428B41196J00099A07025J5511d54094J10393a27492j4129j73527Q0385
$$ -315428 241196 341295 107025 122536 -454094 -343701 -127492 -141621 -315148 -234763
10204b34763O0796c8854j59797O1759e600B08085l2445G8902a15422m8445J9721
$$ -234763 -173967 -38854 -198651 -136892 -5600 208085 175640 78902 -115422 -163867 -144146
10193a44146D0403a66608A52220H290h0523C0157i2281j1427B8046b2216r6074
$$ -144146 40403 -166608 152220 8290 -80523 30157 -92281 -103708 28046 -22216 -118290
10182a18290A62221a09886Q696F2752a08077d9422j13052A17947a27699G3173
$$ -118290 162221 -109886 -101190 62752 -108077 -49422 -162474 117947 -127699 73173
10171B96388G2049c48784J62844A18644A1043J2918Q097J29992a60854E2732i5994
$$ 296388 72049 -348784 -185940 118644 11043 23961 32058 162050 -160854 52732 -95994
10159b3696j75880a2147H770M79038d4654C5350g9984b4870B08922a32564K0177
$$ -23696 -199576 -12147 8770 487808 -44654 35350 -79984 -24870 208922 -132564 -112387
10148a12387G6459c19715a34435R984E322L5378J79091A6052a94685h2858L8747
$$ -112387 76459 -319715 -134435 -124451 5322 40700 219791 16052 -194685 -82858 -44111
10137d4111C5231J42309g0545k59490A65789a51071j059k24769A14858a53457
$$ -44111 35231 177540 -70545 -330035 165789 -151071 -152130 -376899 114858 -153457
10126a90060j32731a43313B8778a29905A45932J74188g5402o5121q5513e0791
$$ -190060 -322791 -143313 28778 -129905 145932 320120 -75402 -140523 -226036 -50791
10115c10765J28327A84886a75323K7843A07842e5776k29034g5020j39833J6405
$$ -310765 -182438 184886 -175323 -147480 107842 -55776 -284810 -75020 -214853 -198448
10105a98448j00902E5888e20063I3745j0973a54783A23410J13843K565A09621
$$ -198448 -299350 55888 -520063 93745 82772 -154783 123410 237253 239818 109621
10094e9875R905l19696G0557b52017d454I2233a19019D2933c5574k34956J07089
$$ -59875 -49970 -369666 70557 -252017 -4454 92233 -119019 42933 -35574 -270530 -163441
10083a63441D7097R1120n2349J9069l7313c54646k2293F2793P4260l7026A6199
$$ -163441 47097 138217 85868 104937 67624 -354646 -376939 62793 137053 100027 16199
10071B6490a7700Q134A73745o7174J3331b40314d525k03065M3802A44819b15447
$$ 26490 -17700 -9566 173745 106571 119902 -240314 -4525 -207590 -163788 144819 -215447
10059H5045f4416F0020a27804N3848A07736L6214c19527h4117p0556D3238A2387
$$ 85045 -64416 60020 -127804 -73956 107736 143950 -319527 -84117 -154673 43238 12387
10047b911j18713c4947D240O7080a08993o8609B57948C7005e8638B60076I2951
$$ -2911 -121624 -34947 4240 71320 -108993 -177602 257948 37005 -58638 260076 92951
10035a13306e0997k45825B0889b67672j28732J86943L4574A20141d6740j21105
$$ -113306 -50997 -296822 20889 -267672 -396404 -209461 -174887 120141 -46740 -167845
10025a67845A0805c14141H889a0873l60928Q6949o0876Q2021J13794j6955K4455
$$ -167845 10805 -314141 8889 -10873 -371801 -284852 -345728 -263707 -149913 -166868 -142413
10014a42413b9240r937D1900a64742j72385J58716j84945a09880j48597a3591
$$ -142413 -29240 -39177 41900 -164742 -337127 -178411 -363356 -109880 -258477 -13591
10003c89485B25843h6696B3177i8005l7914e9978A64210e9951F1343a48571j22979
$$ -389485 225843 -86696 23177 -98005 -135919 -59978 164210 -59951 61343 -148571 -271550
9992b71550k31178b6346A88876d87438D1893d73754A41511a65325A03051b02978
$$ -271550 -502728 -26346 188876 -487438 41893 -473754 141511 -165325 103051 -202978
9981G5638b26365B65086j32453n6685b54324c0118B2794c2037j44642A42556D3855
$$ 75638 -226365 265086 132633 75948 -254324 -30118 22794 -32037 -176679 142556 43855
9969B51309e7677D7234b1198k677j65295E5597g8531F3928c33544Q8009B4450
$$ 251309 -57677 47234 -21198 -23875 -189170 55597 -78531 63928 -333544 -245535 24450
9957e3113j31644b2500E29316C3448L3000j9126M8098d0054C08548b20414j32114
$$ -53113 -184757 -22500 529316 33448 66448 47322 95420 -40054 308548 -220414 -352528
9946c52528A5707a88203j84488J71004a5131k51382F5125b07521H4259j5959j1260
$$ -352528 15707 -188203 -372691 -201687 -15131 -266513 65125 -207521 84259 68300 57040
9935E7040K6391b36701e8086j18352l4743j51437D556a67861G2711N2022F1550
$$ 57040 83431 -236701 -58086 -176438 -211181 -362618 4556 -167861 72711 124733 61550
9923C15797F6865a03900m1275j32751O8105d7474j2733j3631F8754f3636j90538
$$ 315797 66865 -103900 -145175 -277926 -209821 -47474 -60207 -73838 68754 -63636 -254174
9912b54174p1893l7115J54705K8855k15507A88714A876Q2325K7656d8013c069
$$ -254174 -326067 -363182 -208477 -179622 -395129 188714 1876 84201 111857 -48013 -3069
9900H2088a14069A59764c55703B63713a26997C6933b73899a9768A39781J29518
$$ 82088 -114069 159764 -355703 263713 -126997 36933 -273899 -19768 139781 269299
9890B69299b38676A41018B5813a21320F4031k0575a18206j6069E4478O3483e969
$$ 269299 -238676 141018 25813 -121320 64031 43456 -118206 -134275 54478 117961 -5969
9878I7155c12749L6378D4046f5872k84052A94711i9047H3495B3129b28406C4384
$$ 97155 -312749 -276371 44046 -65872 -349924 194711 -99047 83495 23129 -228406 34384
9866A03345d5148m8588A20626J46760a39434B31726b78393e9391b0419B8467M874
$$ 103345 -45148 -93736 120626 267386 -139434 231726 -278393 -59391 -20419 28467 33341
9855C3341a2631B1471a017q4570l56676a67016b8703j13000b4958A32038b34670
$$ 33341 -12631 21471 -1017 -85587 -442263 -167016 -28703 -141703 -24958 132038 -234670
9843A83045p7676h8520C86416G9541a16685E3296c26459b2853B2806c3398B19060
$$ 183045 105369 -88520 386416 79541 -116685 53296 -326459 -22853 22806 -33398 219060
9831a9230o7301G9531a49848g4132G4171h6506p3876I5355a85832o9299J14080
$$ -19230 -86531 79531 -149848 -74132 74171 -86506 -160382 95355 -185832 -255131 -141051
9820a41051F5973a48227d0946j02634A16913A6956c49421a44033f3306A9561b70579
$$ -141051 65973 -148227 -40946 -143580 116913 16956 -349421 -144033 -63306 19561 -270579
9808a33380c9587j66427h6415k37615j50037C9815A6317d94167C8708a33505j46394
$$ -133380 -39587 -206014 -86415 -324030 -474067 39815 16317 -494167 38708 -133505 -279899
9797b79899d7949k34425B0672M3255a89520b9293D9410c87226a88727C2022c7119
$$ -279899 -47949 -282374 20672 63927 -189520 -29293 49410 -387226 -188727 32022 -37119
9785b95382A69434e823j25143F1332a77638N4582c3126l2639B45612D3300J95201
$$ -295382 169434 -5823 -130966 61332 -177638 -123056 -33126 -65765 245612 43300 238501
9774B38501b88674L7105M2463C8834a41740e7907b6452o7083m2965l98720b32200
$$ 238501 -288674 -251569 -209106 38834 -141740 -57907 -26452 -93535 -136500 -535220 -232200
9762d5222r0104o7218l4607A14181J53528A28269b02002j13307R5540A21824b54145
$$ -45222 -135326 -202544 -237151 114181 267709 128269 -202002 -315309 -219769 121824 -254145
9750A16312O1046a38217E8146P3992b06702Q1120l3910A01911g4468J2731q6508
$$ 116312 177358 -138217 58146 132138 -206702 -125582 -159492 101911 -74468 -61737 -148245
9739a48245j99549d980k42839j3504J03819A0824h072B32840D2080K15033c06354
$$ -148245 -347794 -4980 -247819 -261323 -157504 10824 -8072 232840 42080 257113 -306354
9727b76205a10619q335j08533k087h2715C92534a22145k32116b196k43113A3014
$$ -276205 -110619 -118954 -227487 -229574 -82715 392534 -122145 -354261 -2196 -245309 13014
9715b4224f266q8593A74305f90A34733a80987H6246a62092R523q3235a12253c6145
$$ -24224 -6266 -94859 174305 -690 134733 -180987 86246 -162092 -152569 -235804 -112253 -36145
9702B09200a99969L7530a0658j02993A66198b38366A83604b58863B04190F0670
$$ 209200 -199969 -162439 -10658 -113651 166198 -238366 183604 -258863 204190 60670
9691a29484B7818b38418m8138a14983j33645f658j36526I4636f4616F0846e0626
$$ -129484 27818 -238418 -286556 -114983 -248628 -6658 -143184 94636 -64616 60846 -50626
9679g8333p2739N3571j62951d1981B59235A8955b58720k4307D5403c7444j60959
$$ -78333 -151072 -97501 -260452 -41981 259235 18955 -258720 -283027 45403 -37444 -198403
9668a98403G7604b79300g6391G0483B1798a05718H6233a44655A52583E6589i9494
$$ -198403 77604 -279300 -76391 70483 21798 -105718 86233 -144655 152583 56589 -99494
9656C9380b82512P1895n3095J15512j08165J5760A8239Q23Q2030K9601a77599
$$ 39380 -282512 -210617 -263712 -148200 -256365 -240605 18239 19062 101092 130693 -177599
9644A95389a16466B26366b5557j36145B2435b06782k0695r980B6793L9446c3878
$$ 195389 -116466 226366 -25557 -161702 22435 -206782 -227477 -237457 26793 66239 -33878
9632a78613d5501j80849d9752j47343k601d4338G5540k3388b19165F2422K0675
$$ -178613 -45501 -226350 -49752 -197095 -199696 -44338 75540 52152 -219165 62422 83097
9621H3097k9970J12470p9076b65916B4311a28264m047A073J4734J12634h7166
$$ 83097 53127 165597 86521 -265916 24311 -128264 -132311 1073 15807 128441 -87166
9609I9249P9101b86524j16117C5115i6180k52339a27228b9960j69202D0843c3315
$$ 99249 178350 -286524 -402641 35115 -96180 -348519 -127228 -29960 -199162 40843 -33315
9597b56082O585B8958a75374H7707O7161c31937a36188k06930c502D03754r7814
$$ -256082 -249497 28958 -175374 87707 154868 -331937 -136188 -343118 -3502 403754 305940
9586C05940a11623m1200l32659D2937b93224J37976j07436B22095j9557D7943
$$ 305940 -111623 -152823 -485482 42937 -293224 -155248 -262684 222095 202538 47943
9575b65804B3025J14535D0179P4121i5072L8402m7206j33523B04966N2896a43582
$$ -265804 23025 137560 40179 114300 -95072 -56670 -103876 -237399 204966 257862 -143582
9563h5327B5676J30670E7949B8962C723i7871C6780a38238M9342k5383B04658
$$ -85327 25676 156346 57949 28962 3723 -97871 36780 -138238 -88896 -114279 204658
9551f2065l93099e2555j93073I1686b53837M0598B1852a05497E8695c16073a40763
$$ -62065 -455164 -52555 -245628 91686 -253837 -213239 21852 -105497 58695 -316073 -140763
9539A60342b07137r3208O9897D0516K22927c83335A50261a08292k51174J34112
$$ 160342 -207137 -300345 -230448 40516 263443 -383335 150261 -108292 -359466 -225354
9529b25354j5937b829C11849i3390j99480R9371A12583A3450i2387H3968a85070
$$ -225354 -241291 -2829 311849 -93390 -292870 -193499 112583 13450 -92387 83968 -185070
9517c45633J56092i4722k13269A41442L4018K0566B6854J46341e6437j42134j36739
$$ -345633 -189541 -94722 -307991 141442 175460 196026 26854 173195 -56437 -198571 -335310
9506c35310i1252A88083l9351a15771A46006C8581a86153j3913n5392k0607R1818
$$ -335310 -91252 188083 148732 -115771 146006 38581 -186153 -200066 -255458 -276065 -184247
9495a84247Q3137A09738b6925a1196k02499a00225j4752F2359b24289B1534K75153
$$ -184247 -101110 109738 -26925 -11196 -213695 -100225 -114977 62359 -224289 21534 296687
9484B96687j8090J1979b4322r7325b9074k1282d898n3599j35990H0103N5103g1388
$$ 296687 278597 290576 -24322 -121647 -29074 -50356 -4898 -58497 -194487 80103 135206 -71388
9471A5915a81810M8916m5533b9628A45906a44844r94j24680q136i9207o4956f7897
$$ 15915 -181810 -132894 -178427 -29628 145906 -144844 -145838 -270518 -278654 -99207 -164163 -67897
9458a07843j315E8628b90423G0575f0151A60113E9456C987a08220a2292k38717
$$ -107843 -109158 58628 -290423 70575 -60151 160113 59456 3987 -108220 -12292 -251009
9447b51009B74342E1942d5257D47g9682A29566k5473B3590c6546l01443K8730
$$ -251009 274342 51942 -45257 447 -79682 129566 104093 23590 -36546 -337989 -309259
9436c09259J15147r0711A98164G5121c1048k8592a0795l4994l27652B8448e1622
$$ -309259 -194112 -284823 198164 75121 -31048 -59640 -10795 -45789 -373441 28448 -51622
9424B37323a45874A37383f932B49172a8884k28975i8371L5886j02923D7500e4994
$$ 237323 -145874 137383 -6932 249172 -18884 -247859 -98371 -62485 -165408 47500 -54994
9412a32508B95607c0878B29897b26503a02928n7162j2306A6281f4261a4643A49371
$$ -132508 295607 -30878 229897 -226503 -102928 -160090 -172396 16281 -64261 -14643 149371
9400a47492i511C7197K506e7169l1797k2076D5611b2910l14426J46106j28099
$$ -147492 -9511 37197 39703 -57169 -88966 -111042 45611 -22910 -337336 -191230 -319329
9389c19329I9922k5456c01214Q009g5143I0548j7401b59584K6553h3611j15694
$$ -319329 99922 74466 -301214 -293205 -75143 90548 73147 -259584 -233031 -83611 -199305
9378a99305c0914I8680o626A7547d05539a08609b8352I04J26087a92408k00241
$$ -199305 -30914 98680 92054 17547 -405539 -108609 -28352 904 126991 -192408 -392649
9367c92649d1379l4221j75274O4344e7917l92131H2960Q4705a86547G2230k7889
$$ -392649 -41379 -75600 -250874 -186530 -57917 -450048 82960 167665 -186547 72230 44341
9356D4341b16084o4847P3817c2926J5706j17502o8898O5356O2351B54451c93048
$$ 44341 -216084 -280931 -207114 -32926 -17220 -134722 -203620 -138264 -75913 254451 -393048
9344A00771J92677D4946M6960L6666a10902A77112b77524a8069j28640b7546G5467
$$ 100771 293448 44946 91906 128572 -110902 177112 -277524 -18069 -146709 -27546 75467
9332a91508A07329D9697b4150q8989b9789m1871n1321C57862a12496n943C4667
$$ -191508 107329 49697 -24150 -113139 -29789 -71660 -122981 357862 -112496 -118439 34667
9320c54313a51076c7120A09468P768c2899H166i2801n3699C06521C8835b26767
$$ -354313 -151076 -37120 109468 117236 -32899 8166 -92801 -146500 306521 38835 -226767
9308e1929b5930j38217a8216I6837e01311a70375F866J06680b8628o5207p4396
$$ -51929 -25930 -164147 -18216 96837 -501311 -170375 6866 113546 -28628 -93835 -168231
9297a68231m4856A02511d933G2560b29900a682D11794e1090o359E612d6206G4821
$$ -168231 -213087 102511 -4933 72560 -229900 -1682 411794 -51090 -57449 5612 -46206 74821
9284A46399c8734C76969a6761j50021O6250a152B2141e3379D1482O0578A7468
$$ 146399 -38734 376969 -16761 -166782 -100532 -1152 22141 -53379 41482 102060 17468
9272d9151l9436a0104F5385K45936A54336B1349O4850a08813H841f9685C5261
$$ -49151 -88587 -10104 65385 311321 154336 21349 86199 -108813 8841 -69685 35261
9260B67971F9214N9706L8052G4595I315J50598H890d08203A92941i9882j20350
$$ 267971 69214 128920 166972 74595 9315 159913 8890 -408203 192941 -99882 -220232
9249b20232h9436D7402J6123j9566J35140m9498a20735e1912B39782K68341I947
$$ -220232 -89436 47402 63525 43959 179099 129601 -120735 -51912 239782 508123 9947
9237a60951g3819j9127l00554A7696B443a60018B4719a19021M6216o1567j89762
$$ -160951 -73819 -92946 -393500 17696 2443 -160018 24719 -119021 -72805 -134372 -324134
9226c24134A30219N3476a70190A67233a70155A23194P1657a19844b2142p6826
$$ -324134 130219 183695 -170190 167233 -170155 123194 194851 -119844 -22142 -98968
9216i8968A49432a56630O1188C2460f219n0638o3283M4230H167K31209F0997a15652
$$ -98968 149432 -156630 -95442 32460 -6219 -56857 -120140 -75910 8167 239376 60997 -115652
9203c7585B47375b92304J01503A25258a49229o4940m5440A8030f4910o3182j51491
$$ -37585 247375 -292304 -190801 125258 -149229 -214169 -259609 18030 -64910 -128092 -279583
9192b79583h7405p295j9026B3358b80636f4211I165b36317I7764b53427e2017
$$ -279583 -87405 -94700 -113726 23358 -280636 -64211 9165 -236317 97764 -253427 -52017
9180d19290D86173A04802N8035E6277a96669a3381A12995k284d41200N3823b4352
$$ -419290 486173 104802 162837 56277 -196669 -13381 112995 110711 -441200 -387377 -24352
9168g3646E4736c62787a33667L7154k2458K1350A02751D3702j1601b66313a03914
$$ -73646 54736 -362787 -133667 -96513 -118971 -97621 102751 43702 32101 -266313 -103914
9156F0851g0657j33288e6865a9574A87221k7018b00437C0054a20268D59580B5836
$$ 60851 -70657 -203945 -56865 -19574 187221 160203 -200437 30054 -120268 459580 25836
9144g9748b654m07265A19528d55677a13372C75156e7862j28869J6344G2903i0712
$$ -79748 -2654 -409919 119528 -455677 -113372 375156 -57862 -186731 -170387 72903 -90712
9132a62790M0617k7169P515A32879a46839M6885A09220a00375r6905j01862J39613
$$ -162790 -122173 -149342 -141827 132879 -146839 -99954 109220 -100375 -197280 -299142 -159529
9121a59529A97679B9099g0385k25739A47067a05651j75900D6113c31959J35995
$$ -159529 197679 29099 -70385 -296124 147067 -105651 -281551 46113 -331959 -195964
9111a95964i2197B3451J84922m7530A0782b80135J03533I604b22715J01993e0741
$$ -195964 -92197 23451 208373 160843 10782 -280135 -176602 9604 -222715 -120722 -50741
9099d576D3259a22585B8409a70928C7860P8674Q1990d40867J70276e2687j46639
$$ -4576 43259 -122585 28409 -170928 37860 116534 198524 -440867 -270591 -52687 -199326
9088a99326b21m20844J47087A79742f6414j614C14500b20701O3995C22400d56578
$$ -199326 -221 -421065 -273978 179742 -66414 -68028 314500 -220701 -156706 322400 -456578
9076C70045i0328k1653q8718N077f574l8004j19877L3569E7246b98837a19267
$$ 370045 -90328 -111981 -200699 -195622 -6574 -44578 -164455 -130886 57246 -298837 -119267
9064F4023a20679A7759a5588c872j42962C796b85944J3240f4722A41500h0449
$$ 64023 -120679 17759 -15588 -3872 -146834 3796 -285944 -272704 -64722 141500 -80449
9052a44071I7466a30387n6284K9052F416b99218J05395C36259b65935q9509a3518
$$ -144071 97466 -130387 -186671 -157619 6416 -299218 -193823 336259 -265935 -355444 -13518
9040d51798A81065m2714n3311f2620m6430A11537c2123B8847a02964n4485H5443
$$ -451798 181065 138351 85040 -62620 -109050 111537 -32123 28847 -102964 -157449 85443
9028a51636a1532F6818d0894H0181b21263D5695a58332O5933L5147D8032b83663
$$ -151636 -11532 66818 -40894 80181 -221263 45695 -158332 -92399 -57252 48032 -283663
9016a27829M3178I0943b40266a4103m28998A35093o2412b01577C17787E5943c8830
$$ -127829 -84651 90943 -240266 -14103 -443101 135093 72681 -201577 317787 55943 -38830
9004a34784H7953b71985A84003c3055C7220e3256b717m6791B13156A05717k6517
$$ -134784 87953 -271985 184003 -33055 37220 -53256 -2717 -49508 213156 105717 79200
8993G9200c11291A32443a87320p7839A16786K17507a19668N5048c646G1146f4678
$$ 79200 -311291 132443 -187320 -265159 116786 334293 -119668 -64620 -3646 71146 -64678
8981a57062P3814a5326A13732D5851a50774A09849a95619k9735O9D4553b66323
$$ -157062 -83248 -15326 113732 45851 -150774 109849 -195619 -225354 -225285 44553 -266323
8969F0960a85212b1771j65077A27216c00662a8265H6633J28458a68462o7929M4812
$$ 60960 -185212 -21771 -186848 127216 -300662 -18265 86633 215091 -168462 -236391 -191579
8958a91579B84927I9271d42514B7891j266h6011p9740h1457j11686f1988E490
$$ -191579 284927 99271 -442514 27891 26625 -86011 -165751 -81457 -193143 -61988 5490
8946a33417B1963J03089j8939f8781J4652E0984a58248j69930a34189c9159p4303
$$ -133417 21963 125052 106113 -68781 -54129 50984 -158248 -328178 -134189 -39159 -113462
8935a13462c1889j00522q2579m8078K6091c5349P418G5754d22476e3767k14743
$$ -113462 -31889 -132411 -214990 -263068 -236977 -35349 -27931 75754 -422476 -53767 -268510
8924b68510A09301j4979h8647A88546q1563J34634e3679A38374M547a46204C06955
$$ -268510 109301 94322 -88647 188546 106983 241617 -53679 138374 142921 -146204 306955
8912b1150G0542O74119j29963K91559J83104J092226K368237M440056m393996
$$ -21150 70542 744661 614698 906257 1089361 2181587 4549824 8989880 4595884
8903D595884k218254p54337o15470j38528m33753n1575j03047C6315K57206J03731
$$ 4595884 2377630 1623293 1007823 869295 435542 383967 280920 36315 293521 397252
8893C97252b7990H0191K06535A26534D296O5543j5239a24535H0338J92245a62732
$$ 397252 -27990 80191 286726 126534 4296 69839 54600 -124535 80338 272583 -162732
8881a66810j51429R4856n1484B11538a35264j33133a31787M9484k88952e3666
$$ -166810 -318239 -223383 -274867 211538 -135264 -268397 -131787 -82303 -371255 -53666
8870F2776d60177f8089J8646A07518J33468i2927k0024A1998J20691l3596a22611
$$ 62776 -460177 -68089 -49443 107518 240986 -92927 -112951 11998 132689 99093 -122611
8858a56302q2044J09001B61650a90002f6678j37247B21111c884o357r4807p1870
$$ -156302 -238346 -129345 261650 -190002 -66678 -203925 221111 -3884 -10241 -105048 -176918
8847a76918I905K52d2298k4751A66415c52315B25821C7220K0592a69749l1371
$$ -176918 9905 10157 -42298 -67049 166415 -352315 225821 37220 57812 -169749 -201120
8836b01120A18575J31262b89230a5820j93297F6629a06913j21713A99456I462
$$ -201120 118575 249837 -289230 -15820 -209117 66629 -106913 -228626 199456 9462
8825a38671K4892j49095O6880b7958j63068L7992j14107L1515J02412A04274b8894
$$ -138671 -113779 -262874 -195994 -27958 -191026 -153034 -267141 -235626 -133214 104274 -28894
$$ [...]
##END NTUPLES=NMR SPECTRUM
##END=
