
##TITLE=UV1012_M1-1003-1002_6269707_agI7hXAEby
##JCAMPDX= 6.0         $$ Bruker NMR JCAMP-DX V2.0
##DATA TYPE= NMR SPECTRUM
##DATA CLASS= NTUPLES
##ORIGIN= BRUKER
##OWNER= Administrator
$$ 1.72 TOPSPIN		Version 2.1
$$ 2012-06-07 06:54:01.031 -0500  Administrator@TOPSPIN
$$ Compression mode = diff/dup
##.OBSERVE FREQUENCY= 400.13188235
##.OBSERVE NUCLEUS= ^1H
##.ACQUISITION MODE= SIMULTANEOUS (DQD)
##.ACQUISITION SCHEME= undefined
##.AVERAGES= 64
##.DIGITISER RES= 22
##SPECTROMETER/DATA SYSTEM= spect
##.PULSE SEQUENCE= noesygpps1d.comp
##.SOLVENT NAME= COFFEE_meoh
##.SHIFT REFERENCE= INTERNAL, COFFEE_meoh, 1, 14.9671
##AUDIT TRAIL= $$ (NUMBER, WHEN, WHO, WHERE, PROCESS, VERSION, WHAT)
$$ ##TITLE= Audit trail, TOPSPIN		Version 2.1
$$ ##JCAMPDX= 5.01
$$ ##ORIGIN= Bruker BioSpin GmbH
$$ ##OWNER= Administrator
$$ $$ C:\Bruker\TOPSPIN/data/COFFEE/nmr/UV1012_M1-1003-1002_6269707_agI7hXAEby/22/pdata/1/auditp.txt
$$ ##AUDIT TRAIL=  $$ (NUMBER, WHEN, WHO, WHERE, PROCESS, VERSION, WHAT)
(   1,<2012-06-07 06:53:55.937 -0500>,<Administrator>,<TOPSPIN>,<go>,<TOPSPIN 2.1>,
      <created by zg
	started at 2012-06-07 06:42:25.781 -0500,
	POWCHK enabled, PULCHK disabled,
       configuration hash MD5:
       D5 CA 7A 23 FE 6B EE E2 50 67 74 61 24 F7 5E 3B
       data hash MD5: 64K
       6B 66 D6 2B 5A EC 24 A3 A7 F1 CC 02 45 F9 8F D5>)
(   2,<2012-06-07 06:53:58.796 -0500>,<Administrator>,<TOPSPIN>,<proc1d>,<TOPSPIN 2.1>,
      <Start of raw data processing
       efp LB = 0.3 FT_mod = 6 PKNL = 1 PHC0 = 0 PHC1 = 0 SI = 128K 
       data hash MD5: 128K
       25 FE 6A 4D AF 2A 0D 68 B4 84 65 7C B9 6F 9C 64>)
(   3,<2012-06-07 06:53:59.937 -0500>,<Administrator>,<TOPSPIN>,<proc1d>,<TOPSPIN 2.1>,
      <pk PHC0 = 31.05286 PHC1 = 0 
       data hash MD5: 128K
       ED 5E 77 64 75 AD 1F AA 51 7B 05 99 CB 82 13 79>)
(   4,<2012-06-07 06:54:00.687 -0500>,<Administrator>,<TOPSPIN>,<proc1d>,<TOPSPIN 2.1>,
      <abs ABSG = 1 
       data hash MD5: 128K
       03 B6 ED ED 92 17 5B A3 EC F7 C2 D0 AF 0B 3F 7F>)
(   5,<2012-06-07 06:54:00.750 -0500>,<Administrator>,<TOPSPIN>,<proc1d>,<TOPSPIN 2.1>,
      <abs ABSG = 2 
       data hash MD5: 128K
       51 33 9A AB B3 DF 33 C9 F6 77 C4 DE 6C C5 CC 2D>)
(   6,<2012-06-07 06:54:00.796 -0500>,<Administrator>,<TOPSPIN>,<proc1d>,<TOPSPIN 2.1>,
      <abs ABSG = 3 
       data hash MD5: 128K
       32 E5 28 2F 05 0E 3F FA 31 FE 8C D5 E7 EE 58 0F>)
(   7,<2012-06-07 06:54:00.859 -0500>,<Administrator>,<TOPSPIN>,<proc1d>,<TOPSPIN 2.1>,
      <abs ABSG = 4 
       data hash MD5: 128K
       FD BC 54 66 B1 1C AD D8 99 F8 11 82 C2 D9 0D 90>)
(   8,<2012-06-07 06:54:00.921 -0500>,<Administrator>,<TOPSPIN>,<proc1d>,<TOPSPIN 2.1>,
      <abs ABSG = 5 
       data hash MD5: 128K
       6C D9 E6 7A EB 4E E4 75 5E 7E DB 19 0A 88 27 29>)
$$ ##END=
$$ 
$$ $$ hash MD5
$$ $$ D6 11 EA 64 85 CA 7D 78 23 26 9A 4C FB 86 32 C4
##$RELAX= 
##$RELAX= 
##$RELAX= 
##$RELAX= 
##$RELAX= 
##$RELAX= 
##$RELAX= 
##$RELAX= 
$$ Bruker specific parameters
$$ [...]
##$TP07= 0
##$TPNAME0= <>
##$TPNAME1= <>
##$TPNAME2= <>
##$TPNAME3= <>
##$TPNAME4= <>
##$TPNAME5= <>
##$TPNAME6= <>
##$TPNAME7= <>
##$TPOAL= (0..7)
0.5 0.5 0.5 0.5 0.5 0.5 0.5 0.5
##$TPOFFS= (0..7)
0 0 0 0 0 0 0 0
##$TUNHIN= 0
##$TUNHOUT= 0
##$TUNXOUT= 0
##$USERA1= <user>
##$USERA2= <user>
##$USERA3= <user>
##$USERA4= <user>
##$USERA5= <user>
##$V9= 5
##$VALIST= <valist>
##$VCLIST= <CCCCCCCCCCCCCCC>
##$VD= 0
##$VDLIST= <DDDDDDDDDDDDDDD>
##$VPLIST= <PPPPPPPPPPPPPPP>
##$VTLIST= <TTTTTTTTTTTTTTT>
##$WBST= 2048
##$WBSW= 25
##$XGAIN= (0..3)
0 0 0 0
##$XL= 0
##$YL= 0
##$YMAX_a= 9657755
##$YMIN_a= -6852874
##$ZGOPTNS= <>
##$ZL1= 120
##$ZL2= 120
##$ZL3= 120
##$ZL4= 120
##$ABSF1= 14.9671
##$ABSF2= -5.58543
##$ABSG= 5
##$ABSL= 3
##$ALPHA= 0
##$AQORDER= 0
##$ASSFAC= 0
##$ASSFACI= 0
##$ASSFACX= 0
##$ASSWID= 0
##$AUNMP= <proc_prof1d_extract.lims>
##$AXLEFT= 0
##$AXNAME= <>
##$AXNUC= <1H>
##$AXRIGHT= 0
##$AXTYPE= 0
##$AXUNIT= <>
##$AZFE= 0.1
##$AZFW= 0.1
##$BCFW= 0
##$BC_mod= 0
##$BYTORDP= 0
##$COROFFS= 0
##$CY= 15
##$DATMOD= 1
##$DC= 0
##$DFILT= <>
##$DTYPP= 0
##$F1P= 0
##$F2P= 0
##$FCOR= 0.5
##$FTSIZE= 131072
##$FT_mod= 6
##$GAMMA= 0
##$GB= 0
##$INTBC= 1
##$INTSCL= 1
##$ISEN= 128
##$LB= 0.3
##$LEV0= 0
##$LPBIN= 0
##$MAXI= 10000
##$MC2= 0
##$MEAN= 0
##$ME_mod= 0
##$MI= 0
##$NCOEF= 0
##$NC_proc= -2
##$NLEV= 6
##$NOISF1= 0
##$NOISF2= 0
##$NSP= 0
##$NTH_PI= 0
##$NZP= 0
##$OFFSET= 14.9671
##$PC= 1
##$PHC0= 31.05286
##$PHC1= 0
##$PH_mod= 1
##$PKNL= yes
##$PPARMOD= 0
##$PPDIAG= 0
##$PPIPTYP= 0
##$PPMPNUM= 2147483647
##$PPRESOL= 1
##$PSCAL= 4
##$PSIGN= 0
##$PYNMP= <proc.py>
##$REVERSE= no
##$SF= 400.130005404732
##$SI= 131072
##$SIGF1= 0
##$SIGF2= 0
##$SINO= 400
##$SIOLD= 131072
##$SPECTYP= <>
##$SREGLST= <1H.CDCl3>
##$SSB= 0
##$STSI= 131072
##$STSR= 0
##$SW_p= 8223.68421052632
##$SYMM= 0
##$S_DEV= 0
##$TDeff= 65536
##$TDoff= 0
##$TI= <>
##$TILT= no
##$TM1= 0
##$TM2= 0
##$TOPLEV= 0
##$USERP1= <user>
##$USERP2= <user>
##$USERP3= <user>
##$USERP4= <user>
##$USERP5= <user>
##$WDW= 1
##$XDIM= 131072
##$YMAX_p= 227496355
##$YMIN_p= -292923524
##$CURPLOT= <Network HP LaserJet P1505>
##$CURPRIN= <$Network HP LaserJet P1505>
##$DFORMAT= <normdp>
##$LAYOUT= <+/1D_H.xwp>
##$LFORMAT= <normlp>
##$PFORMAT= <normpl>
##$SURQMSG= 1
$$ End of Bruker specific parameters
$$ ---------------------------------
##NTUPLES= NMR SPECTRUM
##VAR_NAME=  FREQUENCY,     SPECTRUM/REAL,   SPECTRUM/IMAG
##SYMBOL=    X,             R,               I
##VAR_TYPE=  INDEPENDENT,   DEPENDENT,       DEPENDENT
##VAR_FORM=  AFFN,          ASDF,            ASDF
##VAR_DIM=   131072,        131072,          131072
##UNITS=     HZ,            ARBITRARY UNITS, ARBITRARY UNITS
##FACTOR=    0.0627417313425165, 1,          1
##FIRST=     8223.62146879498, 1713,         -48062
##LAST=      0,             3708,            -47741
##MIN=       0,             -292923524,      0
##MAX=       8223.62146879498, 227496355,    0
$$ Real data points
##PAGE= N=1
##DATA TABLE= (X++(R..R)), XYDATA
$$ [...]
66543 115888 114507 113321 112915 113326 114044 114331 113627 111910 109729 107677 105842 103972 102088 100684 100240 100733
66527 100733 101640 102241 102038 101195 100550 100856 101911 102697 102508 101692 101188 101519 102386 103063 103062 102528 102081 102143 102384
66508 102384 102074 101016 99788 98911 98135 96942 95445 94314 93840 93637 93423 93609 94686 96289 97356 97235
66492 97235 96241 95005 93694 92141 90433 88890 87523 86092 84771 84194 84567 85176 85254 84989 85132 85847 86565
66475 86565 86853 86735 86167 84993 83643 83115 83743 84532 84300 83094 81947 81530 81651 81866 81881 81426 80352 79073
66457 79073 78386 78643 79372 79876 79944 79840 79829 79818 79431 78484 77508 77549 79078 81225 82535 82501 81907 81651 81755 81711
66437 81711 81304 80713 80120 79601 79217 78930 78513 77741 76640 75486 74694 74616 75154 75527 74902 73446 72364 72498
66419 72498 73286 73476 72653 71551 71003 71055 71194 71097 70987 71337 72222 72987 72819 71755 70785 70696 71153 71384 71378 71745
66399 71745 72527 72969 72639 72067 71888 71874 71373 70363 69524 69335 69577 69842 70127 70701 71535 72142 72071 71456 70918
66380 70918 70963 71603 72616 73891 75260 76183 75982 74502 72369 70554 69744 69998 70714 71066 70807 70664 71491
66363 71491 73052 74076 73747 72632 71823 71561 71189 70202 68852 67753 67283 67381 67632 67564 67143 66892 67244 67811
66345 67811 67672 66424 64675 63420 63180 63769 64573 64948 64622 63946 63588 63880 64595 65401 66242 67163 68008 68604
66327 68604 69051 69561 70053 70135 69562 68576 67788 67723 68378 69160 69407 69070 68694 68666 68770 68698 68667 69044 69539 69372 68294
66306 68294 66922 65867 65058 64244 63634 63523 63580 63181 62416 62111 62705 63565 63746 63039 62032 61314 60977 60770
66288 60770 60444 59969 59570 59551 59969 60550 60975 61163 61214 61262 61509 62189 63234 64121 64365 64064 63662 63302 62778 62127
66268 62127 61774 61906 62111 61922 61442 61137 61192 61413 61658 62028 62672 63604 64677 65570 65907 65636 65139 64719 64086
66249 64086 62776 61031 59812 59761 60531 61334 61823 62179 62640 63279 64042 64728 65046 64979 64938 65233 65532 65254 64405
66230 64405 63613 63331 63420 63606 63855 64074 63852 62884 61469 60278 59729 59781 60156 60488 60397 59794 59135 59054 59685 60520
66210 60520 61023 61249 61701 62624 63561 63734 62981 62144 62220 63153 63865 63633 63005 62939 63413 63469 62511 60977 59700
66191 59700 59149 59441 60509 61916 62886 62924 62245 61352 60428 59434 58626 58551 59481 61072 62610 63533 63781 63764 63944
66172 63944 64364 64670 64601 64305 64106 64137 64355 64707 65127 65513 65841 66230 66790 67512 68339 69122 69509 69238 68602 68208
66152 68208 68102 67635 66566 65731 66016 67017 67445 66722 65440 64306 63420 62773 62669 63251 64088 64697 65157 65872
66134 65872 66953 68160 69263 70142 70660 70706 70298 69539 68543 67466 66440 65435 64396 63552 63299 63679 64287
66117 64287 64805 65306 65894 66339 66329 65816 64932 63878 63105 63200 64221 65405 65882 65477 64559 63410 62159 61070
66099 61070 60423 60208 60250 60477 60755 60806 60714 61128 62339 63471 63425 62474 62017 62738 63939 64955 66146 67935
66081 67935 69728 70592 70474 69963 69208 67933 66300 64998 64483 64719 65581 66890 68089 68553 68358 68183 68362
66064 68362 68590 68645 68783 69143 69393 69320 69285 69622 70018 70026 69891 70265 71232 72153 72480 72273 71861 71377 70746 69897 68898
66043 68898 68094 68066 69160 71001 72713 73712 74072 74165 74231 74379 74741 75401 76293 77270 78160 78776 79043 79153 79383
66024 79383 79747 79996 79976 79706 79161 78363 77721 77800 78502 78916 78322 76997 75727 74882 74463 74665 75715 77272
66006 77272 78680 79820 81083 82371 82828 81918 80229 78740 77723 76861 76146 76002 76538 77266 77702 77861 77994
65989 77994 78141 78190 78195 78393 78981 79931 80983 81746 82019 82115 82698 84109 85981 87683 89045 90309 91492 92213
65971 92213 92303 92239 92648 93609 94705 95593 96229 96676 97037 97505 98082 98342 97908 97210 97280 98575 100416 101817 102516
65952 102516 102942 103567 104689 106535 109101 111938 114476 116453 117824 118527 118686 118867 119665 121156 123111 125517
65936 125517 128421 131422 133953 136022 138072 140039 141165 140948 139735 138205 136715 135409 134451 133791 133016
65921 133016 131737 129873 127439 124470 121391 119015 117843 117667 118031 118629 118947 118186 116143 113792 112308
65906 112308 111724 111153 110153 109192 108799 108977 109565 110617 112141 113843 115400 116733 117847 118574 118633 117895 116605
65889 116605 115429 115163 116134 117977 120140 122450 124858 126913 128065 128469 128902 129741 130605 131246 132249 134263
65873 134263 136868 138892 139931 141020 143494 147417 151503 154533 156522 158410 160882 163826 166800 169578
65859 169578 172104 174293 176160 177937 179835 181815 183737 185481 186723 186957 186121 184970 184354 184292 184152 183581
65843 183581 182739 181774 180740 180030 180164 180901 181169 180203 178273 176024 173610 170902 168038 165204 162211 158848
65827 158848 155486 152746 150634 148548 146082 143358 140482 137208 133412 129496 125972 122862 119851 117014
65813 117014 115052 114653 115698 117306 118633 119481 120025 120174 119560 118177 116627 115466 114567 113455 112130 111163
65797 111163 110974 111340 111760 112046 112364 112822 113254 113404 113261 113098 113193 113488 113678 113719 114151 115638 118154 120799
65779 120799 122593 123335 123570 123850 124270 124714 125311 126404 128147 130295 132499 134705 137172 140047 143012 145505
65763 145505 147301 148836 150810 153493 156468 159015 160634 161195 160814 159759 158407 157072 155834 154584 153244
65748 153244 151808 150250 148524 146635 144607 142434 140237 138385 137213 136605 136137 135609 135167 134869 134529 134124
65732 134124 133974 134298 134896 135574 136550 138131 140274 142796 145745 149130 152528 155510 158280 161329 164557
65717 164557 167321 169416 171325 173275 174620 174527 172910 170354 167362 164040 160363 156435 152484 148737 145315
65702 145315 142324 140102 139174 139598 140531 140979 141004 141661 143603 146380 149341 152544 156245 160084 163558 166995
65686 166995 171221 176240 180938 184323 186580 188587 190706 192277 192211 189970 186107 181857 178072 174574 170672
65671 170672 166157 161484 157037 152680 148171 143595 139084 134395 129229 123895 119202 115533 112387 109111
65657 109111 105853 103370 101977 101162 100357 99625 99241 98986 98363 97365 96422 95644 94684 93559 93055 93915 95959
65640 95959 98322 100331 101801 102672 102848 102496 102174 102465 103483 104789 105891 106837 108122 109906 111585 112522
65624 112522 113010 113985 115879 118418 121549 125702 130815 135949 140490 145033 150351 156062 161259 166068 171539
65609 171539 178141 185310 192474 199541 206178 211624 215703 219288 223214 227259 230631 232945 234177 234129 232680
65594 232680 230479 228774 228426 229336 230815 232255 233407 234240 234653 234398 233362 231838 230207 228335 225575
65579 225575 221515 216419 210772 204725 198179 191106 183460 175061 166021 157193 149733 144106 139772 135846
65565 135846 131911 128152 124951 122477 120522 118654 116551 114238 112064 110455 109622 109302 108762 107329 105079
65550 105079 102893 101613 101251 101175 100882 100343 99691 98988 98408 98365 99121 100288 101003 100738 99928 99604 100345 101700
65532 101700 102803 103411 104092 105438 107397 109520 111563 113628 115848 118194 120565 122915 125318 127990 131186
65517 131186 134985 139294 144100 149526 155506 161636 167593 173461 179323 184684 188760 191353 193004 194159
65503 194159 194531 193541 191134 187862 184273 180466 176135 170920 164780 158232 152111 146922 142476 138305 134321
65488 134321 130846 128067 125792 123788 122032 120515 119028 117394 115770 114502 113763 113472 113489 113717 114117 114701
65472 114701 115427 115964 115743 114525 112783 111242 110113 109089 107954 106732 105264 103253 100945 99223 98589
65457 98589 98483 98053 97271 96693 96366 95688 94383 92955 91968 91391 91002 91023 91894 93600 95632 97603 99548
65440 99548 101542 103314 104487 105088 105550 106110 106483 106394 106250 106821 108200 109632 110637 111804 113928 116737
65424 116737 119177 120764 121901 122829 123136 122629 121949 121721 121556 120552 118571 116394 114665 113190 111380 109039
65408 109039 106582 104716 103963 104332 105305 106191 106502 106081 105028 103625 102143 100606 98880 97102 95817 95474
65392 95474 95949 96760 97578 98277 98725 98929 99289 100299 101889 103406 104308 104657 104830 105061 105448 106142 107244 108512
65374 108512 109416 109579 109200 109027 109796 111603 113785 115533 116520 116861 116640 115810 114562 113387 112579 111932 111175
65357 111175 110496 110350 110851 111656 112390 112841 112771 111980 110780 110038 110376 111493 112622 113490 114376 115310 115818 115722
65339 115722 115687 116531 118201 119877 120969 121638 122372 123409 124641 125741 126288 126047 125324 124871 125249 126280 127175
65322 127175 127267 126662 126181 126522 127394 127791 127233 126469 126619 127980 130089 132603 135412 138034 139792 140795 141972
65305 141972 143827 145849 147580 149627 152962 157641 162851 167941 172844 177668 182514 187559 192758 197454
65291 197454 200823 202773 204002 205078 205830 205761 204747 203166 201472 199704 197410 194202 190392 186736 183435
65276 183435 179799 175285 170372 165882 161782 157458 152989 149301 146990 145682 144715 143744 142448 140378 137550
65261 137550 134687 132436 130678 128989 127379 126122 125196 124354 123590 123038 122582 121949 121155 120451 119875 119202 118374
65244 118374 117656 117313 117359 117693 118192 118626 118762 118746 119132 120273 121787 122921 123421 123739 124286 124896 125308 125815
65226 125815 126833 127955 128122 126948 125246 123901 122848 121726 120974 121388 122783 123992 124263 123973 123777 123724
65210 123724 123464 122764 121569 120053 118811 118497 118946 119149 118416 117114 115934 114900 113559 111731 109584 107323
65194 107323 105311 104198 104353 105262 106009 106254 106345 106572 106789 106771 106512 106118 105677 105290 105035 104955 105200 106012 107324
65175 107324 108559 109121 108951 108395 107718 107063 106673 106728 107065 107429 107859 108519 109258 109743 109880 109706 109030 107683
65157 107683 106097 105141 105276 106184 107224 107910 108076 107985 108221 108988 109570 109080 107688 106509 106159 106136 105845 105508
65139 105508 105631 106149 106627 106954 107317 107760 108284 109153 110641 112514 114193 115388 116282 117121 117891 118433 118720
65122 118720 119044 119981 121963 124768 127596 129878 131846 134086 136731 139301 141246 142427 143148 143882 144865
65107 144865 145896 146695 147489 148950 151424 154621 158248 162462 167313 172213 176584 180770 185672 191588 198115
65092 198115 205136 213122 222260 231932 241493 251076 261250 272283 284175 297126 311354 326527 341755
65079 341755 356207 369533 381765 393146 404031 414551 424201 432079 437735 441590 444241 445516 444656
65066 444656 441475 436862 431728 425739 417639 406905 394485 381644 368543 354564 339754 325202
65054 325202 311793 299226 286680 274109 262288 251690 241854 232024 222081 212599 204201 197079 191035
65041 191035 185672 180559 175477 170625 166396 162909 159964 157568 156110 155648 155315 154015 151775 149840 149279
65026 149279 149901 150745 151132 150818 149617 147512 144976 142632 140645 138851 137368 136536 136291 136145 135894 135825 136043
65009 136043 136040 135253 133707 131895 130288 129195 128812 129164 130105 131476 133066 134414 135059 135155 135420 136207 137016
64992 137016 137180 136715 136077 135471 134864 134464 134611 135201 135632 135378 134348 132789 131098 129628 128302 126563 124095
64975 124095 121498 119738 118953 118316 117173 115839 114969 114585 114098 113063 111603 110170 109140 108643 108594 108879
64959 108879 109470 110350 111370 112363 113394 114678 116177 117408 117769 117029 115550 114107 113449 113834 114955 116415
64943 116415 118145 120267 122701 125208 127664 129951 131677 132497 132757 133366 134803 136631 138139 139142 139920
64928 139920 140697 141503 142326 143081 143546 143547 143151 142567 141993 141644 141665 141882 141906 141604 141206 140811 140182 139244 138352 137617
64908 137617 136411 134094 131025 128213 126069 124145 122157 120582 119987 120222 120663 120913 120928 120692 120145 119378
64892 119378 118588 117841 117016 116029 114953 113903 112967 112270 111999 112183 112476 112375 111814 111406 111876 113257 114868
64875 114868 116055 116697 116949 116886 116598 116341 116298 116322 116188 115945 115845 116097 116824 118001 119185 119639 119100 118231 117960
64856 117960 118576 119740 121061 122157 122565 122294 122262 123377 125261 126705 127443 128507 130574 132923 134637 135995
64840 135995 137910 140542 143363 146267 149664 153504 157021 159647 161632 163508 165358 166900 167982 168761
64826 168761 169439 170014 170265 169989 169208 168033 166364 164004 161201 158730 157118 156018 154719 153116 151764
64811 151764 151103 151105 151609 152500 153427 153829 153483 152719 151861 150785 149329 147804 146657 145690 144087 141393 138220
64794 138220 135709 134389 133746 132912 131512 129739 127866 126073 124706 124272 124891 126035 127084 127980 129004
64779 129004 130035 130452 129856 128653 127712 127628 128409 129698 131095 132302 133102 133382 133192 132796 132581 132826 133571
64762 133571 134721 136223 138097 140371 143073 146211 149651 153004 155758 157638 158939 160497 163132 166872
64748 166872 170785 173838 175874 177428 178695 179185 178600 177419 176160 174521 171891 168489 165336 163109 161586
64733 161586 160242 158824 157194 155152 152786 150705 149612 149737 150760 152118 153314 154158 154781 155255 155307 154724
64717 154724 153998 154096 155467 157676 160117 162641 165310 168040 170845 174027 177729 181552 184996 188000 190655
64702 190655 192699 193818 194355 195223 196987 199311 201339 202429 202546 202174 201821 201491 200701 199141 197109 195116
64686 195116 193314 191578 189920 188383 186677 184380 181541 178677 176132 173772 171350 168840 166301 163776
64672 163776 161422 159528 158272 157635 157580 158070 158869 159609 160136 160612 161256 162215 163626 165439 167138 168060 168144
64655 168144 167997 168035 168010 167634 167222 167235 167466 167177 165977 164155 162213 160467 159131 158340 157918 157308 155910 153521
64637 153521 150582 148073 146946 147315 148276 148837 148922 149158 149770 150248 150204 150035 150443 151617 153237 155024 156957
64620 156957 159124 161728 165110 169401 174145 178596 182438 185950 189422 192695 195371 197253 198424 199049
64606 199049 199220 198919 198044 196560 194666 192691 190789 188870 186878 184976 183332 181859 180334 178735 177389
64591 177389 176821 177452 179250 181587 183656 185157 186490 188158 190236 192628 195586 199563 204607 210229 215914
64576 215914 221489 226920 232084 236787 240808 243889 245918 247172 248116 248918 249432 249643 249707 249443 248311 246211
64560 246211 243834 241814 239847 237234 234034 231078 228907 227323 226059 225217 224759 224077 222548 220266 217853
64545 217853 215671 213542 211150 208450 205631 202899 200295 197632 194653 191338 188010 185062 182636 180635
64531 180635 178895 177206 175340 173301 171518 170524 170423 170886 171688 172928 174554 175996 176665 176736 177015 177916
64515 177916 178938 179365 179197 178994 178989 178780 177956 176597 175055 173538 172079 170642 169079 167268 165448 164147
64499 164147 163479 162847 161616 159789 157693 155403 153042 151269 150696 150922 150902 150337 149977 150418 151412 152594 154026
64482 154026 155484 156061 155264 154015 153697 154532 155636 156398 156885 157027 156422 155213 154361 154578 155502 156305 156734
64465 156734 157200 158159 159746 161808 163985 165853 167144 167759 167589 166659 165523 165160 166194 168355 170860 173132
64449 173132 175058 176892 179155 182394 186723 191618 196335 200405 203723 206401 208744 211119 213577 215687
64435 215687 216933 217185 216706 215833 214771 213475 211666 209143 206178 203324 200753 198213 195747 193932 192961
64420 192961 192068 190463 188541 187417 187404 187710 187622 187213 186669 185712 184196 182758 182311 183099 184624 186300 187801
64403 187801 188958 189782 190556 191627 193082 194804 196770 199020 201388 203609 205749 208263 211482 215186 218881
64388 218881 222390 225950 229721 233416 236676 239766 243600 248862 255284 262062 268893 276234 284537 293697
64374 293697 303470 314036 325748 338543 352085 366475 382364 400309 420388 442608 467303 494790
64362 494790 524874 557146 591779 629662 671489 716858 764347 812269 859166 903753 944906
64351 944906 981958 1014843 1043602 1067727 1086143 1097828 1102349 1099865 1090899 1076214 1056599 1032462
64339 1032462 1003615 969684 930793 887852 842247 795366 748355 702094 657283 614601 574800
64328 574800 538578 506238 477461 451527 427855 406416 387562 371365 357200 344125 331695
64317 331695 320207 310076 301149 292810 284575 276365 268333 260798 254262 249110 245086 241396 237470 233379
64303 233379 229371 225428 221688 218941 217961 218288 218321 216980 214888 213549 213679 214811 216297 218087 220385
64288 220385 223028 225520 227426 228477 228548 227852 227073 226918 227469 228156 228439 228334 228155 227938 227365 226254 224917
64271 224917 223899 223515 223764 224584 225920 227562 229215 230921 233103 235885 238548 240069 240248 239830 239369 238395
64255 238395 236022 232136 227580 223282 219615 216587 214181 212273 210410 207993 204756 201083 197837 195806
64241 195806 195119 195115 194866 193884 192355 190776 189559 188968 189195 190270 191900 193560 194853 195835 196999 198867
64225 198867 201593 204935 208593 212439 216391 220218 223620 226461 228862 231084 233354 235724 238039 240140
64211 240140 242076 243922 245357 245757 244931 243502 242231 241204 240090 239027 238653 239186 239998 240323 239986 239140
64195 239140 237639 235154 231839 228515 225987 224265 222520 219878 216283 212631 209975 208635 208030 207242 205615
64180 205615 203055 200066 197451 195703 194693 194126 194134 195060 196765 198639 200305 201880 203439 204734 205601 206179
64164 206179 206508 206388 205932 205756 206181 206687 206639 206218 206034 206089 205806 205065 204532 204779 205577 206265 206509 206396 206029
64145 206029 205310 204162 202806 201737 201333 201489 201748 201854 202040 202713 204065 206098 208827 212203 216062 220328
64129 220328 225145 230586 236435 242426 248425 254020 258257 260322 260417 259488 258063 255769 252098 247248 241977
64114 241977 236864 231944 227006 222168 218065 215341 213874 212734 211052 208735 206168 203589 201160 199329
64100 199329 198543 198648 199068 199581 200452 201824 203413 204867 205953 206365 205880 204895 204359 204906 206341 208097 209775
64083 209775 211008 211253 210240 208502 207153 207015 208003 209264 209868 209492 208471 207211 205778 204271 203259
64068 203259 203352 204457 205999 207814 210234 213255 216319 219179 222333 226255 230690 235170 239713 244561 249557
64053 249557 254311 258744 263050 267285 271412 275523 279634 283465 286843 290170 293980 298109 301805 304702
64039 304702 307289 310310 314059 318362 322921 327384 331254 334000 335356 335415 334407 332435 329530 325917 321992
64024 321992 317916 313431 308329 302938 297854 293355 289421 286110 283411 280805 277642 274025 270721 268046
64010 268046 265530 262895 260643 259268 258554 258196 258508 259851 261819 263640 265113 266538 268017 269402 270722
63995 270722 272181 273953 276410 280078 284818 289569 293622 297663 302679 308338 313593 318636 324895 332988
63981 332988 341899 350450 358402 365682 371765 376583 381081 385888 390068 392128 391881 390447 388716 386661
63967 386661 384060 381145 378387 376117 374441 373219 372106 370823 369269 367212 364187 360023 355204 350383
63953 350383 345847 341884 339244 338494 339026 339400 338771 337493 336275 335351 334677 334412 334829 336066 338188 341245
63937 341245 345003 348906 352617 356405 360756 365842 371626 378263 385889 394060 401900 409061 416247 424537
63923 424537 434352 445329 457089 469782 483849 499540 516859 535767 556174 577802 600275 623468
63911 623468 647679 673401 700941 730204 760847 792649 825847 861021 898587 938478 980528
63900 980528 1025120 1073338 1126481 1185565 1251257 1324057 1404474 1493185 1591090 1699179 1818316
63889 1818316 1949235 2092606 2248792 2417465 2597632 2788032 2987281 3193623 3404880
63880 3404880 3618810 3833111 4044656 4248881 4440371 4614192 4766612 4894794 4996365
63871 4996365 5069511 5113196 5126907 5110178 5062581 4984344 4877005 4743522 4587753 4413789
63861 4413789 4225583 4026950 3821635 3613123 3404339 3197646 2995282 2799813 2613992
63852 2613992 2440013 2278840 2130280 1993640 1868246 1753515 1648902 1553929 1468082 1390530
63842 1390530 1320132 1255899 1197320 1144053 1095495 1050934 1009985 972505 938084 905951 875457
63831 875457 846315 818315 791169 764900 740120 717601 697620 679857 663798 649066 635524
63820 635524 623347 612973 604735 598517 593924 590788 589256 589312 590458 592118 594285 597556 602470 608920
63806 608920 616191 623428 630039 635824 640931 645610 649901 653603 656603 659078 661166 662578 662764 661393
63792 661393 658387 653631 647088 639130 630182 619951 607642 593241 578011 563245 548986 534485
63780 534485 519453 504208 488889 473290 457428 441615 426028 410733 396077 382357 369224
63769 369224 356151 343585 332805 324339 317198 310044 302542 295192 288441 282475 277447 273292 269468
63756 269468 265255 260212 254265 247786 241796 237591 235620 234977 234358 233270 231961 230589 229007 227174 225275
63741 225275 223445 221705 220068 218462 216710 214832 213123 211710 210327 208845 207626 206846 205802 203559
63727 203559 200195 196830 194445 193117 192367 191719 190815 189477 187871 186341 185007 183764 182619 181750 181236
63712 181236 181030 181165 181692 182441 183165 183870 184647 185225 185123 184287 183254 182595 182512 182962 183799 184719 185361 185610 185623
63693 185623 185622 185850 186563 187674 188533 188604 188292 188572 189761 191268 192646 194233 196393 198732 200512 201526 202157
63676 202157 202876 204018 205697 207620 209248 210521 212053 214239 216484 217912 218635 219709 221855 224776 227796
63661 227796 230596 233132 235268 236889 238150 239281 240267 240910 241152 241134 240980 240695 240276 239799 239380 239174 239416
63644 239416 240327 241872 243619 244973 245567 245391 244639 243601 242765 242737 243795 245571 247433 249163 251079 253479
63628 253479 256247 259053 261682 263939 265491 266077 265817 265063 263983 262581 261160 260411 260805 262018 263223
63613 263223 263929 264313 264733 265209 265552 265801 266227 266943 267718 268167 268017 267195 265903 264542 263335 262022 260192
63596 260192 257908 255713 253952 252472 251043 249657 248250 246651 245134 244501 245145 246406 247443 248369 249887
63581 249887 252080 254375 256660 259574 263538 268239 273327 278918 285059 291308 297300 303253 309508 316038
63567 316038 322877 330564 339520 349267 358928 368437 378704 390575 404088 418796 434412 450972 468675
63554 468675 487664 507809 528618 549521 570258 590865 611298 631172 649794 666310 679880
63543 679880 689948 696381 699420 699648 698044 695703 693128 689876 685206 678957 671602 663535 654668 644678
63529 644678 633293 620337 605889 590596 575503 561312 547909 534809 522040 510360 500566 492714
63517 492714 486160 480428 475829 473010 471945 471784 471897 472665 474887 478682 483489 489034 495680 503626 512281
63502 512281 520794 528971 537332 546468 556635 567914 580411 594216 609284 625496 642823 661402
63490 661402 681386 702659 724773 747250 769713 791338 810230 823949 831161 832632 830350 825818
63478 825818 819521 811673 802828 793633 784479 775617 767164 758700 749149 737463 723335 706999 688594
63465 688594 668187 646365 624328 603166 583175 563920 544834 525793 507418 490795 476604
63454 476604 464409 453052 441830 431010 421135 412274 404290 397460 392281 388662 385720 382463 378520
63441 378520 374247 370346 367377 365369 363816 362192 360435 358817 357455 356197 354913 353629 352327 350859
63427 350859 349155 347368 345772 344624 344112 344274 344966 346015 347332 348810 350247 351498 352503 352992 352562
63412 352562 351404 350573 350853 351490 350842 348297 344881 341831 339344 337038 334852 332942 331235 329781 329131
63397 329131 329785 331507 333739 336469 340114 344779 350125 355853 361795 367711 373569 379991 387824 397213
63383 397213 407544 418268 429293 440667 452468 465104 479141 494644 511106 528095 545382
63372 545382 562347 577967 591883 604975 618447 632666 647339 662485 678687 696529 716252
63361 716252 737867 761134 785358 809574 833103 855766 877454 897531 914685 927440 935072 938125
63349 938125 937825 934933 929458 921607 912442 903112 893672 883234 871102 857193 841442 823623 804025
63336 804025 783691 763463 743165 722235 700928 680362 661381 643805 626948 610629 595530
63325 595530 582733 572914 565778 560179 555010 550203 546860 546294 548875 553818 559963 566695 574132 582602
63311 582602 592107 602375 613279 624988 637662 651203 665505 680854 697820 716711 737252 758919
63299 758919 781380 804454 827688 850198 871088 889933 906632 920709 931040 936589 937400 934545
63287 934545 929092 921519 912296 902414 892719 882996 872344 860347 847129 832266 814627 793777 770872
63274 770872 747580 724570 701681 679093 657487 637208 618148 600540 585122 572247 561363
63263 561363 551682 542934 535149 528051 521025 513544 505383 496547 487136 477238 466896 456287 445876
63250 445876 436186 427437 419601 412730 406895 401887 397380 393419 390271 387751 385186 382234 379261 376639
63236 376639 374127 371255 367982 364629 361447 358546 355918 353257 350121 346665 343815 342204 341219 339632
63222 339632 337004 333889 330794 327573 324032 320637 318324 317728 318671 320206 321171 320933 319698 318116 316682
63207 316682 315658 315281 315688 316743 318203 320066 322461 325271 328133 330813 333383 336009 338762 341653 344748
63192 344748 348321 352895 358865 365851 372769 378886 384657 391184 399048 408066 418003 428981 441124 454283
63178 454283 468278 483148 498998 515734 532987 550308 567621 585510 604669 624784 644395
63167 644395 662355 679083 695820 712974 729927 746224 762114 777829 793227 808309 823386
63156 823386 838383 852549 865105 875623 883626 888539 890443 890163 888114 883502 875226 863176 848220
63143 848220 831392 813633 795888 778752 762230 746378 731943 719666 709106 698936 688625
63132 688625 679254 672333 668156 665649 663620 661849 660961 661518 663503 666644 670875 676174 682195 688513 695187
63117 695187 702569 710499 718326 725900 733877 742549 750954 757750 762617 766197 768945 770725 771308 770520 767906
63102 767906 762967 755826 747071 736785 724358 709479 692847 675612 658545 642018 626373 611853
63090 611853 598308 585336 572658 560265 548384 537460 527983 520043 513146 506626 500251 494358 489543
63077 489543 486225 484325 483193 482047 480715 479842 480149 481579 483407 485175 487175 489917 493370 497065 500784
63062 500784 504781 509167 513468 517145 520407 524021 528249 532379 535544 537646 539221 540734 542398 544377
63048 544377 546622 548593 549712 550190 550897 552305 553963 555219 556011 556646 557206 557662 558328 559699 561815 564170
63032 564170 566329 568384 570690 573335 575960 578058 579404 580317 581457 583318 585945 589172 592954 597305
63018 597305 602079 607111 612554 618742 625723 633220 641097 649581 658809 668522 678432 688715 699874 712330
63004 712330 726478 742884 761915 783198 805919 829786 855269 882730 911811 941988 973393
62993 973393 1006659 1042176 1079904 1119674 1161115 1203301 1245080 1286009 1326596 1367456 1408577
62982 1408577 1449592 1490354 1530769 1570322 1608326 1644683 1679948 1714367 1747135 1776939 1803093
62971 1803093 1825800 1845172 1860300 1869600 1872006 1867463 1856231 1838125 1812829 1780790 1743375 1702104
62959 1702104 1658087 1612288 1565975 1520547 1476990 1435689 1396736 1360307 1326767 1296607 1270331
62948 1270331 1248272 1230435 1216430 1205688 1197863 1193088 1191732 1193822 1198822 1206041 1215046 1225508 1236825
62935 1236825 1248239 1259308 1270085 1280845 1291836 1303119 1314374 1324894 1334077 1341808 1347951 1351638
62923 1351638 1351679 1347766 1340644 1330799 1317588 1300128 1278642 1254321 1228074 1199969 1169868 1138070
62911 1138070 1105190 1071707 1037907 1004227 971464 940484 911601 884354 858163 833126 809826
62900 809826 788395 768249 748884 730392 712915 696121 679719 664101 649874 636959 624671
62889 624671 612544 600585 588787 576935 564934 553003 541489 530754 521128 512637 504863 497335
62877 497335 490019 483156 476841 471117 466225 462317 459065 456044 453324 451158 449289 447254 445251 443932
62863 443932 443259 442324 440576 438506 436805 435454 434036 432371 430433 428141 425728 423828 422652 421404 419119
62848 419119 415864 412606 410043 408079 406357 404765 403377 402366 402084 402846 404411 405963 406846 407237 407865
62833 407865 409035 410059 409897 408389 406600 405710 405754 405850 405472 404894 404345 403512 402312 401516 401897 403018 403529
62816 403529 402583 400464 397890 395293 392839 390660 388801 387210 385893 384870 383984 383024 382064 381377 380997 380673
62800 380673 380302 380048 379974 379951 380089 380839 382375 384166 385485 386132 386317 386062 385183 383816 382550 381934 382074 382745
62782 382745 383564 384005 383615 382536 381590 381582 382556 383932 385249 386495 387804 389152 390439 391613 392596 393285 393702
62765 393702 393984 394194 394377 394908 396450 399350 403302 407808 412725 418031 423384 428410 433334 438845 445285
62750 445285 452369 459746 467397 475355 483434 491475 499570 507939 516840 526685 537865 550257 563295
62737 563295 576738 591024 606575 623163 640421 658701 678941 701788 727229 754973 784809
62726 784809 816645 850590 887051 926559 969503 1016179 1066811 1121162 1178257 1236903 1296365
62715 1296365 1356183 1415506 1473140 1528134 1579664 1626280 1666009 1697508 1720567 1735169 1740648
62704 1740648 1736344 1722589 1700383 1670327 1632640 1588165 1538633 1485668 1430073 1372415 1313863
62693 1313863 1255911 1199452 1144595 1091420 1040492 992448 947416 905192 865803 829511 796186
62682 796186 765096 735637 708080 683230 661427 642163 624729 608852 594549 581658 569839
62671 569839 558904 548950 540183 532811 527009 522764 519758 517540 515873 514787 514401 514852 516351 519048
62657 519048 522744 526985 531640 537264 544681 554163 565150 576776 588651 601193 615354 631999 651371
62644 651371 672978 696074 720366 746294 774556 805358 838156 872145 906900 942526 979200
62633 979200 1016549 1053399 1088123 1119360 1146501 1169448 1187966 1201441 1209271 1211232 1207270 1197225
62621 1197225 1181136 1159694 1133930 1104432 1071322 1035163 997456 959863 923195 887452 852601
62610 852601 818876 786440 755226 725208 696513 669304 643802 620414 599453 580660 563344
62599 563344 547074 531886 517789 504547 492172 481152 471771 463454 455197 446500 437608 429084 421508
62586 421508 415336 410538 406423 402285 398157 394543 391549 388897 386745 385702 385690 385443 383753 380891 378230
62571 378230 376651 375891 375388 375151 375506 376391 377323 378023 378741 379855 381336 382845 384333 386209 388728 391520
62555 391520 394151 397057 401327 407447 414693 422032 429222 436752 445085 454385 464714 476059 488282
62542 488282 501507 516373 533457 552488 572610 593407 615234 638566 663501 690029 718161
62531 718161 747423 776559 804166 829530 852606 873297 891012 904813 913860 917799 916910 911788
62519 911788 902724 889524 872107 851150 827945 803605 778619 753126 727388 701855 676930 652866
62507 652866 629881 608282 588358 570130 553254 537260 521948 507594 494729 483633 473976 465039
62495 465039 456382 448345 441768 437107 433926 431336 428855 426687 425174 424166 423050 421396 419405 417654
62481 417654 416501 415969 416201 417558 419919 422218 423307 423297 423472 424802 427117 429932 433371 437820 443252
62466 443252 449501 456779 465318 474909 485430 497440 511394 526584 541831 557178 573910 592803
62454 592803 613384 635146 658396 683339 709201 734957 760275 785053 808636 830288 849998
62443 849998 867990 883739 896328 905687 912757 918438 923032 926727 929944 933039 936156 939581 943884
62430 943884 949604 957187 967273 980552 997065 1016035 1036693 1059056 1083601 1110310 1138251 1165968
62418 1165968 1192016 1215074 1233888 1247436 1255260 1257495 1254347 1245654 1231148 1211118 1186506 1158232
62406 1158232 1126662 1091865 1054136 1014194 973164 932466 893317 856026 820092 785316 752555
62395 752555 723025 697106 674243 653799 635523 619355 605243 593161 582941 574166 566602 560578
62383 560578 556486 553975 552120 550387 549005 548438 548916 550432 552565 554208 554116 552044 548923 545697 542355
62368 542355 538266 533002 526598 519459 512365 506153 500976 496119 490879 485391 480244 475603 471126 466568
62354 466568 462042 457776 453959 450681 447717 444494 440694 436807 433701 431702 430426 429394 428381 427240
62340 427240 425968 425084 425450 427410 430398 433563 436468 439016 441210 443362 446185 450182 455058 460176 465406
62325 465406 471050 477064 482991 488811 495274 503060 511970 521333 530933 541118 552095 563487 574737
62312 574737 585816 597544 611115 627106 644873 663225 681795 701491 723438 747894 774444
62301 774444 802769 832774 864386 897811 933676 972115 1011871 1051024 1088560 1124435 1158185
62290 1158185 1188485 1214296 1235397 1251312 1260726 1262849 1258705 1250185 1238226 1222715 1203706 1181788
62278 1181788 1157406 1130758 1102435 1073393 1044230 1015123 986558 959414 934130 910366 887719
62267 887719 866318 846479 828193 811229 795336 780045 764554 748124 730607 712501 694582
62256 694582 677460 661355 646293 632488 620246 609389 599178 589229 580088 572379 565812 559769
62244 559769 554540 551019 549233 548251 547679 548190 550121 552602 554734 556840 559745 563505 567724 572570 578410
62229 578410 584659 590056 594188 597911 602138 606907 611854 616877 621909 626590 630695 634678 639352 645087
62215 645087 651598 658420 665337 672417 679930 688377 698395 710372 724107 739029 754908 772294 792110
62202 792110 814863 840374 868221 898108 929758 962844 997309 1033450 1071295 1109940 1147837
62191 1147837 1183660 1216567 1245677 1269863 1288374 1301327 1309218 1311993 1308981 1299710 1284526 1264348
62179 1264348 1240114 1212592 1182475 1150322 1116533 1081595 1046254 1011137 976330 941743 907943
62168 907943 876241 847766 822738 800683 780958 762883 745902 730087 716158 704525 694574 685258
62156 685258 676141 667403 659173 651501 644748 639204 634360 629342 624218 620116 617777 616641 615717 614801 614401
62141 614401 614892 616264 618454 621505 625525 630729 637273 644834 652560 659726 666281 672673 679406 686916
62127 686916 695468 704873 714530 723980 733254 742593 752184 762290 773131 784347 795085 805057 815163
62114 815163 826585 839566 853534 868114 883418 899594 916805 935670 957065 981196 1007194
62103 1007194 1033847 1060417 1086584 1111732 1134534 1153322 1166956 1175432 1179641 1180519 1178462 1173412
62091 1173412 1165150 1153423 1138169 1119859 1099421 1077555 1054365 1029846 1004512 979317 955130
62080 955130 932501 911658 892501 874830 858816 844947 833218 822721 812414 802080 792187 783103
62068 783103 774911 767730 761637 756377 751585 747248 743538 740338 737517 735604 735532 737431 740072 741761 741539
62053 741539 739435 735924 731496 726669 722129 718605 716400 714959 713041 709514 704034 697056 689431 682007
62039 682007 675234 668958 662880 657401 653593 652000 651917 652313 653112 655006 658282 662436 666856 671328 675925
62024 675925 680865 686436 692632 698999 705336 712368 721148 731824 743601 755885 768852 782888 798090
62011 798090 814421 831701 849320 866611 883761 901804 921355 941831 962184 981905 1000906
62000 1000906 1018827 1034939 1048500 1058869 1065445 1067844 1066043 1060200 1050529 1037462 1021657 1003526
61988 1003526 982907 959426 933162 904858 875676 846772 818935 792415 767081 742711 719064
61977 719064 695948 673573 652720 634112 617554 602143 587361 573532 561042 549565 538415
61966 538415 527426 517158 508323 501126 495030 489093 482645 475704 468665 461790 455212 449167 443762 438628
61952 438628 433333 428151 423879 420880 418819 417349 416448 415957 415507 415136 415429 416722 418682 420868 423114
61937 423114 425014 425732 424845 422943 420935 419271 418150 417798 417770 416558 412831 406964 400600 394846 389574
61922 389574 384395 379460 375075 371099 367082 362799 358500 354764 352037 350146 348416 346498 344825 343927
61908 343927 343543 342916 341814 340720 340041 339699 339573 339859 340780 342266 344115 346233 348601 351179 353962 357038
61892 357038 360570 364822 370015 375964 382033 387778 393534 400047 407600 415872 424559 433748 443620 454210
61878 454210 465576 477807 490694 503597 515848 527153 537603 547510 557190 566615 575194 582228
61866 582228 587697 592303 596581 600195 602395 602921 602210 600792 598841 596401 593875 592023 591436 592029 593250
61851 593250 594823 597207 601210 607207 614804 623106 631220 638604 645196 651224 656728 661322 664545 666334
61837 666334 666932 666377 664423 661021 656644 651919 647093 641982 636440 630704 625266 620381 615777 610867 605246
61822 605246 598929 592120 584927 577391 569644 561871 554193 546721 539640 533169 527468 522673 518901 516071
61808 516071 513887 512159 511049 510849 511600 513123 515365 518546 523000 528969 536422 544949 554004 563556 574392
61793 574392 587456 602897 619972 637862 656235 674957 693634 711719 728970 745439 760952
61782 760952 774757 785936 794198 800099 804307 806783 806971 804762 800938 796596 792462 788957 786548 785618
61768 785618 786116 787639 789842 792623 796024 800105 804695 809086 812220 813418 812713 810227 805532 798086 788058
61753 788058 776277 763498 750183 736823 723851 711150 698148 684568 670771 657307 644483
61742 644483 632369 620784 609185 597025 584411 572119 560801 550506 541083 532685 525670 520177
61730 520177 515941 512317 508487 503965 498972 494096 489675 485851 483024 481498 480605 478980 476128 473111
61716 473111 471158 470189 469301 468265 467743 468215 469463 471180 473439 476397 480005 484148 488732 493517 498268
61701 498268 503196 508856 515360 521976 527777 532485 536461 540062 543253 545746 547159 547094 545316 542015 537730
61686 537730 532886 527470 521261 514328 507201 500524 494605 489260 484042 478601 472965 467567 462996 459629
61672 459629 457490 456365 455977 456031 456250 456467 456600 456534 456158 455540 454856 454016 452640 450638 448631 447496 447596
61655 447596 448707 450469 452464 453955 454115 452722 450298 447445 444346 440997 437536 434101 430670 427260
61641 427260 424055 421104 418144 414915 411439 407801 403940 399886 395914 392154 388305 384133 380026 376605
61627 376605 373869 371261 368541 366066 363991 361766 358862 355691 353243 351877 350997 350059 349412 349709 350770
61612 350770 351618 351684 351443 351621 352225 352768 353156 353793 354903 356250 357558 358781 359878 360748 361523 362633 364357
61595 364357 366569 368979 371361 373490 375200 376598 377912 379076 379896 380608 381664 382810 383106 382314 381587
61580 381587 382138 383726 385171 386020 386877 388263 389957 391487 392565 392921 392351 391092 389648 388151 386307
61565 386307 384026 381569 379017 376155 373061 370225 367899 365855 363990 362549 361400 359693 356770 353032
61551 353032 349389 346173 343066 339838 336548 333151 329395 325190 320791 316656 313300 311060 309729 308597
61537 308597 307080 305137 302894 300293 297538 295416 294486 294150 293250 291512 289704 288367 287171 285691 284056
61522 284056 282492 280853 279065 277577 276875 276847 276947 276720 275947 274726 273741 273984 275703 277980 279818 281231
61506 281231 282705 284079 284772 284924 285374 286504 287923 289408 291294 293662 295940 297766 299594 301876 304158
61491 304158 305559 305799 305251 304345 303505 303360 304277 305726 306661 306639 306164 305994 306517 307753 309493 311337 312929
61474 312929 314218 315216 315618 315127 314129 313503 313595 313819 313479 312609 311785 311451 311646 312096 312322 311961 311211 310696 310665
61455 310665 310647 310158 309421 308979 308903 308892 309031 309860 311588 313627 315146 315853 316161 316717 317899 319630 321608 323744
61437 323744 326263 329303 332572 335628 338372 340967 343369 345357 347017 348811 350972 353200 355135 356753
61423 356753 358015 358544 358181 357713 358422 360730 363691 366027 367347 368108 368703 369001 368779 368223 367864 368108 368826
61406 368826 369323 368795 367018 364565 362213 360169 358092 355760 353384 351237 349393 347995 347428 347889 349032
61391 349032 350333 351599 352786 353517 353326 352369 351466 351349 352246 354166 357083 360507 363369 364845 365234 365640
61375 365640 366837 368645 370388 371667 372608 373560 374680 375829 376857 377926 379409 381375 383368 384861 385856
61360 385856 386856 388236 389791 390959 391396 391373 391597 392619 394309 395948 396940 397424 398066 399187 400221 400137
61344 400137 398487 395898 393452 391668 390366 389458 389383 390420 391940 392882 392893 392521 392296 392229 392329 392937 394103
61327 394103 395152 395489 395588 396627 399199 402845 406730 410285 413192 415348 417161 419527 423162 428004 433338
61312 433338 438386 442683 446119 448786 450788 452141 452830 452926 452511 451584 450216 448746 447576 446792 446176 445630
61296 445630 445343 445445 445749 446034 446429 447282 448688 450308 451698 452739 453653 454621 455505 456142 456794 458047 460120
61279 460120 462547 464784 466869 469132 471449 473283 474443 475276 476007 476392 476336 476357 476973 477862 478150 477459 476282
61262 476282 475355 475053 475467 476642 478505 480811 483403 486460 490305 495047 500472 506208 511955 517716 523974
61247 523974 531441 540339 549989 559324 567817 575597 582637 588295 592008 594184 595831 597292 597749 596206
61233 596206 592634 587933 582967 577976 572776 567179 561174 554938 548801 543059 537747 532672 527738 523221
61219 523221 519703 517717 517317 517936 518679 518968 518903 518985 519564 520640 522062 523697 525457 527354 529539 532122
61203 532122 534968 537896 541028 544647 548678 552580 555935 558870 561699 564348 566410 567702 568499 569191 569849
61188 569849 570151 569709 568502 567063 566120 565931 566026 565752 564906 563710 562279 560493 558376 556254 554380 552701
61172 552701 551192 550178 549995 550484 551207 552173 553948 556904 560706 564739 568753 572759 576513 579610 582076
61157 582076 584472 587285 590537 594114 598095 602467 606809 610618 613842 616805 619695 622478 625297 628623
61143 628623 632844 637838 643019 647733 651676 655123 658761 663116 668129 673383 678655 683948 688998 693119
61129 693119 695759 697044 697589 697809 697574 696493 694462 691868 689193 686404 682923 678359 673052 667593 661963
61114 661963 655705 648923 642536 637224 632559 627525 621590 614948 608046 601320 595146 589552 584135 578678
61100 578678 573629 569400 565400 560593 555084 550285 547069 544539 541360 537810 535594 535659 537070 538267 538722
61085 538722 538870 538861 538126 536212 533538 531011 529076 527383 525384 523071 521051 519993 520096 521134 522880 525375
61069 525375 528722 532727 536960 541335 546503 553355 562053 571776 581654 591677 602349 613609 624696
61056 624696 635251 646012 658053 671618 686080 700743 715183 728945 741621 753427 765199
61045 765199 777508 790004 801830 812355 821279 828410 833784 837872 841140 843365 843775 842051 838929
61032 838929 835590 832552 829361 825421 820964 817084 814730 813798 813421 813150 813573 815644 819642 825053 831285
61017 831285 838180 845906 854714 864859 876435 889206 902865 917510 933544 950961 969079 987294
61005 987294 1005898 1025773 1047276 1069698 1091824 1112864 1132847 1152335 1171826 1191283 1210144
60994 1210144 1227877 1244552 1260766 1276957 1292905 1308020 1322009 1335171 1348125 1361464 1375672
60983 1375672 1391097 1407836 1425724 1444631 1464745 1486507 1510374 1536781 1566261 1599310 1636166
60972 1636166 1676992 1722222 1772383 1827455 1886811 1950120 2018034 2091572 2170950 2255411 2344305
60961 2344305 2438205 2539032 2649352 2771436 2906695 3055786 3219255 3398142 3594344 3811095
60951 3811095 4053438 4328106 4642916 5006525 5428066 5915102 6471097 7096497 7794013
60942 7794013 8571939 9441023 10410094 11486486 12673599 13951793 15250277 16444444 17401429
60933 17401429 18047200 18398783 18537535 18557730 18537829 18538136 18591937 18677562 18703890 18543900 18101688
60922 18101688 17359948 16374562 15233862 14022330 12806971 11636763 10542937 9540129
60914 9540129 8631728 7816178 7089490 6445206 5875530 5373307 4932090 4544755 4203295
60905 4203295 3900122 3628913 3384496 3162895 2961535 2778704 2612683 2461650 2323989
60896 2323989 2198108 2082329 1975717 1878644 1791480 1712851 1640146 1571724 1507581 1447800 1391538
60885 1391538 1338035 1287585 1240733 1197106 1155775 1116392 1079323 1044822 1012545 981825 952134
60874 952134 923398 896058 870637 847125 824927 803435 782466 762184 743002 725492 709866
60863 709866 695496 681516 667988 655799 645178 635093 624536 613728 603467 593933 584928 576880
60851 576880 570570 565862 561475 556235 550111 543919 538460 534070 530629 527755 525099 522500 519781 516521
60837 516521 512356 507526 502768 498528 494473 489976 485000 480254 476357 472980 469070 464020 458318 452842
60823 452842 447773 442681 437425 432322 427410 422306 417135 412924 410501 409358 408139 406037 403364 401027
60809 401027 399928 400619 402904 405782 408243 410148 412037 414228 416540 418820 421159 423501 425515 427123
60795 427123 428810 431080 433734 435951 437151 437639 438242 439285 440134 439976 438955 438052 437784 437511 436327 434153
60779 434153 431509 428597 425273 421711 418391 415321 411881 407642 402961 398590 394997 392174 389795 387367
60765 387367 384455 380968 377092 372919 368331 363365 358452 354185 350923 348625 346896 345152 342902 340043
60751 340043 336873 333855 331362 329472 327830 325839 323210 320281 317669 315760 314720 314724 315709 317059 318042
60736 318042 318618 319367 320528 321640 322308 322855 323797 325031 326039 326707 327446 328425 329199 329331 329094 329159 329651 329932
60718 329932 329442 328463 327748 327623 327864 328338 329186 330253 330895 330765 330374 330400 330705 330562 329688 328479 327303 326168
60700 326168 325160 324610 324530 324356 323639 322673 322097 322065 322194 322237 322398 322912 323577 323976 324053 324182 324540 324652 323876 322293
60680 322293 320730 319757 319037 317897 316172 314116 311826 309308 306926 305143 303814 302317 300559 299320 299355
60665 299355 300502 301945 303085 303936 304904 306370 308315 310251 311659 312547 313317 314131 314800 315355 316265 317858
60649 317858 319873 321839 323569 325081 326369 327543 328804 329999 330556 330314 330023 330463 331272 331295 330036 328167
60633 328167 326485 325014 323417 321765 320379 319204 317888 316444 315340 314795 314373 313583 312645 312243 312574 313092
60617 313092 313369 313848 315391 318271 321927 325516 328336 329867 329966 329157 328206 327202 325535 323003 320476 318969
60601 318969 318427 317994 317258 316531 315887 314708 312637 310512 309757 310867 312890 314463 315099 315353 315992 317292
60585 317292 318984 320604 321769 322362 322604 322819 322966 322556 321249 319431 317873 316849 315975 315008 314413 314799
60569 314799 316005 317143 317542 317372 317248 317431 317610 317428 317015 316833 317034 317187 316808 316018 315441 315515 316159 317113
60551 317113 318279 319627 321070 322576 324193 325777 326947 327524 327830 328258 328691 328658 328033 327335 327333 328521 330956
60534 330956 334389 338406 342486 345998 348341 349381 349754 350395 351546 352519 352753 352782 353664 355600 357681 359143
60518 359143 360352 362290 365401 369311 373516 377950 382852 388311 394084 399886 405739 411952 418664 425568
60504 425568 432261 438761 445395 452168 458528 463817 467653 469831 470285 469450 468287 467499 466929 466127 465360 465552
60488 465552 467297 470500 475033 481102 488654 496973 505419 514277 524395 536174 549408 564014 580272
60475 580272 598239 617375 636928 656337 675024 692133 706724 718084 725721 729350 729130 725696
60463 725696 719703 711547 701768 691485 681999 673967 667249 661543 656803 653037 650076 647817 646530 646650
60449 646650 648280 651153 655203 661055 669667 681362 695437 711031 728300 748369 772035 798880
60437 798880 827826 858153 889600 921665 953352 983678 1012168 1038738 1063238 1085200 1104032
60426 1104032 1119538 1132239 1142993 1152169 1159304 1163477 1163612 1158344 1146308 1127117 1101750 1071493
60414 1071493 1036863 998178 956814 914933 873965 834171 795741 759394 725558 693870 664115
60403 664115 637043 613558 593452 575582 559082 543831 529923 517337 506130 496408 487927 480073
60391 480073 472378 464833 457662 451020 444997 439688 435119 431177 427664 424418 421398 418708 416458 414553
60377 414553 412710 410748 408737 406751 404590 401925 398654 395045 391548 388562 386269 384554 383081 381527
60363 381527 379778 377954 376337 375198 374543 374036 373367 372676 372438 372930 374046 375613 377545 379564 381123 381855
60347 381855 381910 381682 381483 381648 382649 384655 387130 389237 390665 391834 393310 395281 397635 400256 403086
60332 403086 406025 408888 411474 413643 415334 416622 417782 419264 421333 423662 425490 426466 427176 428531 430700
60317 430700 433045 435070 436965 439129 441619 444332 447278 450320 452943 454708 455825 456898 458214 459565
60303 459565 460752 461969 463595 465773 468322 471058 474122 477837 482160 486536 490624 494991 500522 507154
60289 507154 513683 519019 523096 526305 528566 529418 528674 526548 523342 519377 515033 510560 506050 501842 498549
60274 498549 496325 494399 491806 488357 484549 480781 477179 473973 471468 469668 468320 467256 466367 465412 464400
60259 464400 464020 465161 467925 471481 474963 478188 481569 485689 490922 497077 503446 509547 515768 522851
60245 522851 530801 538809 546238 553111 559472 564742 568091 569244 568639 566834 563827 558901 551280 541100
60231 541100 529625 518263 507538 497319 487830 479887 474096 470199 467247 464142 460175 455518 451129
60218 451129 447750 445008 442000 438649 435798 433889 432300 430291 427964 425827 423925 421964 419955 418195
60204 418195 416764 415469 414219 413114 412186 411345 410532 409776 409120 408637 408431 408486 408610 408581 408319 407918 407717 408279
60186 408279 409964 412381 414547 415796 416349 416849 417585 418385 419048 419600 420237 421233 422805 424892 427093 428961
60170 428961 430307 431213 431944 432925 434621 437176 440250 443374 446419 449638 453291 457326 461473 465613 470016
60155 470016 475085 480771 486437 491520 496206 501145 506557 511976 516917 521432 525861 530331 534746 539091
60141 539091 543523 548174 552900 557205 560567 562991 565104 567400 569531 570771 571064 571050 570969 570185 568133 565250
60125 565250 562511 560389 558698 557235 556087 555310 554655 553704 552165 550117 548055 546565 545789 545306 544590 543410
60109 543410 541739 539607 537211 534923 532946 531153 529439 528011 527050 526324 525370 523974 522275 520551 519079
60094 519079 518030 517340 516906 516963 517952 519796 521691 522934 523601 524054 524189 523737 523028 522840 523573 525104 527276
60077 527276 529838 532005 533001 533294 534527 537744 542172 546222 549193 551455 553424 555210 557129 559736 563127
60062 563127 566769 570281 573896 577841 581711 584922 587551 590249 593487 597310 601762 606994 612861 618833
60048 618833 624507 629859 634801 638906 641866 643908 645376 646168 646004 645142 644356 644214 644676 645323 645645 645215
60032 645215 643984 642481 641312 640438 639231 637176 634120 629885 624277 617651 610940 604772 598937 592975
60018 592975 586881 580898 575019 569139 563429 558106 552950 547475 541469 535050 528380 521722 515638 510611
60004 510611 506402 502249 497822 493642 490391 488077 486098 483894 481355 478702 476239 474163 472468 470997
59990 470997 469696 468791 468657 469422 470771 472162 473234 474009 474786 475890 477465 479345 481056 482105 482333 481994
59974 481994 481519 481383 482073 483710 485509 486060 484616 481917 479337 477391 475561 473406 471194 469356 467866
59959 467866 466362 464434 461646 457780 453318 449279 446287 444048 441906 439521 436846 433916 431019 428642
59945 428642 426833 424950 422462 419728 417519 416007 414690 413178 411561 410127 409127 408838 409416 410635 412014
59930 412014 413277 414474 415775 417321 419207 421329 423327 424950 426418 428130 430116 432058 433794 435488
59916 435488 437258 438906 440033 440226 439201 437112 434782 433285 433045 433475 433597 432918 431633 430189 428860
59901 428860 427769 427075 426954 427360 427945 428311 428292 427930 427339 426793 426715 427248 427911 428107 427971 428269 429319 430504
59883 430504 431162 431512 432262 433580 434903 435669 435853 435804 435858 436218 437062 438675 441353 445034 449103 452853 456144
59866 456144 459294 462438 465538 469026 473601 478969 483502 485857 486507 487046 488349 490148 492095 494265 496597
59851 496597 498671 500367 502152 504416 506908 509092 510796 512298 513939 515720 517184 517711 517162 516136 515343
59836 515343 514823 514076 512836 511294 509660 508026 506787 506721 508334 511330 514931 518629 522472 526705 531204
59821 531204 535328 538440 540665 542953 546222 550541 555268 559803 563989 568002 572082 576273 580202 583321
59807 583321 585515 587234 588793 589957 590590 591276 592718 594735 596479 597522 598159 598772 599551 600865 603220
59792 603220 606643 610568 614504 618451 622567 626717 630441 633094 634063 633241 631211 628618 625512 621827 618316
59777 618316 616221 615812 615807 614533 611292 606572 601443 596897 593256 589954 586226 582121 578461 575833 574149
59762 574149 573192 572872 572750 572044 570579 569163 568577 568645 568742 568750 569002 569596 570313 571022 571699 572151 572096 571446 570300
59743 570300 568793 567082 565235 562953 559731 555592 551344 547761 544768 541788 538666 535826 533606 531827
59729 531827 530058 528038 525849 523768 521902 519956 517523 514757 512489 511484 511697 512378 512708 512239 511065
59714 511065 509770 509006 508896 509074 509454 510600 513048 516570 520401 523993 527226 530158 533023 536424 541056
59699 541056 547130 554153 561298 567909 573846 579483 585218 590898 595976 600340 604549 608935 612910 615677
59685 615677 617372 618927 620943 623242 625487 627596 629377 630349 630254 629504 628821 628618 628865 629299 629528 629194 628346
59668 628346 627572 627409 627705 627838 627601 627525 628146 629225 630050 630390 630783 631815 633500 635534 637854 640604 643661
59651 643661 646578 649071 651364 654002 657358 661332 665455 669407 673442 678115 683505 689061 694440 700048
59637 700048 706326 712843 718701 723641 728041 731922 734729 736239 736912 737057 736358 734622 732435 730566 729183
59622 729183 728087 727267 726626 725518 723191 719587 715249 710586 705754 701101 697123 693836 690635 686994 683047
59607 683047 679365 676357 673991 672009 670349 669367 669578 671113 673573 676485 679713 683245 686897 690567 694614
59592 694614 699467 704762 709174 711380 711159 709428 707259 704951 702024 697958 692745 686691 679872 672011
59578 672011 662868 652628 641958 631845 623211 616316 610533 604868 598754 592165 585252 578284 571820
59565 571820 566304 561335 555899 549525 542718 535980 528963 521122 512829 505197 498905 493671 488879 484318
59551 484318 480235 476947 474577 473062 472252 471918 471642 470914 469623 468354 467854 468145 468523 468493 468287 468380 468902
59534 468902 469748 470816 471835 472341 472233 472083 472503 473396 474102 474133 473507 472530 471550 470774 470092 469162 467796 466111
59516 466111 464215 462050 459666 457356 455315 453439 451664 450163 449032 448068 447104 446264 445708 445425 445433 445836
59500 445836 446507 447123 447664 448398 449195 449445 448948 448335 448218 448521 449045 450089 451928 454319 457156 461019 466311
59483 466311 472439 478734 485685 494221 504075 514015 523566 533292 543155 551690 557334 559904 560333 559577 558165
59468 558165 556372 554320 552078 549839 547896 546398 545392 544986 545156 545427 545184 544250 542738 540514 537336
59453 537336 533474 529581 525895 522152 518381 515135 512680 510504 507892 504566 500561 495983 491238 487043
59439 487043 483801 481201 478729 476379 474574 473638 473603 474417 475989 478019 480008 481528 482581 483656 485305
59424 485305 487602 490125 492585 495204 498283 501664 504973 508167 511480 514958 518416 521657 524360 525990
59410 525990 526345 526058 525954 526045 525792 525292 525405 526512 527865 528575 528711 529057 530139 531889 534012 536303 538712
59393 538712 541319 544229 547455 551007 554990 559349 563625 567267 570160 572481 574098 574587 573835 572206 570061
59378 570061 567562 565032 562997 561688 560838 560167 559710 559593 559832 560479 561611 563090 564713 566749 569899 574540
59362 574540 580316 586626 593239 600309 608140 617075 627287 638542 650488 663313 677706 693952 711196
59349 711196 727649 741252 750296 754112 753626 750976 748275 746679 746582 748272 752171 758445 766318 773614
59335 773614 777362 775515 768324 757855 746320 735088 724828 715707 707391 699582 692649 687156 682800
59322 682800 678546 673930 669458 665594 662214 659323 657377 656378 655453 653909 652109 650808 650212 650221 650912 652156
59306 652156 653346 654163 655137 656804 658854 660838 663176 666623 671132 676095 681401 687306 693499 699365 705140
59291 705140 711791 719498 727162 733836 740027 747159 756209 767124 779090 790910 801411 809999 816875
59278 816875 822653 827822 832511 836500 839213 839937 838269 834469 829378 823908 818454 812648 805787 797600
59264 797600 788460 778815 768746 758322 748010 738244 728687 718453 707180 695562 684721 675344
59252 675344 667453 660657 654390 648191 642099 636718 632611 629628 627067 624583 622765 622609 624566 628323
59238 628323 633339 639031 644264 647279 646783 643026 637332 630649 623050 614540 605660 597160 589599 583474
59224 583474 579110 576129 573567 571023 569304 569423 571287 573904 576725 580166 584786 590446 596470 602396
59210 602396 608361 614844 622148 630123 638341 646404 653978 660718 666436 671307 675598 679228 681888 683640
59196 683640 684922 685921 686330 685874 684710 683164 681531 680291 679961 680370 680507 679547 677786 676208 675362 674996
59180 674996 674514 673438 671657 669586 667951 667078 666493 665344 663045 659452 654866 650094 646061 642916 639794
59165 639794 635799 630943 625790 620593 615294 610095 605381 601198 597242 593364 589669 586180 582727 579150
59151 579150 575422 571719 568574 566738 566526 567470 568819 570196 571576 572982 574570 576725 579613 582799 585670
59136 585670 588052 590155 592259 594808 598345 602765 606940 609823 611752 614018 617241 620837 624073 626841
59122 626841 629222 630935 631629 631304 630143 628218 625646 622793 620003 617215 614052 610335 606363 602621 599179
59107 599179 595532 591196 586352 581628 577262 572948 568599 564744 561810 559452 557008 554289 551466 548496
59093 548496 545162 541506 537751 533876 529684 525147 520416 515679 511323 507952 505804 504370 502936 501211
59079 501211 499074 496241 492843 489919 488451 488026 487318 485828 484270 483209 482306 481259 480608 481019 482336
59064 482336 483999 486093 489379 494382 500849 508071 515407 522437 528943 535003 541083 547755 555064 562292
59050 562292 568628 574108 579460 584981 590073 594177 597558 600714 603494 605498 606973 608463 609689 609616 607824
59035 607824 605137 602646 600625 598688 596639 594766 593385 592276 590695 588111 584930 582104 579861 577322
59021 577322 573844 570183 567558 565878 563827 560663 557029 553800 550987 548149 545281 542708 540442 538083
59007 538083 535274 532033 528699 525601 522687 519537 515886 512042 508537 505561 503020 500920 499318 498093
58993 498093 497235 497108 497846 498649 498342 496656 494388 492394 491070 490762 491746 493501 494728 494638 493792 493265 493361
58976 493361 493583 493604 493774 494637 496202 497895 499309 500848 503302 506663 509882 512187 514173 517037 521115
58961 521115 525909 531238 537477 544654 552173 559528 566537 572790 577655 581026 583387 584945 585417 584868 584007
58946 584007 583319 582618 581733 580891 580105 578970 577642 577235 578508 580693 582375 583194 583870 584846 585713 585991 585784
58929 585784 585420 584932 584232 583591 583638 584741 586492 588032 588989 589900 591509 593875 596562 599536 603329 608288
58913 608288 614177 620624 627586 635207 643517 652319 661030 668738 674904 680053 685244 690779 695924 699972
58899 699972 702945 705034 705970 705398 703537 700998 698104 694574 689815 683480 675916 668018 660447 653116 645673
58884 645673 638133 630607 622826 614672 606909 600528 595510 591125 587364 585006 584131 583643 582658 581452 580706
58869 580706 580597 580983 581617 581827 580869 579077 577789 577712 578198 578516 578790 579105 578877 577990 577538 578341 579567 580029
58851 580029 580154 581397 584120 587372 590568 594070 598150 602570 607419 613306 620306 627502 634067 640349
58837 640349 647502 656241 666098 675782 684265 691655 698910 706626 714524 722328 730587 740048 750629 761548
58823 761548 772141 781898 790079 796151 800554 804302 807780 810556 812396 813797 815296 816734 817468 817059
58809 817059 815630 813788 812231 811218 810353 808954 806513 802784 797797 792067 786409 781126 775558 768823
58795 768823 760797 752051 743105 734115 725048 715718 705891 695810 686383 678337 671322 664315 656773 648916
58781 648916 641042 633188 625481 618250 611620 605316 599006 592668 586580 581139 576613 572888 569554 566436
58767 566436 563848 562131 561145 560457 559870 559526 559636 560302 561382 562391 562829 562766 562757 563003 563054 562616 562120 562067 562296
58748 562296 562351 562173 561853 561152 559823 558104 556325 554385 552151 549976 548124 546062 543102 539514 536219
58733 536219 533540 531102 528807 527059 525979 525239 524781 524945 525674 526370 526816 527634 529507 532467 536242 540753
58717 540753 545830 550885 555419 559634 564044 568452 571749 572882 571882 569745 567377 564867 561880 558438
58703 558438 554920 551401 547538 543184 538668 534289 530015 525897 522278 519212 516221 513069 510389 508971
58689 508971 508756 508986 509116 509034 508722 508298 508265 509154 510833 512524 513500 513652 513600 514457 517089 521278 525956 530478
58671 530478 535159 540173 544644 547567 549213 550848 553229 556024 558545 560421 561723 562934 564667 567021
58657 567021 569478 571757 574249 577150 579831 581810 583705 586246 588824 590140 589961 589060 587597 584810 580417
58642 580417 575127 569456 563039 555479 546975 537698 527363 515976 504445 493907 484744 476505 468464
58629 468464 460143 451737 444201 438493 434535 431201 427391 422877 418191 414161 411497 410276 409695 408709 406955
58614 406955 404844 402939 401657 401381 402307 404265 407022 410518 414364 417580 419575 421117 423483 426886 430550
58599 430550 434086 437743 441320 443916 445007 444905 443953 442115 439625 437141 434871 432218 428705 424711 420973
58584 420973 417906 415653 414209 413143 411715 409628 407338 405410 403907 402585 401308 400111 399143 398580 398335
58569 398335 397954 397167 396339 395861 395368 394213 392578 391359 391013 391241 391725 392354 392738 392375 391471 390870 391002 391597
58551 391597 392511 394037 396214 398628 401087 403826 406872 409937 413092 416817 421107 425221 428534 431039
58537 431039 432876 434096 435062 436322 437832 439006 439746 440753 442691 445729 450033 455798 462535 469169 475207
58522 475207 481090 487163 493115 498754 504476 510609 517090 524175 532540 542146 551730 560062 567158 573795
58508 573795 580533 587666 595457 603839 612377 621066 630645 641702 653955 666796 679909 692938 705239
58495 705239 716565 727416 738006 747280 753645 756502 756651 755400 753624 751445 748415 744106 738675 732655
58481 732655 726179 718836 710332 700897 690966 680795 670399 659449 647390 634223 621057 609247
58469 609247 599069 589894 581433 573917 567188 560747 554738 549821 545885 541975 537686 533552 529819 526066
58455 526066 522434 519988 519236 519275 518975 518008 516256 513352 509583 506220 504134 502903 501924 501499 502007 502940
58439 502940 503664 504428 505729 507362 508905 510552 512654 514997 517346 520154 523930 528287 532317 535637 538622
58424 538622 542014 546631 552904 560291 567754 575028 582691 590809 598561 605669 613041 621271 629495 636485
58410 636485 641937 645864 647746 647370 645735 644023 642240 639746 636590 633422 630651 628545 627655 628347 630396
58395 630396 633595 638110 643538 648517 652197 655442 659534 664271 668273 670650 671426 670746 668611 665189 660705
58380 660705 655344 649762 645119 641952 639524 636844 633799 630863 628515 627403 628126 630136 631878 632834 634350
58365 634350 637530 641411 644474 646900 649864 653304 655980 657403 658281 659188 659949 660252 659919 658684 656479
58350 656479 653705 650660 647161 643323 640065 638089 637027 636383 636488 637615 638993 639860 640830 643076 646662
58335 646662 650768 655004 659462 663969 668318 672743 677247 681068 683802 686345 689681 693411 696649 699614
58321 699614 703075 706919 710641 714750 720226 726967 734106 741563 749928 758989 767642 775281 782300 789348
58307 789348 796850 804941 813112 820394 826626 832931 840160 847740 855024 862778 871965 881811 890588 897814
58293 897814 904363 910836 917128 923244 929373 935457 941636 948570 956379 963955 970404 976414 983086 990291
58279 990291 997427 1004973 1013896 1024190 1035320 1047324 1060194 1073001 1085096 1097360 1110840 1124911
58267 1124911 1138271 1150882 1163387 1175442 1186295 1196272 1206145 1215773 1224920 1234523 1245521 1257270
58255 1257270 1268707 1280107 1292046 1303782 1314624 1325853 1339180 1354228 1369605 1385461 1402737
58244 1402737 1420820 1438423 1456087 1475357 1496056 1516722 1537238 1558644 1580846 1602822 1624682
58233 1624682 1647252 1670121 1692315 1714434 1737945 1762918 1788624 1815643 1845129 1876732 1909497
58222 1909497 1943899 1980578 2018175 2055114 2092437 2132012 2173081 2213721 2254716 2298564 2345497
58211 2345497 2393966 2444310 2498272 2555425 2613825 2673840 2737562 2804759 2873280 2943264 3017007
58200 3017007 3094712 3174404 3256169 3342411 3433514 3527164 3622440 3720820 3822725 3926914 4033759
58189 4033759 4145442 4262428 4383348 4508647 4640678 4780034 4925547 5077967 5239743
58180 5239743 5411278 5591600 5782601 5988216 6209563 6445482 6697604 6969781 7262580
58171 7262580 7573689 7903970 8257680 8636607 9039814 9469650 9932040 10430127 10963448
58162 10963448 11533791 12145532 12799642 13494074 14231108 15017930 15859414 16757133 17715709
58153 17715709 18742251 19838744 21003089 22238871 23556658 24966398 26478613 28113801
58145 28113801 29899981 31859643 34009838 36376394 38997440 41914696 45178199 48863755
58137 48863755 53072335 57909810 63478911 69883108 77209654 85503988 94787044 105103584
58129 105103584 116529264 129135927 142982326 158076279 174132068 190163111 204336299
58122 204336299 214468778 218944682 217360024 210467194 199643455 186373032 171960241
58115 171960241 157397637 143319124 130056458 117764467 106511737 96302827 87090872
58108 87090872 78812009 71405902 64805783 58932701 53710271 49072443 44952857 41281529
58100 41281529 37998508 35059945 32426728 30057863 27918449 25983266 24227748 22624065
58092 22624065 21149620 19791152 18537267 17374700 16294727 15295383 14373710 13522083
58084 13522083 12734377 12008703 11341061 10722598 10146145 9609747 9111085 8643957 8203105
58075 8203105 7787565 7396641 7027153 6676938 6346528 6035014 5738333 5453721 5182002
58066 5182002 4923800 4677454 4442341 4220273 4011829 3814983 3628889 3455225 3294231
58057 3294231 3143166 3000298 2866783 2742860 2625748 2513191 2405878 2304650 2208393 2116324
58047 2116324 2029391 1947809 1869928 1794881 1723603 1656052 1590384 1526150 1465429 1409505 1357215
58036 1357215 1307762 1262154 1220491 1180817 1142196 1106249 1074120 1044629 1016840 991729 969714
58025 969714 949195 929265 911358 896370 882496 867697 852200 836903 821344 805074 789126
58014 789126 774418 760294 746059 732318 719501 706782 693685 681048 669260 657339 644905
58003 644905 633239 623167 613719 604042 594805 586479 578107 569054 560207 552135 543837 534624 525477 517185
57989 517185 508883 499832 491007 483463 476653 469699 462875 456606 450501 444538 439558 435391 430307 423690
57975 423690 417404 412955 409063 403817 397643 392235 387898 383834 379926 376367 372499 367741 362890 358999
57961 358999 355813 352619 349608 346971 343731 339084 334004 330007 327123 324475 321978 319996 318192 316182
57947 316182 314533 313655 312558 310225 307487 305912 305500 305019 304092 303360 303026 302784 302884 303899 305667 307644
57931 307644 309927 312740 315345 316842 317657 318929 320623 321586 321312 320407 319389 318225 317093 316466 316262 315778
57915 315778 314620 313077 311611 310587 310270 310481 310498 309913 309344 309667 310798 311925 312614 313047 313441 313876 314444
57898 314444 314965 314865 313874 312497 311243 309797 307548 304528 301266 298127 295367 293367 292156 291133 289878
57883 289878 288830 288583 288961 289400 289849 290678 292058 293928 296200 298534 300420 301836 303263 304713 305498 305409
57867 305409 305202 305339 305185 304163 302733 301305 299167 295626 291393 287682 284558 281403 278381 276067 274102
57852 274102 271569 268599 266378 265610 266013 267183 268881 270505 271359 271586 271967 272718 273237 273092 272569 272157 272085
57835 272085 272399 272968 273478 273786 274099 274489 274644 274605 275222 277212 280116 282852 284926 286483 287673 288708 290082
57818 290082 291979 293821 295122 296312 297928 299554 300472 300821 301123 301162 300511 299740 299837 300687 301386 301917 303140
57801 303140 305081 306581 306922 306678 306584 306590 306475 306500 306982 307845 309000 310630 312840 315428 318146 320729 322688
57784 322688 323627 323768 323617 323246 322513 321771 321557 321649 321330 320642 320476 321311 322698 324159 325686 327112 327943 328286
57766 328286 329205 331530 334779 337718 339599 340506 340938 341478 342568 344085 345221 345062 343394 340960 338946
57751 338946 337976 337412 335830 332494 328118 323857 319962 315958 311768 307840 304326 300961 297837 295487 294059
57736 294059 293072 292250 291964 292587 293843 295074 295737 295509 294404 293080 292673 293939 296618 299694 302139 303509
57720 303509 304140 304813 306100 308035 310473 313412 316711 319908 322745 325531 328491 331134 332860 333884 334841
57705 334841 335754 336172 336190 336473 337304 338333 339341 340489 341760 342839 343638 344299 344617 344202 343348 343128 344376
57688 344376 347090 350848 355184 359435 362902 365442 367477 369362 371224 373278 375630 377750 378884 379148
57674 379148 379457 380229 380905 380983 380759 380740 381056 381783 383164 385046 386721 387750 388456 389212 389833 390127 390504 391441
57656 391441 392722 393771 394515 395471 397106 399408 401926 404065 405551 406775 408417 410612 412814 414601 416194
57641 416194 418017 420106 422229 424265 426241 428261 430514 433048 435472 437239 438292 439073 439895 440799 442041
57626 442041 444066 446835 449763 452510 455232 457900 460151 462185 465019 469328 474629 480315 486961 495847
57612 495847 507512 521516 537456 555440 575509 597163 619666 642359 664358 684040 699141
57601 699141 707601 708559 702602 691053 675201 656405 636576 617799 601230 586719 573732 562224
57589 562224 552455 544326 537290 530806 524778 519661 516094 514177 513227 512551 512327 513222 515281 517751 519904
57574 519904 521393 521967 521724 521686 523036 525542 527671 528619 529171 530109 530948 531106 531216 532101 533227 533506 533171
57557 533171 533516 534922 536359 536965 537073 537469 538555 540444 543089 546053 548786 551409 554603 558477 562165
57542 562165 564880 566857 568919 571551 574742 578270 581680 584248 585544 586003 586657 588262 590832 593966 597338
57527 597338 600785 604128 607121 609684 612058 614583 617287 619856 622086 624193 626514 629048 631434 633385
57513 633385 635044 636917 639459 642638 645924 648892 651796 655267 659431 663694 667550 671200 675054 678974
57499 678974 682448 685362 688138 691104 694091 696801 699308 702076 705531 709693 714197 718692 723173 727865
57485 727865 732825 737865 742844 747820 752892 758155 763867 770342 777502 784810 791773 798263 804251 809603
57471 809603 814403 819166 824377 829984 835563 840827 845794 850660 855660 860872 866048 870954 875995 882075
57457 882075 889574 897867 906162 914377 922747 931032 938750 945975 953341 961317 970002 979496 989870 1000689
57443 1000689 1011036 1020212 1028152 1035186 1041661 1047795 1053618 1059059 1064266 1069729 1075810 1082269 1088571 1094561
57429 1094561 1100535 1106782 1113348 1120173 1127039 1133499 1139245 1144529 1149858 1155312 1160550 1165483 1170560 1176372
57415 1176372 1183238 1191115 1199552 1207789 1215300 1222257 1229118 1235926 1242472 1248991 1256038 1263588 1270931 1277680
57401 1277680 1284287 1291299 1298732 1306572 1315311 1325323 1336068 1346508 1356176 1365296 1374018 1382206 1390053
57388 1390053 1398245 1407245 1416773 1426247 1435370 1444065 1452253 1460241 1469051 1479678 1491831 1503944 1514767
57375 1514767 1524631 1534787 1545847 1557359 1568775 1580199 1592058 1604516 1617415 1630480 1643382
57364 1643382 1655944 1668410 1681171 1694027 1706153 1717080 1727295 1737562 1748100 1758890 1770287
57353 1770287 1782556 1795091 1806968 1818326 1830382 1843861 1858064 1871751 1884402 1896242 1907620
57342 1907620 1918903 1930631 1943200 1956398 1969604 1982382 1994672 2006587 2018375 2030490 2043349
57331 2043349 2056946 2070907 2084861 2098548 2111636 2123815 2135273 2146819 2159275 2172683 2186289
57320 2186289 2199353 2211914 2224727 2238473 2253084 2267812 2281905 2295214 2308219 2321517 2335285
57309 2335285 2349209 2362953 2376597 2390486 2404700 2418874 2432619 2445920 2458959 2471784 2484376
57298 2484376 2496942 2509878 2523426 2537544 2552008 2566445 2580382 2593561 2606251 2618979 2631972
57287 2631972 2645134 2658531 2672406 2686603 2700432 2713527 2726525 2740421 2755367 2770538 2785184
57276 2785184 2799318 2813259 2826985 2840284 2853284 2866389 2879738 2893083 2906166 2918894 2931067
57265 2931067 2942263 2952240 2961300 2970099 2979244 2989119 2999838 3011058 3021978 3031862 3040581 3048533 3056165
57252 3056165 3063804 3071749 3080094 3088431 3096143 3103133 3109967 3117201 3124805 3132405 3139805 3147133 3154645 3162550
57238 3162550 3170850 3179227 3187259 3194837 3202176 3209371 3216216 3222558 3228527 3234183 3239280 3243614 3247387 3250872
57224 3250872 3253886 3255963 3257105 3258131 3260224 3264057 3269215 3274473 3278930 3282881 3287232 3292022 3296111 3298601
57210 3298601 3300018 3301490 3303144 3303976 3303159 3300755 3297095 3292147 3285789 3278304 3270331 3262521 3255394 3249355
57196 3249355 3244712 3241731 3240624 3241274 3243155 3245871 3249803 3255903 3264768 3276148 3289272 3303256 3317248
57183 3317248 3330649 3343429 3355845 3367609 3377670 3385119 3390055 3393293 3395393 3396250 3395431 3392531 3387308
57170 3387308 3379796 3370403 3359650 3347821 3335022 3321548 3307949 3294703 3282048 3270228 3259576 3250264
57158 3250264 3242199 3235453 3230536 3227898 3227230 3227750 3229255 3232537 3238550 3247442 3258580 3271205 3284738 3298787
57144 3298787 3313303 3328585 3344612 3360366 3374300 3385597 3394564 3401603 3406164 3406993 3403108 3394118 3379673
57131 3379673 3358923 3330677 3294031 3248868 3195744 3135295 3067779 2993333 2912525 2826393 2735820
57120 2735820 2641144 2542606 2441190 2338845 2237810 2139751 2045683 1956723 1874533 1800560 1734820
57109 1734820 1675893 1622210 1572775 1526428 1481104 1434482 1384958 1331455 1272851 1208527 1139222
57098 1139222 1066481 991401 914766 838241 764192 693901 626637 560646 494291 425973 353886
57087 353886 276537 193184 103537 7457 -94931 -203466 -318497 -440772 -570610 -707706 -851774
57076 -851774 -1002788 -1160597 -1325073 -1496725 -1676349 -1864004 -2059179 -2262137 -2474282 -2697116
57066 -2697116 -2931852 -3180334 -3445423 -3730219 -4037818 -4372049 -4737464 -5138353 -5578630
57057 -5578630 -6062648 -6594873 -7178547 -7816043 -8510930 -9268627 -10095123 -10996851 -11982383
57048 -11982383 -13062893 -14250694 -15558920 -17003062 -18601495 -20375104 -22349350 -24558168
57040 -24558168 -27045110 -29862440 -33073816 -36759715 -41017641 -45955908 -51688853 -58335449
57032 -58335449 -66013176 -74825098 -84850040 -96140207 -108717639 -122565944 -137626201
57025 -137626201 -153798096 -170932829 -188815598 -207150989 -225541882 -243427066 -259995224
57018 -259995224 -274188190 -284893001 -291257182 -292923524 -290046029 -283140362 -272913885
57011 -272913885 -260146561 -245601708 -229949746 -213729616 -197359766 -181167941 -165407996
57004 -165407996 -150265908 -135869918 -122304862 -109623629 -97856341 -87018722 -77115071
56997 -77115071 -68134944 -60050996 -52822158 -46397238 -40716028 -35712268 -31319872 -27476501
56989 -27476501 -24122012 -21197451 -18647978 -16425096 -14485117 -12787787 -11297727 -9985115
56981 -9985115 -8823663 -7789864 -6865306 -6037414 -5296021 -4630318 -4029944 -3486935 -2994871
56972 -2994871 -2547420 -2139130 -1766507 -1426876 -1116888 -833131 -573462 -337138 -124418
56962 63617 226126 363992 479500 574421 649831 708007 752850 787828 814930 836080 853796
56951 853796 869615 883317 894323 902383 906343 904205 895495 881916 864636 842662 815210 783856
56939 783856 750589 714968 674973 629761 580096 527023 471860 416938 364760 316570 272627
56928 272627 233271 198632 167946 140310 115736 94515 76127 59682 44733 30682 16105
56917 16105 -120 -17461 -34499 -50490 -65289 -78374 -89180 -98004 -105421 -111163 -114658 -116315 -117184
56904 -117184 -117514 -116672 -114340 -110894 -106741 -102156 -97598 -93393 -89199 -84506 -79586 -75381 -72701 -72074 -73891
56889 -73891 -77812 -82306 -85664 -87443 -88373 -89008 -89112 -88167 -85906 -82431 -78173 -73452 -67890 -60747 -52168
56874 -52168 -43357 -35022 -26467 -16880 -6650 3417 13219 22420 29214 31481 29007 23405 16054 7376
56859 -2049 -11085 -19051 -26184 -32792 -38698 -43652 -47631 -50555 -52316 -53096 -53190 -52557 -51062 -48975 -46679 -44112
56843 -44112 -41099 -37961 -35186 -32753 -30428 -28348 -26617 -24676 -21913 -18541 -15112 -11550 -7636 -3960
56829 -3960 -1238 1062 4245 8656 13685 19293 26112 33836 40882 46134 49912 52804 54621 55156 55067
56814 55067 55339 56429 58391 61258 64863 68868 73420 79297 87111 96759 107872 120276 133842 148444
56800 148444 164207 181231 198865 215872 231347 244808 255276 261267 262217 259258 254155 248078 241784
56787 241784 236158 231795 228495 225879 224343 224953 228554 235373 245313 258286 274295 293361 315265
56774 315265 339406 365183 392376 420546 447844 470949 486650 493483 491973 483821 471015 455238
56762 455238 437744 419699 402400 386719 372622 359862 349117 341677 337967 337195 338707 342844 350141
56749 350141 360406 373116 388039 404804 422212 438494 451946 460926 463808 459717 449328 434546
56737 434546 417399 399372 381479 364485 348957 335151 322832 311370 300455 290745 283378 278782
56725 278782 276435 275831 277073 280244 284887 290588 297542 305908 314741 322067 325941 325285 320015 310823 298819
56710 298819 285087 270516 255925 242041 229200 217342 206390 196400 187311 178932 171302 164718
56698 164718 159272 154657 150492 146544 142654 138874 135664 133376 131493 129017 125787 122718 120432 118385
56684 118385 115849 113116 111103 110144 109805 109634 109508 109347 108953 108161 106931 105353 103672 102168 100919 99929
56668 99929 99430 99632 100179 100446 100496 101079 102390 103527 103665 103220 103256 104145 105339 106071 105820 104502 102771 101841
56650 101841 102419 104048 105878 107686 109555 111015 111364 110797 110457 111193 112781 114504 116095 117881 120190
56635 120190 122747 124655 125156 124450 123546 123199 123339 123638 124151 125010 125882 126238 125939 125231 124332 123393 122582 121871
56617 121871 120906 119427 117582 115659 113790 112205 111338 111282 111470 111323 110866 110384 109883 109333 109018 109079 109115 108786
56599 108786 108471 108663 109077 109057 108644 108515 108959 109600 110063 110350 110610 111113 112289 114185 116088 117329 118364
56582 118364 120234 123011 125587 127141 128076 129300 131228 133717 136363 138614 140111 141215 142693 144661
56568 144661 146295 146829 146379 145553 144758 144170 143929 143958 143923 143719 143653 143827 143703 142741 141296 140329 140287 140632 140572 139903
56548 139903 139082 138652 138785 139252 139635 139551 138873 137878 137108 136872 136874 136579 136000 135835 136658 138175 139508 140035 139725
56529 139725 138893 138003 137611 138084 139182 140111 140173 139378 138469 138295 139050 140188 141223 142419 144298 146554 148177
56512 148177 148873 149694 151768 154928 158140 160844 163223 165482 167610 169787 172381 175484 178953 182847 187382
56497 187382 192489 197835 203190 208359 212860 216184 218305 219559 220154 220234 220225 220527 220911 220812 220169 219421 218737
56480 218737 217877 216816 215869 215078 214061 212571 210687 208398 205602 202629 200106 198076 195853 193078 190352
56465 190352 188460 187409 186587 185538 184253 182995 182126 181845 181828 181393 180231 178710 177291 175937 174359 172582
56449 172582 170997 170013 169814 170313 171115 171674 171670 171181 170547 170165 170363 171187 172303 173302 174087 174758 175272 175510 175576
56430 175576 175657 175671 175498 175446 175989 177024 177906 178274 178315 178134 177447 176147 174678 173551 172894 172683 172977 173652 174328
56411 174328 174870 175608 176750 177910 178584 178777 178848 178927 178858 178556 178101 177599 177167 177018 177327 178037 178840 179323 179205
56392 179205 178668 178458 179353 181350 183584 185129 185707 185597 185188 184787 184561 184390 183868 182733 181300 180356 180493
56375 180493 181528 182647 183235 183483 183901 184399 184416 184037 184208 185410 186857 187768 188747 190857 193665 195464 195475
56358 195475 194742 194676 195716 197664 200238 202760 204218 204362 204127 204412 205030 205371 205462 205661 205804 205494 204977 204992
56340 204992 205826 207037 208036 208492 208270 207470 206488 205719 205130 204410 203469 202552 201884 201378 200781 200047 199569 199926
56322 199926 201215 202740 203667 203913 204073 204491 204850 204682 203858 202476 200735 199086 198108 198050 198722 199857 201272
56305 201272 202705 203986 205333 206983 208581 209549 210062 210853 211934 212429 212064 212006 213579 216677 220018 222490
56289 222490 223749 224002 223886 224333 225901 228202 230293 231520 231912 232065 232863 234982 238351 242258 246083 249682
56273 249682 253053 256111 258930 261731 264485 266897 268916 270805 272678 274489 276488 278999 281675 283705
56259 283705 284910 285919 287128 288375 289738 291633 293850 295615 297062 299398 302992 306516 308937 311163
56245 311163 314550 318773 322559 325760 329197 332942 336301 339354 343059 347729 352611 357158 361703 366654
56231 366654 371942 377464 383283 389200 394892 400658 407361 415417 424407 433885 443976 454893 466362
56218 466362 477818 488924 499751 510652 522017 533998 546531 559771 574218 590182 607385
56207 607385 625410 644290 664280 685394 707674 731643 757981 786815 817794 850766 886031
56196 886031 924123 965654 1011206 1061059 1115233 1174000 1237948 1307196 1380979 1458391 1539142
56185 1539142 1623147 1709797 1798152 1887340 1976127 2062468 2144163 2219721 2288049 2347584 2396391
56174 2396391 2432937 2456342 2466164 2462529 2446251 2418354 2379697 2331401 2275201 2212797 2145179 2073084
56162 2073084 1997724 1920611 1843087 1766448 1691907 1619812 1549494 1480668 1414460 1352283 1294199
56151 1294199 1239281 1187199 1138508 1093615 1052238 1013721 977248 942115 908489 877491 849863
56140 849863 824919 801529 779593 759696 741805 725331 710091 696259 683656 671997 661488
56129 661488 652241 643480 634364 625306 617477 611241 606130 601985 598964 596553 593811 590657 587969 586368
56115 586368 585786 586123 587409 589316 591335 593367 595456 597224 598424 599791 602421 606515 611573 617467 624368
56100 624368 631951 639766 648207 658091 669517 682012 695461 709869 724687 739517 755131 772586
56088 772586 791732 811860 833413 857665 885040 915213 948588 986120 1027805 1072869 1121307
56077 1121307 1173529 1228448 1283424 1336195 1385437 1429657 1467481 1499366 1527337 1552604 1574833
56066 1574833 1593878 1610367 1624114 1633699 1638483 1639639 1638484 1635022 1628758 1619660 1607497 1591191 1569463
56053 1569463 1541496 1506937 1466431 1422383 1377945 1334792 1292859 1252329 1214613 1181062 1151951
56042 1151951 1127070 1106168 1088597 1073628 1061379 1052350 1046072 1041378 1037935 1036122 1035492 1034957 1034632
56029 1034632 1035870 1039286 1044192 1050047 1056842 1063991 1070574 1076901 1084156 1092428 1100785 1109251 1118684 1128648
56015 1128648 1137691 1146048 1155765 1167651 1180428 1193449 1207764 1223642 1239516 1254595 1270304 1287879
56003 1287879 1306541 1325303 1344628 1364951 1385400 1405343 1425615 1446889 1468322 1488979 1509249
55992 1509249 1529862 1550953 1572837 1596170 1620626 1645053 1669593 1695947 1724993 1756028 1788758
55981 1788758 1823802 1860685 1897839 1935327 1975011 2017136 2059471 2100937 2143344 2188268 2234937
55970 2234937 2282666 2332570 2385170 2438935 2493003 2548921 2608067 2669847 2734108 2802588 2876091
55959 2876091 2952811 3031343 3112822 3198241 3286409 3376638 3470752 3570265 3674130 3781402 3893494
55948 3893494 4011642 4134846 4262503 4396392 4537869 4685896 4840025 5002511 5175256
55939 5175256 5357755 5550307 5756006 5977095 6212646 6462286 6728784 7014394 7318342
55930 7318342 7640668 7984670 8352751 8744008 9159159 9603573 10081994 10594622 11141837
55921 11141837 11727904 12355998 13024622 13733656 14489412 15299244 16166039 17092472 18085108
55912 18085108 19149033 20284029 21491823 22782087 24166688 25655236 27262711 29014540
55904 29014540 30937496 33053505 35390359 37991238 40907083 44190587 47908602 52151496
55896 52151496 57019893 62610536 69020566 76346973 84669119 94053557 104593663 116416144
55888 116416144 129616426 144200580 160074849 176936740 193952161 209477739 221304916
55881 221304916 227496355 227234837 221030566 210249503 196474332 181121531 165318712
55874 165318712 149874214 135288624 121829087 109620085 98687296 88973018 80371864
55867 80371864 72773883 66075609 60169660 54948384 50317895 46197946 42513766 39200375
55859 39200375 36211522 33514065 31075711 28865029 26857967 25034749 23372539 21848091
55851 21848091 20444792 19151032 17954971 16846826 15822808 14880347 14011712 13207251
55843 13207251 12461656 11771714 11130902 10531841 9971717 9450129 8963662 8507286 8079046
55834 8079046 7678747 7303763 6950285 6616922 6303249 6006683 5724524 5457067 5205073
55825 5205073 4966279 4738199 4522358 4321801 4135949 3961520 3796891 3641899 3494876
55816 3494876 3353639 3218380 3090223 2967941 2849101 2733284 2621237 2512097 2404568
55807 2404568 2299825 2200226 2105995 2015835 1929809 1848923 1772717 1699815 1630081 1564027 1501127
55796 1501127 1440903 1384506 1332917 1284828 1238599 1194966 1155398 1119164 1084671 1052427 1023902
55785 1023902 998470 974217 950948 929696 909993 890262 870398 851502 833582 815765 798227
55774 798227 781714 765735 749344 733028 717753 703005 687932 673491 661097 649993 638378
55763 638378 626373 615318 604878 593579 581722 571037 561704 552350 542815 534233 526430 517976 509040
55750 509040 501592 496275 491417 485701 479707 474257 469289 464990 462164 460741 459553 458239 457875 459177
55736 459177 461416 463592 465345 466365 466269 465467 464846 464215 462235 458223 452929 447330 441784 436502 431593
55721 431593 426378 419893 412413 405474 400219 396652 394585 394112 394984 396648 399198 403284 408747 414162 417880
55706 417880 418831 416389 410485 402014 392342 382287 372160 362507 353952 346517 339923 334280 329597 325045
55692 325045 319843 314596 310563 307837 305443 302988 300845 298785 295846 291781 287513 283894 280994 278723
55678 278723 277146 276000 274736 273194 271559 269717 267399 264784 262229 259627 256795 254083 251701 248993
55664 248993 245451 241954 239693 238265 236222 233221 230233 227860 225975 224931 225498 227439 229598 231639
55650 231639 234347 237976 241596 244304 245830 245795 243684 239920 235736 231686 227333 222545 217855 213342 208517
55635 208517 203594 199519 196320 192772 188266 183768 180343 177847 175679 173777 172161 170467 168607 167136
55621 167136 166434 166218 166298 167000 168416 169974 171174 172023 172471 172183 171174 169895 168446 166548 164504 163251
55605 163251 163128 163457 163654 163895 164420 165094 165977 167329 168779 169459 169310 169249 169708 170116 170238 170865 172526 174550
55587 174550 176143 177467 178939 180278 180958 180902 180078 178149 175126 171689 168296 164678 160731 157073 154122
55572 154122 151349 148113 144583 141263 138263 135600 133516 131953 130408 128823 127828 127545 127031 125667 124259
55557 124259 123883 124321 124510 123925 122646 120643 118006 115486 113918 113288 113028 112897 112879 112662 111962 111101 110539
55540 110539 110113 109419 108627 108255 108348 108531 108651 108772 108742 108373 107790 107091 105966 104272 102699 102105 102310 102245 101254
55521 101254 99672 98084 96626 95137 93615 92353 91804 92262 93527 94970 96150 97172 98246 99122 99315
55506 99315 98758 97976 97624 97943 98594 98991 98938 98831 98995 99018 98280 96979 95938 95377 94680 93560 92600 92262 92183
55487 92183 91992 92047 92712 93499 93716 93499 93524 93981 94536 95061 95760 96684 97637 98479 99183 99757 100358 101225 102212 102789
55467 102789 102774 102646 102785 102882 102503 101743 100845 99693 98283 97176 96771 96472 95342 93318 91097 89016 86833
55450 86833 84525 82484 80824 79124 77050 74800 72792 71226 70073 69232 68669 68510 68876 69430 69383 68313
55434 68313 66764 65650 65238 65113 65005 65124 65681 66515 67330 68063 68927 70198 71919 73723 75019 75482 75252
55417 75252 74666 74042 73794 74342 75681 77254 78484 79166 79261 78694 77642 76664 76197 76126 76098 75987 75821 75605 75522
55398 75522 75953 76960 78002 78525 78621 78809 79385 80240 81100 81649 81636 81118 80448 79895 79524 79460 79870 80537 80915
55379 80915 80781 80382 79774 78604 76815 74962 73509 72402 71715 71953 73120 74081 73675 72114 70657 70151
55363 70151 70471 71042 71316 70943 70060 69257 68916 68862 68975 69667 71200 73041 74487 75519 76401 76881 76551 75635
55345 75635 74645 73537 71981 70226 68846 67855 66900 66195 66358 67272 67923 67525 66162 64331 62513 61251
55329 61251 60880 61028 60975 60646 60632 61163 61735 61963 62162 62777 63782 64938 66204 67512 68521 68898 68717 68342
55311 68342 68062 67904 67644 67024 66175 65759 66363 67778 69132 69745 69527 68662 67394 66178 65614 65923 66653 67059
55293 67059 66782 66182 66046 66808 68010 68697 68503 67981 67698 67428 66635 65369 64159 63243 62448 61677 61041 60577
55275 60577 60280 60319 60828 61629 62519 63606 64904 65887 66060 65806 65988 66710 67159 66726 65717 64789 64217 63908
55257 63908 63747 63673 63658 63741 63963 64230 64372 64274 63870 63287 63137 64205 66448 68641 69498 68894 67606 66258 65151
55238 65151 64675 65075 65923 66615 67286 68546 70370 72017 73024 73582 73848 73621 72807 71585 70024 68133 66328
55221 66328 65239 64994 65305 66215 67928 69840 70721 70261 69577 69685 70132 69784 68466 67105 66491 66557 66863 67338
55203 67338 68295 69807 71245 71702 70981 69906 69347 69235 68949 68384 67991 67989 68270 69027 70555 72282 72855 71662
55185 71662 69722 68619 68939 70042 70967 71251 71181 71514 72662 74022 74448 73481 71802 70441 69994 70641 72248
55168 72248 74132 75242 75000 73757 72268 71050 70351 70297 70759 71393 71995 72602 73168 73466 73409 73077 72391 71205
55150 71205 69822 68979 69072 69759 70433 70764 70766 70682 70881 71470 72004 72013 71727 71786 72276 72680 72810 73134 74102 75703 77703
55129 77703 79691 80898 80775 79881 79372 79514 79526 79029 78622 78658 78540 77814 77031 76793 76733 76183 75207 74283 73546
55110 73546 73074 73298 74286 75115 74801 73515 72200 71401 71182 71797 73444 75499 76839 77000 76498 76046 75897
55093 75897 75817 75292 73962 72292 71485 72218 73732 74676 74536 73719 72657 71601 71005 71239 71941 72328 72149 71739
55075 71739 71242 70463 69525 69000 69256 70180 71603 73437 75290 76471 76649 76191 75680 75355 75115 74834 74596 74742
55057 74742 75617 77073 78431 79214 79742 80632 81858 82695 82523 81361 79760 78496 78148 78524 78681 78027 77203
55040 77203 77286 78231 78859 78515 77977 78366 79766 81369 82607 83536 84291 84687 84524 83938 83295 82860 82727 82961
55022 82961 83570 84226 84280 83346 81818 80546 80005 80096 80704 81981 83876 85798 87085 87545 87324 86477 85022
55005 85022 83207 81455 80101 79337 79252 79751 80550 81354 81847 81565 80213 78225 76564 75766 75591 75750 76329
54988 76329 77190 77688 77573 77606 78580 80124 81201 81482 81476 81547 81546 81399 81343 81496 81701 81820 81777 81412 80693 79962 79562
54967 79562 79425 79428 79836 80774 81519 81116 79670 78274 77619 77339 76861 76225 75829 75858 76245 76853 77502 78068 78520
54948 78520 78650 78000 76541 75173 74860 75318 75357 74603 74119 75017 77152 79515 81361 82504 83018 83177 83463
54931 83463 84170 85098 85798 85993 85643 84856 83928 83299 83274 83828 84690 85453 85756 85647 85719 86511 87793 88812 89215
54912 89215 89310 89425 89511 89485 89517 89751 90084 90383 90635 90748 90555 90102 89677 89463 89445 89632 90040 90452 90612 90688 91154
54891 91154 92208 93657 95294 96866 97725 97217 95590 93918 92951 92622 92772 93556 94774 95554 95373 94834 94855
54874 94855 95482 96058 96200 96004 95626 95293 95601 97119 99686 102481 104819 106601 108198 110263 113451 117787
54858 117787 122353 126060 128722 131030 133527 136075 138318 140120 141340 141593 140612 138704 136566 134594 132514
54843 132514 129752 126152 122277 118965 116593 114852 113269 111762 110602 109985 109778 109626 109164 108229 107034
54828 107034 106111 105887 106297 106900 107431 108112 109353 111220 113379 115597 118080 121134 124649 128227 131754 135403
54812 135403 139036 142137 144597 146938 149294 150677 150026 147692 145020 142556 139547 135315 130213 124933
54798 124933 119701 114679 110470 107542 105536 103738 102007 100687 99893 99371 98895 98368 97598 96399 94846
54783 94846 93129 91347 89698 88645 88486 88897 89349 89816 90611 91602 92157 91921 91213 90463 89692 88797 87968 87482
54765 87482 87250 86960 86611 86632 87342 88506 89551 90108 90164 89832 89279 88874 89029 89687 90241 90334 90488 91477 93151
54746 93151 94464 94695 94151 93495 92902 92267 91829 92056 92982 94069 94768 95023 95190 95589 96166 96592 96677 96577 96456
54727 96456 96143 95511 95093 95715 97392 99075 99829 99881 100167 101206 102771 104435 106007 107491 108954 110433
54711 110433 111904 113493 115632 118567 121679 123880 125035 126387 129080 132785 136419 139734 143299 147123
54697 147123 150272 151986 152351 151612 149594 146269 142382 138916 136125 133505 130601 127498 124643 122460 121147
54682 121147 120566 120335 120119 119926 119998 120385 120737 120665 120250 119980 120048 120001 119405 118680 118712 119594 120383 120440 120484 121744 124404
54661 124404 127535 130373 132975 135537 137800 139464 140727 142007 143306 144134 143965 142600 140187 137121 133899
54646 133899 130967 128564 126642 124902 123042 121076 119310 117914 116645 115157 113440 111773 110375 109316
54632 109316 108593 108068 107451 106637 105873 105294 104505 103120 101574 100819 101087 101509 101154 100000 98627 97415 96404
54615 96404 95633 95178 94957 94814 94766 94973 95530 96408 97439 98249 98393 97859 97294 97428 98275 99109 99274 98811 98241
54596 98241 97917 97723 97375 96868 96508 96491 96598 96415 95785 94884 93894 92913 92219 92286 93241 94452 94999 94597 93849
54577 93849 93540 93828 94223 94210 93744 93197 92965 93174 93618 93857 93480 92537 91735 91930 93157 94372 94445 93386 92265
54558 92265 91951 92311 92773 93213 93925 94964 95972 96625 96882 96771 96260 95473 94760 94342 94088 93803 93630 93905
54540 93905 94694 95667 96460 96976 97317 97597 97884 98278 98859 99627 100459 101123 101364 101128 100739 100666 101037 101496 101638
54521 101638 101391 100850 99948 98587 97011 95750 95182 95386 96380 98155 100337 102192 103194 103452 103373 103111 102575
54504 102575 101842 101238 100955 100837 100659 100485 100623 101188 101860 102176 102102 102146 102803 104006 105311 106519 107793 109221
54486 109221 110602 111747 112620 113031 112636 111604 110894 111360 112696 113716 113616 112563 111121 109672 108527 108067
54470 108067 108350 108854 108912 108333 107407 106524 106040 106341 107560 109228 110518 111015 111034 110991 110680 109471 107277 105031
54452 105031 104002 104669 106387 108075 109084 109392 109222 108752 108205 108033 108742 110404 112360 113570 113457 112441
54436 112441 111529 111313 111519 111590 111506 111771 112669 113838 114722 115156 115319 115282 114995 114679 114897 116031 117871 119863
54418 119863 121586 122822 123414 123410 123270 123567 124445 125625 126884 128150 129200 129759 130061 130763 132018 133125 133509
54401 133509 133610 134265 135534 136738 137394 137503 137075 136089 134982 134457 134593 134619 133768 132013 129864 127855 126330
54384 126330 125339 124576 123797 123285 123502 124260 124790 124751 124563 124549 124424 123949 123460 123284 123113 122508 121685 121274 121499
54365 121499 122007 122302 122060 121292 120546 120709 122236 124696 127272 129372 130608 130630 129482 127868 126642 126105
54349 126105 125982 125789 125081 123750 122389 121944 122708 124081 125532 127154 128913 130140 130471 130669 131644 133166
54333 133166 134383 135186 136056 136832 136778 135867 135001 134786 134927 134967 134882 134675 134121 133186 132193 131394 130872 130905 131844 133509
54313 133509 135261 136768 138176 139465 140276 140546 140743 141258 142070 143087 144268 145313 145859 146141 146825 147939
54297 147939 148615 148183 147007 145933 145399 145314 145332 144960 143890 142448 141328 140735 140260 139636 138934 137893 135920
54280 135920 133138 130668 129333 128733 128137 127630 127701 128239 128677 128766 128544 127891 126736 125458 124421 123376 121961
54263 121961 120540 119838 119848 119836 119477 119337 120014 121309 122485 123039 123043 122882 122824 122734 122219 121133 119840 118852 118317
54244 118317 118023 117767 117538 117504 117933 118979 120382 121565 122235 122685 123319 124050 124417 124191 123658 123375 123751 124748
54226 124748 125914 126778 127167 127045 126278 124996 124009 124196 125408 126612 127232 127642 128123 128230 127670 127027 126931 127123
54208 127123 127114 127207 127988 129163 129849 129846 129794 130118 130593 130935 131106 130956 130210 128918 127497 126314 125727 126328 128428
54189 128428 131283 133574 134830 135771 137066 138412 139106 138938 138181 137142 136133 135514 135338 135181 134630 133803
54173 133803 133156 132905 132803 132415 131543 130482 129902 130259 131315 132428 133294 134107 134932 135308 134683 133101 131242
54156 131242 129864 129235 129024 128677 127950 127038 126132 125062 123563 121756 120107 118987 118519 118702 119352 120027 120384
54139 120384 120627 121239 122291 123332 124029 124570 125358 126519 127706 128238 127600 126130 125079 125516 127159 128672
54123 128672 129117 128698 128114 127764 127703 127850 127891 127416 126448 125574 125253 125257 125022 124304 123292 122270 121435 120869 120540
54104 120540 120431 120655 121202 121569 121136 120063 119392 119862 120990 121678 121479 120843 120305 119924 119501 118984 118593 118767
54086 118767 119877 121719 123383 124063 124040 124409 125666 126965 127154 126269 125543 125983 127428 129110 130617 131921
54070 131921 132825 132958 132332 131402 130510 129641 128856 128496 128715 129237 129910 131076 132937 134896 136132 136663 137260
54053 137260 138342 139539 140445 141214 142096 142824 142868 142214 141609 141979 143623 145917 147860 148991 149667 150365 151050
54036 151050 151481 151764 152065 151973 150872 149009 147557 147325 147897 148317 148212 147911 147772 147749 147532 146889 145916 144999
54018 144999 144398 143940 143390 143041 143505 144884 146616 148298 150199 152715 155676 158448 160429 161295 161149 160612
54002 160612 160337 160159 159160 156936 154405 152922 152872 153602 154441 155310 156482 158222 160645 163534 166339 168667
53986 168667 170718 172978 175515 177958 180121 182364 185227 188844 192804 196510 199745 202874 206414 210419
53972 210419 214556 218684 222930 227091 230548 233163 235774 239237 243268 246792 249250 250970 252394 253558
53958 253558 254383 254903 255011 254461 253343 252240 251615 251227 250325 248307 245143 241310 237383 233614 229885 226112
53942 226112 222460 219034 215626 212172 209230 207432 206555 205660 204268 202785 201593 200322 198462 196289 194633
53927 194633 193850 193431 192548 190726 188079 185243 183076 182112 182254 183130 184615 186753 189272 191616 193586 195557
53911 195557 197872 200311 202522 204763 207727 211538 215290 217799 218544 217674 215403 211900 207803 204287 202244
53896 202244 201514 201211 200753 200323 200332 200742 201179 201572 202400 204138 206640 209286 211721 214155 216860 219653 222197
53879 222197 224695 227811 231803 235993 239381 241665 243510 245873 249143 252876 256297 259109 261774 264902
53865 264902 268412 271551 273798 275547 277761 281124 285659 290979 296675 302538 308564 314708 320640 325915
53851 325915 330490 334853 339457 344187 348614 352576 356206 359457 361957 363411 363955 363977 363681 362901 361353
53836 361353 359042 356384 353822 351308 348340 344531 339971 334964 329626 323949 318022 311997 305948 299958
53822 299958 294238 288938 283936 278965 273887 268785 263963 259943 257091 255036 252683 249229 244934 240588
53808 240588 236516 232617 229065 226209 223785 221006 217694 214682 212720 211538 210375 208945 207318 205236
53794 205236 202362 199075 196319 194480 192968 191144 189208 187837 187305 187354 187686 188106 188266 187713 186357 184603
53778 184603 182943 181658 180918 180788 180965 180899 180510 180457 181334 182839 184154 184957 185482 185751 185470 184733 184163 184046
53760 184046 184014 183932 184436 185996 187993 189483 190570 192237 194918 198019 200878 203432 205764 207661 209003
53745 209003 210159 211632 213654 216322 219750 223791 227966 232073 236539 241757 247253 252013 255610 258527
53731 258527 261313 263862 265758 267073 268468 270491 272972 275148 276298 276203 275129 273535 271812 270167 268584
53716 268584 266825 264523 261359 257294 252703 248211 244235 240633 236920 232873 228825 225324 222670 220788
53702 220788 219355 217900 215948 213279 210066 206747 203878 202026 201400 201460 201237 200307 199132 198181 197173 195691
53686 195691 194196 193681 194350 195259 195417 194714 193623 192493 191401 190335 189256 188199 187420 187137 187068 186638 185801
53669 185801 185256 185559 186453 187384 188292 189419 190623 191453 191867 192412 193575 195287 197130 198726 199815 200243
53653 200243 200185 200299 201348 203520 206190 208505 210175 211512 212783 213901 214929 216458 218993 222139 224927
53638 224927 226930 228605 230481 232539 234547 236510 238482 240390 242332 244665 247416 249886 251268 251450
53624 251450 250914 250078 249114 248184 247432 246843 246418 246344 246609 246678 246042 245006 244400 244507 244784 244778 244804 245444 246738 248226
53604 248226 249565 250729 251634 251939 251355 250066 248693 247844 247734 248254 249220 250349 251118 251084 250559 250625 252098
53587 252098 254603 257017 258706 259962 261266 262565 263476 263898 264222 265037 266743 269307 272267 275056 277365
53572 277365 279175 280510 281373 281955 282692 284004 286021 288592 291436 294247 296800 299022 301002 302903 304936
53557 304936 307335 310207 313402 316627 319641 322293 324445 326054 327330 328699 330540 332973 335816 338680
53543 338680 341276 343696 346220 348721 350576 351478 352022 353015 354392 355347 355491 355256 355086 354898 354602 354533 354927
53526 354927 355408 355469 355147 354770 354331 353660 352961 352589 352363 351640 350137 348217 346302 344450 342639 341050 339863
53509 339863 339012 338268 337383 336087 334334 332628 331734 331827 332272 332476 332626 333214 334256 335472 337020 339305 342044
53492 342044 344190 345100 345288 345651 346362 347125 348211 350453 354023 357846 360755 362919 365640 369757 374688
53477 374688 379164 382607 385639 389446 394838 401724 409212 416243 422356 427980 433970 440905 448898 457923
53463 457923 468050 479294 491415 504017 516821 529801 543124 556945 571189 585536 599766
53452 599766 614143 629316 645786 663569 682391 701963 721941 741880 761505 780938 800411
53441 800411 819866 839035 857811 876218 894099 911236 927858 944577 961632 978489 994467
53430 994467 1009494 1024004 1038331 1052583 1066899 1081348 1095597 1109144 1121979 1134658 1147560
53419 1147560 1160397 1172638 1184154 1195142 1205565 1214962 1222779 1228763 1233039 1235994 1238008 1239126 1238976
53406 1238976 1237114 1233395 1227947 1220884 1212284 1202460 1192002 1181414 1170780 1159861 1148474 1136708
53394 1136708 1124791 1112826 1100616 1087773 1074062 1059644 1044959 1030371 1016052 1002190 989145
53383 989145 977189 966233 956039 946736 938856 932740 928070 924205 920864 918269 916702 916200 916722 918320
53369 918320 920990 924536 928818 934063 940717 948967 958461 968487 978502 988662 999918 1013353 1029214
53356 1029214 1046728 1064926 1083461 1102424 1121792 1141534 1162118 1184328 1208540 1234548 1262068
53345 1262068 1290886 1320446 1350024 1379623 1410253 1442867 1477442 1513487 1550953 1589994 1630150
53334 1630150 1670569 1711049 1752197 1794408 1837207 1879784 1921663 1962717 2002895 2042215 2080603
53323 2080603 2117527 2152145 2184148 2214117 2242749 2270003 2295298 2318157 2338215 2354884 2367687
53312 2367687 2376887 2383188 2386720 2386758 2382535 2373865 2360770 2343099 2320909 2294893 2265926 2234390 2200377
53299 2200377 2164423 2127512 2090301 2052732 2014501 1975592 1936250 1896848 1857947 1820184 1783767
53288 1783767 1748280 1713234 1678664 1644984 1612420 1580891 1550270 1520416 1491060 1462011 1433488
53277 1433488 1405963 1379722 1354916 1331960 1311373 1293080 1276319 1260428 1245364 1231284 1218076
53266 1218076 1205648 1194262 1184087 1174662 1165308 1155878 1146620 1137402 1127733 1117665 1108108 1099973 1093326
53253 1093326 1087595 1082348 1077617 1073708 1070950 1069498 1069241 1069979 1071771 1074869 1079168 1084021 1088871 1093951
53239 1093951 1100109 1108004 1117676 1128799 1141041 1154139 1167837 1181930 1196342 1211125 1226400 1242238
53227 1242238 1258501 1274823 1290744 1305853 1319803 1332356 1343526 1353549 1362558 1370301 1376276 1380112
53215 1380112 1381715 1381148 1378490 1373779 1366959 1357919 1346706 1333690 1319398 1304156 1287981 1270745 1252335
53202 1252335 1232711 1212000 1190578 1168901 1147163 1125210 1102831 1080047 1057045 1033974 1010913
53191 1010913 988041 965685 944126 923290 902703 881878 860832 840161 820511 802031 784398
53180 784398 767224 750253 733300 716393 700043 684992 671449 658759 646160 633740 622287
53169 622287 612227 603074 594084 585097 576453 568260 560148 551766 543169 534509 525619 516162 506105 495731
53155 495731 485205 474399 463255 452072 441241 430906 421054 411839 403495 395993 389027 382323 375750
53142 375750 369101 362088 354646 347043 339514 331976 324263 316483 308923 301727 294886 288470 282682 277675
53128 277675 273438 269824 266580 263387 260025 256490 252845 249046 245016 240813 236590 232514 228932 226410
53114 226410 225262 225051 224885 224289 223480 222737 221870 220478 218493 216222 214046 212225 210784 209453 207953 206547
53098 206547 206010 206803 208471 210102 211125 211328 210461 208460 205988 204092 203119 202451 201525 200623 200299 200438 200375
53081 200375 199818 199194 199079 199604 200452 201222 201751 202214 202906 203743 204082 203338 201793 200547 200516 201659 203302 204955
53063 204955 206553 208076 209377 210497 211804 213607 215709 217538 218655 219057 219111 219308 219921 220661 220836 220133
53047 220133 219112 218577 218495 218043 216758 215124 213795 212803 211894 211111 210459 209438 207669 205751 204704 204572
53031 204572 204361 203419 202141 201098 200268 199504 199030 198960 198870 198445 198059 198116 198241 197794 196891 196157 195682 195041 194239
53012 194239 193810 193880 193908 193616 193434 193641 193682 192890 191495 190361 189953 190031 190130 189884 189031 187651 186428 186182 186964
52993 186964 187936 188348 188343 188625 189466 190321 190383 189378 187824 186616 186356 186931 187704 188138 188216 188236 188298 188239 188087 188228
52973 188228 188878 189613 189826 189554 189365 189388 189003 187829 186559 186253 187026 187974 188364 188365 188499 188853 189121 189124 189022 189116
52953 189116 189583 190286 190799 190799 190474 190339 190614 191037 191369 191740 192304 192882 193274 193711 194604 195902 196992 197257 196567
52934 196567 195270 193924 192997 192631 192646 192883 193412 194259 195096 195590 196045 197262 199540 202090 203732 204069 203741
52917 203741 203629 204080 204928 205943 206996 207922 208444 208331 207601 206540 205568 205017 204941 205092 205172 205114 205038 204981 204840
52898 204840 204647 204685 205141 205788 206189 206159 205779 205076 204019 202871 202170 202141 202341 202143 201477 200876 200793 201034 200926
52879 200926 200013 198554 197313 196844 197056 197513 197967 198366 198540 198329 198034 198241 198932 199247 198530 197300 196641 196780
52861 196780 196812 195841 193909 191688 189765 188491 188168 188921 190431 192071 193324 193962 193932 193305 192361 191549 191240
52844 191240 191462 191867 192002 191702 191243 191050 191243 191592 191912 192328 192993 193757 194346 194797 195421 196214 196587 195985 194762
52825 194762 194110 194920 196812 198483 198960 198340 197391 196793 196914 197942 199770 201829 203383 204152 204441 204629 204747
52808 204747 204622 204249 203890 203949 204787 206455 208541 210474 212060 213466 214594 214890 214094 212820 211847 211043 209587
52791 209587 207276 204970 203460 202415 200851 198356 195434 192834 190965 189833 189105 188181 186593 184484 182495
52776 182495 181142 180465 180274 180462 180996 181883 183184 184812 186188 186474 185415 183771 182629 182403 182731 183148
52760 183148 183493 183712 183699 183457 183169 182971 182841 182803 183000 183466 184052 184789 186035 187935 189890 190945 190749 189786
52742 189786 188642 187438 186114 184841 183781 182725 181409 180034 179040 178402 177645 176621 175725 175212 174799 174279
52726 174279 173983 174182 174467 174334 174101 174509 175541 176440 176892 177414 178324 179133 179400 179539 180174 181172 181948 182389
52708 182389 182827 183291 183399 182917 181899 180393 178565 177061 176614 177183 177979 178455 178776 179234 179762 180275 180951
52691 180951 181816 182469 182614 182628 183153 184311 185642 186705 187423 187988 188718 189927 191613 193235 194097 194042 193661
52674 193661 193755 194708 196317 198070 199501 200368 200645 200459 200068 199846 200061 200618 201062 200913 199971 198332 196230
52657 196230 193930 191711 189915 188896 188743 189001 188909 188154 187231 186853 187204 188040 189270 190830 192146 192480 192015
52640 192015 191871 192632 193415 193024 191604 190441 190330 190867 191382 191910 192915 194471 196084 197209 197723 197926 198164
52623 198164 198408 198223 197297 195957 195013 194997 195690 196398 196614 196329 195788 195121 194321 193521 193048 193025 193077 192710 191964
52604 191964 191326 190984 190597 189972 189565 189953 191128 192645 194224 195776 197090 198046 199045 200679 202901 204979
52588 204979 206413 207466 208592 209760 210622 211056 211168 210922 210182 209094 208136 207682 207679 207866 208163 208723 209604 210589
52570 210589 211421 212128 212988 214149 215425 216473 217024 216946 216271 215249 214159 212959 211302 209150 207179 206285
52554 206285 206674 207633 208219 208019 207293 206520 205876 205123 204072 203067 202765 203321 204126 204557 204751 205247 206082 206683
52536 206683 206640 206183 205820 205804 206079 206468 206769 206826 206569 205961 204996 203950 203496 204232 206004 207953 209309 210004
52518 210004 210541 211462 212867 214272 214940 214595 213799 213328 213275 213030 212166 210939 209876 209281 209254 209811 210676 211253
52500 211253 211132 210555 210120 210113 210281 210236 209898 209466 209060 208552 207879 207428 207765 208820 209643 209302 207820 205918 204114
52481 204114 202588 201722 201985 203141 204184 204378 203923 203409 203085 202967 203126 203429 203372 202670 201875 201943 203297 205597
52463 205597 208248 210771 212816 214223 215098 215613 215743 215349 214434 213199 212026 211542 212387 214577 217216 219219
52447 219219 220235 220647 220864 221031 221372 222250 223650 224891 225144 224229 222754 221474 220585 219703 218515 217294
52431 217294 216567 216367 216147 215512 214741 214360 214481 214788 215005 215111 215245 215633 216384 217154 217249 216469 215671 216000 217605
52412 217605 219511 220784 221445 222115 223114 224147 224739 224853 225053 225998 227704 229429 230442 230796 231068 231489 231706
52395 231706 231390 230731 230149 229753 229263 228333 226887 225198 223680 222540 221674 220983 220594 220568 220578 220234 219689 219522
52377 219522 219973 220650 221084 221186 221012 220473 219603 218877 218856 219591 220644 221675 222761 224052 225319 226053 226008 225539
52359 225539 225307 225665 226424 227249 228089 229101 230269 231378 232298 233145 234168 235695 238105 241509 245408 248961
52343 248961 251774 254215 256788 259389 261360 262158 261788 260652 259167 257564 255980 254656 253890 253689 253596 253130
52327 253130 252409 252041 252348 252931 253170 252889 252413 252193 252606 253873 255832 257880 259460 260594 261762 263281
52311 263281 265061 266928 268918 271148 273537 275784 277643 279241 281093 283585 286328 288281 288824 288526 288511
52296 288511 289197 290138 291007 292075 293488 294756 295511 296302 297978 300492 302990 305024 306984 309267 311731
52281 311731 314275 317297 321108 325335 329487 333803 338955 345082 351678 358353 365154 372114 379099 386279
52267 386279 394260 403476 413765 424732 436236 448353 461126 474521 488329 501963 514808 527014
52255 527014 539576 553237 567602 581728 595306 608830 622782 637173 651796 666426 680659
52244 680659 693994 706248 717717 728869 740029 751282 762375 772709 781712 789296 795768 801344
52232 801344 805982 809610 812166 813444 813295 812014 810178 807956 804995 801162 797023 793316 790187 787314
52218 787314 784630 782579 781663 781981 783297 785406 788264 791728 795347 798740 802249 806871 813159 820403 827355
52203 827355 833679 840145 847390 855184 863166 871648 881120 891344 901485 910930 919481 926977 933362 939094
52189 939094 944900 950923 956538 961129 964648 967193 968399 967646 964696 959884 953747 946729 939165 931291
52175 931291 923161 914656 905618 895985 885872 875655 865908 857041 848982 841344 833956 827052 820800 814856
52161 814856 808634 802021 795520 789686 784685 780531 777408 775455 774388 773681 773028 772428 771950 771754 772249 773785
52145 773785 776157 778825 781609 784670 787681 789677 790169 789944 790189 791156 792269 793351 794957 797384 800014
52130 800014 802018 803387 804899 807222 810202 812986 814715 815233 815111 814849 814156 812360 809444 806200 803156
52115 803156 799849 795525 790266 785020 780669 777429 775004 772858 770462 767727 765245 763736 763160 762756 762039
52100 762039 761367 761332 761927 762663 763284 764062 765480 767832 770992 774347 777067 778692 779482 780144 781331 783419
52084 783419 786463 790128 793913 797675 801680 805879 809545 812147 814273 816993 820553 824475 828895 834748
52070 834748 842311 850524 858372 866201 874950 884776 895402 907379 921829 938859 957157 975415 993458
52057 993458 1011754 1030452 1049268 1067857 1085892 1103074 1119346 1134937 1150088 1164940 1179607
52046 1179607 1193902 1206990 1217898 1226574 1233866 1240208 1244934 1247351 1247945 1247824 1247312 1245762 1242692 1238458
52032 1238458 1233708 1228584 1222590 1215019 1205575 1194788 1183711 1172879 1161778 1149793 1137500 1126370
52020 1126370 1117138 1109163 1101597 1094601 1088938 1084875 1082097 1080466 1080180 1081180 1082948 1085137 1088004 1092023
52006 1092023 1097342 1103809 1111244 1119361 1127631 1135633 1143487 1151604 1159998 1168165 1175709 1182687 1189215 1195141
51992 1195141 1200361 1205061 1209235 1212225 1213285 1212474 1210509 1207716 1203636 1197724 1189927 1180475 1169594 1157671
51978 1157671 1145217 1132333 1118586 1103810 1088672 1074042 1060063 1046262 1032432 1018924 1006169
51967 1006169 994298 983133 972171 960631 948006 934714 921881 910381 900241 890957 882021 873058
51955 873058 863800 854172 844290 834237 823995 813670 803586 794044 785005 776096 766836 756854 746034
51942 746034 734543 722622 710371 697827 685205 672877 661063 649694 638684 628201 618564 609907
51930 609907 602027 594480 586723 578232 568683 558231 547642 537894 529407 521637 513641 505094 496546 488615
51916 488615 481149 473385 464806 455705 447000 439668 434169 430222 427199 424842 423452 423298 424162 425722 428057
51901 428057 431297 434940 438032 440161 441831 443685 445615 446834 446745 445666 444741 445044 446622 448524 449922
51886 449922 451009 452582 455057 458403 462821 468839 476658 485982 496681 509087 523379 539077 555434
51873 555434 571850 587559 601289 611745 618266 620680 618750 612276 601753 588502 573986 559066
51861 559066 543902 528363 512542 496949 482245 468761 456316 444508 433080 422070 411825
51850 411825 402844 395331 388879 382887 377362 372979 370239 368967 368732 369229 369903 369804 368464 366633 365473
51835 365473 365125 364649 363249 360926 357898 354137 349810 345663 342481 340417 339150 338470 338353 338558 338552 337948
51819 337948 336950 336293 336732 338465 341009 343670 346075 348253 350340 352402 354492 356552 358256 359194 359304
51804 359304 358887 358121 356840 355003 353106 351817 351238 350829 350128 349337 349063 349577 350486 351165 351393 351458 351672 351981
51786 351981 352069 351652 350521 348547 345860 342890 339892 336562 332508 328042 324020 320808 317955 315147 312942
51771 312942 312021 312086 312171 311981 312180 313213 314423 314776 314054 312849 311646 310448 309279 308455 308056 307589 306633
51754 306633 305643 305618 306837 308331 308860 308198 307218 306834 307183 307857 308596 309577 311057 312882 314397 314955 314620
51737 314620 314218 314473 315145 315302 314448 313073 311986 311466 311265 311153 311055 310856 310429 309867 309378 309002 308703 308670 309140
51718 309140 309893 310373 310469 310846 312239 314613 317259 319512 321186 322523 324017 326109 328771 331465 333828
51703 333828 336257 339438 343343 347145 350148 352313 353654 353649 351730 348120 343714 339184 334672 330321 326581
51688 326581 323666 321065 318037 314546 311329 308980 307255 305568 303966 303239 303983 305849 307966 309962 312292
51673 312292 315601 319986 324929 329659 333484 336003 337279 337820 338298 339267 341001 343374 345816 347667 348707
51658 348707 349132 348943 347735 345349 342356 339548 337218 335380 334329 334286 334594 334067 332296 330029 328101 326619
51642 326619 325482 324963 325217 325721 325789 325303 324407 322901 320622 318202 316617 315997 315546 314703 313712 312910 312148
51625 312148 311226 310351 309737 309167 308328 307311 306389 305616 304986 304756 305232 306377 307971 310031 312719 315913 319253
51608 319253 322610 326218 330299 334780 339381 343742 347463 350247 352065 353079 353347 352744 351202 348889 346128
51593 346128 343212 340309 337490 334931 333088 332492 333191 334511 335548 335802 335227 333902 331960 329766 327729
51578 327729 325909 324114 322393 321118 320453 320058 319453 318380 316695 314251 311245 308453 306621 305606 304404
51563 304404 302188 299155 296293 294437 293668 293504 293445 293228 292678 291621 290067 288370 287037 286348 286216 286316
51547 286316 286244 285722 284834 283994 283480 283145 282857 283078 284514 287192 290397 293648 297242 301555 306403 311481
51531 311481 316893 322463 326824 328183 326281 322983 320546 319657 319464 319118 318782 319246 321014 323930 327470
51516 327470 331244 335236 339650 344568 349737 354699 359180 363410 368091 373860 380672 387770 394337 400087
51502 400087 405210 410045 415119 421211 428906 438057 448085 458839 470742 483859 497195 509229 518949
51489 518949 526187 531190 534255 535728 535949 534892 531984 526477 518238 508166 497680 487661 478073 468760
51475 468760 460258 453331 447812 442528 436538 429861 422758 414941 406118 396962 388760 382114 376502 371147
51461 371147 365832 360777 356192 352131 348460 344806 340827 336703 332987 329760 326320 322079 317507 313711
51447 313711 311141 309179 307079 304897 303276 302604 302691 303111 303560 303926 304254 304698 305277 305680 305537 304949 304474
51430 304474 304455 304604 304454 303954 303293 302410 301129 299726 298827 298611 298521 297999 297181 296607 296513 296599 296336 295327 293542
51411 293542 291384 289349 287490 285472 283272 281399 280075 278611 276173 272996 270266 268720 267941 267198 266527
51396 266527 266635 267999 270348 272956 275195 276863 278201 279676 281604 283894 286153 288126 290092 292754
51382 292754 296635 301677 307535 314081 321219 328262 334035 337929 340426 342246 343415 343629 343201 342836 342500
51367 342500 341196 338143 333712 328989 324740 321049 317640 314258 310836 307449 304143 300876 297756 295201
51353 295201 293583 292804 292533 292764 293678 294990 295972 296331 296644 297685 299639 302143 304721 306959 308619 309916
51337 309916 311423 313437 315682 317907 320483 323951 328199 332488 336319 339951 344039 349009 354863 361439
51323 361439 368769 377159 386857 397711 409410 422056 436179 452013 468996 486271 503439 520504
51311 520504 537186 552606 565695 575743 582549 586185 586709 584121 578607 570653 560692 548712 534507
51298 534507 518346 501021 483233 465352 447863 431529 416737 403112 390175 378045 367095
51287 367095 357242 348105 339645 332111 325432 319203 313307 308144 304164 301477 299871 298914 298110 297287 296756
51272 296756 296701 296517 295215 292527 289176 286075 283701 282262 281781 281716 281034 279219 276989 275604 275514 275991 276012
51255 276012 275260 274252 273643 273518 273376 272860 272372 272661 273813 274971 275227 274501 273381 272435 271998 272327 273422
51238 273422 274725 275486 275531 275306 275089 274613 273772 273242 273817 275269 276458 276646 276175 275742 275573 275749 276797 279226
51220 279226 282636 285937 288489 290496 292265 293724 294883 296153 297791 299466 300755 301728 302653 303468 304023
51205 304023 304558 305434 306579 307678 308733 309940 311075 311539 311015 309694 307818 305428 302598 299624 296880
51190 296880 294753 293567 293237 293076 292418 291358 290428 289682 288661 287272 285959 284858 283528 281919 280935 281424
51174 281424 283004 284497 285283 285667 286030 286214 285782 284513 282557 280430 278922 278663 279616 281052 282126 282422
51158 282422 282048 281435 281051 281154 281691 282459 283358 284443 285809 287478 289392 291420 293409 295279 297033 298685
51142 298685 300247 301830 303610 305554 307295 308432 308960 309247 309557 309726 309389 308448 307196 305987 304902 303812
51126 303812 302663 301601 300861 300678 301206 302265 303179 303225 302427 301620 301483 301781 301859 301661 301740 302362 303099 303446 303464
51107 303464 303539 303728 303608 302761 301349 300180 300118 301335 303160 304729 305624 305844 305520 304988 304850 305443 306276 306441
51089 306441 305600 304181 302674 301235 299986 299153 298689 298231 297638 297215 297236 297611 298229 299242 300741 302448 303954
51072 303954 304957 305153 304316 302737 301225 300365 300121 300358 301292 303034 305153 307171 309178 311423 313580 315009
51056 315009 315634 316009 316570 317315 318195 319241 320266 320919 321266 321917 323331 325248 326990 328144 328790 329277 329981
51039 329981 331241 333263 335946 338798 341191 342868 344170 345540 346793 347214 346512 345363 344715 344801 345171 345440
51023 345440 345616 345824 346224 347190 349132 351891 354582 356226 356529 356035 355689 356185 357546 359270 361005 363027
51007 363027 365849 369459 373238 376697 380008 383713 388111 393169 398910 405679 413889 423438 433400 442435
50993 442435 449698 455379 460333 465273 470385 475590 480862 486175 491283 495715 499011 500949 501599 501170 499847
50978 499847 497714 494753 490914 486319 481550 477518 474730 472643 470020 466008 460707 454767 448843 443543
50964 443543 439419 436600 434656 433128 432101 432031 433204 435560 438890 442946 447520 452611 458375 464704 471034
50949 471034 476859 482316 487988 494202 500678 506794 512034 516355 520280 524474 529045 533451 537247 540645
50935 540645 544071 547469 550427 552856 555201 558090 561999 567119 573241 579947 587193 595538 605559 617244
50921 617244 630215 644278 659332 674962 690581 705905 721046 736340 752391 769952 789353
50910 789353 810334 832881 857869 886272 918087 952657 989727 1029345 1070949 1113581 1157039
50899 1157039 1201803 1247635 1293182 1337365 1380279 1422166 1462219 1499062 1531913 1560665 1585189
50888 1585189 1605224 1620768 1632018 1639043 1641897 1641068 1637522 1632308 1626193 1619407 1611531 1601848 1590091
50875 1590091 1576780 1562675 1548033 1532531 1515763 1497675 1478606 1458996 1438890 1417792 1395111
50864 1395111 1370677 1344548 1316562 1286631 1255371 1223807 1192317 1160465 1128102 1096011 1065155
50853 1065155 1035825 1007928 981617 957160 934611 914059 895793 879661 864596 849429 834108
50842 834108 819616 806761 795474 785283 776016 767881 761071 755422 750447 745749 741360 737530 734251
50829 734251 731357 729085 728028 728316 729301 730331 731502 733346 736213 740251 745564 751987 759056 766645 775255
50814 775255 785260 796270 807790 820170 834252 850319 867984 886887 906889 927734 949332
50803 949332 972389 998036 1026659 1057616 1090258 1124738 1161692 1201623 1244909 1292080 1343760
50792 1343760 1400422 1462232 1528967 1600178 1675706 1756000 1841589 1932262 2027071 2124980 2225119
50781 2225119 2326514 2428102 2529040 2628393 2724321 2814088 2895139 2965928 3025569 3073219 3108211
50770 3108211 3130568 3141000 3140459 3129871 3110251 3082998 3050050 3013734 2976284 2939438 2904489 2872303
50758 2872303 2842897 2815233 2788040 2760804 2733399 2704789 2672937 2636313 2594793 2548601 2497095
50747 2497095 2439403 2375921 2308326 2238183 2166217 2093004 2019605 1947210 1876606 1808395 1743389
50736 1743389 1682439 1625984 1574014 1526357 1482783 1443011 1406941 1374863 1347170 1323842 1304351
50725 1304351 1288096 1274653 1263522 1253922 1245125 1236868 1229220 1222100 1215169 1208135 1200891 1193315 1185258
50712 1185258 1176788 1168126 1159166 1149368 1138422 1126785 1115148 1103464 1090941 1077143 1062757 1049015
50700 1049015 1036452 1024587 1012853 1001565 991681 983766 977592 972824 969614 968207 968391 969977 973617
50687 973617 980454 990863 1004125 1019492 1036924 1056597 1078392 1102337 1128972 1158681 1191074 1225570
50675 1225570 1262237 1301519 1343517 1388126 1435506 1485639 1537673 1590505 1643865 1698012 1752451
50664 1752451 1805815 1857151 1906447 1953566 1997379 2036440 2069974 2097781 2119517 2134499 2142004
50653 2142004 2141589 2133375 2118217 2097374 2072015 2043331 2013007 1982983 1954611 1928541 1905449 1886139
50641 1886139 1870584 1857564 1845756 1834738 1824447 1814107 1802270 1787650 1769515 1747603 1722222
50630 1722222 1694277 1664726 1633963 1601980 1568941 1535406 1502259 1470716 1442047 1416865 1394832
50619 1394832 1375395 1358629 1345112 1335324 1329578 1328181 1331039 1337299 1346023 1357238 1371770 1389928
50607 1389928 1410706 1432352 1453440 1473411 1492524 1511378 1530241 1548756 1566454 1583494 1600609
50596 1600609 1618414 1637005 1656144 1675422 1694318 1712501 1730225 1748141 1766653 1785698 1805197
50585 1805197 1825439 1846963 1870260 1895557 1922620 1950748 1979307 2008307 2038217 2069121 2100389
50574 2100389 2131235 2161236 2190102 2217247 2241894 2263550 2282147 2297780 2310417 2319943 2326475 2330519
50562 2330519 2332511 2331948 2327152 2316394 2299483 2278160 2255003 2232151 2210987 2192423 2177026 2164960
50550 2164960 2156011 2149630 2144864 2140474 2135451 2129425 2122394 2113991 2103119 2088341 2068606 2043553 2013273
50537 2013273 1977979 1938053 1894201 1847281 1797975 1746920 1695183 1644141 1594631 1546615 1500045
50526 1500045 1455729 1414787 1377409 1342810 1310394 1280415 1253401 1229498 1208599 1190632 1175427
50515 1175427 1162740 1152698 1145852 1142382 1141552 1142323 1144348 1148021 1153778 1161653 1171352 1182424 1194499
50502 1194499 1207677 1222548 1239507 1258241 1278228 1299588 1322945 1348529 1375918 1404688 1434758
50491 1434758 1465945 1497688 1529587 1561841 1594812 1628338 1661896 1695327 1729140 1764094 1800736
50480 1800736 1839327 1880027 1923105 1969076 2018586 2072036 2129318 2190062 2254103 2321635 2392927
50469 2392927 2467986 2546482 2627816 2711359 2796817 2884325 2973960 3065022 3156025 3245510 3332612
50458 3332612 3416620 3496229 3569568 3634864 3690627 3735189 3766661 3783820 3786844 3776729 3754114
50447 3754114 3719097 3672219 3615158 3550182 3479274 3404226 3327468 3252287 3181913 3118408 3062503
50436 3062503 3014418 2974786 2944765 2925237 2915819 2914626 2918959 2926248 2934389 2941387 2944917 2942270 2930704
50423 2930704 2907965 2872781 2825058 2765678 2696107 2618183 2534050 2445945 2355841 2265355 2175968
50412 2175968 2089134 2006012 1927167 1852623 1782170 1715633 1653055 1594839 1541574 1493536 1450327
50401 1450327 1411108 1375178 1342321 1312741 1286855 1264984 1247018 1232387 1220567 1211572 1205742 1203098
50389 1203098 1203179 1205526 1210043 1216767 1225556 1236146 1248315 1261871 1276654 1292669 1309891 1327711 1344752
50376 1344752 1359516 1371224 1379951 1386174 1390391 1393014 1394327 1394620 1394541 1395228 1397805 1402727 1409731 1418324
50362 1418324 1428219 1439548 1452889 1468902 1487615 1508288 1530408 1554718 1582774 1615441 1652229
50351 1652229 1692165 1734750 1779809 1826857 1875034 1923510 1971620 2018659 2063774 2106154 2145275
50340 2145275 2181018 2213386 2241860 2265023 2281137 2289154 2288908 2280329 2263029 2236954 2203119 2163286
50328 2163286 2119030 2071399 2021331 1970097 1919305 1870633 1825462 1784578 1748302 1716881 1690619
50317 1690619 1669560 1653406 1641953 1635238 1632928 1633719 1635689 1637138 1636845 1633700 1626551 1614513 1597236
50304 1597236 1574906 1548113 1517608 1483997 1447782 1409835 1371566 1334284 1298530 1264277 1231587
50293 1231587 1200722 1171815 1144835 1119647 1095603 1071236 1045149 1017435 989702 963466 939025
50282 939025 916139 895215 877144 862178 849576 838432 828512 820140 813535 808429 804350 801172 799305
50269 799305 799238 800819 803096 804922 805753 805927 806295 807596 810075 813536 817650 822074 826319 829813 832348
50254 832348 834345 836427 838804 841327 843967 846842 849799 852475 854931 857814 861612 866019 870349 874391
50240 874391 878531 883218 888605 894671 901375 908661 916477 924874 933975 943833 954360 965384 976719
50227 976719 988231 999783 1010916 1020486 1026842 1028675 1025806 1019176 1010247 1000470 991065 982842 976004
50214 976004 970238 965148 960635 956969 954629 954122 955781 959500 964640 970341 976138 982339 989699 998679
50200 998679 1009082 1020464 1032717 1046025 1060311 1074992 1089352 1102960 1115666 1127387 1138116
50189 1138116 1148001 1157231 1165768 1173329 1179579 1184190 1186679 1186346 1182594 1175355 1165070 1152217 1136990
50176 1136990 1119628 1100949 1082263 1064777 1049185 1035676 1023795 1012179 999041 983469 966054
50165 966054 947880 929211 909722 889693 870136 851632 833815 816254 799250 783325 768465
50154 768465 754384 741201 729306 718757 709245 700521 692431 684686 677151 670327 664998 661170 657845
50141 657845 654097 650097 646712 644356 642615 640944 639238 637509 635421 632596 629260 626136 623573 621203
50127 621203 618681 616356 614736 613583 612089 610023 608153 607350 607622 608257 608622 608617 608562 608917 609984 611697 613756
50110 613756 615985 618409 621003 623674 626534 629900 633914 638461 643574 649513 656258 663338 670486 678151
50096 678151 686955 696880 707434 718523 730802 745197 762307 782160 804229 827726 852126 877423
50084 877423 903842 931522 960633 991455 1023972 1057581 1091531 1125412 1158826 1190871 1220588
50073 1220588 1248036 1274323 1300314 1325570 1348674 1368242 1383345 1393181 1396788 1393362 1382840 1366029
50061 1366029 1343984 1317362 1286605 1252711 1217352 1182042 1147521 1114128 1082318 1052458 1024511
50050 1024511 998445 974644 953349 933911 915192 896693 878804 862091 846827 833090 820716
50039 820716 809153 797935 787258 777575 768709 760075 751765 744637 739095 734570 730490 727085 724758
50026 724758 723275 722134 721352 721332 722150 723394 724507 725101 725200 725391 726414 728359 730553 732396 733898 735181
50010 735181 736038 736317 736287 736169 735716 734741 733693 733256 733593 734369 735116 735185 733839 731044 727860 725499 724252
49993 724252 723848 724310 725676 727292 728443 729573 731812 735251 738743 741692 745004 749703 755485 761414 767480
49978 767480 774583 783171 792698 802520 812779 824109 836639 849589 861963 873651 885644 898994
49966 898994 913805 929531 945957 963237 980979 998104 1013947 1028949 1043888 1058841 1073266
49955 1073266 1086690 1098828 1109376 1118216 1125646 1131913 1136607 1138856 1137979 1133586 1125203 1112296 1094703
49942 1094703 1072764 1047129 1018788 989127 959489 930656 903076 877430 854397 833829 814814
49931 814814 796829 780378 766180 754148 743503 733522 723707 713558 702801 691840 681396 671549
49919 671549 661577 650990 640275 630255 620957 611641 602008 592864 585334 579589 574664 569460 563759
49906 563759 558240 553690 550227 547168 543632 539343 534937 531429 529337 528341 527752 527202 526858 527081 527975 529277
49890 529277 530680 532234 534348 537329 540997 544872 548645 552260 555584 558242 559880 560434 560110 559313 558584
49875 558584 558248 557928 556708 554113 550729 547503 544536 540992 536254 530751 525400 520517 515682 510659 506065
49860 506065 502831 501141 500253 499459 498858 498894 499379 499538 499065 498664 499291 501263 504312 508024 511765 514612 516112
49843 516112 517086 519014 522467 526643 530627 534582 539209 544417 549073 552169 553871 555241 557076 559153
49829 559153 560601 560824 559907 558228 556007 553354 550420 547196 543370 538739 533615 528451 523231 517690 512068
49814 512068 507069 503048 499697 496676 494003 491694 489662 488247 488215 489769 492080 494324 496792 500354 505169
49799 505169 510575 516029 521474 526868 531987 536759 541282 545480 549261 552979 557200 561848 566110 569285
49785 569285 571299 572259 572157 571218 570034 568938 567638 565777 563459 560893 557931 554454 550885 547785 545082
49770 545082 542270 539315 536872 535495 535035 534953 534890 534733 534392 533810 533140 532791 533255 534898 537778 541587 545817
49753 545817 550055 554176 558211 562062 565376 567743 569036 569496 569431 568877 567653 565734 563473 561355 559552
49738 559552 557707 555223 551857 548060 544603 541810 539273 536416 533062 529348 525414 521547 518284 515813
49724 515813 513440 510332 506792 504083 502782 502049 500906 499604 499132 499833 501150 502476 503634 504635 505586
49709 505586 506826 508745 511424 514757 518751 523263 527590 530885 533023 534589 535945 536816 536896 536402 535828
49694 535828 535476 535397 535428 535026 533441 530358 526319 522316 519037 516556 514543 512639 510772 509179 508032 507082
49678 507082 505988 505015 505005 506374 508440 510080 510958 511791 513468 516173 519394 522508 525181 527339 529034
49663 529034 530485 532111 534297 537109 540386 544114 548424 553138 557648 561534 565040 568633 572297 575656
49649 575656 578570 581083 582900 583519 582965 581810 580356 578346 575831 573727 572986 573539 574536 575465 576501 577790
49633 577790 578870 579067 578336 577509 577661 579200 581599 584115 586668 589861 594197 599472 604968 610008 614362
49618 614362 618371 622725 627880 633711 639980 647013 655343 664621 673388 680227 684777 687480 688848 689323
49604 689323 689429 689575 689841 690168 690507 690655 690433 690232 690816 692090 692606 690838 686624 680815 673997 666304 658180
49587 658180 650425 643548 637703 633143 629956 627441 624633 621576 619371 618730 619197 619998 620865 621652 621848 621095
49571 621095 619769 618464 617159 615374 612926 610100 607187 604223 601154 597975 594804 591986 589973 588889
49557 588889 588298 587630 586759 586056 585937 586495 587442 588306 588719 588642 588308 588073 588384 589653 591877 594497 597006 599530
49539 599530 602344 604997 606614 607181 607790 609274 611243 612865 613996 614982 615823 616278 616535 617127 618285 619879
49523 619879 621898 624409 627035 629030 630016 630352 630672 631362 632452 633741 634955 635946 636779 637560 638353 639375
49507 639375 641003 643326 646012 648947 652624 657403 662664 667357 671256 674999 678857 682189 684302 685277
49493 685277 685646 685724 685508 684905 683858 682525 681432 681051 681116 680858 680096 679589 680052 681309 682738 684079 685339
49476 685339 686387 687242 688476 690745 694036 697878 702217 707541 714136 721711 729813 738304 747388 757505
49462 757505 769211 782731 797464 812163 825749 837833 848464 857571 864700 869180 870705 870067 869199
49449 869199 869980 872819 876649 880318 883597 886635 888941 889362 886932 881420 873206 863047 851988 841112
49435 841112 831046 821695 812544 803278 794130 785727 778669 773255 769487 767076 765361 763503 761075 758464
49421 758464 756469 755490 755299 755483 755758 755776 755101 753628 751776 750012 748429 747044 746258 746551 747756 749049
49405 749049 749776 750120 750874 752683 755501 758614 761209 762973 764155 765022 765485 765391 764906 764300 763583 762725 762058
49388 762058 761914 761929 761322 760036 758991 758897 759332 759455 759193 759134 759541 760108 760673 761513 762830 764487 766458 769102
49370 769102 772700 777043 781811 787099 793183 799916 806829 813748 820926 828410 835725 842484 848966 855591
49356 855591 861899 866621 869043 869899 870542 871506 872408 873133 874428 877089 881129 886151 892132 899280 907385
49341 907385 915997 925207 935577 947117 958888 969984 980419 990640 1000543 1009588 1017742 1025623 1033541
49328 1033541 1040925 1047018 1051828 1055973 1059722 1062537 1063599 1062573 1059809 1056065 1052130 1048507 1045197 1041835
49314 1041835 1038176 1034443 1031038 1027966 1024818 1021474 1018622 1017293 1017845 1019574 1021392 1022776 1023947 1025249
49300 1025249 1026567 1027440 1027621 1027307 1026773 1025875 1024087 1021007 1016751 1011900 1007133 1002897 999221 995774 992235
49285 992235 988677 985452 982659 979959 977102 974425 972479 971175 969630 966999 963317 959465 956434 954620
49271 954620 953662 952842 951787 950895 951052 952849 956116 960244 964881 970234 976656 983916 990817 995657 997251
49256 997251 995567 991392 985525 978503 970901 963319 955844 947860 938853 929279 920282 912527 905702 899297
49242 899297 893535 889129 886239 884048 881576 878665 875926 873886 872526 871577 870846 870116 869125 867918 866921
49227 866921 866275 865373 863501 860797 858029 855460 852538 848930 845279 842567 841104 840510 840470 841025 842278 844160
49211 844160 846455 848763 850527 851412 851725 852225 853520 855722 858551 861478 863808 865011 865119 864699 864385 864561
49195 864561 865477 867425 870598 874884 879919 885387 891213 897461 903975 910132 915004 917804 918191 916190 912059
49180 912059 906334 899831 893357 887335 881700 876094 870222 864273 859083 855683 854526 855239 857139 859708
49166 859708 862499 865069 867402 870101 873735 878139 882781 887592 892948 898928 905157 911420 917865 924521
49152 924521 931139 937671 944404 951369 958141 964591 971393 979342 988395 997892 1007499 1017430 1027851 1038592
49138 1038592 1049556 1060946 1072848 1084868 1096474 1107642 1118874 1130488 1142048 1152691 1162125
49127 1162125 1171107 1180694 1191031 1201179 1210252 1218483 1226942 1236445 1247000 1258254 1270117 1282825
49115 1282825 1296593 1311411 1327254 1344392 1363383 1384589 1407708 1431846 1456052 1479602 1501720
49104 1501720 1521280 1537105 1548666 1556473 1561865 1566368 1570966 1575756 1580368 1584774 1589503 1594957 1600812
49091 1600812 1606415 1611638 1616960 1622796 1629152 1635982 1643475 1651732 1660523 1669702 1679707 1691274 1704580
49078 1704580 1718886 1733111 1746644 1759612 1772563 1786066 1800537 1816173 1832907 1850438 1868405
49067 1868405 1886590 1904977 1923719 1943067 1963246 1984291 2006056 2028413 2051354 2074792 2098513
49056 2098513 2122674 2148278 2176748 2208867 2244473 2283342 2326039 2373703 2427408 2488138 2557067
49045 2557067 2635232 2722751 2818346 2919006 3019695 3114414 3199605 3277136 3352202 3426152 3491269
49034 3491269 3534065 3544872 3524563 3482505 3428882 3368837 3302187 3226747 3141660 3048835 2952536
49023 2952536 2857830 2768877 2688034 2616021 2552592 2496990 2448196 2405265 2367638 2335016 2306781
49012 2306781 2281745 2258790 2237781 2219489 2204401 2191824 2180452 2169629 2159601 2150581 2142159 2133920
49000 2133920 2126160 2119521 2114126 2109576 2105645 2102505 2100193 2098323 2096454 2094422 2092162 2089626 2087113 2085418
48986 2085418 2085280 2086743 2089219 2092032 2094694 2096835 2098115 2098213 2096906 2094319 2091202 2088630 2087110 2086210 2085342
48971 2085342 2084763 2085409 2087830 2091674 2096236 2101123 2106269 2111628 2117035 2122263 2127089 2131448 2135527 2139630
48957 2139630 2144013 2148951 2154821 2161799 2169546 2177488 2185435 2193615 2202117 2210606 2218695 2226331 2233729 2241153
48943 2241153 2248825 2256723 2264434 2271476 2277868 2284115 2290497 2296698 2302178 2306554 2309495 2310707 2310342 2309086
48929 2309086 2307494 2305464 2302613 2298961 2294936 2290870 2286818 2282751 2278632 2274411 2270139 2266047 2262357 2259142
48915 2259142 2256422 2254127 2251858 2249104 2245915 2242975 2240665 2238449 2235625 2232406 2229725 2228238 2227994 2228841
48901 2228841 2230537 2232658 2235045 2238298 2243184 2249581 2256692 2264347 2273284 2283936 2295696 2307837 2320566
48888 2320566 2334595 2350140 2366930 2384957 2404635 2426241 2449589 2474204 2499546 2525192 2551136
48877 2551136 2577874 2605952 2635484 2666306 2698454 2732131 2767277 2803551 2840847 2879525 2919961
48866 2919961 2962016 3005150 3049003 3093668 3139350 3185886 3232772 3279624 3326455 3373419 3420452
48855 3420452 3467287 3513676 3559441 3604417 3648539 3691840 3734171 3775120 3814485 3852638 3890018
48844 3890018 3926400 3961173 3994233 4026002 4056468 4084900 4110810 4134611 4156889 4177454 4195576
48833 4195576 4210865 4223461 4233658 4241831 4248521 4253971 4257618 4258470 4256022 4250540 4242528 4232229 4219594
48820 4219594 4204497 4187059 4167919 4147910 4127133 4104546 4078909 4049905 4017975 3983389 3946225
48809 3946225 3907068 3866863 3825974 3784135 3741599 3699472 3658466 3618038 3577447 3537137 3498248
48798 3498248 3461091 3424997 3389674 3355890 3324545 3295696 3268907 3244068 3221363 3200620 3181246
48787 3181246 3162890 3145913 3131099 3119067 3109954 3103426 3098908 3096010 3094968 3096494 3100982 3107888 3116146
48774 3116146 3125191 3135255 3146625 3159007 3171924 3185385 3199673 3214584 3229411 3243827 3258352
48763 3258352 3273718 3290063 3307030 3324346 3341945 3359629 3377013 3393928 3410669 3427749 3445474
48752 3445474 3463733 3482069 3499937 3517021 3533408 3549405 3565232 3580949 3596625 3612463 3628749
48741 3628749 3645792 3663873 3683021 3702717 3721985 3740118 3757346 3774621 3792635 3811127 3829230
48730 3829230 3846275 3862051 3876374 3888819 3899043 3907186 3913739 3919083 3923311 3926311 3927773 3927093 3923527
48717 3923527 3916566 3906204 3892864 3877081 3859043 3838271 3813936 3785734 3754382 3720972 3685990
48706 3685990 3649274 3610815 3571052 3530382 3488963 3447156 3405594 3364432 3323066 3281076 3239010
48695 3239010 3197737 3157420 3117860 3079535 3043422 3009758 2977865 2947387 2918854 2892602 2867884
48684 2867884 2843739 2820310 2798618 2779258 2761912 2746041 2731464 2718296 2706799 2697364 2690188 2684898
48672 2684898 2680895 2678051 2676682 2676811 2677929 2679586 2681722 2684221 2686635 2688707 2690751 2693128 2695659 2698001
48658 2698001 2700347 2703222 2706641 2709987 2712714 2714803 2716456 2717839 2719243 2721119 2723651 2726491 2729173 2731679
48644 2731679 2734421 2737725 2741387 2744684 2746891 2747946 2748600 2749623 2750884 2751631 2751796 2752510 2754910 2758816 2763145
48629 2763145 2767390 2772012 2777359 2782933 2788138 2793267 2799244 2806486 2814443 2822204 2829336 2836136 2843351 2851674
48615 2851674 2861366 2872242 2883988 2896383 2909144 2921759 2933749 2945044 2955860 2966211 2975778 2984166
48603 2984166 2990897 2994930 2994492 2987735 2973569 2951793 2922730 2887139 2846444 2802602 2757494 2712455
48591 2712455 2668332 2625707 2584866 2545858 2508833 2474289 2442712 2413968 2387239 2361666 2336977
48580 2336977 2313435 2291278 2270300 2249936 2229690 2209473 2189581 2170371 2151948 2134166 2116936
48569 2116936 2100504 2085339 2071666 2059079 2046726 2033968 2020902 2008174 1996328 1985406 1975218
48558 1975218 1965805 1957488 1950464 1944557 1939414 1934848 1930864 1927389 1924171 1921024 1918076 1915610 1913702 1912170
48544 1912170 1910878 1909851 1908964 1907745 1905792 1903312 1900935 1898925 1896889 1894398 1891689 1889457 1888027 1886999
48530 1886999 1885778 1884232 1882524 1880309 1876410 1869734 1860557 1850493 1840906 1831633 1821681 1810860 1800024
48517 1800024 1789703 1779353 1768347 1757044 1746246 1736033 1725905 1715854 1706566 1698497 1691418 1685006
48505 1685006 1679213 1673788 1667967 1661129 1653505 1645841 1638473 1630997 1622767 1613447 1603137 1592187 1580881
48492 1580881 1569256 1557286 1545220 1533501 1522217 1510903 1499192 1487518 1476809 1467461 1458893 1450212
48480 1450212 1441014 1431404 1421492 1411277 1400976 1391042 1381651 1372488 1363339 1354664 1347163 1340841 1335059
48467 1335059 1329604 1325163 1322423 1321158 1320705 1321013 1322645 1325797 1329802 1333491 1335586 1334885 1330754 1323694 1315046
48452 1315046 1305969 1297021 1288645 1281487 1275916 1271697 1268516 1266612 1266563 1268625 1272447 1277292 1282422 1287517
48438 1287517 1292984 1299617 1307759 1316731 1325043 1330966 1333073 1330832 1325024 1317323 1309150 1300947 1292498 1283569
48424 1283569 1274101 1264229 1254443 1245494 1237820 1231164 1224896 1218584 1212210 1206099 1200720 1196221 1192048 1187388
48410 1187388 1182139 1177065 1172826 1169294 1166019 1162880 1159916 1156977 1154003 1151314 1149171 1147376 1145690 1144305
48396 1144305 1143425 1142709 1141737 1140796 1140524 1140764 1140364 1138309 1134705 1130511 1126503 1122700 1118620 1113943 1108807 1103433
48380 1103433 1097751 1091691 1085635 1080038 1074645 1068770 1062402 1056271 1050570 1044461 1037373 1029980 1023265 1017213
48366 1017213 1011212 1005151 999274 993394 987207 981123 975881 971457 967139 962580 958109 954061 950475 947356
48352 947356 944583 941691 938313 934751 931545 928676 925763 922819 920130 917666 915294 913264 911750 910192
48338 910192 907992 905624 904095 903434 902637 901041 898844 896345 893680 891324 889868 889178 888575 887874 887409 887097
48322 887097 886513 885913 886120 887298 888858 890696 893377 896921 900546 903970 907866 912601 917552 922161 926846
48307 926846 932388 939213 947586 957655 968895 980289 991428 1002811 1014997 1028314 1043476 1061249
48295 1061249 1081067 1100904 1118958 1134870 1149272 1163138 1177698 1193999 1212310 1232710 1255994
48284 1255994 1282928 1313005 1345423 1380988 1421298 1466245 1514382 1565736 1622007 1683740 1749654
48273 1749654 1819217 1893582 1973527 2059053 2151759 2254980 2370745 2499267 2642269 2803940
48263 2803940 2987787 3196067 3433905 3710835 4036897 4420256 4868765 5388588 5980110
48254 5980110 6641686 7379696 8207397 9131144 10147963 11258998 12460280 13689181 14781915
48245 14781915 15519005 15743896 15446860 14741542 13778226 12683242 11550608 10449183 9420875
48236 9420875 8481993 7635971 6883483 6221156 5639411 5127506 4678307 4286349 3944874
48227 3944874 3647202 3388287 3162993 2965080 2789535 2634013 2496819 2375351 2267442
48218 2267442 2172199 2088364 2013425 1945319 1883566 1828001 1777746 1732058 1690802 1653500 1619218
48207 1619218 1587846 1560157 1536180 1514873 1495787 1479538 1466105 1454121 1442546 1431823 1422731
48196 1422731 1415244 1409079 1404227 1400253 1396058 1390897 1384785 1377522 1368313 1356799 1343555 1329235 1314169
48183 1314169 1299013 1284665 1271157 1257732 1244364 1232001 1220898 1209968 1198425 1186911 1176329
48172 1176329 1166636 1157507 1149064 1141014 1132039 1121044 1108472 1095568 1083012 1070954 1059615 1048905
48160 1048905 1037955 1025961 1013194 1000511 988127 975461 961900 947256 931734 915838 899972
48149 899972 883932 867225 850036 833266 817424 802224 787487 773529 760285 747047 733682
48138 733682 721134 710016 699592 689052 678933 670237 662839 655865 649096 642819 636753 630348 623972
48125 623972 618584 614266 610155 605847 601829 598379 595093 591725 588590 585754 582656 579033 575487 572597
48111 572597 570038 567235 564446 562527 561728 561320 560437 558880 556987 555076 553252 551609 550345 549645 549572 550090
48095 550090 551114 552453 553868 555228 556534 557627 558098 557793 557307 557585 558938 560688 561851 561910 561007 559775
48079 559775 559106 559644 561192 562884 564098 565018 566199 567930 570168 572739 575291 577356 578783 580041 581893
48064 581893 584805 588727 593222 597710 601819 605617 609431 613498 618015 623284 629276 635090 639610 642992
48050 642992 646878 652699 660150 667787 674688 681051 687486 694375 701903 710201 719307 729147 739574 750383
48036 750383 761424 772752 784461 796396 808316 820344 832792 845501 857852 869594 881130
48025 881130 892752 904188 915248 926269 937448 948255 958091 967072 975606 983657 991129 998564 1006632
48012 1006632 1015085 1022961 1029823 1036102 1042200 1047933 1053035 1057664 1062189 1066753 1071297 1075737 1080044 1084228
47998 1084228 1088271 1091928 1094746 1096444 1097161 1097120 1096261 1094418 1091597 1087777 1082647 1075892 1067642 1058419 1048802
47983 1048802 1039296 1030172 1021101 1011290 1000303 988460 976099 962957 948788 934169 920019 906564
47971 906564 893366 880117 866736 852922 838396 823586 809357 796039 783203 770410 757634
47960 757634 745044 732941 721823 711912 702706 693554 684597 676454 669095 661813 654298 646939 639941
47947 639941 632954 625797 618811 612274 606197 600951 597281 595240 593747 591663 588831 585757 582880 580564
47933 580564 579112 578236 576984 574734 571866 569048 566334 563517 560836 558648 556716 554544 552190 550095
47919 550095 548255 546213 543846 541562 539683 538120 536777 535778 535126 534494 533625 532750 532414 532883 533806 534421
47903 534421 534197 533253 532107 531059 530134 529586 529989 531525 533561 535370 537069 539389 542653 546377 549908
47888 549908 553085 556283 560091 564882 570431 575969 581022 586178 592610 600657 609236 616898 623181 628662
47874 628662 633978 639279 644608 650232 656238 662087 667039 671004 674554 677943 680490 681261 680199 678205
47860 678205 676164 674183 671782 668514 664333 659583 654713 649902 644986 639870 634896 630494 626531 622391
47846 622391 617742 612917 608458 604657 601603 599317 597685 596597 596261 597023 598678 600417 601751 603153 605423
47831 605423 608693 612474 616426 620669 625416 630688 636301 641830 646630 650267 652982 655557 658684 662587
47817 662587 667091 671784 676154 679793 682548 684369 685132 684750 683331 681094 678233 675023 671824 668674 664997
47802 664997 660115 654086 647728 641733 636011 629999 623389 616330 609051 601583 593996 586736 580394 574997
47788 574997 569784 563984 557687 551698 546652 542681 539850 538311 537862 537876 538004 538522 539696 541247 542811
47773 542811 544494 546522 548725 550920 553509 557104 561724 566806 571816 576271 579548 581454 582884 585094
47759 585094 588282 591649 594869 598594 603289 608535 613924 619772 626282 632767 638559 644192 650808 658709
47745 658709 667344 676535 686718 697870 709096 719588 729355 738630 747124 754394 760624 766544 772617
47732 772617 778607 783858 787809 790300 791573 791978 791639 790573 789070 787599 786166 784145 781092 777501 774373
47717 774373 772200 770762 769773 769148 768549 767190 764414 760292 755475 750640 746120 741776 737081 731632 725737
47702 725737 720217 715401 710647 705150 698975 692963 687890 684024 681266 679193 677148 674790 672551 671194
47688 671194 671034 672059 674556 678824 684232 689396 693723 698144 703888 710979 718432 725544 732448 739703
47674 739703 747850 757194 767524 778145 788626 799362 810919 822960 834304 844026 852036 858603
47662 858603 863879 867978 871020 872829 872975 871390 868660 865427 861694 856940 850739 843046 834054 824105
47648 824105 813726 803526 793875 784732 775822 766987 758376 750287 742858 736027 729851 724722 721074 718911
47634 718911 717788 717250 717196 717829 719404 722014 725467 729383 733591 738473 744694 752527 761521 770905 780227
47619 780227 789536 799067 808814 818416 827442 835777 843705 851517 859020 865533 870386 873418 874989 875497
47605 875497 874910 872833 869079 864047 858377 852319 845713 838510 830890 822785 813811 803983 794091 784926
47591 784926 776461 768281 760532 753766 747965 742442 736886 731830 727812 724576 721556 718753 716636 715335
47577 715335 714424 713534 712795 712577 713016 714051 715830 718743 722818 727213 730766 733315 736146 740773 747366
47562 747366 754729 761667 767917 773729 779115 783760 787358 789803 791239 792051 792522 792409 791091 788229 783943
47547 783943 778269 770908 761741 751184 739661 727016 712873 697416 681431 665692 650559 636057
47535 636057 622095 608675 596060 584593 574225 564496 555176 546611 539125 532405 525906 519615 513927
47522 513927 508982 504677 501180 498729 496892 494684 491595 488078 484804 481970 479518 477549 476088 474858
47508 474858 473706 472984 473057 473574 473605 472475 470222 467412 464764 462806 461504 460209 458293 455853 453618 452136
47492 452136 451235 450249 448543 445925 442811 440056 438376 437839 437946 438087 437765 436566 434396 431830 429867 429082
47476 429082 429169 429358 429084 428204 426900 425562 424580 424058 423870 424021 424625 425409 425697 425236 424696 424865 425617 426217
47458 426217 426557 427395 429199 431295 432484 432258 431180 430240 430032 430398 430709 430560 430253 430424 431200 431915 431764
47441 431764 430556 428830 427443 427054 427669 428613 429192 429415 429772 430285 430336 429630 428797 428622 429093 429668 430133 430646
$$ [...]
##END NTUPLES=NMR SPECTRUM
##END=
