
##TITLE=UV1013_M1-1003-1002_6268855_PmTxJxMRLQ
##JCAMPDX= 6.0         $$ Bruker NMR JCAMP-DX V2.0
##DATA TYPE= NMR SPECTRUM
##DATA CLASS= NTUPLES
##ORIGIN= BRUKER
##OWNER= Administrator
$$ 1.72 TOPSPIN		Version 2.1
$$ 2012-06-02 18:51:39.468 -0500  Administrator@TOPSPIN
$$ Compression mode = diff/dup
##.OBSERVE FREQUENCY= 400.13188235
##.OBSERVE NUCLEUS= ^1H
##.ACQUISITION MODE= SIMULTANEOUS (DQD)
##.ACQUISITION SCHEME= undefined
##.AVERAGES= 8
##.DIGITISER RES= 22
##SPECTROMETER/DATA SYSTEM= spect
##.PULSE SEQUENCE= zg30
##.SOLVENT NAME= COFFEE_meoh
##.SHIFT REFERENCE= INTERNAL, COFFEE_meoh, 1, 14.98061
##AUDIT TRAIL= $$ (NUMBER, WHEN, WHO, WHERE, PROCESS, VERSION, WHAT)
$$ ##TITLE= Audit trail, TOPSPIN		Version 2.1
$$ ##JCAMPDX= 5.01
$$ ##ORIGIN= Bruker BioSpin GmbH
$$ ##OWNER= Administrator
$$ $$ C:\Bruker\TOPSPIN/data/COFFEE/nmr/UV1013_M1-1003-1002_6268855_PmTxJxMRLQ/20/pdata/1/auditp.txt
$$ ##AUDIT TRAIL=  $$ (NUMBER, WHEN, WHO, WHERE, PROCESS, VERSION, WHAT)
(   1,<2012-06-02 18:51:32.703 -0500>,<Administrator>,<TOPSPIN>,<go>,<TOPSPIN 2.1>,
      <created by zg
	started at 2012-06-02 18:50:23.750 -0500,
	POWCHK enabled, PULCHK disabled,
       configuration hash MD5:
       D5 CA 7A 23 FE 6B EE E2 50 67 74 61 24 F7 5E 3B
       data hash MD5: 64K
       F0 A5 D3 93 C5 73 6A 15 B7 E7 D2 00 34 15 3A 1E>)
(   2,<2012-06-02 18:51:35.312 -0500>,<Administrator>,<TOPSPIN>,<proc1d>,<TOPSPIN 2.1>,
      <Start of raw data processing
       efp LB = 0 FT_mod = 6 PKNL = 1 PHC0 = 0 PHC1 = 0 SI = 32K 
       data hash MD5: 32K
       FC 64 D6 F5 D6 95 C3 45 DA 6B B8 28 26 F6 88 10>)
(   3,<2012-06-02 18:51:35.687 -0500>,<Administrator>,<TOPSPIN>,<proc1d>,<TOPSPIN 2.1>,
      <pk PHC0 = 215.0958 PHC1 = 0 
       data hash MD5: 32K
       51 FA EC 9F 09 92 A9 B6 AD E8 FA 51 B2 CD AF 5C>)
(   4,<2012-06-02 18:51:35.812 -0500>,<Administrator>,<TOPSPIN>,<proc1d>,<TOPSPIN 2.1>,
      <abs ABSG = 1 
       data hash MD5: 32K
       E0 45 0B 9B 27 8F 07 6E 60 90 3C 9C CA 38 8D DF>)
(   5,<2012-06-02 18:51:35.843 -0500>,<Administrator>,<TOPSPIN>,<proc1d>,<TOPSPIN 2.1>,
      <abs ABSG = 2 
       data hash MD5: 32K
       24 F7 45 90 D6 58 DB 65 CB 1A D8 FB 9B B4 41 83>)
(   6,<2012-06-02 18:51:35.875 -0500>,<Administrator>,<TOPSPIN>,<proc1d>,<TOPSPIN 2.1>,
      <abs ABSG = 3 
       data hash MD5: 32K
       E5 5C F5 36 96 BC 0C E4 D8 41 78 72 06 B6 C0 21>)
(   7,<2012-06-02 18:51:35.906 -0500>,<Administrator>,<TOPSPIN>,<proc1d>,<TOPSPIN 2.1>,
      <abs ABSG = 4 
       data hash MD5: 32K
       89 A8 70 FC 3C EE CA D9 F0 D1 E5 FF D9 7D 6E DD>)
(   8,<2012-06-02 18:51:35.937 -0500>,<Administrator>,<TOPSPIN>,<proc1d>,<TOPSPIN 2.1>,
      <abs ABSG = 5 
       data hash MD5: 32K
       8C 5E 1B C3 87 DC 7F 18 04 2F AF 49 DC 8F EC 77>)
$$ ##END=
$$ 
$$ $$ hash MD5
$$ $$ C5 2A E4 F3 6F EE 7B 79 D4 84 53 4E AB 12 FC 40
##$RELAX= 
##$RELAX= 
##$RELAX= 
##$RELAX= 
##$RELAX= 
##$RELAX= 
##$RELAX= 
$$ Bruker specific parameters
$$ --------------------------
$$ [...]
##$TP= (0..7)
150 150 150 150 150 150 150 150
##$TP07= 0
##$TPNAME0= <>
##$TPNAME1= <>
##$TPNAME2= <>
##$TPNAME3= <>
##$TPNAME4= <>
##$TPNAME5= <>
##$TPNAME6= <>
##$TPNAME7= <>
##$TPOAL= (0..7)
0.5 0.5 0.5 0.5 0.5 0.5 0.5 0.5
##$TPOFFS= (0..7)
0 0 0 0 0 0 0 0
##$TUNHIN= 0
##$TUNHOUT= 0
##$TUNXOUT= 0
##$USERA1= <user>
##$USERA2= <user>
##$USERA3= <user>
##$USERA4= <user>
##$USERA5= <user>
##$V9= 5
##$VALIST= <valist>
##$VCLIST= <CCCCCCCCCCCCCCC>
##$VD= 0
##$VDLIST= <DDDDDDDDDDDDDDD>
##$VPLIST= <PPPPPPPPPPPPPPP>
##$VTLIST= <TTTTTTTTTTTTTTT>
##$WBST= 2048
##$WBSW= 25
##$XGAIN= (0..3)
0 0 0 0
##$XL= 0
##$YL= 0
##$YMAX_a= 533298
##$YMIN_a= -630491
##$ZGOPTNS= <>
##$ZL1= 120
##$ZL2= 120
##$ZL3= 120
##$ZL4= 120
##$ABSF1= 14.98061
##$ABSF2= -5.57192
##$ABSG= 5
##$ABSL= 3
##$ALPHA= 0
##$AQORDER= 0
##$ASSFAC= 0
##$ASSFACI= 0
##$ASSFACX= 0
##$ASSWID= 0
##$AUNMP= <proc_prof1d_extract_pilot.lims>
##$AXLEFT= 0
##$AXNAME= <>
##$AXNUC= <1H>
##$AXRIGHT= 0
##$AXTYPE= 0
##$AXUNIT= <>
##$AZFE= 0.1
##$AZFW= 0.1
##$BCFW= 0
##$BC_mod= 0
##$BYTORDP= 0
##$COROFFS= 0
##$CY= 15
##$DATMOD= 1
##$DC= 0
##$DFILT= <>
##$DTYPP= 0
##$F1P= 0
##$F2P= 0
##$FCOR= 0.5
##$FTSIZE= 32768
##$FT_mod= 6
##$GAMMA= 0
##$GB= 0
##$INTBC= 1
##$INTSCL= 1
##$ISEN= 128
##$LB= 0
##$LEV0= 0
##$LPBIN= 0
##$MAXI= 10000
##$MC2= 0
##$MEAN= 0
##$ME_mod= 0
##$MI= 0
##$NCOEF= 0
##$NC_proc= -8
##$NLEV= 6
##$NOISF1= 0
##$NOISF2= 0
##$NSP= 0
##$NTH_PI= 0
##$NZP= 0
##$OFFSET= 14.98061
##$PC= 1
##$PHC0= 215.0958
##$PHC1= 0
##$PH_mod= 1
##$PKNL= yes
##$PPARMOD= 0
##$PPDIAG= 0
##$PPIPTYP= 0
##$PPMPNUM= 2147483647
##$PPRESOL= 1
##$PSCAL= 4
##$PSIGN= 0
##$PYNMP= <proc.py>
##$REVERSE= no
##$SF= 400.13
##$SI= 32768
##$SIGF1= 0
##$SIGF2= 0
##$SINO= 400
##$SIOLD= 32768
##$SPECTYP= <>
##$SREGLST= <1H.CDCl3>
##$SSB= 0
##$STSI= 32768
##$STSR= 0
##$SW_p= 8223.68421052632
##$SYMM= 0
##$S_DEV= 0
##$TDeff= 65536
##$TDoff= 0
##$TI= <>
##$TILT= no
##$TM1= 0
##$TM2= 0
##$TOPLEV= 0
##$USERP1= <user>
##$USERP2= <user>
##$USERP3= <user>
##$USERP4= <user>
##$USERP5= <user>
##$WDW= 1
##$XDIM= 32768
##$YMAX_p= 457941643
##$YMIN_p= -704899
##$CURPLOT= <Network HP LaserJet P1505>
##$CURPRIN= <$Network HP LaserJet P1505>
##$DFORMAT= <normdp>
##$LAYOUT= <+/1D_H.xwp>
##$LFORMAT= <normlp>
##$PFORMAT= <normpl>
##$SURQMSG= 1
$$ End of Bruker specific parameters
$$ ---------------------------------
##NTUPLES= NMR SPECTRUM
##VAR_NAME=  FREQUENCY,     SPECTRUM/REAL,   SPECTRUM/IMAG
##SYMBOL=    X,             R,               I
##VAR_TYPE=  INDEPENDENT,   DEPENDENT,       DEPENDENT
##VAR_FORM=  AFFN,          ASDF,            ASDF
##VAR_DIM=   32768,         32768,           32768
##UNITS=     HZ,            ARBITRARY UNITS, ARBITRARY UNITS
##FACTOR=    0.250966925370066, 1,           1
##FIRST=     8223.43324360095, 53365,        -23859
##LAST=      0,             -136942,         29853
##MIN=       0,             -704899,         0
##MAX=       8223.43324360095, 457941643,    0
$$ Real data points
##PAGE= N=1
##DATA TABLE= (X++(R..R)), XYDATA
$$ [...]
19514b7248j92536O5107q3627C2068f5474j77150k57315i8429d845k31937B37284
19502c68292n4393J58223D1340a12920j01293R1813A40528K91886b10265k2411
19492b32676M4272j70506C3730a9606I2256b71460J02168r5948b8862o2451C0436
19480G9132B2665d04271I6763l0176b01972a2340m29790b17561D02010b03643
19469A06747a98843i9420B06565D0314a15816C45767A27764J18544a1450l43479
19459c54929J39460D4629a64911B5844J81794g5212j77072j02155G4535h849A1148
19447A59397D7131b60113o5350P4101H587e2679r8172I0580a17637A63773J71659
19436C35432A45449M4152a16753j47229A73014G6987b6403l2300D9136c07682
$$ y = [-27248, -219784, -154677, -238304, 32068, -65474, -242624, -499939, -98429, -4845, -236782, 237284, -368292, -422685, -264462, 41340, -112920, -214213, -122400, 140528, 432414, -210265, -232676, -188404, -358910, 33730, -19606, 92256, -271460, -169292, -265240, -28862, -91313, 30436, 79132, 22665, -404271, 96763, 66587, -201972, -12340, -442130, -217561, 402010, -203643, 106747, -198843, -99420, 206565, 40314, -115816, 345767, 127764, 246308, -11450, -354929, -215469, 44629, -164911, 25844, 207638, -75212, -252284, -354439, 74535, -8849, 11148, 159397, 47131, -260113, -325463, -251362, 8587, -52679, -150851, 90580, -117637, 163773, 335432, 145449, 189601, -116753, -263982, 173014, 76987, -26403, -58703, 49136, -307682]
19425a65209G5594k6346K37225a21564r3932G0941c60418J74086E1395k1615J85084
19414B14864i8320j86381h518j53285B18539q8131a47923e0389C4438a49663p589
19403a57252a0916m1608A01322k1199a59024p8598A27939A5931J10459k3404C6785
19391b18123i1533j2034I3086b49903B70654c31949a58928d6089A12185a32834
19380A0713K55838c18097A06604J18999a59072A00992b19853C5715A0580N0328
19370F0908i6964j328B10376c93259a17486F1410K1253b63352L1157M1664A39042
19358d39082f5210p5458b3077j96659A72032F6254b50123o0109b5136A65799a39871
19346a36636f5163l43691A08996b3422j07161M3984c4126j31908j97309J31298
$$ y = [-165209, 75594, 49248, 286473, -121564, -215496, 70941, -360418, -186332, 51395, 29780, 214864, -98320, -284701, -8518, -161803, 218539, 130408, -147923, -50389, 34438, -149663, -157252, -10916, -52524, 101322, 80123, -159024, -237622, 127939, 15931, 126390, 102986, 36785, -218123, -91533, -103567, 93086, -249903, 270654, -331949, -158928, -46089, 112185, -132834, 10713, 266551, -318097, 106604, 225603, -159072, 100992, -219853, 35715, 10580, 60908, -96964, -98292, 210376, -393259, -117486, 61410, 82663, -263352, -232195, -190531, 139042, -439082, -65210, -140668, -23077, -219736, 172032, 66254, -250123, -310232, -25136, 165799, -139871, -136636, -65163, -408854, 108996, -23422, -130583, -86599, -34126, -166034, -363343, -232045]
19336b32045L1712P6196K670k71053A41742a51873I7766P8781b112j79477D06320
19324B49089B4464a49096G6979h5490q0096b4253k59174J25843l1659I0973f9264
19312a87607A32360C1759N9160j9413a53367l09863B12841c0091A28732P4988
19302B03720l1835b68855n1187L7570H3471a38164C7008a8665j82949M6529k39869
19291c94954g7094c30B23860e3322l1875j19891b7229n2700H3752a22290A2217
19279C32768I664O5337a65625f2698j45824L0880A24041a22685K3421K3810E1729
19267i1284C29138A01930a28102e438A13691J08157D9317b65309R3217c8288j34254
19256a72542q8300A75111d6362k8100B1434E145d27694j39510K34622Q4292e9094
$$ y = [-232045, -200333, -124137, -121467, -392520, 141742, -151873, 97766, 176547, -2112, -181589, 406320, 249089, 24464, -149096, 76979, -85490, -165586, -24253, -283427, -157584, -189243, 90973, -69264, -187607, 132360, 31759, 90919, 71506, -153367, -463230, 212841, -30091, 128732, 203720, 171885, -268855, -320042, -282472, 83471, -138164, 37008, -18665, -201614, -155085, -394954, -77094, -330, 223860, -53322, -85197, -205088, -27229, -79929, 83752, -122290, 12217, 332768, 9664, 75001, -165625, -62698, -208522, -177642, 124041, -122685, -99264, -75454, 51729, -91284, 329138, 101930, -128102, -5438, 113691, 221848, 49317, -265309, -172092, -38288, -172542, -260842, 175111, -46362, -74462, 21434, 5145, -427694, -567204, -332582, -248290, -59094]
19244a60980c6372p1428b0321A21389c7504n2940p0715I3898a16739C8226A8744
19232e5119H1261c36334J16170B79616a1114B09624a3341A13609d2340k00988
19222b43328A61107b85332B3832h0551l8135j86202A14685K94814A42006c91156
19211a05006j6464b0484A90744c318m1386r5221r4633A01908c02956n0141A1187
19199b18214a4537E8477i8596L5411j57018K0725R4766j34393E2030a68585b7617
19187A5181e7783A86782b5409k15397a10776l9412A6309J04922i1163I796i660
19175A248i3222G2860h8933A73569b2679A15844a30110A5758O82Q1996a06887
19163B37895a46681D6062J4578a10380j56666h7399n561A17429d8250G2064a9038
$$ y = [-160980, -36372, -107800, -20321, 121389, -37504, -90444, -161159, 93898, -116739, 38226, 18744, -55119, 81261, -336334, -220164, 279616, -11114, 209624, -13341, 113609, -42340, -243328, 161107, -285332, 23832, -80551, -118686, -304888, 114685, 409499, 142006, -391156, -105006, -121470, -20484, 190744, -3318, -44704, -139925, -234558, 101908, -302956, -353097, 11187, -218214, -14537, 58477, -98596, -63185, -220203, -199478, -104712, -239105, 52030, -168585, -27617, 15181, -57783, 186782, -25409, -240806, -110776, -150188, 16309, 121231, -91163, 9796, -9660, 1248, -93222, 72860, -88933, 173569, -22679, 115844, -130110, 15758, 16440, 98436, -106887, 237895, -146681, 46062, 60640, -110380, -267046, -87399, -92960, 117429, -48250, 72064, -19038]
19151A64264a656j6752A09470B856K766J18239a15685B07421b67707A19555d3136
19139b7449D02014D427b34304d8589m6715l94519a00761F6713J50184c4145F7163
19127C19072A318a32451j99803h8341j1828A04091c0843k14113f4444j42762J6223
19116a90983J4718G02d5817j23133m6563A9025L60278j41834L4142C3013L5361
19105F8374a37942j14353A49619n6869L5997c13183D7591b48548a17484K4375
19095i3109J9235K027A09731b72190f5431A0592c07116H9616D882b22580R6207
19084a26373r2730a00413L8612A15967l9430d3808k1221B60208i1497b0004A38606
19072b3233n170H2665A0626b33162A1008d53372G6364a75229j60792H4987e5813
$$ y = [164264, -1656, -18408, 109470, 2856, 5622, 123861, -115685, 207421, -267707, 119555, -43136, -27449, 402014, 4427, -234304, -48589, -95304, -489823, -100761, 66713, 216897, -34145, 67163, 319072, 1318, -132451, -332254, -88341, -100169, 104091, -30843, -244956, -64444, -207206, -190983, -176265, 702, -45817, -168950, -215513, 19025, 379303, 237469, 271611, 33013, 68374, -137942, -252295, 149619, 92750, 128747, -313183, 47591, -248548, -117484, -93109, -73874, -71847, 109731, -272190, -65431, 10592, -307116, 89616, 4882, -222580, -126373, -219103, -100413, -61801, 115967, 76537, -43808, -65029, 260208, -91497, -20004, 138606, -23233, -28403, 82665, 10626, -233162, 11008, -453372, 76364, -175229, -336021, 84987, -55813]
19060d14344a76117b5439k26315g3561I9200b52651a7223k14910A65388G8681
19049E9669P4393e4646A26968b47520i0804l05287A1810c9322A0421c53941D3703
19037E7020A7580b47445b1724e862l64225A07386B4436b65584M9996A03077K52439
19026C55516b75124H161a05646a3853A1945a39857C401c7972j2926A04129L9743
19015A43872b13102A52950E191a25675K9422B2111J8890G365J76712k3000B0397
19003B64442C8648N8125a13793F7707e61787f499A18141d8834r7334C36033c11322
18991d6316C493M0869a08868p4664j15568B6540f2387J4762n2930j55454B5418
18979H0201O3439o6616P372i4302A94314A8217e75084K30226B0482J71585b66293
$$ y = [-414344, -176117, -25439, -251754, -73561, 99200, -252651, -17223, -232133, 165388, 78681, 59669, 134062, -54646, 126968, -247520, -90804, -396091, 11810, -39322, 10421, -353941, 43703, 57020, 17580, -247445, -21724, -5862, -370087, 107386, 24436, -265584, -215588, 103077, 355516, -275124, 8161, -105646, -13853, 11945, -139857, 3401, -37972, -50898, 104129, 143872, -213102, 152950, 5191, -125675, -96253, 22111, 41001, 7365, 184077, 161077, 20397, 264442, 38648, 96773, -113793, 67707, -561787, -6499, 118141, -48834, -146168, 336033, -311322, -46316, 3493, 44362, -108868, -183532, -299100, 26540, -62387, -47625, -100555, -256009, 25418, 80201, 143640, 77024, 84396, -94302, 194314, 18217, -575084, -344858, 20482, 192067, -266293]
18967a65961A45267K00633C5400d2908k80888n7225J68800N3961C9733R385O6429
18956A15547J25216e4280d9j57761A69298a18949m1201G1637B6387j069Q5562
18945A10880d9608e210j78311B62430H0488l9406M115E67c42617B78875a75681
18933F1141a11537c963k2826j39208j00951M8307O6684B77297a2289k56803g2154
18921a93369M8461b8585m9827a5993C9931J52279a37445A51915A6479b84180A39108
18909b92557B0751a2334A05024l3496J96811c8828A07644d8616B70804c2474D23320
18897b8690p4586r838k33843e509k27441J2796J09367B00479c1094A01165J3507
18886A14672E4257N1754a45188f7763A39086h3668n0258a979l21900G5271c56676
$$ y = [-165961, 145267, 345900, 35400, -42908, -323796, -381021, -212221, -158260, 39733, 49118, 115547, 240763, -54280, -49, -157810, 169298, -118949, -160150, 71637, 26387, 25318, 110880, -49608, -5210, -183521, 262430, 80488, 41082, 45197, 567, -342617, 278875, -175681, 61141, -111537, -3963, -26789, -165997, -266948, -218641, -151957, 277297, -12289, -269092, -72154, -193369, -144908, -28585, -78412, -15993, 39931, 192210, -137445, 151915, 16479, -284180, 139108, -292557, 20751, -12334, 105024, 71528, 268339, -38828, 107644, -48616, 270804, -32474, 423320, -28690, -103276, -113114, -346957, -5509, -232950, -220154, -110787, 200479, -31094, 101165, 114672, 54257, 106011, -145188, -67763, 139086, -83668, -133926, -1979, -323879, 75271, -356676]
18874e6733A80076a78231A05649B3111e583G6922P2957b39853k772h7303B31421
18862f2859E349J49621a70793p9696B0247K25740I8585l5934l0835a35982q7483
18851b23465A40526b3630A58325b57609g0418A28769a26929p0409Q8688B06833
18840a90495A96226C4524b14206A77568b07331B9795J64413b8791m2843e386A57005
18828b05250l7853f6286j1203p2660f7014p761b3608j21019a6332j32195l5595
18817a84122A76135J05207c10698D6920e50437a99457j19014a14283b1619l9110
18807f0729G0038a47877a6650D1249a26360B16704k5415a92719D893Q3248M3827
18796A31968g7682A60954O2563b53349C65620A65803K0734a19800A36443f3803
$$ y = [-56733, 180076, -178231, 105649, 23111, -5583, 76922, 149879, -239853, -242625, -87303, 231421, -62859, 5349, 154970, -170793, -250489, 20247, 245987, 98585, 62651, 31816, -135982, -223465, 140526, -23630, 158325, -257609, -70418, 128769, -126929, -197338, -108650, 206833, -190495, 196226, 34524, -214206, 177568, -207331, 29795, 194208, -28791, -71634, -5386, 157005, -205250, -243103, -66286, -77489, -150149, -67014, -74775, -23608, -144627, -16332, -148527, -184122, 176135, 281342, -310698, 46920, -550437, -199457, -318471, -114283, -21619, -60729, 70038, -147877, -16650, 41249, -126360, 216704, 191289, -192719, 4893, 88141, 131968, -77682, 160954, 223517, -253349, 365620, 165803, 186537, -119800, 136443, -63803]
18785a0407C1479L3328i0192A8988a09834c6020o8404a9018E8945O2735b8186
18773H7338b91628d4530J1733Q95o4418A00730b21387O820j3808j51993Q8883
18762b91485A98679d47270h196k9029l6057q3532P3093j5728a5783m881j17807
18751a38471f9190J5254A5081a37160m0684q1307C4672J09459G1425J79756h6275
18739a92003e8688j3397o8726F1446A9218h4643F4056O0929a79289d3067G2903
18727a71614H9607a38669D7155A3644K06666i566G705J48683e047p5228A58015
18715b99049a48944j33155a02445l75675a1696H847i9444n972j45201p6404a15643
18703f4507j32311o3904M5186e3903G5323a08183N490j27867J04616j26514d9861
$$ y = [-10407, 31479, 64807, -90192, 18988, -109834, -36020, -104424, -19018, 58945, 121680, -28186, 87338, -291628, -44530, -32797, -31902, -96320, 100730, -221387, -214567, -228375, -380368, -291485, 198679, -447270, -8196, -37225, -73282, -156814, -83721, -99449, -15783, -20664, -138471, -69190, -53936, 15081, -137160, -177844, -259151, 34672, 144131, 71425, 251181, -86275, -192003, -58688, -72085, -140811, 61446, 19218, -84643, 64056, 124985, -179289, -43067, 72903, -171614, 89607, -138669, 47155, 13644, 220310, -9566, 7705, 156388, -5047, -80275, 158015, -299049, -148944, -282099, -102445, -478120, -11696, 8847, -99444, -105416, -250617, -327021, -115643, -64507, -196818, -260722, -215536, -53903, 75323, -108183, -102693, -230560, -125944, -252458, -49861]
18691A58259j8834a34472B20826b54676Q8226H6561b38393B05631h0022m3432
18681a23454j58986M5741a17664B11501E5470c725k50629B4786b71940c8714j5791
18670e4505B5915J2968i5751j39736J16573C4857J23752n9294P9662b25187j7139
18659b42326K4163C8332a39914B7743h3019A1266b39251D3489J18551l5684a67167
18647A18401d52759e2035H9093b43680J7673H7215c57814c3988m1548m5474j70292
18636b91302A47783E7292a80706Q4119B065K24442c99575a86256M4790G7769i9007
18624c54686J08893B9716c06342A80006c87523A0012a94529A9202K39013j04207
18614A54008d213A1167a8335j85929P0442l07519A47659a65328h0547B15336j04959
$$ y = [158259, 139425, -134472, 220826, -254676, -166450, 86561, -238393, 205631, -80022, -123454, -282440, -236699, -117664, 211501, 55470, -3725, -254354, 24786, -271940, -38714, -54505, 25915, 38883, -95751, -235487, -118914, 34857, 158609, 99315, 178977, -225187, -242326, -218163, 38332, -139914, 27743, -83019, 11266, -239251, 43489, 162040, 126356, -167167, 118401, -452759, -52035, 89093, -243680, -226007, 87215, -357814, -33988, -75536, -121010, -291302, 147783, 57292, -180706, -96587, 2065, 226507, -399575, -186256, -141466, 77769, -99007, -354686, -245793, 29716, -306342, 180006, -387523, 10012, -194529, 19202, 258215, 154008, -4213, 11167, -18335, -204264, -133822, -441341, 147659, -165328, -80547, 215336, 110377]
18603A10377a83260B9974Q9866E2736e7014l6138A36141c24463A57336J4899b59217
18591d0207k63975A72705G860i5463A6657G111g2405C00227a32104k51417C0459
18579g746j81009j856B4753d14880b04152m0861J21056b693n525k2646A31564
18567C17046h5339k8955q7453C40048l7123A50143a77479B12453d44855B2812
18556e9083l5072B1701b44142j02793A72725N0838b1955j24826G6760f5268o6920
18545a32188b6252H5255j7806d7856n5308A3862K1134C120a18307B79602a28718
18533A18754b35486i3328M504d1755j29956j6338h5604j39635O9244A21542c27518
18521b07663E1083c25470a3448j90557A75687b34779B6110b99809M9488c3483
$$ y = [110377, -183260, 29974, 119840, 52736, -57014, -93152, 136141, -324463, 157336, 172235, -259217, -40207, -304182, 172705, 7860, -95463, 16657, 7111, -72405, 300227, -132104, -383521, 30459, -7746, -188755, -190611, 24753, -414880, -204152, -245013, -123957, -2693, -8218, -30864, 131564, 317046, -85339, -114294, -201747, 340048, 302925, 150143, -177479, 212453, -444855, 22812, -59083, -94155, 21701, -244142, -346935, 172725, 223563, -21955, -146781, 76760, -65268, -132188, -26252, 85255, 67449, -47856, -103164, 13862, 34996, 3120, -118307, 279602, -128718, 118754, -235486, -93328, -88824, -41755, -171711, -188049, -85604, -225239, -155995, 121542, -327518, -207663, 51083, -325470, -13448, -204005, 175687, -234779, 26110, -299809, -250321, -33483]
18510A45676c0679A32697K4485D5271h567j50768A20127f0137J1723j3168B6080
18498c04419H2684i3871r2621A21717P9869F4814a68159C16089D2385b31080a15321
18486B21421i4152C5756g5836P501j72476P1480J4544c724k61654D4191a56724
18474a75419j99826R0652h4894J7411q3744a1428A73686E8860L04765A78862o3748
18463A15114a04477C6215J21127c06430A64874o3350a15151k9590b4529p6829
18453a01358K2160f521m3123A31066o3901B1102M4254a00874j37394L0130n9173
18442b67311O6786k96669J54273a58300g6314j38825O4738k51256a60828m9562
18432b10390A03780K32509e2563A17832a3214e771r8368j39065j9174C14778D1672
$$ y = [145676, -30679, 132697, 157182, 45271, -8567, -159335, 120127, -60137, -48414, -61582, 26080, -304419, 82684, -93871, -186492, 121717, 201586, 64814, -168159, 316089, 42385, -231080, -115321, 221421, -94152, 35756, -75836, -68335, -240811, -169331, -154787, -3724, -265378, 44191, -156724, -175419, -375245, -284593, -84894, -67483, -151227, -11428, 173686, 58860, 363625, 178862, 115114, -104477, 36215, 157342, -306430, 164874, 101524, -115151, -144741, -24529, -101358, -79198, -6521, -49644, 131066, 67165, 21102, 65356, -100874, -238268, -208138, -267311, -200525, -497194, -342921, -158300, -76314, -215139, -150401, -401657, -160828, -210390, 103780, 336289, -52563, 117832, -13214, -5771, -104139, -243204, -262378, 314778, 41672]
18420b50742h3757j5312C5518Q088b49686c063q2746K7679b6911p1996D875L7599
18408D2474c50262P936B50117a21325B28686a4316j28216A80063b4493A34621
18397C10579a71282I8954i3208p8532B5528e7768n844j105p7672B22273g4579
18385E8871d8987I2412i5502q4891h4384r9405C6081L110K48080b193A95267a70640
18372B48216b65324E4748J39587a35540H050j29b38821J19069C30181C2489c05369
18360c1777J4190A70369m904B2038a79954h173j59904B41914A16748g722A96494
18348B42224a74738j57009g6339A4422a38700c0336j35086B6650g3956b8412A10765
18336b9874l53259J66266R7796q129A60897d8783A32904D8286a64089B22138A5665
$$ y = [-250742, -83757, -99069, 35518, 43606, -249686, -3063, -85809, -58130, -26911, -98907, 4875, 42474, -350262, -342326, 250117, -121325, 228686, -14316, -142532, 180063, -24493, 134621, 310579, -171282, 98954, -93208, -171740, 25528, -57768, -63612, -64717, -142389, 222273, -74579, 58871, -48987, 92412, -95502, -180393, -84384, -183789, 36081, 39191, 287271, -2193, 195267, -170640, 248216, -265324, 54748, 194335, -135540, 8050, 7921, -238821, -119752, 330181, 32489, -305369, -31777, -17587, 170369, 165465, 22038, -179954, -8173, -168077, 241914, 116748, -7722, 196494, 242224, -174738, -331747, -76339, 14422, -138700, -30336, -165422, 26650, -73956, -28412, 110765, -29874, -383133, -216867, -119071, -127200, 160897, -48783, 132904, 48286, -164089, 222138, 15665]
18324b01166A7000i5620A3525d6104F9067A8357a23845C48067b05855i7008k79896
18313c76904a54348K3459A30931i1810B45220h0967A43507A0413a50739B94555
18302c17122P0191R3743f112k55800a07351I5997e9160I5297c82452d9468k18944
18291b68412F6009N4635m0464L788a07507C5143a41210l19234e8483k08757j34073
18280d01313D7152M8927b01608e8932j16486i043I0505a294k60097R156b9498
18268a66231g8413q1945g0488m9428o621D0167K813P770d03336I8894C7852J51407
18256A89259I2258b14432b1509k24757g5954E7078j0060P1861c2775B03773I882
18244b06291J1409R3833L414j68992k9329A36288d38497a08796M8989d11D02344
$$ y = [-201166, 17000, -95620, 13525, -46104, 69067, 18357, -123845, 348067, -205855, -97008, -376904, -154348, -130889, 130931, -91810, 245220, -80967, 143507, 10413, -150739, 294555, -317122, -246931, -153188, -6112, -261912, -107351, 95997, -59160, 95297, -382452, -49468, -268412, 66009, 120644, 80180, 83968, -107507, 35143, -141210, -460444, -58483, -267240, -401313, 47152, 96079, -201608, -58932, -175418, -9043, 90505, -1294, -261391, -252235, -29498, -166231, -78413, -160358, -70488, -119916, -126537, 40167, 42980, 50750, -403336, 98894, 37852, 189259, 92258, -214432, -21509, -246266, -75954, 57078, 47018, 118879, -32775, 203773, 9882, -206291, -194882, -101049, -97635, -266627, -295956, 136288, -438497, -108796, -59807, -411, 402344]
18232a46907P0815E5276h4440d071j94289f5941j20421A13543A8896K27632G3752
18220A639c06095Q6596j36844J30609B65430a70410A9052M93284A06254R4303
18210B00557K07441H5293j4083j7453J51068J25862c66524B0299J41833p6533
18200H5599J60184c6632J0661p5758A61629i9982i398D8943b20719B47690C0250
18188g6342I8069C9416R2945B5862a67968k48817f0446j49232a9742k94534a44768
18176A44631h79n0104e563k17313d5801A74885k2397K97856A4912a20795E1421
18164a49555G2702d5252A69733a25133k10068J58462O504N9445M0608q6113L1430
18153a24865D6628L20348G8360B5808b40563I8527a80102A24213A1937L1369j9002
$$ y = [-146907, -76092, 55276, -84440, -4071, -198360, -65941, -186362, 113543, 18896, 246528, 73752, 1639, -306095, -219499, -356343, -225734, 265430, -170410, 19052, 512336, 106254, 200557, 407998, 85293, 71210, 53757, 204825, 330687, -366524, 20299, 162132, 85599, 245783, -36632, -25971, -101729, 161629, -99982, -9398, 48943, -220719, 247690, 30250, -76342, 98069, 39416, 132361, 25862, -167968, -416785, -60446, -209678, -19742, -314276, -144768, 144631, -879, -50983, -5563, -222876, -45801, 174885, 152488, 450344, 14912, -120795, 51421, -149555, 72702, -45252, 169733, -125133, -335201, -176739, -170235, -110790, -70182, -156295, -124865, 46628, 366976, 78360, 25808, -240563, 98527, -180102, 124213, 11937, 43306, 24304]
18142B4304a30269A45206l0937c8371m1346B6358K25003e9724r5701a7311j59733
18131a77044l4404A25723B499b12708j60338J75626A53240i6312j33613K3073
18121b06852O123B36034b9580A2330a87091c841k76959f933o3903j34086e4558
18109b61153C0521L5523c8768j02035O7431K0616r2616a7556G8840g8431B28129
18097B43092B9846J22496b87708H3920M1850a24597D21461a74483P3929a867j3023
18086a4890k84957A06614b03216L0196C17410c91442a25619E4043J3794B2730
18075C49980G81J80872K7817G3794h2753b4147A92096h5447F7959a86848A44781
18063I4209a1459A06514n1475c79252e0794k36058C1075c3688A74338a35179A31785
$$ y = [24304, -130269, 145206, 114269, -38371, -79717, 26358, 251361, -59724, -155425, -17311, -177044, -211448, 125723, 2499, -212708, -373046, -197420, 153240, -96312, -229925, -206852, -200729, 236034, -29580, 12330, -187091, -3841, -280800, -6933, -70836, -204922, -54558, -261153, 30521, 66044, -38768, -140803, -73372, -52756, -145372, -17556, 78840, -78431, 228129, 243092, 29846, 152342, -287708, 83920, 125770, -124597, 421461, -174483, -100554, -1867, -14890, -299847, 106614, -203216, -173020, 317410, -391442, -125619, 54043, 67837, 22730, 349980, 781, 181653, 209470, 73794, -82753, -24147, 192096, -85447, 67959, -186848, 144781, 94209, -11459, 106514, 55039, -379252, -50794, -286852, 31075, -33688, 174338, -135179, 131785]
18051E7338b57446J188R4253B34825b38330q2571a45857e8887k71039a0272H990
18039d4706I5306i9599L9285A44334L5797a18027K926i985j32471A5167a23322
18027d2099A50657b00873A82739I0996a09601A3602J17629c5374k61070A95434
18016a83371I9632M9980b37090h0874j17175C60942A34087a30758j92463i6847
18005g3318h163l22681a321k56429I8215D734L9542l384O743a52648j58512H991
17992i2971n9038n5189A30196f0255A78321N15d0615B51272d7401j14291m9369
17981b11061r0333L9179N8926N9255E6319J18637o8029j9709L0031M8998c6265
17969b05795f9334B33119H9129O7064c19182B4075a8327k30990m7308A21033m9173
$$ y = [57338, -257446, -256258, -162005, 234825, -238330, -320901, -145857, -58887, -329926, -10272, 8990, -44706, 95306, -99599, -60314, 144334, 180131, -118027, -115101, -9985, -142456, 15167, -123322, -42099, 150657, -200873, 182739, 90996, -109601, 13602, 131231, -35374, -296444, 195434, -183371, 99632, 149612, -237090, -80874, -198049, 360942, 134087, -130758, -323221, -96847, -73318, -8163, -330844, -1321, -257750, 98215, 4734, 44276, 40892, 47635, -152648, -311160, 8991, -92971, -152009, -207198, 130196, -60255, 178321, 178836, -40615, 251272, -47401, -161692, -211061, -301394, -262215, -203289, -144034, 56319, 174956, 106927, 87218, 117249, 166247, -36265, -205795, -69334, 233119, 89129, 156193, -319182, 24075, -18327, -249317, -296625, 121033, 71860]
17958G1860B6772K8807a45346j80459B01083a10937C88344a27616A09551a28447
17947a53692J0760B21795c54196e0487A99968b7259A34358P5306A8953a16202
17936D6120L4361J70262a39439A92806a81688A4925J04112a65946P6640k42203
17926c31509B7115h5689j36828g0450L0558j7665A02351a10134A04241K4708a7160
17914c28381a05247j89584A80473g2716G9963b47221B8913b73531I8892a2421
17903b84325i8172o0121A08694a0703C93685a55063P0392B3453L03758b37597
17892a764B03386E7850K20152a83331N9333D2181h9245B52174b56026A45439h9128
17880a37994j05773E685a01503D955b10201j12336J45028H3249J35195H0376b11639
$$ y = [71860, 26772, 55579, -145346, -325805, 201083, -110937, 388344, -127616, 109551, -128447, -153692, -142932, 221795, -354196, -50487, 199968, -27259, 134358, 209664, 18953, -116202, 46120, 80481, 250743, -139439, 192806, -181688, 14925, 119037, -165946, -89306, -331509, 27115, -85689, -222517, -70450, -39892, -57557, 102351, -110134, 104241, 128949, -17160, -328381, -105247, -294831, 180473, -72716, 79963, -247221, 28913, -273531, 98892, -12421, -284325, -98172, -158293, 108694, -10703, 393685, -155063, -84671, 23453, 327211, -237597, -1764, 203386, 57850, 278002, -183331, -123998, 42181, -89245, 252174, -256026, 145439, -89128, -137994, -243767, 5685, -101503, 4955, -210201, -322537, -177509, 83249, 218444, 80376, -211639]
17868a11446B53199a73410h662I9258F328a84285A70317c1842D5588a4879j6207
17857c1086G1942a77792N8739d4625O069m89234d7171A04553g317j11024N3726
17846f4615j06736o695A26141b62998J24231e0861k2135p3307Q654F2050k9084
17835C2966a73309A01019L54676h1397B47612a4024G2063L12128d20273A49633
17824a5082l38015B8411O2724a29526L5058j51344f6114E6012a23593A92556b65784
17812a11593m760d1944A26816a55620E1262e9853j40080i4720D421K11358a8402
17800C34320A05243a57947n1995H9137L3593b38775A22734b14973C48038A26234
17789A08208b56574D7312R4595a97017A21679e2642A74943l3278b24301K1910
$$ y = [-111446, 253199, -173410, -8662, 99258, 6328, -184285, 170317, -31842, 45588, -14879, -31086, 71942, -177792, -119053, -44625, -38556, -527790, -47171, 104553, -7317, -118341, -64615, -171351, -178046, 126141, -262998, -138767, -50861, -72996, -146303, -137649, 62050, 32966, -173309, 101019, 455695, -81397, 247612, -14024, 72063, 384191, -420273, 149633, -15082, -353097, 28411, 91135, -129526, -94468, -245812, -66114, 56012, -123593, 192556, -265784, -111593, -116353, -41944, 126816, -155620, 51262, -59853, -199933, -94720, 4421, 215779, -18402, 334320, 105243, -157947, -209942, 89137, 122730, -238775, 122734, -214973, 348038, 126234, 108208, -256574, 47312, 141907, -197017, 121679, -52642, 174943, 141665, -224301, -202391]
17779b02391A17467J6779B2340J45249E6198K1310d8053B7638c12151E2741J90398
17768B43139a30808j20595B76056p2656N9483A18600A8458a50009r6147m1159
17758b87315M850k0506d9796A34888K25n0800e1786I8181e7668A94872D4945J68269
17746B13214k529b3110G5021a10954A94664G257c35947C6471a21402a6456B9167
17734b69038g2944B0014J95359b50537a06244k7805H3751J66927j22482e7781
17723F3614b21861J08000e0562B5735K01202a30928r2850I2561b07647A11888
17712E7479Q31a44726f282D3174b10672R0222A16924J4814F3309J54212b04378
17700B3620J03786j3759a47176i114G4453A3141b42988B14833r3555c25399h8011
$$ y = [-202391, 117467, 134246, 22340, 167589, 56198, 77508, -48053, 27638, -312151, 52741, 243139, -130808, -251403, 276056, 203400, 262883, 118600, 18458, -150009, -246156, -287315, -282465, -302971, -49796, 134888, 135113, 84313, -51786, 98181, -57668, 194872, 44945, 213214, 210685, -23110, 75021, -110954, 194664, 7257, -335947, 36471, -121402, -16456, 29167, -269038, -72944, 20014, 215373, -250537, -106244, -134049, 83751, 250678, 128196, -57781, 63614, -221861, -113861, -50562, 25735, 226937, -130928, -223778, 92561, -207647, 111888, 57479, 58310, -144726, -6282, 43174, -210672, -120450, 116924, 131738, 63309, 217521, -204378, 23620, 127406, 113647, -147176, -9114, 74453, 13141, -242988, 214833, 121278, -325399, -88011]
17688A88536d8644C44030b9054m1241L1502L402j7044j52042J0346L5925g2347
17676d21528D068g848B9658a29313G9720B6032a10864o620D27587b77806A53841
17664A41386a36490k45773G6810b58118B0910c0704j90994j26008a7990j68457
17654a86447C88556f251j96969H2744a2211m8155K7579J0013j45636B94037C2736
17642a30302A61744G4168d2169H875J48566J60981d7067j4350A09103Q9037I5873
17630b28064A42889j0589b3460k73872A20282J49690n5458a56678A22136a7551
17619a46615C47230c95249C7553J50260P8323b19095A37800g7757A87952A5K76822
17608B76837d07829B2329J06094k8980b80646A41781J88821c03626B19388N7881
$$ y = [188536, -48644, 344030, -29054, -70295, -38793, -35391, -52435, -204477, -194131, -158206, -72347, -421528, 4068, -7848, 29658, -129313, 79720, 26032, -110864, -117484, 427587, -277806, 153841, 141386, -136490, -382263, 76810, -258118, 20910, -30704, -221698, -347706, -17990, -186447, 388556, -6251, -203220, 82744, -12211, -60366, -32787, -22774, -168410, 294037, 32736, -130302, 161744, 74168, -42169, 8875, 157441, 318422, -47067, -61417, 109103, 198140, 95873, -228064, 142889, 132300, -23460, -297332, 120282, 269972, 214514, -156678, 122136, -17551, -146615, 347230, -395249, 37553, 187813, 266136, -219095, 137800, -77757, 187952, 15, 276837, -407829, 22329, 128423, 99443, -280646, 141781, 330602, -303626, 219388, 277269]
17598B77269b79950e3192r6593C04525e2249B18142a52576f5853A18726g393A70198
17586F1522b3178B73834C1055a34825M1296E013N82184A89872k4770E9387d6876
17574A2216M2846b21777A52296c6367A0053a43208A36721A6073J89251k8963R0979
17563B67340a56044A86161n3001N35a02437F2845K9770J36263c80645a44499B18754
17551B5251a63613E5264K48720G85K3810O4969c5470j00186a0063o7347n5360
17540a32770A93644P2875I5266M5541k7430b47292A74038h1041A64450J10262
17530B74712h4052A5132J0173R8823C4501b5826j04309D3640a28801D03501k01301
17519B02200K3853B8127R1807a08101L3563j1016A98352k4575H907J3000q796
$$ y = [277269, -279950, -53192, -149785, 304525, -52249, 218142, -152576, -65853, 118726, -7393, 170198, 61522, -23178, 273834, 31055, -134825, -93529, 5013, 587197, 189872, 165102, 59387, -46876, 12216, 55062, -221777, 152296, -36367, 10053, -143208, 136721, 16073, 205324, 176361, 267340, -156044, 186161, 133160, 133695, -102437, 62845, 92615, 228878, -380645, -144499, 218754, 25251, -163613, 55264, 303984, 785, 24595, 89564, -35470, -135656, -10063, -77410, -132770, 193644, 266519, 95266, 140807, 113377, -247292, 174038, -81041, 164450, 274712, -84052, 15132, 25305, 124128, 34501, -25826, -130135, 43640, -128801, 403501, 202200, 226053, 28127, 119934, -108101, -74538, -85554, 198352, 173777, 8907, 21907, 13111]
17508A3111K54805E6174N2271K36033r1865n8409J45935A05604a80981A36358
17497I923K01629j1207d14221E5596J30027L2920A0938L9872j0676J27262p0506
17486I6890a41449B44876r5848J07976A02583D5525J40040e0226A87045K24926
17476D11971D7426Q2025N3937B2100K43575F2076h9319c043D0567N7733J45112
17465B43412a39660f1401B10801r8411C8837N0347L07225c70891B64452L8619
17455C03071E1220a8464A07077k3891R1542h1341A65658L6781L9045j16909K14527
17444C39102j54358L57496k58621m4877J08038H3617K01279E4685K48213F8148
17433D1165K41524P8971K197j54188f1180A47273J60475h489B33821E683L62783
$$ y = [13111, 267916, 56174, 108445, 344478, 252613, 194204, 340139, 105604, -180981, 136358, 9923, 211552, 200345, -414221, 55596, 185623, 218543, 10938, 50810, 40134, 167396, 96890, -141449, 244876, 149028, 257004, 102583, 45525, 185565, -50226, 187045, 411971, 47426, 129451, 183388, 22100, 265675, 62076, -89319, -3043, 40567, 98300, 243412, -139660, -61401, 210801, 112390, 38837, 89184, 396409, -370891, 264452, 303071, 51220, -18464, 107077, 83186, 174728, -81341, 165658, 202439, 241484, 124575, 339102, 184744, 542240, 283619, 238742, 346780, 83617, 284896, 54685, 302898, 68148, 41165, 282689, 361660, 363857, 209669, -61180, 147273, 307748, -8489, 233821, 5683, 368466]
17422C68466l460B9514d6416B01091J97655b20849H8771M2876L2943L8883c01846
17410B30679C9923J23288L0260D4295J65915l7586O9833F6984J92451j28590R4847
17399B25692N9616J8684L04541k28283G7698K38224L1596c049m3579B23892B3379
17387A50496h8628j02275D0933n634K25394f1580H2691Q2193d1655B18035f0848
17375C23390a27151C43182H1619B6920J96309c3580A48630b37646e1581A5035
17364a03334B26010n9240J99465j4414D5780J18514K08927B2558R9322M0312M22629
17353E84821f2952D6745K94692j00217q859F6926a26991C40617A13773b12948
17342C82304a51972A06114J83293j07011J66425D9988k1887J33540J67154a8630
$$ y = [368466, 365006, 29514, -46416, 201091, 398746, -220849, 88771, 131647, 164590, 203473, -301846, 230679, 39923, 163211, 193471, 44295, 210210, 172624, 242457, 66984, 259435, 130845, 225692, 285308, 303992, 608533, 380250, 77698, 315922, 347518, -3049, -46628, 223892, 23379, 150496, -88628, -190903, 40933, 35299, 260693, -61580, 82691, 164884, -41655, 218035, -60848, 323390, -127151, 343182, 81619, 26920, 223229, -33580, 148630, -237646, -51581, 15035, -103334, 226010, 166770, 366235, 351821, 45780, 164294, 373221, 22558, 121880, 162192, 584821, -62952, 46745, 341437, 241220, 232361, 66926, -126991, 340617, 113773, -212948, 382304, -151972, 106114, 289407, 182396, 348821, 49988, 28101, 161641, 328795, -18630]
17331A82882L94383H2553J3525P6831q2963J08098J38617i7220L7061I4694a44359
17319B00180b68369I9932Q6787c6012I5645J24593p1378O2193k0583J38138A796
17307A6230Q1282J63313L26164g7997B54701j2623E2147M58122k42533J84429
17297D52165a0911D20119k02403M9825E7397K45452j21068K13631B2766c3504
17286B31231e9470A36193O2729K4745I7221J98788g0827D01049j98758o0955K23964
17275C65300A42886E0679R8151K78902D2559a45669B18203J44740a14759B63933
17264A50224J93563a16049A58391O5176G1205K87549o3281a67853D981J40596
17254A45577e0246A55688C9432L17632j04229N7297j47714b6446B10791Q8963
$$ y = [182882, 577265, 82553, 96078, 172909, 89946, 198044, 336661, -97220, -60159, 94694, -144359, 200180, -268369, 99932, 186719, -36012, 95645, 220238, 148860, 211053, 190470, 328608, 1796, 16230, 97512, 260825, 586989, -77997, 254701, 242078, 52147, 510269, 267736, 452165, -10911, 420119, 217716, 267541, 57397, 302849, 181781, 395412, 22766, -33504, 231231, -59470, 136193, 198922, 223667, 97221, 296009, -70827, 401049, 202291, 141336, 365300, 142886, 50679, 148830, 427732, 42559, -145669, 218203, 362943, -114759, 263933, 150224, 343787, -116049, 158391, 223567, 71205, 358754, 295473, -167853, 4981, 145577, -50246, 155688, 39432, 357064, 252835, 310132, 162418, -26446, 210791, 299754]
17244B99754j06354l1227Q4407r9410R1131a7967B19171d327F5855K67896P7117
17233D10868M17I9155K24142j36601c559A37245L0820A6068P0622O7342G14K38259
17221B38973R298a15276E31883j94291G5184a16769d8728B27031N9768n2839R1556
17210C25516j41707j822J20550A03416K43805r8930J45951N3366b5612C47563
17199B67622j6286O5730F9970M67071k46971L89285a4616C76667j71341B1107
17188B19882m9310f2414B92600A23309E8596a05995D43759F38N17364j49417A58014
17176C40407I7802K09593J13301r6204a65904D09657m0291J32261a2896C3100
17165B74534A02918a06552h962B77101J0131d3677D22850o2667j00407N0200J20366
$$ y = [299754, 193400, 162173, 246580, 147170, 238301, -17967, 219171, -4327, 65855, 333751, 410868, 411285, 99155, 323297, 186696, -3559, 137245, 168065, 16068, 86690, 154032, 714, 238973, 248271, -115276, 531883, 337592, 75184, -116769, -48728, 227031, 286799, 233960, 325516, 183809, 181987, 302537, 103416, 347221, 248291, 394242, 447608, -25612, 347563, 267622, 251336, 317066, 69970, 537041, 290070, 679355, -14616, 376667, 205326, 21107, 219882, 170572, -62414, 292600, 123309, 58596, -105995, 443759, 638, 518002, 368585, 158014, 340407, 97802, 307395, 420696, 324492, -165904, 409657, 369366, 501627, -12896, 33100, 274534, 102918, -106552, -8962, 277101, 287232, -43677, 422850, 360183, 259776, 309976, 430342]
17154D30342j68656L22842B01475P7387J55777B10355J28104a3561F82663C18822
17143B23979K7796F0030L18437A84911M54674k97324K16955A54975n0513K37538
17133C42000p8593K13979k07784P4486l3079L01031C6604L34686R9409k22091
17123B48608i7722D61638P8564m4061A45195g4044D93453d3568B34195O8763J59106
17112D62064A86408K22161n0953j21815M24789A94203K60156r5165A07810J80918
17102B88728J63220J2661A67472K06869p5170p7046j07264L53809r0284A57596
17091F35795A97123J44847J87199j19060A34219Q2589H8996L26393r507j72333
17081B33549J96420j01017J27035K2447J02057B59349K92668j26955K61861j77395
$$ y = [430342, 261686, 584528, 201475, 278862, 434639, 210355, 338459, -13561, 682663, 318822, 223979, 251775, 60030, 378467, 184911, 639585, 342261, 559216, 154975, 104462, 342000, 263407, 477386, 269602, 344088, 311009, 612040, 36604, 371290, 470699, 248608, -97722, 461638, 540202, 496141, 145195, -74044, 493453, -43568, 234195, 302958, 462064, 186408, 408569, 357616, 235801, 660590, 194203, 454359, 359194, 107810, 288728, 451948, 464609, 167472, 374341, 299171, 222125, 114861, 468670, 378386, 157596, 635795, 197123, 341970, 529169, 410109, 134219, 216808, 88996, 415389, 405882, 233549, 429969, 328952, 455987, 478434, 580491, 259349, 552017, 425062, 686923, 509528]
17071E09528A97010L48940k50446J10720N7442m9026J00189J58297l18208J70954
17061E25872l9861l0492l1806K72463B53586L16083B11163K8124J85174J49584
17051E74045j38785K54043A53739L78085M6630j03615J54125k92390M68974B23165
17040F21611B45314N82986C62265M09291Q5639m05645R4471K3787l898J60911
17030G26821N2135k99735j01003o200L37734k96786M4957J70995o6680J22816
17020F85054L29832J43126C49045L48636k91063K21348k22314K43132N560J85602
17010H39946l16437O1280J10809j7422j55932K58176j3417l58443M23127p9235
17000G52452k1543k88461M28757k4279l58527K19230K44834C33688O10526j89396
$$ y = [509528, 197010, 545950, 295504, 406224, 463666, 414640, 514829, 673126, 354918, 525872, 486011, 455519, 423713, 696176, 253586, 569669, 211163, 239287, 424461, 574045, 435260, 689303, 153739, 531824, 578454, 474839, 628964, 336574, 805548, 223165, 621611, 245314, 828300, 362265, 771556, 857195, 451550, 546021, 569808, 565910, 726821, 778956, 479221, 378218, 372018, 709752, 412966, 457923, 628918, 562238, 685054, 1014886, 1158012, 349045, 697681, 406618, 627966, 405652, 648784, 654344, 839946, 523509, 584789, 695598, 678176, 522244, 780420, 767003, 408560, 831687, 752452, 730909, 442448, 871205, 846926, 488399, 707629, 952463, 333688, 944214, 754818]
16990G54818r3716M5649J54229j19983m9518K98460p5906J9224j03614J2076j54053
16979F87666M64238k13232n2724L29872r9283j37225k45355J29022j33005L24239
16969A054213k75860L06783j56413j88182J73151L58576J00707l95683N0421L8425
16959A066138k61J3651K15597k78451K45659j95831j48137K32078L3763j14704
16949A069502m61894M86417P254j0840n206J23261k49499J19942J2194k36294
16939H54837J16749M60639n71799N38864j79093K327m1692J17550k1349L7574
16929A314607k0193O3447k5339k85284N27549j65910o7203L4433k54985M27628
16919A548750l37443j09020K56317O557M87069m36634P4123k37045J55626O6083
$$ y = [754818, 661102, 706751, 860980, 740997, 691479, 989939, 914033, 933257, 829643, 841719, 687666, 1151904, 938672, 885948, 1215820, 1116537, 979312, 733957, 862979, 729974, 1054213, 778353, 1085136, 928723, 740541, 913692, 1272268, 1372975, 977292, 1027713, 1066138, 1065877, 1079528, 1295125, 1016674, 1262333, 1066502, 918365, 1150443, 1184206, 1069502, 607608, 1094025, 1101279, 1090439, 1085233, 1208494, 958995, 1078937, 1091131, 854837, 971586, 1432225, 860426, 1399290, 1220197, 1222524, 1180832, 1298382, 1277033, 1314607, 1294414, 1357861, 1332522, 1047238, 1574787, 1408877, 1341674, 1376107, 1121122, 1548750, 1211307, 1102287, 1358604, 1365161, 1852230, 1415596, 1489719, 1252674, 1408300, 1474383]
16909A474383M07070l39387K14139k38760K55369k6622M7251l4622j76359N8294
16899A640756J78976j86497Q7900K20634j54944j1444j70083J34150P92K7000
16889A767240R8753n7063J2101q0044L00332J88197p6316j64482j19201N75298
16879B444815m94678O1295j28441L66486l07060J75292J02031J8115L52597P4474
16869B664926j2282l35431j12406L86310l26105K43091k0542K52966j23539q4576
16859B532412L51144k15066P0747J90052j3052k14848J60288J36474J09595l95381
16849B712365L47385q8650M49569k37207Q7413j38888J11771O57724l52461r8471
16839C450550J76293J11706r5746m9856K11822N2416J1247J96976j70072M36641
$$ y = [1474383, 1881453, 1542066, 1756205, 1517445, 1772814, 1746192, 1793443, 1758821, 1582462, 1640756, 1819732, 1633235, 1721135, 1941769, 1786825, 1775381, 1605298, 1739448, 1740240, 1767240, 1865993, 1808930, 1821031, 1740987, 2041319, 2229516, 2153200, 1988718, 1869517, 2444815, 1950137, 2011432, 1882991, 2249477, 1942417, 2117709, 2219740, 2237855, 2590452, 2664926, 2652644, 2317213, 2204807, 2591117, 2265012, 2508103, 2487561, 2740527, 2616988, 2532412, 2883556, 2668490, 2739237, 2929289, 2916237, 2701389, 2861677, 2998151, 3107746, 2712365, 3059750, 2971100, 3420669, 3183462, 3270875, 3131987, 3243758, 3901482, 3549021, 3450550, 3626843, 3738549, 3642803, 3592947, 3804769, 3857185, 3868432, 4065408, 3895336, 4331977]
16829D331977K3577n07675L02126L01107l6344K79158R4286j93399j73795O68903
16819E089921P007l94055N00971J94286j87116J55883k02607K39244R3154O62595
16809F159283n12835K14515Q9592M15818j76661J40583M22234m74978N37593J22709
16799F937853N92030j60655L88535J28859k08672K02211M88851K61467k98343
16790H332136K09861O03473j10019n7297O08793j3689J47759L74321K03559M29041
16780A0727938O1296K19433L47433O06559M3339N08786j60999R92673K82550J32609
16770A3761617M33335L84890O55429q1005Q78753O13932O02966m9279Q62333M54462
16760A8517433Q65004N12145O11367P34111J038584O60401Q67211Q05507R05420
$$ y = [4331977, 4355554, 3847879, 4150005, 4451112, 4414768, 4693926, 4788212, 4594813, 4421018, 5089921, 5096928, 4702873, 5203844, 5398130, 5211014, 5366897, 5164290, 5403534, 5496688, 6159283, 5646448, 5860963, 5950555, 6366373, 6189712, 6330295, 6752529, 6277551, 6815144, 6937853, 7529883, 7369228, 7757763, 7886622, 7677950, 7880161, 8369012, 8630479, 8332136, 8541997, 9145470, 9035451, 8978154, 9586947, 9573258, 9721017, 10095338, 10298897, 10727938, 10789234, 11008667, 11356100, 11962659, 12005998, 12514784, 12353785, 13346458, 13629008, 13761617, 14194952, 14579842, 15235271, 15154266, 16033019, 16646951, 17249917, 17200638, 18062971, 18517433, 19382437, 19894582, 20505949, 21240060, 22278644, 22939045, 23806256, 24611763, 25517183]
16751B5517183Q84267P39092J354985J396705P06592J632785J173973J374866
16743C4780448J499599J506970J610648J759006J833939K278040J788751K565750
16735D9623151J816161K967939K616658L031401L077239L118425L482277L812082
16727G3545333M109497L827780M348454M441263M907347N088638N382944N513163
16719A11164419N664865O085177O025917O140183O353225O117702N774784N366418
16711A58692690N188086M863923M416455L326675K961655J608151O61071k71694
16703A81447012j152533k045249l161508l759435m401696n320289n597364o017997
16695A49990941o246762o224918o425069o446221o126615o167531n681090o032148
$$ y = [25517183, 26401450, 27140542, 28495527, 29892232, 30598824, 32231609, 33405582, 34780448, 36280047, 37787017, 39397665, 41156671, 42990610, 45268650, 47057401, 49623151, 51439312, 54407251, 57023909, 60055310, 63132549, 66250974, 69733251, 73545333, 77654830, 81482610, 85831064, 90272327, 95179674, 100268312, 105651256, 111164419, 116829284, 122914461, 128940378, 135080561, 141433786, 147551488, 153326272, 158692690, 163880776, 168744699, 173161154, 176487829, 179449484, 181057635, 181718706, 181447012, 180294479, 178249230, 175087722, 171328287, 166926591, 161606302, 156008938, 149990941, 143744179, 137519261, 131094192, 124647971, 118521356, 112353825, 106672735, 100640587]
16687A00640587n296016n354319m518376m759299m698813m094934l520660l996442
16679F4401728l407483l008088k994151k709737k856410k517326k266887k067707
16671D2573939j961989j896700j991320j661829j421459j583377j309010j086563
16663B9661692j335007j441274p22415j180246r43261o68409j249067p05196n53276
16654B0863541q94680j000619o69447p91926k57855p24830l13827m91427l97022
16645A5321908l52303m65136o38564m38852n29183m78005r2795p53289L54909
16636A1928690n19012o90008k98873m6445m80504j82186j39462l78656j80021
16627I013523m23607k15921j14384j37807n28779J64304m14809j16789r24k25796
$$ y = [100640587, 95344571, 89990252, 85471876, 80712577, 76013764, 71918830, 68398170, 64401728, 60994245, 57986157, 54992006, 52282269, 49425859, 46908533, 44641646, 42573939, 40611950, 38715250, 36723930, 35062101, 33640642, 32057265, 30748255, 29661692, 28326685, 26885411, 26162996, 24982750, 24039489, 23371080, 22122013, 21416817, 20863541, 19968861, 18968242, 18298795, 17506869, 17249014, 16524184, 16210357, 15718930, 15321908, 14969605, 14504469, 13865905, 13427053, 12897870, 12419865, 12327070, 11573781, 11928690, 11409678, 10719670, 10420797, 10374352, 9893848, 9711662, 9572200, 9193544, 9013523, 8589916, 8373995, 8259611, 8121804, 7593025, 7757329, 7342520, 7225731, 7224807, 6999011]
16617F999011N3235l10735l75317J01658K5634m04509p2174K35883n65950J8231
16607E704967j94998q7492N936k73949N4416K36270k98227m93424N4407r4455
16597D613451j87375L25638k34852j11590j19489m01500J59388J45771J10805
16588D300247o81653J23964j56094K16913j84572l38353M73647m95279p6877K95945
16578C477888k37674j01516K23519m77783j1889K27257r6865Q6189k13293p5524
16568B800309M3400k2593m37597J99946o5725K32743n46258j7131L24099j2662
16558B498531k25335K60428l02235K5413M3159J9899m83022L96275m92737J94332
16548A934708M182K41386N5538m42517N95642o76804N66644m57347J40198k24132
$$ y = [6999011, 7052246, 6741511, 6366194, 6467852, 6493486, 6088977, 6016803, 6252686, 5686736, 5704967, 5509969, 5422477, 5428413, 5154464, 5208880, 5445150, 5146923, 4653499, 4707906, 4613451, 4426076, 4751714, 4516862, 4405272, 4285783, 3884283, 4043671, 4189442, 4300247, 3618594, 3742558, 3586464, 3803377, 3618805, 3280452, 3754099, 3258820, 3181943, 3477888, 3240214, 3138698, 3362217, 2884434, 2872545, 3099802, 3002937, 3089126, 2875833, 2800309, 2843709, 2821116, 2383519, 2583465, 2517740, 2750483, 2204225, 2187094, 2511193, 2498531, 2273196, 2533624, 2231389, 2256802, 2299961, 2319860, 1836838, 2233113, 1740376, 1934708, 1938890, 2180276, 2235814, 1793297, 2388939, 1712135, 2278779, 1821432, 1961630, 1737498]
16538A737498J17360k59636L31902n3732m07860J4287L77766k40836L65411k80721
16528A701439k58518K9983L28260m95002K14212J48398k16654K65009j01338m24550
16518A191239P9367N22748n69993J41845q3238K6431k16903Q1189J68320j90106
16508A150899j69424K18385J65033j04592K70703l31220j53420J10997j5153O2137
16498A204345m2613O0779m81088M41528j72043L25927j48945m7438Q226j93970
16488I54708M4718j60551N1643K20840j0334j20335M2521m61344L89509K01075
16478A152450k59985k06981K15081O0737J43k87553J49549L2274J25599k35577
16468G45737J86065j48477J47299k61857K66057k32773j73403M21038j83314K78195
$$ y = [1737498, 1854858, 1595222, 1927124, 1873392, 1465532, 1479819, 1857585, 1616749, 1982160, 1701439, 1442921, 1472904, 1801164, 1306162, 1520374, 1668772, 1452118, 1717127, 1615789, 1191239, 1270606, 1793354, 1223361, 1365206, 1281968, 1308399, 1091496, 1172685, 1341005, 1150899, 981475, 1199860, 1364893, 1260301, 1531004, 1199784, 1046364, 1157361, 1142208, 1204345, 1161732, 1222511, 741423, 1182951, 1010908, 1336835, 1187890, 1140452, 1148678, 954708, 999426, 838875, 890518, 1111358, 1101024, 980689, 1023210, 561866, 951375, 1152450, 892465, 685484, 900565, 961302, 961445, 673892, 823441, 855715, 981314, 745737, 931802, 783325, 930624, 668767, 934824, 702051, 528648, 949686, 766372, 1044567]
16458A044567l61283m3606R7761j9496j02198K44542K6937J51651D98811J17415
16448F16226J42877N2058l57639M45722J2770o0295j32372l2932l41071J83415
16438E28759M9310J8402o9453A92995L24029j68495M04194j93710J2995J2199
16428E84207J00423q6012O6856j42135M0801K92828j08186j34218n0276J2068
16418E76356J52608k05427q9700K72284B22122L31363k31603n2227R5185L25985
16408F90825k43882J1553J46992o8905k2057j98650J19518n7281K03635k2506
16398E59242m4981p5608j42532m3730K01391K59534K8754b7433D05347j36821
16388B68526K28596B31635M8717J42763p5821N5511N8939K1020A48665L48706
$$ y = [1044567, 683284, 639678, 737439, 717943, 615745, 860287, 887224, 1038875, 498811, 616226, 759103, 811161, 453522, 899244, 912014, 851719, 719347, 686415, 345344, 528759, 578069, 596471, 527018, 192995, 517024, 348529, 752723, 559013, 572008, 584207, 684630, 598618, 665474, 523339, 564140, 856968, 748782, 614564, 564288, 576356, 728964, 523537, 433837, 706121, 222122, 553485, 321882, 269655, 364840, 690825, 446943, 458496, 605488, 536583, 514526, 315876, 435394, 378113, 581748, 559242, 514261, 438653, 296121, 252391, 453782, 713316, 742070, -27433, 405347, 268526, 497122, 231635, 280352, 423115, 347294, 402805, 461744, 482764, 148665, 497371]
16378D97371B20075K6594J96454m0131K48140B78817m8398m4106L42068k33421
16368B94960N2390L6935j59973n3081J47772r8752J36537K19002j94388J77534
16358E58936j26112A70199J19027K7592m5245j34384J10291j14374l336Q842J12573
16347B51185K01266j47955A04054C0768M70809f513I1722N72427j65267J3660
16337E12542a56954G21406C57461M6804K26108B40744J52688K2300A59299m7475
16327A11824c9658C28419J14129l0103j84909n0989M0399B368J71183J35876p5480
16316B33947J57222A63626b8176B29607r1110K70797o9741b429B24127J95126
16306D19253j18858j38087A2971J22700J41226j22016Q7954A02084J95160H8186
$$ y = [497371, 220075, 246669, 443123, 402992, 651132, 278817, 230419, 186313, 528381, 294960, 347350, 384285, 224312, 171231, 319003, 220251, 356788, 575790, 381402, 558936, 432824, 170199, 289226, 316818, 271573, 137189, 247480, 133106, 129770, 138612, 251185, 452451, 304496, 104054, 30768, 501577, -6513, 91722, 664149, 498882, 512542, -156954, 721406, 357461, 404265, 630373, 240744, 393432, 415732, 159299, 111824, -39658, 328419, 442548, 412445, 227536, 176547, 216946, 2368, 173551, 309427, 233947, 391169, 163626, -28176, 229607, 138497, 409294, 339553, -2429, 224127, 419253, 300395, 162308, 12971, 135671, 276897, 154881, 242835, 102084, 297244, 88186]
16295H4631C6990A5081J38553F6024L91219j95220J05687J249A02181J70159N7063
16284C29403l7204m1541k0942J02578H0113b26422D95727B13983J03747I2678
16273D6356L49618E5634K93221I9111d1673F9535J94043Q1692a47897D47403e060
16261D94731a11261B1201a03885A21947J62187c3669C19830p4452c1493A53006
16250f4037C7421q80O9962J05603r7302n751L9405J59359J13155I3063k2124L0824
16238A01763c9224B23708a62032A20037b05783A54009i2579L8100g629B43929
16227b9414k4109B90141G4422a51080C00a00123A97350G1677J83974e8650K2073
16216c6577B35445E3071M43740k05539D8430a53904P4569A35341L8911K56925
$$ y = [84631, 36990, 15081, 153634, 66024, 457243, 262023, 367710, 368959, 102181, 272340, 329403, 292199, 250658, 229716, 332294, 80113, -226422, 495727, 213983, 317730, 92678, 46356, 395974, 55634, 348855, 99111, -41673, 69535, 263578, 345270, -147897, 447403, -5060, 494731, -111261, 21201, -103885, 121947, 284134, -33669, 319830, 245378, -31493, 153006, -64037, 37421, 36541, 106503, 212106, 114804, 109053, 148458, 307817, 420972, 93063, 70939, 101763, -39224, 223708, -162032, 120037, -205783, 154009, -92579, -54479, -7629, 243929, -29414, -53523, 290141, 74422, -151080, 300, -100123, 197350, 71677, 255651, -58650, -36577, 235445, 53071, 496811, 291272, 48430, -153904, -79335, 135341, 174252, 431177]
16206D31177A79646m0896R5243a84945B24504a09817C7851J28091j291J21120
16196B85771a26290E9442J98986I391K0133b0256k75744E29924G7828l8878J1823
16185E0773b9055r5911B77692b29616j308A24587L68832b17852j02819K8415J41081
16174a51175B576L30864A3799K16878A6107b13164f5844A64205A0254J23212E6941
16162c410j86231H9494a26387A17420J18107c36881a03205j01179a5311j52494
16152a67805c9177B23007C6860a59699g008D7531b38824Q0512A66666c9249k8610
16141f7859r0221D07481f0101A7320g5382B53263i7539A7044L7960J49016o9936
16130A34084M5757J34578h1638k7711j64341H1761J224g952k68332G0502a08531
$$ y = [431177, 179646, 138750, 233993, -184945, 224504, -109817, 37851, 165942, 164651, 285771, -126290, 59442, 258428, 9391, 29524, -20256, -296000, 529924, 77828, 38950, 50773, -29055, -124966, 277692, -229616, -230924, 124587, 493419, -217852, -320671, -292256, -151175, 2576, 333440, 13799, 230677, 16107, -213164, -65844, 164205, 10254, 133466, 56941, -3410, -189641, 89494, -126387, 117420, 235527, -336881, -103205, -204384, -15311, -167805, -39177, 223007, 36860, -159699, -7008, 47531, -238824, -158312, 166666, -39249, -67859, -158080, 407481, -60101, 17320, -75382, 253263, -97539, 17044, 55004, 204020, 134084, 179841, 314419, -81638, -109349, -273690, 81761, 82985, -7952, -276284, 70502, -108531]
16118D08710F4184J6948J3457M03032A32746J67827j37972n7742J51562B293N7044
16107E9337L2946H841a00198G1438l0297A3526L14792b41967A47923e0420E5246
16095A04889c60756b6793n412B17057a22458A23503M0768o8393D1668J35034C6382
16083A96441d173B41558a38839F6679c47822E7079J72587d2840K1311A00493a55768
16071d2427m0614n233A83856m5228J83774A17198d5828A89089b18460c4382q1244
16060a15626K7235A1855J04841h882q0879n4629C04664j29883l5211A3049N3365
16049F6414k1753K00930a34913D06339A50927g1895j72890P4228j3778A49511
16038e6721B95050g5805B42675i0907n7755B41029h6307b6352A32452k9687D9076
$$ y = [408710, 64184, 81132, 94589, 497621, 132746, 300573, 162601, 104859, 256421, 2293, 59337, 92283, 8841, -100198, 71438, 41141, 13526, 328318, -241967, 147923, -50420, 55246, 104889, -360756, -26793, -32205, 217057, -122458, 123503, 164271, 95878, 41668, 176702, 36382, 196441, -4173, 241558, -138839, 66679, -347822, 57079, 229666, -42840, -21529, 100493, -155768, -42427, -83041, -88274, 183856, 138628, 322402, 117198, -45828, 189089, -218460, -34382, -115626, -88391, 11855, 116696, -8882, -89761, -144390, 304664, 174781, 139570, 13049, 66414, 44661, 245591, -134913, 406339, 150927, -71895, -244785, -170557, -184335, 149511, -56721, 295050, -75805, 242675, -90907, -148662, 241029, -86307, -26352, 132452, 102765, 49076]
16026A5321a20753A16253D0946J19061a59611j77576A56404c10583C30697j06222
16016B24475a49820A87251a2135B26653J8218E4369B862L15766A16490a17893
16005a53722j63893A47668b1951k41339P7250O9943A25310m1443b91488f5344
15994A6516a36383k3907n8816g7305A61727h0516A10587n0943a70819N3025m1012
15983a58806N6137G6884a0995p9689j80464a17437B93032j24710e5079B20374
15972e8709F7856R3397a95470C07254n0329J40720k0844j74542B0622L1865b04094
15960g1442A2189M9M2985O6334f1228K2450k7733A81468b26321g9712m07835K20081
15948b67466h4388A51612h2554a1199j32886d302F8447d62651B12732e4477r6148
$$ y = [15321, -120753, 116253, 40946, 160007, -159611, -337187, 156404, -310583, 330697, 224475, -149820, 187251, -12135, 226653, 244871, 54369, 2862, 318628, 116490, -117893, -153722, -317615, 147668, -21951, -263290, -186040, -116097, 125310, 83867, -291488, -65344, 16516, -136383, -160290, -219106, -77305, 161727, -80516, 110587, 59644, -170819, -117794, -158806, -102669, 76884, -10995, -90684, -271148, -117437, 293032, 168322, -55079, 220374, -58709, 67856, 161253, -195470, 307254, 256925, 397645, 376801, 202259, 20622, 52487, -204094, -71442, 12189, 12238, 55223, 121557, -61228, -38778, -66511, 181468, -226321, -79712, -487547, -267466, -84388, 151612, -82554, -11199, -144085, -4302, 68447, -462651, 212732, -54477, -150625]
15937a50625D5073K8968c05471B40372b40118A13113J48528a66158A96582e9438
15926b77902K8184b6566k33112A05870a03536B99583a10671l294M0308j75806
15916b49463A14113b21928R1571H0158P8956N3796e28567K38971f6327j83191
15906b49518B853b54732F4749J23456a32895L0708A87736g5077K022F8353a54204
15894f1862j69010e9519F6944J17643D2398J3661P7570a02367r7725l35224a7725
15882b7967j56162a4947j93040c3133D07094F681b8572E4493b24604J11670L1429
15871h1505k249D0749M3311K80557b36364c5020j36327D7312e6595l9277j78952
15860b74824L4904D6642d5044E0464d9881q190G6458c13601l5750h9151k66317
$$ y = [-150625, 45073, 74041, -305471, 240372, -240118, 113113, 261641, -166158, 196582, -59438, -277902, -249718, -26566, -259678, 105870, -103536, 299583, -110671, -113965, -73657, -249463, 114113, -221928, -130357, 80158, 159114, 212910, -528567, -289596, -66327, -249518, 2853, -254732, 64749, 188205, -132895, -102187, 187736, -75077, -73055, 68353, -154204, -61862, -230872, -59519, 66944, 184587, 42398, 56059, 133629, -102367, -200092, -535316, -17725, -27967, -184129, -14947, -207987, -33133, 407094, 6681, -28572, 54493, -224604, -112934, -81505, -83754, 40749, 84060, 364617, -236364, -35020, -171347, 47312, -56595, -95872, -274824, -239920, 46642, -45044, 50464, -49881, -58071, 76458, -313601, -349351, -89151, -355468]
15849c55468f7985G270J541i6300C0708i3013c2685j53750A85757R2558f3071
15837B92417c05900A51284b81918Q5734f7644B2102b03425E8485b73756C2886
15826a85630I9746f8534B6622B044i0980c0713A05137a23631l9541H4765a20814
15814c83223a11092N038p1551J7954o1668E8292M2639b83790a9057K522b789l13679
15802c16468h5595k08014L1194C03256q4277D3937h8213M0542l54147G3623a05600
15790a57744B13736b16962j6474F5674N8471K485E0669a11937j0857F2424J19478
15779A81902b820k40737f9663C6940P6252a25364a3289B7218n988F812J3025H703
15766A88904C7011a9223B37884c8241q0402c6742C51848b38855O7278N0324C9372
$$ y = [-355468, -67985, 7270, 8811, -96300, 30708, -93013, -32685, -186435, 185757, 278315, -63071, 292417, -305900, 151284, -281918, -196184, -67644, 22102, -203425, 58485, -273756, 32886, -185630, 99746, -68534, 26622, 2044, -90980, -30713, 105137, -123631, -163172, 84765, -120814, -383223, -111092, -106054, -177605, -159651, -221319, 58292, 100931, -283790, -19057, -16535, -2789, -316468, -85595, -293609, -262415, 303256, 218979, 43937, -88213, -47671, -401818, 73623, -105600, -157744, 213736, -216962, -233436, 65674, 124145, 126630, 50669, -111937, -122794, 62424, 181902, -2820, -243557, -69663, 36940, 113192, -125364, -13289, 27218, 21230, 6812, 19837, 8703, 188904, 37011, -19223, 237884, -38241, -118643, -36742, 351848, -238855, -171577, -121253, 39372]
15754a12024C38423i9921A44412f8308l1005A0885a50360C0663h0353A50810K6206
15743A77016h7016F066K18704H8551B7667b58488B37187F6788M24888G5787J67866
15732B43653A08970b3279A25359a81410J1084k5585A17565d684j10478A72216
15721b01187j773D0238b09382N3864j10633B53516a6372k50334p9299a01590k51154
15710c52744a20702Q597A86644M9826b12012C04018J38287a34402k19961A1670
15699A26448a50226M5419A30005N8676b5714j24113f2781b4361j25820c1943q4898
15688a16841c1236K253B8577a24286B45710a64736h0792G9171K4814h2166B36304
15676B23216A03267b81082C42463G0339b40682B2639b147l6566l05819K3280A85153
$$ y = [-112024, 338423, -99921, 144412, -68308, -99313, 10885, -150360, 30663, -80353, 150810, 177016, -87016, 6066, 224770, 88551, 27667, -258488, 237187, 66788, 491676, 75787, 243653, 108970, -23279, 125359, -181410, -170326, -195911, 117565, -4684, -115162, 172216, -201187, -202960, 40238, -209382, -155518, -266151, 253516, -16372, -266706, -346005, -101590, -352744, -120702, -112105, 186644, 236470, -212012, 304018, 442305, -134402, -354363, 11670, 126448, -150226, -104807, 130005, 188681, -25714, -149827, -62781, -24361, -150181, -31943, -116841, -31236, -28983, 28577, -124286, 245710, -164736, -80792, 79171, 103985, -82166, 236304, 223216, 103267, -281082, 342463, 70339, -240682, 22639, -2147, -38713, -344532, -321252, 185153]
15664a43425A6935h7518A3665e1674A37404i5736k72621A68755B6463b08033H9420
15652e1552a0438b309B5187f5118k3102a840j58630A41460c4453B44881N930K2064
15640B72875i2478k03778d0927j01358C37720b60269p7813E9674L4063a18807
15629B3801M7921a32849B3199Q2520a66453J6515q1937j58679A58749j9064J9575
15618A59260a32245d2061J4244B39153a77991k2428N3949o2706E2254J47124a52903
15606E2553B3836N2364B6049R2314g681j53975N9016A03709B7709e9175p473j26901
15594a93549A15842F371J7309b13910A18079b12766E9856a9992k19089k113A3367
15582B46876a40922A13479b53676b0135r1507M0194F7743a5077m9551n3135k5518
$$ y = [-143425, 16935, -87518, 13665, -51674, 137404, -95736, -368357, 168755, 26463, -208033, 89420, -51552, -10438, -2309, 25187, -65118, -88220, -1840, -160470, 141460, -34453, 244881, 250811, 272875, -92478, -296256, -40927, -142285, 337720, -260269, -338082, 59674, 93737, -118807, 23801, 71722, -132849, 23199, 105719, -166453, -149938, -231875, -390554, 158749, 139685, 159260, -132245, -42061, -27817, 239153, -177991, -200419, -146470, -209176, 52254, 199378, -152903, 52553, 23836, 76200, 26049, 118363, -7681, -161656, -102640, 103709, 27709, -59175, -66648, -193549, 115842, 6371, 23680, -213910, 118079, -212766, 59856, -19992, -239081, -241194, 13367, 246876, -140922, 113479, -253676, -20135, -111642, -71448, 67743, -15077, -64628, -117763, -143281]
15571a43281l0803D1609j8653J0767J68607C8838N2977d366j00877G5750B9385
15559b15936A2774a2005C2955e967n6705B20102J01328e0129k24735A94995e3777
15547A76546c9971D50985f3906C6315K9069h779C1219J87358b12846C61533D7398
15535c4416E6875M8883c6690q1353k33949a66669D7527J81031E6407b7679F8937
15523G829J73921N3167a46510k7100O6442E8211i212A47442K6556A0819h7291
15511I3550b17174P9573j27008A29101c11023A50710B0093d8098C71304I4546
15500C5456q230J69416l8681B3604J27381Q9802D5526a32325K884c5953C84070
15488D8060F552N1122K09598a11518J8029k78609i3475B69317a57983A94875K8902
$$ y = [-143281, -174084, 41609, 22956, 33723, 202330, 38838, 91815, -4366, -105243, 75750, 29385, -215936, 12774, -12005, 32955, -5967, -62672, 220102, 321430, -50129, -274864, 194995, -53777, 176546, -39971, 450985, -63906, 36315, 65384, -8779, 31219, 218577, -212846, 361533, 47398, -34416, 56875, 105758, -36690, -118043, -351992, -166669, 47527, 228558, 56407, -27679, 68937, 7829, 181750, 234917, -146510, -173610, -107168, 58211, -9212, 147442, 173998, 10819, -87291, 93550, -217174, -137601, -264609, 129101, -311023, 150710, 20093, -48098, 371304, 94546, 35456, 27226, 196642, 157961, 23604, 150985, 240787, 45526, -132325, -129441, -35953, 384070, 48060, 6552, 57674, 267272, -111518, -93489, -372098, -93475, 269317, -157983, 194875, 223777]
15477B23777c27992C8076a07924D5291I88h7152j23039A61196d917j64678B70463
15465a89392N0226B11899a68539l2679D1165b01384l3179H4833P3999a56786A20916
15453a21936A2694N0204J19929h9300k66269R8261F5679d1329J6536m0882B9130
15441a6917L443j489B89779A25146a44909B28046c01380C942a84543A40208a20879
15429D0115J12422a63909C5384L63313a23742H9155A4564a66314b1107k46613
15419b67720f0085h77n3731j12220N7960L5190B76018b1865j82715B86483r5727
15408A90756d61261I6862d762H4095J47311a93475c9481A39540c3045A01274m5088
15397E6186L4442L8477n3125K10962A13479L0346f8126B28440H6149K8272M9802
$$ y = [223777, -327992, 38076, -107924, 45291, 988, -87152, -210191, 161196, -4917, -169595, 270463, -189392, -139166, 211899, -168539, -201218, 41165, -201384, -234563, 84833, 158832, -156786, 120916, -121936, 12694, 62898, 182827, -89300, -355569, -257308, 65679, -41329, -24793, -65675, 29130, -16917, -13474, -14963, 289779, 125146, -144909, 228046, -301380, 3942, -184543, 140208, -120879, 40115, 152537, -163909, 35384, 398697, -123742, 89155, 14564, -166314, -21107, -267720, -60085, -877, -54608, -166828, -108868, -73678, 276018, -21865, -204580, 286483, 190756, -461261, 96862, -4762, 84095, 231406, -193475, -39481, 139540, -33045, 101274, 56186, 90628, 129105, 75980, 286942, 113479, 143825, -68126, 228440, 86149, 114421, 164223]
15386A64223b11182B1718P5454D425O1949J336b26653B66036b60078a17241d4773
15374a15760C3998e7363A0838a71220D3818i3413E2461c04840e2003G8190J67807
15363B45997I3787D1104g1250n9916K5120Q686k6405A93516p2118b10578j22786
15352c33364E5229h781A67341g2819L4525B33021A11059g5959E5472A5563c3022
15340f5530a9467F0996j8073a06752l8001A63030b65009p4726a0135j04850a5564
15328a46794A90118b57998C80615C453h6506L5231A62919J71125D2906c7325B61808
15316B64342b87461a00585J5542D13322e1944A64548a3241l1980B70609C7284
15305F7545b79288A79234b78457I4879j5455b6351j31640a4330l08312F2964a40065
$$ y = [164223, -211182, 21718, 97172, 4425, 66374, 67710, -226653, 266036, -260078, -117241, -44773, -115760, 33998, -57363, 10838, -171220, 43818, -93413, 52461, -304840, -52003, 78190, 245997, 93787, 41104, -71250, -131166, -106046, -97360, -123765, 193516, 121398, -210578, -333364, 55229, -8781, 167341, -72819, -38294, 233021, 111059, -75959, 55472, 15563, -33022, -65530, -19467, 60996, 42923, -106752, -144753, 163030, -265009, -339735, -10135, -114985, -15564, -146794, 190118, -257998, 380615, 3453, -86506, -51275, 162919, 334044, 42906, -37325, 261808, 264342, -287461, -100585, -85043, 413322, -51944, 164548, -13241, -45221, 270609, 37284, 67545, -279288, 179234, -278457, 94879, 79424, -26351, -157991, -14330, -322642, 62964, -140065]
15293A93125a9397r3712k7809k65869e5762G116g696j78769A65146d2622K542
15282d0080A55021b70570F4957b98790E17380A15177b16962B06781b7076C4468
15271D3076J43927G1156a29437j18463L3875a515j27107a8377I0198m0836J84969
15260B34331d202I2245k5383O4443d6340l95653E1245M5926K16844a7451A72821
15248E7816J42485J23582j61338F4703J545J72367J19589h7570j53274C23571
15237D48248l0702M1525j41387M86670j20801O28624J13275l6140k65499j66563
15227I57250B72144p0848P9935a43272C4280f4122A29873d4373j09102b0959F4500
15215B78165a10089A0899J65516B0636Q4310c2063q6807L3377F3913h8341K4084
$$ y = [193125, -19397, -113109, -140918, -406787, -55762, 7116, -7696, -186465, 165146, -42622, -40080, 155021, -270570, 64957, -298790, 517380, 115177, -216962, 206781, -27076, 34468, 43076, 187003, 71156, -129437, -247900, -214025, -1515, -128622, -18377, 90198, 49362, 234331, -4202, 92245, 66862, 131305, -46340, -441993, 51245, 97171, 314015, -17451, 172821, 57816, 200301, 323883, 162545, 64703, 66248, 238615, 358204, -87570, -240844, 323571, 448248, 417546, 459071, 317684, 804354, 683553, 1312177, 1425452, 1389312, 1123813, 957250, 272144, 201296, 281231, -143272, 34280, -64122, 129873, -44373, -153475, -20959, 64500, 278165, -110089, 10899, 176415, 20636, 104946, -32063, -118870, -85493, 63913, -88341, -64257]
15204f4257J3435q7182N2529G9652K74533j07767b1761A12965m6139M801J12180
15193A83807a54893j06336J26981h069D9287h4245k40741h8836j46941A77225
15182B7403J45005K75496b71647J23515A33663P4832J0101a56295G313L01867
15172C09180j35349J6780Q7910G0754R5119k5544J70797G0792L18742B3281c0164
15160b79687B77657C9477J45895p7554c3332p2996A81157m6451K33776i329B18167
15148A91593B2021J05526i058m4240F5110i5797b6053B32560C785J47306e3353
15136b25395A19473k2343b62561B61165b45707B13249J79246G0678a20986A48178
15125b4437k53250G6069j731Q161a98228G7234a17572A65540n6637K57325f6269
$$ y = [-64257, -50822, -138004, -85475, 79652, 354185, 246418, -21761, 112965, 66826, 71627, 183807, -154893, -261229, -134248, -8069, 49287, -84245, -324986, -88836, -235777, 177225, 27403, 172408, 447904, -271647, -148132, 133663, 208495, 218596, -156295, 7313, 309180, 173831, 190611, 278521, 70754, 165873, 140329, 311126, 70792, 389534, 23281, -30164, -279687, 277657, 39477, 185372, 107818, -33332, -106328, 181157, 134706, 368482, -9329, 218167, 191593, 22021, 127547, -9058, -53298, 65110, -95797, -26053, 232560, 3785, 151091, -53353, -225395, 119473, 97130, -262561, 261165, -245707, 213249, 392495, 70678, -120986, 148178, -24437, -277687, 76069, 74338, 82499, -198228, 77234, -117572, 165540, 108903, 366228, -66269]
15113B22619H5562K37765A07274K4604a53907A93734H6766C128K71712Q5226C9812
15101b9253B32258n2813J0758r1559D167a42866A63774F0010b42325f4522C55003
15089g1437k5928L2441B16885b6839p9689c572C22867E6433c5619A02217k9459
15078G2758h9447B00449N9794G9163C3718K54712g672j43860A76537H1351J46106
15067B27457j00949J02286E1254a79947A2670M9832g823C52897d5074H3191l2507
15056E0684R430d4788j78233e1092r2332H0154d2201A75972H2490K658O5152a22139
15043c3356A4138O15635A18669J69166A35260D3997c53081C67213o4767a39101
15032A01478c6488j4168A49442r211J22175p1266J38931p0574n1460J3906j5045
$$ y = [222619, 85562, 323327, 107274, 131878, -153907, 193734, 86766, 3128, 274840, 360066, 39812, -29253, 232258, 179445, 190203, 98644, 4167, -142866, 163774, 60010, -242325, -64522, 355003, -71437, -97365, -64924, 216885, -26839, -106528, -3572, 322867, 56433, -35619, 102217, 72758, -89447, 200449, 260243, 79163, 33718, 288430, -7672, -151532, 176537, 81351, 227457, 126508, 228794, 51254, -179947, 12670, 62502, -7823, 352897, -45074, 83191, 50684, 60114, -44788, -223021, -51092, -143424, 80154, -42201, 175972, 82490, 85148, 150300, -122139, -33356, 14138, 629773, 118669, 287835, 135260, 43997, -353081, 367213, 302446, -139101, 101478, -36488, -50656, 149442, 140231, 262406, 191140, 330071, 259497, 208037, 221943, 206898]
15021B06898K14641j82834A13054J2054K13423j6132J72820r7574A81006K19938
15011D00944A36304i0687D3154P6821D9518M3862a78107C48348P4077F1093J73679
15000B34772o9405N8533M5826A14197R5295F7322K32894J46410I0044R6753k4230
14989A62567a95769A47461B2513J83365j01753R8743K63782f9327B89702K43399
14979E33101B34038G911L38820I7816D3604K79547E5435J48383A5320J42010A576
14967C01196j27396J22332A6893K19488Q2360p3099Q9487A55428P0681P9711a75873
14955B08819Q3973m1346a36970C00643q6656O4730l6965L1729A01458D5566J92579
14944B38145K04504k04003N2374K9292F2066M80751k35649F6831J46824c0656
$$ y = [206898, 421539, 238705, 113054, 125108, 338531, 322399, 495219, 397645, 181006, 400944, 136304, -90687, 43154, 119975, 49518, 93380, -178107, 348348, 422425, 61093, 234772, 165367, 223900, 269726, 114197, 209492, 67322, 300216, 446626, 90044, 186797, 162567, -195769, 147461, 22513, 205878, 104125, 202868, 466650, -69327, 289702, 533101, 234038, 7911, 346731, 97816, 43604, 323151, 55435, 203818, 15320, 157330, 1576, 301196, 173800, 296132, 16893, 236381, 318741, 245642, 335129, 155428, 226109, 305820, -175873, 208819, 292792, 251446, -136970, 300643, 213987, 278717, 241752, 273481, 101458, 45566, 238145, 442649, 238646, 291020, 320312, 62066, 542817, 307168, 66831, 213655, -30656]
14933A96629L47029H3340K6791J82299A39847C9429K74014Q7060j4366A17883
14922B97204j00143Q8750J5927a59452D76059k22119p8398J59704j39218K7438
14912B23466m1276E1218K6639K01557b6911A1382L61952j24058M12506B65278
14901C98971j54677J78270R3885q1283A60901J40448j8373A38694L99296a69761
14890A83057q5026J94738F9176L77463A20318J49205j11569J36145L42681O1766
14880F98546C03786L3876K62683k58979K91840l01869A06282K67590p3544n3124
14870B47204E3836J91698o1492p727N29987k90769N9571A47763N6486l350J50600
14859C51499A18406L00350F7707M24953k36991N9731k6587N1093R8587o8871L8205
$$ y = [196629, 543658, 83340, 110131, 292430, 139847, 39429, 313443, 400503, 386137, 117883, 297204, 197061, 285811, 301738, -159452, 476059, 253940, 175542, 335246, 196028, 223466, 182190, 51218, 77857, 279414, -26911, 11382, 373334, 249276, 661782, 265278, 398971, 244294, 422564, 516449, 435166, 160901, 301349, 282976, 138694, 537990, -169761, 183057, 98031, 292769, 69176, 446639, 120318, 269523, 157954, 294099, 636780, 698546, 303786, 337662, 600345, 341366, 633206, 331337, 106282, 373872, 300328, 247204, 53836, 245534, 184042, 176315, 706302, 415533, 475104, 147763, 204249, 200899, 351499, 118406, 418756, 67707, 492660, 255669, 315400, 288813, 339906, 438493, 369622, 407827]
14848D07827J50872R050G8200K14126p9405M6274K18469A90961k437O01496k62685
14837E27335j87557A58114M16830B47876k0039J43535J55976M3931j382j01078
14827D68819O1477j86804L39463p0011j97592j33231L37019l3216B39843J50234
14817C90077N1957j82516J76180M4132p0849o163N607I4294K35236j6394K73714
14806E86850l4143J04869B27800J02032K48996r6469R404Q8781O1764j23974I0608
14794G83892C80631p5619K22888j38553F591M85256j8030J7705l7821J07517P1546
14783F32764Q9686O8424C82372n6418r3587L97073N4278j14124n4492O9374P9378
14772F63854j19988K12174C47632P5929J37652k78472J89223B22126L40647L9927
$$ y = [407827, 558699, 567749, 78200, 292326, 212921, 259195, 477664, 190961, 188524, 790020, 527335, 339778, 158114, 574944, 247876, 227837, 371372, 527348, 571279, 569897, 468819, 530296, 343492, 682955, 612944, 415352, 282121, 619140, 585924, 239843, 390077, 442034, 259518, 435698, 479830, 408981, 402818, 408425, 94294, 329530, 313136, 586850, 552707, 657576, 227800, 329832, 578828, 482359, 491763, 580544, 642308, 518334, 90608, 783892, 380631, 305012, 527900, 389347, 6591, 491847, 473817, 491522, 453701, 561218, 632764, 722450, 790874, 382372, 325954, 232367, 629440, 683718, 569594, 515102, 584476, 663854, 543866, 756040, 347632, 423561, 561213, 282741, 471964, 222126, 562773, 602700]
14762F02700A28233N94098j69168j62501K94042k73665K36614K11346k80387J70258
14752G48870l07272K98186k67603K37054j90774J38672n3689M4649j06917K58135
14742G99311j3562J2934J20566l25387O8287k36865Q2990o4080P5770p0240J94362
14731F44086O8310J09404L4395O6162K058C53605P8987L74040l47560J68144M1523
14720F68739j83705N00398k0753l03992R8940L7881k7460m4175l196K31833m09371
14709E45139J0333J75131j91702L76390o2129j26144j6533k28466L37471L4239
14699H53729k5381L05673l6708k16886M592m12847N79086k60113Q2062Q2289D47950
14687G61257l48625N59909j24847K92192l31796K58794k06480J10822l484N4628
$$ y = [602700, 128233, 722331, 553163, 390662, 684704, 411039, 647653, 858999, 578612, 748870, 441598, 739784, 472181, 709235, 518461, 657133, 603444, 648093, 541176, 799311, 785749, 798683, 919249, 593862, 662149, 425284, 508274, 444194, 519964, 449724, 644086, 712396, 821800, 856195, 922357, 924415, 353605, 432592, 806632, 459072, 627216, 668739, 485034, 985432, 964679, 660687, 759627, 797508, 770048, 725873, 722677, 954510, 545139, 555472, 730603, 538901, 915291, 853162, 727018, 710485, 482019, 819490, 853729, 828348, 1134021, 1097313, 880427, 885019, 472172, 1051258, 791145, 873207, 955496, 447950, 761257, 412632, 972541, 847694, 1139886, 808090, 1066884, 860404, 971226, 967742, 1022370]
14677A022370j31457k24184N10038k26557L060k78748K41590Q5051K4063L912
14667A029138j98842r5703M12603K50197j87772k47782J57985j14946l02783J76294
14657H78389J8817K95136k87757p7798n095K72887O7839J40695o8713J6476k08399
14646A042477k988j29196N96912K350l84766m51868N34227j2240J2309o0155j99428
14635I47634O8060K52958o5164J10523k56105K7498J92417J28666k34149K17312
14625A389650l0222J09912l96581K10529j390M4986l9974J92823j90431J52661
14615A441963m32048K45744j48857K61166k72420L23826j22276J83250K5693l5369
14605A470672l126j97082J73179M095J86312j83606Q4773n3545l67179L37251
$$ y = [1022370, 890913, 666729, 1176767, 950210, 953270, 674522, 916112, 1001163, 1025226, 1029138, 830296, 734593, 1147196, 1397393, 1209621, 961839, 1119824, 1004878, 702095, 878389, 897206, 1192342, 904585, 826787, 821692, 1094579, 1162418, 1303113, 1234400, 1250876, 1042477, 1039489, 910293, 1507205, 1509555, 1124789, 672921, 1207148, 1194908, 1207217, 1147062, 947634, 1015694, 1268652, 1203488, 1314011, 1057906, 1085404, 1277821, 1406487, 1172338, 1389650, 1359428, 1469340, 1072759, 1283288, 1281898, 1326884, 1286910, 1479733, 1289302, 1441963, 1009915, 1255659, 1106802, 1367968, 1095548, 1419374, 1297098, 1480348, 1506041, 1470672, 1467546, 1270464, 1443643, 1447738, 1634050, 1450444, 1535217, 1481672, 1114493, 1451744]
14595A451744N00344l65191P036q3475j21791M2533L57826q4074j87935J97428
14585A714445J6755J20049l29731Q8595M57998m00960j60255M47578l60243J76907
14575A771138K06476j0018j55935O9206J77962k29598J15822K87651k23097k7469
14565A982138M3254L1521J97528j74547j80224J93969K54574O5757q4551l23186
14555B006233K25668l2286k12229L86260K10563K840M6633J13373L24254k90959
14545B780350m5186M69093j09012L23088J13974L41402L0881P10770Q56735Q98911
14535F371006J249967K171025L786835P285040J0849629m54386j2248577o613939
14527A2396600m241018k310573j467573j102769N631o19761J98991l19802k67257
$$ y = [1451744, 1952088, 1586897, 1593933, 1510458, 1388667, 1431200, 1789026, 1704952, 1517017, 1714445, 1731200, 1851249, 1521518, 1610113, 2068111, 1667151, 1506896, 1954474, 1594231, 1771138, 1977614, 1967596, 1811661, 1880867, 2058829, 1829231, 1945053, 2232704, 2009607, 1982138, 2025392, 2056913, 2254441, 2079894, 1899670, 2093639, 2348213, 2413970, 2329419, 2006233, 2231901, 2199615, 1987386, 2373646, 2584209, 2587049, 2633682, 2747055, 3071309, 2780350, 2735164, 3204257, 3095245, 3418333, 3532307, 3873709, 3904590, 4615360, 5472095, 6371006, 7620973, 9791998, 13578833, 20863873, 31713502, 31259116, 19010539, 12396600, 8155582, 5845009, 4377436, 3274667, 3280298, 2660537, 2859528, 2539726, 2272469]
14518B272469J18897q7193o4647l7383N5190J43650j05920J84998k25673k69366
14508A985022K19464L22306j63446M4793Q6855K67636J91925j69660n8493J42348
14498B868750O8367k5903k4318j24882J5873K84864k42864O17757m45913n1556
14488B940175o6675M84676p5507l8028J29803n3859j58011J45121J59677j72944
14478C294428K52832n0034k13131L98860j30394K85068K3204j09188Q0186j35671
14468C696160L59145q7571j80760R9567K60878k15588J93526K53211q5579m8942
14458D244047R1501n0406J78057k15784J46332J86101k95500K19696K87619j12543
14448D679120j39966L63636J28577J88560M3541K50437m67926o8750K03376k5495
$$ y = [2272469, 2391366, 2304173, 2239526, 2202143, 2257333, 2400983, 2295063, 2480061, 2254388, 1985022, 2204486, 2526792, 2363346, 2408139, 2494994, 2762630, 2954555, 2784895, 2726402, 2868750, 2937117, 2911214, 2886896, 2762014, 2777887, 3062751, 2819887, 3437644, 2991731, 2940175, 2873500, 3358176, 3282669, 3244641, 3374444, 3320585, 3162574, 3307695, 3467372, 3294428, 3547260, 3497226, 3284095, 3682955, 3552561, 3837629, 3860833, 3751645, 3831831, 3696160, 4055305, 3967734, 3786974, 3886541, 4147419, 3931831, 4125357, 4378568, 4292989, 4244047, 4335548, 4285142, 4463199, 4247415, 4393747, 4579848, 4284348, 4504044, 4791663, 4679120, 4539154, 4902790, 5031367, 5219927, 5263468, 5513905, 5045979, 4977229, 5180605, 5155110]
14438E155110Q32676n74893N4604L2188k15075L39184K72539r304K11738j87292
14428E911475K51273M0506j79546L76798K88209m48008R28611p19914M33657K38742
14418G121803j39937L36367j68815j46038O02745m35894K05923K00403M08944
14409G985501j42164J94035L81584n4988q5795L2364L79512K7583K58577J68027
14399I144236k22614K33555O5198M86755K02658l39197J00222L63464J33697K02663
14389A0370637M97557P0528k06131L72361m9168J47595M01987K70918M914O29646
14379A2510844N2938K02993p5620O85574M694q552K01131Q1440N06434k05639
14369A3956237N32703N57034L25615r7861O73291j64322N58219L05331J43870
$$ y = [5155110, 5987786, 5412893, 5467497, 5499685, 5284610, 5623794, 5896333, 5887029, 6098767, 5911475, 6162748, 6203254, 6023708, 6400506, 6688715, 6240707, 7169318, 6449404, 6883061, 7121803, 6981866, 7318233, 7149418, 7003380, 7606125, 7170231, 7376154, 7576557, 7985501, 7843337, 8037372, 8418956, 8363968, 8278173, 8310537, 8690049, 8717632, 8976209, 9144236, 8921622, 9155177, 9220375, 9707130, 9909788, 9570591, 9670813, 10034277, 10167974, 10370637, 10868194, 10938722, 10732591, 11104952, 11055784, 11203379, 11605366, 11876284, 11881198, 12510844, 12563782, 12766775, 12691155, 13376729, 13381423, 13372871, 13574002, 13655442, 14161876, 13956237, 14488940, 15045974, 15371589, 15273728, 15947019, 15782697, 16340916, 16646247, 16790117]
14360A6790117P32520N8170O20867o9916L81270L47230L13744M75352P67443j00665
14350B0316132P62221N62679j41777P70492Q38684L54046M21157M30728O62829
14341B4977191N97435Q04462K77476R62970J32816J030222Q36964N77707P83717
14332C0980960J012867N98263N26949J233130P22440J102931J046580N70732J240530
14323C9035382J364266P33837J330981J145424J552097R04926J593459J704062
14315D9364434J240042J774029J456434K029922J596161K176180J581611K197683
14307F3416496J952458K525432K467445K561680K684418K610370L026047L136569
14299H4380915K957016L677304L639852L243869L800764M376332M596553M623536
$$ y = [16790117, 17522637, 17580807, 18201674, 18131758, 18513028, 18860258, 19174002, 19649354, 20416797, 20316132, 21078353, 21641032, 21499255, 22269747, 23108431, 23462477, 23883634, 24314362, 24977191, 25574626, 26379088, 26656564, 27619534, 27752350, 28782572, 29619536, 30197243, 30980960, 31993827, 32592090, 33119039, 34352169, 35074609, 36177540, 37224120, 37794852, 39035382, 40399648, 41133485, 42464466, 43609890, 45161987, 46066913, 47660372, 49364434, 50604476, 52378505, 53834939, 55864861, 57461022, 59637202, 61218813, 63416496, 65368954, 67894386, 70361831, 72923511, 75607929, 78218299, 81244346, 84380915, 87337931, 91015235, 94655087, 97898956, 101699720, 106076052, 110672605, 115296141]
14291A15296141M710267M945181N507250O131441O221914O037909P052461P164005
14283A63066569P411538Q465247Q768919Q932519R698822R955698J0419989J1112667
14275B37831968J1625056J2337411J2645433J3376601J3482039J3912817J3842191
14268C29053516J3912557J3309809J2858971J2462827J2481595J1988327J0331236
14261D16398838R232321Q517684P499130O656223M184328K772241K680878j89519
14253D57752124o251132l244474p991882j0276425r835442o157214j1990326j3847027
14245C88158202j3256215j3530970j3671522j3649266j3418518j3823130j3914610
14238B92893971j3485238j3443842j2762777j2657230j2331176j1604028j1324056
$$ y = [115296141, 120006408, 124951589, 130458839, 136590280, 142812194, 148850103, 155902564, 163066569, 170478107, 178943354, 187712273, 196644792, 206343614, 216299312, 226719301, 237831968, 249457024, 261794435, 274439868, 287816469, 301298508, 315211325, 329053516, 342966073, 356275882, 369134853, 381597680, 394079275, 406067602, 416398838, 425631159, 434148843, 441647973, 448304196, 452488524, 455260765, 457941643, 457752124, 451500992, 448256518, 440264636, 429988211, 420152769, 413995555, 402005229, 388158202, 374901987, 361371017, 347699495, 334050229, 320631711, 306808581, 292893971, 279408733, 265964891, 253202114, 240544884, 228213708, 216609680, 205285624]
14231B05285624j0133371r792746q804833q754499p912266p861872p023478o462113
14223A38540446o073874o071012n580733n009291m831660n134364m042115l672571
14215I8124826m021275l876177l541692l039430l401549l070683k717347k915669
14207G1541004k624399k101592j962313k953968j364254k001780j957504j952705
14199E4622489j459186j487905j714141j110541j903281j214271j238731j038865
14191D3455568j340473j251936j041524j323314p36790r00952o92329j371540
14183C4796710q48068r91478p00301r94572o45295m99639j093943n99093q65700
14174B7558621n91316m28114o57299l56772r46279m83552m23053o45742p8989
$$ y = [205285624, 195152253, 185359507, 176554674, 167800175, 159887909, 152026037, 145002559, 138540446, 132466572, 126395560, 120814827, 115805536, 110973876, 105839512, 101797397, 98124826, 94103551, 90227374, 86685682, 83646252, 80244703, 77174020, 74456673, 71541004, 68916605, 66815013, 64852700, 61898732, 60534478, 58532698, 56575194, 54622489, 53163303, 51675398, 49961257, 48850716, 46947435, 45733164, 44494433, 43455568, 42115095, 40863159, 39821635, 38498321, 37761531, 36860579, 36168250, 34796710, 33948642, 32957164, 32256863, 31262291, 30616996, 30117357, 29023414, 28424321, 27558621, 26967305, 26539191, 25881892, 25525120, 24578841, 24095289, 23672236, 23026494, 22947505]
14165B2947505q39784m52595m13797n70271j61663n56201l81190k85652q54656
14156A8431696J62062o47677l21981m77500k27704j35455r1959l48768n25814
14147A5816900j69812k78481n08030Q9216k96396o12255J71527k71128k97460
14138A3644081l61488k48629J3905n29609K5355m35662j22138R9901l17728J28926
14128A1896914l26924l06151k56743j85915j97279k16771j24069k01747K32529
14119A0313844q2807k77186j66675o4756j47569k30904l45249o0119L8845o33125
14109H344299K93262k23862J40248j63950j0380k39148K22672k76286k73302m7195
14099G766358j72773M9330j77753j11344k42372j12464J75704k71344r7238J58642
$$ y = [22947505, 22107721, 21655126, 21241329, 20671058, 20509395, 19953194, 19572004, 19286352, 18431696, 18593758, 17946081, 17624100, 17146600, 16918896, 16783441, 16691482, 16342714, 15816900, 15647088, 15368607, 14860577, 14949793, 14653397, 14041142, 14212669, 13941541, 13644081, 13282593, 13033964, 13047869, 12518260, 12543615, 12107953, 11985815, 12085716, 11767988, 11896914, 11569990, 11263839, 11007096, 10821181, 10623902, 10407131, 10283062, 10081315, 10313844, 10231037, 9953851, 9787176, 9722420, 9574851, 9343947, 8998698, 8938579, 8977424, 8344299, 8637561, 8413699, 8553947, 8389997, 8379617, 8140469, 8363141, 8086855, 7813553, 7766358, 7593585, 7642915, 7465162, 7353818, 7111446, 6998982, 7174686, 6903342, 6806104, 6964746]
14089F964746k19244j42136j31662j74211N22736n86794j1875j20956K50652k80065
14079F071191l39684J28697r3723K14801j99688o6798k08003N2186k36639o0270
14069E262070q4203J87980j44960p0588j07137o4190J11558j50394j00851Q6215
14059D925500j32522J92010n8982o82649K69424J92259q7917j50572K17112l27487
14049D356176K38995k45754J66382p94654O54407l2518J47046o0808j72579J1326
14039D268019j80765k06909K07632q3781j5225k41917j14853J16582q8430l45947
14029C314406O43706k70683k62953o4145j5969J25481j1360j27636q4288k65061
14019B981498K41577J01689K88926j98499j74922q0212Q5319J44040l21275K1356
$$ y = [6964746, 6745502, 6603366, 6471704, 6297493, 6820229, 6233435, 6221560, 6100604, 6351256, 6071191, 5731507, 5860204, 5766481, 5981282, 5781594, 5714796, 5506793, 5558979, 5322340, 5262070, 5177867, 5365847, 5220887, 5150299, 5043162, 4978972, 5090530, 4940136, 4839285, 4925500, 4792978, 4984988, 4926006, 4243357, 4512781, 4705040, 4617123, 4466551, 4683663, 4356176, 4595171, 4349417, 4515799, 3721145, 4375552, 4343034, 4490080, 4429272, 4256693, 4268019, 4087254, 3880345, 4087977, 4004196, 3988971, 3747054, 3632201, 3748783, 3660353, 3314406, 3958112, 3687429, 3424476, 3360331, 3344362, 3469843, 3458483, 3330847, 3246559, 2981498, 3223075, 3324764, 3613690, 3415191, 3240269, 3160057, 3245376, 3389416, 3068141, 3089497]
14009C089497m5630k6901q1782Q5299j26548N7451k30706J84133q7989k88364
13999B528460K13390J98666n38980K58496K9638M5404q7091q4006j11367J23708
13989B576318j38984J24366k93751J91877j59435K32655R0301j38081J17791J53397
13979B756454M3226K68111K53784Q10213P49578J585797K674094O499264J1475461
13970B7115982N924327j0714814q158030m343882k143103j247201j066480q05765
13962D561034n71595j95672j59421k50514L49174m84316k10380j98921k46275
13953B593114k24749L27689j83631j3800j87012k05465L06107j36714M3256P8825
13943B397620j80153L24640l11191J03704r7853J79659l29872j6536l18067N00328
$$ y = [3089497, 3043867, 3016966, 2935184, 3020483, 2893935, 2951386, 2720680, 2904813, 2816824, 2528460, 2741850, 2940516, 2401536, 2660032, 2689670, 2735074, 2647983, 2563977, 2452610, 2576318, 2437334, 2561700, 2267949, 2459826, 2300391, 2533046, 2623347, 2485266, 2603057, 2756454, 2799680, 3067791, 3321575, 4131788, 4881366, 6467163, 9141257, 15640521, 27115982, 33040309, 22325495, 14167465, 9823583, 7680480, 6433279, 5366799, 4561034, 3989439, 3793767, 3634346, 3383832, 3733006, 3248690, 3038310, 2839389, 2593114, 2368365, 2696054, 2512423, 2498623, 2311611, 2106146, 2412253, 2275539, 2318795, 2397620, 2217467, 2542107, 2230916, 2334620, 2236767, 2416426, 2086554, 2070018, 1751951, 2252279]
13933B252279k63531j88118O533L29209j28449J55746k55410l1262k35482K80977
13923A922492j04169K67161j00662j80607L39265q51371L70690K96676l743J92274
13913B148006m11446j28747k4997J64873J36887J13519k6410l98056R0173K92951
13903A956753j61131m76956J85547J52055j04885K86658k94633J99734m8388n37158
13893A157596K77292j8136k3215N54056q09328J15663J19198N5440m6073L26082
13883A708575k55068j2831P7375J89564O5980l55165L317K7876J91802n51167
13873A090258J13727J10960j92225L53242j61202P0228J20888k48560L7526j76360
13863A118482P3850o6865K60197l02057L37070k36265P3467j04889m8716J41199
$$ y = [2252279, 1988748, 1800630, 1807163, 2136372, 2007923, 2163669, 1908259, 1876997, 1641515, 1922492, 1818323, 2085484, 1984822, 1804215, 2143480, 1292109, 1662799, 1959475, 1955732, 2148006, 1736560, 1607813, 1582816, 1747689, 1884576, 1998095, 1971685, 1573629, 1663802, 1956753, 1795622, 1318666, 1504213, 1656268, 1551383, 1838041, 1543408, 1743142, 1694754, 1157596, 1434888, 1416752, 1393537, 1947593, 1138265, 1253928, 1373126, 1428566, 1382493, 1708575, 1453507, 1440676, 1518051, 1707615, 1773595, 1418430, 1421747, 1449623, 1641425, 1090258, 1203985, 1314945, 1122720, 1475962, 1314760, 1384988, 1505876, 1257316, 1294842, 1118482, 1192332, 1125467, 1385664, 1083607, 1420677, 1184412, 1257879, 1152990, 1104274, 1245473]
13853A245473l2046j80977o4535Q4503o206K85766J46255m0309j54790J61517
13843A444651m93817N31273k88481Q575r8166l0351J86094k08564J74562j66984
13833A058792P5559o7516K65901l66834j5492N5398j23561K81319k71396k7305
13823H64865K49365k2153j17350L70347j17524l5774j77291R604K69327l54925
13813I38491J75249j22357N4029j65748J74317j67392j46518K61336o1813n706
13803I33888k15344K48612j56244L27669n44215o490K52963L1170r0548L54450
13793A135911p868k63899Q6937j37244k61576M09624p2558R0502l7026n9436r5556
13782G87811j23353P1015k17548M58243j48338k19737L36559p5007q7743J85722
$$ y = [1245473, 1213427, 1032450, 967915, 1052418, 1046212, 1331978, 1478233, 1437924, 1283134, 1444651, 950834, 1482107, 1193626, 1202201, 1104035, 1073684, 1259778, 1051214, 1225776, 1058792, 1134351, 1066835, 1332736, 965902, 950410, 1005808, 882247, 1163566, 892170, 864865, 1114230, 1092077, 974727, 1345074, 1227550, 1191776, 1014485, 1024089, 1293416, 938491, 1113740, 991383, 1045412, 879664, 1053981, 886589, 740071, 1001407, 939594, 933888, 718544, 967156, 810912, 1138581, 594366, 587876, 840839, 872009, 781461, 1135911, 1128043, 864144, 951081, 813837, 552261, 961885, 889327, 979829, 942803, 883367, 787811, 664458, 735473, 517925, 976168, 827830, 608093, 944652, 869645, 781902, 967624]
13772I67624Q6385j68882J36096j4539D73600L84492o7987k37629M65390k59652
13762G58214q9535K08652O5663k01003J23283m295k56311J406J63835j52863L09757
13751I26803j27249j27127p9050J98393k52314L68312Q095j54816j92643Q5359
13741F53763J67489r7767r9850M49177j77965M9550l00653k23425L57881k18431
13731E59769B76240O93194j59163j33060j95219J36399J13014l1881k03942K50302
13721G45884M20585m25064j56789B45630N55472k89182M6238K95797k45385K07853
13711H16423j03597k84614k5073J55475Q8860O3580j92035M09167D19740M55535
13701H75275C66316N2321K05368r08k50149N82867m22109K71350j99962j19968
$$ y = [967624, 1054009, 885127, 1021223, 1006684, 473600, 858092, 790105, 552476, 1017866, 758214, 668679, 877331, 942994, 741991, 865274, 860979, 604668, 606074, 769909, 617046, 926803, 799554, 672427, 593377, 791770, 539456, 907768, 915863, 761047, 568404, 653763, 821252, 723485, 623635, 1072812, 894847, 944397, 643744, 420319, 778200, 559769, 276240, 969434, 810271, 677211, 481992, 618391, 731405, 699524, 495582, 745884, 1166469, 741405, 584616, 245630, 801102, 511920, 558158, 853955, 608570, 816423, 712826, 428212, 403139, 558614, 647474, 711054, 519019, 928186, 419740, 875275, 366316, 418637, 624005, 623097, 372948, 955815, 533706, 805056, 605094, 485126]
13691D85126K5738K41813j94156K20718l60001K78481j52380K52231k94338P1197
13681E74429Q2085r3496K02815C43058O0513M5984J64432J55961j61827P2404
13671F80525j1968l14301N9305K65364K4831k93395K98077l07459J44644B66222
13660F18645j93488p5870n0424N6637j5703K51813o3343L9921A97613M29783j2358
13649F15038O114R6894J76276l66273j70963L66030k41534K75653k23581K32865
13639G66519B75472p085N25844C20651l9425C5900L55337k2818K70236m5405J62268
13628G55518k8368B38300K42819l2533A38840M02549B63948L04643J77954C27828
13617A39931J49369J18572j30336J33071N86K29111j81984q9333J39010k09639
$$ y = [485126, 510864, 752677, 558521, 779239, 419238, 697719, 545339, 797570, 503232, 574429, 656514, 563018, 765833, 343058, 403571, 449555, 613987, 769948, 608121, 680525, 668557, 354256, 413561, 678925, 703756, 410361, 708438, 400979, 545623, 266222, 618645, 425157, 349287, 298863, 355500, 339797, 591610, 528267, 568188, 197613, 627396, 615038, 621152, 718046, 894322, 528049, 357086, 723116, 481582, 757235, 533654, 766519, 275472, 268387, 794231, 320651, 281226, 35900, 391237, 368419, 638655, 593250, 755518, 727150, 238300, 481119, 448586, 138840, 541389, 263948, 568591, 746545, 327828, 139931, 289300, 407872, 277536, 410607, 411193, 640304, 458320, 368987, 507997, 298358]
13607B98358P7747J5139K44973K16684k29216n3011k13014J38912J44469C08250
13596A64126L78350B14352J22234L6114K2971l6605P0817N1876A63438J56700
13586C20138K30345n9509n8638M5682j06042J5532J26005j01210l4462N0564J06575
13575E34980M8237j37382Q3912Q5873k07653j78494J47650J34194J23418k06929
13565D27806l1811j4944K38011k40995j71057J55563J86517j81427J60154B03008
13554g947C65593j20181K8853K85544k33857K85852B76743C7851K11482c7509
13543D51794j18020K78123A59695A6264M82355j9535j25840L42972j99011k11033
13533B86172L9999N8127A31464K82415J54737j17775j0401A53126L25274c3497
$$ y = [298358, 376105, 391244, 636217, 852901, 623685, 570674, 357660, 496572, 641041, 308250, 164126, 542476, 214352, 336586, 372700, 395671, 359066, 429883, 481759, 163438, 320138, 550483, 490974, 432336, 478018, 371976, 387508, 513513, 412303, 377841, 428405, 534980, 583217, 445835, 529747, 615620, 407967, 229473, 377123, 511317, 634735, 427806, 395995, 381051, 619062, 378067, 207010, 362573, 549090, 367663, 527817, 203008, -7947, 365593, 245412, 274265, 559809, 325952, 611804, 276743, 37851, 249333, -37509, 451794, 333774, 611897, 159695, 16264, 498619, 479084, 353244, 696216, 497205, 286172, 326171, 384298, 131464, 413879, 568616, 450841, 440440, 153126, 478400, -33497]
13522C07849K07228k38622q6265K34242G4925K17802J47313N0088B21194i068
13511E59552B45787J90339C928L22104A10347J26434J9391K55734k34723j07914
13501A69269J2001G6310O1354L4077m9679J39753r7889J553K87817j01336j44656
13490B07304J92030A96804K42672j16793N3110E6789J69508L2253J53432j06318
13480C05664J26147k0046K95580l38843j30639l5936H8039N06950B11433N01190
13470G12623A03047j3972K37363O3811J30674q5693j14664N4278j0700c6510j5874
13459e2384C10884A2621a03998b2292E10990G0357K17347K82449r6687A74570
13448C98727A36511K9620J65840j57026K66113A69313K12963B2072K47082M3635
$$ y = [307849, 515077, 276455, 190190, 424432, 74925, 292727, 440040, 490128, 221194, -9068, 559552, 245787, 436126, 3928, 326032, 110347, 236781, 256172, 511906, 277183, 169269, 181270, 76310, 137664, 171741, 122062, 261815, 163926, 165479, 453296, 351960, 207304, 399334, 196804, 439476, 322683, 375793, 56789, 226297, 258550, 411982, 305664, 431811, 411765, 707345, 368502, 237863, 201927, 88039, 594989, 211433, 712623, 103047, 89075, 326438, 390249, 520923, 435230, 320566, 374844, 364144, -36510, -52384, 310884, 12621, -103998, -22292, 510990, 70357, 287704, 570153, 473466, 174570, 398727, 136511, 166131, 331971, 174945, 441058, 169313, 382276, 22072, 269154, 312789]
13438C12789j53911K7182j7098J67820C6065L26455l6571l6854l1810I9486L35326
13427D34812J09723k32141p5740K85224k34818j8767l1694N2878A27113J5674
13417A42787J66867Q8532A47131J2678O3732J9807p0838K29710p5344M118g5815
13405D05616a5474C87587A80061h5210A96199I7797P8647G6588J55245a54383
13394D9076A3442L53689C6986L46235L9911b7071C10808A28716O0334m0310K19072
13383C67812A62563j8396H809K77465F8283R5737K64037A93011p6670M0228P0555
13372B27124J50203L1110E5811J92499e5897A75442J93848A68737J9999L43681
13362E32417k1054A23478l2173B0020L94654k06391I5611O47035B64870K42219
$$ y = [312789, 158878, 186060, 168962, 336782, 36065, 362520, 325949, 289095, 257285, 99486, 434812, 544535, 312394, 236654, 521878, 287060, 268293, 236599, 289477, 127113, 142787, 309654, 398186, 147131, 159809, 223541, 243348, 172510, 402220, 326876, 330994, -75815, 405616, -15474, 387587, 180061, -85210, 196199, 97797, 176444, 76588, 231833, -154383, 49076, 13442, 367131, 36986, 383221, 423132, -27071, 310808, 128716, 189050, 148740, 367812, 162563, 144167, 8809, 286274, 68283, 164020, 428057, 193011, 116341, 156569, 227124, 377327, 408437, 55811, 248310, -55897, 175442, 369290, 168737, 188736, 532417, 511363, 123478, 91305, 20020, 414674, 208283, 95611, 742646, 264870, 507089]
13352E07089j19012I9539L18604H5223M92775j38636j79151m262H3162L17233
13342D00395A84124K69799A40028K34546j85864J38418b207C43694H5260K63471
13332C48731L1667A11725L29658m3981l2191J7686J7351A87383K51112b311H0533
13320C50503j27463P3189A38673J33810E3246K29493l914P2654a10568A76253
13309A97362a0285D27667A65407J61723j1728A15816J50632o6307K7265c10610
13298B09354d0728F54022A46647j2883L12045l0082g6795K6134D88704c559B66199
13286e1605B20620J60064A83126J66266k287l1861J64518A10881B2992L28687
13276C51679j13728o8767O4021O380K57693k07564Q806p3511J59327B6968N24918
$$ y = [507089, 388077, 99539, 418143, 85223, 577998, 439362, 260211, 255949, 83162, 400395, 184124, 453923, 140028, 374574, 188710, 327128, -2207, 343694, 85260, 348731, 380398, 111725, 441383, 397402, 365211, 382897, 400248, 187383, 438495, -2311, 80533, 350503, 223040, 296229, 138673, 272483, 53246, 282739, 278825, 351479, -110568, 176253, 197362, -10285, 427667, 165407, 327130, 315402, 115816, 266448, 200141, 227406, -310610, 209354, -40728, 654022, 146647, 133764, 445809, 415727, -76795, -50661, 488704, -3559, 266199, -51605, 220620, 380684, 183126, 349392, 347105, 315244, 479762, 110881, 22992, 351679, 237951, 169184, 233205, 239585, 497278, 289714, 298520, 225009, 384336, 26968, 551886]
13265E51886k01720A38688N9981D4441J65991o110k5703J09251K81798F1488J48527
13254B10015k3635b53254C9772K87738H2583Q1152L85828A92010n45b6661C24612
13242B20433a06168E6990K63286C9253M4231g9773B01238Q8257j21047K28836
13232C97284j24595R125A17539J22811h159A26807a8424C68301M234A58450N1586
13221B10036G5350a23079A68732K95399B8214J03012j4404B4577K12524n5423
13211A81678P9880f2585I0864J07290O3379c6985C8852K88373j03845a28368D5970
13199b01431C65448H6411j1638k4185d4055p3141L7037A33505g1591A96462B6782
13187E67505G6495K45720J9282a75086d7328j41014C27138G7437K32219C1441
$$ y = [551886, 350166, 138688, 198669, 44441, 210432, 204322, 178619, 287870, 569668, 61488, 210015, 186380, -253254, 39772, 327510, 82583, 163735, 549563, 192010, 191465, -26661, 324612, 220433, -106168, 56990, 320276, 39253, 83484, -79773, 201238, 289495, 168448, 397284, 272689, 281814, 117539, 240350, -8159, 126807, -18424, 368301, 372535, 158450, 210036, 75350, -123079, 168732, 464131, 28214, 131226, 116822, 24577, 237101, 181678, 261558, -62585, 90864, 198154, 261533, -36985, 38852, 327225, 223380, -128368, 45970, -201431, 365448, 86411, 74773, 50588, -44055, -117196, -80159, 133505, -71591, 196462, 26782, 567505, 76495, 322215, 341497, -175086, -47328, -188342, 327138, 77437, 309656, 31441]
13176c6927C67928a8735j34750O3379L0154E62228F2053j6341J27223P147p2860
13165A07222k5772d7570A94114p8352K64362B2248J62330b60638i8158h305A00270
13153B70917p7149n6297K946a59144A3744K45584i8365B34994I2820J88184N4285
13142C35289A39122K21806a01593A73293k452j7035B8121M9306b36600g4819l9448
13131a14267B5752f0812A12845R7566P5899A41160L7744m6339L8240B907f4188
13119h5512g451j56178I5089K34075a80265A34073k9262M7023b60809C93985n410
13108C88575H63h7415j38433C41374A40480J30842j16476j3899E9218b09276A44843
13096B46507M5972c05946A38592D5342L70106a79501c17B78439A12612c8052B22968
$$ y = [-36927, 367928, -18735, -153485, -90106, -59952, 562228, 62053, 45712, 172935, 180082, 107222, 81450, -47570, 194114, 115762, 380124, 22248, 184578, -260638, -98158, -8305, 100270, 270917, 193768, 137471, 140417, -159144, 13744, 259328, -98365, 234994, 92820, 281004, 335289, 139122, 360928, -101593, 173293, 170841, 153806, 28121, 77427, -236600, -74819, -114267, 25752, -60812, 112845, 210411, 286310, 141160, 178904, 132565, 170805, 2907, -64188, -85512, -7451, -163629, 95089, 329164, -180265, 134073, 104811, 151834, -260809, 393985, 388575, 863, -87415, -225848, 341374, 140480, 271322, 154846, 140947, 59218, -209276, 144843, 246507, 292479, -305946, 138592, 45342, 415448, -179501, -317, 278439, 112612, -38052, 222968]
13084H2032A0401K38397A924K08664N9988J65986j91559H1072J885C6631a53978
13072B4403q432K06142g529B12963I5219K20236d35754F7373N685J88490a64434
13060g3055L1361A17193E683L02394A10496J06547j2324F7444K8255J47114c41389
13048a66734G7276e5894A1090J2965M33194A60370K78515A50107e2898C9951J4734
13037E4685L0074b22A49980K07647a26606A99590J69108c2171A78903M6245a34478
13025a07092n0537A48443p2283h5540C71744I238d9951A02771e2903A86326K8669
13014B14995b5649n4279G5923O8467d5133I3076J95998j16991n5800i8561B10519
13002A52710a547A07963J18019a63038B26401H6992J39243R3484A13681m6373
$$ y = [82032, 10401, 248798, 1924, 210588, 270576, 436562, 245003, 81072, 82957, 36631, -153978, 24403, 15971, 222113, -7529, 212963, 95219, 315455, -435754, 67373, 73058, 261548, -164434, -73055, -41694, 117193, 5683, 308077, 110496, 217043, 204719, 67444, 95699, 242813, -341389, -166734, 77276, -55894, 11090, 24055, 457249, 160370, 438885, 150107, -52898, 39951, 54685, 84759, -222, 149980, 357627, -126606, 199590, 368698, -32171, 178903, 225148, -134478, -107092, -157629, 148443, 76160, -85540, 371744, 9238, -49951, 102771, -52903, 186326, 214995, -25649, -79928, 75923, 144390, -45133, 93076, 289074, 172083, 116283, -98561, 210519, 152710, -1547, 107963, 225982, -163038, 226401, 86992, 226235, 319719, 113681, 67308]
12992F7308M86068B24274k4919N3798H5073M16419b08980D82744f183C02514j46289
12981A56225h5332B9683J85205K6050a81828N7943a9081B4666K97169A32951i4106
12969I6876d26209A60833b0068B79653Q1812j17298J85934k11633I0281a39000
12958D32532A19327h1804B72299J9017J2147a02092E5118J18478c724B06661C9675
12946C96494j48623B4635d3625C10161p8766K3967j9175c85954I7171K74487a8457
12934B47965r4367F0935J07213N4317j02017b2457C64617b8805I6464J3998J65394
12923B75856k684a4120j90892d609B11522g8135B55287c5462G6679J6487O0617
12912A53783R2487g7674B44246K00252A90353P8251r0538c01519j2838a3265A1484
$$ y = [67308, 553376, 224274, 199355, 253153, 85073, 501492, -208980, 482744, -6183, 302514, 156225, -85332, 29683, 214888, 240938, -181828, -123885, -19081, 24666, 321835, 132951, -94106, 96876, -426209, 160833, -20068, 279653, 361465, 244167, 430101, 218468, 90281, -139000, 432532, 119327, -81804, 272299, 291316, 303463, -102092, 55118, 173596, -3724, 206661, 39675, 396494, 247871, 24635, -43625, 310161, 231395, 255362, 236187, -385954, 97171, 371658, -18457, 247965, 153598, 60935, 168148, 222465, 120448, -22457, 364617, -28805, 96464, 110462, 275856, 273172, -14120, -205012, -4609, 211522, -78135, 255287, -35462, 76679, 93166, 153783, 246270, -77674, 244246, 444498, 190353, 268604, 178066, -301519, -314357, -13265, 11484]
12900a44037A59125e135j18786A65535H0987Q6245C1391a60430J08A69561a75195
12888e6388A42217J65886E1004Q7799o4556A6061J6689g9639D08195A59918L042
12877A62960k6120j8921a17257A21672l4952a06024b8782A28335b87470A35497
12866B00071f1847j09234A03149a39506A00226a98729R9070O536L1436G6511h9160
12854a60889f2991c1272J3027n0209E1711N8840m4956b48673I781O1274b28951
12842b95475J41462A24234a64873A49802c02548A90303e6729k50411B22061J55058
12832C77119A4690J1678K55908b0315B86448d069k20138J9672A3329J17963a97034
12820A04093f9927J0270C7780a50125f3044D7734j8838R3422N7349a95697B41546
$$ y = [-144037, 159125, -5135, -123921, 165535, 80987, 167232, 31391, -160430, -160322, 169561, -175195, -56388, 142217, 308103, 51004, 138803, 74247, 16061, 32750, -79639, 408195, 159918, 162960, 136840, 117919, -117257, 121672, 86720, -106024, -28782, 128335, -287470, 135497, 200071, -61847, -171081, 103149, -139506, 100226, -198729, -99659, -93123, -61687, 76511, -89160, -160889, -62991, -31272, -18245, -68454, 51711, 110551, 65595, -248673, 9781, 71055, -228951, -295475, -154013, 124234, -164873, 149802, -302548, 190303, -56729, -307140, 222061, 377119, 14690, 26368, 282276, -20315, 286448, -4069, -224207, -204535, 13329, 131292, -197034, 104093, -69927, -59657, 37780, -150125, -63044, 47734, 28896, 122318, 179667, -195697, 241546]
12808C02727D5816j1619N0219J54803o953F4367K75748H1809d5982D51737e918
12796a43895A67281a80054Q8053A01972K01O6981K6593A1158J25542a03028D4070
12784b02791H9595g2087k5883B20810J93469a00367a1320F3666c7821G840a91939
12772G6823a58366J7334b4495j0270j5877A30392b28688B53570a44003L7985j82321
12761b88339a23459A30898a84145F2467a0530C2177J04919F4742J49341b05847
12750F976K15404G6734A9620e7541P054g747B42990a94212B48492C4200a17908
12738a93849O0632A6216b9409l9620B36498o9637M5120a92579j48754a1763B79076
12726E1062M579K6803K0997R1707d1541B24858k491a76495g7135m3589F557f7664
$$ y = [302727, 45816, 34197, 84416, 239219, 232266, 64367, 340115, 81809, -45982, 451737, -5918, -143895, 167281, -180054, -92001, 101972, 102173, 169154, 195747, 11158, 136700, -103028, 44070, -202791, 89595, -72087, -97970, 220810, 414279, -100367, -11320, 63666, -37821, 7840, -191939, 76823, -158366, -141032, -24495, -34765, -50642, 130392, -228688, 253570, -144003, -106018, -288339, -123459, 130898, -184145, 62467, -10530, 32177, 137096, 64742, 214083, -205847, 6976, 222380, 76734, 19620, -57541, -50487, -7747, 242990, -194212, 248492, 34200, -117908, -193849, -133217, 16216, -29409, -69029, 236498, 166861, 211981, -192579, -341333, -11763, 279076, 51062, 55641, 82444, 103441, 195148, -41541, 224858, 222367, -176495, -77135, -120724, 6557, -67664]
12713a6417k78509A5398J46103C8158J04267k6316b169A60307J71441h8403H8902
12701b8570i291j21414A56643A7817a22856b1190o8064A62369L36463A98650d5539
12689b3729A91663a50097D24549C5777K78024J7605a22726I1529K76692d260C77739
12677B65714G2446b0064A03332a9395j31032A33287C3606a48658F4827L68219
12667D33046A58778O8710J67256a2294A46458a25726F0906J90722A23937N28497
12657F52434c03750G2915a27487l405B57216M0336E2860J66633F3739N6229J41870
12646B61838l8104K35358A95087K349n1959n0037J60385J02346c6082C6762J3056
12635D9818a58145A57917K5336q6088m6513h1354A11284E5341B2174a90008B70083
$$ y = [-16417, -294926, 15398, 161501, 38158, 142425, 116109, -2169, 160307, 331748, -88403, 88902, -28570, -9291, -130705, 156643, 17817, -122856, -21190, -89254, 162369, 498832, 198650, -45539, -23729, 191663, -150097, 424549, 35777, 313801, 331406, -122726, 91529, 368221, -4260, 377739, 265714, 72446, -20064, 103332, -19395, -150427, 133287, 33606, -148658, 64827, 433046, 158778, 227488, 394744, -12294, 146458, -125726, 60906, 251628, 123937, 652434, -303750, 72915, -127487, -130892, 257216, 297552, 52860, 219493, 63739, 119968, 261838, 223734, 459092, 195087, 197436, 145477, 95440, 255825, 358171, -36082, 36762, 49818, -158145, 157917, 183253, 97165, 50652, -81354, 111284, 55341, 22174, -190008, 270083]
12623B32218j15042J27277K7799E1280k5618J16867E6428d4314A65205K25582
12613C90787J60103B43856O3813K0628j60742f509I5456K20148a14189d4378l637
12602d8015B93476j7341m1138a791A2846J74818d2033G6166a11886b8537B8793
12590a03875H0730C4141b1202B34863f8378B60222B2456Q5183E1137K14931B8036
12578d9664f171A32248a8511D3529g7098A50454A585M7198J21087n5765L3825
12567A47930J1447g8936C8960c6994G0044a19562J16C4676i696A98936p5362D4970
12554C30061C9641P3830R5389h8583A01449m235b360k83344r0778A24893b33956
12542B86827F9136o326e6124j98696B87461c01353h9685c7917E247d2945B09700
$$ y = [232218, 117176, 244453, 272252, 51280, 25662, 142529, 56428, -44314, 165205, 390787, 550890, 243856, 307669, 328297, 167555, -6509, 95456, 315604, -114189, -44378, -48015, 293476, 276135, 234997, -1791, 12846, 187664, -42033, 76166, -111886, -28537, 28793, -103875, 80730, 34141, -21202, 234863, -68378, 260222, 22456, 107639, 51137, 266068, 28036, -49664, -6171, 132248, -18511, 43529, -77098, 150454, 1585, 48783, 169870, 114105, 147930, 159377, -78936, 38960, -36994, 70044, -119562, -119446, 34676, -9696, 198936, 123574, 44970, 330061, 39641, 113471, 208860, -88583, 101449, 97214, -2360, -285704, -376482, 124893, -233956, 286827, 69136, 62810, -56124, -254820, 287461, -301353, -89685, -37917, 5247, -42945, 209700]
12530b28727J05350p2106C05917a34790A19770k0689a22166F0802J38208E3973
12519c88535a89922C4165P7357n3852J15055c0251B03064h9744A7323K46648c686
12507A51637Q5758C5205b50393C8525a7713A19280j953J24691r8321o287b93165
12495B76246A06159d601F8593J80494A2564c3307j45006P7911b3878A97259i5719
12483B16079A06883j4741e6476j55490n2331I7439J23034a8301l0002A25473a07608
12471b7925j36030j06861B31199a03427C89454d1572C35701F936e8483j20607
12461a79090D7931b15695D41637a18595K7123j1873F3803b6387j80791i076p4948
12450h4024F1216a48241A70052N1759A04769C1708a92368O3442F0513Q2412d7325
$$ y = [-228727, -123377, -195483, 305917, -134790, 119770, 99081, -122166, 60802, 199010, 53973, -388535, -189922, 34165, 111522, 57670, 172725, -30251, 203064, -89744, 17323, 263971, -3686, 151637, 237395, 35205, -250393, 38525, -17713, 119280, 117327, 242018, 143697, 137410, -293165, 276246, 106159, -4601, 68593, 249087, 12564, -33307, -178313, -100402, -23878, 197259, -95719, 216079, 106883, 92142, -56476, -211966, -264297, 97439, 220473, -18301, -48303, 125473, -107608, -27925, -163955, -270816, 231199, -103427, 389454, -41572, 335701, 6936, -58483, -179090, 47931, -215695, 441637, -118595, -91472, -103345, 63803, -26387, -207178, -9076, -84024, 61216, -148241, 170052, 221811, 104769, 31708, -192368, -128926, 60513, 142925, -47325]
12438d1932A43705J33750c16833B58811i2168F732h6616A38185c75138c3266n2064
12427h5330A48221b87809A33191j2205k8798K72155a04506l91648B61246A29330
12416A43056d4420B45974l2358b1258A13631b11392J05254A42622i2917j75738
12406b68655J02914E427J50212c4379A10144l5207C6967J79659n8625a37494A81013
12394B09651a33959H9893a34950a1921B09044r7104a25499B27339a86333O5067
12384a21266j51811a4274r9479e432j05780o0163O2138L3501D9124N7293K1072
12373A27489k7316C1417c8610B32611A11980a50597C998a32828j04813p2337C7681
12361b7043C00523A09547a6615k12j72672A66584a29899A56313F4410e3225r9349
$$ y = [-41932, 143705, 277455, -316833, 258811, -92168, 6732, -86616, 138185, -375138, -33266, -85330, 148221, -287809, 133191, 120986, 92188, 364343, -104506, -496154, 261246, 129330, 143056, -44420, 245974, 213616, -21258, 113631, -211392, -106138, 142622, -92917, -268655, -165741, 5427, 155639, -34379, 110144, 74937, 36967, 216626, 158001, -137494, 181013, 209651, -133959, 89893, -134950, -11921, 209044, 111940, -125499, 227339, -186333, -121266, -273077, -14274, -113753, -5432, -111212, -171375, -109237, -75736, 49124, 106417, 127489, 100173, 31417, -38610, 232611, 111980, -150597, 3998, -132828, -237641, -309978, 37681, -27043, 300523, 109547, -16615, -16827, -189499, 166584, -129899, 156313, 64410, -53225, -152574]
12350a52574D3797b75148b6906G8753J75153C2653B379J66535o6780J0344B5904
12338B8440g4027C03635a19623C44999j47801q0238b98717g4860B02833P03A9481
12326B33110D2720J87847b5794j24251d2989a6361k76231A566b10342A64374h6312
12314i4452I8243c30798A40429J05792A00837C9039K32785A0966J00587a24k31567
12303b31691N4147A14226a44319A5518a37320K4089A05872a88553K5643d1748
12292G3184j7961a58366c8705j30355m174C3587c5774C8376c02021D63698j80920
12281B82778A15355P4462o8823a62955O042C8799K02935D5703g3989j10400C17843
12269g8682k5713n7266O8184a3649B45107C686J28868L95361B00172Q0075i365
$$ y = [-152574, 43797, -275148, -26906, 78753, 253906, 32653, 2379, 168914, 102134, 112478, 25904, 28440, -74027, 303635, -119623, 344999, 197198, 116960, -298717, -74860, 202833, 203536, 19481, 233110, 42720, 230567, -25794, -150045, -42989, -16361, -292592, 1566, -210342, 164374, -86312, -94452, 98243, -330798, 140429, 246221, 100837, 39039, 271824, 10966, 111553, -124, -231691, -177544, 114226, -144319, 15518, -137320, -113231, 105872, -188553, -162910, -41748, 73184, 55223, -158366, -38705, -169060, -173234, 33587, -35774, 38376, -302021, 463698, 282778, 115355, 189817, 120994, -162955, -156913, 38799, 241734, 45703, -73989, -184389, 317843, -78682, -104395, -161661, -93477, -13649, 245107, 3686, 132554, 527915, 200172, 280247, -9365]
12257A68904G7031Q7536o3081A5928M66610I9315O8238a901A74135q2976K99914
12246C91073n8746A54857L8002c5505G9868g0134m1890j61765A19922L42209a47817
12234e1223F2670M4310b7710B62077B3098K42767a91064A25610K8825c61409B5100
12222C7107L26875A48495M6073B3919d51009A87571p4791c8692B33075p2355n2376
12211A08344M9661J98756p6445a6413E22938B52685G7473J20922J15368n9644
12201B54119d6592B51353R35B384b6515B19584O3822b20220B20857J54146A34304
12189C7070g2845A43379J32052h5711E66333B15612J60340d0053B81476j7377
12179B64099A14507J50337k5566b7470B89577A19096P7037J26688j01220a57163
$$ y = [168904, 77031, 164567, 101486, 15928, 482538, 99315, 167553, -1901, 174135, 91159, 391073, 332327, 154857, 192859, -35505, 79868, -70134, -112024, -273789, 119922, 462131, -147817, -51223, 62670, 106980, -27710, 262077, 23098, 265865, -191064, 125610, 154435, -361409, 25100, 37107, 363982, 148495, 194568, 23919, -451009, 187571, 112780, -38692, 233075, 160720, 108344, 158005, 356761, 280316, -16413, 522938, 252685, 77473, 198395, 313763, 254119, -46592, 251353, 252288, 2384, -26515, 219584, 283406, -220220, 220857, 375003, 134304, 37070, -72845, 143379, 275431, -85711, 566333, 215612, 375952, -40053, 281476, 264099, 114507, 264844, 239278, -27470, 289577, 119096, 196133, 322821, 221601, -157163]
12168C06377j4262q7437J42986j16428A06428J04059J6435p6440J13792N8720
12158C22994N8788b1579A6344J85261a53478H9469B5116J04881j2949M1442Q5250
12147B43740R5353C0970J53019L9535q8746a47823C28698H5063L4203a36871B6652
12135B48537J6257q5721A9450J31731a36683I5019a59955E7775c72619E7548J79518
12124B37066H1935g2240B59335A0008a40688e5247C4666a4954H2773e8088n6394
12113a14482D1660A4119K43608c04455G4837b36291G2779e8228B93041a40130
12102d5629B16455a99284R3624l5900G5480P9327b29070A6281b17366A41774a53490
12090d6057o6015C8449N8214m0217g4044B69631C0387J26879N105a17238M7639
$$ y = [306377, 292115, 204678, 347664, 231236, 106428, 210487, 226922, 150482, 264274, 322994, 381782, -21579, 16344, 201605, -153478, 89469, 25116, 129997, 117048, 158490, 243740, 339093, 30970, 183989, 223524, 134778, -147823, 328698, 85063, 119266, -136871, 26652, 248537, 264794, 179073, 19450, 151181, -136683, 95019, -159955, 57775, -372619, 57548, 237066, 81935, -72240, 259335, 10008, -140688, -55247, 34666, -14954, 82773, -58088, -114482, 41660, 14119, 257727, -304455, 74837, -236291, 72779, -58228, 293041, -140130, -45629, 216455, -199284, -105660, -141560, 75480, 154807, -229070, 16281, -217366, 141774, -153490, -46057, -112072, 38449, 96663, 56446, -74044, 269631, 30387, 157266, 162371, -117238, -69599]
12079f9599j38303q7850D02222A18166d4962F7078l3476J0662L8428R5854J19170
12068B97716e905k0987A27310N2548h2274F15925J04776N99771k67180n09407
12058E43885j30587j26680F8235j1045L320a52798A10167m7845J18686h6567j58946
12047b45513F1989P2002L5519b91441c2830n3885C25217d43A14399e3953j22279
12036a76232A15949a09952A2770g634E156Q5546J6490O2184A4731P7673a5260
12024b14606B2096a79354A5221K9870J70413F7851a34351L2108B34163b51644
12013A32632d1102E7666K5251b67856H8464j9443c8447j12792J3168q0087D4626
12001A02740a25842A76858J11397A21974j9270h7352G8589P0891D1062a26648
$$ y = [-69599, -207902, -295752, 402222, 118166, -44962, 67078, 33602, 44264, 82692, 178546, 297716, -5905, -26892, 127310, 179858, -82274, 615925, 720701, 1320472, 1053292, 543885, 413298, 286618, 68235, 57190, 60510, -152798, 110167, 62322, 181008, -86567, -245513, 61989, 133991, 169510, -291441, -32830, -86715, 325217, -443, 114399, -53953, -176232, 115949, -109952, 12770, -7634, 5156, 90702, 107192, 169376, 14731, 92404, -15260, -214606, 22096, -179354, 15221, 45091, 215504, 67851, -134351, -102243, 234163, -251644, 132632, -41102, 57666, 82917, -267856, 88464, 69021, -38447, -151239, -138071, -218158, 44626, 102740, -125842, 176858, 288255, 121974, 102704, -87352, 78589, 149480, 41062, -126648]
11990C68145c48436F0133j0469a85880o2959K1249P5701B85733i9853p0729q6871
11979b57453b3192l76515F9732b86027a3765A29877b07372B6125e3573E8910d6255
11967B4036a9115k04685d9796B864b04088I1482O1996h6229j67829r9992a32988
11955A71536b85251A247K0513b46478A79417e9285j31474H2762m61a16178j48531
11944b64709i0872B3758J95975b8368r0637a6737k11929G1373e8721A68195d9760
11932F2293d26624a75443A14749M2031j1793a62113E22085A97067I0147N518J52083
11921B47748f8390K0746B632J14564i9184A56413K04643j21878A3429N1262J83125
11910B47816I3360a92092G1368C4349b42767A67133P3522P8423j40060l7574D5799
$$ y = [368145, -348436, 60133, 49664, -185880, -248839, -227590, -151889, 285733, -99853, -170582, -257453, -23192, -399707, 69732, -286027, -13765, 129877, -207372, 26125, -53573, 58910, -46255, 24036, -19115, -223800, -49796, 2864, -204088, 91482, 153478, -86229, -254058, -354050, -132988, 171536, -285251, 1247, 21760, -246478, 179417, -59285, -190759, 82762, 82301, -116178, -264709, -90872, 23758, 219733, -28368, -119005, -16737, -228666, 71373, -58721, 168195, -49760, 62293, -426624, -175443, 114749, 156780, 144987, -162113, 522085, 197067, 90147, 95665, 247748, -68390, -47644, 2632, 117196, -99184, 156413, 361056, 239178, 13429, 64691, 247816, 93360, -192092, 71368, 34349, -242767, 167133, 240655, 319078, 179018, 141444, 45799]
11898g9761K0433r2906m1263h4289j95431C0984L4114N1527c5951o9433J1220
11887i4164C21187A28822J7562l8487c1923k8906A24521b09285G183b74803c417
11875B19307k768f4393j9542l456K7760A25978n0231b0803a083B99887j3398b32415
11862a29100I412N260a09809G8100c95428A88793J54149G5506a42765A48037a75242
11850H5089b6025A45100a05917k0942G9791c72878R3264K6060B44859b05743A17897
11838D2226c231j20624h8k28858e9268A65404M8195E6102K42258b85038F8994
11826A16418i4578b3684k7654A89801l2662a79925q6196m7387B72908L0963E0494
11814a90251H7423K13508j064a73020a9587j70973n9177a20374C9469a77136N1708
$$ y = [-79761, -59328, -152234, -193497, -84289, -279720, 30984, 65098, 116625, -35951, -105384, -94164, 321187, 128822, 146384, 107897, -31923, -60829, 124521, -209285, 7183, -274803, -3417, 219307, 216539, -64393, -83935, -87391, -59631, 125978, 75747, -20803, -1083, 299887, 286489, -232415, -129100, 9412, 14672, -109809, 78100, -395428, 188793, 342942, 75506, -142765, 148037, -175242, 85089, -26025, 145100, -105917, -126859, 79791, -372878, -279614, -253554, 244859, -205743, 117897, 42226, -3231, -123855, -88, -228946, -59268, 165404, 213599, 56102, 298360, -285038, 68994, 116418, -94578, -23684, -51338, 189801, 157139, -179925, -266121, -313508, 272908, 303871, 50494, -190251, 87423, 300931, 299867, -173020, -19587, -190560, -249737, -120374, 39469, -177136, -125428]
11803a25428A7054J69406b8021H3911J71708b1412j21891A48541F1575i8006b9567
11791C7967a42650C93479b14621d4851B8000a89473A51305i7535h091B03807a77381
11779b54756F203a17181A47401b1158A26465E4172a8606B7606d3869A50212a86171
11767F1502R004J55722c0886A15003p973b68053A68804a22289C24896A3831K7052
11756D0883h6895L6073C19835J11736f6408p8273c5835o2851A41953c89437B94405
11744D6644a99391A83527a10742o8486P909E5931b69767a32912M9079A02583c5025
11732a27057K7396B28054E6144d8621j18487B0089a76548A63973a12681a5603
11721F6511g0619l68318D7072k3299a86363d9220j70514A52645m2243a42621k33933
$$ y = [-125428, 17054, 186460, -28021, 83911, 255619, -21412, -143303, 148541, 61575, -98006, -29567, 37967, -142650, 393479, -214621, -44851, 28000, -189473, 151305, -97535, -8091, 203807, -177381, -254756, 6203, -117181, 147401, -21158, 126465, 54172, -18606, 27606, -43869, 150212, -186171, 61502, 70506, 226228, -30886, 115003, 107030, -268053, 168804, -122289, 324896, 13831, 40883, -86895, -50822, 319835, 431571, -66408, -144681, -35835, -98686, 141953, -389437, 294405, 46644, -199391, 183527, -110742, -179228, -171319, 55931, -269767, -132912, -83833, 102583, -35025, -127057, -99661, 228054, 56144, -48621, -167108, 20089, -176548, 163973, -112681, -15603, 66511, -70619, -438937, 47072, 23773, -186363, -49220, -219734, 152645, 110402, -142621, -376554]
11710c76554b9783j8398j5146B79906E7903J00890o898J37631A37194j178J97217
11699C33233a52582A3883J04927M8820G3451Q8975d54924A23299a14802A98162
11688g9170k3272B39252I0584L76987a53610B53091g5948D428a29947q6951A02032
11676f4140K7390p7804k04308a4456o9455C1563K26047I7184l2129d2759E5305
11664H799K30821c90618a8402l5265j13377a4781j23422D0390K06574M2269A8158
11652i2764a8193B43615h642A60786N2883I2557a01366k48825G3322K3503a99071
11640i7048M1445B25005r1001L40253E1650I394b04530E8374N1483O9711Q1068
11629B60636G0492f0516C935d9346K275A8102b94117A85462b68643A7922a03835
$$ y = [-376554, -29783, -48181, -63327, 279906, 57903, 158793, 151895, 289526, 137194, 136016, 333233, -152582, 13883, 118810, 167630, 73451, 162426, -454924, 123299, -114802, 198162, -79170, -102442, 239252, 90584, 467571, -153610, 253091, -75948, 4428, -129947, -216898, 102032, -64140, -36750, -114554, -318862, -14456, -83911, 31563, 257610, 97184, 65055, -42759, 55305, 8799, 239620, -390618, -18402, -53667, -167044, -14781, -138203, 40390, 246964, 289233, 18158, -92764, -18193, 243615, -8642, 160786, 213669, 92557, -101366, -350191, 73322, 96825, -199071, -97048, -55603, 225005, 134004, 474257, 51650, 9394, -204530, 58374, 109857, 179568, 260636, 70492, -60516, 3935, -49346, -47071, 18102, -294117, 185462, -268643, 17922, -103835]
11617f1935o1073D29397g0404A0229i6034F6996a47819D030b4391B3317b17033
11605b33087l1046f5277B77994b90968d6270i695C30838b50515B21177a36321
11594C117P1554K26819a65691I1898a5841r4056A25138n3096J3393a14350B22636
11582a633D0828a14981c0738e59F2809c09096A63011g7583j01043C76961b0810
11570A32596K27890b1128j51404A0271b16715A44903P3282A00945j3117L883a58690
11558A39564Q6914H4018O8675c1040o0186C84944c1374j54216A89236L00128h6767
11546A1959Q790M7536K94794A72892b4475n8412r2414g3746A8817f8911B27118
11534C30035a80441J7106B13621c83074c4599D2616j3589c6861C57579E0832K71553
$$ y = [-61935, -123008, 429397, -70404, 10229, -96034, 66996, -147819, 4030, -24391, 23317, -217033, -233087, -264133, -65277, 277994, -290968, -46270, -9695, 330838, -250515, 221177, -136321, 3117, 74671, 301490, -165691, 91898, -15841, -109897, 125138, 72042, 85435, -114350, 222636, -1633, 40828, -114981, -30738, -559, 62809, -309096, 163011, -77583, -178626, 376961, -20810, 132596, 360486, -21128, -172532, 10271, -216715, 144903, 218185, 100945, 87828, 91711, -158690, 139564, 226478, 84018, 152693, -31040, -91226, 384944, -31374, -185590, 189236, 489364, -86767, 11959, 20749, 68285, 363079, 172892, -24475, -82887, -175301, -73746, 18817, -68911, 227118, 330035, -180441, -163335, 213621, -383074, -34599, 42616, 29027, -36861, 357579, 50832, 322385]
11523C22385A56977j4347n0335b17797J0550B82141A02283Q2713J3582p8745l3419
11512H6414K33614A48851m6787J52387N1964A00976a13628C9961a65811k733B54432
11500g6034B11492K1030a07261A49497Q0414j13936K37606A74359K98288A82399
11489D02580A02310P8739c6939G4894a68o4056A39797B2458K64713j38399a53469
11477b04724R0468H1844a0051D37142A80695K6644a51293B45189G7812O020L4093
11466A17925J8633K9380B2999J4270J36354J57065j52705L7992F6898J42071E0409
11454i3980O35o2578B54196G3697J55034o1688J547G7781f4502B38362o5271a5983
11441B97595c7565D15340n7541B2073A353c3987D50240k10912r8158A2814N08782
$$ y = [322385, 156977, 142630, 92295, -217797, -207247, 282141, 102283, 184996, 198578, 119833, 86414, 320028, 148851, 102064, 254451, 306415, 100976, -113628, 39961, -165811, -168544, 254432, -76034, 211492, 232522, -107261, 149497, 229911, 115975, 353581, 174359, 472647, 182399, 402580, 102310, 181049, -36939, 74894, -168, -64224, 139797, 22458, 287171, 148772, -153469, -204724, -114256, 81844, -10051, 437142, 180695, 207339, -151293, 245189, 77812, 83832, 117925, 136558, 165938, 22999, 37269, 173623, 330688, 177983, 215975, 66898, 208969, 50409, -93980, -93345, -155923, 254196, 73697, 228731, 167043, 168590, 77781, -64502, 238362, 173091, -15983, 297595, -37565, 415340, 357799, 22073, 1353, -33987, 450240, 239328, 141170, 12814, 521596]
11430E21596b38813E4073h5134p1244a8416A06912K55884a83016C76682e5703
11419A77212o152I410K65894j4873a17868b0608j8612B56190e03835g9599A40890
11407g3903j23514B35144J0097A21693l3275g8647b5128j36824A74343G2553a98499
11395H9703a4980j18468N4064C64451b48501G8906J34758a24664I4043a00404
11384h6847A84899p376C6909A0130a03468C93147E1270k1635J41007K9246a60487
11372a22298L5656j12762P2992l2218a1615G2767R0150a17866E1834c64017J70360
11361a93657F9072d6766j30771e7424r7685b5426l2458m6714N0141j58524f1261
11349b3630j35318j5297B16431A06378c4270j80845D365L0045J48883l8127a85538
$$ y = [521596, -238813, 54073, -85134, -156378, -18416, 106912, 362796, -183016, 376682, -55703, 177212, 171060, 9410, 275304, 260431, -117868, -20608, -39220, 256190, -503835, -79599, 140890, -73903, -197417, 235144, 245241, 121693, 88418, -78647, -25128, -161952, 174343, 72553, -198499, 89703, -14980, -133448, -79384, 364451, -248501, 78906, 213664, -124664, 94043, -100404, -86847, 184899, 177523, 36909, 10130, -103468, 393147, 51270, 29635, 170642, 199888, -160487, -122298, -86642, -199404, -126412, -158630, -11615, 72767, 162917, -117866, 51834, -364017, -193657, 69072, -46766, -177537, -57424, -155109, -25426, -57884, -104598, -54457, -212981, -61261, -23630, -158948, -174245, 216431, 106378, -34270, -215115, 4365, 34410, 183293, 145166, -185538]
11337a27423l8427J1063d4175A00456Q488a3445n7646B77584A37001a91582C01331
11325a93818f3376j60185a4742q7549r7929O2885M5972D7397K9101g1675o4858
11314a36533a9634k07950Q9766c8136j66338k6815K7981D5891j0267d4528j08657
11303a53185I9823P7161a23347B37585c08756A13798m1593b22978A18651g7009
11292F9956B4463a966m9780o3034K5455j88599A09374b1634l2366B1209c94228
11280d6224E1228c2287P495C4534m459b22749J10865A07057f5372b0275k76859
11269b97134B24721c28044D1211b53536P9008A6703J68750I894K47037C8397b06844
11257A07653A9891K00116a0925j53929l1844d9541j7377C7716K88243h1243j82801
$$ y = [-127423, -165850, -154787, -44175, 100456, 108944, -13445, -71091, 277584, 137001, -191582, 301331, -193818, -63376, -223561, -14742, -102291, -200220, -137335, -91363, 47397, 76498, -71675, -136533, -19634, -227584, -137818, -38136, -204474, -231289, -203308, 45891, 35624, -44528, -153185, 99823, 176984, -123347, 237585, -308756, 113798, 72205, -222978, 118651, -77009, 69956, 24463, -1966, -51746, -114780, -89325, -277924, 109374, -21634, -54000, 21209, -394228, -46224, 51228, -32287, -24792, 34534, 30075, -222749, -111884, 107057, -65372, -20275, -297134, 224721, -328044, 41211, -253536, -174528, 16703, 185453, 9894, 256931, 38397, -206844, 107653, 19891, 220007, -10925, -164854, -196698, -49541, -66918, 37716, 325959, -81243, -264044]
11246b64044e6489K5648j80063G2797M8492b05231I8018a90430c856j51678M5577
11235a09957j50709c9504n9188M1695A15631J60610c3567n7572I7982J2419l2000
11224G8401d2499J6085j66905R2604A60117b4953C8638K8742b93591Q1099l1479
11213b43971R1854L6234k21171h5954j87811G4950P0437B0780b790l62984g5322
11201a79712d8748j69152E3301A0511J2138a3013A38852f0800k0426E1565J73495
11190B25060i4384k2417r0864f6105A90056a45967K9688B70534B4171K33498F0844
11178b01865B32805a45424m6536G5881b8399A95259C3050a04799n4546C6894a46822
11166b35613a10226M9081p1124r8647g0221K6841j17635I3286a65539J9131k82136
$$ y = [-264044, -56489, -30841, -210904, 72797, 121289, -205231, 98018, -190430, -3856, -155534, -109957, -260666, -39504, -98692, -56997, 115631, 276241, -33567, -91139, 97982, 110401, 78401, -42499, -26414, -193319, -100715, 160117, -24953, 38638, 67380, -293591, -212492, -243971, -152117, -115883, -337054, -85954, -273765, 74950, 145387, 20780, -2790, -365774, -75322, -179712, -48748, -217900, 53301, 10511, 22649, -13013, 138852, -60800, -81226, 51565, 225060, -94384, -116801, -207665, -66105, 190056, -145967, -116279, 270534, 24171, 257669, 60844, -201865, 232805, -145424, -191960, 75881, -28399, 195259, 33050, -104799, -159345, 36894, -146822, -235613, -110226, -61145, -132269, -230916, -70221, -43380, -161015, 93286, -165539, -146408, -428544]
11155d28544B3523J50282f6316B09679E5441b4591j94680Q5956L3691A95235d00752
11143A13779f5251B48812a43766a9130A01003Q214M2550f1124C55059A14266k7951
11132H6315d51133a18976A88791k8077k0511D1454h2858B49176b92904A7960a82614
11120a65833L9580j61184H1781B247L9539j2839J21660n0605d7667J9322q3661
11109a12006B3341K70930j35566C3557K57725J14065j5787A84501M6599I9796
11098B66563a01195c4951A02617K54229D2510a86533a5634B49291o3411a35125
11087B8916J17095J89646F0471J2559J62902J99010N644A59169J44900A04789
11076C27327E2397K15032K37294j54268j00398K43286a9037C6797L64487A23333
$$ y = [-428544, 23523, 173805, -66316, 209679, 55441, -24591, -219271, -133315, -99624, 195235, -400752, 113779, -65251, 248812, -143766, -19130, 101003, 109217, 151767, -61124, 355059, 114266, 86315, -451133, -118976, 188791, 160714, 140203, 41454, -82858, 249176, -292904, 17960, -182614, -165833, -126253, -287437, 81781, 2247, 41786, 28947, 150607, 100002, -47667, -28345, -112006, 23341, 294271, 158705, 33557, 291282, 405347, 389560, 184501, 231100, 99796, 266563, -101195, -34951, 102617, 356846, 42510, -186533, -15634, 249291, 185880, -135125, 28916, 146011, 335657, 60471, 73030, 235932, 434942, 440586, 159169, 304069, 104789, 327327, 52397, 267429, 504723, 350455, 250057, 493343, -19037, 36797, 401284, 123333]
11065C55400A06617J22787K29127j93858J23870A54568K39576j87416R0131p3528
11055B23331L10237j63433A71174P5615L2347J85170j84157l3770K26025M12082
11045H84486B76986N50646l03168K31498o4641k06951L71474C52665J30657J69050
11035F52372q6214K76995l46297K45852n2665m5153k49071M08479k66859L85099
11025I22538k71454J80763j1272M5970j40045k65779K15706O7829j63068J79892
11015G61080p3010j91266o0793K08870j816J00j34209L73165r7476p6715k66398
11004D41532n6822K86934o5478j74726K10036n1385r5963K28360l30398L3789
10994D25879M70044j18884k56902K33666C68903J92878L63634l16430M2313m0436
$$ y = [355400, 106617, 229404, 458531, 264673, 388543, 154568, 394144, 206728, 296859, 223331, 533568, 370135, 171174, 246789, 279136, 464306, 280149, 246379, 472404, 884486, 276986, 827632, 524464, 755962, 691321, 484370, 855844, 352665, 483322, 652372, 566158, 843153, 496856, 742708, 690043, 644890, 395819, 804298, 537439, 922538, 651084, 831847, 820575, 866545, 726500, 460721, 676427, 744256, 581188, 761080, 688070, 496804, 436011, 644881, 643065, 643165, 508956, 882121, 784645, 707930, 441532, 384710, 671644, 606166, 431440, 641476, 590091, 494128, 722488, 392090, 425879, 895923, 777039, 520137, 753803, 368903, 561781, 925415, 608985, 651298, 610862]
10984F10862Q9398j00795J7029J01339J18951j76580J86186j69548M6881J57457
10974H81180m4374R8785q0843J64998P90J7315q1850J40682J96569o4957J89051
10963A417346K4294K28469K283J33105L18525M99881K07422j54802P3015q8391
10953B661147K29877m41083Q5198m10368l50065k36348J19530q3742K5381k7671
10943A571856N1808J25744J71658j60549m07642j11986n5814l6255q0258k44698
10933H23864l9174m4076C03725M215q2059j06870O27472k60612A78793K48350
10923D27143j50031J26317j07370d809A4000K38635q2305n097J5140a8488D76981
10911D7437a77597l6948A05760a9601j31623B91926m5036j18703M6533C6332K64887
$$ y = [610862, 700260, 599465, 616494, 717833, 836784, 660204, 846390, 676842, 723723, 881180, 836806, 935591, 854748, 1019746, 1020536, 1037851, 956001, 1096683, 1293252, 1228295, 1417346, 1441640, 1670109, 1672392, 1805497, 2124022, 2623903, 2831325, 2676523, 2749538, 2661147, 2891024, 2449941, 2535139, 2124771, 1774706, 1538358, 1657888, 1574146, 1599527, 1571856, 1623664, 1749408, 1921066, 1760517, 1352875, 1240889, 1185075, 1148820, 1068562, 823864, 784690, 740614, 303725, 307940, 225881, 119011, 746483, 485871, 178793, 427143, 277112, 403429, 296059, -4809, 14000, 252635, 170330, 165233, 180373, -18488, 476981, 47437, -177597, -214545, 105760, -19601, -151224, 291926, 246890, 128187, 174720, 36332, 301219]
10900C01219B0371a17176p0476k1927I0513d0776k69160H2891n441a33970E5924
10888b25208A94528e4820G9767b13589o3999B10956b25905e8561j30953B01827
10877h3375A51370a23889k3334N8677C01269b30253d2633H238b9815C4741a42327
10865a35058A31800a07772F0002P3658D1373K25330j9497j23256F072N6023a85521
10853C24407A32306i3849D6658A5835K18103Q0907f3709A04410a51395C5967a27847
10841A55656a89769B0097L04792a07037B16278g3560A73741H2975M687p133L9772
10830A20301a89864A2188i8214j3184l4699n5306Q7753b6224o2239c8277a4850
10818g9692n6620c9116o6552j61961A276c00974g2705J6071h634j21534K929d730
$$ y = [301219, 20371, -117176, -187652, -209579, 90513, -40776, -309936, 82891, 77450, -133970, 55924, -225208, 194528, -54820, 79767, -213589, -277588, 210956, -225905, -58561, -189514, 201827, -83375, 151370, -123889, -147223, -88546, 301269, -230253, -42633, 8238, -29815, 34741, -142327, -135058, 131800, -107772, 60002, 133660, 41373, 266703, 247206, 123950, 6072, 62095, -185521, 324407, 132306, -93849, 46658, 15835, 233938, 314845, -63709, 104410, -151395, 35967, -127847, 155656, -189769, 20097, 324889, -107037, 216278, -73560, 173741, 82975, 87662, 80529, 120301, -189864, 12188, -98214, -111398, -146097, -201403, -113650, -26224, -88463, -38277, -14850, -79692, -136312, -39116, -105668, -267629, 1276, -300974, -72705, -56634, -8634, -130168, -127239, -4730]
10805B14989l4267a13818a5033A07822a17544l7324F5186b08618D890b17889j25756
10794c43645B55321j20397k6950b46422a5493p3145j46105F4388i9273k09423
10784c08696I0897h0795h229A41099J2828b81072D8890J22620p0973b23943d257
10772A89606b36387f3253m6778j46857Q3454f9524A01527C0875L1139O9199d33379
10760I593e8077A74533c0448j9335J0523q1926G7268a19128r682k53245J76848
10749b05207p199g7790q4991j23455L8155q4020A66771h8328c7203I665b03850
10737a47952e9737n5213A23486d64929A2527b00960A41032J13737A11323l0464
10727H0859b08635B18965p9956A409h7213B5967c00400H9461g9028a5603A4824
$$ y = [214989, 180722, -113818, -15033, 107822, -117544, -154868, 65186, -208618, 4890, -217889, -343645, 255321, 134924, 107974, -246422, -15493, -88638, -234743, 64388, -99273, -308696, 90897, -80795, -8229, 141099, 153927, -281072, 48890, 171510, 100537, -223943, -4257, 189606, -236387, -63253, -110031, -256888, -173434, -69524, 101527, 30875, 62014, 131213, -433379, 9593, -58077, 174533, -30448, -49783, -39260, -121186, 77268, -119128, -128810, -382055, -205207, -212406, -77790, -162781, -286236, -248081, -332101, 166771, -88328, -37203, 9665, -203850, -147952, -59737, -114950, 123486, -464929, 12527, -200960, 141032, 254769, 111323, 80859, -208635, 218965, 139009, 1409, -87213, 25967, -300400, 89461, -79028, -15603, 14824]
10715H4333j9248a72700a6538k659C23718a0383A18381c03309F5135a23059N1946
10704g1113k36416A4835J99613a8926G578h7703E028c15686D179a76553N6454
10693a20099o4120L0845N4567d0509A34543c9103B52844a26623J2274H0198j7612
10682F2586Q692J48810O2139A15298b2032E0427a43836D409i2945F3056g2965
10670B40413J42207a30878j52682A07690A7100P8346i5153d4605l1513n0524j44227
10659b70869B3554a70452q5817A7239G40a7439H5523b65890i4299d3560h772C0284
10646I1633a86865B4071g1396E5353e3393l58612c9414j22m821k70980b0947j24969
10634a45916p9225B16981b7056n6222E1568a22557A65800f4011J2355H8344D3627
$$ y = [84333, 65085, -172700, -16538, -19197, 323718, -10383, 118381, -303309, 65135, -123059, -71113, -307529, 14835, 214448, -18926, 7578, -87703, 5028, -315686, 4179, -176553, -120099, -184219, -153374, -98807, -40509, 134543, -39103, 252844, -126623, -114349, 80198, 62586, 71278, 220088, 282227, 115298, -22032, 50427, -143836, 4409, -92945, 63056, -72965, 240413, 382620, -130878, -283560, 107690, 17100, 95446, -95153, -44605, -76118, -126642, -270869, 23554, -170452, -256269, 17239, 740, -17439, 85523, -265890, -94299, -43560, -8772, 30284, 91633, -186865, 24071, -71396, 55353, -53393, -412005, -39414, -39536, -44357, -315337, -20947, -145916, -225141, 216981, -27056, -83278, 51568, -122557, 165800, -64011, -51656, 88344, 43627]
10622C8378h1278k39289J28500F33Q6896h6340B14988c28690E2837b3450n7427
10611h0877j66087B38108e0941n8000q9481N4140I6715m848f0891m6374p2719
10600a79984E0776h0476a5611B3388b6643n3101H0594h4605H8684a86063K1632
10589a64431d0295I4488J0721O9824a58804j06507A8340J77407a57246a6558l66797
10578c83355d523m46658I7423p429i2187j2286k38182b9285D1740b19775p2151
10567b91926R1135A68193a3516o018a147m17957i2329j63561K9982i0300I1716
10555I9759e7021l88768K12897a15686C4593b18452G5623a71819G610J64107a74097
10543e8204A17979a22051l4190j67506a45905o4714R2228A63081G4076c01250
$$ y = [38378, -81278, -320567, -192067, 633, 87529, -86340, 214988, -328690, 52837, -23450, -80877, -246964, 238108, -50941, -108941, -198422, -144282, 96715, 91867, -60891, -107265, -179984, 50776, -80476, -15611, 23388, -26643, -79744, 80594, -84605, 88684, -186063, -164431, -40295, 94488, 105209, 175033, -158804, -265311, 18340, 195747, -157246, -16558, -383355, -4523, -451181, 97423, 89994, -92187, -104473, -342655, -29285, 41740, -219775, -291926, -200791, 168193, -13516, -19534, -1147, -419104, -92329, -255890, -225908, -90300, 91716, 99759, -57021, -445789, -232892, -115686, 34593, -218452, 75623, -171819, 7610, 171717, -174097, -58204, 117979, -122051, -156241, -323747, -145905, -210619, -118391, 163081, 74076, -301250]
10532b0931A17944J6386b02218a520r2150C0513b04834P3471B05280b96399A32008
10520a08311k50030J18629l6337Q8884B5416l847J78548c53211A82292a07154
10509e1377A34489A6614b68086A54108N2027a13849B55302R3107a76805B7908
10498F3223b71017B27242I3342b9213k622n0838j80518a3722l5668A61645K91119
10487D52764A51097b8402q5391A29491a76662G7121a47638c9387j90997B29261
10476A30499b02232A54327F4456a47062i495B57492a69329k7559F2929L88565
10466D51494A27302j8480L21167m0043m5911j02353A13709J79119A39058f7271
10455H5015a94737K2184A91030m8744a0282I1473a39055E6855j0168J8622J49789
$$ y = [-20931, 117944, 134330, -202218, -1520, -93670, 30513, -204834, -131363, 205280, -296399, 132008, -108311, -358341, -239712, -276049, -187165, 25416, 21569, 200117, -353211, 182292, -107154, -51377, 134489, 16614, -268086, 154108, 206135, -113849, 255302, 348409, -176805, 27908, 63223, -271017, 227242, 93342, -29213, -31835, -82673, -263191, -13722, -49390, 161645, 452764, 151097, -28402, -113793, 129491, -176662, 77121, -147638, -39387, -230384, 229261, 130499, -202232, 154327, 64456, -147062, -9495, 257492, -169329, -196888, 62929, 451494, 127302, 108822, 429989, 389946, 344035, 241682, 113709, 292828, 139058, -67271, 85015, -194737, -172553, 191030, 142286, -10282, 91473, -139055, 56855, 46687, 65309, 215098]
10444B15098a78350O5468l44521A55768A9526i177B3144a19132k04927B10186
10433a27947A18551a4249E5492K78010a90484H4042b4185k78703A96389d0609
10422h2502L2284A91771J8169b750r0535b9291I0090C5217K3621R4287d9544K0385
10410b9159j0391j15277N125H2529a22695A1456L6800q331L32833A1800f767q2467
10398h9234B9673a69853e1614E7642F912O885o762b1959l7037A24681D4955a73038
10385b10538e4851C30169j60931c8315J8459j76524A99308A4004c34804B58710
10374B43873a26215M5067C30461C325a22251C58882a25962B07239a09566C72089
10363B38293N3085q0536I8923L0669c0697C56179j1028L61881k06176B36057P9055
$$ y = [215098, -178350, -112882, -457403, 155768, 19526, -9177, 23144, -119132, -324059, 210186, -127947, 118551, -14249, 55492, 333502, -190484, 84042, -24185, -302888, 196389, -40609, -82502, -50218, 191771, 209940, -2750, -93285, -29291, 90090, 35217, 58838, 153125, -49544, -29159, -39550, -154827, -149702, 82529, -122695, 11456, 48256, 39925, 372758, 11800, -6767, -89234, 29673, -169853, -51614, 57642, 6912, 13797, 7035, -21959, -58996, 124681, 44955, -173038, -210538, -54851, 330169, 169238, -38315, -19856, -196380, 199308, 14004, -334804, 258710, 243873, -126215, -81148, 330461, 3325, -122251, 358882, -125962, 207239, -109566, 372089, 238293, 291378, 210842, 98923, 129592, -30697, 356179, 345151, 707032, 500856, 236057, 315112]
10352C15112J10065j45800J67910Q1384j22836J637k00152G4997M5548K91107
10342D11652j39512o8576N6443j6892J00750c7308C70283o2175J73774l4762E4970
10330C36348m4460K77716d106B62168L89537k88989A66446J81629B8744K6310
10320E5054K17689I5239J21350q357B594c75226A83472e4961B36753l6974k8881
10309A70898C8200J83480J14502A07716a12357J8489B91762p0679J23717b19912
10298A05372J09121E7735j4856b71244J35005A2582c8908r9594N7907A81907d0786
10286a6594G9181c1402D19536A82020H9686a55570P7091A40980J585h1107k00277
10275b81384B38247b29030B81898d7950j9551k93125e5324j00636I599K45827
$$ y = [315112, 425177, 279377, 447287, 528671, 405835, 407472, 207320, 74997, 120545, 411652, 272140, 203564, 260007, 243115, 343865, -37308, 370283, 308108, 481882, 447120, 54970, 336348, 291888, 569604, -4106, 262168, 651705, 362716, 166446, 348075, 28744, 55054, 272743, 95239, 216589, 208232, 2594, -375226, 183472, -54961, 236753, 199779, 170898, 38200, 221680, 336182, 107716, -112357, -93868, 291762, 221083, 344800, -219912, 105372, 214493, 57735, 42879, -271244, -136239, 12582, -38908, -138502, -80595, 181907, -40786, -16594, 79181, -31402, 419536, 182020, 89686, -155570, -78479, 140980, 142565, -81107, -281384, 238247, -229030, 281898, -47950, -67501, -360626, -55324, -155960, 9599, 255426]
10265B55426b52105E5616a1884j46014L609f3500q9331A43920B1581J33040a66703
10253H5752J50725a27981B10597d9557A49610M0141B8453g5156A2126R1651m0239
10242F3538m230A7355N0430N554M1997o973K04312j2542f4770A98818a11161b8430
10229I190a50288P2459b9252F5929e8881k0937B45254J12103b94846J45259d050
10217B10039A187b35329M7155D5714a97174b8156j2667k810D829J48171g4027
10205A88335O5026C050d4086l05899k1764J68189i3180K4593N234F6837H05e18707
10192a15694j82587a43969K8407e5850j71880A35983a05947a1968A49352D4349
10181b56131a21549A82177i2538M4978k00633a4745B63078d7781B44256a87981
$$ y = [255426, -252105, 55616, -11884, -157898, -154289, -63500, -152831, 143920, 21581, 154621, -166703, 85752, 236477, -127981, 210597, -49557, 149610, 189751, 28453, -75156, 12126, 103777, 63538, 59308, 17355, 67785, 73339, 115336, 108363, 312675, 300133, -64770, 198818, -111161, -28430, 9190, -150288, -77829, -29252, 65929, -58881, -79818, 245254, 357357, -294846, -149587, -4050, 210039, 1187, -235329, -188174, 45714, -197174, -28156, -40823, -43633, 4829, 153000, -74027, 188335, 253361, 3050, -44086, -349985, -371749, -203560, -93180, -68587, -63353, 66837, 805, -518707, -115694, -298281, -143969, -115562, -55850, -227730, 135983, -105947, -11968, 149352, 44349, -256131, -121549, 182177, -92538, -47560, -248193, -14745, 263078, -47781, 244256, -187981]
10170A06383a12533m6742A62043c64357i7839k07663M3350N8824k82435C9694
10159B09262a81451N2027e2897j48798A04029a3704m03492I3242J680b29725e2694
10147a65632C9204j5859e724k11764a04585J0627D9323c05227Q9423c1209i081
10135D600J79489a71416F3281a66022l5352B71567j17987J89821d5908D9210a95189
10123a15539A60104a82958E0895o157A9871J2913O4343B3342g3532j43476j09079
10112c26087I0614a46214A46624b25589A54765d35004B14771a48714b574F208
10101g5408k5793F8513g0910j57611j217A16626a31001j1028K8901J8837j25048
10090b19339J9785A0074a61026O907A60045e6385l19124i8281j09274b4111A09812
$$ y = [106383, -112533, -159275, 162043, -364357, -97839, -305502, -262152, -203328, -485763, 39694, 209262, -181451, -129424, -52897, -201695, 104029, -13704, -417196, 93242, 94922, -229725, -52694, -165632, 39204, 23345, -5724, -217488, -104585, -93958, 49323, -305227, -215804, -31209, -9081, 4600, 184089, -171416, 63281, -166022, -201374, 271567, 153580, 343401, -45908, 49210, -195189, -115539, 160104, -182958, 50895, 44738, 19871, 32784, 97127, 23342, -73532, -217008, -326087, 90614, -146214, 146624, -225589, 154765, -435004, 214771, -148714, -2574, 6208, -75408, -101201, 68513, -70910, -228521, -229738, 116626, -131001, -142029, -113128, -94291, -219339, -199554, 10074, -161026, -154119, 160045, -56385, -375509, -98281, -207555, -24111, 109812]
10078c1519j42490A22135B2377h4555J2040j87079C48444e8669J885b6584B20246
10066a25227A48393a83591L5034A09559K23661a41349B6823c29942a62648B9854
10055i7047k6322m0593Q0469A9464g4685E5083a23762j10989A41458K5409D8084
10043A25727a05633d7884J259A27060o0382a7773l6379q0875j59254M8874D8543
10031b59419B4695J23980a13417M406L2011b4340g119j19524j00646D2893a70753
10019A03831M1589b50723d9290Q556j41473A43993A076b3114A81190i4046L9382
10008e4664a9083B9474e6128k30346L0157A6568N7255a54011A51564b56713G0565
9996d4155H6482b62866a03027E2294P0174b05557d1366r0771C4436c5789j10808
$$ y = [-31519, -174009, 122135, 22377, -84555, -72515, -259594, 348444, -58669, -56784, -26584, 220246, -125227, 148393, -183591, -148557, 109559, 333220, -141349, 26823, -329942, -162648, 29854, -97047, -123369, -163962, -83493, 19464, -74685, 55083, -123762, -234751, 141458, 166867, 48084, 125727, -105633, -47884, -46625, 127060, 66678, -17773, -54152, -135027, -294281, -245407, 48543, -259419, 24695, 148675, -113417, -109011, -77000, -24340, -7119, -126643, -227289, 42893, -170753, 103831, 145420, -250723, -49290, -40734, -182207, 143993, 1076, -23114, 181190, -94046, -54664, -19083, 29474, -56128, -286474, -256317, 16568, 73823, -154011, 151564, -256713, 70565, -44155, 86482, -262866, -103027, 52294, 122468, -205557, -41366, -132137, 34436, -35789, -146597]
9985a46597j2924K3532F1007k8533A5656f3050k42055J49539p1729A34403J41486
9974B75889d8554G2831h3678C37348A21900Q6694F4901c1492F827b62299h2861
9962D35098a84382j11737d1914K666A14563f903c331l2466q7415B89251h0218
9950F2252M03404a89841a8333j72336R1446c4915m8646l5307L9631n8529e7498
9938B59448b26631c2709a649r2901B3373J16026l2269a59600o706j16668M0792
9927b42182a0194H4606b8667j90729K1983B0764J35387g8041q2414A24971a04274
9915c8549A93237a73151k9079A48822O0204H2673c366m20244i3637A27941a12507
9903b34642h1659j35126e1065C93769a4161m58052J99463j66104A52955a44463
$$ y = [-146597, -159521, -135989, 61007, 32474, 15656, -63050, -305105, -155566, -227295, 134403, 275889, -48554, 72831, -83678, 337348, 121900, 208594, 64901, -31492, 6827, -262299, -82861, 435098, -184382, -296119, -41914, -39248, 114563, -6903, -3331, -35797, -123212, 289251, -80218, 62252, 465656, -189841, -18333, -190669, -99223, -34915, -83561, -118868, -79237, -137766, -57498, 259448, -226631, -32709, -1649, -94550, 23373, 139399, 107130, -159600, -166306, -282974, -242182, -10194, 84606, -28667, -219396, -197413, 20764, 156151, -78041, -160455, 124971, -104274, -38549, 193237, -173151, -202230, 148822, 209026, 82673, -3366, -423610, -93637, 127941, -112507, -234642, -81659, -216785, -51065, 393769, -14161, -472213, -272750, -438854, 152955, -144463]
9892c40597R0244P8866G8934a51386G4049a85084M9806a7443l40745L4345c8999
9880b12380j46091A43707n7675b15005L8872c8297m0615k15983J15150A8540M1167
9869E9707f7719B02638g6913j51356k4391A88191B5042b13536l5685B2562b82992
9857A41929a68240B91387d9358A45994a38158j36817J8333q5962A6952O9337O5957
9846A52246a3730l6826j39122k1461B9382a29858L1201l1481A40662i2766l0173
9835a22939p6696b5374I1250q971K06673d10355B52071I0797a8854q0518c5036
9823H1405a29639j9140b2198q9945B02394a94496A40519a32995b2371l94720L9549
9812c77542B05419d38514I5249B177b04831d9089B23888c3943C28007c99376d4128
$$ y = [-340597, -250353, -171487, 78934, -151386, 74049, -185084, -135278, -17443, -358188, -323843, -38999, -212380, -358471, 143707, 86032, -215005, -176133, -38297, -78912, -294895, -179745, 18540, 59707, -67719, 202638, -76913, -228269, -252660, 188191, 25042, -213536, -249221, 22562, -282992, 141929, -168240, 291387, -49358, 145994, -138158, -274975, -256642, -342604, 16952, 86289, 152246, -13730, -50556, -189678, -211139, 29382, -129858, -98657, -130138, 140662, -92766, -122939, -199635, -25374, 91250, 82279, 288952, -410355, 252071, 90797, -18854, -99372, -35036, 81405, -129639, -148779, -22198, -112143, 202394, -194496, 140519, -132995, -22371, -417091, -377542, 205419, -438514, 95249, 2177, -204831, -49089, 223888, -33943, 328007, -399376, -44128]
9800A04397h8062j6204K227l337D0049a7959M66l36065M4547Q5333g2804B79946
9787f4631j2595F8070f2244B8823c1182p4422l71635c8507m79586a2092p8362
9776i0454c0360H4224J91267B3310a22227B36059l2400K9631H20J5521a33049
9764F9442P2907h3665p5219B06944n9858n988D0692a53584B19267B3462b01423
9752A03653c8847m6790c8958J175n0794G1370a78258O8116A36087b02305J00424
9741a01881F4837c50050L2703A37398a94288F1314P8798a08632D00562g4363n9677
9730a34040f5103j90534B79760h6721B17962a04125j46879B5225a34799B2055
9719E1661D65a88333o7351b5610k39229G4457a40732B796a81896a3458D4411a45854
$$ y = [104397, -88062, -104266, -102039, -105376, 40049, -17959, -17493, -353558, -309011, -223678, -72804, 279946, -64631, -77226, 68070, -62244, 28823, -31182, -105604, -477239, -38507, -518093, -12092, -90454, -30360, 84224, 275491, 23310, -122227, 236059, 203659, 233290, 820, 16341, -133049, 69442, 142349, -83665, -158884, 206944, 147086, 141098, 40692, -153584, 219267, 23462, -201423, 103653, -38847, -85637, -38958, -37783, -88577, 71370, -178258, -110142, 136087, -202305, -101881, 64837, -350050, -317347, 137398, -194288, 61314, 140112, -108632, 400562, -74363, -134040, -65103, -255637, 279760, -86721, 217962, -104125, -251004, 25225, -134799, 22055, 51661, 465, -188333, -255684, -25610, -264839, 74457, -140732, 2796, -181896, -13458, 44411, -145854]
9706D6464a08859m54815B17894d9650E1851B5630N677b85298a24929l1533N5460
9695a01002b0504k14188C65051j48187b98154A16348d34415H284J51091F8708
9684a02576B1722a68049q5615B03224C9924L3098e6073A25953b58720C06304b9866
9672d4912A92279P5256g009F7448O1604c158l33213C9798h4166j45635A91496
9660a52137j23111G5154c4733j29704A15201b7026E2202i002q7931J2803h792
9648D08208A33963c55632a32331k48666J16795c5205q259A63058c22012A02462
9637c2640A14426d86488J49266G774a64727c7726A8735d77003a07187B23566a89520
9625d34720a18315l3179l8601j5867O7249A702b00630n6209a5452j58049l6863
$$ y = [46464, -108859, -563674, 217894, -49650, 51851, 25630, 31307, -285298, -124929, -156462, -101002, -20504, -234692, 365051, 216864, -298154, 116348, -434415, 8284, 159375, 68708, -102576, 21722, -168049, -253664, 203224, 39924, 73022, -56073, 125953, -258720, 306304, -29866, -44912, 192279, 267535, -7009, 67448, 129052, -3158, -336371, 39798, -84166, -229801, 191496, -152137, -275248, 75154, -34733, -164437, 115201, -27026, 52202, -9002, -96933, -84130, -8792, 408208, 133963, -355632, -132331, -380997, -264202, -35205, -43464, 163058, -322012, 102462, -32640, 114426, -486488, -337222, 7774, -164727, -37726, 18735, -477003, -107187, 223566, -189520, -434720, -118315, -151494, -190095, -205962, -138713, 1702, -200630, -256839, -15452, -173501, -210364]
9614b10364C0495d0079j69522j59056B96559d4569A41222D8494j2799a95680j21173
9603c16853i9424l1306a6411B28578c99270B83955B6177b7678m0466E5638g2903
9591d1040k13667e5870E6144g611m7514b7461C9684c2166j56763N403k34549K05989
9579b12086N9506f8295I3359l2236h6435B58387b96017A92463A6078h3726D25405
9567G5056a97674D3717a18151l74861B44500c6732j59061Q2639Q387e0590D8984
9555e340B16778a01501H6236J6195C092P6360b77324M1518R6858m7440A33657
9543b75586A2164K26785C7347N6352a88183b9863A70619l9799F3712N702g4953
9531e4088j7564K691K5472m0078l5696B24050a31295L6277k7804J5199k25578
$$ y = [-210364, 30495, -40079, -209601, -368657, 296559, -44569, 141222, 48494, 35695, -195680, -316853, -99424, -130730, -16411, 228578, -399270, 283955, 26177, -27678, -68144, 55638, -72903, -41040, -254707, -55870, 56144, -7611, -55125, -27461, 39684, -32166, -188929, -183526, -418075, -212086, -152580, -68295, 93359, 61123, -86435, 258387, -296017, 192463, 16078, -83726, 425405, 75056, -197674, 43717, -118151, -493012, 244500, -36732, -195793, -113154, -104767, -50590, 48984, -5340, 216778, -101501, 86236, 102431, 3092, 79452, -277324, -235806, -138948, -186388, 133657, -275586, 12164, 238949, 37347, 93699, -188183, -29863, 170619, 130820, 63712, 69414, -74953, -54088, -71652, -68961, -43489, -83567, -119263, 224050, -131295, -95018, -122822, -107623, -333201]
9520c33201f5156j90015j7444f1494n5367B23781r4574k4178b97433B77041b18750
9508d7851D91698h763k14954j1815C4591L0793b65075H6967a42451B17275a44376
9496e2840A72425c70933C76784a25957C23502a72924N0528D26814c5532j84585
9486b20117N8512f0466e020j0254j05213A91148g1864j44525j50195K1164R9950
9475b45470D5598J39424f3464q7501j98652A44617j0336A2592J02263e2136l10682
9464c62818g9890r9517h4200C8338f2221j58543I8703q291N2995K1592h9974A21891
9451b78643J32737a6643F6325i1183J2696j11746e6169j36251N5372B09034J4514
9440B23548I8636a40879k0353p9077J5445F5157a61767G3040h2221J1094A2392
$$ y = [-333201, -65156, -255171, -272615, -61494, -116861, 223781, 129207, 105029, -297433, 277041, -218750, -47851, 491698, -8763, -223717, -235532, 34591, 65384, -265075, 86967, -142451, 217275, -144376, -52840, 172425, -370933, 376784, -125957, 323502, -172924, -122396, 426814, -35532, -220117, -161605, -60466, -5020, -15274, -120487, 191148, -71864, -216389, -366584, -345420, -245470, 45598, 185022, -63464, -150965, -349617, 144617, 134281, 12592, 114855, -52136, -362818, -79890, -179407, -84200, 38338, -62221, -220764, 98703, 90412, 143407, 164999, -89974, 121891, -278643, -145906, -16643, 66325, -91183, -78487, -190233, -56169, -192420, -137048, 209034, 223548, 98636, -140879, -161232, -240309, -224864, 65157, -161767, 73040, -82221, -71127, 12392]
9428H7075f1645B8010h3712k73274g2999j15595Q4293B05861d6613j43318h3816
9416a01041k72183c5961A072b26074e6481o7496b5209C9485a25081B50232h1822
9404b09770m2057B04849h6369D9540b46390a13904j29649a13669m11004a05502
9393a44197A82575a18461j56009C66105a47039Q595p7623f3203l0945A68512C0909
9381a5169O766q1397A37961A4803a43020C2428c43518H9027b25226m0469B4047
9369b06340B07510a20357e7460j2759A63725h850A44616o591p701D1478c06162
9357d41588J97687j46054g5700j24776L2932E5b4098G9054A6007J87369e5532
9345c41055P3814J06678c6563j42381C36724b97452d0583E0110J42960e3002B2676
$$ y = [87075, -61645, 28010, -83712, -356986, -72999, -188594, -104301, 205861, -46613, -189931, -83816, -101041, -373224, -35961, 1072, -226074, -56481, -123977, -25209, 39485, -125081, 250232, -81822, -209770, -251827, 204849, -86369, 49540, -246390, -113904, -243553, -113669, -524673, -105502, -144197, 182575, -118461, -274470, 366105, -147039, -138444, -216067, -63203, -94148, 168512, 30909, -15169, -8403, -89800, 137961, 14803, -143020, 32428, -343518, 89027, -225226, -265695, 24047, -206340, 207510, -120357, -57460, -70219, 163725, -8850, 144616, 138025, 130324, 41478, -306162, -441588, -243901, -389955, -75700, -200476, -167544, 55, -24098, 79054, 16007, 203376, -55532, -341055, -267241, -160563, -36563, -178944, 336724, -297452, -40583, 50110, 193070, -53002, 22676]
9333b73426B06926a90965N6328k28797k16074a64149Q0592q2380j76339A22407
9322g9472B42948d6317A99198e88620h2771E2089j8069e12774a06025b6020j78665
9311b04685F7609M4924A4209i1230R253j37475A9658N7512h7174B9202e5148j33405
9299a88553q5266J22843C1720b03670N6155E4480b42589D2426M0841a52910k0029
9288a72939e484j30832G8815i7936k0888B64102c7894o8300F1373J15809o8657
9277A08525C8622K02541d47267H3349a27933N1102K3732k9012G8434i4420A12923
9265i1822m6526l19966b11029e4309A4575D490b33756e0323n3617m8331c6387
9253b74984H9207b20500O2492L9827l96946J31431A5771J13516C3221M5289a16894
$$ y = [-273426, 206926, -190965, -134637, -363434, -579508, -164149, -83557, -165937, -342276, 122407, -79472, 242948, -46317, 199198, -588620, -82771, 52089, 34020, -512774, -106025, -26020, -204685, 67609, 112533, 14209, -91230, -81977, -219452, 19658, 77170, -87174, 29202, -55148, -188553, -273819, -150976, 31720, -203670, -147515, 54480, -242589, 42426, 83267, -152910, -172939, -5484, -136316, 78815, -97936, -118824, 264102, -37894, -106194, 61373, 177182, 108525, 38622, 241163, -447267, 83349, -127933, -76831, -53099, -82111, 78434, -94420, 112923, -91822, -138348, -458314, -211029, -54309, 14575, 4490, -233756, -50323, -103940, -152271, -36387, -274984, 89207, -220500, -158008, -118181, -515127, -383696, 15771, 129287, 33221, 78510, -116894]
9241a10600K5058o3627A32689c2740j73558e9656o1006j77856c6736c033j33792
9230a36825a570A45868e8107B82049j4157a17962j60839b98k15160b1472D3497
9218A18254j6382D4068J67006a68190A85046f8462I7274a36546B60483b07935
9207I1077b69141F6749K47173d2091N642M390A36984a46532M2936o0393A67811
9195b42584E8403b3416A04231b52453C3249b95054J18617K4964J3297A42348i4831
9183A21399R0259a34540G5166a51691m489A0876a45687H6770h888A32810A9580
9171A97986a97894f6053A1790a95132O3985A85602j6082b44747e7454l5307L304
9160h9457J1042D0989e6408B44587b01200b2684k18158J20344B17676j01518C0648
$$ y = [-110600, -85542, -149169, 132689, -32740, -206298, -59656, -120662, -298518, -36736, -3033, -136825, -1570, 145868, -58107, 282049, 267892, -117962, -278801, -298, -215458, -21472, 43497, 118254, 101872, 44068, 211074, -168190, 185046, -68462, 97274, -136546, 260483, -207935, 91077, -269141, 66749, 313922, -42091, -36449, -32059, 136984, -146532, -103596, -163989, 167811, -242584, 58403, -23416, 104231, -252453, 33249, -295054, -176437, -151473, -138176, 142348, -94831, 121399, 211658, -134540, 75166, -151691, -156180, 10876, -145687, 86770, -8888, 132810, 19580, 197986, -197894, -66053, 11790, -195132, -131147, 185602, 169520, -244747, -57454, -92761, -89457, -78415, 40989, -56408, 244587, -201200, -22684, -240842, -120498, 217676, 116158, 30648]
9148H2491a23677A61941E4870M8919Q7809c09827E1862b30284p7999J46518A28513
9136B34227i6080A76390Q5781a97663b2887k2050D2303f1178A002c69467L1172
9125c38295r8716F114K8440d8239A820b83803g5829K9669R959j77928q9075A73473
9112f6421q4086d547A5115c82205i298l93302f1936B28938b52325C06384b79428
9100i7508C7852J8146J88917e55070K66018P840M9884C5346c7446j06499C6041
9088e2671B09561I220J73960b5469A70080o6324b83266M2815f906B6095a66193
9076c0475j38330c6931m24646a56981b686A86364i4408B91359C9846j8651c8451
9064D7668J1836H577h2877l277J3663l01356K8440A1111a86088A18715b39482
$$ y = [82491, -123677, 161941, 54870, 103789, 191598, -309827, 51862, -230284, -308283, -161765, 128513, 234227, -96080, 176390, 262171, -197663, -22887, -44937, 42303, -61178, 1002, -369467, -338295, -437011, 6114, 34554, -48239, 1820, -283803, -75829, -46160, -36201, -214129, -303204, 173473, -66421, -150507, -4547, 15115, -382205, -9298, -402600, -61936, 228938, -252325, 306384, -279428, -97508, 37852, 55998, 244915, -555070, -289052, -281212, -231328, 35346, -37446, -143945, 36041, -52671, 209561, 9220, 183180, -25469, 170080, 103756, -283266, -240451, -6906, 26095, -166193, -30475, -168805, -36931, -461577, -156981, -2686, 186364, -94408, 291359, 39846, 21195, -38451, 47668, 59504, 8577, -82877, -86154, -72491, -373847, -345407, 11111, -186088, 118715, -239482]
9052A1389J61914a16348F0018c73351A07547a18834l37874a02712b4020B46810
9041a0534n8215F4681k3865c27727a9906j10163f465A68436a54127J8066M8256
9030h7805j59118j99509b0464A92534B0141c0571G5838h7251e81j62903B4677
9018a63760M3924g495j82100B19020P5641a12763N3632B56190I2940J45619f792
9006a00930l2182j19679f6237q0454A75603d6888p7816l0634P5475I7565k3254
8995G4311L232a3517p2240F9249a40767I4444J40786b7721B7549g3321J6483j83079
8983b39917F3283a39678d1425k2666n12817b52483p7808B36542b08498h6446l26496
8972d12942B361O1120J60991C5392d30378A00746k9078f8667A36441a63122j2130
$$ y = [11389, 173303, -116348, 60018, -373351, 107547, -118834, -456708, -102712, -24020, 246810, -10534, -68749, 64681, 40816, -327727, -19906, -130069, -6465, 168436, -154127, -136061, -87805, -246923, -446432, -20464, 192534, 20141, -30571, 75838, -87251, -581, -163484, 24677, -163760, -119836, -7495, -189595, 219020, 294661, -112763, -59131, 256190, 92940, 238559, -6792, -100930, -133112, -252791, -66237, -146691, 175603, -46888, -124704, -155338, -79863, 97565, 74311, 77543, -13517, -85757, 69249, -140767, 94444, 235230, -27721, 27549, -73321, -56838, -239917, 63283, -139678, -41425, -64091, -576908, -252483, -330291, 236542, -208498, -86446, -412942, 2361, 63481, 224472, 35392, -430378, 100746, 71668, -68667, 136441, -163122, -175252]
8961a75252l4697R7973c7717k05262I9285a45455l2248O6462A92789f2546R226
8950e3320n2271j78205J6066P3047k3126A43071a78550M8863j07047I0124a2597
8938e7770A99667b39536O9131j50679A72888P145n4582b28079h1203A17022A9781
8926e7703a6223D03735a21055A6429c5948H9880L8946O6495J28368b1559B93006
8914A60293n5786J83852l5069L34802j05362N10868N87753Q80989K300913N361237
8904A0124490m592117B525190j059901l70874l36282C60296j3506L9250j63552
8895B22488a6078C20269r2046A13883L38855H6439C5058a10820k54678a48363
8884a97130O7190j90709J31142N5313B96137d44458a85879D16559A77610a42664
$$ y = [-175252, -209949, -111976, -37717, -242979, 99285, -145455, -177703, -111241, 192789, -62546, -53320, -105591, -283796, -267730, -194683, -217809, 143071, -178550, -129687, -236734, 90124, -12597, -57770, 199667, -239536, -170405, -321084, 172888, 180033, 125451, -228079, -81203, 117022, 19781, -57703, -16223, 403735, -121055, 16429, -35948, 89880, 128826, 195321, 323689, -21559, 293006, 160293, 104507, 288359, 253290, 588092, 482730, 993598, 1581351, 2462340, 4763253, 10124490, 5532373, 2525190, 1465289, 1094415, 758133, 360296, 346790, 386040, 222488, -16078, 320269, 228223, 113883, 452738, 86439, 35058, -110820, -365498, -148363, -197130, -129940, -320649, -189507, -134194, 296137, -444458, -185879, 416559, 177610, -142664]
8873a84641l0979h6085j67287A53833a03026j46953b7942A42553J12701b70563
8862c18470I313P1928a78880a7137j68530A54037a48863C18930d33153B70037
8851b33782A16688B2996K2387J39832F7465g9904k45113g1426A17398J52453b61220
8839a6454A09064e341m36467C31286c7104k4721j16433L8694A27792C8586B597
$$ y = [-184641, -215620, -86085, -253372, 153833, -103026, -249979, -27942, 142553, 255254, -270563, -318470, 9313, 81241, -178880, -17137, -185667, 154037, -148863, 318930, -433153, 270037, -233782, 116688, 22996, 45383, 185215, 67465, -79904, -325017, -71426, 117398, 269851, -261220, -16454, 109064, -5341, -441808, 331286, -37104, -61825, -178258, -139564, 127792, 38586, 2597]
$$ [...]
##END NTUPLES=NMR SPECTRUM
##END=
