
##TITLE=UV1013_M1-1003-1002_6268855_PmTxJxMRLQ
##JCAMPDX= 6.0         $$ Bruker NMR JCAMP-DX V2.0
##DATA TYPE= NMR SPECTRUM
##DATA CLASS= NTUPLES
##ORIGIN= BRUKER
##OWNER= Administrator
$$ 1.72 TOPSPIN		Version 2.1
$$ 2012-06-02 19:05:34.500 -0500  Administrator@TOPSPIN
$$ Compression mode = diff/dup
##.OBSERVE FREQUENCY= 400.13188235
##.OBSERVE NUCLEUS= ^1H
##.ACQUISITION MODE= SIMULTANEOUS (DQD)
##.ACQUISITION SCHEME= undefined
##.AVERAGES= 64
##.DIGITISER RES= 22
##SPECTROMETER/DATA SYSTEM= spect
##.PULSE SEQUENCE= noesygpps1d.comp
##.SOLVENT NAME= COFFEE_meoh
##.SHIFT REFERENCE= INTERNAL, COFFEE_meoh, 1, 14.96719
##AUDIT TRAIL= $$ (NUMBER, WHEN, WHO, WHERE, PROCESS, VERSION, WHAT)
$$ ##TITLE= Audit trail, TOPSPIN		Version 2.1
$$ ##JCAMPDX= 5.01
$$ ##ORIGIN= Bruker BioSpin GmbH
$$ ##OWNER= Administrator
$$ $$ C:\Bruker\TOPSPIN/data/COFFEE/nmr/UV1013_M1-1003-1002_6268855_PmTxJxMRLQ/22/pdata/1/auditp.txt
$$ ##AUDIT TRAIL=  $$ (NUMBER, WHEN, WHO, WHERE, PROCESS, VERSION, WHAT)
(   1,<2012-06-02 19:05:28.671 -0500>,<Administrator>,<TOPSPIN>,<go>,<TOPSPIN 2.1>,
      <created by zg
	started at 2012-06-02 18:53:48.796 -0500,
	POWCHK enabled, PULCHK disabled,
       configuration hash MD5:
       D5 CA 7A 23 FE 6B EE E2 50 67 74 61 24 F7 5E 3B
       data hash MD5: 64K
       32 31 3F E6 62 E0 04 04 80 78 1E 67 BF CA 6F 66>)
(   2,<2012-06-02 19:05:31.546 -0500>,<Administrator>,<TOPSPIN>,<proc1d>,<TOPSPIN 2.1>,
      <Start of raw data processing
       efp LB = 0.3 FT_mod = 6 PKNL = 1 PHC0 = 0 PHC1 = 0 SI = 128K 
       data hash MD5: 128K
       16 00 BC 07 BB E8 49 B3 4E F6 C4 16 5A E6 5E B5>)
(   3,<2012-06-02 19:05:33.640 -0500>,<Administrator>,<TOPSPIN>,<proc1d>,<TOPSPIN 2.1>,
      <pk PHC0 = 36.90308 PHC1 = 0 
       data hash MD5: 128K
       64 4D F9 96 B3 2C 49 04 7E C5 99 18 1E 3A BF B9>)
(   4,<2012-06-02 19:05:33.921 -0500>,<Administrator>,<TOPSPIN>,<proc1d>,<TOPSPIN 2.1>,
      <abs ABSG = 1 
       data hash MD5: 128K
       CD 53 E5 44 77 64 D0 C5 2F 09 08 1E C2 D5 24 EE>)
(   5,<2012-06-02 19:05:34.015 -0500>,<Administrator>,<TOPSPIN>,<proc1d>,<TOPSPIN 2.1>,
      <abs ABSG = 2 
       data hash MD5: 128K
       E8 15 25 7C 7E BB D0 ED 1C D0 EC 46 9A 70 29 E1>)
(   6,<2012-06-02 19:05:34.078 -0500>,<Administrator>,<TOPSPIN>,<proc1d>,<TOPSPIN 2.1>,
      <abs ABSG = 3 
       data hash MD5: 128K
       4F 3B 7C 2C BE 17 54 C6 60 8A 50 FD 8E A3 D8 C2>)
(   7,<2012-06-02 19:05:34.140 -0500>,<Administrator>,<TOPSPIN>,<proc1d>,<TOPSPIN 2.1>,
      <abs ABSG = 4 
       data hash MD5: 128K
       FD DA 80 FA ED 74 BC 9E 18 75 A0 74 A6 F7 BD 67>)
(   8,<2012-06-02 19:05:34.390 -0500>,<Administrator>,<TOPSPIN>,<proc1d>,<TOPSPIN 2.1>,
      <abs ABSG = 5 
       data hash MD5: 128K
       63 F6 98 AD 0A 24 CD 67 0F DC 72 98 58 5D A4 00>)
$$ ##END=
$$ 
$$ $$ hash MD5
$$ $$ 47 BE D1 B7 0D 18 19 83 D4 A8 4F 4F 44 3F C5 19
##$RELAX= 
##$RELAX= 
##$RELAX= 
##$RELAX= 
##$RELAX= 
##$RELAX= 
##$RELAX= 
##$RELAX= 
$$ Bruker specific parameters
$$ [...]
##$TP07= 0
##$TPNAME0= <>
##$TPNAME1= <>
##$TPNAME2= <>
##$TPNAME3= <>
##$TPNAME4= <>
##$TPNAME5= <>
##$TPNAME6= <>
##$TPNAME7= <>
##$TPOAL= (0..7)
0.5 0.5 0.5 0.5 0.5 0.5 0.5 0.5
##$TPOFFS= (0..7)
0 0 0 0 0 0 0 0
##$TUNHIN= 0
##$TUNHOUT= 0
##$TUNXOUT= 0
##$USERA1= <user>
##$USERA2= <user>
##$USERA3= <user>
##$USERA4= <user>
##$USERA5= <user>
##$V9= 5
##$VALIST= <valist>
##$VCLIST= <CCCCCCCCCCCCCCC>
##$VD= 0
##$VDLIST= <DDDDDDDDDDDDDDD>
##$VPLIST= <PPPPPPPPPPPPPPP>
##$VTLIST= <TTTTTTTTTTTTTTT>
##$WBST= 2048
##$WBSW= 25
##$XGAIN= (0..3)
0 0 0 0
##$XL= 0
##$YL= 0
##$YMAX_a= 11966469
##$YMIN_a= -6264000
##$ZGOPTNS= <>
##$ZL1= 120
##$ZL2= 120
##$ZL3= 120
##$ZL4= 120
##$ABSF1= 14.96719
##$ABSF2= -5.58534
##$ABSG= 5
##$ABSL= 3
##$ALPHA= 0
##$AQORDER= 0
##$ASSFAC= 0
##$ASSFACI= 0
##$ASSFACX= 0
##$ASSWID= 0
##$AUNMP= <proc_prof1d_extract.lims>
##$AXLEFT= 0
##$AXNAME= <>
##$AXNUC= <1H>
##$AXRIGHT= 0
##$AXTYPE= 0
##$AXUNIT= <>
##$AZFE= 0.1
##$AZFW= 0.1
##$BCFW= 0
##$BC_mod= 0
##$BYTORDP= 0
##$COROFFS= 0
##$CY= 15
##$DATMOD= 1
##$DC= 0
##$DFILT= <>
##$DTYPP= 0
##$F1P= 0
##$F2P= 0
##$FCOR= 0.5
##$FTSIZE= 131072
##$FT_mod= 6
##$GAMMA= 0
##$GB= 0
##$INTBC= 1
##$INTSCL= 1
##$ISEN= 128
##$LB= 0.3
##$LEV0= 0
##$LPBIN= 0
##$MAXI= 10000
##$MC2= 0
##$MEAN= 0
##$ME_mod= 0
##$MI= 0
##$NCOEF= 0
##$NC_proc= -3
##$NLEV= 6
##$NOISF1= 0
##$NOISF2= 0
##$NSP= 0
##$NTH_PI= 0
##$NZP= 0
##$OFFSET= 14.96719
##$PC= 1
##$PHC0= 36.90308
##$PHC1= 0
##$PH_mod= 1
##$PKNL= yes
##$PPARMOD= 0
##$PPDIAG= 0
##$PPIPTYP= 0
##$PPMPNUM= 2147483647
##$PPRESOL= 1
##$PSCAL= 4
##$PSIGN= 0
##$PYNMP= <proc.py>
##$REVERSE= no
##$SF= 400.13000536944
##$SI= 131072
##$SIGF1= 0
##$SIGF2= 0
##$SINO= 400
##$SIOLD= 131072
##$SPECTYP= <>
##$SREGLST= <1H.CDCl3>
##$SSB= 0
##$STSI= 131072
##$STSR= 0
##$SW_p= 8223.68421052632
##$SYMM= 0
##$S_DEV= 0
##$TDeff= 65536
##$TDoff= 0
##$TI= <>
##$TILT= no
##$TM1= 0
##$TM2= 0
##$TOPLEV= 0
##$USERP1= <user>
##$USERP2= <user>
##$USERP3= <user>
##$USERP4= <user>
##$USERP5= <user>
##$WDW= 1
##$XDIM= 131072
##$YMAX_p= 508729282
##$YMIN_p= -256560349
##$CURPLOT= <Network HP LaserJet P1505>
##$CURPRIN= <$Network HP LaserJet P1505>
##$DFORMAT= <normdp>
##$LAYOUT= <+/1D_H.xwp>
##$LFORMAT= <normlp>
##$PFORMAT= <normpl>
##$SURQMSG= 1
$$ End of Bruker specific parameters
$$ ---------------------------------
##NTUPLES= NMR SPECTRUM
##VAR_NAME=  FREQUENCY,     SPECTRUM/REAL,   SPECTRUM/IMAG
##SYMBOL=    X,             R,               I
##VAR_TYPE=  INDEPENDENT,   DEPENDENT,       DEPENDENT
##VAR_FORM=  AFFN,          ASDF,            ASDF
##VAR_DIM=   131072,        131072,          131072
##UNITS=     HZ,            ARBITRARY UNITS, ARBITRARY UNITS
##FACTOR=    0.0627417313425165, 1,          1
##FIRST=     8223.62146879498, 1588,         -118974
##LAST=      0,             5572,            -118889
##MIN=       0,             -256560349,      0
##MAX=       8223.62146879498, 508729282,    0
$$ Real data points
##PAGE= N=1
##DATA TABLE= (X++(R..R)), XYDATA
$$ [...]
63466A610479l5902l8615m0515m2092m3250m3362m2348m1287m1203m1408l9975
$$ 1610479 1574577 1535962 1495447 1453355 1410105 1366743 1324395 1283108 1241905 1200497 1160522
63455A160522l6187l1556k7719k4319k0276j6327j4500j4982j5441j4089j1876
$$ 1160522 1124335 1092779 1065060 1040741 1020465 1004138 989638 974656 959215 945126 933250
63444I33250j0602j0270r698q706p958p175n391k987j712k182k866k384j597k247
$$ 933250 922648 912378 902680 893974 886016 878841 873450 870463 868751 866569 863703 861319 859722 857475
63430H57475m242n545m577j865Q31K327K777K980L257L162K363J549J781K961
$$ 857475 853233 847688 843111 841246 842077 844404 847181 850161 853418 856580 858943 860492 862273 865234
63416H65234L673K925J353J38n50j287k189k975l867n253o492o243m300k129j206
$$ 865234 868907 871832 873185 873323 872773 871486 869297 866322 862455 857202 850710 844467 840167 838038 836832
63401H36832j496k045k187j751p14P46K245L746N618P856R868J1388J2880J4482
$$ 836832 835336 833291 831104 829353 828639 829385 831630 835376 840994 848850 858718 870106 882986 897468
63387H97468J5475J5610J6019J7651J9482J9814J9041J9516K2580K7116L1391
$$ 897468 912943 928553 944572 962223 981705 1001519 1020560 1040076 1062656 1089772 1121163
63376A121163L4913L7864L9888M0323L8963L5962L1804K7816K5785K6167K7512
$$ 1121163 1156076 1193940 1233828 1274151 1313114 1349076 1380880 1408696 1434481 1460648 1488160
63365A488160K8488K9665L2259L5877L9028M1499M4562M8576N1783N2123M9237
$$ 1488160 1516648 1546313 1578572 1614449 1653477 1694976 1739538 1788114 1839897 1892020 1941257
63354A941257M3968L6807K7846J7858Q302J13o847j2767j6948j8481j7807j6978
$$ 1941257 1985225 2022032 2049878 2067736 2076038 2076151 2069304 2056537 2039589 2021108 2003301 1986323
63342A986323j8023k1291k5693l0246l4698l8844m2058m3941m4835m5190m4891
$$ 1986323 1968300 1947009 1921316 1891070 1856372 1817528 1775470 1731529 1686694 1641504 1596613
63331A596613m3658m1730l9526l6887l3301k8759k3894j9374j5597j2724j0406
$$ 1596613 1552955 1511225 1471699 1434812 1401511 1372752 1348858 1329484 1313887 1301163 1290757
63320A290757p695l927L17L877O638R663J3440J6884J8649J8857J8773J9168J9896
$$ 1290757 1283062 1279135 1279452 1283329 1289967 1299630 1313070 1329954 1348603 1367460 1386233 1405401 1425297
63307A425297K1093K3789K8574L4118L8048L9539M0325M2460M5699M8024M8454
$$ 1425297 1446390 1470179 1498753 1532871 1570919 1610458 1650783 1693243 1738942 1786966 1835420
63296A835420M7894M6921M4312L8866L1466K3804J5809O268m105j2285j6292j7455
$$ 1835420 1883314 1930235 1974547 2013413 2044879 2068683 2084492 2090760 2086655 2074370 2058078 2040623
63284B040623j8371j9919k1535k3356k6351l0481l4267l6670l8430m0900m4200
$$ 2040623 2022252 2002333 1980798 1957442 1931091 1900610 1866343 1829673 1791243 1750343 1706143
63273A706143m7037m8108m7181m4910m1985l8592l4583l0038k5663k2349k0203
$$ 1706143 1659106 1610998 1563817 1518907 1476922 1438330 1403747 1373709 1348046 1325697 1305494
63262A305494j8210j5350j2176j0768j2641j6871k0883k3014k3693k4131k4618
$$ 1305494 1287284 1271934 1259758 1248990 1236349 1219478 1198595 1175581 1151888 1127757 1103139
63251A103139k4506k3142k0342j6434j2511j0086r717j0190r788q176o432n485
$$ 1103139 1078633 1055491 1035149 1018715 1006204 996118 986401 976211 966423 958247 951815 946330
63239I46330n269n354n540n719n758n770o116p100q740j0582j1582j0781q628
$$ 946330 941061 935707 930167 924448 918690 912920 906804 899704 890964 880382 868800 858019 849391
63226H49391o944o823p302p042o444o706p460p245n940m846m263l059j042L63
$$ 849391 842447 835624 828322 821280 814836 808130 800670 793425 787485 782639 778376 775317 774275 774638
63212G74638M94N03J082J118o8j028m42N96M45j88N35K422L595L509L431L996
$$ 774638 775132 775635 776717 777835 777767 776739 776297 776893 777338 777150 777685 780107 783702 787211 790642 794638
63196G94638M508M880O152Q442J0044R590P995P384Q769J1307J3367J4002J3859
$$ 794638 799146 804026 810178 818620 828664 838254 846249 853633 862402 873709 887076 901078 914937
63183I14937J4606J7004J9875K1746K3022K5231K8452L1149L2651L4102L6346
$$ 914937 929543 946547 966422 988168 1011190 1036421 1064873 1096022 1128673 1162775 1199121
63172A199121L8512L9502L9564L9446L9101L8331L7726L7822L8025L7472L6319
$$ 1199121 1237633 1277135 1316699 1356145 1395246 1433577 1471303 1509125 1547150 1584622 1620941
63161A620941L5159L3773L1674K9492K8482K8750K9059K8433K6935K4694K1190
$$ 1620941 1656100 1689873 1721547 1751039 1779521 1808271 1837330 1865763 1892698 1917392 1938582
63150A938582J5984R474K586l941r769j4933j9889k5133l0564l5358l8616l9795
$$ 1938582 1954566 1964040 1966626 1962685 1952916 1937983 1918094 1892961 1862397 1827039 1788423 1748628
63138A748628l8703l5715l2062k9163k7257k5216k2197j8835j6130j3653j0009
$$ 1748628 1709925 1674210 1642148 1612985 1585728 1560512 1538315 1519480 1503350 1489697 1479688
63127A479688m985o2L566O453R639J2774J4587J4845J4732J5259J6310J7419J8461
$$ 1479688 1474703 1474641 1478207 1484660 1494299 1507073 1521660 1536505 1551237 1566496 1582806 1600225 1618686
63114A618686J9253J9416J9140J9213J9523J8488J5004J0337O767M615K048k070
$$ 1618686 1637939 1657355 1676495 1695708 1715231 1733719 1748723 1759060 1765827 1770442 1772490 1770420
63102A770420o594j0044j2884j6773k2048k7241l1039l3690l6055l8069l8870
$$ 1770420 1763826 1753782 1740898 1724125 1702077 1674836 1643797 1610107 1574052 1535983 1497113
63091A497113l8163l6620l4716l1971k8008k3884k1332k0595j9976j7993j5204
$$ 1497113 1458950 1422330 1387614 1355643 1327635 1303751 1282419 1261824 1241848 1223855 1208651
63080A208651j3170j2184j1048q903o299m289l112k142p63J025K666L649M106
$$ 1208651 1195481 1183297 1172249 1163346 1157047 1152758 1149646 1147504 1146741 1147766 1150432 1154081 1158187
63067A158187M726O020P844R786J1597J2916J3103J1925J0122Q662P699O799N943
$$ 1158187 1162913 1168933 1176777 1186563 1198160 1211076 1224179 1236104 1246226 1254888 1262587 1269386 1275329
63054A275329N481N310M823L812K749K110J891J808J572J110Q32J304K138J900
$$ 1275329 1280810 1286120 1290943 1294755 1297504 1299614 1301505 1303313 1304885 1305995 1306827 1308131 1310269 1312169
63040A312169j9k040k171p10K81O5J38J786M297O207P066P149O602N614M750M464
$$ 1312169 1312150 1310110 1307939 1307229 1307510 1307575 1307713 1309499 1313796 1320003 1327069 1334218 1340820 1346434 1351184 1355648
63024A355648M873O121P942Q889P586N199M810P453J0595J1771J1862J2975J4786
$$ 1355648 1360521 1366642 1374584 1383473 1391059 1396258 1401068 1408521 1419116 1430887 1442749 1455724 1470510
63011A470510J5525J5486J6713J9503K1886K2934K4142K6842L0310L3551L7076
$$ 1470510 1486035 1501521 1518234 1537737 1559623 1582557 1606699 1633541 1663851 1697402 1734478
63000A734478M1581M6247M9835N2573N5603N9129O2476O5609O9344P4010P8897
$$ 1734478 1776059 1822306 1872141 1924714 1980317 2039446 2101922 2167531 2236875 2310885 2389782
62989B389782Q3177Q6653Q9356R0954R0973Q9352Q6683Q3887Q1698Q0194P8858
$$ 2389782 2472959 2559612 2648968 2739922 2830895 2920247 3006930 3090817 3172515 3252709 3331567
62978C331567P7148P4965P2477O9644O6238O2355N8487N4678M9853M2585L2704
$$ 3331567 3408715 3483680 3556157 3625801 3692039 3754394 3812881 3867559 3917412 3959997 3992701
62967C992701K1519R956k935j8597l6422n3550o7457p7701q5075r0235r3754r6178
$$ 3992701 4014220 4024176 4021241 4002644 3966222 3912672 3845215 3767514 3682439 3592204 3498450 3402272
62955C402272r7002r4709q9071q2487p7426p3147o6692n7002m6293l7189k9962
$$ 3402272 3305270 3210561 3121490 3039003 2961577 2888430 2821738 2764736 2718443 2681254 2651292
62944B651292k3170j5682p528L48O705J1164J4883J9096K3076K5042K5241K6217
$$ 2651292 2628122 2612440 2604912 2605260 2611965 2623129 2638012 2657108 2680184 2705226 2730467 2756684
62932B756684K9196L1996L1918K9313K6504K4298K1572J7751J3647R657M956j013
$$ 2756684 2785880 2817876 2849794 2879107 2905611 2929909 2951481 2969232 2982879 2992536 2997492 2996479
62920B996479p533j3887k0672k9068l9159m9520n8271o4353o8025p0302p1818
$$ 2996479 2988946 2975059 2954387 2925319 2886160 2836640 2778369 2714016 2645991 2575689 2503871
62909B503871p2389p1768p0410o8962o7384o5148o2190n8995n5927n3110n0817
$$ 2503871 2431482 2359714 2289304 2220342 2152958 2087810 2025620 1966625 1910698 1857588 1806771
62898A806771m9190m7603m5166m2069l9706l9027l9172l8262l5381l1588k8832
$$ 1806771 1757581 1709978 1664812 1622743 1583037 1544010 1504838 1466576 1431195 1399607 1370775
62887A370775k7869k7417k5877k3627k2492k2611k1511j7626j3291j2031j3502
$$ 1370775 1342906 1315489 1289612 1265985 1243493 1220882 1199371 1181745 1168454 1156423 1142921
62876A142921j3858j1313q573q589j0387j1001r758q327p544o630n211l996l270
$$ 1142921 1129063 1117750 1109177 1100588 1090201 1079200 1069442 1061115 1053571 1046941 1041730 1037734 1034464
62863A034464k388j232q25k006m373o765q121p824o140m322l458l308l089l013
$$ 1034464 1032076 1030844 1030019 1028013 1023640 1016875 1008754 1000930 994790 990468 987010 983702 980613 977600
62849I77600l814m964n008l865l192l870m734m544l748l254k813j839p93k66M37
$$ 977600 973786 968822 963814 959949 956757 952887 948153 943609 939861 936607 933794 931955 931162 930896 931333
62834I31333K331M783O020N389L896K655J956J794K104K358J899Q75l7q41k152
$$ 931333 933664 938447 944467 949856 953752 956407 958363 960157 962261 964619 966518 967393 967356 966515 964363
62819I64363l812m628l886k336j289j385k472m015n204n428m963m724m983m973
$$ 964363 960551 955923 952037 949701 948412 947027 944555 940540 935336 929908 924945 920221 915238 910265
62805I10265m023k489j140k42K50O1j052k554l277k546r18L06L77j55j15Q67J961
$$ 910265 906242 903753 902613 902371 902621 902682 901630 899076 895799 893253 892335 892641 893018 892863 892748 893615 895576
62788H95576K400K438K486K031M80j369k095j756j754k431k486j323l03n53j002
$$ 895576 897976 900414 902900 904931 905411 904042 901947 900191 898437 896006 893520 892197 891894 891341 890339
62773H90339j1K034L406L578L525L842M147M323M851N729O264O190O013O071O220
$$ 890339 890328 892362 895768 899346 902871 906713 910860 915183 920034 925763 932027 938217 944230 950301 956521
62758I56521O647P814R330R917R154Q336Q928J0789J2601J3501J3643J3513J3433
$$ 956521 963168 970982 980312 990229 999383 1007719 1016647 1027436 1040037 1053538 1067181 1080694 1094127
62745A094127J3585J4037J4740J5711J7101J8902K0826K2666K4508K6427K8311
$$ 1094127 1107712 1121749 1136489 1152200 1169301 1188203 1209029 1231695 1256203 1282630 1310941
62734A310941L0116L1989L3987L6063L8556M2175M7227N3179N9344O5587P1970
$$ 1310941 1341057 1373046 1407033 1443096 1481652 1523827 1571054 1624233 1683577 1749164 1821134
62723A821134P8133Q3589Q8480R3598R9634J06629J13801J19644J22611J22354
$$ 1821134 1899267 1982856 2071336 2164934 2264568 2371197 2484998 2604642 2727253 2849607
62713B849607J20076J17155J13523J07928R9478Q8241P4390N7702L8241J6947
$$ 2849607 2969683 3086838 3200361 3308289 3407767 3496008 3570398 3628100 3666341 3683288
62703C683288m786k5643m4425o0355p3842q6187r7861j07486j13388j15686j16150
$$ 3683288 3678502 3652859 3608434 3548079 3474237 3388050 3290189 3182703 3069315 2953629 2837479
62692B837479j16150j15820j14896j13105j09504j02971r4229q6227q1134p7689
$$ 2837479 2721329 2605509 2490613 2377508 2268004 2165033 2070804 1984577 1903443 1825754
62682A825754p2806o5599n8356n3430n0485m7446m3198l8471l4645l2266l0612
$$ 1825754 1752948 1687349 1628993 1575563 1525078 1477632 1434434 1395963 1361318 1329052 1298440
62671A298440k8339k4823k0929j7997j6033j3754j0628p799o228m917k187J834
$$ 1298440 1270101 1245278 1224349 1206352 1190319 1176565 1165937 1158138 1151910 1146993 1144806 1146640
62659A146640N326P201Q145R193J0452J1702J3233J5507J8525K1967K5489K8616
$$ 1146640 1151966 1159167 1167312 1176505 1186957 1198659 1211892 1227399 1245924 1267891 1293380 1321996
62647A321996L0968L3011L5907M0173M4928M9033N2475N6009N9858O3582O6999
$$ 1321996 1352964 1385975 1421882 1462055 1506983 1556016 1608491 1664500 1724358 1787940 1854939
62636A854939P0445P4015P7196P9402Q0384P9894P7433P2663O5760N7050M6527
$$ 1854939 1925384 1999399 2076595 2155997 2236381 2316275 2393708 2466371 2532131 2589181 2635708
62625B635708L4048K0038N669p735j9574l0279m0808n1706o2504p1993p9025q3079
$$ 2635708 2669756 2689794 2695463 2687728 2668154 2637875 2597067 2545361 2482857 2410864 2331839 2248760
62613B248760q4269q3252q1123p8977p7135p4936p1632o7341o2864n8654n4514
$$ 2248760 2164491 2081239 2000116 1921139 1844004 1769068 1697436 1630095 1567231 1508577 1454063
62602A454063n0328m6441m3096l9957l6677l3490l0806k8497k6125k3627k1262
$$ 1454063 1403735 1357294 1314198 1274241 1237564 1204074 1173268 1144771 1118646 1095019 1073757
62591A073757j9179j7664j7426j8633j9752j8614j5006j1130q909p849o408m433
$$ 1073757 1054578 1036914 1019488 1000855 981103 962489 947483 936353 927444 919595 913187 908754
62579I08754l037k611k407k021j923k221k050q71M09M42q42k199k685k623k806
$$ 908754 905717 903106 900699 898678 896755 894534 892484 891613 892022 892464 891622 889423 886738 884115 881309
62564H81309l084k276L86L930O235O183M988N094P679J1443J3771J3129J0460
$$ 881309 878225 875949 876335 880265 886500 892683 897671 902765 910444 921887 935658 948787 959247
62551I59247Q290Q336J0026J1616J2471J3553J5730J8608K1501K4544K8085L1684
$$ 959247 967537 975873 985899 997515 1009986 1023539 1039269 1057877 1079378 1103922 1132007 1163691
62539A163691L4687L7192L9451M1025M1770M3167M6962N2432N6668N7996N7685
$$ 1163691 1198378 1235570 1275021 1316046 1357816 1400983 1447945 1500377 1557045 1615041 1672726
62528A672726N7532N7076N4312M8300L9985L0868K1831J3042M160n346j5561k5735
$$ 1672726 1730258 1787334 1841646 1889946 1929931 1960799 1982630 1995672 1999832 1994486 1978925 1953190
62516A953190l4779m1956m7027n0135n1895n3153n4224n4523n3274n0457m6942
$$ 1953190 1918411 1876455 1829428 1779293 1727398 1674245 1620021 1565498 1512224 1461767 1414825
62505A414825m3873m1895m0625l8894l5918l2176k8622k5309k1664j8001j5527
$$ 1414825 1370952 1329057 1288432 1249538 1213620 1181444 1152822 1127513 1105849 1087848 1072321
62494A072321j4524j3813j2633j1756j1903j2111j0967q574o174m332k850j856
$$ 1072321 1057797 1043984 1031351 1019595 1007692 995581 984614 976040 969866 965534 962684 960828
62482I60828j617j450k48J819L286L236K211J181P00J239L286O537R623J1199
$$ 960828 959211 957761 957513 959332 962618 965854 968065 969246 969946 971185 974471 981008 990631 1001830
62468A001830J1070J0222J0159J2035J5718J9750K2814K5145K7835L1058L4078
$$ 1001830 1012900 1023122 1033281 1045316 1061034 1080784 1103598 1128743 1156578 1187636 1221714
62457A221714L6780L9828M3150M5766M7572M9959N3805N8078O1304O3353O4632
$$ 1221714 1258494 1298322 1341472 1387238 1434810 1484769 1538574 1596652 1657956 1721309 1785941
62446A785941O4511O1998N7501N2495M7676M2661L7442L2796K9082K5741K2511
$$ 1785941 1850452 1912450 1969951 2022446 2070122 2112783 2150225 2183021 2212103 2237844 2260355
62435B260355K0252K0090K2133K5471K9042L2444L6192M1180M7468N3760N8638
$$ 2260355 2280607 2300697 2322830 2348301 2377343 2409787 2445979 2487159 2534627 2588387 2647025
62424B647025O2056O4780O6397O5065N9556N0552L9507K7261J4373J564j1305
$$ 2647025 2709081 2773861 2840258 2905323 2964879 3015431 3054938 3082199 3096572 3098136 3086831
62413C086831k5792m2916o0884p6219q7112r4508r9937j03707j05629j06076j05365
$$ 3086831 3061039 3018123 2957239 2881020 2793908 2699400 2599463 2495756 2390127 2284051 2178686
62402B178686j02922r8062r1123q3174p5047o7319o0667n5280n0269m4584l8395
$$ 2178686 2075764 1977702 1886579 1803405 1728358 1661039 1600372 1545092 1494823 1450239 1411844
62391A411844l2776k8067k3608j9083j5223j2697j1096r477p485n391l438j592
$$ 1411844 1379068 1351001 1327393 1308310 1293087 1280390 1269294 1259817 1252332 1246941 1243503 1241911
62379A241911J70J678K685L030K804K318J618Q8k886o747r889j1295j1554j1762
$$ 1241911 1242081 1243759 1246444 1249474 1252278 1254596 1256214 1256302 1253416 1246669 1236780 1225485 1213931 1202169
62365A202169j1983j1635j0922j0843j1485j1490r908p917p688r664j1958j2668
$$ 1202169 1190186 1178551 1167629 1156786 1145301 1133811 1123903 1115986 1108298 1098634 1086676 1074008
62353A074008j1904j0888r884q200n915m257l823l698k994k244k145j864j21K436
$$ 1074008 1062104 1051216 1041332 1033132 1027217 1022960 1019137 1015439 1012445 1010201 1008056 1006192 1006071 1008507
62339A008507L759L502L881O559J0053J1486J0090P727O452O739Q011R656J1271
$$ 1008507 1012266 1015768 1019649 1026208 1036261 1047747 1057837 1065564 1072016 1078755 1086766 1096422 1107693
62326A107693J2683J4104J5822J7605J8807J9219J9383J9947K0991K2167K3176
$$ 1107693 1120376 1134480 1150302 1167907 1186714 1205933 1225316 1245263 1266254 1288421 1311597
62315A311597K3931K4509K5128K6142K7779K9824L1668L2928L4160L6700M1372
$$ 1311597 1335528 1360037 1385165 1411307 1439086 1468910 1500578 1533506 1567666 1604366 1645738
62304A645738M7419N3116N7462O0861O4162O7752P1742P6283Q1105Q5115Q7051
$$ 1645738 1693157 1746273 1803735 1864596 1928758 1996510 2068252 2144535 2225640 2310755 2397806
62293B397806Q6320Q2930P7042O9017N9372M8211L5157K0522O030o348j6043k3820
$$ 2397806 2484126 2567056 2644098 2713115 2772487 2820698 2855855 2876377 2882407 2876059 2860016 2836196
62281B836196l0484l6535m2611m9115n5237n9409o1065o1274o1365o1583o1248
$$ 2836196 2805712 2769177 2726566 2677451 2622214 2562805 2501740 2440466 2379101 2317518 2256270
62270B256270n9666n6603n2422m8088m4603m2354m1263m1418m2734m4061m3684
$$ 2256270 2196604 2140001 2087579 2039491 1994888 1952534 1911271 1869853 1827119 1783058 1739374
62259A739374m1253l8421l6944l6607l5718l3190k9523k5916k3106k1077j9341
$$ 1739374 1698121 1659700 1622756 1586149 1550431 1517241 1487718 1461802 1438696 1417619 1398278
62248A398278j7254j4381j0851p478n283m588m490l541j190J745M251O231Q006
$$ 1398278 1381024 1366643 1355792 1348314 1343031 1338443 1333953 1330412 1329222 1330967 1335218 1341449 1349455
62235A349455R347R918J0170J0698J1006J0247R103R250J0584J0878R107P430
$$ 1349455 1358802 1368720 1378890 1389588 1400594 1410841 1419944 1429194 1439778 1450656 1459763 1467193
62223A467193Q273J0740J1818J0416Q275P201P446Q907J1833J5531J8059J8346
$$ 1467193 1475466 1486206 1498024 1508440 1516715 1523916 1531362 1540269 1552102 1567633 1585692 1604038
62211A604038J7634J7916J9828K2911K6933L1678L6176L9585M2578M6631N2004
$$ 1604038 1621672 1639588 1659416 1682327 1709260 1740938 1777114 1816699 1859277 1905908 1957912
62200A957912N7600O2837O8265P3961P8626Q1199Q2447Q3702Q4471Q2521P6384
$$ 1957912 2015512 2078349 2146614 2220575 2299201 2380400 2462847 2546549 2631020 2713541 2789925
62189B789925O6817N5558M3600L1114J8343N701o781j9348l1827m3445n3419o1468
$$ 2789925 2856742 2912300 2955900 2987014 3005357 3011058 3004277 2984929 2953102 2909657 2856238 2794770
62177B794770o7738p2538p6162p8644p9669p9004p6992p4273p1040o6947o1885
$$ 2794770 2727032 2654494 2578332 2499688 2420019 2341015 2264023 2189750 2118710 2051763 1989878
62166A989878n6342n0750m5083l9455l4667l1433k9295k7051k4304k1900k0593
$$ 1989878 1933536 1882786 1837703 1798248 1763581 1732148 1702853 1675802 1651498 1629598 1609005
62155A609005j9930j8797j6647j3793j0826q240o350n103m053k824j459j1J846
$$ 1609005 1589075 1570278 1553631 1539838 1529012 1520772 1514422 1509319 1505266 1502442 1500983 1500972 1502818
62142A502818M267O595P983Q588R361J0611J1673J2189J2766J3792J4557J4338
$$ 1502818 1507085 1513680 1521663 1530251 1539612 1550223 1561896 1574085 1586851 1600643 1615200 1629538
62130A629538J3670J3672J4545J5714J6995J8638K0488K2138K3546K4417K3476
$$ 1629538 1643208 1656880 1671425 1687139 1704134 1722772 1743260 1765398 1788944 1813361 1836837
62119A836837K0031J6112J5067J7454K0294K1285K1872K4589K9155L3431L7054
$$ 1836837 1856868 1872980 1888047 1905501 1925795 1947080 1968952 1993541 2022696 2056127 2093181
62108B093181M1522M6948N1409N4032N6312N9288O1329O0262N6248N0786M3813
$$ 2093181 2134703 2181651 2233060 2287092 2343404 2402692 2464021 2524283 2580531 2631317 2675130
62097B675130L3972K1701J0020J391n030j1932k0410k9044l6133m1537m6003m9686
$$ 2675130 2709102 2730803 2740823 2742214 2737184 2725252 2704842 2675798 2639665 2598128 2552125 2502439
62085B502439n2278n3985n5359n6210n5630n3348n0183m6814m3046l8794l4944
$$ 2502439 2450161 2396176 2340817 2284607 2228977 2175629 2125446 2078632 2035586 1996792 1961848
62074A961848l2318l0400k8024k5011k2218k0293j9199j8703j8405j7606j6114
$$ 1961848 1929530 1899130 1871106 1846095 1823877 1803584 1784385 1765682 1747277 1729671 1713557
62063A713557j4980j5233j5931j4741j0713n366p43K468M591N969P000Q162R109
$$ 1713557 1698577 1683344 1667413 1652672 1641959 1636593 1635850 1638318 1642909 1648878 1655878 1664040 1673149
62050A673149Q503N536J147k874n476o619o726o460o505o898p033o800p026q240
$$ 1673149 1681652 1687188 1688335 1685461 1679985 1673366 1666640 1660180 1653675 1646777 1639744 1632944 1625918 1617678
62036A617678r646j0038r096p190m666k091l29N86J940M605P515R206J0219J2281
$$ 1617678 1608032 1597994 1588898 1581708 1577042 1574951 1574622 1575208 1577148 1581753 1589268 1598474 1608693 1620974
62022A620974J5413J7772J8557J9272K1382K4276K6540K8062K9718L1777L3757
$$ 1620974 1636387 1654159 1672716 1691988 1713370 1737646 1764186 1792248 1821966 1853743 1887500
62011A887500L5341L6490L7061L7177L7546L8470L9004L8173L6822L6790L8016
$$ 1887500 1922841 1959331 1996392 2033569 2071115 2109585 2148589 2186762 2223584 2260374 2298390
62000B298390L7775L3565K5875J7298R584K637m176j1046j8166k5916l4006m1255
$$ 2298390 2336165 2369730 2395605 2412903 2422487 2425124 2420948 2409902 2391736 2365820 2331814 2290559
61988B290559m6881n1465n5930o0024o2687o3632o3703o3486o2435n9761n5688
$$ 2290559 2243678 2192213 2136283 2076259 2013572 1949940 1886237 1822751 1760316 1700555 1644867
61977A644867n1395m7872m5103m2254l8593l4302l0357k7435k5231k3055k0801
$$ 1644867 1593472 1545600 1500497 1458243 1419650 1385348 1354991 1327556 1302325 1279270 1258469
61966A258469j8821j7164j5745j5083j5771j7069j7076j4945j2177j0937j1580
$$ 1258469 1239648 1222484 1206739 1191656 1175885 1158816 1141740 1126795 1114618 1103681 1092101
61955A092101j2560j2455j1398j0394r786q735o319l083r39r92j836j018J882
$$ 1092101 1079541 1067086 1055688 1045294 1035508 1026773 1020454 1017371 1016432 1015440 1013604 1012586 1014468
61942A014468M748N703N111M315L687K919K128J428J69k053m171m746m101m099
$$ 1014468 1019216 1024919 1030030 1034345 1038032 1040951 1043079 1044507 1044676 1042623 1038452 1033706 1029605 1025506
61928A025506n814q451j0657j1904j2519j3036j3654j3845j2718j0278p877o756
$$ 1025506 1019692 1011241 1000584 988680 976161 963125 949471 935626 922908 912630 904753 897997
61916H97997o668o788p150p912p963o141l554k687l863m531k787J25J788J737
$$ 897997 891329 884541 877391 869479 861516 855375 851821 849134 845271 840740 837953 838078 839866 841603
61902H41603J376J880L312N088O251N957M633M053N377P657R191R757J0439J1797
$$ 841603 842979 844859 848171 853259 859510 865467 870100 874153 879530 887187 896378 906135 916574 928371
61888I28371J3291J4401J5278J6357J8106K1020K5015K8905L1248L1824L1637
$$ 928371 941662 956063 971341 987698 1005804 1026824 1051839 1080744 1111992 1143816 1175453
61877A175453L1536L1464L1120L0580L0071K9614K9022K7920K5784K2465J8638
$$ 1175453 1206989 1238453 1269573 1300153 1330224 1359838 1388860 1416780 1442564 1465029 1483667
61866A483667J5209J2242Q989N101J268j574l192l946m192m127l862l262j871
$$ 1483667 1498876 1511118 1520107 1525208 1526476 1524902 1521710 1517764 1513572 1509445 1505583 1502321 1500450
61853A500450O37M017P790J1691J5368J7788J7864J6046J4462J4630J5490J4773
$$ 1500450 1501087 1505104 1512894 1524585 1539953 1557741 1575605 1591651 1606113 1620743 1636233 1651006
61841A651006J2071R082O582K988k823q729j1419j0674r547j0330j2207j3346
$$ 1651006 1663077 1672159 1678741 1681729 1678906 1670177 1658758 1648084 1638537 1628207 1616000 1602654
61829A602654j3397j3027j2521j2067j2312j3563j5177j6619j8162j9765k0437
$$ 1602654 1589257 1576230 1563709 1551642 1539330 1525767 1510590 1493971 1475809 1456044 1435607
61818A435607j9832j9291j9899k0490j9328j6926j5209j4330j2490q980n391l184
$$ 1435607 1415775 1396484 1376585 1356095 1336767 1319841 1304632 1290302 1277812 1268832 1263441 1260257
61806A260257j858j00K554N972J0036J4260J7771K0424K3037K6030K8713L0570
$$ 1260257 1258399 1258299 1260853 1266825 1276861 1291121 1308892 1329316 1352353 1378383 1407096 1437666
61794A437666L2219L4475L7297M0308M3370M6003M7114M6288M4537M2933M1117
$$ 1437666 1469885 1504360 1541657 1581965 1625335 1671338 1718452 1764740 1809277 1852210 1893327
61783A893327L8033L3456K7875K1616J5026Q943L907n80n051q904j1311j2609
$$ 1893327 1931360 1964816 1992691 2014307 2029333 2038276 2042183 2041603 2036552 2027648 2016337 2003728
61771B003728j3357j2532q555k193L501O696Q573J0732J2299J1214P510L451M59
$$ 2003728 1990371 1977839 1969284 1967091 1970592 1977288 1985861 1996593 2008892 2020106 2027616 2031067 2031526
61758B031526k603p461j3890k0016k4721k8626l2630l6337l8564l8894l7998l6645
$$ 2031526 2028923 2021462 2007572 1987556 1962835 1934209 1901579 1865242 1826678 1787784 1749786 1713141
61746A713141l5188l3953l3259l2815l1982l0904l0528l0968l0836k8967k5957
$$ 1713141 1677953 1644000 1610741 1577926 1545944 1515040 1484512 1453544 1422708 1393741 1367784
61735A367784k3012k0166j6971j4298j3666j4844j5721j4931j3249j1934j0947
$$ 1367784 1344772 1324606 1307635 1293337 1279671 1264827 1249106 1234175 1220926 1208992 1198045
61724A198045r533p570n533l814k716k520l005l381l174k636j995r69N20J937
$$ 1198045 1188512 1180942 1175409 1171595 1168879 1166359 1163354 1159973 1156799 1154163 1152168 1151199 1151719 1153656
61710A153656K903L788N067O663Q346J0052J1387J1683J1149J1083J2196J3564
$$ 1153656 1156559 1160347 1165414 1172077 1180423 1190475 1201862 1213545 1224694 1235777 1247973 1261537
61698A261537J4003J3612J2956J1709R396O750M785K899m74n425j0266j3756j6169
$$ 1261537 1275540 1289152 1302108 1313817 1323213 1329963 1334748 1337647 1337173 1331748 1321482 1307726 1291557
61685A291557j7871j8393j7545j6297j5650j5458j5002j4044j2654j0690q219
$$ 1291557 1273686 1255293 1237748 1221451 1205801 1190343 1175341 1161297 1148643 1137953 1129734
61674A129734o027m974n043n480n572n018l860k506j538j099p00P6R51J325R44
$$ 1129734 1123707 1118733 1113690 1108210 1102638 1097620 1093760 1091254 1089716 1088617 1087917 1087993 1088944 1090269 1091213
61659A091213m9j405k651l049k206p41J03m09j934l643n110o464p846q946r276
$$ 1091213 1091164 1089759 1087108 1084059 1081853 1081112 1081215 1080806 1078872 1075229 1070119 1063655 1055809 1046863 1037587
61644A037587q898q592r129j0392j1360j0950q970o483n195n888p370p585o128
$$ 1037587 1028689 1020097 1010968 1000576 989216 978266 969296 962813 957618 951730 944360 936775 930647
61631I30647m925n741p811q954q465p477o679n363l203j571k024m236o292o605
$$ 930647 925722 919981 912170 903216 894751 887274 880595 875232 872029 870458 868434 864198 857906 851301
61617H51301m967k229L67J801J818R32k54j386k046j685k83J431K708L331L358
$$ 851301 846334 844105 844472 846273 848091 849023 848769 847383 845337 843652 843369 844800 847508 850839 854197
61602H54197K865K307K417L374M548N408O041O416N953M565L392L466M083L601
$$ 854197 857062 859369 861786 865160 869708 875116 881157 887573 893526 898091 901483 904949 909032 912633
61588I12633J791L83R44K911M306M058L119L112M270N216M845L714K975K518J244
$$ 912633 914424 914807 915751 918662 922968 927026 930145 933257 937527 942743 947588 951302 954277 956795 958039
61573I58039r38k670k995k601k663l347m127m784n320n553n470n511n951o449
$$ 958039 957101 954431 951436 948835 946172 942825 938698 933914 928594 923041 917571 912060 906109 899660
61559H99660o706o872o841n995m319k962k941l946n122o107o510n630l830l157
$$ 899660 892954 886082 879241 873246 868927 865965 863024 859078 853956 847849 841339 835709 831879 828722
61545H28722m971p784r151q971r101j0094j0568r742q497p486o258m911m645n671
$$ 828722 823751 815967 806816 797845 788744 778650 768082 758340 749843 742357 736099 731188 726543 720872
61531G20872o170m715k424j382j844k309j747m53Q05J359P11r05k260k345j625
$$ 720872 714702 709987 707563 706181 704337 702028 700281 699828 700633 701992 702703 701798 699538 697193 695568
61516F95568j173r00J88K043L211K813J811J515J675J066m15j335n89J222K697
$$ 695568 694395 693495 693683 695726 698937 701750 703561 705076 706751 707817 707402 706067 705478 706700 709397
61501G09397L269L372L430L442L441L599L767L499K708J782R40J42l06J79J389
$$ 709397 712666 716038 719468 722910 726351 729950 733717 737216 739924 741706 742646 742788 742482 742661 744050
61486G44050K205K103K010K889M133M281K902Q76p91j520r04R84L092M167M101
$$ 744050 746255 748358 750368 753257 757390 761671 764573 765449 764658 763138 762234 763218 766310 770477 774578
61471G74578L705L266K308Q55j69k23o3p98k464l907l963k610j069n98r83o92
$$ 774578 778283 781549 783857 784712 784543 784320 784257 783459 780995 777088 773125 770515 769446 768848 767865 767173
61455G67173J058K980L237J800L11j14K21P36J467K466L380L996M553N173N599
$$ 767173 768231 771211 774448 776248 776559 776445 776666 777402 778869 781335 784715 788711 793264 798437 804036
61440H04036N666N547N398N309N490N967O234N966N748O221O711N952M084K715
$$ 804036 809702 815249 820647 825956 831446 837413 843647 849613 855361 861582 868293 874245 878329 881044
61426H81044K738L300L318K907K632K328J481K63l81M12K531M588M878L211J344
$$ 881044 883782 887082 890400 893307 895939 898267 899748 900011 899630 900042 902573 907161 912039 915250 916594
61411I16594P95Q31j94k081l184l170l375m222m488l738l444m531n689n386m145
$$ 916594 917389 918220 918026 915945 912761 909591 906216 901994 897506 893768 890324 885793 880104 874718 870573
61396H70573l353l097k616j881j359r31l38m1m56j031j088q14l61J129M235P674
$$ 870573 867220 864123 861507 859626 858267 857336 856998 856957 856501 855470 854382 853568 853207 854336 858571 866245
61380H66245R406Q986P635O439N591N029M590L785K502J677K262L748M727M708
$$ 866245 875651 884637 892272 898711 904302 909331 913921 917706 920208 921885 924147 927895 932622 937330
61366I37330M434M483M535M079L133K275K206L019L704L055J342J46kn11k327
$$ 937330 941764 946247 950782 954861 957994 960269 962475 965494 969198 972253 973595 973741 973739 973228 970901
61351I70901l917l310j209j68j141k576k905k212j230j87P47J049N51q2K8J117
$$ 970901 966984 963674 962465 962297 961156 958580 955675 953463 952233 952046 952793 953842 954393 954311 954339 955456
61335I55456K645L634L410K451K075K843L777L816L275L023L037K912L090M132
$$ 955456 958101 961735 965145 967596 969671 972514 976291 980107 983382 986405 989442 992354 995444 999576
61321I99576N336N624N382N855O908P214O700O872Q274R374Q824P469P034P811
$$ 999576 1004912 1010536 1015918 1021773 1028681 1035895 1042595 1049467 1057741 1067115 1075939 1083408 1090442 1098253
61307A098253Q515P900N742K831N42m6R25K329L331L918M202M038L566L388L801
$$ 1098253 1106768 1114668 1120410 1123241 1123783 1123737 1124662 1126991 1130322 1134240 1138442 1142480 1146046 1149434 1153235
61292A153235M472N069N564N713M998L499K160J718J850J785J303P19K53j02k81
$$ 1153235 1157707 1162776 1168340 1174053 1179051 1182550 1184710 1186428 1188278 1190063 1191366 1192085 1192338 1192236 1191955
61277A191955j77P7J1q12k266l579m055l914l940m232l985k936k143k554l386
$$ 1191955 1191778 1191855 1191866 1191054 1188788 1185209 1181154 1177240 1173300 1169068 1165083 1162147 1160004 1157450 1154064
61262A154064k923o82K153M260N248N459N577O433Q386J0848J2948J4504J5878
$$ 1154064 1151141 1150459 1152612 1156872 1162120 1167579 1173156 1179589 1187975 1198823 1211771 1226275 1242153
61249A242153J7216J8517J9990K1553K2413K1995K0823J9547J7621J4172R683
$$ 1242153 1259369 1277886 1297876 1319429 1341842 1363837 1384660 1404207 1421828 1436000 1445683
61238A445683N459J781j944n423p544q275q964j0315j1527j1926j2152j2955j3862
$$ 1445683 1451142 1452923 1450979 1445556 1438012 1429737 1420773 1410458 1398931 1387005 1374853 1361898 1348036
61225A348036j3792j2415j0420q802q045p615o381m081j960j094o67Q57L318N160
$$ 1348036 1334244 1321829 1311409 1302607 1294562 1286947 1280566 1276485 1274525 1273431 1272764 1273621 1276939 1282099
61211A282099N918O647P741Q137P239O088N932O824Q194R687J0999J1958J3029
$$ 1282099 1288017 1294664 1302405 1310542 1317781 1323869 1329801 1336625 1344819 1354506 1365505 1377463 1390492
61198A390492J4569J5471J4050J0549P134N008L206Q46j347k686l884n437o255
$$ 1390492 1405061 1420532 1434582 1445131 1452265 1457273 1460479 1461325 1459978 1457292 1453408 1447971 1441716
61185A441716n282l462k715l789o072q480r719q925p123o701q315r660q649o223
$$ 1441716 1436434 1432972 1430257 1426468 1420396 1411916 1402197 1393272 1386149 1379448 1371133 1361473 1352824 1346601
61171A346601m352k771rL343N032M686M465N878P898Q889Q831Q776R248R928J0267
$$ 1346601 1342249 1339478 1339469 1342812 1347844 1352530 1356995 1362873 1370771 1379660 1388491 1397267 1406515 1416443 1426710
61156A426710R863Q778P761P712Q642R579R530Q273O343M709M225M862N583N520
$$ 1426710 1436573 1445351 1453112 1460824 1469466 1479045 1488575 1496848 1503191 1507900 1512125 1516987 1522570 1528090
61142A528090N161N844Q193J1534J4741J7075J8234J8221J7364J6182J5111J4317
$$ 1528090 1533251 1539095 1547288 1558822 1573563 1590638 1608872 1627093 1644457 1660639 1675750 1690067
61130A690067J3563J2221R703O131K297j211m455p556r991j1000j0489r356q879
$$ 1690067 1703630 1715851 1725554 1731685 1733982 1732771 1728316 1720760 1710769 1699769 1689280 1679924 1671045
61117A671045r690j1247j2527j3415j4857j7201j9137j9254j8134j7573j8055
$$ 1671045 1661355 1650108 1637581 1624166 1609309 1592108 1572971 1553717 1535583 1518010 1499955
61106A499955j8463j8119j7634j7641j8110j9040k0191k0046j6971j1926q034
$$ 1499955 1481492 1463373 1445739 1428098 1409988 1390948 1370757 1350711 1333740 1321814 1313780
61095A313780o661n832l576q23M86N19R76K552M443N536M849J895k186n076o004
$$ 1313780 1307119 1301287 1297711 1296888 1297374 1297893 1298869 1301421 1305864 1311400 1316249 1318144 1315958 1310882 1304878
61080A304878o731q507r722q340n192k687j320K31K353M198N756P896J0503J2510
$$ 1304878 1298147 1289640 1279918 1271578 1266386 1263699 1262379 1262610 1264963 1269161 1274917 1282813 1293316 1305826
61066A305826J3786J5274J7334J9641K2428K6023K9252L0233K9006K7725K8043
$$ 1305826 1319612 1334886 1352220 1371861 1394289 1420312 1449564 1479797 1508803 1536528 1564571
61055A564571K9670L1570L3032L3394L2296L0517K9349K8883K8045K6299K4047
$$ 1564571 1594241 1625811 1658843 1692237 1724533 1755050 1784399 1813282 1841327 1867626 1891673
61044A891673K1428J8111J4343J0773P180K801j991n733p918r594j1623j3593
$$ 1891673 1913101 1931212 1945555 1956328 1963508 1966309 1964318 1958585 1950667 1941073 1929450 1915857
61032A915857j4852j5496j5953j6408j6814j6665j4887j1074o649l617k172q55
$$ 1915857 1901005 1885509 1869556 1853148 1836334 1819669 1804782 1793708 1787059 1783442 1781270 1780415
61020A780415J123L123M780O808R681J2766J5338J7547J9980K2986K6571L0308
$$ 1780415 1781538 1784661 1789441 1796249 1805930 1818696 1834034 1851581 1871561 1894547 1921118 1951426
61008A951426L3422L5631L7558L9589M1066M1656M2676M5360M8597N0261N0444
$$ 1951426 1984848 2020479 2058037 2097626 2138692 2180348 2223024 2268384 2316981 2367242 2417686
60997B417686N1280N3690N6335N7868N8352N8214N7624N7137N7337N7708N7394
$$ 2417686 2468966 2522656 2578991 2636859 2695211 2753425 2811049 2868186 2925523 2983231 3040625
60986C040625N6780N6535N5559N2332M8069M5895M6614M8075M8974N0339N2563
$$ 3040625 3097405 3153940 3209499 3261831 3309900 3355795 3402409 3450484 3499458 3549797 3602360
60975C602360N4168N4767N6415O0448O5554P0546P6531Q4517R3228J01340J09794
$$ 3602360 3656528 3711295 3767710 3828158 3893712 3964258 4040789 4125306 4218534 4319874 4429668
60964D429668J19931J31190J42541J54353J66990J79567J92138K07220K26910
$$ 4429668 4549599 4680789 4823330 4977683 5144673 5324240 5516378 5723598 5950508
60955E950508K50151K74959L01571L31140L63065L96201M31530M71658N19240
$$ 5950508 6200659 6475618 6777189 7108329 7471394 7867595 8299125 8770783 9290023
60946I290023N77573O50437P39031Q41487R57831J092344J248443J425742J626275
$$ 9290023 9867596 10518033 11257064 12098551 13056382 14148726 15397169 16822911 18449186
60937A8449186J857420K120752K403782K693305K986891L261788L422326L312492
$$ 18449186 20306606 22427358 24831140 27524445 30511336 33773124 37195450 40507942
60929D0507942K830802K050384J204507N31626J32805k6571j6669J05475K45141
$$ 40507942 43338744 45389128 46593635 47125261 47258066 47231495 47214826 47320301 47565442
60920D7565442K32058r8137p63221j593718k347835k866355l126940l187233l111512
$$ 47565442 47797500 47699363 46936142 45342424 42994589 40128234 37001294 33814061 30702549
60911C0702549k946593k729635k490093k244782k001571j767830j550882j353541
$$ 30702549 27755956 25026321 22536228 20291446 18289875 16522045 14971163 13617622
60903A3617622j175341j017579q83275p73145o84972o15832n61782n16572m74272
$$ 13617622 12442281 11424702 10541427 9768282 9083310 8467478 7905696 7389124 6914852
60894F914852m33198l94847l59650l26323k94626k65663k39383k14660j92238
$$ 6914852 6481654 6086807 5727157 5400834 5106208 4840545 4601162 4386502 4194264
60885D194264j74919j63945j57036j50892j44053j36648j29003j21519j14818
$$ 4194264 4019345 3855400 3698364 3547472 3403419 3266771 3137768 3016249 2901431
60876B901431j09082j03808r8549r3134q7088q0027p2823o7124o3232n9666n5362
$$ 2901431 2792349 2688541 2589992 2496858 2409770 2329743 2256920 2189796 2126564 2066898 2011536
60865B011536n1050m7712m4911m1838l8974l7291l6340l4565l1532k8575k6932
$$ 2011536 1960486 1912774 1867863 1826025 1787051 1749760 1713420 1678855 1647323 1618748 1591816
60854A591816k6015k4098k0357j5936j3082j3114j4968j5965j4417j1373r409
$$ 1591816 1565801 1541703 1521346 1505410 1492328 1479214 1464246 1448281 1433864 1422491 1413082
60843A413082r825j1553j2802j3155j3610j4920j6433j6780j5582j4201j4373
$$ 1413082 1403257 1391704 1378902 1365747 1352137 1337217 1320784 1304004 1288422 1274221 1259848
60832A259848j6122j7539j7074j5473j4682j5185j5509j4466j2714j1513j0883
$$ 1259848 1243726 1226187 1209113 1193640 1178958 1163773 1148264 1133798 1121084 1109571 1098688
60821A098688r984q684p688p316p149o917o957p517q150q057o718m227j391O30
$$ 1098688 1088704 1080020 1072332 1065016 1057867 1050950 1043993 1036476 1028326 1020269 1013551 1009324 1007933 1008563
60807A008563J270J209J619K867M361N501O071N839M698L338K971L920N191N799
$$ 1008563 1009833 1011042 1012661 1015528 1019889 1025390 1031461 1037300 1041998 1045336 1048307 1052227 1057418 1063217
60793A063217N902O181O653O649N628L686J532J87K15J049J447P37r19l346o537
$$ 1063217 1069119 1075300 1081953 1088602 1094230 1097916 1099448 1099635 1099850 1100899 1102346 1103083 1102164 1098818 1092281
60778A092281r785j1823j2370j2567j3192j3462j2438j0677r406q849q581q761
$$ 1092281 1082496 1070673 1058303 1045736 1032544 1019082 1006644 995967 986561 977712 969131 960370
60766I60370r662j0416r752p900o357n839n801o007p054q880j0018r186o852m751
$$ 960370 950708 940292 930540 922640 916283 910444 904643 898636 891582 882702 872684 863498 856646 851895
60752H51895m334n856q209r452q335n738l825l581l962l755l062k402j446K13
$$ 851895 847561 841705 833496 824044 815709 809971 806146 802565 798603 794848 791786 789384 787938 788151
60738G88151J788K040J121M98R70J641J279J14l36R33L134M507M220L147K639
$$ 788151 789939 791979 793100 793598 794568 796209 797488 797602 797266 798199 801333 805840 810060 813207 815846
60723H15846K985L494L685L672L487K885J966J194N42n88k251l460l406k588k151
$$ 815846 818831 822325 826010 829682 833169 836054 838020 839214 839756 839168 836917 833457 830051 827463 825312
60708H25312k530l275l757l509k362r08l66j197k215j988q12k22o88r68j36R92
$$ 825312 822782 819507 815750 812241 809879 808971 808605 807408 805193 803205 802393 802171 801483 800515 800379 801371
60692H01371J163N49K70O12Q04N97Q80K268L750L498R32k611n288o488o915p227
$$ 801371 802534 803083 803353 803965 804769 805366 806246 808514 812264 815762 816694 814083 808795 802307 795392 788165
60676G88165p131n983l981k236j520j401r76k08N6n40j185q41M97K039L276M246
$$ 788165 781034 775051 771070 768834 767314 765913 764937 764729 764785 764245 763060 762219 762716 764755 768031 772277
60660G72277M847M683L745K698K127J882J523J063R74J557K636L787M721N453
$$ 772277 777124 781807 785552 788250 790377 792259 793782 794845 795819 797376 800012 803799 808520 813973
60646H13973O134O604O246M665K383L28j316l061m790n457m607l291k696k538
$$ 813973 820107 826711 832957 837622 840005 840333 839017 835956 831166 825709 821102 817811 815115 812577
60632H12577j827o62r4n20j347k127k848l142k504j470j140j179J73L255N625
$$ 812577 810750 810088 809994 809474 808127 806000 803152 800010 797506 796036 794896 793717 793890 797145 802770
60617H02770N051K741J922L572N404N212L503K135J663J001q99l960p210r347
$$ 802770 807821 810562 812484 816056 821460 826672 830175 832310 833973 834974 834075 830115 822905 813558
60603H13558r398p482m945l286k973l407l728l313j840M81K886M700N890O654
$$ 813558 804160 796678 791733 788447 785474 782067 778339 775026 773186 773667 776553 781253 787143 793797
60589G93797O737N759M041K405J217L16k24k12l10j679m181n969n666m117l100
$$ 793797 800534 806293 810334 812739 813956 814272 814048 813836 813526 811847 807666 801697 796031 791914 788814
60574G88814l000k852k117j175l28N19J181J276J002Q99R54Q76J102K265L662
$$ 788814 785814 782962 780845 779670 779342 779861 781042 782318 783320 784219 785173 786049 787151 789416 793078
60559G93078L744K371J097P47L29q42j494k55K044L454L516L282L305L155K740
$$ 793078 796822 799193 800290 801037 801366 800524 799030 798775 800819 804273 807789 811071 814376 817531 820271
60544H20271K550K484J695J0j503j744o54J061K686L745M132M268M691N404N903
$$ 820271 822821 825305 827000 827010 825507 823763 823109 824170 826856 830601 834733 839001 843692 849096 854999
60529H54999N887N558N340N558O291P119P356O815O021N298M260K766J747K220
$$ 854999 860886 866444 871784 877342 883633 890752 898108 904923 910944 916242 920502 923268 925015 927235
60515I27235L918N839P678R657J1388J2287J2979J4750J7453J9368J9573J9149
$$ 927235 931153 936992 944670 954327 965715 978002 990981 1005731 1023184 1042552 1062125 1081274
60503A081274J9385J9937J9582J7979J5716J3248J0543P506M137O56k089k903
$$ 1081274 1100659 1120596 1140178 1158157 1173873 1187121 1197664 1205170 1209307 1209963 1207874 1204971
60491A204971j588M74J752K310L355N205O693O947P061R216J4094J9846K4102
$$ 1204971 1203383 1203857 1205609 1207919 1211274 1216479 1223172 1230119 1237180 1246396 1260490 1280336 1304438
60478A304438K6605K9224L3384L8433M2852M6167M8782N0594N0808M8955M5213
$$ 1304438 1331043 1360267 1393651 1432084 1474936 1521103 1569885 1620479 1671287 1720242 1765455
60467A765455L9736L2494K3742J4034L978n429j2646j6889j9336k1860k4652k6269
$$ 1765455 1805191 1837685 1861427 1875461 1879439 1874010 1861364 1844475 1825139 1803279 1778627 1752358
60455A752358k5924k4305k1961j8475j3799q958m656m04M208Q514J2013J5494
$$ 1752358 1726434 1702129 1680168 1661693 1647894 1638936 1634280 1633876 1638084 1646598 1658611 1674105
60443A674105J9848K4764K9673L5144M2059N0013N7832O5125P1987P7620Q0640
$$ 1674105 1693953 1718717 1748390 1783534 1825593 1875606 1933438 1998563 2070550 2148170 2228810
60432B228810Q0746P8840P5525P0652O4357N7410N0245M2797L5736L0732K8730
$$ 2228810 2309556 2388396 2463921 2534573 2598930 2656340 2706585 2749382 2785118 2815850 2844580
60421B844580K8518K7682K4572J8876J0651l77j4540l1552n0209o8536q4387r6369
$$ 2844580 2873098 2900780 2925352 2944228 2954879 2954502 2939962 2908410 2858201 2789665 2705278 2608909
60409B608909j04413j09381j11837j11278j06874r9016q9784q1460p4767o8864
$$ 2608909 2504496 2395115 2283278 2172000 2065126 1966110 1876326 1794866 1720099 1651235
60399A651235o2880n6868n1312m6377m1876l7576l3412k9724k7195k6023k5218
$$ 1651235 1588355 1531487 1480175 1433798 1391922 1354346 1320934 1291210 1264015 1237992 1212774
60388A212774k3419k0483j7460j4982j2650j0296q706q439q844q932q487p655
$$ 1212774 1189355 1168872 1151412 1136430 1123780 1113484 1104778 1096339 1087495 1078563 1070076 1062421
60376A062421o396n153n037o271p305o761n447n008n299m890l751l394m260m970
$$ 1062421 1056025 1050872 1045835 1039564 1032259 1025498 1020051 1015043 1009744 1004854 1001103 997709 993449 988479
60362I88479m679m276m441m249k936j619j710k578k394o85J360K837L787M068
$$ 988479 983800 979524 975083 970834 967898 966279 964569 961991 959597 958912 960272 963109 966896 970964
60348I70964L110J250O5O56K261L239K957K249K305L568N428O733O685N518M118
$$ 970964 974074 975324 975389 976045 978306 981545 984502 986751 989056 992624 998052 1004785 1011470 1016988 1021106
60333A021106L027K139J438J406K259L329L777L763M256N669P278Q143Q077P472
$$ 1021106 1024133 1026272 1027710 1029116 1031375 1034704 1038481 1042244 1046500 1052169 1059447 1067590 1075667 1083139
60319A083139O592N428M074K843J955J385J104J291K069L067L559L419L570M946
$$ 1083139 1089731 1095159 1099233 1102076 1104031 1105416 1106520 1107811 1109880 1112947 1116506 1119925 1123495 1128441
60305A128441O934P745O662N098M603M705L969K735K970N280P774Q706Q801R786
$$ 1128441 1135375 1143120 1149782 1154880 1159483 1164188 1168157 1170892 1173862 1179142 1186916 1195622 1204423 1214209
60291A214209J1742J3276J3621J3171J2323J1073R573P948N667K102k300o247
$$ 1214209 1225951 1239227 1252848 1266019 1278342 1289415 1298988 1306936 1312603 1314705 1312405 1306158
60279A306158q937j0373j0791j0644j0714j1077j0428p868m905l919m847n424
$$ 1306158 1297221 1286848 1276057 1265413 1254699 1243622 1233194 1225326 1220421 1216502 1211655 1206231
60267A206231m872m921o431p432o178m117l716m550l980j073K253M078M560M974
$$ 1206231 1201359 1196438 1190007 1182575 1176397 1172280 1168564 1164014 1160034 1158961 1161214 1165292 1169852 1174826
60253A174826O154Q352J1469J4808J7467J9372K1177K2904K3498K2257K0054J8432
$$ 1174826 1180980 1189332 1200801 1215609 1233076 1252448 1273625 1296529 1320027 1342284 1362338 1380770
60241A380770J7844J7309J5682J2766R115N069L35n543j2418j9292k4743k7658
$$ 1380770 1398614 1415923 1431605 1444371 1453486 1458555 1458890 1453347 1440929 1421637 1396894 1369236
60229A369236k7966k6867k5929k5582k4766k2495j9305j6465j4291j2221j0268
$$ 1369236 1341270 1314403 1288474 1262892 1238126 1215631 1196326 1179861 1165570 1153349 1143081
60218A143081r051q438p561o503o525q110r976j0703j0116q508n927l140j758
$$ 1143081 1134030 1125592 1118031 1111528 1105003 1096893 1086917 1076214 1066098 1057590 1051663 1048523 1046765
60205A046765k157k625j978j621l151n124m687j871K53j84j751k321j675o20P32
$$ 1046765 1044608 1041983 1040005 1038384 1035233 1030109 1025422 1023551 1023804 1023620 1021869 1019548 1017873 1017253 1017985
60190A017985K485L983M550M547M696M822M156K651J317J177K214L371L568K842
$$ 1017985 1020470 1024453 1029003 1033550 1038246 1043068 1047224 1049875 1051192 1052369 1054583 1057954 1061522 1064364
60176A064364K257K513L125L406L582M117M569M274L856M590O420P922Q363Q397
$$ 1064364 1066621 1069134 1072259 1075665 1079247 1083364 1087933 1092207 1096063 1100653 1107073 1114995 1123358 1131755
60162A131755Q606Q775Q964R693J0556J0283Q937Q481R984J1846J2217J1818J2468
$$ 1131755 1140361 1149136 1158100 1167793 1178349 1188632 1197569 1206050 1216034 1227880 1240097 1251915 1264383
60149A264383J3921J4324J3353J2589J2671J2219J0253P863O533O117N590M840
$$ 1264383 1278304 1292628 1305981 1318570 1331241 1343460 1353713 1361576 1368109 1374226 1379816 1384656
60137A384656M516M684M784M523L954K888J042j282l413n044o071o033m684l192
$$ 1384656 1389172 1393856 1398640 1403163 1407117 1410005 1411047 1409765 1406352 1401308 1395237 1389204 1384520 1381328
60123A381328l504o007q649r186p619n650m252k938j232L28J061J066Q14L75l40
$$ 1381328 1377824 1371817 1363168 1353982 1346363 1340713 1336461 1333523 1332291 1332619 1333680 1334746 1335560 1335935 1335595
60108A335595j007j208j176j718l303n467p119p414o424n007l919l127k237j326
$$ 1335595 1334588 1333380 1332204 1330486 1327183 1321716 1314597 1307183 1300759 1295752 1291833 1288706 1286469 1285143
60094A285143p84l12J037L395N428N780M778L919M025M572M836M922N340O039
$$ 1285143 1284359 1284047 1285084 1288479 1293907 1299687 1304465 1308384 1312409 1316981 1321817 1326739 1332079 1338118
60080A338118O211N160L234J772J901L445N234O376O775O586N932N298N345N906
$$ 1338118 1344329 1349489 1352723 1354495 1356396 1359841 1365075 1371451 1378226 1384812 1390744 1396042 1401387 1407293
60066A407293N941N071M321M689N663O160O298P106Q674R833R796R186R145J0106
$$ 1407293 1413234 1418305 1422626 1427315 1432978 1439138 1445436 1452542 1461216 1471049 1480845 1490031 1499176 1509282
60052A509282J1699J3223J3970J3559J2322J1126J0638J0806J0963J0317Q470
$$ 1509282 1520981 1534204 1548174 1561733 1574055 1585181 1595819 1606625 1617588 1627905 1636375
60041A636375N764K987O63j134k266k388j631q66q24j379k052k751l589m656o301
$$ 1636375 1642139 1645126 1645789 1644655 1642389 1640001 1638370 1637504 1636680 1635301 1633249 1630498 1626909 1622253 1615952
60026A615952q955j2063j4131j4588j4703j5701j6888j6933j6198j6227j7339
$$ 1615952 1606997 1594934 1580803 1566215 1551512 1535811 1518923 1501990 1485792 1469565 1452226
60015A452226j8352j8462j7900j6778j4961j3162j2639j3427j4162j4004j3538
$$ 1452226 1433874 1415412 1397512 1380734 1365773 1352611 1339972 1326545 1312383 1298379 1284841
60004A284841j3358j2998j1805r902p896o393n925o406o610n357l258k079k217
$$ 1284841 1271483 1258485 1246680 1236778 1228882 1222489 1216564 1210158 1203548 1198191 1194933 1192854 1190637
59991A190637k258j285q8M71P63J308J805K056K636L731M485M403M200M281L692
$$ 1190637 1188379 1187094 1187006 1187477 1188240 1189548 1191353 1193409 1196045 1199776 1204261 1208664 1212864 1217145 1220837
59976A220837J739m60j431j451j799k618l065l014l231m037n015n953o997p993
$$ 1220837 1222576 1222116 1220685 1219234 1217435 1214817 1211752 1208738 1205507 1201470 1196455 1190502 1183505 1175512
59962A175512q568q758q839q848q881r318r970r700p896n719m698m608m092k976
$$ 1175512 1166944 1158186 1149347 1140499 1131618 1122300 1112330 1102630 1094734 1089015 1084317 1079709 1075617 1072641
59948A072641k399k698k769j861o43jR3k0m24j160j756j832j589j333j024o07
$$ 1072641 1070242 1067544 1064775 1062914 1062271 1062270 1062363 1062343 1061919 1060759 1059003 1057171 1055582 1054249 1053225 1052618
59932A052618j53O11K245M558O268O269M851L268K519K913M182N441N505M034
$$ 1052618 1052465 1053076 1055321 1059879 1066147 1072416 1077267 1080535 1083054 1085967 1090149 1095590 1101095 1105129
59918A105129K133J116Q79K32j220k424k302j185l98q90k578m625n859n411l438
$$ 1105129 1107262 1108378 1109257 1109489 1108269 1105845 1103543 1102358 1101960 1101070 1098492 1093867 1088008 1082597 1079159
59903A079159j097O04J711K718L522L682L283K688J673o7j634j548%R33J8j523
$$ 1079159 1078062 1078666 1080377 1083095 1086617 1090299 1093582 1096270 1097943 1097876 1096242 1094694 1094694 1095627 1095645 1094122
59887A094122k071j892k020k063j009N61J092O51Q46K103L017K848K817M045N814
$$ 1094122 1092051 1090159 1088139 1086076 1085067 1085628 1086720 1087371 1088217 1090320 1093337 1096185 1099002 1103047 1108861
59872A108861O823O923O711O594P074Q821J1325J2618J1463R084P512P058O569
$$ 1108861 1115684 1122607 1129318 1135912 1142986 1151807 1163132 1175750 1187213 1196297 1203809 1210867 1217436
59859A217436N537M560M039L693L362L291L578M140N105O542P834P977O536L949
$$ 1217436 1222973 1227533 1231572 1235265 1238627 1241918 1245496 1249636 1254741 1261283 1269117 1277094 1283630 1287579
59845A287579J103j039j810j384p17m87m36j19K18J15k99n59n07k2J341L768O595
$$ 1287579 1288682 1287643 1285833 1284449 1283732 1283245 1282809 1282690 1282908 1283023 1282724 1282165 1281658 1281636 1282977 1286745 1293340
59828A293340Q991J0715J1666J1379R937Q776R368J1319J2899J3329J3461J4081
$$ 1293340 1302331 1313046 1324712 1336091 1346028 1354804 1364172 1375491 1388390 1401719 1415180 1429261
59816A429261J4722J4397J2773J0285P691N748M801M517M294L806K882J252r84
$$ 1429261 1443983 1458380 1471153 1481438 1489129 1494877 1499678 1504195 1508489 1512295 1515177 1516429 1515445
59803A515445k988m036m462n094n954o449o528o604o460n395l691k682k998l682
$$ 1515445 1512457 1508421 1503959 1498865 1492911 1486462 1479934 1473330 1466870 1461475 1457784 1455102 1452104 1448422
59789A448422l547k509r26J418M734Q213J0547J1352J1153J0151P909M539J393
$$ 1448422 1444875 1442366 1441440 1442858 1447592 1455805 1466352 1477704 1488857 1499008 1506917 1511456 1512849
59776A512849m1L87J694L215N110P272Q497P438M231M65k443m337n729o851p669
$$ 1512849 1512808 1513195 1514889 1518104 1523214 1530486 1538983 1546421 1550652 1551117 1548674 1544337 1538608 1531757 1524088
59761A524088q319q950r278q733p153n223m117m521n851o708o433n961o579q238
$$ 1524088 1515769 1506819 1497541 1488808 1481655 1476432 1472315 1467794 1461943 1455235 1448802 1442841 1436262 1428024
59747A428024r731j0326j0261r780q815p740p195o939o053m740m537o088p894
$$ 1428024 1418293 1407967 1397706 1387926 1379111 1371371 1364176 1357237 1351184 1346444 1341907 1335819 1327925
59734A327925q246p345o529o350o418o317n680m210k544k156l217l637j661J417
$$ 1327925 1319679 1312334 1305805 1299455 1293037 1286720 1281040 1276830 1274286 1272130 1268913 1265276 1263615 1265032
59720A265032K766J670ro35k81M72J549K902M275N702P277Q418Q361P402O661
$$ 1265032 1267798 1269468 1269459 1268824 1268543 1269015 1270564 1273466 1277741 1283443 1290720 1299138 1307499 1314901 1321562
59705A321562O696P241Q033Q842R132Q806Q977J0557J2526J3087J2282J1758J2089
$$ 1321562 1328258 1335499 1343532 1352374 1361506 1370312 1379289 1389846 1402372 1415459 1427741 1439499 1451588
59692A451588J2266J1794J1277J0553Q385M818J901J056J290J142Q47J246J871
$$ 1451588 1463854 1475648 1486925 1497478 1505863 1510681 1512582 1513638 1514928 1516070 1516917 1518163 1520034
59679A520034J606M57o24j049q30j29N35L77n01q22K30J752K484K523K723L111
$$ 1520034 1521640 1522097 1521473 1520424 1519594 1519465 1520000 1520377 1519876 1519054 1519284 1521036 1523520 1526043 1528766 1531877
59663A531877L135K958L314M155M626M252L387K519J857J514J510J662J880K375
$$ 1531877 1535012 1537970 1541284 1545439 1550065 1554317 1557704 1560223 1562080 1563594 1565104 1566766 1568646 1571021
59649A571021L236M165N068O388Q318J0146J1049J1207J1473J2189J2794J2421
$$ 1571021 1574257 1578422 1583490 1589878 1598196 1608342 1619391 1630598 1642071 1654260 1667054 1679475
59637A679475J0559P616N155M809O408P845P484O002M969M515L688K479J853J806
$$ 1679475 1690034 1697650 1702805 1707614 1714022 1721867 1729351 1735353 1740322 1744837 1748525 1751004 1752857 1754663
59623A754663R30j631m956p593r076r709r656r026q316q025q054p941p509o936
$$ 1754663 1755593 1753962 1749006 1741413 1732337 1722628 1712972 1703946 1695630 1687605 1679551 1671610 1664101 1657165
59609A657165o345n671m821l720k268n02J274K675L651M632O174Q331J0345J1185
$$ 1657165 1650820 1645149 1640328 1636608 1634340 1633838 1635112 1637787 1641438 1646070 1652244 1660575 1670920 1682105
59595A682105J0511R110Q128P929P823O837M572J319k407o335j0466j4748j8734
$$ 1682105 1692616 1701726 1709854 1717783 1725606 1732443 1737015 1738334 1735927 1729592 1719126 1704378 1685644
59582A685644k1728k3269k3409k2516k1060j9651j8922j9055j9443j9198j8002
$$ 1685644 1663916 1640647 1617238 1594722 1573662 1554011 1535089 1516034 1496591 1477393 1459391
59571A459391j6377j5009j4031j3128j2403j2619j4218j6194j6780j5659j4728
$$ 1459391 1443014 1428005 1413974 1400846 1388443 1375824 1361606 1345412 1328632 1312973 1298245
59560A298245j5736j7583j7359j4183j0625r517j0567j1280j0396q851p666o617
$$ 1298245 1282509 1264926 1247567 1233384 1222759 1213242 1202675 1191395 1180999 1172148 1164482 1157865
59548A157865n347m317l816l134j709k81J56%M88J824L001L373L231K799J912
$$ 1157865 1152518 1148201 1144385 1141251 1139542 1139261 1139417 1139417 1139905 1141729 1144730 1148103 1151334 1154133 1156045
59533A156045R78R02J497J230n68k378k486j253j58M63J078J148k91k447l277
$$ 1156045 1157023 1157925 1159422 1160652 1160084 1157706 1155220 1153967 1153809 1154272 1155350 1156498 1156207 1153760 1150483
59518A150483k443j842k715m174n226o287p474p330m931j904m93o37o36L7M23
$$ 1150483 1148040 1146198 1143483 1139309 1134083 1127796 1120322 1112992 1108061 1106157 1105664 1105027 1104391 1104428 1104851
59503A104851J26j75j22j24l36l82p0N88J764L155L601K548J357J707L221M407
$$ 1104851 1104977 1104802 1104680 1104556 1104220 1103838 1103768 1104356 1106120 1109275 1112876 1115424 1116781 1118488 1121709 1126116
59487A126116N357P434J0381J2168J2187J2396J4374J7158J9244K1033K3764K6982
$$ 1126116 1131473 1138907 1149288 1161456 1173643 1186039 1200413 1217571 1236815 1257848 1281612 1308594
59475A308594K8555K6677K1082J2941M511j695m469m644l988l755m373n606o561
$$ 1308594 1337149 1363826 1384908 1397849 1402360 1400665 1396196 1391552 1387564 1383809 1379436 1373830 1367269
59462A367269o267m812l347k776l084m111n913p998r285r393r079q927q624q058
$$ 1367269 1361002 1356190 1352843 1350067 1346983 1342872 1336959 1328961 1319676 1310283 1301204 1292277 1283653 1275595
59448A275595p936q654r494r737r588r222q129o314n023n033n343m742l821l778
$$ 1275595 1267659 1259005 1249511 1239774 1230186 1220964 1212835 1206521 1201498 1196465 1191122 1186380 1182559 1178781
59434A178781m065k960j89K749M820O372P560P483N732L636K989L942M963M769
$$ 1178781 1174716 1171756 1171567 1174316 1179136 1185508 1193068 1200551 1206283 1209919 1212908 1216850 1221813 1226582
59420A226582L725L229L974N220N876N797N483M822L178Q79n13l5J420K275K015
$$ 1226582 1230307 1233536 1237510 1242730 1248606 1254403 1259886 1264708 1267886 1268765 1268252 1268217 1269637 1271912 1273927
59405A273927J098rp85m84J067K948M416O047Q469J0643J0855R290Q035Q400R454
$$ 1273927 1275025 1275016 1274231 1273747 1274814 1277762 1282178 1288225 1296694 1307337 1318192 1327482 1335517 1343917 1353371
59390A353371R498P939N355K807J450J754K529J703j204m204n241m784m956o563
$$ 1353371 1362869 1370808 1376163 1378970 1380420 1382174 1384703 1386406 1385202 1380998 1375757 1370973 1366017 1359454
59376A359454q126p900n797l006n66J170K305L388N208P930J0580J2122J2980
$$ 1359454 1351328 1343428 1337631 1334625 1334059 1335229 1337534 1340922 1346130 1354060 1364640 1376762 1389742
59363A389742J4652J7720K1087K3537K5169K6679K8024K8777K9234L0230L2100
$$ 1389742 1404394 1422114 1443201 1466738 1491907 1518586 1546610 1575387 1604621 1634851 1666951
59352A666951L4626L7452L9366L7633K9775J6598K494p757j1991j0941o935k417
$$ 1666951 1701577 1739029 1778395 1816028 1845803 1862401 1864895 1857138 1845147 1834206 1827271 1824854
59340A824854J613O161J2052J6994J6555R008k221j2051j8384k2164k4331k4802
$$ 1824854 1826467 1832628 1844680 1861674 1878229 1887237 1885016 1872965 1854581 1832417 1808086 1783284
59328A783284k3841k2332k0555j8070j5094j2709j1445j0627r416p653n543l361
$$ 1783284 1759443 1737111 1716556 1698486 1683392 1670683 1659238 1648611 1639195 1631542 1625999 1622638
59316A622638j739j389k082k538j816l58P05R22P50P91J367K689M833P330R204
$$ 1622638 1620899 1619510 1617428 1614890 1613074 1612716 1613421 1614343 1615093 1615884 1617251 1619940 1624773 1632103 1641307
59301A641307R870R784R908J0649J1755J3101J4798J6492J7440J7695J8370K0054
$$ 1641307 1651177 1660961 1670869 1681518 1693273 1706374 1721172 1737664 1755104 1772799 1791169 1811223
59289A811223K1785K2496K2645K3256K3942K3355K1257J8730J6485J4382J2540
$$ 1811223 1833008 1855504 1878149 1901405 1925347 1948702 1969959 1988689 2005174 2019556 2032096
59278B032096J1330J0121P511L286j210n022q524j2214j5831j9214k2560k5485
$$ 2032096 2043426 2053547 2061058 2064344 2063134 2058112 2049588 2037374 2021543 2002329 1979769 1954284
59266A954284k7156k7808k8596k9567k9397k7798k6325k5991k5805k4759k3477
$$ 1954284 1927128 1899320 1870724 1841157 1811760 1783962 1757637 1731646 1705841 1681082 1657605
59255A657605k2712k1911k0643j9849k0054j9952j8309j5979j4271j2760j0599
$$ 1657605 1634893 1612982 1592339 1572490 1552436 1532484 1514175 1498196 1483925 1471165 1460566
59244A460566q635p987p536n182j081K648N083P258R864J2208J3757J5121J7035
$$ 1460566 1451931 1443944 1436408 1431226 1430145 1432793 1437876 1445134 1454998 1467206 1480963 1496084 1513119
59231A513119J9195K0205J8175J2101L499m189q806j1131j2471j2310r997p052
$$ 1513119 1532314 1552519 1570694 1582795 1586294 1582105 1573299 1562168 1549697 1537387 1527390 1520338
59219A520338n306l883p05L836P429R637J2198J5477J7594J7557J6726J6433J6386
$$ 1520338 1515032 1511149 1510444 1514280 1521709 1531346 1543544 1559021 1576615 1594172 1610898 1627331 1643717
59206A643717J6216J6464J7057J6611J4271J0805P263L950J201m78j547l110m932
$$ 1643717 1659933 1676397 1693454 1710065 1724336 1735141 1742404 1746354 1747555 1747077 1745530 1742420 1737488
59193A737488n519m716m313n329o559o767o383n874m322j307J291J320o37j944
$$ 1737488 1731969 1727253 1722940 1717611 1711052 1704285 1697902 1692028 1687706 1686399 1687690 1689010 1688373 1686429
59179A686429j241K36L93j547m524o731p502q064r792j1969j2680j1973j2144
$$ 1686429 1685188 1685424 1685817 1684270 1679746 1673015 1665513 1657449 1647657 1635688 1623008 1611035 1598891
59166A598891j4181j5929j5205j2999j1764j1871j1781j0887r985r280q149o814
$$ 1598891 1584710 1568781 1553576 1540577 1528813 1516942 1505161 1494274 1484289 1475009 1466860 1460046
59154A460046o390o807o461m657k813k255k190j152N17J242R64J561M126P238
$$ 1460046 1453656 1446849 1440388 1435731 1432918 1430663 1428473 1427321 1427838 1429080 1430044 1431605 1435731 1442969
59140A442969Q845Q806Q452Q267P647O689O651Q073R828J0730J0945J0965J0346
$$ 1442969 1451814 1460620 1469072 1477339 1484986 1491675 1498326 1506399 1516227 1526957 1537902 1548867 1559213
59127A559213Q603O415M617K781K13k260l213l055l816o398r545j1780j2957j3444
$$ 1559213 1567816 1574231 1578848 1581629 1581842 1579582 1576369 1573314 1569498 1563100 1553555 1541775 1528818 1515374
59113A515374j3114j1888j0449r736j0122j1240j2117j1595r470p049n810n627
$$ 1515374 1502260 1490372 1479923 1470187 1460065 1448825 1436708 1425113 1415643 1408594 1402784 1397157
59101A397157n276m455l998m139m137l877m342n864p173p150o525o852q420j0082
$$ 1397157 1391881 1387426 1383428 1379289 1375152 1371275 1366933 1361069 1353896 1346746 1340221 1333369 1324949 1314867
59087A314867j0752j0371r561q902q537q284q086q196q616q627p426n221l189
$$ 1314867 1304115 1293744 1284183 1275281 1266744 1258460 1250374 1242178 1233562 1224935 1217509 1212288 1209099
59074A209099k300k464k687j857K53K501L458L368M192P012J0319J1888J1610
$$ 1209099 1206799 1204335 1201648 1199791 1200044 1202545 1206003 1209371 1213563 1220575 1230894 1242782 1254392
59061A254392J1286J2274J4546J7469K0151K1494K1249K0547K0309J9821J8186
$$ 1254392 1265678 1277952 1292498 1309967 1330118 1351612 1372861 1393408 1413717 1433538 1451724
59050A451724J6219J5279J5043J4362J3388J2672J0995O927K148J32J282K263
$$ 1451724 1467943 1483222 1498265 1512627 1526015 1538687 1549682 1556609 1558757 1558889 1560171 1562434
59038A562434P62j880l606m567n753o953p500p436o858n729m932n683p188p166
$$ 1562434 1563196 1561316 1557710 1553143 1547390 1540437 1532937 1525501 1518643 1512914 1507982 1502299 1495111 1487945
59024A487945n441m634o211q295q944r062j0127j1263j0933r760r288r304q760
$$ 1487945 1482504 1477870 1471659 1463364 1454420 1445358 1435231 1423968 1413035 1403275 1393987 1384683 1375923
59011A375923q174q692r579r022p045n460n151n245m957m630m766n297n885o174
$$ 1375923 1367749 1359057 1349478 1340456 1333411 1327951 1322800 1317555 1312598 1307968 1303202 1297905 1292020 1285846
58997A285846n914n425n465o003n867m394k562j555j153n52J45M05M15O11Q09
$$ 1285846 1279932 1274507 1269042 1263039 1257172 1252778 1250216 1248661 1247508 1246956 1247101 1247506 1247921 1248532 1249341
58982A249341Q80J387K395K661J452L05J228L772N645N889N666N986O399O328
$$ 1249341 1250221 1251608 1254003 1256664 1258116 1258421 1259649 1263421 1269066 1274955 1280621 1286607 1293006 1299334
58968A299334O291P167R021J1155J2865J3933J4746J5921J7483J8531J8099J6164
$$ 1299334 1305625 1312792 1321813 1332968 1345833 1359766 1374512 1390433 1407916 1426447 1444546 1460710
58956A460710J3547J0973Q541N944K979M7j923k436k124k008k256k371k205j836
$$ 1460710 1474257 1485230 1493771 1499715 1502694 1502741 1500818 1498382 1496258 1494250 1491994 1489623 1487418 1485582
58942A485582q58R14K407K488J986K684M335M759L185J287L11m35j418j574o48
$$ 1485582 1484724 1485638 1488045 1490533 1492519 1495203 1499538 1504297 1507482 1508769 1509080 1508645 1507227 1505653 1505005
58927A505005m98k267m091l620j300P01J545J877K178K854M861Q397J1769J3366
$$ 1505005 1504507 1502240 1498149 1494529 1493229 1493930 1495475 1497352 1499530 1502384 1507245 1515642 1527411 1540777
58913A540777J3872J4927J6456J7163J6874J6594J6672J6539J5871J4650J2659
$$ 1540777 1554649 1569576 1586032 1603195 1620069 1636663 1653335 1669874 1685745 1700395 1713054
58902A713054J0103Q012O839N490L027K52j773l674o553r940j2794j5518j8854
$$ 1713054 1723157 1731169 1738008 1743498 1746525 1746777 1745004 1741330 1734777 1724837 1712043 1696525 1677671
58889A677671k1609k1797j9764j8038j7974j8424j7833j6051j3907j2167j1046
$$ 1677671 1656062 1634265 1614501 1596463 1578489 1560065 1542232 1526181 1512274 1500107 1489061
58878A489061r854p498m192j929j969k761j984R0J100R0j534k421k840l432l931
$$ 1489061 1479207 1471709 1467517 1465588 1463619 1460858 1458874 1458964 1460064 1460154 1458620 1456199 1453359 1449927 1445996
58863A445996l685k646j439q83j228j549m94J750L197K572J153J003K266L529
$$ 1445996 1442311 1439665 1438226 1437343 1436115 1434566 1434072 1435822 1439019 1441591 1442744 1443747 1446013 1449542
58849A449542M132M812O484R390J2923J5624J6260J5542J5687J7518J9509K0496
$$ 1449542 1453674 1458486 1464970 1474360 1487283 1502907 1519167 1534709 1550396 1567914 1587423 1607919
58837A607919K1400K2914K3614K2314K0430J9827J9990J9819K0457K3434K7164
$$ 1607919 1629319 1652233 1675847 1698161 1718591 1738418 1758408 1778227 1798684 1822118 1849282
58826A849282K8426K6690K4225K2346K0367J7883J5366J2694R490O721N599N179
$$ 1849282 1877708 1904398 1928623 1950969 1971336 1989219 2004585 2017279 2026769 2033490 2039089 2044268
58814B044268L502P53j143j851k876m681o208p281q815j0499j0951j0474j1104
$$ 2044268 2047770 2048523 2047380 2045529 2042653 2037972 2031764 2024483 2015668 2005169 1994218 1983744 1972640
58801A972640j3392j5614j6725j7806j9845k2209k3969k5004k5304k4874k4407
$$ 1972640 1959248 1943634 1926909 1909103 1889258 1867049 1843080 1818076 1792772 1767898 1743491
58790A743491k4372k3615k0965j7930j7285j8965k0095j9266j8040j7722j7544
$$ 1743491 1719119 1695504 1674539 1656609 1639324 1620359 1600264 1580998 1562958 1545236 1527692
58779A527692j6863j6536j6948j6989j6008j4691j3168j0467o824m246l721l937
$$ 1527692 1510829 1494293 1477345 1460356 1444348 1429657 1416489 1406022 1399198 1394952 1391231 1387294
58767A387294l686l431l392k370J15K529L528L710L934L802L098K950L956M757
$$ 1387294 1383608 1380177 1376785 1374415 1374530 1377059 1380587 1384297 1388231 1392033 1395131 1398081 1402037 1406794
58753A406794L970K224R17K08m88j215j792k391k811k460j895k870n763q397q666
$$ 1406794 1410764 1412988 1413905 1414113 1413625 1412410 1410618 1408227 1405416 1402956 1401061 1398191 1392428 1384031 1375365
58738A375365p149n890n759o203o615o689o197n321m521l513j402J654M196N516
$$ 1375365 1368216 1362326 1356567 1350364 1343749 1337060 1330863 1325542 1321021 1317508 1316106 1317760 1321956 1327472
58724A327472O588Q217R717J0406J0960J2190J3611J4373J4454J3806J1562P422
$$ 1327472 1334060 1342277 1351994 1362400 1373360 1385550 1399161 1413534 1427988 1441794 1453356 1460778
58712A460778K877l03k232m305p052r702j1453j2203j2233j1934j1698j1565j1167
$$ 1460778 1463655 1463352 1461120 1456815 1449763 1440061 1428608 1416405 1404172 1392238 1380540 1368975 1357808
58699A357808j0290r223q348p744p175o135m257k247j816l616n750n658l207m87
$$ 1357808 1347518 1338295 1329947 1322203 1315028 1308893 1304636 1302389 1300573 1296957 1291207 1285549 1282342 1281855
58685A281855J169K262L426M467N458O940Q557R078Q279P507P863R145J0820J2558
$$ 1281855 1283024 1285286 1288712 1293179 1298637 1305577 1314134 1323212 1331491 1338998 1346861 1356006 1366826 1379384
58671A379384J3491J2551J0147Q108P457P508P453P373P229O427N050M179M395
$$ 1379384 1392875 1405426 1415573 1423681 1431138 1438646 1446099 1453472 1460701 1467128 1472178 1476357 1480752
58658A480752N126N921P055Q437R104Q447O905N162L428J588p84m264q449j1667
$$ 1480752 1485878 1491799 1498854 1507291 1516395 1524842 1531747 1536909 1540337 1541925 1541141 1536877 1528428 1516761
58644A516761j3150j4730j8474k3362k6435k6775k6075k5619k5205k4818k4752
$$ 1516761 1503611 1488881 1470407 1447045 1420610 1393835 1367760 1342141 1316936 1292118 1267366
58633A267366k4072k1587j8348j6534j5886j4128j1071r085r040r123q317p733
$$ 1267366 1243294 1221707 1203359 1186825 1170939 1156811 1145740 1136655 1127615 1118492 1110175 1102442
58621A102442p562o202l686k538l538l906j689J114J984J644K028L024L809N134
$$ 1102442 1094880 1088678 1084992 1082454 1078916 1075010 1073321 1074435 1076419 1078063 1080091 1083115 1086924 1092058
58607A092058P688R981J0487J0343J1465J3159J2986J0117N890J791j540l946
$$ 1092058 1099746 1109727 1120214 1130557 1142022 1155181 1168167 1178284 1184174 1185965 1184425 1180479
58595A180479n781p672r392r954r374r090j0115j2057j4238j6033j6024j3189
$$ 1180479 1174698 1167026 1157634 1147680 1138306 1129216 1119101 1107044 1092806 1076773 1060749 1047560
58583A047560r354p780q593q498n922l235k481k178m75J486J784Q93J61n83j661
$$ 1047560 1038206 1030426 1021833 1013335 1007413 1004178 1001697 999519 999044 1000530 1002314 1003207 1003368 1002785 1001124
58568A001124j870n80M79j60j143o40N85Q19M57J013K505L986N316O525O766N839
$$ 1001124 999254 998674 999153 998993 997850 997210 997795 998614 999071 1000084 1002589 1006575 1011891 1018416 1025182 1031021
58552A031021N228N923O758O585O197O443O490N894O170Q097R578Q642O592N602
$$ 1031021 1036249 1042172 1048930 1055515 1061712 1068155 1074645 1080539 1086709 1094806 1104384 1113026 1119618 1125220
58538A125220N141L668K165K881N614Q019Q934R006Q878Q856R680J1643J3758
$$ 1125220 1130361 1134029 1136194 1139075 1144689 1152708 1161642 1170648 1179526 1188382 1198062 1209705 1223463
58525A223463J5223J6630J8355J9372J9167J9098K0010K0450J9059J6930J5552
$$ 1223463 1238686 1255316 1273671 1293043 1312210 1331308 1351318 1371768 1390827 1407757 1423309
58514A423309J4395J2563J0956J0570J0603J0492J1789J5496J9643K2088K3843
$$ 1423309 1437704 1450267 1461223 1471793 1482396 1492888 1504677 1520173 1539816 1561904 1585747
58503A585747K6853L0323L2259L2974L3973L4623L3003K9092K4396J9371J3635
$$ 1585747 1612600 1642923 1675182 1708156 1742129 1776752 1809755 1838847 1863243 1882614 1896249
58492A896249P798K737j909o540j0239j2498j4571j7178j8783j8440j8203k0123
$$ 1896249 1904047 1906784 1904875 1898335 1888096 1875598 1861027 1843849 1825066 1806626 1788423 1768300
58480A768300k2987k4690k5739k7522k9228k9582k9556l0149k9537k5943k1421
$$ 1768300 1745313 1720623 1694884 1667362 1638134 1608552 1578996 1548847 1519310 1493367 1471946
58469A471946j9096j8374j6678j4299j3449j3786j2961j0835r312q580p278n697
$$ 1471946 1452850 1434476 1417798 1403499 1390050 1376264 1363303 1352468 1343156 1334576 1327298 1321601
58457A321601n409o024n770m735m460m896m753m208m318m537l730k666k494k013
$$ 1321601 1316192 1310168 1304398 1299663 1295203 1290307 1285554 1281346 1277028 1272491 1268761 1266095 1263601 1261588
58443A261588L27K987L419K394K596L880L772K005O88M09o6m11J281N045Q751
$$ 1261588 1261915 1264902 1268321 1270715 1273311 1277191 1280963 1282968 1283656 1284065 1283999 1283588 1284869 1289914 1298665
58428A298665J1273J3210J4760J5577J6316J7756J9057J9377J9984K2088K4052
$$ 1298665 1309938 1323148 1337908 1353485 1369801 1387557 1406614 1425991 1445975 1468063 1492115
58417A492115K3871K2681K2412K1657J7919J2514Q850O793L172k595p618j0085
$$ 1492115 1515986 1538667 1561079 1582736 1600655 1613169 1622019 1628812 1631984 1629389 1621771 1611686
58405A611686j0745j0132q148o211o021o274m107M52M685P324R007R494Q217P000
$$ 1611686 1600941 1590809 1582661 1576450 1570429 1564155 1560048 1560500 1565185 1572509 1581516 1591010 1599227 1606227
58391A606227Q311J1048J1726R430O010K042l463r715j4316j6674j7801j7286
$$ 1606227 1614538 1625586 1637312 1646742 1652752 1654794 1651331 1641616 1627300 1610626 1592825 1575539
58379A575539j4124r862p151n662l127L28K650L882N690P607P807P031P761R953
$$ 1575539 1561415 1551553 1544402 1538740 1535613 1535941 1538591 1542473 1548163 1555770 1563577 1570608 1578369 1588322
58365A588322J1445J2018J3106J4166J3263J0604P852M934J179j843k641l357
$$ 1588322 1599767 1611785 1624891 1639057 1652320 1662924 1670776 1675710 1676889 1675046 1672405 1669048
58353A669048o635j0671j1958j1158j1187j1423r317o139n218n751m292j186M32
$$ 1669048 1662413 1651742 1639784 1628626 1617439 1606016 1596699 1590560 1585342 1579591 1575299 1574113 1574545
58340A574545R04L007N844O238N304O833R880J0031P561P071R178R944Q724Q942
$$ 1574545 1575449 1578456 1584300 1590538 1595842 1602675 1612555 1622586 1630147 1637218 1646396 1656340 1665064 1674006
58326A674006J0548R520O023N306Q889J2126J2442J2749J4615J5096J2979J1640
$$ 1674006 1684554 1694074 1700097 1705403 1714292 1726418 1738860 1751609 1766224 1781320 1794299 1805939
58314A805939J2895J3975J3114J2548J3677J4637J4623J5453J7178J7446J6516
$$ 1805939 1818834 1832809 1845923 1858471 1872148 1886785 1901408 1916861 1934039 1951485 1968001
58303A968001J7472K0302K1358J9728J8371J8201J7022J5002J4802J5659J4002
$$ 1968001 1985473 2005775 2027133 2046861 2065232 2083433 2100455 2115457 2130259 2145918 2159920
58292B159920J0543R654J1149J0359P215P139J1374J4688J4637J4932J7388J8686
$$ 2159920 2170463 2180117 2191266 2201625 2208840 2215979 2227353 2242041 2256678 2271610 2288998 2307684
58280B307684J7833J8777K2662K5247K4867K5318K8028K9198K7602K7280K9489
$$ 2307684 2325517 2344294 2366956 2392203 2417070 2442388 2470416 2499614 2527216 2554496 2583985
58269B583985K9907K7003K5112K5922K5145K1072J8308J9205J9724J7632J6736
$$ 2583985 2613892 2640895 2666007 2691929 2717074 2738146 2756454 2775659 2795383 2813015 2829751
58258B829751J9104K1072K0828K1808K4903K5730K3504K3925K9050L3127L2994
$$ 2829751 2848855 2869927 2890755 2912563 2937466 2963196 2986700 3010625 3039675 3072802 3105796
58247C105796L3569L8194M2492M3084M3621M6716M8514M6846M6171M8829M9884
$$ 3105796 3139365 3177559 3220051 3263135 3306756 3353472 3401986 3448832 3495003 3543832 3593716
58236C593716M6421M3468M4922M6958M6282M6491N0329N3953N4709N6295O0641
$$ 3593716 3640137 3683605 3728527 3775485 3821767 3868258 3918587 3972540 4027249 4083544 4144185
58225D144185O3334O2658O4235P0885P6946P8532Q0166Q5357R0140R1964R5241
$$ 4144185 4207519 4270177 4334412 4405297 4482243 4560775 4640941 4726298 4816438 4908402 5003643
58214E003643J01850J06149J05724J06925J13448J19910J23080J28416J38706
$$ 5003643 5105493 5211642 5317366 5424291 5537739 5657649 5780729 5909145 6047851
58205F047851J47728J52198J58298J69089J77645J80390J84611J94561K03129
$$ 6047851 6195579 6347777 6506075 6675164 6852809 7033199 7217810 7412371 7615500
58196G615500K05912K10235K21062K31537K37228K45803K62350K79129K90521
$$ 7615500 7821412 8031647 8252709 8484246 8721474 8967277 9229627 9508756 9799277
58187I799277L03833L24388L44555L59180L76650M02708M28767M48784M71480
$$ 9799277 10103110 10427498 10772053 11131233 11507883 11910591 12339358 12788142 13259622
58178A3259622N02801N33112N55925N81948O19467O58484O90275P24649P70973
$$ 13259622 13762423 14295535 14851460 15433408 16052875 16711359 17401634 18126283 18897256
58169A8897256Q20638Q66028R17849R84788J055299J119208J187675J271522J360763
$$ 18897256 19717894 20583922 21501771 22486559 23541858 24661066 25848741 27120263 28481026
58160B8481026J447133J544786J665233J794244J918255K050459K205407K372843
$$ 28481026 29928159 31472945 33138178 34932422 36850677 38901136 41106543 43479386
58152D3479386K544038K737165K966983L217723L477383L767501M104548M467531
$$ 43479386 46023424 48760589 51727572 54945295 58422678 62190179 66294727 70762258
58144G0762258M845126N279904N821900O476156P243318Q167463R287488J0588723
$$ 70762258 75607384 80887288 86709188 93185344 100428662 108596125 117883613 128472336
58136A28472336J2066842J3787047J5807033J8101675K0643473K3470690K6567456
$$ 128472336 140539178 154326225 170133258 188234933 208878406 232349096 258916552
58129B58916552K9795046L3089077L6474666L9391040L9969307L5645851K5193280
$$ 258916552 288711598 321800675 358275341 397666381 437635688 473281539 498474819
58122D98474819J0254463n392574j8211942k6659133l1067197l2495196l1912429
$$ 498474819 508729282 503336708 485124766 458465633 427398436 394903240 362990811
58115C62990811l0080258k7664241k5228608k3142199k1506529k0174960j8904423
$$ 362990811 332910553 305246312 280017704 256875505 235368976 215194016 196289593
58108A96289593j7554090j6144512j4747314j3392653j2103345j0934964r920376
$$ 196289593 178735503 162590991 147843677 134451024 122347679 111412715 101492339
58101A01492339r018815q169256p360741o612114n920367n273003m682996m169853
$$ 101492339 92473524 84304268 76943527 70331413 64411046 59138043 54455047 50285194
58093E0285194l726365l336636l004904k735191k503741k283122k076077j898006
$$ 50285194 46558829 43222193 40217289 37482098 34978357 32695235 30619158 28721152
58085B8721152j743909j599592j468097j357877j259513j159713j065128r88802
$$ 28721152 26977243 25377651 23909554 22551677 21292164 20132451 19067323 18078521
58077A8078521r25761q64054q07091p63300p25967o84668o45358o18485n97703
$$ 18078521 17152760 16288706 15481615 14718315 13992348 13307680 12662322 12043837 11446134
58068A1446134n70201n38113n10660m84827m52805m19508l94245l73162l47453
$$ 11446134 10875933 10337820 9827160 9342333 8889528 8470020 8075775 7702613 7355160
58059G355160l20934l02391k88217k69601k49801k37656k30413k18985k04469
$$ 7355160 7034226 6731835 6443618 6174017 5924216 5686560 5456147 5237162 5032693
58050E032693j94113j86394j74799j61280j52041j45033j34823j24573j20248
$$ 5032693 4838580 4652186 4477387 4316107 4164066 4019033 3884210 3759637 3639389
58041C639389j18328j11893j03484r9443r7116r0352q2226p9506p9461p4872o7367
$$ 3639389 3521061 3409168 3305684 3206241 3109125 3018773 2936547 2857041 2777580 2702708 2635341
58030B635341o3275o0857n4322m6296m3763m5170m3771m0380m0895m4240m4470
$$ 2635341 2572066 2511209 2456887 2410591 2366828 2321658 2277887 2237507 2196612 2152372 2107902
58019B107902m2130m2235m3688m1649l7781l7326l8470l5433k9700k7583k8676
$$ 2107902 2065772 2023537 1979849 1938200 1900419 1863093 1824623 1789190 1759490 1731907 1703231
58008A703231k7264k3294k1672k2278k0712j7553j7125j8393j6628j2886j2529
$$ 1703231 1675967 1652673 1631001 1608723 1588011 1570458 1553333 1534940 1518312 1505426 1492897
57997A492897j5346j6223j4609j4518j6048j5638j3908j4694j6978j6091j2359
$$ 1492897 1477551 1461328 1446719 1432201 1416153 1400515 1386607 1371913 1354935 1338844 1326485
57986A326485j0576j1493j1504j0167j0353j1665j1073r427j0149j2315j2114
$$ 1326485 1315909 1304416 1292912 1282745 1272392 1260727 1249654 1240227 1230078 1217763 1205649
57975A205649j0117r933j0895r440o664o898r707j0683r482r645j1169j0749q869
$$ 1205649 1195532 1185599 1174704 1165264 1158600 1151702 1141995 1131312 1121830 1112185 1101016 1090267 1081398
57962A081398r151j0954j0050o601n213o872p868o987o875p892p299n156m627
$$ 1081398 1072247 1061293 1051243 1044642 1039429 1032557 1024689 1017702 1010827 1002935 995636 990480 985853
57949I85853n832n568l502k707l629l485k010j888l161k988j273q00j510m55K147
$$ 985853 980021 974453 970951 968244 964615 961130 959120 957232 954071 951083 949810 949010 947500 947045 949192
57934I49192K657L77j391j324j662l162l702k706k025j861n48J298J244k34l56
$$ 949192 951849 952226 950835 949511 947849 944687 940985 938279 936254 934393 933845 935143 936387 936153 935797
57919I35797O34j29k390k804r54N0n70k43J508K001P68P64K906M327L434K154
$$ 935797 936431 936302 933912 931108 930154 930204 929634 929391 930899 932900 933668 934432 937338 941665 945099 947253
57903I47253J809J113l94j048n05o62k013k759k459k941m668n753n398m906m627
$$ 947253 949062 950175 949781 948733 948228 947566 945553 942794 940335 937394 932726 926973 921575 916669 912042
57888I12042l282j044M6o18j374j228p98j61J388L514N343P344J0017J1748J1039
$$ 912042 908760 907716 907762 907144 905770 904542 903744 903583 904971 908485 913828 921172 931189 942937 953976
57873I53976R596R872J0820R828P429O023N239K972j52j921l036n665q530q480
$$ 953976 963572 973444 984264 994092 1001521 1007544 1012783 1015755 1015603 1013682 1010646 1004981 996451 987971
57859I87971o311n861p752r020q620q210p798n774l128k501l181k170J03N96j75
$$ 987971 981660 975799 968047 959027 950407 942197 934399 928625 925497 922996 919815 917645 917748 918344 918169
57844I18169J347M952O505N072M038M358L032l63j975m98K85j773l491j990J076
$$ 918169 919516 924468 930973 936045 940083 944441 947473 947110 945135 944637 944922 943149 939658 937668 938744
57829I38744L491N855Q289Q515O109M480N708P239O437M650M087M106L354K409
$$ 938744 942235 948090 956379 964894 971003 975483 981191 988430 994867 999517 1003604 1007710 1011064 1013473
57815A013473J868P37j176k128j574j453k609l114j835m25m3N94K055K543J427
$$ 1013473 1015341 1016078 1014902 1012774 1011200 1009747 1007138 1004024 1002189 1001764 1001721 1002315 1004370 1006913 1008340
57800A008340J205L616O590P284N768L788K308J892L225N636P180P222O797O002
$$ 1008340 1009545 1013161 1019751 1027035 1032803 1036591 1038899 1040791 1044016 1049652 1056832 1064054 1070851 1076853
57786A076853L814R40k41P22J982K982M936P206P192M727K705K434K276J756K608
$$ 1076853 1080667 1081607 1081366 1082088 1084070 1087052 1091988 1099194 1106386 1111113 1113818 1116252 1118528 1120284 1122892
57771A122892M633N095L747L730N639N688K123j346j413j3j11q72n18k48j647
$$ 1122892 1127525 1132620 1136367 1140097 1145736 1151424 1153547 1152201 1150788 1150775 1150664 1149792 1149274 1149026 1147379
57756A147379l332l674l987n763p400o840m955l593k812k562m132p287r020p993
$$ 1147379 1144047 1140373 1136386 1130623 1123223 1116383 1111428 1107835 1105023 1102461 1098329 1091042 1082022 1074029
57742A074029p044q328r311p219m134l652n087n256l797k554j449P86L158L688
$$ 1074029 1066985 1058657 1049346 1042127 1037993 1034341 1029254 1023998 1020201 1017647 1016198 1016984 1020142 1023830
57728A023830L166L923N701O212N216M672N232N641N452N596O315O845P075P602
$$ 1023830 1026996 1030919 1036620 1042832 1048048 1052720 1057952 1063593 1069045 1074641 1080956 1087801 1094876 1102478
57714A102478Q334Q654Q562Q273P404N818M429L890L579L030K995L868M491L963
$$ 1102478 1110812 1119466 1128028 1136301 1143705 1149523 1153952 1157842 1161421 1164451 1167446 1171314 1175805 1179768
57700A179768L018K405J592M71L95J932L495L884M141N144N503M137K825L674
$$ 1179768 1182786 1185191 1186783 1187254 1187649 1189581 1193076 1196960 1201101 1206245 1211748 1215885 1218710 1222384
57686A222384N704O457N608M600L965L404L395M362N148M417K817J942K035K365
$$ 1222384 1228088 1234545 1240153 1244753 1248718 1252122 1255517 1259879 1265027 1269444 1272261 1274203 1276238 1278603
57672A278603K788L321L345K739K687L872N139N268M679L948K444pj841j891j156
$$ 1278603 1281391 1284712 1288057 1290796 1293483 1297355 1302494 1307762 1312441 1316389 1318833 1318826 1316985 1315094 1313938
57657A313938p19K11K330M155M079K973K619L064L502M208N577O665O644O217
$$ 1313938 1313219 1313430 1315760 1319915 1323994 1326967 1329586 1332650 1336152 1340360 1345937 1352602 1359246 1365463
57643A365463N862M580K298J353L142N373N278L692L141L671L720L527M330N255
$$ 1365463 1371325 1375905 1378203 1379556 1382698 1388071 1393349 1397041 1400182 1403853 1407573 1411100 1415430 1420685
57629A420685M466K659K211L315M039L906M393N871P027P540Q804J1543J4744
$$ 1420685 1425151 1427810 1430021 1433336 1437375 1441281 1445674 1451545 1458572 1466112 1474916 1486459 1501203
57616A501203J7416J9676K2002K4929K9320L5368M1571M6352N0398N5726O2419
$$ 1501203 1518619 1538295 1560297 1585226 1614546 1649914 1691485 1737837 1788235 1843961 1906380
57605A906380O7612O7564N9806M4059K2778N13j8660l3085m2654m7264m7458m5368
$$ 1906380 1973992 2041556 2101362 2145421 2168199 2168712 2150052 2116967 2074313 2027049 1979591 1934223
57593A934223m3235m1464l9114l5442l0042k2788j5027r414p118o312m832k879
$$ 1934223 1890988 1849524 1810410 1774968 1744926 1722138 1707111 1697697 1690579 1684267 1679435 1676556
57581A676556j584o48O47J610J473J259K102L020K595J691K012L055L166K811
$$ 1676556 1674972 1674324 1674971 1676581 1678054 1679313 1681415 1684435 1687030 1688721 1690733 1693788 1696954 1699765
57567A699765L973O541P966O798M419K871K643K884K637J688R20J495L161M321
$$ 1699765 1703738 1710279 1718245 1725043 1729462 1732333 1734976 1737860 1740497 1742185 1743105 1744600 1747761 1752082
57553A752082M367M529N468N845M682L374L499M305M439M626O264Q509R245Q201
$$ 1752082 1756449 1760978 1766446 1772291 1776973 1780347 1783846 1788151 1792590 1797216 1803480 1811989 1821234 1829435
57539A829435O963O454O363O402O414N910N001M879N887O375N056L224K878M015
$$ 1829435 1836398 1842852 1849215 1855617 1862031 1867941 1872942 1877821 1883708 1890083 1895139 1898363 1901241 1905256
57525A905256N458O954Q552R364Q836P940P455O807O083O868R011R420O738M414
$$ 1905256 1910714 1917668 1926220 1935584 1944420 1952360 1959815 1966622 1972705 1979573 1988584 1998004 2004742 2009156
57511B009156N698Q232P724M856L778N239O065M941L911M132M451M611N910Q019
$$ 2009156 2014854 2023086 2030810 2035666 2039444 2044683 2050748 2055689 2059600 2063732 2068183 2072794 2078704 2086723
57497B086723Q724P565O591P026Q101R482J1798J4342J5290J4654J4347J5110
$$ 2086723 2095447 2103012 2109603 2116629 2124730 2134212 2146010 2160352 2175642 2190296 2204643 2219753
57485B219753J6132J7681K0900K4776K6616K6021K5351K5677K5421K3674K1717
$$ 2219753 2235885 2253566 2274466 2299242 2325858 2351879 2377230 2402907 2428328 2452002 2473719
57474B473719K0293J8259J5094J2201J0713J0244J0480J1733J3386J4072J3798
$$ 2473719 2494012 2512271 2527365 2539566 2550279 2560523 2571003 2582736 2596122 2610194 2623992
57463B623992J3603J3087J1054Q685Q880J1858J4615J5410J5677J6630J7312J7234
$$ 2623992 2637595 2650682 2661736 2670421 2679301 2691159 2705774 2721184 2736861 2753491 2770803 2788037
57451B788037J7772J9426K0586K0544K0924K2468K3188K1585J9180J7891J7191
$$ 2788037 2805809 2825235 2845821 2866365 2887289 2909757 2932945 2954530 2973710 2991601 3008792
57440C008792J5908J4756J4888J5644J5712J5220J4966J4813J4388J4203J4784
$$ 3008792 3024700 3039456 3054344 3069988 3085700 3100920 3115886 3130699 3145087 3159290 3174074
57429C174074J5744J6629J7453J7746J6749J5210J5067J6458J7094J5694J3969
$$ 3174074 3189818 3206447 3223900 3241646 3258395 3273605 3288672 3305130 3322224 3337918 3351887
57418C351887J3815J4683J5255J5770J6771J7255J6117J4291J3612J4368J5534
$$ 3351887 3365702 3380385 3395640 3411410 3428181 3445436 3461553 3475844 3489456 3503824 3519358
57407C519358J6511J7267J7492J7001J6406J6389J6806J7223J7558J7746J7719
$$ 3519358 3535869 3553136 3570628 3587629 3604035 3620424 3637230 3654453 3672011 3689757 3707476
57396C707476J8086J9680K2081K3900K4876K6001K7130K6482K3528K0549K0025
$$ 3707476 3725562 3745242 3767323 3791223 3816099 3842100 3869230 3895712 3919240 3939789 3959814
57385C959814K1941K4737K7423K9450L0002K8975K7650K7150K7136K6998K7128
$$ 3959814 3981755 4006492 4033915 4063365 4093367 4122342 4149992 4177142 4204278 4231276 4258404
57374D258404K7834K8202K7404K6265K6191K7196K8119K8218K7623K6736K6019
$$ 4258404 4286238 4314440 4341844 4368109 4394300 4421496 4449615 4477833 4505456 4532192 4558211
57363D558211K5932K6377K6686K6550K6345K6313K6164K5806K5614K5748K5991
$$ 4558211 4584143 4610520 4637206 4663756 4690101 4716414 4742578 4768384 4793998 4819746 4845737
57352D845737K6376K6968K7181K6514K5952K7114K9896L2395L3400L3377L2860
$$ 4845737 4872113 4899081 4926262 4952776 4978728 5005842 5035738 5068133 5101533 5134910 5167770
57341E167770L1658L0148K9543L0289L1584L2915L4407L5304L4126L1076K8494
$$ 5167770 5199428 5229576 5259119 5289408 5320992 5353907 5388314 5423618 5457744 5488820 5517314
57330E517314K8032K8959K9944L0785L1506L1574L1047L0999L1804L2377L1922
$$ 5517314 5545346 5574305 5604249 5635034 5666540 5698114 5729161 5760160 5791964 5824341 5856263
57319E856263L0978L0056K8902K7880K8358L0663L3185L4403L4410L3782L2620
$$ 5856263 5887241 5917297 5946199 5974079 6002437 6033100 6066285 6100688 6135098 6168880 6201500
57308F201500L1483L1402L2056L1785L0329K9540L0403L1491L1660L2038L3575
$$ 6201500 6232983 6264385 6296441 6328226 6358555 6388095 6418498 6449989 6481649 6513687 6547262
57297F547262L4764L3855L1768L0665L0882L1258L1402L1605L1376K9987K7986
$$ 6547262 6582026 6615881 6647649 6678314 6709196 6740454 6771856 6803461 6834837 6864824 6892810
57286F892810K6646K6356K6659K7181K7543K7231K6544K6699K8009K9027K8652
$$ 6892810 6919456 6945812 6972471 6999652 7027195 7054426 7080970 7107669 7135678 7164705 7193357
57275G193357K7857K8129K9233K9844K9479K8653K8018K8314L0182L3082L5466
$$ 7193357 7221214 7249343 7278576 7308420 7337899 7366552 7394570 7422884 7453066 7486148 7521614
57264G521614L6770L7966L9398L9878L9124L9147M1371M3901M3631M0037L5101
$$ 7521614 7558384 7596350 7635748 7675626 7714750 7753897 7795268 7839169 7882800 7922837 7957938
57253G957938L0562K7129K5408K5472K5979K5444K4119K3223K2903K2435K1864
$$ 7957938 7988500 8015629 8041037 8066509 8092488 8117932 8142051 8165274 8188177 8210612 8232476
57242H232476K1886K2449K2936K3413K4406K5624K6207K5992K5589K5350K5200
$$ 8232476 8254362 8276811 8299747 8323160 8347566 8373190 8399397 8425389 8450978 8476328 8501528
57231H501528K5078K4798K3933K2629K1946K2548K3565K3641K2595K1314K0422
$$ 8501528 8526606 8551404 8575337 8597966 8619912 8642460 8666025 8689666 8712261 8733575 8753997
57220H753997J9862J9357J8712J8053J8060J9335K1311K2670K3127K3718K5062
$$ 8753997 8773859 8793216 8811928 8829981 8848041 8867376 8888687 8911357 8934484 8958202 8983264
57209H983264K6449K7061K6793K5541K3167K0582J9214J8737J7078J3561J0208
$$ 8983264 9009713 9036774 9063567 9089108 9112275 9132857 9152071 9170808 9187886 9201447 9211655
57198I211655Q791Q372P248N752N550P272J0316J3902J7181J9427K1396K5235
$$ 9211655 9220446 9228818 9236066 9241818 9247368 9254640 9264956 9278858 9296039 9315466 9336862 9362097
57186I362097L1623L8247M2498M4571M6422M8684N0202M9908M7804M4685M1924
$$ 9362097 9393720 9431967 9474465 9519036 9565458 9614142 9664344 9714252 9762056 9806741 9848665
57175I848665M0631M0232L8783L5614L2357L0477K9203K7149K4490K2033J9460
$$ 9848665 9889296 9929528 9968311 10003925 10036282 10066759 10095962 10123111 10147601 10169634 10189094
57164A0189094J6083J2330Q970N815K528k56j908k975m069m672m210l241k357
$$ 10189094 10205177 10217507 10226477 10232292 10234820 10234564 10232656 10229681 10225612 10220940 10216730 10213489 10211132
57151A0211132j124P87K759M749P977J2490J5808J6203J5877J8387K3707K8307
$$ 10211132 10210008 10210795 10213554 10218303 10226280 10238770 10254578 10270781 10286658 10305045 10328752 10357059
57139A0357059K9662K8506K6791K5531K4851K4368K3156K0505J6855J3036Q686
$$ 10357059 10386721 10415227 10442018 10467549 10492400 10516768 10539924 10560429 10577284 10590320 10599006
57128A0599006K603n321j3492k0227k5364l0224l6238m3614n1362n8699o5917
$$ 10599006 10601609 10596288 10582796 10562569 10537205 10506981 10470743 10427129 10375767 10317068 10251151
57117A0251151p3170p9116q2187q2955q3576q4920q5978q6005q5180q2900p7679
$$ 10251151 10177981 10098865 10016678 9933723 9850147 9765227 9679249 9593244 9508064 9425164 9347485
57106I347485o9448n9969n0358m0320l0461k2966j8875j6841j5709j6165j8497
$$ 9347485 9278037 9218068 9167710 9127390 9096929 9073963 9055088 9038247 9022538 9006373 8987876
57095H987876k0615j9862j5313p322L337J4769K4117K9568L0821K7256J7762L185
$$ 8987876 8967261 8947399 8932086 8924764 8928101 8942870 8966987 8996555 9027376 9054632 9072394 9075579
57083I075579j3410k9973m6917o4524q1111r4919j05939j15044j23193j31891
$$ 9075579 9062169 9032196 8985279 8920755 8839644 8744725 8638786 8523742 8400549 8268658
57073H268658j42303j53597j64391j75872j90703k08968k28430k48760k71832
$$ 8268658 8126355 7972758 7808367 7632495 7441792 7232824 7004394 6755634 6483802
57064F483802k97561l23487l49046l76469m06908m39829m76717n20795n72188
$$ 6483802 6186241 5862754 5513708 5137239 4730331 4290502 3813785 3292990 2720802
57055B720802o27853o87129F52924a73776r07876r98112j101862j221338j356480
$$ 2720802 2092949 1405820 652924 -173776 -1081652 -2079764 -3181626 -4402964 -5759444
57046e759444j509934j685979j884105k099600k329717k572077k818842l063430
$$ -5759444 -7269378 -8955357 -10839462 -12939062 -15268779 -17840856 -20659698 -23723128
57038b3723128l314738l595769l927895m325953m806170n382601o051741o793789
$$ -23723128 -27037866 -30633635 -34561530 -38887483 -43693653 -49076254 -55127995 -61921784
57030f1921784p592805q445318r354354j0337762j1444597j2736873j4239186
$$ -61921784 -69514589 -77959907 -87314261 -97652023 -109096620 -121833493 -136072679
57023a36072679j5901053j7560100j8862170j9224199j8025585j5004455j0506292
$$ -136072679 -151973732 -169533832 -188396002 -207620201 -225645786 -240650241 -251156533
57016b51156533n294536j09280M572630Q441526J1227007J2787461J3268206J3059912
$$ -251156533 -256451069 -256560349 -251987719 -243546193 -232319186 -219531725 -206263519 -193203607
57008a93203607J2574170J2071368J1651269J1315899J1016542J0693375J0314792
$$ -193203607 -180629437 -168558069 -156906800 -145590901 -134574359 -123880984 -113566192
57001a13566192R881688R398799Q863783Q285546P689007P093158O500652N914057
$$ -113566192 -103684504 -94285705 -85421922 -77136376 -69447369 -62354211 -55853559 -49939502
56993d9939502N345842M806008M294445L812376L369274K972142K618220K303703
$$ -49939502 -44593660 -39787652 -35493207 -31680831 -28311557 -25339415 -22721195 -20417492
56985b0417492K030243J797845J599839J429575J284727J161521J052454R53553
$$ -20417492 -18387249 -16589404 -14989565 -13559990 -12275263 -11113742 -10061288 -9107735
56977i107735Q67033P93411P27568O65658O09310N59823N14265M70491M30252
$$ -9107735 -8240702 -7447291 -6719723 -6054065 -5444755 -4884932 -4370667 -3900176 -3469924
56968c469924L94287L59832L26078K97016K75586K59484K45686K35025K28997
$$ -3469924 -3075637 -2715805 -2389727 -2092711 -1817125 -1557641 -1311955 -1076930 -847933
56959h47933K24888K16145J95403e4282D8215M1806j0162C4366c2049p8150q3078
$$ -847933 -623045 -406900 -211497 -54282 48215 90021 79859 34366 -32049 -110199 -193277
56948a93277q3024q1727q1954q3072q3625q3790q3947q3318q1258p7714p2097
$$ -193277 -276301 -358028 -439982 -523054 -606679 -690469 -774416 -857734 -938992 -1016706 -1088803
56937a088803o4310n6812n2448n0116m5951l8946l1815k6046k0069j3129p061
$$ -1088803 -1153113 -1209925 -1262373 -1312489 -1358440 -1397386 -1429201 -1455247 -1475316 -1488445 -1495506
56926a495506k937O55M796Q585J1293J3217J3728J1422P017L240J199k91j409
$$ -1495506 -1498443 -1497788 -1492992 -1484407 -1473114 -1459897 -1446169 -1434747 -1427730 -1424490 -1423291 -1423582 -1424991
56913a424991o12K055M203M726N371P711J1131J4620J7989K0742K2200K3319K5890
$$ -1424991 -1425603 -1423548 -1419345 -1414619 -1409248 -1401537 -1390406 -1375786 -1357797 -1337055 -1314855 -1291536 -1265646
56900a265646K9600L2337L3497L4271L4624L2970K9077K4350J9154J2923P012
$$ -1265646 -1236046 -1203709 -1170212 -1135941 -1101317 -1068347 -1039270 -1014920 -995766 -982843 -975831
56889i75831M025L832L573K104J210J976L372N144Q555J3274J6843J8309J9398
$$ -975831 -971806 -967974 -964401 -962297 -961087 -959111 -955739 -950595 -942040 -928766 -911923 -893614 -874216
56876h74216K1251K3099K4973K8409L3368L7561L9760M0567L9082L2536K0923
$$ -874216 -852965 -829866 -804893 -776484 -743116 -705555 -665795 -625228 -586146 -553610 -532687
56865e32687Q601m92o403j0574j2855j3046j2500j2093j0824q177n706m718m511
$$ -532687 -524086 -524578 -530981 -541555 -554410 -567456 -579956 -592049 -602873 -611050 -616756 -621474 -625985
56852f25985m121l526k095J480O285R066Q530P270P689Q738Q587P957Q412R511
$$ -625985 -630106 -633632 -635727 -634247 -627962 -618896 -610366 -603096 -595407 -586669 -578082 -570125 -561713 -552202
56838e52202J0064J0524J1836J3344J3882J3897J4608J6024J7276J8151J9089
$$ -552202 -542138 -531614 -519778 -506434 -492552 -478655 -464047 -448023 -430747 -412596 -393507
56827c93507K0445K2415K4646K5504K3207J8182J2722P916K891k490o434p860
$$ -393507 -373062 -350647 -326001 -300497 -277290 -259108 -246386 -238470 -235579 -238069 -244503 -252363
56815b52363q104q721r220q228n507j766K236N771Q601J1780J6550K2246K7066
$$ -252363 -260467 -269188 -278408 -286636 -292143 -293909 -291673 -285902 -277301 -265521 -248971 -226725 -199659
56802a99659L0914L5334M0411M4046d427C7118L4567K3191R777j344q268j2556
$$ -199659 -168745 -133411 -93000 -48954 -4427 37118 71685 94876 104653 103309 95041 82485
56790H2485j5202j4866j1345p465n364l503M60O014J1098J5227J9368K4151K9787
$$ 82485 67283 52417 41072 33607 28243 24740 25200 31214 42312 57539 76907 101058 130845
56777A30845L6260M2492M6743M8840N0219N0829M8039L9633K6206R808p559k3344
$$ 130845 167105 209597 256340 305180 355399 406228 454267 493900 520106 529914 522355 499011
56765D99011l4842m1498m4846m5477m2530l6777l1132k6788k1854j5155q343k562
$$ 499011 464169 422671 377825 332348 289818 253041 221909 195121 173267 158112 149769 147207
56753A47207L699J1330J8210K2504K5628K9527L3345L5063L4053K9699K0267N958
$$ 147207 150906 162236 180446 202950 228578 258105 291450 326513 360566 390265 410532 416490
56741D16490r177k1170k9944l6759m0411l9267l5069l1162k8171k4536k0101j6117
$$ 416490 407313 386143 356199 319440 279029 239762 204693 173531 145360 120824 100723 84606
56729H4606j2598q590m350p67K630O619J0182J1918J2757J4683J7190J7432J3656
$$ 84606 72008 63418 59068 58301 60931 67550 77732 89650 102407 117090 134280 151712 165368
56716A65368O585k164j1168j8975k4481k7501k8193k6734H451a4306k2462k1477
$$ 165368 171953 169789 158621 139646 115165 87664 59471 32737 8451 -14306 -36768 -58245
56704e8245j8635j5317j3003j1051q660o852o457o040m239k301k017k793l197
$$ -58245 -76880 -92197 -105200 -116251 -124911 -131763 -138220 -144260 -148499 -150800 -152817 -155610 -158807
56691a58807l551m388m163j596J216J278q53k134j640r47p27k12M06R1o84n15
$$ -158807 -162358 -166746 -170909 -172505 -171289 -170011 -170864 -172998 -174638 -175585 -176312 -176524 -176118 -176027 -176711 -177226
56675a77226J30o03k776m418m517l843k941j676p10j031j844j234Q73K540K855
$$ -177226 -177096 -177699 -180475 -184893 -189410 -193253 -196194 -197870 -198580 -199611 -201455 -202689 -201816 -199276 -196421
56660a96421L001L855M514L870K213P08L08J294K949L745K868J290M96O84J191
$$ -196421 -193420 -189565 -185051 -181181 -178968 -178260 -177952 -176658 -173709 -169964 -167096 -165806 -165310 -164626 -163435
56645a63435J811K437K273R34k92J69K125M254O036P592Q384P785O416N462N106
$$ -163435 -161624 -159187 -156914 -155980 -156272 -156103 -153978 -149724 -143688 -136096 -127712 -119927 -113511 -108049 -102943
56630a02943M812M594M776N147N432N845O260N932M887M272M365L883K438J737
$$ -102943 -98131 -93537 -88761 -83614 -78182 -72337 -66077 -60145 -55258 -50986 -46621 -42738 -40300 -38563
56616c8563K822M017L460J877R00M08l58q26l18L73N91J128K079J798J82K29L316
$$ -38563 -35741 -31724 -28264 -26387 -25487 -25079 -25437 -26263 -26581 -26208 -25617 -24489 -22410 -20612 -20430 -20201 -16885
56599a6885N794L967l2j506k12N14j8L40J492J092n18l63J705K312J92j865j843
$$ -16885 -11091 -7124 -7156 -8662 -8874 -8360 -8378 -8038 -6546 -5454 -5972 -6335 -4630 -2318 -2126 -3991 -5834
56582e834j193j381j402n65l80j780l085k577r90M5K49J82R2J87O39R69O82M25
$$ -5834 -7027 -8408 -9810 -10375 -10755 -12535 -15620 -18197 -19187 -19142 -18893 -18711 -18619 -18432 -17793 -16824 -16142 -15717
56564a5717R48J471J049P67K084L765b161b79A602L746M638L203J210R3q06j770
$$ -15717 -14769 -13298 -12249 -11482 -9398 -5633 -2161 -279 1602 5348 9986 13189 14399 14492 13686 11916
56548A1916j782r89j158k568B069f85k174k201j685p20j168k958l127k59L058
$$ 11916 10134 9145 7987 5419 2069 -685 -2859 -5060 -6745 -7465 -8633 -11591 -14718 -14977 -11919
56533a1919M125L663e82B874K112L0j221j081J13J926L337L048J380K99P03J438
$$ -11919 -7794 -4131 -582 2874 4986 5016 3795 2714 2827 4753 8090 11138 12518 12817 13520 14958
56517A4958J790K657M344N446N255N126O018O739O131N104M915N150M950M660
$$ 14958 16748 19405 23749 29195 34450 39576 45594 52333 58464 63568 68483 73633 78583 83243
56503H3243M786M934N059O254Q869J1333J2152J1779J1203J0205Q272O061M541
$$ 83243 88029 92963 98022 104276 113145 124478 136630 148409 159612 169817 178089 184150 188691
56490A88691L723L225K994K710J651O8o58j06J61j369m133o288o544m767j907
$$ 188691 192414 195639 198633 201343 202994 203062 202404 202298 202459 201090 196957 190669 184125 179358 177451
56475A77451K91N83m06j134j349k013l274m279m847n457n657m560k885k297k736
$$ 177451 177742 178325 177919 176785 175436 173423 170149 165870 161023 155566 149909 145349 142464 140167 137431
56460A37431k645j838j609k050j953j518k243l772l954k572j825k485k786j985
$$ 137431 134786 132948 131339 129289 127336 125818 123575 119803 115849 113277 111452 108967 106181 104196
56446A04196j589j959j299N19P45j716l961l521j943j548j660q20k6p29j790j310
$$ 104196 102607 100648 99349 99868 100613 98897 94936 91415 89472 87924 86264 85444 85418 84689 82899 81589
56430H1589J74R92J242J938K724K727K396K371J953O37l19K30J300J568J589K277
$$ 81589 81763 82755 83997 85935 88659 91386 93782 96153 98106 98743 98424 98654 99954 101522 103111 105388
56414A05388K719J720J49k66N28J438K087K477K011O05l77J32J318J976K235K482
$$ 105388 108107 109827 109976 109710 110238 111676 113763 116240 118251 118856 118479 118611 119929 121905 124140 126622
56398A26622K112Q89J16Q93K425L354L421K759J253l43m64P84J310L69L6J757
$$ 126622 128734 129623 129739 130632 133057 136411 139832 142591 143844 143501 143037 143821 145131 145500 145536 147293
56382A47293L832M146L215K534J950Q64J38O50J526J638J249N77j187l764m953
$$ 147293 151125 155271 158486 161020 162970 163834 163972 164622 166148 167786 169035 169612 168425 164661 159708
56367A59708l841k613l063l681k513n80K13L27J047J715J374J193K426L687L165
$$ 159708 155867 153254 150191 146510 143997 143417 143630 143957 145004 146719 148093 149286 151712 155399 158564
56352A58564J810J367J057o47k574k704k151l624o628p719n400j824L93O30l40
$$ 158564 160374 161741 162798 162151 159577 156873 154722 151098 144470 136751 131351 129527 129920 130550 130210
56337A30210j212o14J519L449L862L628L917M011K830J111J45k12l50N34K584
$$ 130210 128998 128384 129903 133352 137214 140842 144759 148770 151600 152711 152856 152644 152294 152828 155412
56322A55412L868L168K311L172M313L477J572J022J720J886J591K085K743K069
$$ 155412 159280 162448 164759 167931 172244 175721 177293 178315 180035 181921 183512 185597 188340 190409
56308A90409Q59J083K366K654J732J068R20N57O52K350M577N203M382L868L743
$$ 190409 191268 192351 194717 197371 199103 200171 201091 201648 202300 204650 209227 214430 218812 222680 226423
56293B26423K852J868K604M474M810K850O82J18J005K611M259M750L376J475R88
$$ 226423 229275 231143 233747 238221 243031 245881 246563 246681 247686 250297 254556 259306 262682 264157 265145
56278B65145J867K677L074L646M106L854L516L816L828K498R43R63K194L013L216
$$ 265145 267012 269689 272763 276409 280515 284369 287885 291701 295529 298027 298970 299933 302127 305140 308356
56263C08356L637M139M197M304M748M398K789J656K141K564J531J027L223O466
$$ 308356 311993 316132 320329 324633 329381 333779 336568 338224 340365 342929 344460 345487 348710 355176
56249C55176P889P910Q404Q471O279L513L443N592O673O067O191P987J0002J1486
$$ 355176 363065 370975 379379 387850 394129 397642 401085 406677 413350 419417 425608 433595 443597 455083
56235D55083J2719J2902J1438J0476J2336J5215J5411J3058J1661J2594J4259
$$ 455083 467802 480704 492142 502618 514954 530169 545580 558638 570299 582893 597152
56224E97152J6000J8585K1125K1727K1023K1186K1917K1313K0138K0957K3484
$$ 597152 613152 631737 652862 674589 695612 716798 738715 760028 780166 801123 824607
56213H24607K5074K5488K6861K9319L0935L1823L3990L7363M0188M2901M7230
$$ 824607 849681 875169 902030 931349 962284 994107 1028097 1065460 1105648 1148549 1195779
56202A195779N2014N4621N6036N9703O5708P1251P6452Q4192R4168J02863J09895
$$ 1195779 1247793 1302414 1358450 1418153 1483861 1555112 1631564 1715756 1809924 1912787 2022682
56191B022682J18606J29598J39290J46190J53126J61740J69823J75643J80077
$$ 2022682 2141288 2270886 2410176 2556366 2709492 2871232 3041055 3216698 3396775
56182C396775J82924J81831J76364J68605J58534J43493J23349J01243P7978N0912
$$ 3396775 3579699 3761530 3937894 4106499 4265033 4408526 4531875 4633118 4711096 4762008
56172D762008K0046r899l5623n8690q0868j00756j17181j31433j43877j52456
$$ 4762008 4782054 4772155 4736532 4677842 4596974 4496218 4379037 4247604 4103727 3951271
56162C951271j56645j58879j60282j59020j54549j49309j44565j38758j31531
$$ 3951271 3794626 3635747 3475465 3316445 3161896 3012587 2868022 2729264 2597733
56153B597733j25043j19763j13458j05892r9914r6232r1836q5405p9380p4847
$$ 2597733 2472690 2352927 2239469 2133577 2033663 1937431 1845595 1760190 1680810 1605963
56143A605963o9327o1873n5341n1228m7049m1382l6696l4535l2538k9007k5989
$$ 1605963 1536636 1474763 1419422 1368194 1321145 1279763 1243067 1208532 1175994 1146987 1120998
56132A120998k4964k3786k0691j7338j5285j3403j1100j0014j0239r188o293m428
$$ 1120998 1096034 1072248 1051557 1034219 1018934 1005531 994431 984417 974178 964990 958697 954269
56120I54269m605m056j769q31k635l777j678J475L226M467N752N063K380J590
$$ 954269 949664 945608 943839 943008 940373 936596 934918 936393 939619 944086 949838 954901 957281 958871
56106I58871M565P968R097J0057J2900J5548J6105J6507J8389J9811J9654K0541
$$ 958871 963436 971404 980501 990558 1003458 1019006 1035111 1051618 1070007 1089818 1109472 1130013
56094A130013K3959K7062K7824K8711L1803L4989L6689L9522M5527N2388N8023
$$ 1130013 1153972 1181034 1208858 1237569 1269372 1304361 1341050 1380572 1426099 1478487 1536510
56083A536510O4142P1719P8123Q2570Q9109R9918J10727J17236J20849J23544
$$ 1536510 1600652 1672371 1750494 1833064 1922173 2022091 2132818 2250054 2370903 2494447
56073B494447J22398J14530J02820R1549Q0602O8888N9068N3656N0167M4866L7703
$$ 2494447 2616845 2731375 2834195 2925744 3006346 3075234 3134302 3187958 3238125 3282991 3320694
56062C320694K9523J8789N417o577j4689k1873l0922l9766m6727n5225o8222q2651
$$ 3320694 3350217 3369006 3374423 3367846 3353157 3331284 3300362 3260596 3213869 3158644 3090422 3007771
56050C007771r4235j03111j10060j12250j07873j00368r3177q4952p4441o4743
$$ 3007771 2913536 2810425 2700365 2588115 2480242 2379874 2286697 2201745 2127304 2062561
56040B062561n7890n0675m0907l2246k7634k3798j7660j2188j0145q195l331Q96
$$ 2062561 2004671 1953996 1913089 1880843 1853209 1829411 1811751 1799563 1789418 1781223 1777892 1778788
56028A778788R75J84K346M908M934N702J0351J5049J5684J5261J7408J9034J7099
$$ 1778788 1779763 1779947 1782293 1787201 1792135 1797837 1808188 1823237 1838921 1854182 1871590 1890624 1907723
56015A907723J6089K0380K5575K6118K5305K8485L2492L1609K8661L0091L4603
$$ 1907723 1923812 1944192 1969767 1995885 2021190 2049675 2082167 2113776 2142437 2172528 2207131
56004B207131L6502L6097L7346L9344L9201L9166M2109M4416M1989L8396L8470
$$ 2207131 2243633 2279730 2317076 2356420 2395621 2434787 2476896 2521312 2563301 2601697 2640167
55993B640167L9293L6550L3932L6494M0580M0455L9221M2546M7474M8394M8467
$$ 2640167 2679460 2716010 2749942 2786436 2827016 2867471 2906692 2949238 2996712 3045106 3093573
55982C093573N3645O0735O2991O2457O5245O9685P0846P1447P6397Q1944Q2360
$$ 3093573 3147218 3207953 3270944 3333401 3398646 3468331 3539177 3610624 3687021 3768965 3851325
55971C851325Q1771Q6948R4317R7107R9147J07656J18333J22224J22015J26672
$$ 3851325 3933096 4020044 4114361 4211468 4310615 4418271 4536604 4658828 4780843 4907515
55961D907515J35204J40723J45239J54788J65101J68327J69134J77704J91593
$$ 4907515 5042719 5183442 5328681 5483469 5648570 5816897 5986031 6163735 6355328
55952F355328K01194K08326K21896K39728K52744K63103K80018L01323L17555
$$ 6355328 6556522 6764848 6986744 7226472 7479216 7742319 8022337 8323660 8641215
55943H641215L30521L49495L72772L91638M08426M31730M58416M79858N00730
$$ 8641215 8971736 9321231 9694003 10085641 10494067 10925797 11384213 11864071 12364801
55934A2364801N31129N65738N92465O15917O49593O90870P27812P64693Q14993
$$ 12364801 12895930 13461668 14054133 14670050 15319643 16010513 16738325 17503018 18318011
55925A8318011Q74745R29502R82406J047901J123414J196303J272754J368932
$$ 18318011 19192756 20122258 21104664 22152565 23275979 24472282 25745036 27113968
55917B7113968J479339J586014J692995J817879J956658K093766K239637K418604
$$ 27113968 28593307 30179321 31872316 33690195 35646853 37740619 39980256 42398860
55909D2398860K626775K844166L080086L359956L676436M006835M372953M828426
$$ 42398860 45025635 47869801 50949887 54309843 57986279 61993114 66366067 71194493
55901G1194493N393872O064075O868194P851961R009669J0314805J1812535J3596417
$$ 71194493 76588365 82652440 89520634 97372595 106382264 116697069 128509604 142106021
55893A42106021J5707183J8154087K0999229K4261307K7748837L1178217L4397863
$$ 142106021 157813204 175967291 196966520 221227827 248976664 280154881 314552744
55886C14552744L7071168L7930335L4823661K6230441J2954054j953318j5118414
$$ 314552744 351623912 389554247 424377908 450608349 463562403 461609085 446490671
55879D46490671k4689517l0562121l3446215l4097573l3158294l1178524k8563123
$$ 446490671 421801154 391239033 357792818 323695245 290536951 259358427 230795304
55872B30795304k5589203k2512873j9577298j6920586j4568894j2527878j0813180
$$ 230795304 205206101 182693228 163115930 146195344 131626450 119098572 108285392
55865A08285392r403989q248691p323029o620751o088103n630229n188534m761985
$$ 108285392 98881403 90632712 83309683 76688932 70600829 64970600 59782066 55020081
55857E5020081m353869l950892l557695l200720k887419k600322k335588k109085
$$ 55020081 50666212 46715320 43157625 39956905 37069486 34469164 32133576 30024491
55849C0024491j920522j748442j585550j445330j329830j223261j121504j037005
$$ 30024491 28103969 26355527 24769977 23324647 21994817 20771556 19650052 18613047
55841A8613047r70149r04998q37811p82140p41432p02890o62578o30873o08621
$$ 18613047 17642898 16737900 15900089 15117949 14376517 13673627 13011049 12380176 11771555
55832A1771555n82403n48342n17602m93726m66744m34122m05966l84577l59417
$$ 11771555 11189152 10640810 10123208 9629482 9162738 8728616 8322650 7938073 7578656
55823G578656l27274k98022k75654k52190k25005k02152j86143j69761j52314
$$ 7578656 7251382 6953360 6677706 6425516 6200511 5998359 5812216 5642455 5490141
55814E490141j43198j45116j49727j53574j62238j75015j81614j78494j73463
$$ 5490141 5346943 5201827 5052100 4898526 4736288 4561273 4379659 4201165 4027702
55805D027702j70299j63574j52319j43711j39092j30956j17886j08300j05164
$$ 4027702 3857403 3693829 3541510 3397799 3258707 3127751 3009865 2901565 2796401
55796B796401j01066r2798q6929q6151q3598p5771o8449o4807o0075n2787m9062
$$ 2796401 2695335 2602537 2515608 2429457 2345859 2270088 2201639 2136832 2076757 2023970 1974908
55785A974908n0687n0767m6301m3505m5603m6633m2797l8988l8573l7133l2014
$$ 1974908 1924221 1873454 1827153 1783648 1738045 1691412 1648615 1609627 1571054 1533921 1501907
55774A501907k8098k8487k8829k6198k4551k6131k6409k2777j9654j9971j9883
$$ 1501907 1473809 1445322 1416493 1390295 1365744 1339613 1313204 1290427 1270773 1250802 1230919
55763A230919j6820j4685j6080j7310j5842j5098j7139j8023j5151j2109j1898
$$ 1230919 1214099 1199414 1183334 1166024 1150182 1135084 1117945 1099922 1084771 1072662 1060764
55752A060764j2121j0918j0615j1654j0031m813j192k065l363j654M77M86M98
$$ 1060764 1048643 1037725 1027110 1015456 1005425 1000612 999420 997355 993992 992338 992815 993301 993799
55739I93799J946K169J42q92j15j718p115j1404j1486j1031j3256j5382j4628
$$ 993799 995745 997914 998056 997164 997049 995331 988216 976812 965326 954295 941039 925657 911029
55726I11029j3366j3888j4056j2439j1918j3946j5033j3199j2129j4602j7282
$$ 911029 897663 883775 869719 857280 845362 831416 816383 803184 791055 776453 759171
55715G59171j6540j4172j2961j1644q634n884m932l705j118j28k475n067n319
$$ 759171 742631 728459 715498 703854 695220 689336 684404 680699 679581 679453 676978 671911 666592
55702F66592n287o901q016p003o436q291j0076r589r048j0634j2351j2034j1155
$$ 666592 661305 654404 646388 639385 632949 624658 614582 604993 595945 585311 572960 560926 549771
55689E49771j1112j0127p350n545o196o479m568l243m594n967n106m524o501q361
$$ 549771 538659 528532 521182 515637 509441 502962 498394 495151 490557 484590 479484 474960 468459 460098
55675D60098p160m872m474m858l969l120l896m540l603l417n673p413n822l342
$$ 460098 452938 448066 443592 438734 434765 431645 427749 423209 419606 416189 410516 403103 397281 393939
55661C93939l419m715m233k902l128l752k386k96k59j622j864j047o67n9K036
$$ 393939 390520 385805 381572 378670 375542 371790 369404 369108 368849 367227 365363 364316 363649 363590 365626
55646C65626M119L936K156O83q19l381n632n598l971k649j861j439k710n966q159
$$ 365626 369745 373681 375837 376520 375701 372320 366688 361090 357119 354470 352609 351170 348460 342494 334335
55631C34335o379k014J332K490K705K728K495K325K289J856J493K618M769N511
$$ 334335 327956 325942 327274 329764 332469 335197 337692 340017 342306 344162 345655 348273 353042 358553
55617C58553M328L514L814K897l2k123j761j531l568n754n663m530m084l036k62
$$ 358553 362881 366395 370209 373106 373074 370951 369190 367659 364091 358337 352674 348144 344060 341024 340762
55602C40762J902J319j25Q8Q92L92k09P32J644O73m59N00J895R25j428k244j624
$$ 340762 342664 343983 343858 343946 344838 345230 345021 345753 347397 348070 347611 348111 350006 350931 349503 347259 345635
55585C45635j825l061l845m138m897n757n985o262p042p014n574m626n470o354
$$ 345635 343810 340749 336904 332766 327869 322112 316127 309865 302823 295809 290235 285609 280139 273785
55571B73785n666m716m696l910j077J642K227K320L656M170J630j710k491j656
$$ 273785 268119 263403 258707 254797 253720 255362 257589 259909 263565 267735 269365 267655 265164 263508
55557B63508k131l469l312k308k894m689n325m719m601m958m543l656l180k266
$$ 263508 261377 257908 254596 252288 249394 244705 239380 234661 230060 225102 220559 216903 213723 211457
55543B11457k34J074J25j137m23P83p3j922k119j126j071j470o72J86r52k769
$$ 211457 211223 212297 212422 211285 210862 211645 211572 209650 207531 206405 205334 203864 203192 203378 202426 199657
55527A99657k516r62j081k909l857l141j917j80K463M139K963Q15Q88K635L219
$$ 199657 197141 196179 195098 192189 188332 185191 183274 183094 185557 189696 192659 193474 194362 196997 200216
55512B00216K598K865L757L396K421K824L581K091q13j973j331j595l060l627
$$ 200216 202814 205679 209436 212832 215253 218077 221658 223749 222936 220963 219632 218037 214977 211350
55498B11350l537n035p413p493n345m502n828o067l549p34L47J010K656M198M311
$$ 211350 207813 202778 195365 187872 182527 178025 172197 166130 162581 161847 162194 163204 165860 170058 174369
55483A74369L275J557p07k185j253J042J848O92j94J95N54L32M69P90pj397j417
$$ 174369 177644 179201 178494 176309 175056 176098 177946 178638 178444 178639 179193 179525 179994 180784 180777 179380 177963
55466A77963k85k38j403j513k29k1j901l846m405m436m297k765m8J453P07m88
$$ 177963 177678 177440 176037 174524 174295 174274 172373 168527 164122 159686 155389 152624 152576 154029 154736 154248
55450A54248q22j261k316k563j444q17j995l485l262j383Q23K404K648J159j058
$$ 154248 153426 152165 149849 147286 145842 145025 143030 139545 136283 134900 135723 138127 140775 141934 140876
55435A40876k125j521l22Q26K096K994K616J479Q90O45m41j987k526k307k864
$$ 140876 138751 137230 136908 137734 139830 142824 145440 146919 147809 148454 148013 146026 143500 141193 138329
55420A38329l985m022l050k718l039k560j647k121l395k691K18K228J737P22Q20
$$ 138329 134344 130322 127272 124554 121515 118955 117308 115187 111792 109101 109319 111547 113284 114006 114826
55405A14826Q24m07j740k066k066k215j636l20K38k04O4J358J476o73k926l075
$$ 114826 115650 115243 113503 111437 109371 107156 105520 105200 105438 105234 105298 106656 108132 107459 104533 101458
55389A01458j682k29J056J947J329p00k025j528p29q53n86J387L704M244L035
$$ 101458 99776 99547 100603 102550 103879 103179 101154 99626 98897 98044 97458 98845 102549 106793 109828
55374A09828J409j31j396j419J65J722J336p49k619k957j869k70P87Q71N83N86
$$ 109828 111237 111106 109710 108291 108456 110178 111514 110765 108146 105189 103320 103050 103837 104708 105291 105877
55358A05877M17n47j320l68J795L013K509J394K95j078j923o91J933L046J422
$$ 105877 106294 105747 104427 104059 105854 108867 111376 112770 113065 111987 110064 109373 111306 114352 115774
55343A15774r27j902j696j253o29M1J25r9M29J446J516P82J027K367K608Q50r45
$$ 115774 114847 112945 111249 109996 109367 109408 109533 109434 109863 111309 112825 113607 114634 117001 119609 120459 119514
55326A19514j191q18q48m34J010K048J416O3n99q08j294j697j455r14l86M86J559
$$ 119514 118323 117505 116657 116223 117233 119281 120697 120760 120161 119353 118059 116362 114907 113993 113607 114093 115652
55309A15652J870J250O36L04m70j575j949j679k040k955k761j091M87J192J941
$$ 115652 117522 118772 119408 119712 119242 117667 115718 114039 111999 109044 106283 105192 105679 106871 108812
55294A08812K909K951K157K088K726K200L98l84N29R20j79o94M20Q50r83k872
$$ 108812 111721 114672 116829 118917 121643 123843 124241 123857 124386 125306 125127 124433 124853 125703 124720 121848
55278A21848k433q76n44j226j552j652j878j242M17J020m24j426L04L029L724
$$ 121848 119415 118539 117995 116769 115217 113565 111687 110445 110862 111882 111458 110032 110336 113365 117089
55263A17089K622K000K173J810Q68K70k36j250j839q46Q49J515J021K56n53j201
$$ 117089 119711 121711 123884 125694 126562 126832 126596 125346 123507 122661 123510 125025 126046 126302 125749 124548
55247A24548p64O07Q66q70k354j479L78O98l12q32o89p68o32M35J341Q27n7K45
$$ 124548 123784 124391 125257 124387 122033 120554 120932 121630 121318 120486 119797 119029 118397 118832 120173 121000 120943 121188
55229A21188R48N03l29Q9J056P55l84o23k00o12j419j002J82K10q26j063l16k38
$$ 121188 122136 122639 122310 122399 123455 124210 123826 123203 123003 122391 120972 119970 120152 120362 119536 118473 118157 117919
55211A17919j151j669j473j619j912q17J628L416L570L169K915K134P73J05M38
$$ 117919 116768 115099 113626 112007 110095 109278 110906 114322 117892 121061 123976 126110 126883 126988 127426
55196A27426J13k013m465m646j818J954L556J681j570k565k81K369K276k2j684
$$ 127426 127539 125526 121061 116415 114597 116551 120107 121788 120218 117653 117372 119741 122017 121995 120311
55181A20311j458l88M62Q22M22o71j254l28J178J667J206Q78N63n93k087k558
$$ 120311 118853 118465 118927 119749 120171 119500 118246 117918 119096 120763 121969 122847 123410 122817 120730 118172
55165A18172k041j656j401l13J354K131J541N26k36p40n90O13J992K200J386P48
$$ 118172 116131 114475 113074 112761 114115 116246 117787 118313 118077 117337 116747 117360 119352 121552 122938 123686
55149A23686M26l81j440j514l52J003J786J908J078o91k017j497J6L58q08j643
$$ 123686 124112 123731 122291 120777 120425 121428 123214 125122 126200 125509 123492 121995 122011 122369 121561 119918
55133A19918j021J79Q38R77R97R57R76J103P86l79j467j160K12R34J90j051j371
$$ 119918 118897 119076 119914 120891 121888 122845 123821 124924 125710 125331 123864 122704 122916 123850 124040 122989 121618
55116A21618j55K193M189M052J698o37j007j73M3k06N50K156K807J827L18q31
$$ 121618 121463 123656 127845 131897 133595 132958 131951 131778 131821 131615 132165 134321 137128 138955 139273 138442
55100A38442j742k268j830p56j05M7P10K155L309L159J776o4j351j388o90p30
$$ 138442 136700 134432 132602 131846 131741 131788 132498 134653 137962 141121 142897 142833 141482 140094 139404 138674
55084A38674j830k323j045N71N09r95k387l285l865l068j40K941L377J457j07
$$ 138674 136844 134521 133476 134047 134556 133561 131174 127889 124024 120956 120816 123757 127134 128591 128484
55069A28484l47o26j385j348l04J84n01j006l91O22J293J696J557L05j238j380
$$ 128484 128137 127511 126126 124778 124474 124658 124157 123151 122760 123382 124675 126371 127928 128233 126995 125615
55053A25615k34K43o04j001M72K795L998L317J344o01r86O29K650L091J937N49
$$ 125615 125381 125624 125020 124019 124491 127286 131284 134601 135945 135344 134358 134987 137637 140728 142665 143214
55037A43214o76k123l078k420r13l28n15J38J532K012J634K246L879M245K545
$$ 143214 142538 140415 137337 134917 134004 133676 133161 133299 134831 136843 138477 140723 144602 148847 151392
55022A51392Q24M96M60k21o22k48m23j706k373j146P08J547J683J886J538Mj742
$$ 151392 152216 152712 153172 152951 152329 152081 151658 149952 147579 146433 147141 148688 150371 152257 153795 153799 152057
55005A52057k451k178j406j69R34O05r83j738o32O84N73j67k15j11q32j409j71
$$ 152057 149606 147428 146022 145853 146787 147392 146409 144671 144039 144723 145296 145129 144914 144803 143971 142562 142391
54988A42391K477M282L665J073j623k372o70J464J529j08p69K86O74j007k745
$$ 142391 144868 149150 152815 153888 152265 149893 149223 150687 152216 152108 151339 151625 152299 151292 148547
54973A48547k521j530j608j697P0K474K585J97k029k448j726n71J074K459K194
$$ 148547 146026 144496 142888 141191 141261 143735 146320 146517 144488 142040 140314 139743 140817 143276 145470
54958A45470O47n1Q23J285k67k213j580J857M889M433R22k506l543k556r49R18
$$ 145470 146117 146066 146889 148174 147907 145694 144114 145971 150860 155293 156215 153709 150166 147610 146661 147579
54942A47579L164M814M493K605J180J366K331K836K451J095j059k772k507o50
$$ 147579 150743 155557 160050 162655 163835 165201 167532 170368 172819 173914 172855 170083 167576 166926
54928A66926N64or92p96K44Q55N73l72j560k007p61J331K030P86l09K99J422J443
$$ 166926 167490 167484 166492 165696 165940 166795 167368 166996 165436 163429 162668 163999 166029 166815 166506 166805 168227 169670
54910A69670J024J576K628K703J703N70m86j595k036j213j31p2m86M0J357K082
$$ 169670 170694 172270 174898 177601 179304 179874 179388 177793 175757 174544 174413 174341 173855 173895 175252 177334
54894A77334J821J359J009N34L61J067J895J492Q3o63o8Q07R77O93N36N40N64
$$ 177334 179155 180514 181523 182057 182418 183485 185380 186872 186955 186292 186224 187031 188008 188701 189237 189777 190341
54877A90341N22K06l07j26J474L585M385L520K597K987M243N133N272N126N199
$$ 190341 190863 191069 190762 190636 192110 195695 200080 203600 206197 209184 213427 218560 223832 228958 234157
54862B34157N847P317R145R969Q822O539N098N167N081K873j063m371n669n975
$$ 234157 240004 247321 256466 266435 275257 281796 286894 292061 297142 300015 298952 294581 288912 282937
54848B82937o730p700p863p317o892o544n751n089n588o598o187m002j921j286
$$ 282937 276207 268507 260644 253327 246435 239891 234140 229051 223463 216865 210678 206676 204755 203469
54834B03469j167k10J282K183K288K220K376K754L123K938J936J091J887M291
$$ 203469 202302 202092 203374 205557 207845 210065 212441 215195 218318 221256 223192 224283 226170 230461
54820B30461O656P948Q619Q959Q302O635N269M901M529L329K030J185k56l067
$$ 230461 237117 245065 253684 262643 270945 277580 282849 287750 292279 295608 297638 298823 298567 295500
54806B95500n859o878o636o976q232r123q970q412q092p866p196n558k907m13
$$ 295500 289641 282763 276127 269151 260919 251796 242826 234414 226322 218456 211260 205702 202795 202382
54792B02382N4j792l769l786k453j902k679l357k935k063j759j958j759o40Q16
$$ 202382 202436 200644 196875 193089 190636 188734 186055 182698 179763 177700 175941 173983 172224 171584 172400
54777A72400J315L01j182j588p04M88J463K305K359P01j747k593j299m5k95n90
$$ 172400 173715 174016 172834 171246 170542 171030 172493 174798 177157 177858 176111 173518 172219 172174 171879 171289
54761A71289O70K279K111L67j114j620j619j129n4O41J21o41k18R05J205P56Q78
$$ 171289 171959 174238 176349 176716 175602 173982 172363 171234 171180 171821 171942 171301 171083 171988 173193 173949 174827
54744A74827J720K205K237K796L733L487J385j276k965l447l206k485j400k39
$$ 174827 176547 178752 180989 183785 187518 191005 192390 191114 188149 184702 181496 179011 177611 177372
54730A77372Q15J850K941L987M567L987K006k36j020k30M87K84M48K017L633L423
$$ 177372 178187 180037 182978 186965 191532 195519 197525 197289 196269 196039 196526 196810 197258 199275 202908 206331
54714B06331K038J803L395N154N650N420N903P573R407R815Q373O660O530P451
$$ 206331 208369 210172 213567 218721 224371 229791 235694 243267 252674 262489 270862 277522 284052 291503
54700B91503O958M197J307K43K7j476m463p497r455r676p553l851j209j412l153
$$ 291503 298461 302658 303965 304208 304235 302759 298296 290799 281344 271668 264115 260264 259055 257643 254490
54685B54490m139m185m297m147k848j214p84j230j007r8K01k99n93l76K6J082
$$ 254490 250351 246166 241869 237722 234874 233660 232876 231646 230639 230541 230742 230443 229850 229474 229500 230582
54669B30582L261N367N889N527O057P203P216O200O156P599Q645P826N588K707
$$ 230582 233843 239210 245099 250626 256683 263886 271102 277302 283458 291057 299702 307528 313116 315823
54655C15823m98l118l999l740m412o680q892r445q580p474o931p124p352o285
$$ 315823 315325 312207 308208 304468 300056 293376 284484 275039 266459 258985 252054 244930 237578 231293
54641B31293l758j796k206l769l861k223q34n58m13k6j78q10j015j152k404m115
$$ 231293 227535 225739 223533 219764 215903 213680 212846 212288 211875 211849 211671 210861 209846 208694 206290 202175
54625B02175m195k468r87o41k23O12L96j273k657k718k460k408j402P33J980J146
$$ 202175 197980 195512 194525 193884 193661 194273 194669 193396 190739 188021 185561 183153 181751 182484 184464 185610
54609A85610j07Q5J172J664J397P73l89j759k054j112o59j582k323j509k81k46
$$ 185610 185503 185588 186760 188424 189821 190594 190205 188446 186392 185280 184621 183039 180716 179207 178926 178680
54593A78680q24o43KK6k76J8N71N37L82J108K292K555J527Lj292j891j267L33
$$ 178680 177856 177213 177215 177241 176965 176983 177554 178091 178473 179581 181873 184428 185955 185958 184666 182775 181508 181841
54575A81841J391P64o19r23K09J502J825J158J60m00k16N0o34k067k742j910o78
$$ 181841 183232 183996 183377 182454 182663 184165 185990 187148 187308 186908 186692 186742 186108 184041 181299 179389 178711
54558A78711k65l02J39Q01P34q9o90k42J281L202M443M378L578K872J854l01k553
$$ 178711 178446 178144 178283 179084 179818 179729 179039 178797 180078 183280 187723 192101 195679 198551 200405 200104 197551
54541A97551k617m63J028N5j610j731j049j401k110j093J327K615J913J133J763
$$ 197551 194934 194471 195499 195554 193944 192213 191164 189763 187653 186560 187887 190502 192415 193548 195311
54526A95311K814K784J882J140N86m43j744k211j330L7O55L34p4L6K85J30j47
$$ 195311 198125 200909 202791 203931 204517 204074 202330 200119 198789 198826 199481 199815 199741 199777 200062 200192 200045
54509B00045J30R47J695K028J927J215l9r61p72M6N76J059K218L313K794Q76m23
$$ 200045 200175 201122 202817 204845 206772 207987 207948 206987 206215 206261 206837 207896 210114 213427 216221 217097 216674
54492B16674j75M29M18L94Q78J291J577K816M948N788L933J125k4N36Q84J74p13
$$ 216674 216499 216928 217346 217740 218618 219909 221486 224302 229250 235038 238971 240096 240072 240608 241492 241666 240953
54475B40953r34n03L25J198J465P88k63r59j232j174n11P16J703J770J080n0j563
$$ 240953 240019 239516 239841 241039 242504 243292 243029 242070 240838 239664 239153 239869 241572 243342 244422 244372 242809
54458B42809k912l086k096j269j422j873j976k225k885k957j746j54P18J101J512
$$ 242809 239897 236811 234715 233446 232024 230151 228175 225950 223065 220108 218362 218208 218926 220027 221539
54443B21539J478O65Q2O52J575J612R94O90N72q7j017j262n61O89K128L053K356
$$ 221539 223017 223682 223764 224416 225991 227603 228597 229287 229859 229772 228755 227493 226932 227621 229749 232802 235158
54426B35158J15j738j655m08M65J020K068L027K668J458J217K532M057M388L466
$$ 235158 235273 233535 231880 231472 231937 232957 235025 238052 240720 242178 243395 245927 249984 254372 257838
54411B57838K149J345J398J681J302O54J251L294M722L827J569mm50o44r10j137
$$ 257838 259987 261332 262730 264411 265713 266367 267618 270912 275634 279461 281030 281026 280576 279932 279022 277885
54395B77885j613k169j425J295M148M646K612k62k791m454m410k560p95r13j880
$$ 277885 276272 274103 272678 273973 278121 282767 285379 285117 282326 277872 273462 270902 270107 269194 267314
54380B67314j364N71J702J098q6j111k476l984m309l004j190J13P68O87q7m73
$$ 267314 265950 266521 268223 269321 269235 268124 265648 261664 257355 254351 253161 253274 254042 254729 254642 254169
54364B54169O23K371K875K023J507J939K081J235L26nm42j429k247k350k158j778
$$ 254169 254792 257163 260038 262061 263568 265507 267588 268823 269149 269144 268702 267273 265026 262676 260518 258740
54348B58740n51J437K735K251O05q01j117j67J559K777K442J178N93J112J781
$$ 258740 258189 259626 262361 264612 265217 264416 263299 263132 264691 267468 269910 271088 271681 272793 274574
54333B74574K187K840L502K933J022n76o81r2J7j98j00P1k46q26j016o21J48J005
$$ 274574 276761 279601 283103 286036 287058 286482 285801 285709 285726 285528 285428 285499 285253 284427 283411 282790 282938 283943
54315B83943J447J108N47Q43K051L033L153L154L745M316L834K356J018P64J474
$$ 283943 285390 286498 287045 287888 289939 292972 296125 299279 303024 307340 311174 313530 314548 315312 316786
54300C16786K037J348m49j911k087j799k275l024k498o89N13k35k218l945m703
$$ 316786 318823 320171 319722 317811 315724 313925 311650 308626 306128 305439 305952 305717 303499 299554 294851
54285B94851m462l425k180j414j220j341j991l325m365l831k154j220j825k798
$$ 294851 290389 286964 284784 283370 282150 280809 278818 275493 271128 267297 265143 263923 262098 259300
54271B59300k955k519k109j656r90l92K9O02J354J772J552Q29k59j227r00J091
$$ 259300 256345 253826 251717 250061 249071 248679 248708 249310 250664 252436 253988 254817 254558 253331 252431 253522
54255B53522K852K099n09k088j662j238k072k533j015J299K346K122J841J621
$$ 253522 256374 258473 257964 255876 254214 252976 250904 248371 247356 248655 251001 253123 254964 256585
54241B56585R84M89R82J918K151J757J516J181n3j737k493k014j341j149j031
$$ 256585 257569 258058 259040 260958 263109 264866 266382 267563 267510 265773 263280 261266 259925 258776 257745
54226B57745o42l83n93r17q15k85J52K9n24o92K10J709K493J947Q38J62k7k69
$$ 257745 257103 256720 256127 255210 254395 254110 254262 254291 253767 253075 253285 254994 257487 259434 260272 260434 260407 260138
54208B60138p56j298j639j471p38j02l06q07j07J966L493K879J131M89J445K387
$$ 260138 259382 258084 256445 254974 254236 254134 253828 253021 252914 254880 258373 261252 262383 262872 264317 266704
54192B66704J920L98q57r72n7J050J414P76l17j190j600j560j159q15j065j794
$$ 266704 268624 269022 268165 267193 267136 268186 269600 270376 270059 268869 267269 265709 264550 263735 262670 260876
54176B60876k254k208k273k674k463q20J492K855K634J598P62N36P91J111J094
$$ 260876 258622 256414 254141 251467 249004 248184 249676 252531 255165 256763 257525 258061 258852 259963 261057
54161B61057Q29Q60J284J279P3j881l249l282k449j705j485j464j095l43J85M2
$$ 261057 261886 262746 264030 265309 265382 263501 260252 256970 254521 252816 251331 249867 248772 248429 248614 248656
54145B48656l41j42P06J457J608J353R92N26J04J36O43J064R50L52n53j538k055
$$ 248656 248315 248173 248879 250336 251944 253297 254289 254815 254919 255055 255698 256762 257712 258064 257511 255973 253918
54128B53918j705j073j130j574j013Q19K252J912P13N73J938L638M540M329L045
$$ 253918 252213 251140 250010 248436 247423 248242 250494 252406 253119 253692 255630 259268 263808 268137 271182
54113B71182J030p75j428r69k46J69L89O18O71J97q28j838j975j024qk82j890
$$ 271182 272212 271437 270009 269040 268794 268963 269352 269970 270641 270838 270010 268172 266197 265173 265165 264883 262993
54096B62993l416l675k820j581l14O94Q74K30j74M29J199O92j065k520k550j535
$$ 262993 259577 255902 253082 251501 251187 251881 252755 252985 252811 253240 254439 255131 254066 251546 248996 247461
54080B47461l55O72J505J773J234N52P88J962K741K067O26K7N78J000N01Q5Q93
$$ 247461 247106 247778 249283 251056 252290 252842 253630 255592 258333 260400 261026 261053 261631 262631 263132 263217 264110
54063B64110K174K151N77r39j092k85M90R97J568K233K615K423J774J195J227
$$ 264110 266284 268435 269012 268073 266981 266696 267186 268183 269751 271984 274599 277022 278796 279991 281218
54048B81218J835K453K771K980K938K079P75P08K592M548M284K219O51L78J42
$$ 281218 283053 285506 288277 291257 294195 296274 297049 297757 300349 304897 309181 311400 312051 312429 312571
54033C12571p33j383j283j096j145q29o8L37K22L20N88N6j088j224J76J513J409
$$ 312571 311838 310455 309172 308076 306931 306102 306034 306371 306593 306913 307501 307557 306469 305245 305421 306934 308343
54016C08343M45l12p03o09N69K451L444L034K658L168L293J915M5j047j827k851
$$ 308343 308788 308476 307773 307164 307733 310184 313628 316662 319320 322488 325781 327696 327741 326694 324867 322016
54000C22016k858p06K095L121K353J717K004K340K215K055K036J957K073K665
$$ 322016 319158 318452 320547 323668 326021 327738 329742 332082 334297 336352 338388 340345 342418 345083
53986C45083L106K746K309L071M972O810P931Q542Q701Q213P305O522O222O737
$$ 345083 348189 350935 353244 356315 361287 368097 376028 384570 393271 401484 408789 415311 421533 428270
53972D28270Q288J0151J0953J0577J0483J1262J1503J0267Q903Q636Q194O107
$$ 428270 436558 446709 457662 468239 478722 489984 501487 511754 520657 529293 537487 543594
53960E43594L768L510M671M521K407K50q10j395j724j286r56k578n812p929p618
$$ 543594 547362 550872 555543 560064 562471 562721 561911 560516 558792 557506 556550 553972 548160 540231 532613
53945E32613o737p331q924r931r879r069p574n784m732m762m918m541m382n187
$$ 532613 525876 518545 509621 499690 489811 480742 473168 467384 462652 457890 452972 448431 444049 438862
53931D38862o246o330n318m041l143k830l161l851m187l686k559j305k72K51J14
$$ 438862 432616 426286 420968 416927 413784 410954 407793 403942 399755 396069 393510 392205 391933 392184 392298
53916C92298l48n50l73j69m7L05J077K248L900O036Q191R844J1025J1992J2513
$$ 392298 391950 391400 391027 390858 390811 391116 392193 394441 398341 404377 412568 422412 433437 445429 457942
53901D57942J2110J0617P945L974n10l587m275m140n305p304p686n621k946j377
$$ 457942 470052 480669 488614 492588 492078 488491 484216 480076 474771 467467 459781 454160 451214 449837
53887D49837m70R30K736M038M485M530M815N760P147Q057P880P296P358P799P425
$$ 449837 449367 450297 453033 457071 461556 466086 470901 476661 483808 491865 499745 507041 514399 522198 529623
53872E29623O146N245N387N750N495M947M714M669M468M377M954O330Q106R595
$$ 529623 535769 541014 546401 552151 557646 562593 567307 571976 576444 580821 585775 592105 600211 609806
53858F09806J0194J0019R864J0085R982R182Q866J0348J2903J4562J4692J4163
$$ 609806 620000 630019 639883 649968 659950 669132 677998 688346 701249 715811 730503 744666
53846G44666J3229J1242Q609O921O474N501K799l94k177k447k480l033l882m604
$$ 744666 757895 769137 777746 784667 791141 796642 799441 799047 796870 794423 791943 788910 785028 780424
53832G80424n030n298n852o974q289r401j0733j2723j4401j4306j2822j2053j2945
$$ 780424 775394 770096 764244 757270 748981 739580 728847 716124 701723 687417 674595 662542 649597
53819F49597j4111j4000j2746j1315j0239r806j0070j0018q305n573m382n784
$$ 649597 635486 621486 608740 597425 587186 577380 567310 557292 548987 543414 539032 533248
53807E33248p627p624o559o677q072q770p784o185n176m764m585m758n393o073
$$ 533248 525621 517997 511438 504761 496689 487919 480135 473950 468774 464010 459425 454667 449274 443201
53793D43201o262n884n277m735m201l384k311j545j571k006k064j637j330j434
$$ 443201 436939 431055 425778 421043 416842 413458 411147 409602 408031 406025 403961 402324 400994 399560
53779C99560j729k299l567n301o396n919l874r78J602K602J802O43N33R24N49
$$ 399560 397831 395532 391965 386664 380268 374349 370475 369497 371099 373701 375503 376146 376679 377603 378152
53764C78152Q6J454M236N403L520R57N11J772K566K419K506L264L980M203L957
$$ 378152 378238 379692 383928 389331 392851 393808 394319 396091 398657 401076 403582 406846 410826 415029 418986
53749D18986L098J872J601L296N938P484P376O865P103Q039R054R682R764R660
$$ 418986 422084 423956 425557 428853 434791 442275 449651 456516 463619 471658 480712 490394 500158 509818
53735E09818J0039J0821J0827R323P334O443O666O651N630M129K865J901R49k32
$$ 509818 519857 530678 541505 550828 558162 564605 571271 577922 583552 587681 590546 592447 593396 593164
53721E93164j683k992l421k881k465l240m921o393p283q108r160j0033j0246r698
$$ 593164 591481 588489 585068 582187 579722 576482 571561 565168 557885 549777 540617 530584 520338 510640
53707E10640q611p503p021p175p016n699l757k683l316n063o651p143o331m653
$$ 510640 502029 494526 487505 480330 473314 467615 463858 461175 457859 452796 446145 439002 432671 428018
53693D28018k868j663j412k094l194l846l617l125l234l768l697k684j540r67
$$ 428018 425150 423487 422075 419981 416787 412941 409324 406199 402965 399197 395500 392816 391276 390309
53679C90309p34l39K70R41J479J411M98m70l75N85J110P60L43J97k13n75M82K981
$$ 390309 389575 389236 389506 390447 391926 393337 393835 393365 392990 393575 394685 395445 395788 395985 395772 395197 395679 398660
53661C98660M747M252K680J862J742J525J786L332M936M474J925m92j054L9J729
$$ 398660 403407 407659 410339 412201 413943 415468 417254 420586 425522 429996 431921 431429 430375 430414 432143
53646D32143L145L771L679L510L566L385K980L450N273O938O757N220M075L876
$$ 432143 435288 439059 442738 446248 449814 453199 456179 459629 464902 471840 478597 483817 487892 491768
53632D91768L958M084M394M236K929J286P03R99Q23r9q27j052j298j438q09K45
$$ 491768 495726 499810 504204 508440 511369 512655 513358 514357 515180 515081 514254 513202 511904 510466 509657 509902
53616E09902P41Q82J724K972L112J921R51J046J223O79M7j02m10j351k036j428
$$ 509902 510643 511525 513249 516221 519333 521254 522205 523251 524474 525153 525200 525098 524688 523337 521301 519873
53600E19873P7J145R23m08j777j743N8J953J842m8j416r89J93R24J476K341L026
$$ 519873 519950 521095 522018 521610 519833 518090 518148 520101 521943 521895 520479 519490 519683 520607 522083 524424 527450
53583E27450L197L556M436M761L671K230K133L485M966N577N188M024K678K112
$$ 527450 530647 534203 538639 543400 547071 549301 551434 554919 559885 565462 570650 574674 577352 579464
53569E79464K673L544L917M087M508M648L916L045L145L750L318J689O59J752
$$ 579464 582137 585681 589598 593685 598193 602841 606757 609802 612947 616697 620015 621704 622363 624115
53555F24115M437O986Q210P909O373M356L151L864O251Q536Q824O846M211K802
$$ 624115 628552 635538 643748 651657 658030 662386 665537 669401 675652 684188 693012 699858 704069 706871
53541G06871K971L544L399K586J871J739K094K508K469J718O86K50P39J430J359
$$ 706871 709842 713386 716785 719371 721242 722981 725075 727583 730052 731770 732456 732706 733445 734875 736234
53526G36234M10p77j669k149k157j665j123j367k671m184m798m489m241m490m286
$$ 736234 736644 735867 734198 732049 729892 728227 727104 725737 723066 718882 714084 709595 705354 700864 696578
53511F96578k600o9J471J312P77J337K584K860J440p55k443l189l190k544j179
$$ 696578 693978 693909 695380 696692 697469 698806 701390 704250 705690 704935 702492 699303 696113 693569 692390
53496F92390O70K186K452J369n5o86l72M01J612L494N345N979N705O256P961Q707
$$ 692390 693060 695246 697698 699067 699012 698326 697954 698355 699967 703461 708806 714785 720490 726746 734707 743414
53480G43414P124N197N661P907R014Q329Q281J0347J2862J3793J3606J3980J5221
$$ 743414 750538 755735 761396 769303 778317 786646 794927 805274 818136 831929 845535 859515 874736
53467H74736J6397J7071J7626J8498J9980K2138K4292K5357K5300K5331K6068
$$ 874736 891133 908204 925830 944328 964308 986446 1010738 1036095 1061395 1086726 1112794
53456A112794K6614K6397K6697K9003L2627L5494L6751L7277L7780L8092L8345
$$ 1112794 1139408 1165805 1192502 1221505 1254132 1289626 1326377 1363654 1401434 1439526 1477871
53445A477871L9288M0901M1860M1267M0029L9597L9885L9509L7960L6348L5702
$$ 1477871 1517159 1558060 1599920 1641187 1681216 1720813 1760698 1800207 1838167 1874515 1910217
53434A910217L5437L4478L3250L3282L4765L5874L5060L3015L1350L0311K9127
$$ 1910217 1945654 1980132 2013382 2046664 2081429 2117303 2152363 2185378 2216728 2247039 2276166
53423B276166K8070K8390L0061L1145L0093K7531K5119K3523K2308K1103J9944
$$ 2276166 2304236 2332626 2362687 2393832 2423925 2451456 2476575 2500098 2522406 2543509 2563453
53412B563453J8669J6747J3712R616N116J165j767m193o945j0095j3076j5731
$$ 2563453 2582122 2598869 2612581 2622197 2627313 2628478 2626711 2622518 2615573 2605478 2592402 2576671
53400B576671j8352k0679k1917k2056k2182k2967k3793k4028k4372k5978k8772
$$ 2576671 2558319 2537640 2515723 2493667 2471485 2448518 2424725 2400697 2376325 2350347 2321575
53389B321575l1435l2777l2588l1402l0064k9230k8805k7997k6272k3912k1425
$$ 2321575 2290140 2257363 2224775 2193373 2163309 2134079 2105274 2077277 2051005 2027093 2005668
53378B005668j8901j6327j3949j1894r822p463n002k580R9L152N975P975R449
$$ 2005668 1986767 1970440 1956491 1944597 1934775 1927312 1922310 1919730 1919829 1922981 1928956 1936931 1946380
53365A946380J1170J3356J5555J7314J8567J9708K1541K4691K8685L2163L4426
$$ 1946380 1957550 1970906 1986461 2003775 2022342 2042050 2063591 2088282 2116967 2149130 2183556
53354B183556L6189L8371M0818M2959M4880M6950M8919N0472N2123N4483N7016
$$ 2183556 2219745 2258116 2298934 2341893 2386773 2433723 2482642 2533114 2585237 2639720 2696736
53343B696736N8778O0140O2391O5692O8911P1725P5387Q0580Q5741Q8641Q8894
$$ 2696736 2755514 2815654 2878045 2943737 3012648 3084373 3159760 3240340 3326081 3414722 3503616
53332C503616Q7916Q6933Q6234Q6063Q6902Q8428Q9205Q8071Q5394Q2398P9596
$$ 3503616 3591532 3678465 3764699 3850762 3937664 4026092 4115297 4203368 4288762 4371160 4450756
53321D450756P6570P3022O9262O5461O1173N6061N0427M4586L8118L0607K2725
$$ 4450756 4527326 4600348 4669610 4735071 4796244 4852305 4902732 4947318 4985436 5016043 5038768
53310E038768J5689R738L900k697j0210j8781k8700l9410m9416n7824o5034p1241
$$ 5038768 5054457 5064195 5068095 5065398 5055188 5036407 5007707 4968297 4918881 4861057 4796023 4724782
53298D724782p5390p6795p6987p8403q1475q4436q5926q6360q6460q5837q3748
$$ 4724782 4649392 4572597 4495610 4417207 4335732 4251296 4165370 4079010 3992550 3906713 3822965
53287C822965q0376p6637p3429p1441p0966p1275p0869o8941o6146o3368o0551
$$ 3822965 3742589 3665952 3592523 3521082 3450116 3378841 3307972 3239031 3172885 3109517 3048966
53276C048966n7405n4490n2453n0692m8073m4737m1859l9558l6546l2272k8130
$$ 3048966 2991561 2937071 2884618 2833926 2785853 2741116 2699257 2659699 2623153 2590881 2562751
53265B562751k5672k4627k3713k2627k2141k2564k3168k3033k1655j9043j6002
$$ 2562751 2537079 2512452 2488739 2466112 2443971 2421407 2398239 2375206 2353551 2334508 2318506
53254B318506j3991j3672j3774j2452r675p113n640m288k005P66K972M286M925
$$ 2318506 2304515 2290843 2277069 2264617 2254942 2247829 2242189 2237901 2235896 2236662 2239634 2243920 2248845
53241B248845N174N913Q667J3955K0129K4729K6778K7079K7015K7727K9777L2569
$$ 2248845 2254019 2259932 2268599 2282554 2302683 2327412 2354190 2381269 2408284 2436011 2465788 2498357
53229B498357L4549L4926L4656L4830L4795L3214L0475K8373K7456K6253K3513
$$ 2498357 2532906 2567832 2602488 2637318 2672113 2705327 2735802 2764175 2791631 2817884 2841397
53218B841397J9883J6791J4569J2290Q845L841k105p663j1820j4741j7339k0218
$$ 2841397 2861280 2878071 2892640 2904930 2913775 2917616 2915511 2907848 2896028 2881287 2863948 2843730
53206B843730k3512k7342l1660l5784l8909m0944m2238m2952m3502m4916m7534
$$ 2843730 2820218 2792876 2761216 2725432 2686523 2645579 2603341 2560389 2516887 2471971 2424437
53195B424437m9886n0418m9875n0188n1115n0317m7192m4334m4113m5614m6381
$$ 2424437 2374551 2324133 2274258 2224070 2172955 2122638 2075446 2031112 1986999 1941385 1895004
53184A895004m5710m4594m3468m1866l9838l8281l7776l7999l8188l7634l6039
$$ 1895004 1849294 1804700 1761232 1719366 1679528 1641247 1603471 1565472 1527284 1489650 1453611
53173A453611l3936l2338l1502l0499k8482k5710k2906k0315j8016j6427j5734
$$ 1453611 1419675 1387337 1355835 1325336 1296854 1271144 1248238 1227923 1209907 1193480 1177746
53162A177746j5439j5194j5442j6552j7937j8950j9973k1686k3666k4702k4301
$$ 1177746 1162307 1147113 1131671 1115119 1097182 1078232 1058259 1036573 1012907 988205 963904
53151I63904k3062k1678k0284j8711j6910j5289j4747j5892j7856j8604j6984
$$ 963904 940842 919164 898880 880169 863259 847970 833223 817331 799475 780871 763887
53140G63887j4058j1916j1682j3079j5153j6739j6911j5695j3991j2396j0825
$$ 763887 749829 737913 726231 713152 697999 681260 664349 648654 634663 622267 611442
53129F11442r513r177r555r139p500o498p658r462r196o841m945m857n297m980
$$ 611442 601929 592752 583197 574058 566558 560060 552402 542940 533744 526903 521958 517101 511804 506824
53115E06824m598n208o234o278n058l521k508k095j981j936j998k396l130l664
$$ 506824 502226 497018 490784 484506 479448 475927 473419 471324 469343 467407 465409 463013 459883 456219
53101D56219l430k585j802j260m65R25K565L723L663J930j006l486m003k982k303
$$ 456219 452789 450204 448402 447142 446677 447602 450167 453890 457553 459483 458477 454991 450988 448006 445703
53086D45703k707k792j274O85P76j248l054k690q55N65J198K131L550M065K918
$$ 445703 442996 440204 438930 439615 440391 439143 436089 433399 432544 433109 434307 436438 439988 444053 446971
53071D46971J407J130J713J569L73o96q96o01q0R42K107K360J639J307K175L347
$$ 446971 448378 449508 451221 452790 453163 452467 451571 450970 450890 451832 453939 456299 457938 459245 461420 464767
53055D64767L749L553L177K171L35j205j484j315k000l102l211k359j928k428
$$ 464767 468516 472069 475246 477417 477752 476547 475063 473748 471748 468646 465435 463076 461148 458720
53041D58720k945k896k793k957k811j938q59l78p55j781k875l121k072n88j40
$$ 458720 455775 452879 450086 447129 444318 442380 441521 441143 440388 438607 435732 432611 430539 429951 429811
53026D29811r98j960k012j518j364j557j283k21P56N45n52p72Q37K570J843j187
$$ 429811 428813 426853 424841 423323 421959 420402 419119 418898 419654 420199 419647 418875 419712 422282 424125 422938
53010D22938l505l343k501l256m736m509k488p89k17N14J954K777K021N58m43
$$ 422938 419433 416090 413589 410333 405597 401088 398600 397811 397594 398108 400062 402839 404860 405418 404975
52995D04975r34j113p07P0J75q03j801j720p29M50J583K632L260L236K638J353
$$ 404975 404041 402928 402221 402291 402466 401663 399862 398142 397413 397863 399446 402078 405338 408574 411212 412565
52979D12565o57k344k111J0J973K203J404R98J048Q86O80R74J264M85j237k616
$$ 412565 411908 409564 407453 407463 409436 411639 413043 414041 415089 415975 416655 417629 418893 419378 418141 415525
52963D15525k932k729k620k319j173P99K729L624L259K386J888J800J500Q07J98
$$ 415525 412593 409864 407244 404925 403752 404551 407280 410904 414163 416549 418437 420237 421737 422544 422742
52948D22742k36j136k627l497k550l27J399J726J291Q94L58p07j712j465K55K108
$$ 422742 422506 421370 418743 415246 412696 412369 413768 415494 416785 417679 418037 417330 415618 414153 414408 416516
52932D16516K589J741J035J558K801L386K576Q00q31j173K09K395L642L189K141
$$ 416516 419105 420846 421881 423439 426240 429626 432202 433002 432171 430998 431207 433602 437244 440433 442574
52917D42574J952K521K648J912R99M13M6k8L78N87m90k559l700k668m90Q19N02
$$ 442574 444526 447047 449695 451607 452606 453019 453065 453037 453415 454002 453512 450953 447253 444585 444095 444914 445416
52900D45416o15j304q46O16J999J955K17k053l511l808l282k143n69Q18J303Q42
$$ 445416 444801 443497 442651 443267 445266 447221 447438 445385 441874 438066 434784 432641 432072 432890 434193 435035
52884D35035P5l88n22p07j088j200m87O64J034R2j191j673j579j756k012j492
$$ 435035 435110 434722 434200 433493 432405 431205 430718 431382 432416 432508 431317 429644 428065 426309 424297 422805
52868D22805l28M42N73P39R91O40j20k46J74k39j665k294j123K66J70m97K03J979
$$ 422805 422477 422919 423492 424231 425222 425862 425742 425496 425670 425431 423766 421472 420349 420615 420785 420288 420491 422470
52850D22470K684J452m43j638j969j639o53N70J159Q32J38m09p43o19L52J729
$$ 422470 425154 426606 426163 424525 422556 420917 420264 420834 421993 422825 422963 422554 421811 421192 421544 423273
52834D23273K134Q31j022j374M33K762L328J631n66j305o16l5l18n49J45J061
$$ 423273 425407 426238 425216 423842 424275 427037 430365 431996 431430 430125 429509 429474 429156 428607 428752 429813
52818D29813P98q02k314k200k58K255L696L546K898L061L797L759K711K119K979
$$ 429813 430611 429809 427495 425295 425037 427292 430988 434534 437432 440493 444290 448049 450760 452879 455858
52803D55858M190M064K641J253M41m27j631k522k735k904l690m718n156m999n154
$$ 455858 460048 464112 466753 468006 468447 468020 466389 463867 461132 458228 454538 449820 444664 439665 434511
52788D34511o096o860n986l475j165p07j716k610k754k636k373j546n85p32k099
$$ 434511 428415 421555 415569 412094 410929 410222 408506 405896 403142 400506 398133 396587 396002 395270 393171
52773C93171l227l178k712k561k091p25P52J573K434L887M628L238Q05m00l20
$$ 393171 389944 386766 384054 381493 379402 378677 379429 381002 383436 387323 391951 395189 395994 395594 395274
52758C95274q25k186k362m36J553J452L1l97P46K018K379K341K647L034K719J402
$$ 395274 394449 392263 389901 389465 391018 392470 392501 392104 392850 394868 397247 399588 402235 405269 407988 409390
52742D09390n61k618m235m938m636l864l326l112k801k378k351k641k173n15Q40
$$ 409390 408829 406211 401976 397038 392402 388538 385212 382100 379299 376921 374570 371929 369756 369241 370081
52727C70081J72j798k554j116R44K049K321K185J379M33J079L507N100L965K067
$$ 370081 370253 368455 365901 364785 365729 367778 370099 372284 373663 374096 375175 378682 383782 387747 389814
52712C89814K264L616K712r00l987m547m208m800n375m321k212o43K67J409K751
$$ 389814 392078 395694 398406 397506 393519 388972 384764 379964 374589 370268 368056 367413 367680 369089 371840
52697C71840L442L233K503J460L76OP29J753K104J898J801J780J369P38N43R73
$$ 371840 375282 378515 381018 382478 382854 382860 383589 385342 387446 389344 391145 392925 394294 395032 395575 396548
52681C96548J772K831M043M844M663L587K050L59r13p71Q92K428K092L40p63k10
$$ 396548 398320 401151 405194 410038 414701 418288 420338 420697 419784 419013 419905 422333 424425 424765 424002 423792
52665D23792J106K113K657K611J450n49j940j920j552k124l163l272k306j287
$$ 423792 424898 427011 429668 432279 433729 433180 431240 429320 427768 425644 422481 419209 416903 415616
52651D15616n51M22J275O07j721l481k517M76K753K735J351L64L32M84q3j369
$$ 415616 415065 415487 416762 417369 415648 412167 409650 410126 412879 415614 416965 417329 417661 418145 418062 416693
52635D16693k339j885k21J014O09o06q17L08J228O62q96k093k224j399n8J113
$$ 416693 414354 412469 412248 413262 413871 413265 412448 412756 413984 414646 413750 411657 409433 408034 407976 409089
52619D09089J487J252J261J727J731N41j254k544k917k413q81J431L333L800L337
$$ 409089 410576 411828 413089 414816 416547 417088 415834 413290 410373 407960 407079 408510 411843 415643 418980
52604D18980L146L220K439N48j141j392n11L90R59J778L215M599M850L833K688
$$ 418980 422126 425346 427785 428333 427192 425800 425289 425679 426638 428416 431631 436230 441080 444913 447601
52589D47601K388K279R43j507l140k742j362n15j1R65J672P19j160j464M72K191
$$ 447601 449989 452268 453211 451704 448564 445822 444460 443945 443934 444899 446571 447290 446130 444666 445138 447329
52573D47329J393r10j910p03R82J476J236J831L623N083M415J602j475l045l130
$$ 447329 448722 447812 445902 445199 446181 447657 448893 450724 454347 459430 463845 465447 463972 460927 457797
52558D57797k951l050k827j810n31J30j71j175k264k583j598P3J032P08M9J47
$$ 457797 454846 451796 448969 447159 446628 446758 446587 445412 443148 440565 438967 439040 440072 440780 440829 440976
52542D40976O92N26n42j270n38J180K217J504k54j273o09Q02J217K01q47m53R47
$$ 440976 441668 442194 441652 440382 439844 441024 443241 444745 444491 443218 442609 443411 444628 444829 443982 443529 444476
52525D44476J507L62j096r00R76K544K322J012K14L70Q11J261J926K285J314o89
$$ 444476 445983 446345 445249 444349 445325 447869 450191 451203 451417 451787 452598 453859 455785 458070 459384 458695
52509D58695j890j215J85N95j22r89j602k169k475k165j600j337r83K11J848K632
$$ 458695 456805 455590 455775 456370 456248 455259 453657 451488 449013 446848 445248 443911 442928 443139 444987 447619
52493D47619K122J074O4j051k169k535j782n05N93J408K001K073J377K53n31m08
$$ 447619 449741 450815 450879 449828 447659 445124 443342 442837 443430 444838 446839 448912 450289 450542 450011 449603
52477D49603M47R94J17j935l341k695p95L59J35k18M88K019L385L819L003J206
$$ 449603 450050 451044 451161 449226 445885 443190 442395 442754 442889 442671 443159 445178 448563 452382 455385 456591
52461D56591n17j034k85Q46J728K261K174J162j59n05N16J911K614K531K127J827
$$ 456591 456074 455040 454755 455601 457329 459590 461764 462926 462767 462262 462778 464689 467303 469834 471961 473788
$$ [...]
##END NTUPLES=NMR SPECTRUM
##END=
