
##TITLE=UV1014_M1-1003-1002_6268966_0VxE4nSqBs
##JCAMPDX= 6.0         $$ Bruker NMR JCAMP-DX V2.0
##DATA TYPE= NMR SPECTRUM
##DATA CLASS= NTUPLES
##ORIGIN= BRUKER
##OWNER= Administrator
$$ 1.72 TOPSPIN		Version 2.1
$$ 2012-06-02 01:25:03.109 -0500  Administrator@TOPSPIN
$$ Compression mode = diff/dup
##.OBSERVE FREQUENCY= 400.13188235
##.OBSERVE NUCLEUS= ^1H
##.ACQUISITION MODE= SIMULTANEOUS (DQD)
##.ACQUISITION SCHEME= undefined
##.AVERAGES= 8
##.DIGITISER RES= 22
##SPECTROMETER/DATA SYSTEM= spect
##.PULSE SEQUENCE= zg30
##.SOLVENT NAME= COFFEE_calctemp
##.SHIFT REFERENCE= INTERNAL, COFFEE_calctemp, 1, 14.98061
##AUDIT TRAIL= $$ (NUMBER, WHEN, WHO, WHERE, PROCESS, VERSION, WHAT)
$$ ##TITLE= Audit trail, TOPSPIN		Version 2.1
$$ ##JCAMPDX= 5.01
$$ ##ORIGIN= Bruker BioSpin GmbH
$$ ##OWNER= Administrator
$$ $$ C:\Bruker\TOPSPIN/data/COFFEE/nmr/UV1014_M1-1003-1002_6268966_0VxE4nSqBs/10/pdata/1/auditp.txt
$$ ##AUDIT TRAIL=  $$ (NUMBER, WHEN, WHO, WHERE, PROCESS, VERSION, WHAT)
(   1,<2012-06-02 01:24:54.750 -0500>,<Administrator>,<TOPSPIN>,<go>,<TOPSPIN 2.1>,
      <created by zg
	started at 2012-06-02 01:23:48.125 -0500,
	POWCHK enabled, PULCHK disabled,
       configuration hash MD5:
       D5 CA 7A 23 FE 6B EE E2 50 67 74 61 24 F7 5E 3B
       data hash MD5: 64K
       87 B6 9A C8 C2 E2 D1 32 0E 3E E8 BB 48 0B 1F EC>)
(   2,<2012-06-02 01:24:58.781 -0500>,<Administrator>,<TOPSPIN>,<proc1d>,<TOPSPIN 2.1>,
      <Start of raw data processing
       efp LB = 0 FT_mod = 6 PKNL = 1 PHC0 = 0 PHC1 = 0 SI = 32K 
       data hash MD5: 32K
       13 D5 70 03 AD 16 0C 96 39 D6 90 3F 15 32 49 B8>)
(   3,<2012-06-02 01:24:59.078 -0500>,<Administrator>,<TOPSPIN>,<proc1d>,<TOPSPIN 2.1>,
      <pk PHC0 = 208.1085 PHC1 = 0 
       data hash MD5: 32K
       4E A1 39 50 6A E5 79 29 D7 F9 6B 25 D4 A8 48 51>)
(   4,<2012-06-02 01:24:59.171 -0500>,<Administrator>,<TOPSPIN>,<proc1d>,<TOPSPIN 2.1>,
      <abs ABSG = 1 
       data hash MD5: 32K
       26 D1 D8 5D 6C 54 4D F7 3C BD AC 94 47 FA 79 43>)
(   5,<2012-06-02 01:24:59.390 -0500>,<Administrator>,<TOPSPIN>,<proc1d>,<TOPSPIN 2.1>,
      <abs ABSG = 2 
       data hash MD5: 32K
       32 B3 68 5A BC DC 3D 98 5F 13 B9 BB 03 95 EF A4>)
(   6,<2012-06-02 01:24:59.437 -0500>,<Administrator>,<TOPSPIN>,<proc1d>,<TOPSPIN 2.1>,
      <abs ABSG = 3 
       data hash MD5: 32K
       3F 44 85 BB 71 DE 89 BD 0C 16 57 2E 7F CD 74 71>)
(   7,<2012-06-02 01:24:59.468 -0500>,<Administrator>,<TOPSPIN>,<proc1d>,<TOPSPIN 2.1>,
      <abs ABSG = 4 
       data hash MD5: 32K
       58 F4 AF B2 D0 5B E0 15 F5 6B 26 36 DC 55 A5 43>)
(   8,<2012-06-02 01:24:59.500 -0500>,<Administrator>,<TOPSPIN>,<proc1d>,<TOPSPIN 2.1>,
      <abs ABSG = 5 
       data hash MD5: 32K
       4D F0 F1 BB E5 6F 1A 6D 7B 8E 58 DF 7F A9 E1 46>)
$$ ##END=
$$ 
$$ $$ hash MD5
$$ $$ B9 BA F7 BC 72 7D 53 29 41 18 A2 D0 E1 70 35 60
##$RELAX= 
##$RELAX= 
##$RELAX= 
##$RELAX= 
##$RELAX= 
##$RELAX= 
##$RELAX= 
$$ Bruker specific parameters
$$ --------------------------
$$ [...]
150 150 150 150 150 150 150 150
##$TP07= 0
##$TPNAME0= <>
##$TPNAME1= <>
##$TPNAME2= <>
##$TPNAME3= <>
##$TPNAME4= <>
##$TPNAME5= <>
##$TPNAME6= <>
##$TPNAME7= <>
##$TPOAL= (0..7)
0.5 0.5 0.5 0.5 0.5 0.5 0.5 0.5
##$TPOFFS= (0..7)
0 0 0 0 0 0 0 0
##$TUNHIN= 0
##$TUNHOUT= 0
##$TUNXOUT= 0
##$USERA1= <user>
##$USERA2= <user>
##$USERA3= <user>
##$USERA4= <user>
##$USERA5= <user>
##$V9= 5
##$VALIST= <valist>
##$VCLIST= <CCCCCCCCCCCCCCC>
##$VD= 0
##$VDLIST= <DDDDDDDDDDDDDDD>
##$VPLIST= <PPPPPPPPPPPPPPP>
##$VTLIST= <TTTTTTTTTTTTTTT>
##$WBST= 2048
##$WBSW= 25
##$XGAIN= (0..3)
0 0 0 0
##$XL= 0
##$YL= 0
##$YMAX_a= 542812
##$YMIN_a= -670123
##$ZGOPTNS= <>
##$ZL1= 120
##$ZL2= 120
##$ZL3= 120
##$ZL4= 120
##$ABSF1= 14.98061
##$ABSF2= -5.57192
##$ABSG= 5
##$ABSL= 3
##$ALPHA= 0
##$AQORDER= 0
##$ASSFAC= 0
##$ASSFACI= 0
##$ASSFACX= 0
##$ASSWID= 0
##$AUNMP= <proc_prof1d_extract_pilot.lims>
##$AXLEFT= 0
##$AXNAME= <>
##$AXNUC= <1H>
##$AXRIGHT= 0
##$AXTYPE= 0
##$AXUNIT= <>
##$AZFE= 0.1
##$AZFW= 0.1
##$BCFW= 0
##$BC_mod= 0
##$BYTORDP= 0
##$COROFFS= 0
##$CY= 15
##$DATMOD= 1
##$DC= 0
##$DFILT= <>
##$DTYPP= 0
##$F1P= 0
##$F2P= 0
##$FCOR= 0.5
##$FTSIZE= 32768
##$FT_mod= 6
##$GAMMA= 0
##$GB= 0
##$INTBC= 1
##$INTSCL= 1
##$ISEN= 128
##$LB= 0
##$LEV0= 0
##$LPBIN= 0
##$MAXI= 10000
##$MC2= 0
##$MEAN= 0
##$ME_mod= 0
##$MI= 0
##$NCOEF= 0
##$NC_proc= -8
##$NLEV= 6
##$NOISF1= 0
##$NOISF2= 0
##$NSP= 0
##$NTH_PI= 0
##$NZP= 0
##$OFFSET= 14.98061
##$PC= 1
##$PHC0= 208.1085
##$PHC1= 0
##$PH_mod= 1
##$PKNL= yes
##$PPARMOD= 0
##$PPDIAG= 0
##$PPIPTYP= 0
##$PPMPNUM= 2147483647
##$PPRESOL= 1
##$PSCAL= 4
##$PSIGN= 0
##$PYNMP= <proc.py>
##$REVERSE= no
##$SF= 400.13
##$SI= 32768
##$SIGF1= 0
##$SIGF2= 0
##$SINO= 400
##$SIOLD= 32768
##$SPECTYP= <>
##$SREGLST= <1H.CDCl3>
##$SSB= 0
##$STSI= 32768
##$STSR= 0
##$SW_p= 8223.68421052632
##$SYMM= 0
##$S_DEV= 0
##$TDeff= 65536
##$TDoff= 0
##$TI= <>
##$TILT= no
##$TM1= 0
##$TM2= 0
##$TOPLEV= 0
##$USERP1= <user>
##$USERP2= <user>
##$USERP3= <user>
##$USERP4= <user>
##$USERP5= <user>
##$WDW= 1
##$XDIM= 32768
##$YMAX_p= 467546899
##$YMIN_p= -669226
##$CURPLOT= <Network HP LaserJet P1505>
##$CURPRIN= <$Network HP LaserJet P1505>
##$DFORMAT= <normdp>
##$LAYOUT= <+/1D_H.xwp>
##$LFORMAT= <normlp>
##$PFORMAT= <normpl>
##$SURQMSG= 1
$$ End of Bruker specific parameters
$$ ---------------------------------
##NTUPLES= NMR SPECTRUM
##VAR_NAME=  FREQUENCY,     SPECTRUM/REAL,   SPECTRUM/IMAG
##SYMBOL=    X,             R,               I
##VAR_TYPE=  INDEPENDENT,   DEPENDENT,       DEPENDENT
##VAR_FORM=  AFFN,          ASDF,            ASDF
##VAR_DIM=   32768,         32768,           32768
##UNITS=     HZ,            ARBITRARY UNITS, ARBITRARY UNITS
##FACTOR=    0.250966925370066, 1,           1
##FIRST=     8223.43324360095, -147497,      -23388
##LAST=      0,             -109590,         -275603
##MIN=       0,             -669226,         0
##MAX=       8223.43324360095, 467546899,    0
$$ Real data points
##PAGE= N=1
##DATA TABLE= (X++(R..R)), XYDATA
$$ [...]
19518A18855k5547b66912c5842A30785l6360b1666k58236J13438f9056r4523j30766
19507b94345A54936E9364a26932o3635A02658a02992A77508b92464a2670l3262
19497d5932l27047J34900A5439a04967j23841A4201a74770N2909G7870b16099
19486b62144J07189g4594o7094a2616m90443i9399l14116a44904O8430m9219A38089
19474A17661M966J23381I8654D8234a90630n1292B24993a40783B8270b17076j85774
19463d02850f8403j16218P1611j7227f2587A2370J96983g485C17380C9853b46008
19451A2243e390p4455o8429o2586f6719J149L0589j93335e6661m5173l7006j07764
19439b46604Q2105A28351c13641A38614c99937B05480a5962j50010B30807b40425
$$ plain form
19518 118855 93308 -266912 -35842 130785 94425 -21666 -279902 -166464 -69056 -163579 -294345
19507 -294345 154936 59364 -126932 -190567 102658 -102992 177508 -292464 -12670 -45932
19497 -45932 -372979 -238079 15439 -104967 -228808 14201 -174770 -121861 77870 -216099
19486 -262144 -154955 -74594 -141688 -12616 -503059 -99399 -413515 -144904 -76474 -125693 138089
19474 117661 122627 246008 98654 48234 -190630 -241922 224993 -140783 28270 -217076 -402850
19463 -402850 -68403 -184621 -113010 -130237 -62587 12370 209353 -7485 317380 39853 -246008
19451 12243 -5390 -79845 -148274 -210860 -66719 -65570 -34981 -228316 -56661 -101834 -138840 -246604
19439 -246604 -164499 128351 -313641 138614 -399937 205480 -15962 -165972 230807 -240425
19428B28650a85708B58661A01569R8438F2355N9234a44022j28165A13369g683
19417b67945b6599C7901a63822j8320j76620J50271P5541c6322A55853Q410n4180
19406A10083B9563L1251r700A5101h5438j58695i1332a172G7307l0199k090J01597
19394A46615a88418h2118A7541c01692A65138b66062B89720b01791A12112J92245
19384C04357a92389F193e5447C428P9625c86629d9762j20071I2413P9964J3954
19373A86331A4430L7858M2674K9606b45793B23066L5978A25521N9963l7154B6812
19361a44819H1341a02086K6319k73129B30894g5625H3970j4206L9451c71672g8514
19349f5686G1055a43304a0068p5118C1513K70928b95326A07364c12383R0376l2878
$$ plain form
19428 228650 -185708 258661 101569 200007 62355 121589 -144022 -272187 113369 -7683
19417 -267945 -26599 37901 -163822 -182142 -358762 -208491 -132950 -36322 155853 164263 110083
19406 110083 29563 60814 51114 15101 -85438 -244133 -91332 -1172 77307 47108 45018 146615
19394 146615 -188418 -82118 17541 -301692 165138 -266062 289720 -201791 112112 304357
19384 304357 -192389 6193 -55447 3428 83053 -386629 -49762 -169833 92413 172377 186331
19373 186331 14430 52288 94962 124568 -245793 223066 259044 125521 185484 148330 26812
19361 -144819 81341 -102086 -75767 -348896 230894 -75625 83970 69764 109215 -371672 -78514
19349 -65686 71055 -143304 -10068 -85186 31513 302441 -295326 107364 -312383 -222007 -254885
19338b54885m4287R8191i4445J5526r3488E598f3130b457A23816h3618l1273B02242
19325D6897q13a3004l40811J18038a11547j22257Q6852G3561J42248A9797N747
19314B5544O8957i8426D45834d05099a84928D3125a95518m9454j43823A44319
19303A7424c20259a59971j40390k1575C9246c4052n9464r0169G2557j9526d9643
19291a30382j33798c5635F1543d01847a18241k64349J37079O8485I2990b45008
19280a62775H8335b41282J5015H7845b47631J04570F6102b70572i6666A06930
19269H7463a6086j25530b2388B52178A08621a54507L4275M8000h245j21202j26099
19258b55546B347a69991e6104m8990o7519C0573b45172g9789j22766K232d9330
$$ plain form
19338 -254885 -299172 -200981 -94445 -78919 -172407 5598 -63130 -2457 123816 -83618 -114891 202242
19325 46897 46084 -13004 -353815 -235777 -111547 -233804 -146952 73561 215809 19797 25544
19314 25544 94501 -98426 445834 -405099 -184928 43125 -195518 -244972 -388795 144319
19303 17424 -320259 -159971 -300361 -321936 39246 -34052 -93516 -183685 72557 53031 -49643
19291 -130382 -264180 -35635 61543 -401847 -118241 -382590 -245511 -177026 92990 -245008
19280 -162775 88335 -241282 -226267 87845 -247631 -143061 66102 -270572 -96666 106930
19269 87463 -16086 -141616 -22388 252178 108621 -154507 -120232 -72232 -8245 -129447 -255546
19258 -255546 2347 -169991 -56104 -105094 -172613 30573 -245172 -79789 -202555 -200323 -49330
19246b63306B22855o3965d22669h954j52727c3908n4281A23882N0785P7832i9811
19234I3966e7962A93807a79689B36286i0626l56528G9558M3164b63922N0521F7585
19222c67307a24176A94910b43482R2722j5947l3692A48593a1981j47781q4026
19212b43788B08715a21480k0166M1913c466A74532k9554a82558B39985a53471
19201b9209J2035j6892A93518a47564k5593g6673j62171j50381A13115l1237l7690
19190D4188b44926Q2849L5166A1941J61326f3918j1979A32227b30497D3805c6936
19178a86456P5403a9021k93880J56100k8643D2951L1401e073j17511H4282d7685
19166A5780b46866Q1106C10447a12614B41688c3242C9099a22578j24538D598J52986
$$ plain form
19246 -263306 222855 158890 -422669 -8954 -161681 -33908 -88189 123882 174667 252499 -99811
19234 93966 -57962 193807 -179689 236286 -90626 -447154 79558 122722 -263922 -213401 67585
19222 -367307 -124176 194910 -243482 -150760 -166707 -200399 148593 -11981 -159762 -243788
19212 -243788 208715 -121480 -141646 -99733 -3466 174532 144978 -182558 239985 -153471
19201 -29209 -17174 -34066 193518 -147564 -173157 -76673 -238844 -389225 113115 81878 44188
19190 44188 -244926 -162077 -126911 11941 173267 -63918 -75897 132227 -230497 43805 -36936
19178 -186456 -111053 -19021 -312901 -156801 -185444 42951 74352 -5073 -122584 84282 -47685
19166 15780 -246866 -165760 310447 -112614 241688 -33242 39099 -122578 -247116 4598 157584
19155A57584d3660p0952j7952C4887b28590Q5944i378j22022e2842r3329A02879
19143A84065D1542J23217R511a05564A35537a31160c8000I217f69226d1526P782
19132c3744J2319j42639O1226a9750C23276a70578g1647B67623a53235A48397
19121a96915j5178I6772b60853f2678A9573d04460C10927d2956k292j88660H7140
19109a62170L7236c8039A0421a25881n086k89707B3588b59726P3093R2169A20378
19097A55157b2871E5932J15811c53959d6328C9324a01447G6884d6764n1934a7684
19085e259A42145a99450j2057K5581G2379b3536n5958b3187j79018j08315a36274
19073B70085a15596K8356B47216r5932F9081K19323a01828j16295A9235J00334
$$ plain form
19155 157584 -43660 -114612 -132564 34887 -228590 -142646 -9378 -131400 -52842 -146171 102879
19143 184065 41542 164759 174270 -105564 135537 -131160 -38000 9217 -669226 -41526 -33744
19132 -33744 -21425 -164064 -102838 -19750 323276 -170578 -71647 267623 -153235 148397
19121 -196915 -212093 96772 -260853 -62678 19573 -404460 310927 -42956 -45248 -233908 87140
19109 -162170 -124934 -38039 10421 -125881 -130967 -420674 23588 -259726 -186633 -94464 120378
19097 155157 -22871 55932 171743 -353959 -46328 39324 -101447 76884 -46764 -98698 -17684
19085 -5259 142145 -199450 -211507 -185926 72379 -23536 -79494 -23187 -202205 -310520 -136274
19073 270085 -115596 -87240 247216 151284 69081 288404 -101828 -218123 19235 119569
19063A19569r472b27916I6915f8476B80650E2904B6359a59213d1464F7630e9644
19051H952J94587a68286B68457b61718K0401b302j5889A60873K9784n4087d0543
19039a19724D7119J44673o056c06182j2300a07052B38095b8631C95799c95928
19028b08061A21884b45195a4912I4347i3376K5188j16165G5762P9881f1908l2618
19017i4526A78975J40011h4166j9720j37328F1414N9679O5517q9984J9904a11662
19005A4094a29188J0178I5245c48165C35187a49298C7381A3491a60088G4267J40751
18994B15018j06199c8094j29088h248m1099A21917a71530H1714f5030k16773H1182
18982D49970c230B08303C0649b17927O9032j92738C5813L662J38367M6531c67698
$$ plain form
19063 119569 110097 -227916 96915 -68476 280650 52904 26359 -159213 -41464 67630 -59644
19051 8952 203539 -168286 268457 -261718 -241317 -2302 -18191 160873 190657 136570 -40543
19039 -119724 47119 191792 185736 -306182 -318482 -107052 238095 -28631 395799 -395928
19028 -208061 121884 -245195 -14912 94347 -93376 -68188 -184353 75762 155643 -61908 -94526
19017 -94526 178975 318986 -84166 -103886 -241214 61414 121093 186610 96626 116530 -111662
19005 14094 -129188 -119010 95245 -348165 335187 -149298 37381 13491 -160088 74267 215018
18994 215018 108819 -38094 -167182 -8248 -49347 121917 -171530 81714 -65030 -281803 81182
18982 449970 -3230 208303 30649 -217927 -148895 -341633 35813 39475 177842 224373 -367698
18970a87028A91380J12672a9402l7387k48595A32560a68683A91952a90440m1214
18960b31654g4992r155A10687J597a65868A0043e0705p6949a4855D1062a08750
18948I9175i3029E1577f5209j84821J5298C9933b98594P2487B4346a77850g7408
18936a0258p0634m0806j41855J02095g0063j73077A0221b47935R2325M1948K1167
18925i2495K5727G4555K81068a18810e5246p0287c6783r0308A59155D6477b50947
18913A04169B681d278q5259c9886B1775c35330H1623J22871E655K41936A05373
18901A57402a7113A56807b36211a09230K4423J5593F8500a00009j31692g7641
18890b9170A3063d2642j75334j65491D0054a59693F8159h3444B05233b43662a12011
$$ plain form
18970 -187028 191380 304052 -19402 -56789 -305384 132560 -168683 191952 -190440 -231654
18960 -231654 -74992 -84147 110687 112284 -165868 10043 -50705 -127654 -14855 41062 -108750
18948 99175 -93029 51577 -65209 -250030 -234732 39933 -298594 -226107 24346 -177850 -77408
18936 -10258 -80892 -121698 -263553 -161458 -70063 -243140 10221 -247935 -155610 -113662 -92495
18925 -92495 -66768 74555 355623 -118810 -55246 -125533 -36783 -127091 159155 46477 -250947
18913 104169 2681 -4278 -89537 -39886 21775 -335330 81623 204494 5655 247591 105373
18901 157402 -17113 156807 -236211 -109230 -84807 -69214 68500 -100009 -231701 -77641
18890 -29170 13063 -42642 -217976 -383467 40054 -159693 68159 -83444 205233 -243662 -112011
18878C09025a38078j47244b7253D8440a21702k39939a62212j41719J13575B01661
18867e9133F1369J45475a68666b0327m9030B73513h6367A29781d7135n5369k0324
18856a22828b0564o4077A26591a1316A07710n2519R5239a41957B97460a65732
18845A34514R5498H3290l5331J19861o6857K3747a44584J8986M478p202n18918
18834f47240H2028i0383I6409J6801L8895d08355B41977e8934p8459m7205A01470
18822b13822i4541I3516i465A66262h9071H5871C078b10854Q1437J1785N5153
18811f2479o108G1865L4525b19936C62327j65726h9966b1015f13k52295J06789
18800a46119L9865E9197K02450I7888b6281D2251N7939Q6442i5398D607f7891
$$ plain form
18878 309025 -138078 -285322 -27253 48440 -121702 -361641 -162212 -303931 -190356 201661
18867 -59133 61369 206844 -168666 -20327 -69357 273513 -86367 129781 -47135 -102504 -122828
18856 -122828 -20564 -84641 126591 -11316 107710 55191 150430 -141957 297460 -165732
18845 134514 230012 83290 47959 167820 100963 124710 -144584 -125598 -121120 -128322 -647240
18834 -647240 82028 -90383 96409 113210 152105 -408355 241977 -58934 -137393 -184598 101470
18822 -213822 -94541 93516 -9465 166262 -89071 85871 3078 -210854 -129417 -117632 -62479
18811 -62479 -68587 71865 106390 -219936 362327 196601 -89966 -21015 -613 -252908 -146119
18800 -146119 -106254 59197 261647 97888 -26281 42251 100190 186632 -95398 4607 -67891
18788A04135J3342b8556f241k51618B11581h6516p3978j45397d4225G4698h6092
18776c87079c5858p1259l45419d6612f79l91034g6446j22461B67061a54043k5494
18765a79537E7559B5316h8890j00256B37755A00141A7284i8587B2064J88402c73668
18753g3988j64112N4549j11456I9168P5696K46256G800c90861e7679G2055M948
18742G7003b96249A32513b45050D21410b20583a01187C5641c03175a607H0019
18731a36053B64902h6280j91914E0250a92513h2859o6666f1347A56278a43466
18720H8333b34914h1780K0253B59884b67856a1399j82020H4120d9902A9626a08169
18708a30898A53604i9230j66918A6553g4494n979j31088i3317a8693j09595b1076
$$ plain form
18788 104135 117477 -28556 -6241 -257859 211581 -86516 -160494 -305891 -44225 74698 -86092
18776 -387079 -35858 -107117 -452536 -46612 -679 -391713 -76446 -198907 267061 -154043 -179537
18765 -179537 57559 25316 -88890 -189146 237755 100141 17284 -98587 22064 210466 -373668
18753 -73988 -238100 -183551 -295007 99168 174864 421120 7800 -390861 -57679 72055 77003
18742 77003 -296249 132513 -245050 421410 -220583 -101187 35641 -303175 -1607 80019
18731 -136053 264902 -86280 -278194 50250 -192513 -82859 -149525 -61347 156278 -143466
18720 88333 -234914 -81780 -61527 259884 -267856 -11399 -193419 84120 -49902 19626 -108169
18708 -130898 153604 -99230 -266148 16553 -74494 -80473 -211561 -93317 -18693 -128288 -21076
18696E8504f3996A93002d15670a71530N1766j86826B50540a50872A63194b39875
18685A13046c51825a24789a3604A47861j8560g5182A64897M5853o5445b26846
18674a97283e5668j94571J11637F3265a20750k36785D07950j43982d41023a15321
18663A29078a26256I1750c03530b2347D1470b95326A18060d9310m2559C0665m31
18652C0234a42788j32737H7402b57449H3290K3696a56576g2959l63790a29695
18641A7857a75848N011B14225D2970a76485N3086A39562g7306A28733L4601b4564
18629h6300m94951A80595d4994a3896G7049a50946l8272O7001q0293g2807k85409
18618c58216a16835B47216i6725C90079G4210J54855b3374j2360k23613f882l80672
$$ plain form
18696 58504 -63996 193002 -415670 -171530 -119764 -306590 250540 -150872 163194 -239875
18685 113046 -351825 -124789 -13604 147861 129301 -75182 164897 210750 145305 -226846
18674 -197283 -55668 -250239 -138602 63265 -120750 -357535 407950 263968 -441023 -115321
18663 129078 -126256 91750 -303530 -22347 41470 -295326 118060 -49310 -91869 30665 30234
18652 30234 -142788 -275525 87402 -257449 83290 106986 -156576 -72959 -436749 -129695
18641 17857 -175848 -170837 214225 42970 -176485 -123399 139562 -77306 128733 163334 -24564
18629 -86300 -581251 180595 -44994 -13896 77049 -150946 -189218 -122217 -202510 -72807 -358216
18618 -358216 -116835 247216 -96725 390079 74210 229065 -23374 -35734 -259347 -6882 -387554
18607c87554A20226e5265g503j25492B1195c14282g8895q8800G768P5327c25783
18595h9779k15469h6876A07546a12350C57661H3405h0598q1632C7675K21600b06766
18583H0207e1904N008j92957G6183d28395a23241G6024a52323A80599b12288n553
18572b17841R2946F899J17716K42076c6880A50212d8314J1008k17104D9820i4767
18560I3611J76709b5951I2356a33294A32068N0370F2897i6577H7711j5175i5504
18548c66003a34368D2060a09236L1940D3738O7536J64380B7471M6554d30055A32767
18536a89556F9272h6665C22262g3733A06010A2870K38167j05956K3017b01999
18525a32754F5912a8527A19770b27015B95445c51465e2361A11800e8374A86194
$$ plain form
18607 -387554 120226 -55265 -7503 -132995 21195 -314282 -78895 -167695 7768 83095 -325783
18595 -89779 -305248 -86876 107546 -112350 357661 83405 -80598 -162230 37675 259275 -206766
18583 80207 -51904 -46896 -239853 76183 -428395 -123241 76024 -152323 180599 -212288 -217841
18572 -217841 -124895 6899 124615 366691 -36880 150212 -48314 -37306 -254410 49820 -94767
18560 93611 270320 -25951 92356 -133294 132068 182438 62897 -96577 87711 72536 -95504
18548 -366003 -134368 42060 -109236 -77296 43738 111274 275654 27471 74025 -430055 132767
18536 -189556 69272 -86665 322262 -73733 106010 12870 251037 145081 168098 -201999
18525 -132754 65912 -18527 119770 -227015 295445 -351465 -52361 111800 -58374 186194
18514a80399g5532H5897b21560A77331b70656Q6713A6068K64754F6828c0628D2916
18502a68469d7790q9228O8360b9078m79041A13982c29503a15325H9309i2390D331
18490h3635j68015R0374n5206E5853i6390K3473k2915H6365k2556J71780e120
18478a3424A10425d2603j27765q3748N6107O6129D3776b32950J11528c8274n3102
18467i1376j07770c3305G1091h2053A6536L18058d2848l17250B74784b31161E9263
18455b51940d1330j33524B5857G485O2920g159j54279D7481M891L5964D371J83316
18443A87687d651l07902A65639i3778j76770i0842A29748a79175A09275a19746
18432B43467b2384B4120J58501E8855K37387H568b52006h6692A03219J51062o0668
$$ plain form
18514 -180399 -75532 85897 -221560 177331 -270656 -183943 16068 280822 66828 -30628 42916
18502 -168469 -47790 -137018 -68658 -29078 -508119 113982 -329503 -115325 89309 -92390 4331
18490 -83635 -251650 -161276 -216482 55853 -96390 -72917 -95832 86365 63809 235589 -5120
18478 -13424 110425 -42603 -170368 -254116 -198009 -131880 43776 -232950 -121422 -38274 -91376
18467 -91376 -199146 -33305 71091 -82053 16536 334594 -42848 -360098 274784 -231161 59263
18455 -251940 -41330 -174854 25857 7485 70405 -7159 -161438 47481 52372 88336 4371 187687
18443 187687 -4651 -312553 165639 -93778 -270548 -90842 129748 -179175 109275 -119746
18432 243467 -22384 24120 182621 58855 296242 8568 -252006 -86692 103219 254281 193613
18421A93613d63381G3564b64009B0860L47648b274A18762a06919j46941J26289
18411a27571d7869q4729b9501k17061k4497g5133G7578J36488f9188J194B41591
18399E6427L5134a27944d4924k5611q7850H60b44046m853L6396A3408J21045L9446
18387A73899g1246l8332d1572j06778D6407a83947D059a23795F5701J55239c69099
18375b68917f9793a0598a980o3008B16011F885J83146a70709B530h9975q5034
18364a75009q0814H2230h8510B6257J19005D7648c5312A90982E4426J93030B8223
18352A8915J15415M5231d33518e2499J6632j86481c889A9164J41907a57973A0341
18340E0184J41542d870C2118a84773A3141M36548E7180a88948h8169d3828j51513
$$ plain form
18421 193613 -463381 73564 -264009 20860 368508 -2274 118762 -106919 -253860 -127571
18411 -127571 -47869 -132598 -29501 -246562 -271059 -75133 77578 214066 -69188 -67994 241591
18399 56427 91561 -127944 -44924 -70535 -158385 860 -244046 -248899 -212503 13408 134453 173899
18387 173899 -71246 -109578 -41572 -148350 46407 -183947 4059 -123795 65701 220940 -369099
18375 -268917 -69793 -10598 -1980 -64988 216011 6885 190031 -170709 2530 -89975 -175009
18364 -175009 -255823 82230 -88510 26257 145262 47648 -35312 190982 54426 247456 28223
18352 18915 134330 179561 -433518 -52499 -35867 -222348 -3889 19164 161071 -157973 10341
18340 50184 191726 -4870 32118 -184773 13141 449689 57180 -188948 -88169 -43828 -195341
18329a95341A48304N8061b65133I0178a42331l7013G6341L6361d1029A15275d66591
18317h4726r7925b3779B21892l1299C7230J4180c25737B85867F9063a69731l1746
18306b01477O7106D7923J45566b11501p5823F2485e0616j15287l0734B3935a02436
18294b18569d7464G4962N9197e0315l10458B2798J39417J0373d12648G7584a39484
18282E3415f0366B17488n1072m2366b8767A70391d5201A61376a98348A55087d1466
18270i4323k6115k4969r2439C2001K1405L0641J2068a94228F0566b21941b9386
18258B20233b81468L2370J20828A72023a19299j33413a0203A8879K584a08491
18247d18338i9274c804k28475B55854c72196i3239I2446J5712R4871b5073j5924
$$ plain form
18329 -195341 148304 206365 -265133 90178 -142331 -179344 76341 112702 -41029 115275 -466591
18317 -84726 -182651 -23779 221892 190593 37230 51410 -325737 285867 69063 -169731 -201477
18306 -201477 -134371 47923 193489 -211501 -287324 62485 -50616 -165903 -196637 23935 -102436
18294 -218569 -47464 74962 134159 -50315 -360773 22798 162215 172588 -412648 77584 -139484
18282 53415 -60366 217488 166416 124050 -28767 170391 -45201 161376 -198348 155087 -41466
18270 -94323 -120438 -145407 -237846 32001 53406 84047 96115 -194228 60566 -221941 -29386
18258 220233 -281468 -249098 -128270 172023 -119299 -252712 -10203 18879 21463 -108491
18247 -418338 -99274 -3804 -232279 255854 -372196 -93239 92446 108158 203029 -25073 -40997
18236d0997j60217A29319j0707l6901a64087A2106N1616a46470B89802h463B24796
18224f3010C62628a1981k14646c103l7388A6626J2458c33273g3597A36964a236
18212a89419N1445E3297a15874m1438k8938A33800F4422b72363k3028B3457J36891
18201A60348F423L50732e4241H2676g0337j9966B60955b70543B0387K90366a53518
18189a06629A26859d9439A58892D8642e2015B40312a72323o5420l8706H9367a26661
18177c58489J2659A538J66155i8825C8838b57376a6373k5129a0347A89999p3891
18166A16108A9094M46037H3033c00014P195a0898j3435A34187d49265f384k99301
18155c05685A5159J18648A5460b95412a06469k38456g5872i830B6857B888c0553
$$ plain form
18236 -40997 -201214 129319 118612 81711 -164087 12106 63722 -146470 289802 -8463 224796
18224 -63010 362628 -11981 -226627 -3103 -40491 16626 29084 -333273 -73597 136964 -1236
18212 -189419 -137974 53297 -115874 -157312 -186250 133800 64422 -272363 -295391 23457 160348
18201 160348 6423 357155 -54241 82676 -70337 -90303 260955 -270543 20387 310753 -153518
18189 -106629 126859 -49439 158892 48642 -52015 240312 -172323 -237743 -276449 89367 -126661
18177 -358489 -345830 1538 167693 -98825 38838 -257376 -16373 -41502 -10347 189999 116108
18166 116108 19094 465131 83033 -300014 -292819 -10898 -24333 134187 -449265 -6384 -305685
18155 -305685 15159 133807 15460 -295412 -106469 -344925 -75872 -9830 26857 2888 -30553
18143C22626A7446b32047R0955j22310D02829b08081b406j29737M1894D4062J56570
18132B00632a15383o700A42711a01001B55886a07605n6812g664l87912c2106k0307
18121e2413b0281j52112A17107b835j10102G05a25246j7983B6490e4368M096j59938
18109b10210A27487B974R432a26645n9019H0034b41242b088n6277l3638k79059
18098c71062B35008a97708E3125g7135K1759o2594I5007a9777l13771C06781a02967
18086d558B18885a27317B20279j1227a50464B68100f1570o1675q7916c1264k9291
18075f0555D9025K31858b13040c5927a3484j97262K3571Q3376c77k78801O7076
18064b12102B39882c57669a3152j02561B76656A14863m3410M2692a70960A50348
$$ plain form
18143 322626 17446 -232047 -141092 -263402 402829 -208081 -2406 -132143 -90249 44062 200632
18132 200632 -115383 -122083 142711 -101001 255886 -107605 -164417 -7664 -395576 -32106 -52413
18121 -52413 -20281 -172393 117107 -2835 -112937 705 -125246 -143229 26490 -54368 -50272 -210210
18109 -210210 127487 2974 12406 -126645 -185664 80034 -241242 -2088 -58365 -92003 -371062
18098 -371062 235008 -197708 53125 -77135 -55376 -117970 95007 -19777 -333548 306781 -102967
18086 -4558 218885 -127317 220279 209052 -150464 268100 -61570 -123245 -211161 -31264 -60555
18075 -60555 49025 280883 -213040 -35927 -13484 -210746 -187175 -103799 -377 -279178 -212102
18064 -212102 239882 -357669 -13152 -115713 276656 114863 71453 114145 -170960 150348
18053b61054A62228h4145A54327a56215G3147d8534B2631K59499e7442g559A37179
18041a43902n3504d3111A86572c02492A1517b40972A25022c59817A4602e4345
18030e8552C3783b6605n1227A36805k1351O8601a48071B69837f3921n7866m5465
18019a67252l177K1002A18122a33250H1214b9370j75998D07101a73753E0304J86419
18008B36723B592d6097J4387j60874B22427F127J54576G3793b20176A40567C1270
17996a27063j58939L7179H7494l3100Q8278b39518A68385c77809A3754J59995
17986A73749R9001g8901j8966j90996E153J41101a95457G2766e122m9244F8080
17974h1005b3091j27767K324f8272D2064J66331a98436E301K3403b59828b0415
$$ plain form
18053 -261054 162228 -84145 154327 -156215 73147 -48534 22631 282130 -57442 -7559 137179
18041 -143902 -197406 -43111 186572 -302492 11517 -240972 125022 -359817 14602 -54345
18030 -58552 33783 -26605 -77832 136805 115454 184055 -148071 269837 -63921 -121787 -167252
18019 -167252 -170429 -149427 118122 -133250 81214 -29370 -205368 407101 -173753 50304 236723
18008 236723 2592 -46097 -31710 -192584 222427 6127 160703 73793 -220176 140567 31270
17996 -127063 -286002 -248823 87494 54394 142672 -239518 168385 -377809 13754 173749
17986 173749 272750 -78901 -97867 -288863 5153 146254 -195457 72766 -5122 -54366 68080
17974 -81005 -23091 -150858 -148534 -68272 42064 208395 -198436 5301 28704 -259828 -20415
17962A14212K07925f5071L2388A69079J92985h9945r3311G410a36965A21505b1895
17950F6506g2184k34530D4080R3924L26922F2949N8963a25638L1266o5378k05671
17939c65421a26647n9964p2481A88280d8056I2112a22107p612F4116a49755C4041
17927B15362m8671a93834A4591J30389b9801j11867M2858j40094I2459a35958
17916a17675j46424H2796J26252B820Q9723a16812A79554a76809A5627N56365
17906E71992G0221J64930j01689D4546F874b22585A35507b07265I9771a96236
17895e7331A4298R425O0991a15021b8758B74273J35408b4017c603j82506Q8553
17884i7556j6265q3672N9128d5527G8185b37377A92978h703H137b14103E4974
$$ plain form
17962 114212 322137 -65071 -32683 169079 362064 -89945 -183256 7410 -136965 121505 -21895
17950 66506 -72184 -306714 44080 138004 464926 62949 121912 -125638 -94372 -159750 -365421
17939 -365421 -126647 -186611 -259092 188280 -48056 92112 -122107 -129719 64116 -149755 34041
17927 215362 166691 -193834 14591 144980 -29801 -141668 -98810 -238904 92459 -135958
17916 -117675 -264099 82796 209048 2820 92543 -116812 179554 -176809 15627 571992
17906 571992 70221 235151 133462 44546 6874 -222585 135507 -207265 99771 -196236
17895 -57331 14298 23723 84714 -115021 -28758 274273 409681 -24017 -3603 -186109 -97556
17884 -97556 -113821 -197493 -138365 -45527 78185 -237377 192978 -8703 8137 -214103 54974
17872a64479G7296a51485G5709J51283A6679b4188j39053q62A9703i340m30344
17861d39684c1141k7187I08M5461A5283Q9109J30216c09428F6045J99010a20499
17849a64347A9612b45807A56222J23806J1982j33856J90196m8404a60180b6540
17838a64335a1716o3038J1246m6511I3882i2330l2406B3867c1224B85254f5380
17826A17964N3697G2400a99455B03498c0716B83377A08436b87101b6574C86492
17815a23176r301d9034I8379b40640C48649a3191B17831h2885J3052C3995P6798
17804A10793J64758A06294a62133a9883j9951j7281I7577e6103E2315b21789A00191
17792e6764l95099J53080B40521a31910d4195H101N4022J0069f1652G8023R1531
$$ plain form
17872 -164479 77296 -151485 75709 226992 16679 -24188 -163241 -164103 19703 -9340 -439684
17861 -439684 -31141 -58328 908 46369 15283 104392 234608 -309428 66045 265055 -120499
17849 -164347 19612 -245807 156222 280028 292010 158154 348350 299946 -160180 -26540
17838 -164335 -11716 -74754 -63508 -110019 93882 -92330 -124736 23867 -31224 285254 -65380
17826 117964 171661 72400 -199455 203498 -30716 283377 108436 -287101 -26574 386492
17815 -123176 -132477 -49034 98379 -240640 348649 -13191 217831 -82885 -69833 33995 110793
17804 110793 275551 106294 -162133 -19883 -39834 -57115 97577 -56103 52315 -221789 100191
17792 -56764 -451863 -298783 240521 -131910 -44195 8101 62123 72192 -61652 78023 169554
17781A69554M5175C6126a75041N8977c834A87321i4728l2902j2623D8495O3026
17770A11521Q8451p6477a24308A95126b35071D7605c4511A11401a42954f4263
17759B97127q5819g3082E2612P7524b05991a539A30584b65707A28087n7314l3872
17748C6901J35738b00400o8491a01836j34906A93926C4413Q9515b38633C3566
17737a08863A27711J21865h293m0265A31887P1672r2636R1333a04013J7850A07962
17725A80301b8543A08562O3906B6589L93477E7996J54289E2742A3439a06979A93903
17713b70963C9997J49838b25134D301a2005F5576J1415C3343a92335O3684C09959
17701e363K447j23009B19988a27263B36010h1946F0525g6696D02891e1556H7756
$$ plain form
17781 169554 214729 36126 -175041 -116064 -3834 187321 -94728 -127630 -140253 48495 111521
17770 111521 199972 123495 -124308 195126 -235071 47605 -34511 111401 -142954 -64263
17759 297127 211308 -73082 52612 130136 -205991 -1539 130584 -265707 128087 70773 36901
17748 36901 172639 -200400 -268891 -101836 -236742 193926 34413 123928 -238633 33566
17737 -108863 127711 249576 -8293 -48558 131887 203559 110923 202256 -104013 -86163 107962
17725 180301 -28543 108562 172468 26589 420066 57996 212285 52742 13439 -106979 193903
17713 -270963 39997 189835 -225134 4301 -12005 65576 76991 33343 -192335 -128651 309959
17701 -5363 -2916 -125925 219988 -127263 236010 -81946 60525 -76696 402891 -51556 87756
17689a62235A06700c26416b9957r1514K9471K1232B21207J4720b9769A48519Q5180
17678B33699C3209a9636B65036A24116B2430i4394q4999g2495D8963K33365A2587
17666G9063M3664d7411C50990C0191K15268Q4106h8306j55276P7374b3477F533
17654E1169R8367c68158C3687b42849F2820b16077A03795a34343C147g657p3384
17643h1041C0147M8521c07196C10761a86765J7982O4192A48975n9682L79809B24989
17631A81207b57824A03699R2871R652a15796j40744N6670B28930g9081C9935J1965
17620E1900J04186P2297a65447A22010f3165C56336j64259b11248A06409O897
17610A13306n4534l490J989a28804A27155k5256a54470D1603J15574a55110C8006
$$ plain form
17689 -162235 106700 -326416 -29957 -121471 -92000 -70768 221207 235927 -29769 148519 233699
17678 233699 33209 -19636 265036 124116 22430 -94394 -179393 -72495 48963 282328 12587
17666 79063 122727 -47411 350990 30191 245459 329565 -88306 -243582 -166208 -23477 6533
17654 51169 149536 -368158 33687 -242849 62820 -216077 103795 -134343 3147 -7657 -81041
17643 -81041 30147 78668 -307196 310761 -186765 -168783 -104591 148975 89293 469102 224989
17631 181207 -257824 103699 196570 206222 -115796 -256540 -199870 228930 -79081 39935 51900
17620 51900 156086 228383 -165447 122010 -63165 356336 192077 -211248 106409 113306
17610 113306 58772 55282 57271 -128804 127155 101899 -154470 41603 157177 -155110 38006
17598A65857k9339F1522j8827Q4964Q7906K04259a5250k45827A53809J72982q4349
17587B42442a61642g3678k24217A7255a15185b5967E4888e7330C40231r5467M5343
17576B90107a62642A93054j0145I407N93670B26007j11329K60252b34550i2898
17565a13105F5389j8954K54482G5724K9201A4926i7710A8286a95155A6595b49709
17553a28790L0519n5145d6910F5648Q2786j3110c6053j67213O2434A01127R5225
17542A96352D0273J39813J95321A36930K01527j60958C5681a73057k4219C55202
17531b49534F2917L04240H7846R8541a0434j45051I2092f3122p6984B71716b45185
17519a07337C4273a00074A44312c17032A89811j2116F1173c9102B18156j06780
$$ plain form
17598 165857 136518 61522 42695 127659 215565 419824 -15250 -261077 153809 326791 242442
17587 242442 -161642 -73678 -297895 17255 -115185 -25967 54888 -57330 340231 244764 290107
17576 290107 -162642 193054 182909 9407 603077 226007 114678 374930 -234550 -92898
17565 -113105 65389 46435 300917 75724 104925 14926 -97710 18286 -195155 16595 -249709
17553 -128790 -98271 -153416 -46910 65648 148434 135324 -36053 -203266 -140832 101127 196352
17542 196352 40273 180086 375407 136930 338457 177499 35681 -173057 -197276 355202
17531 -249534 62917 367157 87846 186387 -10434 -155485 92092 -63122 -140106 271716 -245185
17519 -107337 34273 -100074 144312 -317032 189811 177695 61173 -39102 218156 111376
17509A11376J35350b84554L3648C75053A05537O7502g4651A67569a45120A24016
17498C92567A3102J34905b70654f4965B13230j04075b1869l3473B73874A28079
17487a27326e0075D90641B27054G2460R7854b39831P8011A18700a5382E5890M3004
17476I8894i770B19293a8128j2379F3292K14515a18676A20276h7214B60165a57750
17464B0646J96377o2366a13520D15193A752M01805j13456o8414a86167D05341
17453A25690K2573o0946d01B16073p3205J39269A21397M6132h0341K4806o9613
17442a25148c8787C34939r1514N6081l0675N5178l0642p3528n7177r732J18791
17431B71721K50411A13019J06258J6908H319J91468E6730P39M41019j08647L437
$$ plain form
17509 111376 246726 -284554 -250906 375053 105537 173039 -74651 167569 -145120 124016
17498 392567 13102 148007 -270654 -64965 213230 109155 -21869 -55342 273874 128079
17487 -127326 -50075 490641 227054 72460 170314 -239831 -161820 118700 -15382 55890 98894
17476 98894 -9770 219293 -18128 -30507 63292 277807 -118676 120276 -87214 260165 -157750
17464 20646 217023 154657 -113520 415193 1752 403557 290101 221687 -186167 405341
17453 125690 148263 87317 -401 216073 142868 282137 121397 167529 -80341 -55535 -125148
17442 -125148 -38787 334939 243425 299506 268831 324009 293367 219839 162662 152930 271721
17431 271721 522132 113019 219277 236185 8319 199787 56730 57469 498488 389841 393278
17420C93278A29587J89471K1123G7392J87627o6371b5708C03805J80415B30985
17409D66313A56651J9724m4442R1264G6068J97706j23162F3984K71929E6891L74242
17398D31133m8213j80902J9469J30977j34290a34282B26962p7937m3567b24164
17387A39136C171N3690K37393I3185b23452B99950J15245A3063a32852A77601
17376F2477j6741K78081C9211b5231C28764j41636A8379e12r7977A46556j2575
17365A33981J1111a60423B72934E3645c4329B05017P4518b14153A64506L88876
17355E53382G2511R2482B5419J64413N3755I7329b6090r2246B56439R2420A33966
17343B23910M3053j25850J4307e8542I2534K8831O7670N3127J60337H085J74555
$$ plain form
17420 393278 129587 319058 340181 77392 265019 198648 -25708 303805 484220 230985
17409 466313 156651 176375 131933 223197 76068 273774 150612 63984 335913 56891 431133
17398 431133 382920 202018 221487 352464 218174 -134282 226962 149025 105458 -224164
17387 139136 3171 56861 294254 93185 -223452 299950 415195 13063 -132852 177601
17376 62477 45736 323817 39211 -25231 328764 187128 18379 -512 -98489 146556 133981
17365 133981 145092 -160423 272934 53645 -34329 205017 279535 -214153 164506 553382
17355 553382 72511 164993 25419 189832 243587 97329 -26090 -118336 256439 348859 133966
17343 223910 266963 141113 155420 -58542 92534 121365 189035 242162 402499 8085 182640
17332A82640P8091J0852J05542r7982f7140E2884f6345C25821j26067L08332B11130
17320A77372M3715o0902A9090J50423P8420l8479G4907R4628K8256J3116H6887
17308A9668J8258L20189F6780M2316M60870A07091N2776G8363K00153o7636q154
17297B02726D7914J0971M161K29981M9097Q2122j40006h3056A91835K30172j77131
17286B44876J58860j44453j00965Q3395C5955c5550p6807C30349q2133b29522
17275A02523K74382j52539H8684J94087G2699J32863J47596q713L6055o1995L46251
17264F64756f6587A53216K60507p7900B1700N48316r0437F3193f5650B42254R8952
17253C41206o7233j21922L101K46350j21600J04080j73937k2924P2647R4332A4827
$$ plain form
17332 182640 260731 271583 377125 279143 -67140 52884 -66345 325821 199754 508086 211130
17320 177372 221087 160185 19090 169513 247933 209454 74907 169535 197791 210907 86887
17308 19668 37926 358115 66780 109096 569966 107091 159867 78363 278516 210880 202726
17297 202726 47914 58885 63046 293027 342124 424246 284240 -83056 191835 422007 244876
17286 244876 403736 259283 158318 241713 35955 -35550 -112357 330349 248216 -229522
17275 102523 376905 224366 88684 282771 72699 205562 353158 344445 380500 318505 664756
17264 664756 -66587 153216 413723 335823 21700 570016 479579 63193 -65650 242254 341206
17253 341206 273973 152051 155152 401502 279902 383982 210045 187121 259768 354100 14827
17241F22913k96970k6853k5853P258l2002L29169j65513B02615p3469l221K75851
17230D01776A76131i3925D5814M16543f4366C02296J51751j65643r3426e9942
17219C87601n9730N7534A30473j3746j0983m5353L76977Q6366A50045D9430r283
17208D0147a02205B02207B5112F749J47069d7220D03998A3167L40522a76976B55495
17196A46328F4107N57656d8894A74487Q2390o6581J49582p5171A17541A0008L89382
17185C99390j96600I7977K68492o4984P5794A70148K14102j32121D0967h519E94166
17173C03847L11406k59519p8971K62318A71324l7757K52641D5573K61332J04398
17163D11303N4993r3343A54791K25709A26983P7654R0870m6529L37423B12156
$$ plain form
17241 622913 325943 299090 273237 280495 248493 577662 412149 202615 129146 125925 401776
17230 401776 176131 -93925 45814 462357 -64366 302296 454047 288404 194978 -59942
17219 387601 327871 385405 130473 116727 105744 60391 437368 523734 150045 49430 40147
17208 40147 -102205 202207 25112 6749 153818 -47220 403998 13167 353689 -176976 255495
17196 146328 64107 621763 -48894 174487 256877 190296 339878 264707 117541 10008 399390
17185 399390 202790 97977 366469 301485 377279 170148 384250 252129 40967 -8519 594166
17173 303847 615253 355734 276763 539081 171324 133567 386208 45573 306905 411303
17163 411303 466296 372953 154791 380500 126983 204637 295507 248978 586401 212156
17152I0625J16376q800K86746o3406l7742J91675a9764D99707j26469Q8528A68859
17140E42836j12127j39437l4524q8860J09565j05438L70789B8243N19669G2796
17129B82732Q9182K04153n1425A85791J89080J11562J4038j295j25477k7903J1085
17118C56881N7518L65305B30886J50868B1051K98000J79154Q0848k34443L00699
17108F45309j30399J60219C34375K20688k61998K01759j1541B28409M5908J09973
17098C84290P8650M0313J01651A19708M0717K07942J54432j75856K62695k28629
17088C81009K35916j36693m6511J66271k35266K42401k80242j07883D4921M80672
17078E25593K581J31808k65115K12852l6008A36370N54437k13612O0707o5864
$$ plain form
17152 90625 207001 198201 484947 421541 383799 575474 -19764 499707 373238 461766 168859
17140 542836 430709 291272 256748 167888 277453 172015 542804 28243 547912 72796
17129 282732 371914 576067 524642 185791 374871 486433 500471 499176 373699 345796 356881
17118 356881 414399 779704 230886 381754 21051 319051 498205 579053 344610 645309
17108 645309 514910 675129 334375 555063 293065 494824 483283 228409 274317 384290
17098 384290 462940 503253 604904 119708 160425 368367 522799 346943 609638 381009
17088 381009 616925 480232 433721 599992 364726 607127 326885 219002 44921 525593
17078 525593 528174 659982 394867 607719 571711 136370 690807 477195 537902 472038
17068D72038A39578N81864P3215B53097R3707L44301B70033K50248J84918k17566
17058D87633j69064N01664k06048k25137J57680L7378N7898M1854l11490J59871
17048E32239R0655M2545C11800J45411K46008A69706M56911k89328K37764J50643
17038G25696j75485m5893Q1781r795k3284M0702K5720l343K85644D22802K87837
17027G10639k40279j25524M44760o4357L5507k85821M89502j2160j85504P1241
17017H38004M6707j11325j1371J0174j34371M87226l95270j60709K03169J7474
17007G89708J47881k0344j19491j65678J46990K68831m26013l1774j66571J74049
16997E97588k39960K66587K40487r368K22414J20582n28583J28796k4623K38002
$$ plain form
17068 472038 139578 721442 794657 253097 346804 691105 270033 520281 705199 487633
17058 487633 318569 820233 614185 389048 546728 584106 642004 683858 372368 532239
17048 532239 622894 665439 311800 457211 703219 169706 626617 337289 575053 725696
17038 725696 550211 504318 586099 576304 553020 593722 619442 616099 901743 422802 710639
17027 710639 470360 344836 789596 725239 760746 474925 964427 952267 766763 838004
17017 838004 884711 773386 762015 772189 637818 1125044 729774 569065 772234 789708
17007 789708 937589 917245 797754 632076 779066 1047897 621884 590110 423539 597588
16997 597588 357628 624215 864702 855334 1077748 1198330 669747 798543 773920 1011922
16987A011922p7403j27989k4003K74135l40922M25844n41042K07157J13085m40184
16977D80600J16219o5434K11189K69120j25838j00760J35473j4559j72619L15171
16967A048562j61473J2630L07789m19470Q389K15593M8993p3045M8864m2354K88099
16956A282577l45981K47489l09796O4133J61316k7041j57144k43889N53395o6568
16946A158491J21562l93110M57643l00910J28271k57883L23131P7433J12652J34511
16936A561791j01424j14316j56976L46959n22888J58990L64547j81158j66300
16927A189225J04751j26806J53135n7361k9295J12510J09891K9583p2067J76511
16917A590077j54625m7403J87460J12842l69770K09125J97360J61449m92401K39845
$$ plain form
16987 1011922 934519 806530 782527 1056662 715740 1141584 600542 807699 920784 480600
16977 480600 596819 531385 742574 1011694 885856 785096 920569 906010 733391 1048562
16967 1048562 887089 899719 1207508 788038 796427 1012020 1061013 987968 1036832 994478 1282577
16956 1282577 936596 1184085 874289 938422 1099738 1072697 915553 671664 1225059 1158491
16946 1158491 1280053 886943 1344586 1043676 1171947 914064 1237195 1314628 1427280 1561791
16936 1561791 1460367 1346051 1189075 1536034 1013146 1172136 1536683 1355525 1189225
16927 1189225 1293976 1167170 1320305 1262944 1233649 1346159 1456050 1485633 1413566 1590077
16917 1590077 1435452 1388049 1575509 1688351 1318581 1527706 1725066 1886515 1394114 1633959
16907A633959j02729L3938O332O8685k7801K87183k62683R7265m2355K91943j75597
16896A808140K6199k35271M69644j1006m3390L558j85098J71428l8254j12256
16886A853694L19548j32673L91931l56040j98911J12935J58313P6708K21221p10202
16876A736524M37544M39450l57325j16124L20L63971k15978L43400j16189R7075
16866B612668k03457J58040R7640J51720k57857n1884J97617P8057m0232r8079
16856B644233l816L37219P5071k50692M14208q8795k7719K1511N0663J00276n135
16845C267024j64069L54743k83998J41172K63518j78910K08205m5213J08560j96039
16835C474993N90695j37926j53881K7753O25078l68204J78617N664M3343K17703
$$ plain form
16907 1633959 1531230 1565168 1571500 1640185 1612384 1899567 1636884 1734149 1691794 1983737 1808140
16896 1808140 1834339 1599068 2068712 2057706 2014316 2017874 1832776 2004204 1965950 1853694
16886 1853694 2173242 2040569 2432500 2076460 1877549 1990484 2148797 2225505 2446726 1736524
16876 1736524 2174068 2613518 2256193 2140069 2140389 2504360 2288382 2631782 2515593 2612668
16866 2612668 2409211 2567251 2664891 2816611 2558754 2506870 2704487 2782544 2742312 2644233
16856 2644233 2640417 2977636 3052707 2802015 3216223 3127428 3099709 3121220 3171883 3272159 3267024
16845 3267024 3102955 3457698 3173700 3314872 3578390 3399480 3607685 3562472 3671032 3474993
16835 3474993 4065688 3927762 3773881 3801634 4426712 4058508 4237125 4242789 4286132 4503835
16825D503835J97614q3458L29663j58504n3975K11615J92026P0933K70237k94581
16815E185405J87918l76121O53206P9671K1471L85320j09508K05686M2408L57419
16805F632875j68876M8965L9427M41485j63967L17924K75975k2149K14657L01608
16795G917924J18642J10967K09621J45717N13948J44407j60558M62790K84594
16786I748052K51696N6263J31667K39989L68532K10823J59018O99162K37597J27607
16776A2230406J79243N45678K56175J17602P13609K71098N82034K17078M77691
16767A5590614M31165N70364O47979L93235L22994M66710R40981R16256N52695
16758B0832993P71123P09850N45970O07500J271012P06240Q88781J303329O04952
$$ plain form
16825 4503835 4701449 4617991 4947654 4789150 4735175 4946790 5138816 5209749 5479986 5185405
16815 5185405 5373323 4997202 5650408 5730079 5751550 6136870 6027362 6233048 6275456 6632875
16805 6632875 6463999 6512964 6552391 6993876 6829909 7147833 7423808 7401659 7616316 7917924
16795 7917924 8036566 8147533 8357154 8502871 9016819 9161226 9000668 9463458 9748052
16786 9748052 9999748 10056011 10187678 10427667 10796199 11007022 11166040 11865202 12102799 12230406
16776 12230406 12409649 12955327 13211502 13329104 14042713 14313811 14895845 15112923 15590614
16767 15590614 16021779 16592143 17240122 17633357 17956351 18423061 19364042 20280298 20832993
16758 20832993 21604116 22313966 22859936 23467436 24738448 25444688 26333469 27636798 28241750
16749B8241750J176378J422993J134084J150817J535274J253768K015310J069586
16741C8999960K039987J681912K126644K239966K238953J980172K874487K568453
16733E6750534K763748K774785L427330L652485L831658L523636M235576M634032
16725H5593784M502895N032559N106488N516473N794945O174102O067824N950807
16717A29739877O709950O568389O408050O080139N982226N651387N201132M400821
16709A76741971L887498L262614K356168Q24292J63968r43149k089703k971585
16701A81232074l753417m618598m852304n952498o002847o256352o455090o546726
16693A36794242o673737o214046o221368o238225n485868n755440m854637n304018
$$ plain form
16749 28241750 29418128 30841121 31975205 33126022 34661296 35915064 37930374 38999960
16741 38999960 41039947 42721859 44848503 47088469 49327422 51307594 54182081 56750534
16733 56750534 59514282 62289067 65716397 69368882 73200540 76724176 80959752 85593784
16725 85593784 90096679 95129238 100235726 105752199 111547144 117721246 123789070 129739877
16717 129739877 136449827 143018216 149426266 155506405 161488631 167140018 172341150 176741971
16709 176741971 180629469 183892083 186248251 187072543 187236511 186293362 184203659 181232074
16701 181232074 177478657 172860059 168007755 162055257 156052410 149796058 143340968 136794242
16693 136794242 130120505 123906459 117685091 111446866 105960998 100205558 95350921 90046903
16685I0046903m836537m856728l807861m245767l390910l791025l272256l118549
16677E8727270k971897k698003k949472k070364k591591k020159k022875j990261
16669C9412648j427820j647552j674427j598985j383758j596786p66548j576615
16661B7740157j102551n28989j163425j080875j263991o49564r63688p08395o66879
16652A9611800o20438n75275o87976n34192j033947k26712o17058l94541l23306
16643A4598355o85018l28371K3327r52699j19056l24806n33036l13411j31275
16634A1234010n73377l99678J81019l07460j39263o68947j55862K1683n68284
16625H623841j68677j52362n1656l04412m11873j9144l972j55383m55588j09704
$$ plain form
16685 90046903 85210366 80353638 76545777 72300010 68909100 65118075 61845819 58727270
16677 58727270 55755373 53057370 50107898 48037534 45445943 43425784 41402909 39412648
16669 39412648 37984828 36337276 34662849 33063864 31680106 30083320 29316772 27740157
16661 27740157 26637606 26108617 24945192 23864317 22600326 21950762 20987074 20278679 19611800
16652 19611800 18991362 18416087 17728111 17193919 16159972 15933260 15316202 14921661 14598355
16643 14598355 13913337 13584966 13608293 12655594 12536538 12211732 11678696 11365285 11234010
16634 11234010 10660633 10260955 10441974 10134514 9995251 9326304 9170442 9192125 8623841
16625 8623841 8455164 8302802 8251146 7946734 7534861 7515717 7511745 7356362 6900774 6791070
16615F791070k73286J9000k59031J00922m25142k43232K68806m98702o7587K14701
16605E627519m75329J08457n6005J50621m98286J63654l05029k48222K98310k45608
16595D520082L304j85926P7400l15808j00292M1558q3193j02831L26493m89131
16585C691656J0005m82005J22571K8161K95293k96829J18591k07858k25046o6925
16575B987614j87053K87722Q5588K10874l22252n14459J34697J43755k2906K8147
16565B831727l10413j6376J24505j71415q6435l034K25401l4180k01727j17841
16555B240212j24045J57036j33231J25702k60731O7426J12379j99945K13408j38420
16545B059791R1269j92206j80732L83762j16951k79273n3804K59462j31594j77870
$$ plain form
16615 6791070 6517784 6536784 6277753 6378675 5953533 5710301 5979107 5480405 5412818 5627519
16605 5627519 5152190 5260647 5204642 5355263 4856977 5020631 4715602 4467380 4765690 4520082
16595 4520082 4523386 4337460 4414860 4099052 3998760 4040318 3957125 3854294 4180787 3691656
16585 3691656 3701661 3219656 3342227 3370388 3665681 3368852 3487443 3279585 3054539 2987614
16575 2987614 2800561 3088283 3173871 3384745 3062493 2548034 2682731 2826486 2803580 2831727
16565 2831727 2521314 2504938 2629443 2458028 2371593 2368559 2593960 2559780 2358053 2240212
16555 2240212 2116167 2273203 2139972 2265674 2004943 2072369 2184748 1984803 2198211 2059791
16545 2059791 2151060 1958854 1778122 2161884 2044933 1765660 1711856 1971318 1839724 1661854
16535A661854k7289j20349J79735j23055R4270J4831J58472l31704K11853k46258
16525A472360K82805K6087K20173m50394P7240j95249j51578L1835K88078l9409
16515A561948o5066k24494O4915j49653K82542j39059K69144l44622r8580m2861
16505A114214J76044l07304L39002J47586m72662J83411N262l13294L64274k98195
16495I38338L5491K59270k88966Q877J08974l9660j86456Q5863J51541L4019J92623
16484A299914m90568L30307j71565k08979K35035M760q0419m6499J10623m07957
16474E74652J55500J476O7365K38065O567j30961q0868J19820j83086K2992N1158
16463H42680k81140R9669K11544k12948o0080J39848J32390L0993j94341L10542
$$ plain form
16535 1661854 1634565 1514216 1693951 1570896 1665166 1679997 1838469 1506765 1718618 1472360
16525 1472360 1755165 1781252 2001425 1551031 1628271 1433022 1281444 1313279 1601357 1561948
16515 1561948 1496882 1272388 1337303 1187650 1470192 1331133 1600277 1255655 1157075 1114214
16505 1114214 1290258 982954 1321956 1469542 996880 1180291 1185553 872259 1236533 938338
16495 938338 973829 1233099 944133 953010 1061984 1022324 835868 921731 1073272 1107291 1299914
16484 1299914 809346 1139653 968088 759109 994144 998904 918485 871986 982609 574652
16474 574652 730152 731628 798993 1037058 1043625 912664 831796 951616 768530 791522 842680
16463 842680 561540 661209 872753 659805 599725 739573 871963 902956 708615 1019157
16453A019157l76145J40177k82242L15758k54249J32829o8535j28577B14525N39560
16443G54085l3851j86352K1113j96329l6056J73994j4243J76981J16593n8561
16433G17374M4148j84788P3455k4183k72985J56468K2261K56848k92304J24658
16423F20952L48938D68666K11215o3589j05623L57758j95416j05934J92391l43789
16413D15679A91578L01627j6185l6975J34519B31384L63754M9361j55171N2754
16403E42082J26476j92406L949J12711B69261n3718L98503K01396l69792F1670
16392C02518r280K6461K69377k10168q8116j7207N8359J69399j46199J57976k06552
16381C06568J14809J8167M4242m1997A22348M30650K9393r2896l7209K31857A35006
$$ plain form
16453 1019157 643012 783189 500947 816705 562456 695285 626750 498173 214525 754085
16443 754085 720234 533882 554995 358666 322610 496604 482361 659342 775935 717374
16433 717374 761522 576734 650189 626006 353021 509489 531750 788598 496294 620952
16423 620952 969890 468666 679881 616292 510669 868427 673011 567077 759468 415679
16413 415679 191578 493205 477020 440045 574564 231384 595138 644499 489328 542082
16403 542082 668558 476152 480101 592812 269261 215543 614046 815442 445650 61670
16392 302518 293238 319699 589076 378908 290792 273585 331944 501343 355144 513120 306568
16381 306568 421377 439544 483786 441789 122348 552998 582391 489495 452286 684143 135006
16369D80037k11974J88734j80170N6418J66385A93836Q1088F3048L51634h7286
16358C10775A32174J60475K88067j35462E0689K14409D6372K97353a26680B24426
16347B68302k7012C393e5215D60888j75909P819K28105j68204j47449K5699C5963
16335B45486P7322G8344K17452J77282o5018A17933j0060M12767A35991c0600
16324H6967Q3737K2323D8996M43617j96861A14104L43911F3504L1823j3172J10268
16313A92423M22170A66096J89850p20A6943J4067M45237B37569K00688A98461
16302I9771L43585j01074j39041B0180L24269n3980h5474B76766l8803Q9312j59697
16291A67578k6628e6326A91359K95045h6585A99141a81721B60856q5776b3843
$$ plain form
16369 480037 268063 456797 276627 333045 499430 193836 274924 63048 414682 -87286
16358 310775 132174 292649 580716 445254 50689 265098 46372 343725 -126680 224426
16347 268302 241290 3393 -55215 460888 284979 292798 520903 352699 205250 230949 35963
16335 245486 322808 78344 295796 473078 408060 117933 107873 520640 135991 -30600
16324 86967 170704 193027 48996 492613 295752 114104 458015 63504 95327 82155 192423
16313 192423 614593 166096 355946 355226 16943 31010 476247 237569 438257 198461
16302 99771 443356 342282 203241 20180 344449 290469 -85474 276766 237963 327275 167578
16291 167578 140950 -56326 191359 486404 -86585 199141 -181721 260856 175080 -23843
16280G1861A6191A303a14019M7561J1997n7552G7424J1135d416E23925n5782A66414
16267A04879a64610D65902a49803C58055Q9070A39481B8678J49762N9727k8619
16257B09548P8722n6113p9275J61433A02710K61332A22574k0816a14132A74029
16246C28191F0519a62349C6464J26834f556B95725d436j29807C87948A1747K83632
16235B95379r3528Q6624a41384F8244P7785i7674E4889a35310D28226e6785E6748
16223D93458A88995a38465A77742b77013B43159J65065A83064k0291K57554g2702
16212b80434P4206C53010G8992R0963p1267c71523G3472a04071A99818p0421g0537
16200D5647J18707J06081N3278G0623J91632C603J96178e71A36791b71123A86186
$$ plain form
16280 71861 16191 1303 -114019 -66458 -54461 -112013 77424 88559 -4416 523925 468143 166414
16267 104879 -164610 465902 -149803 358055 447125 139481 28678 178440 238167 209548
16257 209548 288270 232157 152882 314315 102710 364042 122574 101758 -114132 174029
16246 328191 60519 -162349 36464 163298 -6556 295725 -4436 -134243 387948 11747 295379
16235 295379 201851 288475 -141384 68244 146029 -97674 54889 -135310 428226 -56785 56748
16223 493458 188995 -138465 177742 -277013 243159 408224 183064 162773 420327 -72702
16212 -280434 -206228 353010 78992 169955 98688 -371523 73472 -104071 199818 129397 -70537
16200 45647 164354 270435 323713 70623 262255 3603 199781 -571 136791 -271123 186186
16188A61009d71518a48024B88503a39317A20350O8955f1776b8378a3559G4135
16177A37726C7909A4721K43023F4038C0039a42055n6862D81623A88901B3657a05627
16165a23228B34076c8304k09796C5772J30109b95287D5647L16036a45218l8047
16155a83265d5170l6284A37357F6620b0631k17804a1324A56121a40601C26581
16144A69838j9200K40495C8952K06459r0311a55078D5851a61259q1030A97428
16133d9901j14799C04458G7224J780e9469E2888a88041A04043B8212f1086q1992
16122a43078g1317c1094m6727B63772a75843A01727K2411a60131L4675E7723P3819
16111A31542b1079j10225C560b4695C0794K08651b84975A57812e2549H0971J07355
$$ plain form
16188 161009 -471518 -148024 288503 -139317 120350 189305 -61776 -28378 -13559 74135
16177 137726 37909 14721 257744 64038 30039 -142055 -198917 481623 188901 23657 -105627
16165 -123228 234076 -38304 -248100 35772 165881 -295287 45647 361683 -145218 -183265
16155 -183265 -45170 -81454 137357 66620 -20631 -238435 -11324 156121 -140601 326581
16144 169838 150638 391133 38952 245411 155100 -155078 45851 -161259 -242289 197428
16133 -49901 -164700 304458 77224 79004 -59469 52888 -188041 104043 28212 -61086 -143078
16122 -143078 -71317 -31094 -77821 263772 -175843 101727 124138 -160131 -125456 57723 131542
16111 131542 -21079 -131304 3560 -24695 30794 239445 -284975 157812 -52549 80971 188326
16100A88326H9392J27401e5249j61664a485H741J38474d83534K38413h3907D6004
16088B85118i5788C00711A3556J94867b46607d3548m2225F1608J81064J25489
16078C68161c990j66951H1235J81673J38670A30129a67428e2251a5026j91558
16068b06584A49931k7093a92264e4365E505c4329B64816c5325D3391K48443f9416
16056B68151c4358n4m3439L6046C58210p0533b88877A43552d5948a0556B67623
16044a98903b0048C69440A20503K5669J11766r3150a80817k19360I9159g8471
16033d8485j57345B20239c26491B63046A9977J18669J26169K0531j27569o2796
16023I4981A7093c9827j53165K4698A22299N0608f1047I4037J6286e3m7573j43242
$$ plain form
16100 188326 89392 216793 -55249 -216913 -1485 8741 147215 -483534 -245121 -83907 46004
16088 285118 -95788 300711 13556 208423 -246607 -43548 -85773 61608 242672 368161
16078 368161 -3990 -170941 81235 262908 401578 130129 -167428 -52251 -15026 -206584
16068 -206584 149931 122838 -192264 -54365 5505 -34329 264816 -35325 43391 291834 -69416
16056 268151 -34358 -34412 -77851 -41805 358210 287677 -288877 143552 -45948 -10556 267623
16044 -198903 -20048 369440 120503 146172 257938 164788 -180817 -400177 99159 -78471
16033 -48485 -205830 220239 -326491 263046 19977 138646 264815 285346 157777 94981
16023 94981 17093 -39827 -192992 -168294 122299 172907 -61047 94037 110323 -53 -47626 -190868
16011a90868Q4375G5260b81120c3765B13018a58842A0972K17358i0747h806i0
15999A00996e7115l58848a17858A15403a20520d3695E6183c9582l65745A50447
15988g0408j04320N8434I35J70531h1424J139A82077a11065j16668r7084a16930
15976B15071l9801J9038h1719a68j45993f4287k4165C60131H5436M08702j87215
15965C06923o3301J90960I0163Q6115C6652a80118F7269a67811A75766g7768k546
15954h0314A55247d6280l90178F4165P721c1239A60165C4344b16338A53476J05952
15943B59428B828L35748m1293f4238A61873c46146C574b54801K1780j36085J14077
15932b55029b3525n4508B12395a46698N209f7505A9377a68243A3625Q8726m6706
$$ plain form
16011 -190868 -106493 75260 -281120 -33765 213018 -158842 10972 228330 -90747 -8806 -90
15999 100996 -57115 -415963 -117858 115403 -120520 -43695 56183 -39582 -405327 150447
15988 -70408 -174728 -116294 935 171466 -81424 -80285 182077 -111065 -227733 -324817 -116930
15976 215071 175270 194308 -81719 -168 -146161 -64287 -88452 360131 85436 494138 306923
15965 306923 243622 434582 90163 176278 36652 -180118 67269 -167811 175766 -77768 -80314
15954 -80314 155247 -46280 -436458 64165 71886 -31239 160165 34344 -216338 153476 259428
15943 259428 2828 338576 297283 -64238 161873 -346146 3574 -254801 -233021 -369106 -255029
15932 -255029 -23525 -78033 212395 -146698 -141489 -67505 19377 -168243 13625 102351 55645
15921E5645K9174a16305M4535J4003B10363c43704i6076B4258b19035E8402f2509
15909d36392J5247J06133O2728B36505q4367a966j45932O2414A50809b6425r6806
15898a23231r1490Q4434A06415a60783C85881a90563B30934a45902D067J55709
15888A59776N2509K5888a92453F8963K3588A0902a5594F7993L14060d08564a68679
15876g0163j41760R2539B4182L05018D8975K3537L34528A14372D4061J50453q7340
15865A07174a51384l5282e8448B9417c5790A459h3151l31759C01813a78218n1872
15854b30090a4164D7783b87277f1722B1380K69963a63496A27633K36967G6071
15843c01012p1187a20942q6811N8037m3566B63710a07412O650k7357l1937r5044
$$ plain form
15921 55645 84819 -116305 -71770 -57767 210363 -343704 -96076 24258 -219035 58402 -62509
15909 -436392 -421145 -315012 -252284 236505 152138 -1966 -147898 -85484 150809 -26425 -123231
15898 -123231 -214721 -130287 106415 -160783 385881 -190563 230934 -145902 4067 159776
15888 159776 212285 238173 -192453 68963 92551 10902 -15594 67993 382053 -408564 -168679
15876 -70163 -211923 -119384 24182 329200 48975 72512 407040 114372 44061 194514 107174
15865 107174 -151384 -186666 -58448 29417 -35790 1459 -83151 -414910 301813 -178218 -230090
15854 -230090 -14164 47783 -287277 -61722 21380 291343 -163496 127633 364600 76071
15843 -301012 -372199 -120942 -207753 -149716 -193282 263710 -107412 -100762 -128119 -160056 -255100
15832b55100i3948k06436J33778A12959j9167b37669O9089A62475b8253a2914
15821a35453I2302J86172c53103I4398J72819q4467b2268j5703l89948H231J47536
15810A55767k6268m7290M7468a10085q7495B68402A00180J77144c32756a36854
15799C06521A4708i0405A91770B2471Q5328j544a71226H8599a55661g7521A20878
15787c21833N2443i8277r1769H450L45470j51644K95184a50030B04376h1728k7823
15776a09551M6542F4960g8633j30797a6505D7864P154c16435A03312c71328a6031
15764b08517P1545B67899b97733b8573k01778f5377k21259c7354m5035c225A77395
15752f8533k46150F5677b41369a11493N5678B041J35980c8655B81897f6169h808
$$ plain form
15832 -255100 -93948 -300384 -166606 112959 93792 -237669 -168580 162475 -28253 -12914
15821 -135453 92302 278474 -353103 94398 267217 182750 -22268 -37971 -427919 8231 155767
15810 155767 129499 82209 129677 -110085 -197580 268402 100180 277324 -332756 -136854
15799 306521 14708 -90405 191770 22471 107799 106255 -171226 88599 -155661 -77521 120878
15787 -321833 -269390 -98277 -190046 8450 353920 202276 497460 -150030 204376 -81728 -109551
15776 -109551 -63009 64960 -78633 -209430 -16505 47864 55018 -316435 103312 -371328 -16031
15764 -208517 -136972 267899 -297733 -28573 -230351 -65377 -286636 -37354 -82389 -3225 177395
15752 -68533 -314683 65677 -241369 -111493 -55815 2041 138021 -38655 281897 -66169 -8808
15740D310Q4607e858k6857J6114p9502k5461N8038A60163f7122H2959b33258A7583
15727A14642Q685D9089J67968a4343A7725b74224q5961C50476b29577j73368e6967
15715c4725B2501a14526F7492b11263A36371R2299d9528r6921o1989k07821a1670
15703a0842A24770D8281a63131B1063O2818g6912K1740k25237h9136r0906A7411
15691G1071J4794A0101K98617f6125C3745a83593B24422c07866a17342A29075
15680e0723A48095J20289h0034r171K6204H7543K19936a876B40281a3158k7318
15669d0476p1772q4751L2880B04627b49785a23164H4222b07520j16587f0750I0846
15657H3827R45h9345r7373A27357J77740A10336n4641b61274e3142q8029M0131
$$ plain form
15740 4310 88917 -5858 -32715 -16601 -96103 -121564 -63526 160163 -67122 82959 -233258 17583
15727 114642 123327 49089 217057 -14343 17725 -274224 -360185 350476 -229577 -402945 -56967
15715 -34725 22501 -114526 67492 -211263 136371 228670 -49528 -146449 -208438 -416259 -11670
15703 -10842 124770 48281 -163131 21063 83881 -76912 -55172 -280409 -89136 -180042 17411
15691 71071 85865 10101 308718 -66125 33745 -183593 224422 -307866 -117342 129075
15680 -50723 148095 268384 -80034 -89205 -63001 87543 307479 -1876 240281 -13158 -40476
15669 -40476 -112248 -196999 -164119 204627 -249785 -123164 84222 -207520 -324107 -60750 90846
15657 83827 84772 -89345 -186718 127357 305097 110336 55695 -261274 -53142 -141171 -101040
15646a01040E6897Q3489f6450j80354Q5850l406m184P923J2792p4685D73716G5570
15633b02248m5437d6240j11020A14087g7350I9090b11795g16l44967M1902a19369
15621i4728A78538n5033a55726j24054A14669K55001p3841g9612J9117j25715
15611a86210h723j28694A8732b60600K1220A57728D6032b1001p7918A62491i4785
15599G1718e33289g9363c4892j27403j09995J6868o0133e8695A67533J90184a30045
15587B6926j1930J13058D0525b84639M8506i0004j22207h0597j69152E9071E439
15575b56193R7722C1273e1801B05748D9061d2353A01982B0301a13847d6982A00951
15563E57840G8007L10364Q1481a81490A49236a5442q8286A19979a88269F7695
$$ plain form
15646 -101040 56897 140386 -66450 -246804 -160954 -164360 -168544 -160621 -147829 -222514 473716 75570
15633 -202248 -247685 -46240 -157260 114087 -77350 99090 -211795 -716 -345683 -303781 -119369
15621 -94728 178538 123505 -155726 -279780 114669 369670 295829 -79612 -60495 -186210
15611 -186210 -8723 -137417 18732 -260600 -239380 157728 46032 -21001 -98919 162491 -94785
15599 71718 -533289 -79363 -34892 -162295 -272290 -255422 -315555 -58695 167533 357717 -130045
15587 26926 14996 128054 40525 -284639 -236133 -90004 -212211 -80597 -249749 59071 5439
15575 -256193 -158471 31273 -51801 205748 49061 -42353 101982 20301 -113847 -46982 100951
15563 557840 78007 388371 469852 -181490 149236 -15442 -103728 119979 -188269 67695
15552a01480p3284C3477j3192b67693C44067a1968j58040c7660A02521J75886
15542B78407n8959a41702e9864b923n3839J6363m06832a92666A03845C1815J2916
15531D4731J14185c42836a08362l16367a72498A78281a50442C09454A04946b43324
15520A76271J1743p4118J9300B0137a18323M0575k0890H9922K46523A11905a68075
15508e5766J8559a1658n0871a8533m77551A28647B8044J95564J19954a66981C4101
15496A24409a20682k38687A78250f8631A45032l6661J39476g6620A001b90520
15485a3993G6444b8696B64606b23722l5501e120o8339A51472G1306f5858e095
15473I7489j887a80827a7838r1298E7322J43649O159g0816n4608O946j90115A69538
$$ plain form
15552 -101480 -174764 33477 20285 -267693 344067 -11968 -170008 -37660 102521 278407
15542 278407 219448 -141702 -59864 -2923 -56762 -40399 -447231 -192666 103845 31815 44731
15531 44731 158916 -342836 -108362 -424729 -172498 178281 -150442 309454 104946 -243324
15520 176271 188014 113896 133196 20137 -118323 -77748 -98638 89922 336445 111905 -168075
15508 -55766 -37207 -11658 -62529 -18533 -496084 128647 28044 223608 343562 -166981 34101
15496 124409 -120682 -359369 178250 -68631 145032 108371 247847 -76620 1001 -290520
15485 -13993 76444 -28696 264606 -223722 -259223 -5120 -73459 151472 71306 -65858 -5095
15473 97489 95602 -180827 -17838 -109136 57322 200971 207130 -70816 -125424 -118478 -308593 169538
15460c2591a4489A86199n1517m3113J36706r3675a04705B07546q4702a39075J3940
15449a25135j12833H9797a188k8860B77035A15114b6473j45062j0479L2665A08723
15437D9299a52419N7034a3724A68303C338a16893E449a26659D4501d6724B13535
15425A71800a16848I4940c02219E0269a78409A20903a38683A87063M2601r7931
15415A31733b33545O4749m3759J04202a5520B1677a29069d3264p1311B63153a36967
15403a29649A0008N5919g5581B1007J54185O6512a85111H9434c8010A87061a38280
15391c15950h6026G175j412g3993r7825K148Q2481C88833j70937a51483B4576
15379A13267m9710M2989c18441I6512c21424c1568A80744r436E0021a70157N9403
$$ plain form
15460 -32591 -14489 186199 134682 91569 228275 134600 -104705 207546 122844 -139075 -125135
15449 -125135 -237968 89797 -1188 -30048 277035 115114 -26473 -171535 -182014 -149349 108723
15437 49299 -152419 -95385 -13724 168303 3338 -116893 5449 -126659 44501 -46724 213535
15425 171800 -116848 94940 -302219 50269 -178409 120903 -138683 187063 229664 131733
15415 131733 -233545 -168796 -212555 -108353 -15520 21677 -129069 -43264 -114575 263153 -136967
15403 -129649 10008 65927 -75581 21007 175192 241704 -185111 89434 -38010 187061 -138280
15391 -315950 -86026 7175 5763 -73993 -171818 -169670 -87189 388833 217896 -151483 24576
15379 113267 63557 106546 -318441 96512 -321424 -31568 180744 171308 50021 -170157 -110754
15368a10754d8515A08512g295A25741L5205a25010i719k99883a47740A28041J75220
15357C03261a04542j33593a5679A37697e4081A77210P3504c512j53683c0151C7290
15345c9283p7574E6949a78171c9662E3307C363M0865J56962a41009E1396K3680
15334G5076A6584O768c7315B7543K87333b08455d5213n3283g924q7722A21323
15322c4896A6559K10516M4950b49725R5758P4629k05468C60394A54166e8475B26819
15310A62869R7743e4979I8063b54456c3602E535a3506B19191a17551j41051c9218
15298C70819o9072I9229l7450d0834j2766a2002E4053c04312C83164A01275J91278
15287B92553a78860o2146c1253A95401i2623q7976e2465A11156J20616a41415
$$ plain form
15368 -110754 -48515 108512 -7295 125741 160946 -125010 -9719 -309602 -147740 128041 303261
15357 303261 -104542 -238135 -15679 137697 -54081 177210 250714 -3512 -157195 -30151 37290
15345 -39283 -116857 56949 -178171 -39662 53307 3363 44228 201190 -141009 51396 75076
15334 75076 16584 23352 -37315 27543 314876 -208455 -45213 -98496 -7924 -95646 121323
15322 -34896 16559 227075 272025 -249725 -153967 -79338 -284806 360394 154166 -58475 226819
15310 162869 260612 -54979 98063 -254456 -33602 5535 -13506 219191 -117551 -258602 -39218
15298 370819 301747 99229 61779 -40834 -53600 -12002 54053 -304312 383164 101275 292553
15287 292553 -178860 -241006 -31253 195401 -92623 -180599 -52465 111156 231772 -141415
15276f7709D9934N0853i0478L7351p9354F5327K7409f8809H6871R240m2113K13876
15264B67874A29004l8537J84995C5147a67943c7776D47349C2805c07354A21619
15253c34135k4572d7493B81412d8244D8267e1416E7445O8494d5392E1312N8229
15242A09541J77963m8101j15245R2997L06874J8921B68063j12739M04325M89884
15232A049533O19804m24721Q0951J34334m95294D58513p4236o4178o3401c7377
15221B44081F9742k0418d4921B42641m2142q6176N8438q699l3606a88520B33795
15209C9859d37929e3711I5640l1186h2143a0101j77880G6868K45332p0279b5967
15197B9698L64638f9646A328b40985C70650I5581K5728e5000j33857H4235J50591
$$ plain form
15276 -67709 49934 100787 -90478 -53127 -132481 65327 92736 -68809 86871 96111 53998 267874
15264 267874 129004 90467 275462 35147 -167943 -37776 447349 32805 -307354 121619
15253 -334135 -358707 -47493 281412 -48244 48267 -51416 57445 125939 -45392 51312 109541
15242 109541 287504 239403 124158 217155 524029 542950 268063 155324 559649 1049533
15232 1049533 1669337 1244616 1325567 1459901 964607 458513 384277 320099 256698 -37377
15221 244081 69742 49324 -44921 242641 200499 114323 172761 164062 130456 -188520 233795
15209 39859 -437929 -53711 95640 64454 -82143 -10101 -187981 76868 322200 251921 -25967
15197 29698 394336 -69646 1328 -240985 370650 95581 121309 -55000 -188857 84235 234826
15186B34826N588r965K05301i7994C7777a08241a6474C9223N426J76811a05035
15174A45039b09852D1837K26438j14739f3345A65826B4214J92179n6833n9505
15164A00055a88151D05928b40484A64830G0850L9682J26463K22362A58364l7178
15154A21186J20647b2715A48600B2039c0255A69814c2671I797L3137K47744R0141
15143C80819B0847J08514L47260f1223B013L2584b4538D7564L6108L02948A04008
15131B03619k7586C4671J28095m2076K83900E4522R973a2861j70974B09530P7070
15120B86600j3455e1418A47130L7462n5945i2224b1207D5860L39818A30205J05134
15109B35339C247K9248J13822r431i1981C71643J51331r7360A18482c028j05897
$$ plain form
15186 234826 240414 230449 435750 -97994 37777 -108241 -16474 39223 44649 221460 -105035
15174 145039 -209852 41837 268275 153536 -63345 165826 24214 216393 159560 100055
15164 100055 -188151 405928 -240484 164830 70850 110532 236995 459357 158364 121186
15154 121186 241833 -22715 148600 22039 -30255 169814 -32671 9797 42934 290678 380819
15143 380819 20847 129361 476621 -61223 2013 34597 -24538 47564 83672 386620 104008
15131 203619 176033 34671 162766 120690 404590 54522 64495 -12861 -183835 209530 286600
15120 286600 273145 -51418 147130 184592 128647 -92224 -21207 45860 385678 130205 235339
15109 235339 3247 32495 146317 136886 -91981 371643 522974 425614 118482 -3028 -108925
15098a08925a650B36105F5057J06710J18641a86501B45400n3541n8785B1088M3931
15087F5019B1460h7780D39418a78589A26611M1327i7296A76945a17596j2502A62501
15075C38797m1675r1679a82120C22637J7433j34788k1980a33486A79827i68A38661
15063B52706a86017A27147J09055H6708J79874j07248J00829A22976D024a56937
15052C86382o0989A02483J22531Q2960D1440g1726B56625K58753b21980c611B31718
15040B80167j21517J17206q0767l4748F2744l0818N8133J61889H4436A1015L91173
15029D02188A33876E5280M485H062J71538M53134A10846R7277J43037E7949K60306
15018C18255q2294L3965F2477O0905J03083o626b3166E90815k40919P727A25632
$$ plain form
15098 -108925 -1650 236105 65057 171767 290408 -186501 245400 191859 133074 21088 65019
15087 65019 21460 -87780 439418 -178589 126611 167938 -97296 176945 -117596 -130098 162501
15075 338797 297122 205443 -182120 322637 340070 205282 183302 -133486 179827 -968 138661
15063 252706 -186017 127147 236202 86708 266582 159334 260163 122976 4024 -156937
15052 386382 325393 102483 225014 307974 41440 -71726 256625 515378 -221980 -3611 231718
15040 280167 158650 275856 195089 160341 62744 31926 90059 251948 84436 11015 402188
15029 402188 133876 55280 59765 8062 179600 632734 110846 208123 351160 57949 318255
15018 318255 235961 269926 62477 123382 226465 219839 -23166 590815 349896 357623 125632
15006F7275K14108J4109a56782A52481Q6791K46497i987A79867J07253j23762
14996A63358C345h1326D21216j40684A39344d2896A65607m7098R580N3376R4616
14985B76081a24694F25498D238L69055j06709j07436N2952n7338j9840J87616
14975C22538j29026K6301J56365J7570A94397a0675B36445j7625l5856l1665R3096
14964B44395B1572M77570j27701L65796C36010E4934J48516J7910n2173Q7605
14954B56792R6035A11470Q5675K52092j37616F6358J69597K08735j37803K93750
14944F00637j27867B16554h448A66155J48312J82446D0045a4561B52594A02741
14933D1264N33453j62934A0051Q8790M72158o4434j07270K3820j55183N7522j53340
$$ plain form
15006 67275 281383 295492 -156782 152481 239272 485769 -9987 179867 287120 163358
14996 163358 3345 -81326 421216 280532 139344 -42896 165607 118509 128089 181465 276081
14985 276081 -124694 625498 4238 373293 266584 159148 212100 154762 134922 322538
14975 322538 193512 219813 376178 393748 194397 -10675 236445 218820 182964 151299 244395
14964 244395 21572 499142 371441 737237 336010 54934 203450 221360 169187 256792
14954 256792 352827 111470 197145 449237 311621 66358 235955 444690 306887 600637
14944 600637 472770 216554 -8448 166155 314467 496913 40045 -14561 252594 102741
14933 41264 574717 411783 10051 98841 570999 506565 399295 423115 267932 325454 172114
14922A72114Q271j7626K06998L9856j93055K27004A01048L01329r8857J22075
14912D25595A48745J60169l8401J85566j06666J85722A32003J94162N7661l3046
14902C50780J08818j86752K40865m516p0972J2013j15813j39634J73065f2710
14891D30714A68051K12316I0835K80332j61465J53202P7259A82277K55771j38823
14881B99225q8371L89416K3431k60188A54456M54001G9501L07644F6236K19165
14871B85401L24374C02893A48477j8712L00094o9040J58183j86627j24079O8972
14861B77268j20506M15031l4010J64633C43612J81510o6625j22535J60579k8421
14851D68120k00224L00491j8142A72689F4937K63064J17853q9506K06705N050
$$ plain form
14922 172114 180385 162759 369757 409613 216558 443562 101048 402377 303520 425595
14912 425595 148745 308914 270513 456079 349413 535135 132003 326165 383826 350780
14902 350780 459598 272846 513711 509195 438223 450236 334423 194789 367854 -62710
14891 430714 168051 380367 90835 371167 209702 362904 440163 182277 438048 299225
14881 299225 210854 600270 623701 363513 154456 608457 79501 387145 66236 285401
14871 285401 609775 302893 148477 129765 429859 360819 519002 332375 208296 277268
14861 277268 156762 571793 537783 702416 343612 525122 458497 335962 496541 468120
14851 468120 267896 568387 550245 172689 64937 328001 445854 356348 563053 568103
14841E68103k56820K88769j42784N6928A68195O92116m10867N5472j17038L1288
14831D19166k38L48089k10269k61185J88376l462p2430j87213Q4284K02488l2
14820E07574O8137l7052k66768K62546Q84q4825K27965k88041L56543k20521j26213
14809D00229J45035j70922K03816j35600j46930P9804M14714N1027m18859M5012
14799D67326J15733j77828J53878p6171K09305J6428j38184J53350C40997L3691
14789C74688M4614L53903k11166P1140l11877q2483L72875J44825k31998j93691
14779C30830K98703j85621K86419A47542M49853M6400l2052j49698M84964C41343
14768G28451P6064j01822N2654j81963N0167j50469L9998L36689j77129j32048
$$ plain form
14841 568103 311283 600052 457268 514196 168195 860311 449444 504916 387878 419166
14831 419166 418928 767017 556748 295563 483939 480477 408047 220834 305118 507606 507574
14820 507574 575711 538659 271891 534437 535321 450496 678461 390420 746963 526442 400229
14809 400229 545264 374342 578158 442558 295628 375432 790146 841173 422314 467326
14799 467326 583059 405231 559109 482938 692243 708671 570487 723837 340997 374688
14789 374688 419302 773205 562039 633179 321302 238819 611694 756519 524521 330830
14779 330830 629533 443912 730331 147542 597395 643795 611743 462045 947009 341343
14768 728451 804515 702693 755347 573384 623551 473082 513080 849769 672640 540592
14758E40592K91224M8790j97469J39142k46018O5736J73587j85301K76500l00751
14748F06032P9864N6235j6489o0842K75085P0067K2889l76970O737J48911j92080
14737F19439j2466m7882J12326L98850k62782l6417N4659j15823J9827j49483
14727E80248J68901Q3611k22984r5467M47900j67484l17143M61562k92866J91476
14717H37754K46551k60479j26036k12271K27538l4261K68173j29582J20550L2808
14707I70745K02940n48271O54451l29829K613o9045J10658M3096k75296J49704
14697I11766r8803q57J75895j93859N3414l2649K9909o1207J78589k5610J45287
14686A081875l03612J52443K85102j70653j17567p9184L43723l69242R0645j68638
$$ plain form
14758 540592 831816 880606 683137 822279 576261 641997 815584 630283 906783 606032
14748 606032 685896 742131 725642 664800 939885 1009952 1032841 655871 662608 811519 619439
14737 619439 606973 559091 671417 1070267 807485 771068 825727 709904 729731 580248
14727 580248 749149 832760 609776 514309 962209 794725 477582 939144 646278 837754
14717 837754 1084305 823826 697790 485519 713057 678796 946969 817387 937937 970745
14707 970745 1173685 625414 1279865 950036 952649 883604 994262 1037358 762062 911766
14697 911766 812963 812106 988001 794142 847556 814907 844816 783609 962198 936588 1081875
14686 1081875 778263 930706 1215808 1045155 927588 848404 1192127 822885 913530 744892
14676G44892K36416j02372J20869l19901j63946M72063J4774O3375l43908K93682
14666A015944p1028J29933K37223l92809k131M32054r6958J80466r2385k25254
14656A115055J94337J74979m37002M18309n10019M6636M02773m55913J82527j13549
14646A018133K37849M387J86304k91775l38167L28103J41730l08667L77376j91335
14636A163938L49567k84931J19592Q7045l37799K52307j81946J89452r2934K78887
14626A543178l16485J21099n0256L53552j80222k6778O0274j9761j40489J94302
14616A538414m5281K08728l41851L1075m23847M20862J48421J33830k30631M2695
14606A482415J21501j48855K7477P4694n2862K47431p0459K3176q5200K79164
$$ plain form
14676 744892 981308 878936 999805 679904 515958 988021 1002795 1066170 722262 1015944
14666 1015944 944916 1074849 1312072 919263 917132 1349186 1252228 1432694 1340309 1115055
14656 1115055 1309392 1484371 1047369 1465678 955659 1002295 1405068 949155 1131682 1018133
14646 1018133 1255982 1260369 1446673 1154898 816731 1144834 1286564 977897 1355273 1163938
14636 1163938 1513505 1228574 1348166 1435211 1097412 1349719 1167773 1357225 1264291 1543178
14626 1543178 1226693 1347792 1297536 1651088 1470866 1444088 1504362 1484601 1344112 1538414
14616 1538414 1493133 1701861 1360010 1391085 967238 1388100 1536521 1670351 1439720 1482415
14606 1482415 1603916 1455061 1482538 1557232 1504370 1751801 1681342 1704518 1619318 1898482
14596A898482j1782k63059P8818k93385N44078k14977J61798q737j44916k74840
14586A471480M72885L9340k37702L3932K15949o1745k1232J46967n14106K55268
14576A801036J00280J40134j91928k77577M79016j44582K46587N5477m66596J93378
14566A935225J81065P7590k42100j80246M84973k76629K58128o3870M20705l62792
14556B232049Q7169N5594J05925R5511K48262j90502J28826J37409j33376m4938
14546B721929M39508k26774L72145k40868N99724J39126O45738K62833Q16015
14537E529376M10174J225547Q69050K724036L721204P115363J2009434q96993
14529C2707191j4352515o484099l526799k492072j829610l90903o72629j37091
$$ plain form
14596 1898482 1886700 1623641 1702459 1409074 1953152 1738175 1899973 1891236 1746320 1471480
14586 1471480 1944365 1983705 1746003 1779935 1995884 1934139 1912907 2059874 1545768 1801036
14576 1801036 1901316 2041450 1849522 1571945 2050961 1906379 2152966 2208443 1741847 1935225
14566 1935225 2116290 2193880 1951780 1771534 2256507 1979878 2238006 2174136 2594841 2232049
14556 2232049 2319218 2374812 2480737 2576248 2824510 2634008 2762834 2900243 2766867 2721929
14546 2721929 3161437 2934663 3306808 3065940 3665664 3804790 4450528 4713361 5529376
14537 5529376 5939550 7165097 8034147 10758183 14479387 21594750 33604184 32707191
14529 32707191 18354676 11870577 8343778 5851706 4022096 3631193 2958564 2821473
14521B821473K37822j45283n50061P22316k33853l09915m8419K0100K98541j38026
14511B674695j96895J73466k2132K42233k81607L32157j41737K44886k60186j89394
14501B575486M91633m98569O67910l40039K29885J37217r2076j90427L04795j78701
14491C107114Q52343p87092P3716O2137K24925k77028m91J12511J46030j50042
14481C364123K79775j86194K44163M1256k78870O37683k72974P6396J07660o6426
14471C946592J02769o9806R3432j05574J07360O8811Q7468M6921r5244K86521
14461D469250k71657M35997m75386L59347K01585j77087Q1285K89115J34958k22300
14451D825107J35299J63306j35533M609L71384l73288L23775o3740K65166j10571
$$ plain form
14521 2821473 3059295 2914012 2363951 3086267 2852414 2542499 2494080 2514180 2812721 2674695
14511 2674695 2477800 2651266 2629134 2871367 2589760 2921917 2780180 3025066 2764880 2575486
14501 2575486 3067119 2568550 3236460 2896421 3126306 3263523 3171447 2981020 3285815 3107114
14491 3107114 3959457 3172365 3246081 3308218 3533143 3256115 3255624 3368135 3514165 3364123
14481 3364123 3643898 3457704 3701867 3743123 3464253 4101936 3828962 3905358 4013018 3946592
14471 3946592 4049361 3979555 4072987 3967413 4074773 4143584 4231052 4277973 4182729 4469250
14461 4469250 4197593 4633590 4158204 4517551 4719136 4542049 4623334 4912449 5047407 4825107
14451 4825107 4960406 5123712 4988179 4992788 5364172 4990884 5314659 5250919 5516085 5405514
14441E405514O06180m86703k7529L20073L8120j46551O3996J54546j1136J42727
14431F059237P1785J59665J7398L03553m6695J43208O1259k15461M34673P4165
14421G062787l42341J24729L25294M03623k2718K2676l264J17162O7723K61853
14411H017524K31415J14093j43666j2094M07299Q8014K9494l9260J93599N79701
14401I466119l59259P2969N57762k05621O0359L76877J19892K20387O0409L1273
14391A0401167J86653K67760J55999M56956k28017J86507K93027M20989K26372
14382A2367413k59186M63702K19051K11731J02867L69050m6347N05199L34964
14373A4268444j09435O23587k0973M14433J64838N03596r0714N47826M27499N91724
$$ plain form
14441 5405514 6011694 5524991 5497462 5817535 5855655 5709104 5773100 5927646 5916510 6059237
14431 6059237 6131022 6290687 6308085 6611638 6564943 6708151 6769410 6553949 6988622 7062787
14421 7062787 6720446 6845175 7170469 7574092 7551374 7574050 7570786 7687948 7755671 8017524
14411 8017524 8248939 8363032 8219366 8207272 8614571 8702585 8732079 8692819 8886418 9466119
14401 9466119 9106860 9179829 9737591 9531970 9592329 9969206 10089098 10309485 10369894 10401167
14391 10401167 10587820 10855580 11011579 11468535 11240518 11427025 11720052 12141041 12367413
14382 12367413 12108227 12571929 12790980 13002711 13105578 13474628 13428281 13933480 14268444
14373 14268444 14159009 14782596 14761623 15176056 15340894 15844490 15753776 16301602 16729101 17320825
14363A7320825k58839M35216N19190K05970L62864P42471L11583K80494J98965
14354B0118739L94463Q81310N1591N85600J68920O48592M45559O94393L56723
14345B4345890M74280P64403O51727O04198M82024N38201Q46943J67689J253240
14336C0128595O67469P95609N75014P15454J292436N31754Q45430J013595Q70983
14327C7436339J087004J312206Q70559J149485J145366J435190J432803J155427
14319D7024379J370210J290638J417595J471769J894791J661405J650362J965999
14311E9747148J875147K143686K403222K078684K105519K619400K705819K280946
14303G7959571L007382L200733L167792L234040L621798L472789M241093L826252
$$ plain form
14363 17320825 17061986 17497202 18016392 18222362 18585226 19327697 19639280 19919774 20118739
14354 20118739 20513202 21394512 21446103 22031703 22200623 22849215 23294774 23989167 24345890
14345 24345890 24820170 25584573 26236300 26840498 27322522 27860723 28707666 28875355 30128595
14336 30128595 30796064 31591673 32166687 32882141 34174577 34706331 35551761 36565356 37436339
14327 37436339 38523343 39835549 40706108 41855593 43000959 44436149 45868952 47024379
14319 47024379 48394589 49685227 51102822 52574591 54469382 56130787 57781149 59747148
14311 59747148 61622295 63765981 66169203 68247887 70353406 72972806 75678625 77959571
14303 77959571 80966953 84167686 87335478 90569518 94191316 97664105 101905198 105731450
14295A05731450M329829M424364M758247M869249N341138N950920N926257O268237
14287A47599691O755201P259979P541034P841730Q331504Q607906R590133J0016046
14279B13543224J0563959J1001776J1619326J2216684J2856028J3264151J3965990
14272B99031138J4485356J4880615J5162548J5059035J5609095J5416777J4630422
14265D04274986J1610469R507816Q396948P856260O629685O292819N499643L505162
14257D63573788K184838J464799L23474l455206q795040q793134j0765325j2225696
14249D23512498j3217661j3568003j2627669j3596015j3518088j4031046j3448021
14242C29505995j2935705j3848170j3115505j3274566j2370084j2505557j1992549
$$ plain form
14295 105731450 110061279 114485643 119243890 124113139 129454277 135405197 141331454 147599691
14287 147599691 154354892 161614871 169155905 176997635 185329139 193937045 203527178 213543224
14279 213543224 224107183 235108959 246728285 258944969 271800997 285065148 299031138
14272 299031138 313516494 328397109 343559657 358618692 374227787 389644564 404274986
14265 404274986 415885455 425393271 433790219 441646479 448276164 454568983 460068626 463573788
14257 463573788 465758626 467223425 467546899 464091693 455296653 446503519 435738194 423512498
14249 423512498 410294837 396726834 384099165 370503150 356985062 342954016 329505995
14242 329505995 316570290 302722120 289606615 276332049 263961965 251456408 239463859
14235B39463859j0866584j0780334j0243222r569436q822006q968260p734431
14228A72479586p696829p267808o948090o389500o183486n728401n618572n258169
14220A21388731n238566m646094m449844m245337l773311l682465l933037l432890
14212H7987187l970460k974408k855057k598748l041723k591655k215423k315604
14204F5424109k186154k195294k122319k064768j597318j625900j758327j595276
14196E0278753j266563j854994j228266j473161p00494j429377j533118q29212
14188C9963568j334316q57630r17843q49606j101395r27359r87059o40380q51671
14179C1496309p53786m83788j175687m51255r11881q80860k79735j039681k32247
$$ plain form
14235 239463859 228597275 217816941 207573719 198004283 189182277 180214017 172479586
14228 172479586 164782757 157514949 150566859 144177359 137993873 132265472 126646900 121388731
14220 121388731 116150165 111504071 107054227 102808890 99035579 95353114 91420077 87987187
14212 87987187 84016727 81042319 78187262 75588514 72546791 69955136 67739713 65424109
14204 65424109 63237955 61042661 58920342 56855574 55258256 53632356 51874029 50278753
14196 50278753 49012190 47157196 45928930 44455769 43755275 42325898 40792780 39963568
14188 39963568 38629252 37771622 36853779 36004173 34902778 33975419 32988360 32347980 31496309
14179 31496309 30742523 30258735 29083048 28631793 27719912 26839052 26559317 25519636 25287389
14170B5287389q52716o72394K3358p92433j49101q84890l23998m85284j91731
14161B0958200m84929o44568n16551l99476K23355q88289j59097l19128n04283
14152A7265234m95180J13695m16090l54469n53386P2476k68818m31510R7988m37268
14142A4592672o01189Q1969j17006l16431j82868k49167k84132l05310l46400
14133A2272138O459p7875J0079l67401k97008j41820k67797k29417K87049m09494
14123A0784913l00951j06724r2099m62836Q7604Q4594j63989j31943j48786k99023
14113I250760j11611j23252J0009o8561j0758k89676k91303J41280j15265j69107
14103H222516k23754k63821L03662l12056p3391J67504k11938j337l48903k63154
$$ plain form
14170 25287389 24434673 23762279 23785637 22993204 22844103 21959213 21635215 21149931 20958200
14161 20958200 20473271 19828703 19312152 18912676 19136031 18247742 18088645 17769517 17265234
14152 17265234 16770054 16883749 16467659 16113190 15559804 15632280 15363462 14931952 15029940 14592672
14142 14592672 13991483 14073452 13956446 13640015 13457147 13207980 12923848 12618538 12272138
14133 12272138 12278597 12200722 12210801 11843400 11546392 11404572 11136775 10907358 11194407 10784913
14123 10784913 10483962 10377238 10285139 9822303 9909907 9994501 9830512 9698569 9549783 9250760
14113 9250760 9139149 9015897 9025906 8957345 8946587 8656911 8365608 8506888 8391623 8222516
14103 8222516 7998762 7734941 8038603 7726547 7653156 7820660 7608722 7607385 7258482 6995328
14093F995328o97J95736l07741K7061k50288J25713m18738M38751j12592o40642
14083F051891o1453j35478K24979j19596J401j4575J09932m55304J0873j7985
14073E594685k8162j00841m4197J69979k31577L2326k75656J02832q4830k46750
14063D887809J48149K9915m2356o7385l89715J16893j1237k81784L89545m36535
14053D343299N832J61446j04030k4206m0621j88728P0233j11127j4325J96148
14043D293921k21349J29841j0341J44153p62101L09954K4762o2967l7990J59728
14033C967611k73278q0511n5980O5914m0114J26725m05676k03111r2285K40663
14023C249958N30568q55702m2687L89834O7032j51573k1918J15408q5386j09847
$$ plain form
14093 6995328 6994631 7190367 6882626 6909687 6659399 6785112 6366374 6805125 6692533 6051891
14083 6051891 5990438 5854960 6079939 5960343 5961744 5947169 6057101 5601797 5612670 5594685
14073 5594685 5566523 5465682 5421485 5591464 5359887 5392213 5116557 5219389 5134559 4887809
14063 4887809 5035958 5065873 5023517 4956132 4566417 4683310 4672073 4390289 4779834 4343299
14053 4343299 4349131 4510577 4406547 4382341 4341720 4152992 4223225 4112098 4097773 4293921
14043 4293921 4072572 4202413 4192072 4336225 3574124 3884078 3908840 3845873 3807883 3967611
14033 3967611 3694333 3613822 3557842 3623756 3583642 3710367 3304691 3101580 3009295 3249958
14023 3249958 3780526 2924824 2882137 3271971 3339003 3187430 3165512 3280920 3195534 3085687
14013C085687q2106K84083l31002p2248o5492j6342N8777O0572j56665K00578
14003B965842l83190L3277J82754j11886J76324j89790k78231L69832j22861l80790
13993B261281L60905r8080k4930k99562M87453j55666n3668j34601K95589l14772
13983B323949J19810j48368J82185N52057J7323R0780N28458N86045P03539J637408
13973F593186L082486N899489J2841214N770594j2597751q380263l656836k072260
13965G479859j470500j085944N9165p81600m01914K3674k24234k56985o5018m40462
13955B836041R4370j69331j48642K0796j16133j69307M03643m24972J70149j71034
13945B325580O8702N3426j93311k19787K46334m9018j49992J89681l8956j68554
$$ plain form
14013 3085687 3003581 3287664 2956662 2884414 2818922 2802580 2861357 2921929 2765264 2965842
14003 2965842 2582652 2615929 2798683 2686797 2863121 2673331 2395100 2764932 2642071 2261281
13993 2261281 2622186 2524106 2499176 2199614 2687067 2531401 2477733 2343132 2638721 2323949
13983 2323949 2443759 2295391 2477576 3029633 3046956 3137736 3666194 4252239 4955778 6593186
13973 6593186 9675672 15575161 28416375 34186969 21589218 13208955 9552119 7479859
13965 7479859 6009359 4923415 4982580 4200980 3799066 3822740 3598506 3341521 3276503 2836041
13955 2836041 2930411 2761080 2612438 2633234 2517101 2347794 2751437 2326465 2496614 2325580
13945 2325580 2394282 2447708 2254397 2034610 2280944 2231926 2081934 2271615 2232659 2064105
13935B064105k03699K93493M0562j7702k09208m3662J90421l60311L0722N4119
13925A838840L19702l33321K30346l68105J84873p7243p6989L9506k23017K09748
13915A744340j16045J45900J41900L1324l07837K40186l99664j2813K63404J03640
13905A834335k43381K80774m51404k6839K08117J74070n28714K00271L34404M5912
13895A827545m75046J40556R0150j14983J59428l24932J40832k83026N16265l16720
13885A360069n1490k8607r1711K39297J64339k31833L3967j50541K98886k77487
13875A264889J94388o9603J40442n06564J48901L44395k63963o7785L58038l94805
13865A148333p2076J34082L10589l14594O8987l49439M48369o3641K20338j0655
$$ plain form
13935 2064105 1860406 2153899 2194461 2176759 1967551 1923889 2114310 1753999 1784721 1838840
13925 1838840 2158542 1825221 2055567 1687462 1872335 1795092 1718103 1757609 1534592 1744340
13915 1744340 1628295 1774195 1916095 1947419 1639582 1879768 1480104 1467291 1730695 1834335
13905 1834335 1590954 1871728 1420324 1393485 1601602 1775672 1246958 1447229 1781633 1827545
13895 1827545 1352499 1493055 1583205 1468222 1627650 1302718 1443550 1160524 1676789 1360069
13885 1360069 1308579 1279972 1188261 1427558 1591897 1360064 1394031 1243490 1542376 1264889
13875 1264889 1459277 1389674 1530116 1023552 1172453 1516848 1252885 1185100 1543138 1148333
13865 1148333 1076257 1210339 1520928 1206334 1275321 925882 1374251 1310610 1530948 1520293
13855A520293q5278k19959j47635K53793j1914j81464j55521o8077L11060K6580
13845A241878J12798j07982l21716K79794E87079M57377J43497K37366k23820
13836A201499k34197J70299j29215j25695K60549q8217j64709K61829k90919L32236
13826A193460o5602N7470j26855P8368j25742J01719l10846M29543k44812k4970
13816I61733j45447L31059p8209p9115j04887l50477L80083m4429k08253L60471
13806A022529l51876n669M85323k19281n3871k6844k69830O60218l93763K38027
13796A084963J20432k45798k31022j9423l7882p3691L46245K3832j9927k28378
13786G19351l4384K7108M0676K96294k8790J8719j19246l67926j2646L71839j60147
$$ plain form
13855 1520293 1435015 1215056 1067421 1321214 1309300 1127836 972315 904238 1215298 1241878
13845 1241878 1354676 1246694 924978 1204772 587079 1044456 1187953 1425319 1201499
13836 1201499 967302 1137601 1008386 882691 1143240 1055023 890314 1152143 861224 1193460
13826 1193460 1127858 1185328 1058473 1136841 1011099 1112818 801972 1231515 986703 961733
13816 961733 816286 1147345 1069136 990021 885134 534657 914740 870311 662058 1022529
13806 1022529 670653 664984 1150307 931026 877155 850311 580481 1240699 846936 1084963
13796 1084963 1205395 959597 728575 709152 671270 597579 943824 967656 947729 719351
13786 719351 684967 712075 752751 1049045 1020255 1038974 919728 551802 539156 910995 750848
13775G50848M7338J03713l1034J2236K52492j54075k67706r5403R0165l26099
13765C82475O42885l76993j7887K93375k79865J49093j41749j00272L65590l15510
13755F01142L11180M4269j32943J20599o9673k6908M4963j05506k80630L23029
13745H29522C66205K02838J65495j32420L20729l01630j09770J38996q8487K23181
13735G85137q1831L8631O0427k39741k79584K95910k43122N33633j92333K53234
13725I30361K1736D52686R5258J35951B02140N61919j34213L122q3020M9683K28745
13714H28376j96364J76201C97604M08245q7532j54623n2183K1572J2911L8643
13704E84637j81860L81283j05126Q5922j50310B45651M49529n5746q2397R659
$$ plain form
13775 750848 798186 901899 870865 883101 1135593 981518 713812 618409 708574 382475
13765 382475 1025360 648367 630480 923855 643990 793083 651334 551062 916652 601142
13755 601142 912322 956591 823648 944247 874574 847666 892629 787123 506493 829522
13745 829522 366205 569043 734538 602118 922847 621217 511447 650443 561956 785137
13735 785137 703306 741937 802364 562623 283039 578949 335827 869460 677127 930361
13725 930361 952097 452686 547944 683895 202140 764059 629846 632968 549948 599631 828376
13714 828376 632012 808213 397604 805849 718317 563694 511511 533083 545994 584637
13704 584637 402777 784060 678934 764856 614546 245651 695180 639434 557037 566696
13694E66696p1060J94541l02024J90568j1388J41591N9290k69129k6606B05442
13683F63548k3417k99190K69508q0298L3064K9848j11171K60090q5043l13695
13673C43244N27689l43059j33381N1046J59003q5524J08197r7378j66781l3590
13663C29466j8040O8403J01186P5735L5063j81105A04491N45768C22113Q6193
13653D08306N7862k04303K50180j93816L09287j49066k7420K08568j93466l9569
13643D26563j75889L96300r1827A61124J24546L80025J1355j36341k64114M68179
13633G44774A28774L29037j36449L75966R7767j826l55794K6443R3118k5869j30521
13622D00646q4727K00562k37063L42897k68962o9535K31569k18478Q5831M2483
$$ plain form
13694 566696 495636 690177 388153 578721 567333 708924 768214 499085 472479 205442
13683 663548 640131 340941 610449 530151 563215 593063 481892 741982 656939 343244
13673 343244 870933 527874 394493 445539 604542 519018 627215 529837 363056 329466
13663 329466 311426 379829 481015 556750 591813 410708 104491 650259 322113 408306
13653 408306 466168 261865 512045 318229 627516 478450 451030 659598 466132 426563
13643 426563 250674 646974 555147 161124 285670 665695 677050 540709 276595 744774
13633 744774 128774 457811 321362 697328 795095 793269 437475 463918 557036 531167 400646
13622 400646 315919 516481 279418 622315 353353 283818 515387 296909 382740 425223
13612D25223J89322J04126l58551J2484j29673K80260k34429J7793L82464A87533
13601C54309p8245J90276R9150k61817N3951m5167M38545k23936B34894J68682
13591D03576R848K39466A03516K31927n5159L1232J32712A82440K28084L13702
13581G24226B48034K63104K60134l30044R6820B14713K67508J5035k01061J02556
13571C98751j36518K69668N3456j81518j05508E9648K59603j5376M4291J72104
13561E20270K2287B15955J35797n3500J43696A81895J67820K9640J46021M3148
13551E68524A64821M8300K87449H40N02562j13118o2667K95363j87095n4763j39505
13540B41617R5844r0867j922l5132F8109K03583K29523k6873j74185M2883M5778
$$ plain form
13612 425223 614545 718671 360120 372604 242931 523191 288762 306555 689019 187533
13601 354309 276064 466340 565490 303673 357624 312457 751002 527066 234894 403576
13591 403576 413424 652890 103516 335443 280284 311516 444228 182440 410524 724226
13581 724226 248034 511138 771272 441228 538048 214713 482221 497256 296195 398751
13571 398751 262233 531901 585357 403839 298331 59648 319251 303875 348166 520270
13561 520270 542557 215955 351752 298252 441948 181895 349715 379355 525376 568524
13551 568524 164821 213121 500570 840 503402 390284 327617 622980 435885 381122 241617
13540 241617 337461 246594 244672 209540 68109 271692 501215 474342 300157 343040 388818
13529C88818K7244A81961L78577j67042o1501j55636K07577k8602j61702K25003
13519D18635j24617g8283D98763A7953M37139k2580j36597j39962b69369E98926
13508G9666K97750Q70j19421p6193K90423A24970R9105f6568B96524m3764j6119
13497B36641K00861A69473M86690B55851F3842K88273j30721J6184J27984J55659
13487E21221j39362q5064a378C36098H6830J23307j2177J6558D4148J56709b4950
13475B10390j6763Q2432J08238f822A88183K51378j37801J99454A20844J95821
13465C16665F8070Q9696N0869J93058j83455a6085A98097K52724j23112A21749
13454C53861j57015L52609k65728H9234d2021D31320J22110A41174b7413A28647
$$ plain form
13529 388818 416062 181961 560538 393496 331995 176359 383936 355334 193632 418635
13519 418635 294018 -78283 498763 17953 455092 432512 295915 155953 -269369 598926
13508 79666 377416 378286 258865 182672 473095 124970 224075 -66568 296524 252760 236641
13497 236641 437502 169473 656163 255851 63842 352115 221394 237578 365562 521221
13487 521221 381859 296795 -1378 336098 86830 210137 197960 214518 44148 200857 -24950
13475 210390 193627 276059 384297 -6822 188183 439561 301760 501214 120844 316665
13465 316665 68070 157766 208635 401693 218238 -16085 198097 450821 327709 121749
13454 353861 196846 549455 283727 89234 -42021 431320 553430 141174 -27413 128647
13443A97603o6660J45491i5474A71435J17316k5655O8649r548o4294a78487A86558
13431a91738A53832L54043f5986G1503C3050J80295j04935K82873J12917f3484
13420C63359J03106k7767b5804B14504P1661A21175J61939m3940L20575c0306
13409A60398a69396B87450j27177o2223L43760A57581k442M75757j12708D030
13398A91021d1495B95322l9401J20295P5309j33103j47653p0889J44030L9567
13388B83477J23593m4693e7248E81792A01202J3421O6309b02586A60394K1667
13378A82061L8898A2533K97952A8817K21748N8867A18333K84261q2326G0393J47981
13367B18374M5059H9962K72493j37630b2000n2544B32296b6533B27838p7502J6468
$$ plain form
13443 197603 130943 276434 -95474 171435 288751 263096 331745 322197 257903 -178487 186558
13431 -191738 153832 507875 -65986 71503 33050 213345 108410 391283 504200 -63484
13420 363359 466465 438698 -25804 214504 286165 121175 283114 239174 559749 -30306
13409 160398 -169396 287450 160273 98050 441810 157581 155139 630896 518188 4030
13398 191021 -41495 295322 255921 376216 451525 318422 170769 99880 243910 283477
13388 283477 407070 362377 -57248 581792 101202 114623 180932 -202586 160394 182061
13378 182061 220959 12533 310485 18817 240565 299432 118333 402594 320268 70393 218374
13367 218374 263433 89962 362455 224825 -22000 -74544 232296 -26533 227838 150336 166804
13356A66804N1055Q3998a93372A09856a74799C61127G6887J68856E8302L71022
13346D29324c0574B38819J87572e335B68130A26774K91622A52068J49135o9184
13336B32019D0157J77432l0106k9176h037A49399K25927d2429B28701J8109q7040
13325A59770K10687Q4690E9118J16821f7163I8351F098M41741j96991A12912F087
13313A81469q1980J44294j14691D9020K14206B6905J77886D279N79505A66267
13302a02883A18088L33600A53934A8157K29845A04090j8633J47062A593J72460
13292A74053l4861D6140L03674h4830K7638b3693B71645Q1189A52076J7927A5279
13280A94469K43821o6374q4373I8205B0462J75492O0607M0488j07926a51159D04673
$$ plain form
13356 166804 217859 301857 -193372 109856 -174799 361127 76887 245743 58302 429324
13346 429324 -30574 238819 426391 -5335 268130 126774 418396 152068 301203 232019
13336 232019 40157 217589 187483 158307 -8037 149399 375326 -42429 228701 246810 159770
13325 159770 370457 455147 59118 175939 -67163 98351 6098 447839 250848 112912 6087
13313 181469 99489 243783 129092 49020 263226 26905 204791 4279 583784 166267
13302 -102883 118088 451688 153934 18157 248002 104090 85457 232519 1593 174053
13292 174053 139192 46140 349814 -84830 -57192 -23693 271645 352834 152076 170003 15279
13280 194469 438290 371916 287543 98205 20462 195954 256561 297049 189123 -151159 404673
13268A91354M7797F0615a88294c211D34540I7030K78866n6837A07501m6914c8969
13256f8044A8606K43493J50716j57025L04908G3817L08665a89280H6222J48138
13246B34360i2808G8779J35704C5996H561K51815R9625a36231A8895K58761j06791
13235A70865K70485g6046A85874J04850p8045a93210Q5284A64035J24941h9388
13224A25504B0841O73169b97650B81328n5479L7262f3682B0527P7920J24049m6208
13213A76288j9678K33001j07740J38699A39388l1557J12512A6403a65293I6316
13202E62574D5932J37315R211J45523F7812J02004a72602A55690a02793D68586
13191B24119a07033E1642J92297B4579a49402b3458g865C49362A4741L194M83222
$$ plain form
13268 191354 239151 60615 -188294 -3211 434540 97030 375896 319059 107501 60587 -38969
13256 -68044 18606 262099 412815 255790 560698 73817 382482 -189280 86222 234360
13246 234360 -92808 78779 214483 35996 8561 260376 360001 -136231 18895 277656 170865
13235 170865 441350 -76046 185874 290724 212679 -193210 -107926 164035 288976 -89388
13224 125504 20841 694010 -297650 281328 225849 263111 -63682 20527 98447 222496 176288
13213 176288 156610 389611 281871 420570 139388 107831 220343 16403 -165293 96316
13202 562574 45932 183247 192458 337981 67812 169816 -172602 155690 -102793 468586
13191 224119 -107033 51642 243939 24579 -149402 -23458 -7865 349362 14741 17935 501157
13180E01157k04562D3071K86529g7823J9720A15619L1976J02874O0355f2795B46127
13168d6524q228C48720L2988b3631H5860J21432J4999a39829c9963m9389F5031
13156a60347B94021C8736J18822K5169K3173c56291B70491B4483N25107c8033
13145I4003b71327b2192o138B62070j6187A12126a40945H6897L3633E5076J02879
13134A57955m50C9007J7842K73774i3885j21918B99796a21700C9435K14642I8970
13122I5734J12692F6725b26360g3917E8266J61413E4982a38404B27867A13004
13111b82955Q9055k222B18930O7177R2800b0550G4363M98983H4053J0278H009
13099A34603L9255d1217B30419k8321a49207f9840B03267e3066D06775c7855J0458
$$ plain form
13180 501157 296595 43071 329600 -77823 -58103 115619 147595 250469 310824 -62795 246127
13168 -46524 -54752 348720 381708 -23631 85860 207292 222291 -139829 -39963 -89352 65031
13156 -160347 294021 38736 157558 182727 205900 -356291 270491 24483 549590 -38033
13145 94003 -271327 -22192 -28330 262070 245883 112126 -140945 86897 120530 55076 157955
13134 157955 157505 39007 56849 330623 -93885 -215803 299796 -121700 39435 254077 98970
13122 95734 208426 66725 -226360 -73917 58266 219679 54982 -138404 227867 113004
13111 -282955 -193900 -196122 218930 286107 378907 -20550 74363 573346 84053 94331 8009
13099 134603 173858 -41217 230419 202098 -149207 -69840 203267 -53066 406775 -37855 -27397
13088b7397A98143D8789K99813a50995A56292P3007a04193a6594A92048J26097
13078C18145p8576a60854H1898j0990b04977R3113C32587A02769a44555A20029
13067g6918B8194L6736c27021c8298A77428a12746H8787N728b47747I1965J86580
13056B78545j22856A615K14056e86A04545n2103M8647g97A2829L400E421P7460
13044H2881N1038k085g4777I9796D0016J43367j6711n2728N2317J76762c2821
13032A87001M1751d8201j92083I6653N5347b28951a2788B76513c9772j55505D6386
13020B31689p6889Q155J06094p4550P1388q1578L4829n6657R3890K6336d5426
13008d240j13487A14726K5712e3618C09660j03263d8527A13050a27275B22622
$$ plain form
13088 -27397 198143 48789 348602 -150995 156292 229299 -104193 -16594 192048 318145
13078 318145 239569 -160854 81898 70908 -204977 -111864 332587 102769 -144555 120029
13067 -76918 28194 64930 -327021 -38298 177428 -112746 88787 94515 -247747 91965 278545
13056 278545 155689 1615 215671 -586 104545 52442 101089 -797 12829 16229 5421 82881
13044 82881 133919 131834 -74777 99796 40016 183383 166672 113944 166261 343023 -32821
13032 187001 228752 -48201 -240284 96653 152000 -228951 -12788 276513 -39772 -195277 46386
13020 231689 154800 162955 269049 194499 265887 184309 219138 162481 256371 282707 -45426
13008 -4240 -117727 114726 140438 -53618 309660 206397 -48527 113050 -127275 222622
12997A5939Q8751J18484a25203k1502A83780n4147J53973j04377P9780e554C15659
12985D17181A59124b7683E63769a76998H2032K47969Q4147C4542a54386R997p9663
12974b24052P1662A17999J4990h8461A0128f0570B92144a73251G698K78424J69806
12963D55928C831b48851G0637h8973j8998A25091J75691D5812A8412K3390a54899
12951e1914C2572e9859G9236b07964B6650K8697N4876h430A37347h0967A23854
12939D0150J96885a11736b8414B63308e5642A71824b1503A99030i1440J0107G4029
12927A33648K70112A3648M605b3377q8274A70003l7620b13098R5967A25066B8459
12915B6247h2783B34917B8028c1209E7128a96866l7230C4174J36524f3952l44347
$$ plain form
12997 15939 104690 223174 -125203 -146705 183780 129633 283606 179229 259009 -5554 315659
12985 417181 159124 -27683 563769 -176998 82032 330001 414148 34542 -154386 -144389 -224052
12974 -224052 -152390 117999 132989 -88461 10128 -60570 292144 -173251 7698 286122 455928
12963 455928 3831 -248851 70637 -88973 -107971 125091 300782 45812 18412 41802 -154899
12951 -51914 32572 -59859 79236 -207964 26650 55347 110223 -8430 137347 -80967 123854
12939 40150 237035 -111736 -28414 263308 -55642 171824 -21503 199030 -91440 -81333 74029
12927 133648 403760 13648 18253 -23377 -111651 170003 132383 -213098 -117131 125066 28459
12915 26247 -82783 234917 28028 -31209 57128 -196866 -234096 34174 170698 -63952 -408299
12904d08299C14710B6547a51336A90499b05107b3259A00892Q6728a68180r6281
12894b64461a13260c947C1484b2902i068B56027I9408d237m3462a4017n4086A85321
12881B7623M3734a70223A72454N4038D8232J19845p4515L9244l3111L00726I8778
12869H40a6281E0375O5902J01179r0971M1209i1982b8440A63410p8258a14761
12857I228K44230b4542p5695F1018L36324a36090B07703A7193J75903r4293a58489
12845G7558j2543Q5944K42936I2065d37500J55509i4386B38529c0251k9651A49300
12833b74867A59250D5299N0262h9290j7986D5382A1842M4697L75463b33529R8530
12822a34999F5714c7751B23189b31133B14734a6753A0939a3796G5064J43739a48753
$$ plain form
12904 -408299 314710 26547 -151336 190499 -205107 -23259 100892 187620 -168180 -264461
12894 -264461 -113260 -3947 31484 -22902 -9068 256027 99408 -4237 -47699 -14017 -68103 185321
12881 27623 71357 -170223 172454 226492 48232 168077 93562 132806 99695 400421 98778
12869 840 -16281 50375 116277 217456 126485 167694 -91982 -28440 163410 85152 -114761
12857 9228 253458 -24542 -100237 61018 397342 -136090 207703 17193 193096 98803 -158489
12845 77558 65015 150959 393895 92065 -437500 -281991 -94386 238529 -30251 -59902 149300
12833 -274867 159250 45299 95561 -89290 -107276 45382 11842 56539 432002 -233529 -134999
12822 -134999 65714 -37751 223189 -231133 214734 -16753 10939 -13796 75064 218803 -148753
12810b4112r7740C10426c6459A8291N4552g5791j98897A65367R1088C9491b88864
12798C1900c30027A25024a01613n00938B72578a69276D23130b25669A41800a33641
12787A53347b08568d1300j71694N3211A09424H968P405L734K01306d2331k8655
12776g0986K3908q9340j2325j68992G7720e0195I7852L6156A2697a29737r41D4614
12763C54627f2727k28469G4870b8584k54396a2840j42062A27698E4042A2468M5026
12752E7494R8187A0742e746A88940J74790c31805B23009b0558r9558E7363b6996
12740A94517I228J4063a14435b5946B51584n5636J08347a72420j67836A89116
12729b01809B02798r4772b48998J9395f1555B22917Q315j02723b69500A51175
$$ plain form
12810 -24112 -121852 310426 -36459 18291 72843 -75791 -274688 165367 256455 39491 -288864
12798 31900 -330027 125024 -101613 -602551 272578 -169276 423130 -225669 141800 -133641
12787 153347 -208568 -41300 -212994 -159783 109424 8968 16373 20107 221413 -42331 -70986
12776 -70986 -47078 -136418 -148743 -317735 77720 -50195 97852 134008 12697 -129737 -130678 44614
12763 354627 -62727 -291196 74870 -28584 -282980 -12840 -154902 127698 54042 12468 57494
12752 57494 155681 10742 -5746 188940 363730 -331805 223009 -20558 -120116 57363 -26996
12740 194517 9228 23291 -114435 -25946 251584 195948 304295 -172420 -340256 189116
12729 -201809 202798 108026 -248998 -229603 -61555 222917 231232 128509 -269500 151175
12718B1589J52239b29494C49022a24378F7300a89126A2632J70631o6057P7759
12708A94965q6557b66645d0791D40229H0185k8338K33124n8964N4499c5749E2505
12696A48859M4577o5540Q8337o2639J59833E1261O5815P4852K50627B10247r4877
12685A15370K10802c5721B19453a49558l11286G1620J29927E3055J25085p7121
12675A01019H634b01839B73769L2103J12788a78861m7517d7306B51511c0203A00190
12663A79746b66760A97508H2492J99863C8617J33040O1377j4512a32866D3197
12652A31971J39047c08587a25096k10548B99454n2675A19922a64049A04185d12678
12641B92526g7517E11175j41044j29697C682K15928K21309e7669j8608A0281b8561
$$ plain form
12718 21589 173828 -229494 349022 -124378 67300 -189126 12632 183263 117206 194965
12708 194965 108408 -266645 -40791 440229 80185 51847 284971 226007 280506 -35749 52505
12696 148859 193436 127896 216233 153594 313427 51261 117076 191928 442555 210247 115370
12685 115370 326172 -35721 219453 -149558 -460844 71620 201547 53055 178140 101019
12675 101019 8634 -201839 273769 305872 418660 -178861 -226378 -47306 251511 -30203 100190
12663 179746 -266760 197508 82492 282355 38617 171657 233034 218522 -132866 43197
12652 131971 271018 -308587 -125096 -335644 299454 246779 119922 -164049 104185 -412678
12641 292526 -77517 511175 370131 240434 3682 219610 440919 -57669 -76277 10281 -28561
12629B84988b97896a060A00206A3116d6060l7982l44029A09226a7473A84317E4324
12617A09368C6289d5659A86380N3350K51134n8246o6503q4163o9694b03246B73613
12605C16067B8163Q6255b30010R5795A18207f9339B21011a46163A6420K5395N5218
12594I7033P9895a98444k0635g328A8804J46252J54399i6894A88534J25863a22793
12582I6448b27094A23756J42849e7528B00780f4361A69427a32927a2201o1602
12572g3803B00062a54792k4515o077I2884b74287a19736m4965e8639b1456j81384
12561b02840P9207j2187r3854B67516G618P7767k3947J9134J04046D9087h4778
12549h0685A73422E7100A4015Q9293a25674A3022J35996D5052B0173a39278p7308
$$ plain form
12629 284988 -297896 -1060 100206 13116 -46060 -84042 -428071 109226 -17473 184317 54324
12617 109368 36289 -45659 186380 239730 490864 432618 366115 281952 212258 -203246 273613
12605 316067 28163 114418 -230010 -134215 118207 -69339 221011 -146163 16420 41815 97033
12594 97033 176928 -198444 -219079 -7328 18804 165056 319455 -96894 188534 314397 -122793
12582 96448 -227094 123756 266605 -57528 200780 -64361 169427 -132927 -12201 -73803
12572 -73803 200062 -154792 -179307 -185384 92884 -274287 -119736 -164701 -58639 -21456 -202840
12561 -202840 -123633 -135820 -229674 267516 7618 85385 61438 80572 184618 49087 -84778
12549 -80685 173422 57100 14015 103308 -125674 13022 149018 45052 20173 -139278 -216586
12538b16586C6021K46421a75320E3321a16984H999J07081c67131B24808k8300
12528A96508O4048b1810B89950A14116i3056B10253a35909d3831B02280L2812
12518B35092R4826E5382a32571B22484G7457J36104o1122f2498a4925H4851P6294
12507A61145a00273G9254K76455g507j23754p4617l7604F5314L41549a58243E5233
12495C1645f0230J8608J9829H8508e0538q1055b018A26723K64520A91936F1207
12483A67737a11396B06775G3274C1792K4372C841F64J03182d50370B29125J7584
12472B46709r3603m6736f6011A20264b55974J01901e9545K5830D4970F552N6138
12461F2690K59558c14517B69995E8191c05054C6496O5726M5411b74284h5881m01736
$$ plain form
12538 -216586 36021 282442 -175320 53321 -116984 8999 116080 -367131 224808 196508
12528 196508 260556 -21810 289950 114116 -93056 210253 -135909 -43831 202280 235092
12518 235092 329918 55382 -132571 222484 77457 213561 152439 -62498 -14925 84851 161145
12507 161145 -100273 79254 355709 -7507 -131261 -205878 -243482 65314 406863 -158243 55233
12495 31645 -60230 -41622 -21793 88508 -50538 -131593 -2018 126723 391243 191936 61207
12483 167737 -111396 206775 73274 31792 56164 3841 664 103846 -450370 229125 246709
12472 246709 153106 106370 -66011 120264 -255974 -154073 -59545 -33715 44970 6552 62690
12461 62690 322248 -314517 269995 58191 -305054 36496 102222 147633 -274284 -85881 -487617
12450d87617K42759g4044A02738g6819j9650n048B04680a35971I4236D1790K44997
12439B86787d1861j18972A20290a71837h841p5444B88711a28080k6833I1607a39857
12427A07039R0448K4766a47960m3282A34326O1790a23793d6727D43078e7512j51249
12416b08761d7940M009k28662B06411a26913b4227B8113b60402D5492L1560j547
12405G5505a90137m710E6025N7502c430k55226d1836C1778b3326l4020D3523a66198
12392b65940E9731d5241j86369B83616F9639M0592b80161N7307M3002A28395B0630
12380b14321H1571P5272n9790d4120o0392B83338B9484J93216O0415g4717A80383
12368b22710d3388L314F4169a79898b764j38072k146A34317a05765j07356K1728
$$ plain form
12450 -487617 -244858 -74044 102738 -76819 -96469 -101517 204680 -135971 94236 41790 286787
12439 286787 -41861 -160833 120290 -171837 -8841 -84285 288711 -128080 -154913 91607 -139857
12427 107039 197487 222253 -147960 -191242 134326 196116 -123793 -46727 443078 -57512 -208761
12416 -208761 -47940 -43931 -272593 206411 -126913 -24227 28113 -260402 45492 77052 75505
12405 75505 -190137 -194847 56025 113527 -3430 -258656 -41836 31778 -23326 -57346 43523 -166198
12392 -265940 59731 -45241 -231610 283616 69639 110231 -280161 -222854 -179852 128395 20630
12380 -214321 81571 156843 97053 -44120 -104512 283338 29484 222700 283115 -74717 180383
12368 -222710 -43388 -40074 64169 -179898 -2764 -140836 -142982 134317 -105765 -213121 -191393
12357a91393C12061a88396A55842b5786A75456b10880A74876K0729E5857J00970
12347A56827F0112K33120a00925B43064A10287N8441c67328D6064K81383b2791
12336a46891l17527b2880E0467d593k04893B44219l5219d7077j37053c0002j04508
12325a34510a1324A4429a71024H0363a30391A49088K07851h6673G4545A7978a31285
12313I5052a7357j65274C0946L0459R369e7701I6426N0943j4581a46895q6178
12302b33073B39924o3110d8766A21823J330g5256l8644D984a86042K1940O0238
12291a03864m2102B61893O6738j43214a44408k0678D4328k1380a60073A78042
12280c9878Q857j0886C71023h6987A00721m3327j7566A8396K33982a86286A24446
$$ plain form
12357 -191393 312061 -188396 155842 -25786 175456 -210880 174876 195605 55857 156827
12347 156827 60112 293232 -100925 243064 110287 168728 -367328 46064 327447 -22791
12336 -146891 -464418 -22880 50467 -4593 -209486 244219 209000 -47077 -184130 -30002 -134510
12325 -134510 -11324 14429 -171024 80363 -130391 149088 356939 -86673 74545 17978 -131285
12313 95052 -17357 -182631 30946 61405 70774 -57701 96426 147369 132788 -146895 -233073
12302 -233073 239924 176814 -48766 121823 123153 -75256 -113900 4984 -186042 -164102 -103864
12291 -103864 -145966 261893 328631 185417 -144408 -165086 44328 22948 -160073 178042
12280 -39878 -31021 -41907 371023 -86987 100721 57394 39828 18396 252378 -186286 124446
12268B22482a73264B34126b6104k23643g0500r0110A64460M7293c8873A86469
12257B46856a9667A29306f7917G8217p143J48067K55772j90328b030j2288j02055
12246a16373q5474B9674K59807p3086I9851d1841P997F0030g082D6338K07682
12235B54020I1798d3700C13067a80287F7619a0387q4855A9595K26L21302D1368
12223a1702o6009H3897J12947d2251A81972L6560J8038a7085H7436N01122A87522
12211I2508g0477B07357J17490L8154r2849l4366M0214B9795L47383r780K2434
12200C89832n3115l5700j36008c28421b6880A12756a97671C72295I9266J1658
12190A10924k3763d9082C28372j61041p2535N9142p968J63545H4545k1436a69233
$$ plain form
12268 222482 -173264 234126 -26104 -249747 -70500 -160610 164460 211753 -38873 186469
12257 246856 -19667 129306 -67917 78217 71074 219141 474913 284585 -2030 -14318 -116373
12246 -116373 -201847 29674 289481 216395 99851 -41841 -33844 60030 -7082 46338 254020
12235 254020 91798 -43700 313067 -180287 67619 -10387 -95242 19595 19821 341123 41368
12223 -11702 -77711 83897 196844 -42251 181972 218532 236570 -17085 87436 588558 187522
12211 92508 -70477 207357 324847 363001 270152 235786 276000 29795 377178 367398 389832
12200 389832 336717 301017 165009 -328421 -26880 112756 -197671 372295 99266 110924
12190 110924 87161 -49082 328372 167331 94796 153938 145970 309515 84545 63109 -169233
12178A00344N13998B91671J60529j65489l8657m353K0103l8573l3911f3236j17073
12167a80309A63343c3570B3990N2087J7964d3545A36602b08151E5661K6898M6108
12156A28667E3872O2232M8681l4852K14452b55354a26358A23151D7284h4021A75995
12144B85312o2944L6203K04451A41569A3851J96860I5948K92859A23493J22420
12134B45913A03922J36176j2713K37215A85606a93755e4489M775o6747C39845
12123F453a8790F2282J66431f0369A79598d3662k7425D02154i8481M3032F7278
12111A15458a10832c6185F5196J11397g2905l3958j00503d5279j2203F3041R1997
12100A55038d5376j64837i4943B4464d2356B0142a09339B5821c71585J03432k4545
$$ plain form
12178 100344 614342 291671 452200 286711 248054 243701 263804 225231 191320 -63236 -180309
12167 -180309 163343 -33570 23990 76077 94041 -43545 136602 -208151 55661 82559 128667
12156 128667 53872 116104 164785 129933 344385 -255354 -126358 123151 47284 -84021 175995
12144 285312 222368 258571 463022 141569 13851 210711 95948 388807 123493 245913
12134 245913 103922 240098 227385 464600 185606 -193755 -54489 -49714 -116461 339845
12123 6453 -18790 62282 228713 -60369 179598 -43662 -71087 402154 -98481 -55449 67278
12111 115458 -110832 -36185 65196 176593 -72905 -106863 -207366 -45279 -57482 63041 155038
12100 155038 -45376 -210213 -94943 24464 -42356 20142 -109339 25821 -371585 -268153 -292698
12089b92698C55105Q413A03273a17516e3924D5524d71457a09272F3325b03767
12078i8422a537j01791q5919D1623h3421B7639a8232o4060A10184a79308L6223
12067a43085d8924a0537A41255a63993B18222p417J28671K39799M87236n07546
12057E58965M1737I5360M60913a61179a59C33641a2050q8286r071a9618C33301
12045A41124J09438E9401K35424G9741B3909L2951K46616E7525a32042e3326B71204
12033A80386a47354c4281A78852K3191d4616j52225A98789B2836O8084B6759L7891
12022F4650A6136g1323c0060o8546G2622O8361E0287b490A16696k0073c2342r2976
12010a25318d9323j41771d8117J1475j22051I7156a50812K4091I8873a02084c5090
$$ plain form
12089 -292698 355105 363518 103273 -117516 -53924 45524 -471457 -109272 63325 -203767
12078 -98422 -1537 -103328 -189247 41623 -83421 27639 -18232 -82292 110184 -179308 -143085
12067 -143085 -48924 -10537 141255 -163993 218222 210805 339476 579275 1066511 558965
12057 558965 600702 95360 556273 -161179 -159 333641 -12050 -100336 -109407 -19618 333301
12045 141124 250562 59401 294825 79741 23909 56860 303476 57525 -132042 -53326 271204
12033 180386 -147354 -34281 178852 202043 -44616 -196841 198789 22836 90920 26759 64650
12022 64650 16136 -71323 -30060 -98606 72622 140983 50287 -2490 116696 96623 -32342 -125318
12010 -125318 -49323 -191094 -48117 -36642 -158693 97156 -150812 -126721 98873 -102084 -35090
11998i3875k63407c129n1048k0727B75248b09146h200j72033B42599I2170b4444
11986d17637a55223A07632L8514c1827d595r9633A06314a46235B10636r331b21819
11974A29580b7749k13002Q4581C9332J64590q9333b72846Q7804f0600A34345b26875
11962A63958H44J1392h3456A02766k6934b47149J15589m4735A52350N9402A9242
11950H9543C4659K15679I0391L8477J4703o6115d08343E2517a42233E5861P9321
11939A35182D3700b718o5939k83422A351a40243a2105H3459B4537d0580D771K1882
11927B6653K31102c93269B5457K67814a44541A37418f0603j04385f7340H2242
11916b27165a07845B10685J51477a52945a4587A0737d0399l5994j48940A3834
$$ plain form
11998 -93875 -357282 -3129 -54177 -74904 275248 -209146 -8200 -180233 242599 92170 -24444
11986 -417637 -155223 107632 146146 -31827 -4595 -104228 106314 -146235 210636 201305 -221819
11974 129580 -27749 -240751 -156170 39332 203922 114589 -272846 -185042 -60600 134345 -226875
11962 163958 844 12236 -83456 102766 75832 -247149 -131560 -176295 152350 211752 19242
11950 89543 34659 250338 90391 128868 143571 77456 -408343 52517 -142233 55861 135182
11939 135182 43700 -2718 -68657 -352079 1351 -140243 -12105 83459 24537 -40580 4771 26653
11927 26653 257755 -393269 25457 293271 -144541 137418 -60603 -164988 -67340 82242
11916 -227165 -107845 210685 362162 -152945 -14587 10737 -40399 -76393 -225333 13834
11905c20609o2464d862A637N8610J03112O1443G3662j1193K5265d2659A2646a69164
11892a69208d2446I5137J35238b30076I5632m0497K5232a03290A1297i4064A13265
11880a1500k65961R1904A31675B7962i4460r1835n8770N8303E6014a94789D1441
11868b46016A98042r149E925g0872j70256A21460a23068A4788L6380p195p89Q1050
11856A24234c11370a55328a4044A16985J04099K8749a12697F6044b38918B08555
11845D0305O703J74470D5982d532I0246m276a36475l2453j998B41644b65549k32485
11833d98034H2657O0277a89647J0148D7533J5464g453A27929B010K3935K94150
11822C20095a74729f3346B84687A01261j2625b07096P5681l5042o0325e8343p4093
$$ plain form
11905 -320609 -383073 -4862 1637 60247 163359 224802 73662 62469 87734 -42659 12646 -169164
11892 -169208 -42446 95137 230375 -230076 95632 55135 80367 -103290 11297 -94064 113265
11880 -11500 -277461 -185557 131675 27962 -94460 -186295 -245065 -186762 56014 -194789 41441
11868 -246016 198042 188893 5925 -70872 -241128 121460 -123068 14788 51168 43973 43184 124234
11856 124234 -311370 -155328 -14044 116985 221084 249833 -112697 66044 -238918 208555
11845 40305 47008 221478 45982 -4532 90246 85970 -136475 -168928 -170926 241644 -265549 -498034
11833 -498034 82657 142934 -189647 -179499 47533 62997 -7453 127929 2010 25945 320095
11822 320095 -174729 -63346 284687 101261 88636 -207096 -131415 -166457 -226782 -58343 -132436
11811a32436n9035E0775O2512J0825B6638c72145J52592j80070c5450B85312j29819
11800A55493d0796n5908k87421A44476b51783d1617q7229C9645b92277a7040j05035
11789a22075A88454a55037C4202a04317A52675e1642A79123q5376J73155a1585
11778b95700i457A4439J29470E7728c9441A17110l4644a07255D3715a39002l941
11767a42943A48109K3848f6253q6895N7679H1634a85893J3621A70615j6494b15317
11755B5342d9248k21870B6002b0686j06495A14683A2000J9883d809B93133E5610
11743A39604J63932I613g0758q3825H3143M8546f438D04137d4861G5911i0216
11731g834H726J48320O841b95967A75596b34906A18517a82172A02405a17637q6310
$$ plain form
11811 -132436 -191471 50775 113287 124112 26638 -372145 -219553 -399623 -35450 285312 155493
11800 155493 -40796 -96704 -384125 144476 -251783 -41617 -128846 39645 -292277 -17040 -122075
11789 -122075 188454 -155037 34202 -104317 152675 -51642 179123 93747 266902 -11585
11778 -295700 -9457 14439 143909 57728 -39441 117110 82466 -107255 43715 -139002 -142943
11767 -142943 148109 171957 -66253 -153148 -95469 81634 -185893 -172272 170615 154121 -215317
11755 25342 -49248 -271118 26002 -20686 -127181 114683 12000 31883 -4809 293133 55610
11743 139604 303536 9613 -70758 -154583 83143 131689 -6438 404137 -44861 75911 -90216
11731 -7834 8726 157046 163887 -295967 175596 -234906 118517 -182172 102405 -117637 -203947
11720b03947F5281b8345k50642a8862e227B32603c4449o0516l75792a5314q47
11709a6161G773b906A59717a78086J6798l7179D4401J87870g2335F5650a10583
11697A10671e3146B67668F1693K17175d1072G8648j9597e3215B23120G2763c29075
11685f5517C59686a2804j96374E2317B5499J56322a96707C4237f9410C20058a06610
11673B50274a81062A2183J63712b3358m625A90174b53100B51565o3318F7651a30776
11661a15266A00452a06438C39637d87585f5381A29316c9269C41327j17798A0371
11650c11852J09164c7124n31411I9503J34039C4563a30659K8436m6133B8896J45068
11639A73964a64708q4205D5058b4919A14103a87418E2547P0230M88032e7191k53298
$$ plain form
11720 -203947 65281 -28345 -278987 -18862 -5227 232603 -34449 -94965 -470757 -15314 -16161
11709 -16161 7773 -2906 159717 -178086 -161288 -198467 44401 232271 -72335 65650 -110583
11697 110671 -53146 267668 61693 278868 -41072 78648 59051 -53215 223120 72763 -329075
11685 -65517 359686 -12804 -209178 52317 25499 181821 -196707 34237 -69410 320058 -106610
11673 250274 -181062 12183 175895 -23358 -27983 190174 -253100 251565 188247 67651 -130776
11661 -115266 100452 -106438 339637 -487585 -65381 129316 -39269 341327 223529 10371
11650 -311852 -202688 -37124 -568535 99503 233542 34563 -130659 -102223 -148356 28896 173964
11639 173964 -164708 -248913 45058 -24919 114103 -187418 52547 122777 610809 -57191 -310489
11628c10489M7616a10020H3140b5323N26D48477C2184J9974a82859a1436j33713
11617a45149G758b53323J9914D8987K7257J23334L8449h6522B33868F223R7840
11606A04063d598A23598J63639c8017B31626a38002C19785B7878b71693B23699
11595A63192p0173K46k2342J69960p0357A5851a10777E1132a0078l73307a10588
11583d4337B72800D2002i5177B40156A15258C2316a63579j8530D47662A36551
11572C06630A33746n0461a56256G6409K2719m5141J16716L0150A6152R6640J14389
11561B27181F936O5247h1040A02477b88612A93537E254J8626K92008A41092M3289
11550A84381C3367K53506n6347a15344B88435r014b07280A1517J19216I170J95165
$$ plain form
11628 -310489 -262873 -110020 83140 -25323 -24797 448477 32184 52158 -182859 -11436 -145149
11617 -145149 7758 -253323 -233409 48987 76244 199578 238027 -86522 233868 6223 104063
11606 104063 -4598 123598 287237 -38017 231626 -138002 319785 27878 -271693 223699
11595 163192 93019 93265 70923 240883 170526 15851 -110777 51132 -10078 -383385 -110588
11583 -44337 272800 42002 -95177 240156 115258 32316 -163579 -182109 447662 136551
11572 306630 133746 83285 -156256 76409 99128 53987 170703 200853 16152 112792 227181
11561 227181 6936 72183 -81040 102477 -288612 193537 5254 23880 315888 141092 184381
11550 184381 33367 286873 230526 -115344 288435 279421 -207280 11517 130733 9170 204335
11539B04335b2858q4935j28623h5972q2829K2622B58004H9431O1562b18204I7452
11527a5757j11787B71046E0666c4881j00579H0547a89154A45430c3122j45443
11517a78565O263A58170M6746K72900c5721A9235J4455M0925L6509J24813h5467
11505a62142B11732d7305I5010M1627N2601g6766G4568d2635B71629b5854j37707
11494a63561D1575K03538K7082F826K68518H7091P6567J82648A41249g5198C50686
11482A56283J64032a28196b6924A67100F0573J56678a52514A41124L19232C8229
11471C29988A20078l4765A4912K94797c63783B09516m7265J0020b40622A31594
11460B2915L91511H4415C0222M81669a48564B64655K25622A14467J84442n1908
$$ plain form
11539 204335 -22858 -107793 -236416 -85972 -168801 -146179 258004 89431 150993 -218204 97452
11527 -15757 -127544 271046 50666 -34881 -135460 80547 -189154 145430 -33122 -178565
11517 -178565 -172302 158170 204916 477816 -35721 19235 33690 74615 111124 235937 -85467
11505 -162142 211732 -47305 95010 136637 189238 -76766 74568 -42635 271629 -25854 -163561
11494 -163561 41575 245113 272195 6826 275344 87091 163658 346306 141249 -75198 350686
11482 156283 320315 -128196 -26924 167100 60573 217251 -152514 141124 460356 38229
11471 329988 120078 85313 14912 309709 -363783 209516 162251 172271 -240622 131594
11460 22915 414426 84415 30222 511891 -148564 264655 490277 114467 298909 247001
11450B47001l8542J5048L30518f4014E4749h6686B40051I903L70393b94041A12019
11438F6123P2871E3304N6573A2045O2224J1046Q8054a91954d1390k1776o5634
11427a28800b7174k45453i4619k9148A01899a77186A36203M6999h4667d1798F3805
11415A81507a60438A87270J33500c8951F967O3228i2084I1831J7819b77902D233
11403B5186J3113R7795c4772k5597p8755l7809c7216C36131B5004f2512k569B9598
11390A43201F2621e6776j95490a14874k2484O7617B27517H2733a00366h05k3129
11379b3934C3593b11354j35426c1517j44868A57913F2558K33660a96702Q9985
11369a06717d2848k14709B73300a51403F5581g2894C7763f9335j89959c9515A5066
$$ plain form
11450 247001 208459 223507 554025 -64014 54749 -86686 240051 9903 380296 -294041 112019
11438 66123 138994 53304 109877 12045 74269 85315 173369 -191954 -41390 -63166 -128800
11427 -128800 -27174 -272627 -94619 -123767 101899 -177186 136203 183202 -84667 -41798 63805
11415 181507 -160438 187270 320770 -38951 6967 70195 -92084 91831 109650 -277902 4233
11403 25186 38299 136094 -34772 -60369 -139124 -176933 -37216 336131 25004 -62512 -65081 29598
11390 143201 62621 -56776 -252266 -114874 -137358 -69741 227517 82733 -100366 -805 -23934
11379 -23934 33593 -211354 -346780 -31517 -176385 157913 62558 296218 -196702 -106717
11369 -106717 -42848 -257557 273300 -151403 65581 -72894 37763 -69335 -259294 -39515 15066
11357C0118P6190A8644c44684a58679A57085e6941B42653a744C7885m593d2202
11345a92038A66767a66182r8066C23270j33279a83449D3864f9345k26553M3966
11335b51932a14301L2021A10742h1654A98586F4234e8478B52375D8378O2440a26890
11323b2401E9345A6279c4438m13404C79087F3650b09917B36266H022Q0186G284
11311B8113a77096P3083j00401H2060K40852H2002l9817a06033a5280k74654A10577
11299D9044a27829L9100b5076j27931b098j11862j77280B52242b38844E3863b9012
11287A01070j0908J19104b94051a07790d4442C9018K7568Q7551f1386A21823J15729
11276B37552F8903a25388k3761K417O2435L4706m0446I0899a35582G7978K6631
$$ plain form
11357 30118 106308 18644 -344684 -158679 157085 -56941 242653 -1744 37885 33292 -42202
11345 -192038 166767 -166182 -264248 323270 189991 -183449 43864 -69345 -295898 -251932
11335 -251932 -114301 -82280 110742 -81654 198586 64234 -58478 252375 48378 110818 -126890
11323 -22401 59345 16279 -34438 -447842 379087 63650 -209917 236266 8022 88208 7284
11311 28113 -177096 -104013 -204414 82060 322912 82002 42185 -106033 -15280 -289934 110577
11299 49044 -127829 -88729 -25076 -153007 -2098 -113960 -291240 252242 -238844 53863 -29012
11287 101070 90162 209266 -294051 -107790 -44442 39018 66586 154137 -61386 121823 237552
11276 237552 68903 -125388 -149149 -146732 -84297 -49591 -90037 90899 -135582 77978 104609
11265A04609l4417K26804b5478k1399G6507c9761n9090q8850N687B4028g3579
11253A56208D3510N1980d05936a21944A84441h7419l84269E2047d6823B6339g1021
11241c9519m0391A19469b16593d3807j23475B2499K6238K58115h8620L8095C07511
11229A7685b42080i8790F5901j3349e2275J2123m7129C3035h6448c7280j45691
11218a82971A44834c76601F7866N0866a39095A47326p3290J69937A3506a90326
11207a66772A2352e5061o4459e945q0685a247B35263i0016n7530O8906H13Q3062
11195H3875Q4867m2497b31903J08464m1416A7334K07361d80337A47929e1221J2064
11184c9157a0746N234l23083R8193g825k1231j86539B1598f166B21224a77874
$$ plain form
11265 104609 70192 296996 -25478 -46877 76507 -39761 -98851 -187701 -182014 24028 -73579
11253 156208 43510 95490 -405936 -121944 184441 -87419 -471688 52047 -46823 26339 -71021
11241 -39519 -79910 119469 -216593 -43807 -167282 22499 48737 306852 -88620 -50525 307511
11229 17685 -242080 -98790 65901 52552 -52275 -40152 -87281 33035 -86448 -37280 -182971
11218 -182971 144834 -376601 67866 118732 -139095 147326 74036 243973 13506 -190326
11207 -166772 12352 -55061 -119520 -5945 -86630 -1247 235263 -90016 -147546 -78640 813 83875
11195 83875 168742 126245 -231903 -123439 -164855 17334 224695 -480337 147929 -51221 -39157
11184 -39157 -10746 -5512 -328595 -230402 -7825 -29056 -215595 21598 -6166 221224 -177874
11172a22425i542A078b080l2863C52302D9919J08255F7899a62570b4609k0561
11161d5170c477j9092r7421N2967l6970I2791a12699A73307d0727C07271h9013
11149A81021f0526k37515J03883A43612j9102K24587A17754C3375e1651C314h825
11137g9933A37152k4430O7536a06084j76016o3966i7868j15326D4709L1804O3831
11126A40344a26307k4320B60419q6430J5564J71931b0545j60347B86710j37560
11116A49150l192O3548o6728c768D2183A3L0485R5793N1418N8939n566J5554j13179
11103A33457J20003p6293l5483e0819a4279B63458f6188F2765c9876B34545g0412
11091A70421J56381m0542m9136b2982A13049J71360r2156p6388L70708B04819
$$ plain form
11172 -122425 -9542 1078 -2080 -34943 352302 49919 158174 67899 -162570 -24609 -45170
11161 -45170 -3477 -22569 -119990 -67023 -103993 92791 -112699 173307 -40727 307271 -89013
11149 181021 -60526 -298041 -194158 143612 124510 349097 117754 33375 -51651 3314 -8825
11137 -79933 137152 112722 180258 -106084 -282100 -346066 -97868 -213194 44709 76513 140344
11126 140344 -126307 -150627 260419 173989 189553 361484 -20545 -180892 286710 149150
11116 149150 145958 209506 142778 -3768 42183 13 30498 126291 177709 236648 231082 246636 133457
11103 133457 253460 177167 141684 -50819 -14279 263458 -66188 62765 -39876 234545 -70412
11091 170421 326802 286260 237124 -22982 113049 284409 192253 115865 486573 204819
11080E36581B40556M6173h7425A78803L18441b78383J5661B84169a93124C18451
11069A30374J30525G7873J55531J17519K916o5544Q3042j54592J91227j5977j10157
11058B81838j28432J74371m8445M0923j09449Q370J90019A24887L72153L13r3665
11047D03688K18509J67478O0210k64539n7034Q2450q6846k5805K17390M4716M6367
11036H06584k38699K75820K75126l25600j40244Q1224N0728J66182m09707N3891
11026E95305k2586K06016l21728K11546J42447k0405j29713J1040k4651Q6345
11016G33616j50948K34193m0165j30725R3531j99154M88941l50478k20837M64703
11006I22677k48549k82895M90188C63441K36383j13892M7474J27353j94459K44522
$$ plain form
11080 536581 240556 286729 -87425 178803 497244 -278383 -262722 284169 -193124 318451
11069 130374 260899 77873 233404 350923 353839 288295 371337 216745 407972 391995 281838
11058 281838 153406 327777 279332 320255 210806 219176 409195 124887 497040 497353 403688
11047 403688 622197 789675 849885 585346 528312 610762 523916 498111 715501 760217 806584
11036 806584 567885 843705 1118831 793231 652987 734211 784939 951121 541414 595305
11026 595305 572719 778735 457007 668553 811000 790595 660882 671922 647271 733616
11016 733616 582668 816861 776696 645971 739502 540348 1029289 678811 457974 922677
11006 922677 674128 391233 881421 363441 599824 485932 533406 660759 466300 710822
10996G10822J96451k80372K92577l35138K35359k69269L65026j65905J5899j76266
10986E89184J74305m8417O1878j12210l6910O5693K08645J9564l16402J9833Q7921
10975G13084k07322L90220j36315J92249j46764k10440L40641O1858J84111m4992
10965A136330l2665M4073N17969J23616N0827Q5281N6880L19556J84228K06410
10955B692505q745j6771k7268J19021k25078k90392n93537M5135M9234l7609m08576
10944A297919K24820O6551L26492k13938J18004l51753j52453L38395o00647n1444
10934A001946k01234P1586j02401j03175A18069D9659K29378K5967q4332M8735
10924B69407L60982g3380K5898B46094J15948r2651A15775C8669c1200m1973o7299
$$ plain form
10996 710822 907273 626901 919478 584340 819699 550430 915456 749551 765450 589184
10986 589184 763489 715072 776950 664740 627830 693523 902168 921732 605330 625163 713084
10975 713084 505762 895982 759667 951916 805152 594712 935353 997211 1181322 1136330
10965 1136330 1103665 1147738 1665707 1789323 1840150 1925431 1982311 2301867 2486095 2692505
10955 2692505 2683760 2666989 2639721 2758742 2533664 2243272 1649735 1694870 1744104 1706495 1297919
10944 1297919 1522739 1589290 1915782 1701844 1819848 1468095 1315642 1654037 1053390 1001946
10934 1001946 800712 872298 769897 666722 118069 49659 279037 305004 220672 269407
10924 269407 630389 -73380 -47482 246094 362042 269391 115775 38669 -31200 -73173 -140472
10913a40472H7140J53585L1409o4637E3263k1558J39603D0718c23189C5525e8397
10901a27280c3329k46158F1158f6292A83344Q0802D9455M2522a82586E288a09154
10889b4227j63839Q4218j3687J0834A882K31530j7082a01965j01031L8465k8548
10878a93079J1854f0909b5428j43370I0580L33269A61224a59381D9982j7049c08490
10866A44550a77155h0851q2866c1633l8883A38756E7580a91262A47360a66767
10855a38269D2147a8415m0413K825D996J93128J9791c91646F4957B476c0966D9858
10842c18324I2760e6691A1548K11817g156j10097j64659F9549b2370A86384a24902
10830A17557b44506a1322D4724f0686k78354h8552A78566D8874a5760A29729b4028
$$ plain form
10913 -140472 87140 240725 272134 207497 53263 31705 171308 40718 -323189 35525 -58397
10901 -127280 -33329 -279487 61158 -66292 183344 264146 49455 91977 -182586 5288 -109154
10889 -24227 -188066 -103848 -117535 -106701 1882 233412 216330 -101965 -202996 -164531 -193079
10878 -193079 -181225 -60909 -25428 -168798 90580 423849 161224 -159381 49982 32933 -308490
10866 144550 -177155 -80851 -163717 -31633 -70516 138756 57580 -191262 147360 -166767
10855 -138269 42147 -18415 -58828 -56003 4996 198124 217915 -391646 64957 2476 -30966 49858
10842 -318324 92760 -56691 11548 223365 -7156 -117253 -281912 69549 -22370 186384 -124902
10830 117557 -244506 -11322 44724 -60686 -339040 -88552 178566 48874 -15760 129729 -24028
10818b8069F1783K05842a23966b9224C10677b3594q6635K9338k02518O3069i3671
10806h5659G7823A0826a05385b3949A19741b60418a22991A8495b10836L019B11617
10794e6520r8848l06651A57162o8194J85430b1141l89910A77702b11748m8642
10784b60390h2596k6907B3235P9105b64540f9199A2386J4805c8443j86030Q4934
10773a39539K4382j8887I0706k3268J61723b95385B0145f4672j91681A90332h9017
10761c68335c7770A44546R5902a91863o7347C1340a40628L5600j64648a19161
10750B73199h5409C04597A0649L0626c05165A47004G2843k7133L2753c4301q4951
10739a19252H1547b7050j16396H4149J48806D9742B3857J73572c7381A73708R750
$$ plain form
10818 -28069 61783 267625 -123966 -29224 310677 -23594 -110229 -80891 -283409 -220340 -93671
10806 -85659 77823 10826 -105385 -23949 119741 -260418 -122991 18495 -210836 -207817 211617
10794 -56520 -155368 -462019 157162 88968 274398 -21141 -411051 177702 -211748 -260390
10784 -260390 -82596 -109503 23235 102340 -264540 -69199 12386 27191 -38443 -224473 -139539
10773 -139539 -115157 -134044 90706 67438 229161 -295385 20145 -64672 -256353 190332 -89017
10761 -368335 -37770 144546 240448 -191863 -259210 31340 -140628 -105028 -269676 -119161
10750 273199 -85409 304597 10649 41275 -305165 147004 72843 45710 78463 -34301 -119252
10739 -119252 81547 -27050 -143446 84149 232955 49742 23857 197429 -37381 173708 183458
10728A83458M2436D8130J70790D43K14639A2268c5624j6393k85683J43607j08756
10717c02849J19342A24795J15034a54186e2814R781j63625n1967D1947a85979
10706a65374B33326q5105d84495F0773e6341m5966A2853b74146I618b51723A19435
10694c09140K1636J19522k7985Q3514n7381g0000j64813R0184H9462i2515E3315
10682h1229B21215l921i3102o9760A61350i8799L3423j06052C66858b33643D4541
10670A289a55094j57665G0508a40960F4809a26066A35597b41330H9960B4957e5393
10658F218P7941g8635j92035A99930b44363J11862O1168q7869E6064J49570p0748
10647A34886a76428p0112J316A20904a20684D2141a13386D1918a05932k81235
$$ plain form
10728 183458 225894 48130 218920 443 215082 12268 -35624 -52017 -337700 -194093 -302849
10717 -302849 -183507 124795 239829 -154186 -52814 -43033 -206658 -258625 41947 -185979
10706 -165374 233326 148221 -484495 60773 -56341 -102307 12853 -274146 9618 -251723 119435
10694 -309140 -287504 -167982 -195967 -112453 -169834 -70000 -234813 -144629 89462 -92515 53315
10682 -81229 221215 217294 -93102 -162862 161350 -98799 -65376 -171428 366858 -233643 44541
10670 1289 -155094 -312759 70508 -140960 64809 -126066 135597 -241330 89960 24957 -55393
10658 6218 84159 -78635 -270670 199930 -244363 -132501 -71333 -159202 56064 205634 134886
10647 134886 -176428 -246540 -245224 120904 -120684 42141 -113386 41918 -105932 -387167
10637c87167A59865a36880q0077C1730j1221J65478G8618L6532C9864e05950E6511
10625f7434D7340e8546l6518j39948A40575f0870j33387D5521b33629i0701b7603
10613B66320d99069A44851a78161D847K7037J06567F1047c18972e9434j03351
10603a62785F1322d01551A00587A3114J58791L1273J15031A1723b4262l1098k34105
10592b89465A38563a42094b508j50134D4593a90712B9506a047A11588b9762k41665
10581b71427L1268e2431k13746A13139c267k66124B93251A11393n2470b097j70592
10570a72689P5893a7070j25018F8289a92132B85211N0525b44684O6602l3299G6040
10558C6260b38204A13901b08196j01418f9830k90723B89295a42855A39820f7661
$$ plain form
10637 -387167 159865 -136880 -216957 31730 20509 185987 78618 115150 39864 -505950 56511
10625 -67434 47340 -58546 -95064 -235012 140575 -60870 -194257 45521 -233629 -90701 -27603
10613 266320 -499069 144851 -178161 4847 31884 138451 61047 -318972 -59434 -162785
10603 -162785 61322 -401551 100587 13114 171905 203178 318209 11723 -24262 -55360 -289465
10592 -289465 138563 -142094 -2508 -152642 44593 -190712 29506 -1047 111588 -29762 -271427
10581 -271427 -240159 -52431 -266177 113139 -3267 -269391 293251 111393 58923 -2097 -172689
10570 -172689 -96796 -17070 -142088 68289 -192132 285211 335736 -244684 -178082 -211381 76040
10558 36260 -238204 113901 -208196 -309614 -69830 -360553 289295 -142855 139820 -67661
10547C38433b82750R6227B6323i9167E4265e8958C9192K2961J10422J16275a46819
10535a2632j83804B339L0723c0357j66574Q6108B00561a91644f3733H7855l4511
10524E3344F112L2505L384c05485F1935e20268A97876P8509f1757l67211B06579
10512a6389A63814i4607q7349b8128C23496b12769k1263D664P3718a94799e098
10500C2673d43941a80804r4442C89202l8826n7636C8751P8973b06170c780l07995
10489c11775H0423d6821A13194c16261c5486j75443G8539B7837J6553d9834A24189
10477B43367H514K13089q3946J03555d4165l8748j33140r971R3872B30308H1694
10465a36382O585N1669C50902j28570n182J07646D1226j1414O3860e8482j55419
$$ plain form
10547 338433 -282750 -186523 26323 -99167 54265 -58958 39192 62153 172575 288850 -146819
10535 -12632 -196436 2339 33062 -30357 -196931 -110823 200561 -191644 -63733 87855 53344
10524 53344 6112 38617 42001 -305485 61935 -520268 197876 276385 -61757 -428968 206579
10512 -16389 163814 -94607 -181956 -28128 323496 -212769 -234032 4664 78382 -194799 -5098
10500 32673 -443941 -180804 -275246 389202 350376 292740 38751 117724 -206170 -3780 -311775
10489 -311775 80423 -46821 113194 -316261 -35486 -210929 78539 27837 44390 -49834 124189
10477 243367 8514 221603 137657 241212 -44165 -82913 -216053 -226024 -132152 230308 81694
10465 -136382 -129797 -78128 350902 222332 217150 324796 41226 29812 93672 -58482 -213901
10454b13901j6809A26183n9920a18456A29935g1314j25479g8102A06349J39702
10444B46051c17274a33307k32070E3343b40328d763B35211C3067a91300M3820
10434a47480A09452a44321I0564c8994m8769B3292K60605l9225e7517j13930A7881
10422f8040l68037a37253N5527E7412a7546j87406a2833A02688d3988B7333J5931
10411D3264J87306a18531D6908b36328A47482b44065M2984A28585e4316a4082
10400a24058G6694a72237A1717a1716k76933g4705B95675B2508a73514E0832a02798
10388d89701F9471L9192b85009n450b9330A83399l1109j945n8788Q1947N6018
10377B29522K12689j51014K00C3831K52961j10740C9327o087a47296C19377d4245
$$ plain form
10454 -213901 -230710 126183 66263 -118456 129935 -71314 -196793 -78102 106349 246051
10444 246051 -317274 -133307 -365377 53343 -240328 -4763 235211 33067 -191300 -147480
10434 -147480 109452 -144321 90564 -38994 -87763 23292 283897 244672 -57517 -171447 17881
10422 -68040 -436077 -137253 -81726 57412 -17546 -204952 -12833 102688 -43988 27333 43264
10411 43264 230570 -118531 46908 -236328 147482 -244065 -201081 128585 -54316 -14082
10400 -124058 76694 -172237 11717 -11716 -288649 -74705 295675 22508 -173514 50832 -102798
10388 -489701 69471 108663 -285009 -290459 -29330 183399 152290 150345 91557 173504 229522
10377 229522 442211 291197 291397 33831 286792 176052 39327 33240 -147296 319377 -44245
10365B272K49717L5220P8774c7756A36189J92359R9288A16025k6212N3080K41092
10354C83985a8463l7343D21664P3634M31739k84096A80674M71233A90943o2367
10344A28576N4792K89286j43880o2883H2329K14274j17264J49730o5268J9222
10334B83023M61776l12852A95166B2304L43170k0935K3135r7716n9940I8683J12715
10323B11398j9597J99403j45747L7493k9924a06066A13853f9916A15214j2499
10313A02715O9377K0911E2471J03072R2760l0858C1382j3818K3625i8793D35491
10301I4893a6059A74849q428G3429a59039C638J17057b48632i1958C39970b49751
10289b34124J14835D2701K17006A7589Q5981a49336H8459m2557i8865b9769j49789
$$ plain form
10365 2272 251989 287209 365983 -37756 136189 328548 427836 116025 89813 142893 383985
10354 383985 -18463 -55806 421664 495298 927037 642941 180674 651907 190943 128576
10344 128576 183368 472654 328774 265891 82329 296603 179339 329069 263801 283023
10334 283023 744799 431947 195166 22304 365474 344539 367674 269958 210018 98683 211398
10323 211398 191801 391204 245457 282950 253026 -106066 113853 -69916 115214 102715
10313 102715 172092 193003 52471 155543 248303 217445 31382 17564 41189 -98793 435491
10301 94893 -16059 174849 166421 73429 -159039 3638 120695 -248632 -91958 339970 -249751
10289 -234124 -119289 42701 259707 17589 103570 -149336 88459 45902 -98865 -29769 -179558
10278a79558A32749A7756J77279a32867p1865i7100l71855h4829I2227b96711
10267i6187B00013H5395h7298A01352B9468a37403A23061D8961i9488o2343E4602
10255a43883A72263b3750A14514J19686a7298j53092e1657a3670D6464J08421
10245A54885c4562j33104D23422A68602P5538A02661J70001j31957A0941L03051
10235C13992j22805J17453O8540D516L582b16994A17616A1459J10884a165A28701
10223d4260p4589A01840K642f9700b45j63645B15062b12897A86123b12319A4915
10211B39112b48601D4254O1172L2327c2370K13E0977b6964j25747E5394b33294
10199A8636c8400A06168n56a19604I3924J49029e80463a79583O0098d1539H8903
$$ plain form
10278 -179558 132749 17756 195035 -132867 -204732 -97100 -468955 -84829 92227 -296711
10267 -96187 200013 85395 -87298 101352 29468 -137403 123061 48961 -99488 -161831 54602
10255 -143883 172263 -23750 114514 234200 -17298 -170390 -51657 -13670 46464 154885
10245 154885 -34562 -167666 423422 168602 244140 102661 272662 140705 10941 313992
10235 313992 191187 308640 377180 4516 8098 -216994 117616 11459 122343 -1165 128701
10223 -44260 -118849 101840 104482 -69700 -245 -163890 215062 -212897 186123 -212319 14915
10211 239112 -248601 44254 105426 137753 -32370 -32157 50977 -26964 -152711 55394 -233294
10199 18636 -38400 106168 105612 -119604 93924 242953 -580463 -179583 -119485 -41539 88903
10187A83247d1314B22639m2803b23586o9429J33233C3991O8036c2548j25293M9623
10176a08218k50550M5115B10645G6141b78832i2918A0097a01697E02604a17746
10165A109K30280b32539o5110L9636J09931N7824A97665b99986A32825J4631E5633
10153B6197a08082D8059a09161D2858a62148A24479R5834a6001l2684m78402a14020
10141b79083I746a46940p150G8577b80221D31924E7184d5818k12875j41493a90145
10129b7228j29899e0382j15427C4160M6061a02892k15092c1915j99830B96117
10118b49312e6572N202r1126j73817C5929a31524M3798A78827b15037B3200a70482
10106c2529e962j91356j25661B23258F0453e5374A00301J7843b04489k582D7103
$$ plain form
10187 183247 -41314 222639 179836 -223586 -293015 -159782 33991 102027 -32548 -157841 -108218
10176 -108218 -358768 -313653 210645 76141 -278832 -92918 10097 -101697 502604 -117746
10165 1109 231389 -232539 -297649 -258013 -148082 -90258 197665 -299986 132825 147456 55633
10153 26197 -108082 48059 -109161 42858 -162148 124479 220313 -16001 -48685 -527087 -114020
10141 -279083 9746 -146940 -154090 78577 -280221 431924 57184 -45818 -258693 -400186 -190145
10129 -27228 -157127 -50382 -165809 34160 80221 -102892 -317984 -31915 -231745 296117
10118 -249312 -56572 -51370 -142496 -316313 35929 -131524 -87726 178827 -215037 23200 -170482
10106 -32529 -5962 -197318 -322979 223258 60453 -55374 100301 118144 -204489 -207071 47103
10094b43969I2254D5691e5635n0195j0637D3015P5060a81957O8827A66361a31863
10082g4492j40261F0206K4058C3803f4197j60397E7093b7270m11206I9434a12566
10070c3743a3465F8856F402J01006c64861h1722R96k63787B11725L1293b60684
10058b47103O8287H7976b0272l4398A27531j6807i1184A44456J88442a23243d1618
10046A98191J05783A06055D7153k2056a14863r9246J02662j57664A15461B3383
10035i9049B52845a50122b3174k50211O7338P7001m3370C9501b68312o8381A0628
10023c1429k54899R5746j24296a34641B74962b83358L9049e5760j71693A55043
10012b83138o5700J29818c3323n9287I0332e5170B05625i4940b7720l6087m5300
$$ plain form
10094 -243969 92254 45691 -55635 -105830 -116467 43015 118075 -181957 -113130 166361 -131863
10082 -74492 -214753 60206 84264 33803 -64197 -224594 57093 -27270 -438476 99434 -112566
10070 -33743 -13465 68856 6402 107408 -364861 -81722 -80726 -344513 211725 243018 -260684
10058 -247103 -178816 87976 -20272 -54670 127531 110724 -91184 144456 332898 -123243 -41618
10046 198191 303974 106055 47153 25097 -114863 -214109 -111447 -269111 115461 23383
10035 -99049 252845 -150122 -23174 -273385 -206047 -129046 -172416 39501 -268312 -336693 10628
10023 -31429 -286328 -190582 -314878 -134641 274962 -283358 -244309 -55760 -227453 155043
10012 -283138 -348838 -219020 -33323 -92610 90332 -55170 205625 -94940 -27720 -63807 -109107
10001a09107e0321q2483a2849o877p9376C03975e4615m3826j7891k7405b5360
9989b14620c6315l5910l65174P8327a42223G5407b30502J10852A00533b99885
9978a46738q4C97138E7097B774N363Q240P2287J51998h5460D3184c7975j21353
9966a59328M6239A26619D8267h445B62878d7791j9395k72533J29329j95140C9847
9954e1423l571A3135a45372A25132b07811C12450a51241L1251A306a00475j51646
9943b52121a15724j39320A87298b04184H5967a34253K6659j54203i874B13762
9932d6208J8681A94602i6003R55k03807B32482b10524B47455c42326r8834b747
9920a56430l2235I6108b29977J11241H0358K52870A02359Q6136d05945g9608r286
$$ plain form
10001 -109107 -50321 -132804 -12849 -19726 -99102 303975 -54615 -98441 -116332 -143737 -25360
9989 -214620 -36315 -72225 -437399 -359072 -142223 75407 -230502 -119650 100533 -299885
9978 -146738 -146822 397138 57097 2774 8137 16377 88664 240662 -85460 43184 -37975 -159328
9966 -159328 -113089 126619 48267 -8445 262878 -47791 -67186 -339719 -210390 -405530 39847
9954 -51423 -54994 13135 -145372 125132 -207811 312450 -151241 -119990 1306 -100475 -252121
9943 -252121 -115724 -255044 187298 -204184 85967 -134253 -107594 -261797 -9874 213762
9932 -46208 -27527 194602 -96003 -95048 -298855 232482 -210524 247455 -342326 -441160 -2747
9920 -156430 -188665 96108 -229977 -118736 80358 333228 102359 188495 -405945 -79608 -88894
9909h8894C5772N3768d1777C1309f7863j89827r7664J03012i4032E0988b17067
9897c10213a46693L510B6166J84800d2301A16420f6243j00299A95181a27186M3743
9886h3443E426J52982a5220j69722J4529j85970f3876k06464G502B751a97401
9874a76471A36191c48845F3316b0397k97902a01977j27451l9351B3192e46268
9863B4012J08063d30149e6443a3842j55058H9965K43945a97515O6155J8220E6423
9851b35553C7558a77745A16378e443k0880k16625j5655C0039L8245P9317a31130
9839B8076a07829k21015A52745c57297A93685p9048i1166b1778j77154N9734A070
9827b03787e7311K2716A59302o7325A7599c844j68279O6837J2524B46266h5371
$$ plain form
9909 -88894 35772 89540 -41777 31309 -67863 -257690 -355354 -252342 -94032 50988 -217067
9897 -310213 -146693 -143183 26166 210966 -42301 116420 -66243 -166542 195181 -127186 -83443
9886 -83443 5426 158408 -15220 -184942 -170413 -356383 -63876 -270340 7502 2751 -197401
9874 -176471 136191 -348845 63316 -20397 -318299 -101977 -229428 -268779 23192 -546268
9863 24012 132075 -430149 -56443 -13842 -168900 89965 333910 -197515 -131360 -113140 56423
9851 -235553 37558 -177745 116378 -5443 -26323 -242948 -258603 30039 68284 147601 -131130
9839 28076 -107829 -328844 152745 -357297 193685 114637 -91166 -21778 -198932 -139198 1070
9827 -203787 -57311 -34595 159302 91977 17599 -3844 -172123 -105286 -92762 246266 -85371
9815C09218e9862M912j37135a4937m2821D23893D3680c82022f7039j72895a12049
9803f2468D8751f0296k32650n278a19574D9781a47317N2857j4820M3216A66500
9791D1096N8172f032m27850M7839i4715B27629F4896N9525b42240d1515j66323
9780b07838N6066G3349c05202C3996c5548D09550F9939Q515h0380k00169A71384
9768b32511J5735K6089A775b23162f0920A2528a95350B31068g6429j97043j0123
9757b83595J23373j8647c731D994b63320k034J16792k482H7629c18022A01175
9745a16851A7305a11679L3010D7491e9963m7197B6755b2088r6758I891J62148
9734A72039m6129k0290B7635b89749g4896j04631b4673A71064B6730b32008d0759
$$ plain form
9815 309218 -59862 -54950 -192085 -14937 -57758 423893 43680 -382022 -67039 -239934 -112049
9803 -62468 48751 -60296 -292946 -298224 -119574 49781 -147317 -94460 -109280 -66064 166500
9791 41096 99268 -6032 -433882 -386043 -94715 227629 64896 124421 -242240 -41515 -207838
9780 -207838 -151772 73349 -305202 33996 -35548 409550 69939 78454 -80380 -280549 171384
9768 -232511 -216776 -190687 1775 -223162 -60920 12528 -195350 231068 -76429 -273472 -283595
9757 -283595 -160222 -178869 -3731 4994 -263320 -265354 -148562 -151044 87629 -318022 101175
9745 -116851 17305 -111679 -78669 47491 -59963 -107160 26755 -22088 -118846 9891 172039
9734 172039 125910 105620 27635 -289749 -74896 -179527 -24673 171064 26730 -232008 -40759
9722I6046f9219K9337F849J4560i2607G7357J44651a57552d5058B71423f4527
9710a42886b6885A93674l9787b33347A94996E3769a635j24685l1750A87490g9979
9698c38609J18288I2648J07933g646B2458d18853a98603i934B534b03978F4936
9686b99139A65778h8715l4455j13112h1170J2531F9797l2232g3917H7396f7451
9674c5451j66816D34715A25188n371c43619G7228a37427j82012B72541a81495
9663c6508k75397a3737j01715K3874A20213d8812k67431J39074B1946c51489A02056
9651F4591a2833o5513k90654a0284l31526H5858k831J43840D8763F631N5298B5308
9638B21235g1586l6464l2071G598c18973a36945l35831a24373J0826k12252C65806
$$ plain form
9722 96046 -69219 -39882 6849 21409 -92607 77357 222008 -157552 -45058 271423 -64527
9710 -142886 -26885 193674 153887 -233347 194996 53769 -1635 -126320 -158070 187490 -79979
9698 -338609 -220321 92648 200581 -7646 22458 -418853 -198603 -9934 2534 -203978 64936
9686 -299139 165778 -88715 -123170 -236282 -81170 -68639 69797 37565 -73917 87396 -67451
9674 -35451 -202267 434715 125188 119817 -343619 77228 -137427 -319439 272541 -181495
9663 -36508 -311905 -13737 -115452 -91578 120213 -48812 -316243 -177169 21946 -351489 102056
9651 64591 -12833 -78346 -369000 -10284 -341810 85858 83027 226867 48763 6631 61929 25308
9638 221235 -71586 -108050 -140121 7598 -318973 -136945 -472776 -124373 -113547 -325799 365806
9626d8793k4545o5860J0723B3231d8771o5351b7896n3284l35129h8973L6245m46240
9614d98968i1338B28971L2657K509m4719a12962c4151P464q1785n4790B78241
9602a63792Q663A19370F749J33068b33925Q466M9199I348Q9735a79653B80134
9590A16022b05042b492F0600J1160R6130c4818k52188Q5275R1792E9610K12024
9579B71634g1794A24836g9908k80614B3241J48639a68490F4642I862K16700i0276
9567A61223a89685d589j67877G6680a37057A56246d8911A16851d969k22474A7218
9555d33320a08569M7061k70424A67269a03862B37386H2539J39279a15300k77772
9545c93072b9535B9494f9857m4243j32697k20142h3728l21375a48689L1802J85
$$ plain form
9626 -48793 -73338 -139198 -128475 23231 -48771 -114122 -27896 -81180 -416309 -88973 -52728 -498968
9614 -498968 -91338 228971 261628 264137 219418 -112962 -34151 -26687 -108472 -163262 278241
9602 -163792 -155129 119370 6749 139817 -233925 -225459 -176260 9348 99083 -179653 280134
9590 116022 -205042 -2492 60600 71760 167890 -34818 -287006 -201731 -109939 59610 271634
9579 271634 -71794 124836 -79908 -360522 23241 171880 -168490 64642 9862 226562 -90276
9567 161223 -189685 -4589 -172466 76680 -137057 156246 -48911 116851 -4969 -227443 17218
9555 -433320 -108569 -61508 -331932 167269 -103862 237386 82539 221818 -115300 -393072
9545 -393072 -29535 29494 -69857 -114100 -246797 -466939 -83728 -405103 -148689 -116887 -116702
9534a16702C548d58709h4857Q570C9463c25924J59558C1268a83384Q5736I1003
9522C36986G2642M7044a21464p33A93668H1299b05610D2991e9632F1807J69537
9511B31344c37332j54927I5781P115N4847a5241A4650J29794a77796h3558M719
9500g8839j10735E7662J70337b35973a979A9713Q1489M7172f404r1621B10830
9488a25271O402m2428m9347j36036A14296D5210b84467R4570b3630A03656f7936
9476A37647a06186D9860J4146b3548p1059A38316c08811R4953E9930b00496Q269
9465a92227k6042e3325F8514J42053b55744B24873a1088k1948A42818b58090f2183
9453G7455a43406M852j68793J23802d1871k78252i9008k0868k26509e1249r4873
$$ plain form
9534 -116702 3548 -458709 -84857 -76287 39463 -325924 -166366 31268 -183384 -97648 91003
9522 336986 72642 119686 -121464 -122197 193668 81299 -205610 42991 -59632 61807 231344
9511 231344 -337332 -492259 95781 102896 157743 -15241 14650 144444 -177796 -83558 -78839
9500 -78839 -189574 57662 227999 -235973 -1979 19713 101202 148374 -6404 -98025 210830
9488 -125271 -118869 -161297 -210644 -346680 114296 45210 -284467 -189897 -23630 103656 -67936
9476 137647 -106186 49860 64006 -23548 -94607 138316 -308811 -213858 59930 -200496 -192227
9465 -192227 -218269 -53325 68514 210567 -255744 224873 -11088 -33036 142818 -258090 -62183
9453 77455 -143406 -138554 -307347 -183545 -41871 -320123 -99008 -119876 -346385 -51249 -146122
9442a46122B99116p7074a49032k25615J28284j28344a36944J5256J9801E1126
9431B74518g3506o303N872A1151c70828e1418b1031j897j7160D1392a60919h0146
9418A00703B1535J11731K338A66J81816a67453f7193E5324c43556e4175p7504
9407a31679O2060C3566P8122A206b57473h5376C07219c02520h2899D43309B01964
9395E2085r978b54284G1742h3893n1904B1119J2180L9873a09503C4323i5274E6732
9382G9709a66383b3857m564j26036n4266J04284B38715a01057b2323B93976G5044
9370A85975D127a3786j06010N276k20752J04340B30i1629h853A61793h252k33129
9358b41381A52157B6125K14457b56616H6410Q7703a03440j07016D7529A6505g3954
$$ plain form
9442 -146122 299116 222042 -149032 -374647 -246363 -374707 -136944 -121688 -101887 51126
9431 274518 -73506 -79809 -73937 11151 -370828 -51418 -21031 -22928 -40088 41392 -160919 -80146
9418 100703 21535 133266 135604 166 181982 -167453 -67193 55324 -343556 -54175 -131679
9407 -131679 -69619 33566 111688 1206 -257473 -85376 307219 -302520 -82899 443309 201964
9395 52085 42107 -254284 71742 -83893 -135797 21119 33299 73172 -109503 34323 -95274 56732
9382 79709 -166383 -23857 -28421 -154457 -208723 -104439 238715 -101057 -22323 293976 75044
9370 185975 4127 -13786 -119796 -114520 -335272 -230932 230 -91629 -8853 161793 -8252 -241381
9358 -241381 152157 26125 240582 -256616 86410 174113 -103440 -210456 47529 16505 -73954
9346d9234C1476N126b5308l43016B8624a33663j59659b4199j81917i0770A0897
9334b80957G8381i2001k5096A69955b06095g722A29728d02204J23305c5894k62084
9323b97978c9345A58529f8178j51748L7409L0686b7306j70959l457H2840a19158
9311b67545L1797K3054h264k22500c0341p7944j78109H6204b2848n89102a86049
9299F8603j5875J19687d27874E9341J31783b66773l5768m913J46163C1151J03565
9288A34716a09005N3156j87881O2413A08722b70821h6489A84400n5020d9435A27992
9276a22437j4392H5499e8569A553g6688A46289L5107b02467j69058a35008J4754
9265a20254l19424A09737b04752P8249a2894j26630c190r3596A3100L4904b46376
$$ plain form
9346 -49234 31476 36602 -25308 -368324 28624 -133663 -293322 -24199 -206116 -90770 10897
9334 -280957 78381 -92001 -117097 169955 -206095 -7722 129728 -402204 -278899 -35894 -297978
9323 -297978 -39345 158529 -68178 -219926 -182517 -151831 -27306 -198265 -201722 82840 -119158
9311 -267545 -235748 -212694 -8264 -230764 -30341 -108285 -286394 86204 -22848 -611950 -186049
9299 68603 52728 172415 -427874 59341 191124 -266773 -302541 -307454 -161291 31151 134716
9288 134716 -109005 -55849 -243730 -181317 108722 -270821 -86489 184400 129380 -49435 127992
9276 -122437 -136829 85499 -58569 1553 -76688 146289 181396 -202467 -371525 -135008 -120254
9265 -120254 -439678 109737 -204752 -126503 -12894 -139524 -3190 -96786 13100 48004 -246376
9253e2001q3344A55572c7089B34971b37643f4393B09474a7949j62983L9047D1015
9241G8749c9645A6532a61464O3972A03299d2698m9967n1708D99193b1386j36635
9230a58021k9229j7714E3721a80579B78848a736k91547h1794R385k12957j08331
9219c93697A31318c0795r7558A33004c4788D4274a43228a0979k62295A6131h2782
9207A30162c12794B56244N5686C3385b19440r4472a13053m1274A10930a0010l24413
9196c34423D19059b06256K7833A37456l9129J55148a8896j08073o107N9487m6268
9185a19857k23740a34686k02848g0070j88587a7790B5243b2378g260A33309b67634
9173i6301D94331g2293o224E9459J00619b24526I6066a15713b7683j91661D1962
$$ plain form
9253 -52001 -135345 155572 -37089 234971 -237643 -64393 209474 -17949 -180932 -141885 41015
9241 78749 -39645 16532 -161464 -97492 103299 -42698 -92665 -144373 499193 -21386 -158021
9230 -158021 -187250 -204964 53721 -180579 278848 -1736 -293283 -81794 -72409 -285366 -393697
9219 -393697 131318 -30795 -128353 133004 -34788 44274 -143228 -10979 -273274 16131 -82782
9207 130162 -312794 256244 311930 33385 -219440 -313912 -113053 -154327 110930 -10010 -334423
9196 -334423 419059 -206256 -178423 137456 98327 253475 -18896 -126969 -133076 -73589 -119857
9185 -119857 -343597 -134686 -337534 -70070 -258657 -17790 25243 -22378 -7260 133309 -267634
9173 -96301 494331 -72293 -78517 59459 160078 -224526 96066 -115713 -27683 -219344 41962
9161A24011c15302a29761B04893d76539A6658i8388J2858o5929K2288n9195h7364
9149B37940c22355A08280K3734b06666j435P0527A91102a21769d3155j89943A00772
9137c31213J23305d1400j15457A16191a85472L9399n317c98j45887j00101J01324
9126a45062C20849p9646b11408A63072h4156D7930a9613A04165a29623I0133b30679
9114A16698a81389D5915b23680o7276A93733c72156B2858h7702p8210k9292H2235
9102b35578P856k169i5344E0027H118M4328a89465g8694j91630H8955h4137k06035
9090b90172i1787l7624A24422J47666j00572D9411L86074A42458a76702d4961
9079H2308a9717j75383c952r1280D1003a48019r3630P8202A45123a14914j51231
$$ plain form
9161 124011 -315302 -129761 204893 -476539 16658 -98388 -85530 -151459 -129171 -188366 -87364
9149 237940 -322355 108280 132014 -206666 -208101 -137574 191102 -121769 -43155 -233098 100772
9137 -331213 -207908 -41400 -156857 116191 -185472 -146073 -151390 -398 -146285 -246386 -145062
9126 -145062 320849 241203 -211408 163072 -84156 47930 -19613 104165 -129623 90133 -230679
9114 116698 -181389 45915 -223680 -290956 193733 -372156 22858 -87702 -165912 -195204 82235
9102 -235578 -227722 -229891 -95344 50027 8118 52446 -189465 -78694 -270324 88955 -84137 -290172
9090 -290172 -91787 -129411 124422 272088 171516 49411 435485 142458 -176702 -44961
9079 82308 -19717 -195100 -3952 -95232 41003 -148019 -241649 -163447 145123 -114914 -266145
9068b66145J7479f4495D19985A17333b7721j62086B88754a30309A35702a64895
9057a17615N4864A04917K04194j03756a7770h473p351A82325G6991c64066G8178
9045A34049b9366q2410G6639i7630F1096d6435H9141a92557j12899a32049A54940
9033a80412H875J11514f6252F5459a43317G2013J30771B5436a22812A9495h086
9021b2419l27365D5791d5925D0378d16468g8231k62712e2805n5764C1827M951
9010C6778c43395J05392p6821G4602a97168E9170g7166A51262F841a91235f5013
8998b72786E4377B177e9369K3904j88384C4383b19646H4342a23183C42676A19756
8986a53722n4793c4790h885A09744c00540a43683k09423a11956J6172j93220A3996
$$ plain form
9068 -266145 -248666 -64495 419985 117333 -27721 -189807 288754 -130309 135702 -164895
9057 -117615 -62751 104917 309111 205355 -17770 -8473 -15824 182325 76991 -364066 78178
9045 134049 -29366 -111776 76639 -97630 61096 -46435 89141 -192557 -305456 -132049 154940
9033 -180412 8875 120389 -66252 65459 -143317 72013 202784 25436 -122812 19495 -8086
9021 -22419 -349784 45791 -45925 40378 -416468 -78231 -340943 -52805 -108569 31827 36778
9010 36778 -343395 -238003 -314824 74602 -197168 59170 -77166 151262 6841 -191235 -65013
8998 -272786 54377 2177 -59369 -35465 -223849 34383 -219646 84342 -123183 342676 119756
8986 -153722 -208515 -34790 -8885 109744 -300540 -143683 -353106 -111956 -95784 -289004 13996
8974c27520h9944j72867J01234j49360F0802g0638l42934a20407A58855d75480
8963I1713a54637p6071D11450h9469H6568L1766f6420F5560L50758j68135c50436
8951I6332O2234D589a9486j0051A59058m2025E497R8704h002b373o4039A8505
8938A37966e9125j91632c4884O352k21781p8448h7524b079A79951q3882c3198
8926A91878a9160r3327D5766R1111J40104a2031n091E1672L25612P1177i4895
8914C39769A16354o910M9943J55362M37565J29215M05128J002805K165130O137002
8904A0591594m414955B917988j453454n13990j76479A20803N07486B24208K3474
8895B47682a85449b607G4043J83395J48810g4847C73708b2774m3865J5617m5549
$$ plain form
8974 -327520 -89944 -262811 -161577 -310937 60802 -70638 -413572 -120407 158855 -475480
8963 91713 -154637 -230708 411450 -89469 86568 118334 -66420 65560 416318 248183 -350436
8951 96332 158566 4589 -19486 -29537 159058 117033 5497 104201 -8002 -2373 -66412 18505
8938 137966 -59125 -250757 -34884 -28532 -250313 -328761 -87524 -2079 179951 96069 -33198
8926 191878 -19160 -112487 45766 136877 276981 -12031 -17122 51672 377284 448461 -94895
8914 339769 116354 109444 159387 314749 752314 881529 1286657 2289462 4454592 10591594
8904 10591594 6176639 2917988 1464534 950544 774065 120803 628289 224208 247682
8895 247682 -185449 -2607 74043 257438 406248 -74847 373708 -22774 -66639 -51022 -96571
8884i6571C72634b6132b11H2158J45685b70634A00894b43787M8309B527e28489
8872A48068K11083I8238b50588L5486j7885i2342A68277L4364b84085h6413j66573
8861b52986P4964d2725f651c038l01557B84144d7332J9575A32476C2300e3982
8849c52760a69751n2375K1000q6107c7268j79483A91404a58709j45659J11989
$$ plain form
8884 -96571 372634 -26132 -211 82158 227843 -270634 100894 -243787 -195478 2527 -528489
8872 148068 359151 98238 -250588 -215102 -232987 -92342 168277 202641 -284085 -86413 -252986
8861 -252986 -178022 -42725 -6651 -3038 -304595 284144 -47332 -27757 132476 32300 -53982
8849 -352760 -169751 -222126 -201126 -287233 -37268 -216751 191404 -158709 -304368 -192379
$$ [...]
##END NTUPLES=NMR SPECTRUM
##END=
