
##TITLE=UV1014_M1-1003-1002_6268966_0VxE4nSqBs
##JCAMPDX= 6.0         $$ Bruker NMR JCAMP-DX V2.0
##DATA TYPE= NMR SPECTRUM
##DATA CLASS= NTUPLES
##ORIGIN= BRUKER
##OWNER= Administrator
$$ 1.72 TOPSPIN		Version 2.1
$$ 2012-06-02 01:38:06.421 -0500  Administrator@TOPSPIN
$$ Compression mode = diff/dup
##.OBSERVE FREQUENCY= 400.13188235
##.OBSERVE NUCLEUS= ^1H
##.ACQUISITION MODE= SIMULTANEOUS (DQD)
##.ACQUISITION SCHEME= undefined
##.AVERAGES= 64
##.DIGITISER RES= 22
##SPECTROMETER/DATA SYSTEM= spect
##.PULSE SEQUENCE= noesygpps1d.comp
##.SOLVENT NAME= COFFEE_calctemp
##.SHIFT REFERENCE= INTERNAL, COFFEE_calctemp, 1, 14.96723
##AUDIT TRAIL= $$ (NUMBER, WHEN, WHO, WHERE, PROCESS, VERSION, WHAT)
$$ ##TITLE= Audit trail, TOPSPIN		Version 2.1
$$ ##JCAMPDX= 5.01
$$ ##ORIGIN= Bruker BioSpin GmbH
$$ ##OWNER= Administrator
$$ $$ C:\Bruker\TOPSPIN/data/COFFEE/nmr/UV1014_M1-1003-1002_6268966_0VxE4nSqBs/12/pdata/1/auditp.txt
$$ ##AUDIT TRAIL=  $$ (NUMBER, WHEN, WHO, WHERE, PROCESS, VERSION, WHAT)
(   1,<2012-06-02 01:38:01.203 -0500>,<Administrator>,<TOPSPIN>,<go>,<TOPSPIN 2.1>,
      <created by zg
	started at 2012-06-02 01:26:31.062 -0500,
	POWCHK enabled, PULCHK disabled,
       configuration hash MD5:
       D5 CA 7A 23 FE 6B EE E2 50 67 74 61 24 F7 5E 3B
       data hash MD5: 64K
       A2 61 CB 59 41 2C E3 9A B3 49 D4 4B F5 CD D1 1C>)
(   2,<2012-06-02 01:38:04.281 -0500>,<Administrator>,<TOPSPIN>,<proc1d>,<TOPSPIN 2.1>,
      <Start of raw data processing
       efp LB = 0.3 FT_mod = 6 PKNL = 1 PHC0 = 0 PHC1 = 0 SI = 128K 
       data hash MD5: 128K
       34 EC A9 A1 1A 63 E4 74 6B D1 7F 0A E6 AE E6 C6>)
(   3,<2012-06-02 01:38:05.562 -0500>,<Administrator>,<TOPSPIN>,<proc1d>,<TOPSPIN 2.1>,
      <pk PHC0 = 30.18494 PHC1 = 0 
       data hash MD5: 128K
       54 3E 18 14 82 0F DC 62 AA 72 5E 11 5E FB 92 60>)
(   4,<2012-06-02 01:38:06.093 -0500>,<Administrator>,<TOPSPIN>,<proc1d>,<TOPSPIN 2.1>,
      <abs ABSG = 1 
       data hash MD5: 128K
       80 C9 CC BF F3 86 4E A1 10 28 82 65 5B A9 68 22>)
(   5,<2012-06-02 01:38:06.171 -0500>,<Administrator>,<TOPSPIN>,<proc1d>,<TOPSPIN 2.1>,
      <abs ABSG = 2 
       data hash MD5: 128K
       1E A6 4A A0 45 23 DD 6C 0E AA FD B8 06 B3 A0 AE>)
(   6,<2012-06-02 01:38:06.234 -0500>,<Administrator>,<TOPSPIN>,<proc1d>,<TOPSPIN 2.1>,
      <abs ABSG = 3 
       data hash MD5: 128K
       F1 9F 2E 5B CA AE 9D 21 A1 20 23 93 B5 D1 00 90>)
(   7,<2012-06-02 01:38:06.296 -0500>,<Administrator>,<TOPSPIN>,<proc1d>,<TOPSPIN 2.1>,
      <abs ABSG = 4 
       data hash MD5: 128K
       E7 63 84 60 9B 35 FB D4 6F 00 A8 0D 5E AA AB E6>)
(   8,<2012-06-02 01:38:06.343 -0500>,<Administrator>,<TOPSPIN>,<proc1d>,<TOPSPIN 2.1>,
      <abs ABSG = 5 
       data hash MD5: 128K
       55 8F 6F EC 12 7B 20 0B 42 FD BA 6B 7F F5 C1 1A>)
$$ ##END=
$$ 
$$ $$ hash MD5
$$ $$ 48 ED 51 32 C4 75 E7 CE B1 82 A6 F9 57 7D 45 B6
##$RELAX= 
##$RELAX= 
##$RELAX= 
##$RELAX= 
##$RELAX= 
##$RELAX= 
##$RELAX= 
##$RELAX= 
$$ [...]
##$TP07= 0
##$TPNAME0= <>
##$TPNAME1= <>
##$TPNAME2= <>
##$TPNAME3= <>
##$TPNAME4= <>
##$TPNAME5= <>
##$TPNAME6= <>
##$TPNAME7= <>
##$TPOAL= (0..7)
0.5 0.5 0.5 0.5 0.5 0.5 0.5 0.5
##$TPOFFS= (0..7)
0 0 0 0 0 0 0 0
##$TUNHIN= 0
##$TUNHOUT= 0
##$TUNXOUT= 0
##$USERA1= <user>
##$USERA2= <user>
##$USERA3= <user>
##$USERA4= <user>
##$USERA5= <user>
##$V9= 5
##$VALIST= <valist>
##$VCLIST= <CCCCCCCCCCCCCCC>
##$VD= 0
##$VDLIST= <DDDDDDDDDDDDDDD>
##$VPLIST= <PPPPPPPPPPPPPPP>
##$VTLIST= <TTTTTTTTTTTTTTT>
##$WBST= 2048
##$WBSW= 25
##$XGAIN= (0..3)
0 0 0 0
##$XL= 0
##$YL= 0
##$YMAX_a= 12546336
##$YMIN_a= -6731545
##$ZGOPTNS= <>
##$ZL1= 120
##$ZL2= 120
##$ZL3= 120
##$ZL4= 120
##$ABSF1= 14.96723
##$ABSF2= -5.5853
##$ABSG= 5
##$ABSL= 3
##$ALPHA= 0
##$AQORDER= 0
##$ASSFAC= 0
##$ASSFACI= 0
##$ASSFACX= 0
##$ASSWID= 0
##$AUNMP= <proc_prof1d_extract.lims>
##$AXLEFT= 0
##$AXNAME= <>
##$AXNUC= <1H>
##$AXRIGHT= 0
##$AXTYPE= 0
##$AXUNIT= <>
##$AZFE= 0.1
##$AZFW= 0.1
##$BCFW= 0
##$BC_mod= 0
##$BYTORDP= 0
##$COROFFS= 0
##$CY= 15
##$DATMOD= 1
##$DC= 0
##$DFILT= <>
##$DTYPP= 0
##$F1P= 0
##$F2P= 0
##$FCOR= 0.5
##$FTSIZE= 131072
##$FT_mod= 6
##$GAMMA= 0
##$GB= 0
##$INTBC= 1
##$INTSCL= 1
##$ISEN= 128
##$LB= 0.3
##$LEV0= 0
##$LPBIN= 0
##$MAXI= 10000
##$MC2= 0
##$MEAN= 0
##$ME_mod= 0
##$MI= 0
##$NCOEF= 0
##$NC_proc= -3
##$NLEV= 6
##$NOISF1= 0
##$NOISF2= 0
##$NSP= 0
##$NTH_PI= 0
##$NZP= 0
##$OFFSET= 14.96723
##$PC= 1
##$PHC0= 30.18494
##$PHC1= 0
##$PH_mod= 1
##$PKNL= yes
##$PPARMOD= 0
##$PPDIAG= 0
##$PPIPTYP= 0
##$PPMPNUM= 2147483647
##$PPRESOL= 1
##$PSCAL= 4
##$PSIGN= 0
##$PYNMP= <proc.py>
##$REVERSE= no
##$SF= 400.130005356206
##$SI= 131072
##$SIGF1= 0
##$SIGF2= 0
##$SINO= 400
##$SIOLD= 131072
##$SPECTYP= <>
##$SREGLST= <1H.CDCl3>
##$SSB= 0
##$STSI= 131072
##$STSR= 0
##$SW_p= 8223.68421052632
##$SYMM= 0
##$S_DEV= 0
##$TDeff= 65536
##$TDoff= 0
##$TI= <>
##$TILT= no
##$TM1= 0
##$TM2= 0
##$TOPLEV= 0
##$USERP1= <user>
##$USERP2= <user>
##$USERP3= <user>
##$USERP4= <user>
##$USERP5= <user>
##$WDW= 1
##$XDIM= 131072
##$YMAX_p= 506071533
##$YMIN_p= -26748171
##$CURPLOT= <Network HP LaserJet P1505>
##$CURPRIN= <$Network HP LaserJet P1505>
##$DFORMAT= <normdp>
##$LAYOUT= <+/1D_H.xwp>
##$LFORMAT= <normlp>
##$PFORMAT= <normpl>
##$SURQMSG= 1
$$ End of Bruker specific parameters
$$ ---------------------------------
##NTUPLES= NMR SPECTRUM
##VAR_NAME=  FREQUENCY,     SPECTRUM/REAL,   SPECTRUM/IMAG
##SYMBOL=    X,             R,               I
##VAR_TYPE=  INDEPENDENT,   DEPENDENT,       DEPENDENT
##VAR_FORM=  AFFN,          ASDF,            ASDF
##VAR_DIM=   131072,        131072,          131072
##UNITS=     HZ,            ARBITRARY UNITS, ARBITRARY UNITS
##FACTOR=    0.0627417313425165, 1,          1
##FIRST=     8223.62146879498, -509,         -111385
##LAST=      0,             599,             -112685
##MIN=       0,             -26748171,       0
##MAX=       8223.62146879498, 506071533,    0
$$ Real data points
##PAGE= N=1
##DATA TABLE= (X++(R..R)), XYDATA
$$ [...]
$$ plain form
63499 1196526 1214078 1232721 1252721 1274126 1296865 1321261 1348163 1378220 1411102 1446013 1483214
63488 1483214 1524325 1570286 1619270 1667329 1710911 1747974 1776935 1795893 1803487 1799994 1787373 1768769
63476 1768769 1747923 1727905 1709773 1692889 1676576 1660610 1644012 1624761 1601564 1574981 1545950
63465 1545950 1514063 1478283 1438719 1396614 1353104 1309167 1266520 1227307 1192530 1161293 1131717
63454 1131717 1102365 1073141 1045253 1020065 997796 977870 960609 947339 938029 930147 921284 911963
63442 911963 904154 897644 889976 880053 869757 861427 855313 850329 845948 842333 839473 837098 834985 832792
63428 832792 830130 827188 824657 822735 820879 818967 817891 818556 820960 824701 829576 835010 839608 842099
63414 842099 842484 841791 841028 840650 840447 839459 836486 831240 824709 818132 812112 806951 803113 800825 799800 799812
$$ packed form
63499A196526J7552J8643K0000K1405K2739K4396K6902L0057L2882L4911L7201
63488A483214M1111M5961M8984M8059M3582L7063K8961J8958P594l493j2621j8604
63476A768769k0846k0018j8132j6884j6313j5966j6598j9251k3197k6583k9031
63465A545950l1887l5780l9564m2105m3510m3937m2647l9213l4777l1237k9576
63454A131717k9352k9224k7888k5188k2269j9926j7261j3270r310p882q863r321
63442I11963p809o510p668r923j0296q330o114m984m381l615k860k375k113k193
63428H32792k662k942k531j922j856j912j076O65K404L741M875N434M598K491
63414H42099L85o93p63l78k03r88k973n246o531o577o020n161l838k288j025J2
$$ plain form
63398 799812 800973 803050 805280 807446 810452 815197 821487 828590 836268 844722 854346 866079 880912 898109
63384 898109 914991 929765 943843 960058 979450 1001283 1025395 1052517 1082619 1115031 1150149
63373 1150149 1188808 1229535 1268492 1303034 1333607 1361395 1386190 1408124 1429854 1454909 1484480
63362 1484480 1517365 1552522 1590220 1631168 1675933 1724858 1776903 1828463 1874676 1912229 1940262
63351 1940262 1958978 1968842 1971153 1967836 1960026 1947883 1932244 1915261 1898574 1881630 1862513 1839757
63339 1839757 1812770 1781347 1745848 1707441 1667279 1625707 1583088 1540950 1501297 1464760 1430401
63328 1430401 1397510 1366781 1339386 1315622 1295008 1277357 1263294 1253725 1248929 1247930 1248803 1250032 1251877
63315 1251877 1256186 1264735 1277901 1294791 1314056 1334391 1354905 1375687 1397787 1422187 1448925 1477557
$$ packed form
63398G99812J161K077K230K166L006M745O290P103P678Q454R624J1733J4833J7197
63384H98109J6882J4774J4078J6215J9392K1833K4112K7122L0102L2412L5118
63373A150149L8659M0727L8957L4542L0573K7788K4795K1934K1730K5055K9571
63362A484480L2885L5157L7698M0948M4765M8925N2045N1560M6213L7553K8033
63351A940262J8716R864K311l317p810j2143j5639j6983j6687j6944j9117k2756
63339A839757k6987l1423l5499l8407m0162m1572m2619m2138l9653l6537l4359
63328A430401l2891l0729k7395k3764k0614j7651j4063r569m796r99Q73J229J845
63315A251877M309Q549J3166J6890J9265K0335K0514K0782K2100K4400K6738K8632
$$ plain form
63303 1477557 1508227 1541669 1578213 1617334 1658332 1700981 1745229 1790510 1835562 1878752 1918345
63292 1918345 1952555 1979634 1998227 2007876 2009341 2004268 1994318 1980538 1963510 1943894 1922547 1900168
63280 1900168 1876916 1852240 1824959 1793796 1758234 1718808 1676414 1631610 1585001 1537958 1492171
63269 1492171 1448543 1407232 1368895 1335030 1306665 1283367 1264104 1248446 1236199 1226288 1216895 1206644
63257 1206644 1194858 1180725 1163130 1141742 1117707 1092828 1068393 1045089 1023616 1004769 988852
63246 988852 975308 963023 951006 939077 928075 919183 912708 907570 902234 896045 889412 882834 876149
63233 876149 868789 860426 851241 841879 833308 826346 820952 815993 809950 801972 792362 782416 773853 767878
63219 767878 764286 761649 758770 755749 753280 751312 749258 747324 746575 747319 748359 748383 747399 746112 744645
$$ packed form
63303A477557L0670L3442L6544L9121M0998M2649M4248M5281M5052M3190L9593
63292A918345L4210K7079J8593R649J465n073r950j3780j7028j9616k1347k2379
63280A900168k3252k4676k7281l1163l5562l9426m2394m4804m6609m7043m5787
63269A492171m3628m1311l8337l3865k8365k3298j9263j5658j2247r911r393j0251
63257A206644j1786j4133j7595k1388k4035k4879k4435k3304k1473j8847j5917
63246I88852j3544j2285j2017j1929j1002q892o475n138n336o189o633o578o685
63233H76149p360q363r185r362q571o962n394m959o043p978r610r946q563n975
63219G67878l592k637k879l021k469j968k054j934p49P44J040K4r84j287j467
$$ plain form
63204 744645 742840 741387 741492 743387 746066 748707 751646 755738 761326 768017 774973 781347 787089 793494
63190 793494 802208 813238 824437 833471 840163 846711 855886 869095 885667 903698 921920 940983
63178 940983 962607 987425 1014233 1041523 1069062 1097482 1126969 1157084 1187624 1219006 1251821
63167 1251821 1286238 1321551 1356036 1387706 1415766 1441115 1465214 1489020 1513480 1540145 1569965
63156 1569965 1601507 1631495 1657576 1680058 1700717 1720315 1737381 1748987 1752656 1747983 1736676 1720833
63144 1720833 1701290 1677810 1650467 1620149 1587824 1554225 1520444 1488162 1458879 1433359 1411973
63133 1411973 1394971 1381944 1371588 1362642 1354990 1349433 1346577 1346384 1348784 1354178 1363048 1375232 1389883
63120 1389883 1406143 1423662 1442326 1461671 1480974 1499889 1518573 1537031 1554718 1571014 1585687
$$ packed form
63204G44645j805j453J05J895K679K641K939M092N588O691O956O374N742O405
63190G93494Q714J1030J1199R034O692O548R175J3209J6572J8031J8222J9063
63178I40983K1624K4818K6808K7290K7539K8420K9487L0115L0540L1382L2815
63167A251821L4417L5313L4485L1670K8060K5349K4099K3806K4460K6665K9820
63156A569965L1542K9988K6081K2482K0659J9598J7066J1606L669m673j1307j5843
63144A720833j9543k3480k7343l0318l2325l3599l3781l2282k9283k5520k1386
63133A411973j7002j3027j0356q946p652n557k856j93K400N394Q870J2184J4651
63120A389883J6260J7519J8664J9345J9303J8915J8684J8458J7687J6296J4673
$$ plain form
63109 1585687 1598598 1609500 1618558 1626470 1633241 1637319 1636942 1632161 1624391 1613885 1598901 1577918 1551719
63096 1551719 1522619 1492364 1461518 1430211 1398507 1366320 1333903 1302528 1274052 1249623 1229072
63085 1229072 1211457 1195755 1180979 1166222 1151049 1135923 1122058 1110619 1101821 1094835 1088802 1083917
63073 1083917 1081231 1081417 1084129 1088679 1094782 1102305 1110738 1119451 1128308 1137580 1147329 1157212 1166842 1176079
63059 1176079 1184914 1193262 1200869 1207421 1212824 1217327 1221170 1224172 1226034 1227101 1228399 1230726 1234030 1237757
63045 1237757 1241376 1244426 1246688 1248604 1250925 1253486 1254934 1254293 1252345 1250863 1250948 1252824 1256646 1262269 1268365
63030 1268365 1273125 1276327 1279740 1284896 1291155 1296622 1300423 1303335 1306464 1310189 1314491 1319688 1326329 1334546
63016 1334546 1343831 1353481 1363121 1372802 1382869 1393915 1406708 1421852 1439415 1459081 1480538 1503454
$$ packed form
63109A585687J2911J0902R058P912O771M078l77m781p770j0506j4984k0983k6199
63096A551719k9100l0255l0846l1307l1704l2187l2417l1375k8476k4429k0551
63085A229072j7615j5702j4776j4757j5173j5126j3865j1439q798o986o033m885
63073A083917k686J86K712M550O103P523Q433Q713Q857R272R749R883R630R237
63059A176079Q835Q348P607O552N403M503L843L002J862J067J298K327L304L727
63045A237757L619L050K262J916K321K561J448o41j948j482Q5J876L822N623O096
63030A268365M760L202L413N156O259N467L801K912L129L725M302N197O641Q217
63016A334546R285R650R640R681J0067J1046J2793J5144J7563J9666K1457K2916
$$ plain form
63004 1503454 1527238 1551554 1577291 1606397 1640222 1678406 1719763 1763746 1810448 1859739 1911411
62993 1911411 1966041 2024817 2088371 2156452 2228570 2303953 2380644 2455840 2527977 2598017 2668038
62982 2668038 2738801 2809153 2877385 2942709 3005684 3067720 3129894 3191628 3250600 3304475 3352840
62971 3352840 3397077 3438147 3474639 3503067 3520062 3524341 3516590 3497517 3466465 3422485 3366608 3302107
62959 3302107 3232082 3157530 3078529 2996712 2915433 2837544 2763996 2694855 2630818 2573195 2523011
62948 2523011 2480700 2446373 2419780 2400199 2386868 2379477 2377955 2381933 2390925 2404826 2423555 2446054
62936 2446054 2470338 2494977 2520116 2546509 2573975 2601458 2628342 2654733 2680250 2703449 2723066
62925 2723066 2739300 2753166 2764740 2772587 2774709 2769517 2756089 2734270 2704677 2668032 2624369 2573486
$$ packed form
63004A503454K3784K4316K5737K9106L3825L8184M1357M3983M6702M9291N1672
62993A911411N4630N8776O3554O8081P2118P5383P6691P5196P2137P0040P0021
62982B668038P0763P0352O8232O5324O2975O2036O2174O1734N8972N3875M8365
62971C352840M4237M1070L6492K8428J6995M279p751j9073l1052m3980n5877o4501
62959C302107p0025p4552p9001q1817q1279p7889p3548o9141o4037n7623n0184
62948B523011m2311l4327k6593j9581j3331p391j522L978Q992J3901J8729K2499
62936B446054K4284K4639K5139K6393K7466K7483K6884K6391K5517K3199J9617
62925B723066J6234J3866J1574P847K122n192j3428k1819k9593l6645m3663n0883
$$ plain form
62913 2573486 2516368 2455389 2392561 2328090 2261401 2193313 2126354 2062768 2002812 1945334 1889668
62902 1889668 1836451 1786602 1739976 1695468 1652454 1611618 1573847 1538511 1503547 1467563 1431361
62891 1431361 1396933 1365335 1336061 1308304 1282015 1257592 1235038 1213742 1192824 1171579 1149969
62880 1149969 1128952 1110028 1094076 1080710 1068949 1058341 1049081 1041147 1033807 1026158 1017955 1009841
62868 1009841 1002950 998322 996181 995393 993895 990272 984993 979694 975208 970775 965301 958757 951898 945215
62854 945215 938936 933647 929896 927133 923962 919820 915622 912313 909560 906587 903663 901785 901139 900922 900713
62839 900713 901047 902306 903968 905646 908207 912869 919242 925140 928683 930064 930837 931904 932848 933202 933568
62824 933568 934932 937258 939379 940259 939818 938469 936528 934382 932598 931199 929166 925424 920261 915114 910915
$$ packed form
62913B573486n7118o0979o2828o4471o6689o8088o6959o3586n9956n7478n5666
62902A889668n3217m9849m6626m4508m3014m0836l7771l5336l4964l5984l6202
62891A431361l4428l1598k9274k7757k6289k4423k2554k1296k0918k1245k1610
62880A149969k1017j8924j5952j3366j1761j0608r260p934p340p649q203q114
62868A009841o891m628k141p88j498l623n279n299m486m433n474o544o859o683
62854I45215o279n289l751k763l171m142m198l309k753k973k924j878o46k17k09
62839I00713L34J259J662J678K561M662O373N898L543J381P73J067R44L54L66
62824I33568J364K326K121Q80m41j349j941k146j784j399k033l742n163n147m199
$$ plain form
62809 910915 907331 903792 900463 897639 894782 890989 886351 882168 879611 878591 878135 877493 876603 875669 874734
62794 874734 873732 872772 872111 871802 871524 870911 870035 869303 868703 867453 864876 861577 859161 858392 858207 857206 855843
62777 855843 856027 858298 860521 860325 858181 856830 857811 859862 861057 861202 861258 861458 861418 861800 864451 870457 878849
62760 878849 887641 895553 902459 908761 914923 921405 928499 936152 944083 952073 960202 968915 978745 989725
62746 989725 1001206 1012713 1024873 1038915 1055106 1072329 1089480 1106709 1124862 1144287 1164779
62735 1164779 1186348 1209377 1234230 1261311 1291367 1325122 1362664 1403768 1448786 1498573 1553462
62724 1553462 1612865 1676039 1742714 1812940 1887048 1966172 2052063 2145529 2245115 2347759 2450646
62713 2450646 2552181 2651539 2747965 2840394 2927005 3004843 3070376 3120825 3154848 3171851 3171223
$$ packed form
62809I10915l584l539l329k824k857l793m638m183k557j020m56o42q90r34r35
62794H74734j002r60o61l09k78o13q76p32o00j250k577l299k416p69j85j001j363
62777H55843J84K271K223j96k144j351R81K051J195J45N6K00m0L82K651O006Q392
62760H78849Q792P912O906O302O162O482P094P653P931P990Q129Q713R830J0980
62746I89725J1481J1507J2160J4042J6191J7223J7151J7229J8153J9425K0492
62735A164779K1569K3029K4853K7081L0056L3755L7542M1104M5018M9787N4889
62724A553462N9403O3174O6675P0226P4108P9124Q5891R3466R9586J02644J02887
62713B450646J01535R9358R6426R2429Q6611P7838O5533N0449L4023J7003o28
$$ plain form
62702 3171223 3152768 3117630 3068051 3005918 2932019 2847062 2753176 2653834 2552181 2449776 2347088
62691 2347088 2244954 2145167 2049717 1959801 1875659 1797073 1723729 1655186 1590951 1530915 1475698
62680 1475698 1426276 1383065 1345394 1311867 1281152 1252386 1225130 1199404 1175878 1155642 1139436
62669 1139436 1126987 1117192 1108889 1101501 1095188 1090584 1088256 1088181 1089746 1092304 1095606 1099663 1104532 1110573
62655 1110573 1118651 1129541 1143113 1158594 1175730 1195307 1218295 1244825 1274229 1305815 1339352
62644 1339352 1375114 1413780 1456147 1502554 1552643 1605918 1662411 1722499 1786188 1852968 1922350
62633 1922350 1994075 2067566 2141389 2213443 2281529 2343617 2397802 2442350 2475911 2497618 2506941
62622 2506941 2503552 2487451 2459286 2420427 2372427 2316316 2252577 2181949 2106024 2026849 1946251
$$ packed form
62702C171223j8455l5138m9579o2133p3899q4957r3886r9342j01653j02405j02688
62691B347088j02134r9787r5450q9916q4142p8586p3344o8543o4235o0036n5217
62680A475698m9422m3211l7671l3527l0715k8766k7256k5726k3526k0236j6206
62669A139436j2449r795q303p388o313m604k328p5J565K558L302M057M869O041
62655A110573Q078J0890J3572J5481J7136J9577K2988K6530K9404L1586L3537
62644A339352L5762L8666M2367M6407N0089N3275N6493O0088O3689O6780O9382
62633A922350P1725P3491P3823P2054O8086O2088N4185M4548L3561K1707R323
62622B506941l389j6101k8165l8859m8000n6111o3739p0628p5925p9175q0598
$$ plain form
62611 1946251 1865977 1788201 1715016 1647070 1583262 1522338 1464507 1411108 1362960 1319566 1279827
62600 1279827 1242908 1208381 1176150 1146576 1120210 1096929 1075527 1054594 1033795 1014017 996327
62589 996327 981061 967850 956116 945360 935324 926180 918483 912627 908310 904683 901078 897442 894054
62576 894054 891013 888172 885422 882882 880754 879165 878084 877279 876359 874994 873186 871216 869323 867582 866065
62561 866065 865005 864805 866178 870174 877431 886964 896237 903278 908692 914912 923386 933263 943110 953029
62547 953029 964299 977490 991901 1006790 1022298 1038998 1057287 1077574 1100554 1126862 1156695
62536 1156695 1190014 1226754 1266581 1308824 1353071 1399505 1448167 1498037 1547331 1594612 1639100
62525 1639100 1679837 1715080 1742855 1761910 1771962 1773243 1766156 1751295 1729476 1701485 1667784 1628712
$$ packed form
62611A946251q0274p7776p3185o7946o3808o0924n7831n3399m8148m3394l9739
62600A279827l6919l4527l2231k9574k6366k3281k1402k0933k0799j9778j7690
62589I96327j5266j3211j1734j0756j0036r144p697n856m317l627l605l636l388
62576H94054l041k841k750k540k128j589j081q05r20j365j808j970j893j741j517
62561H66065j060k00J373L996P257R533R273P041N414O220Q474R877R847R919
62547I53029J1270J3191J4411J4889J5508J6700J8289K0287K2980K6308K9833
62536A156695L3319L6740L9827M2243M4247M6434M8662M9870M9294M7281M4488
62525A639100M0737L5243K7775J9055J0052J281p087j4861k1819k7991l3701l9072
$$ plain form
62513 1628712 1585224 1539373 1493581 1449035 1405000 1360126 1314427 1269623 1227587 1188925 1153260
62502 1153260 1120358 1090517 1063996 1040559 1019699 1001132 984982 971513 960629 951637 943583 935876
62490 935876 928480 921556 915197 909575 904955 901260 897895 894413 891244 889358 889240 890562 892875 896143
62476 896143 900346 904915 909004 912314 915402 919120 923963 930053 937678 947563 960371 975909 993079
62463 993079 1010837 1029154 1048979 1071418 1097111 1126204 1158509 1193730 1231806 1273041 1317607
62452 1317607 1364893 1413720 1463325 1513872 1565941 1619690 1674464 1728786 1780732 1828949 1873504
62441 1873504 1915136 1953376 1986123 2011716 2030901 2046095 2059308 2071794 2085162 2101279 2120873
62430 2120873 2143589 2169943 2201930 2240786 2285105 2332315 2381401 2432967 2486922 2541342 2593558
$$ packed form
62513A628712m3488m5851m5792m4546m4035m4874m5699m4804m2036l8662l5665
62502A153260l2902k9841k6521k3437k0860j8567j6150j3469j0884q992q054p707
62490I35876p396o924o359n622m620l695l365l482l169j886j18J322K313L268
62476H96143M203M569M089L310L088L718M843O090P625R885J2808J5538J7170
62463I93079J7758J8317J9825K2439K5693K9093L2305L5221L8076M1235M4566
62452A317607M7286M8827M9605N0547N2069N3749N4774N4322N1946M8217M4555
62441A873504M1632L8240L2747K5593J9185J5194J3213J2486J3368J6117J9594
62430B120873K2716K6354L1987L8856M4319M7210M9086N1566N3955N4420N2216
$$ plain form
62419 2593558 2641053 2680996 2710176 2726529 2730391 2723478 2706543 2678325 2636746 2581096 2513251 2436888
62407 2436888 2355280 2269724 2180209 2087437 1993709 1901885 1814194 1732278 1657573 1590866 1531801
62396 1531801 1479469 1433375 1393322 1358601 1327978 1300472 1275584 1252827 1231792 1212871 1197135
62385 1197135 1184968 1175388 1167434 1161868 1160495 1163553 1168587 1172481 1174235 1175075 1176102 1176764 1175911 1173386
62371 1173386 1169724 1164748 1157501 1147697 1136236 1123876 1110211 1094698 1078243 1062924 1050130 1039515
62359 1039515 1029815 1020179 1010631 1001607 993268 985169 976657 967682 959069 951750 945884 941020 936882 933637
62345 933637 931558 930895 931877 934271 937023 938975 940151 941857 945469 951470 959504 968636 977546 985358 992726
62330 992726 1001429 1012416 1024784 1037088 1048992 1061068 1073686 1087083 1102176 1120130 1140882 1162841
$$ packed form
62419B593558M7495L9943K9180J6353L862o913j6935k8218m1579n5650o7845p6363
62407B436888q1608q5556q9515r2772r3728r1824q7691q1916p4705o6707n9065
62396A531801n2332m6094m0053l4721l0623k7506k4888k2757k1035j8921j5736
62385A197135j2167r580p954n566j373L058N034L894J754Q40J027O62q53k525
62371A173386l662m976p247r804j1461j2360j3665j5513j6455j5319j2794j0615
62359A039515r700r636r548r024q339q099q512q975q613p319n866m864m138l245
62345I33637k079o63R82K394K752J952J176J706L612O001Q034R132Q910P812P368
62330I92726Q703J0987J2368J2304J1904J2076J2618J3397J5093J7954K0752K1959
$$ plain form
62318 1162841 1184425 1205469 1226862 1249176 1272045 1294851 1317748 1341813 1368104 1396727 1427096
62307 1427096 1459005 1492894 1529099 1567758 1610003 1658409 1715103 1779559 1849149 1921857 1997655
62296 1997655 2077204 2160214 2245447 2331431 2416455 2498267 2574364 2642372 2699804 2744001 2773137
62285 2773137 2787393 2788741 2779471 2761165 2734896 2701696 2662346 2616965 2565361 2508051 2446716 2383506
62273 2383506 2320038 2257273 2196055 2137219 2081160 2027894 1977685 1930982 1887389 1845379 1803682
62262 1803682 1762485 1722545 1683624 1644754 1605809 1567692 1530934 1495180 1460288 1426948 1395768
62251 1395768 1366643 1339496 1314841 1293095 1274030 1257415 1243393 1231648 1221081 1211156 1202769 1196816
62239 1196816 1192682 1189332 1187349 1188349 1192547 1198345 1204475 1211124 1218597 1226283 1233796 1242107 1252567 1265366
$$ packed form
62318A162841K1584K1044K1393K2314K2869K2806K2897K4065K6291K8623L0369
62307A427096L1909L3889L6205L8659M2245M8406N6694O4456O9590P2708P5798
62296A997655P9549Q3010Q5233Q5984Q5024Q1812P6097O8008N7432M4197K9136
62285B773137J4256J348r270j8306k6269l3200l9350m5381n1604n7310o1335o3210
62273B383506o3468o2765o1218n8836n6059n3266n0209m6703m3593m2010m1697
62262A803682m1197l9940l8921l8870l8945l8117l6758l5754l4892l3340l1180
62251A395768k9125k7147k4655k1746j9065j6615j4022j1745j0567r925q387n953
62239A196816m134l350j983J000M198N798O130O649P473P686P513Q311J0460J2799
$$ plain form
62225 1265366 1279745 1295271 1312127 1330407 1349831 1369993 1390382 1410377 1429788 1449293 1469873
62214 1469873 1491988 1515854 1542271 1572315 1605957 1641554 1677256 1712779 1749485 1788761 1830601
62203 1830601 1873972 1918412 1965013 2015638 2071390 2132102 2197112 2265979 2338437 2414182 2492869
62192 2492869 2573545 2653508 2728161 2792841 2844910 2883912 2910183 2924011 2925897 2916752 2897450 2868485
62180 2868485 2830048 2782014 2724113 2656874 2582500 2504081 2423716 2342113 2260276 2180696 2106179
62169 2106179 2037996 1975720 1918361 1865021 1815043 1768598 1726896 1690893 1659797 1631674 1605544
62158 1605544 1581833 1560684 1540983 1521776 1503783 1488569 1476670 1467280 1459470 1452911 1447560 1443475
62146 1443475 1440922 1439963 1439856 1439638 1439596 1441510 1446972 1455785 1466380 1477450 1488727 1500438 1512569 1524823
$$ packed form
62225A265366J4379J5526J6856J8280J9424K0162K0389J9995J9411J9505K0580
62214A469873K2115K3866K6417L0044L3642L5597L5702L5523L6706L9276M1840
62203A830601M3371M4440M6601N0625N5752O0712O5010O8867P2458P5745P8687
62192B492869Q0676P9963P4653O4680N2069L9002K6271J3828J886r145j9302k8965
62180B868485l8437m8034n7901o7239p4374p8419q0365q1603q1837p9580p4517
62169B106179o8183o2276n7359n3340m9978m6445m1702l6003l1096k8123k6130
62158A605544k3711k1149j9701j9207j7993j5214j1899r390p810o559n351m085
62146A443475k553r59j07k18m2J914N462Q813J0595J1070J1277J1711J2131J2254
$$ plain form
62132 1524823 1536989 1549276 1562341 1576861 1592873 1609653 1626527 1643764 1662385 1683106 1705691
62121 1705691 1729231 1752659 1774979 1795514 1814209 1831436 1847464 1862642 1878371 1897141 1920715
62110 1920715 1948606 1979257 2012638 2050595 2094501 2143784 2197249 2254518 2314845 2375383 2432317
62099 2432317 2483604 2529130 2568080 2597792 2616054 2623347 2621814 2612773 2596252 2572341 2541893 2506073
62087 2506073 2466051 2422894 2376985 2327877 2275705 2222545 2171303 2123241 2077782 2034962 1996662
62076 1996662 1964478 1937324 1912372 1888099 1865309 1845141 1827106 1809634 1791923 1774459 1757780
62065 1757780 1741513 1725065 1708846 1694082 1681443 1670553 1661092 1653656 1648951 1646709 1646171 1647239 1650265
62052 1650265 1654929 1660270 1665622 1670390 1672880 1670799 1663640 1653560 1643213 1633592 1624620 1616642 1609974
$$ packed form
62132A524823J2166J2287J3065J4520J6012J6780J6874J7237J8621K0721K2585
62121A705691K3540K3428K2320K0535J8695J7227J6028J5178J5729J8770K3574
62110A920715K7891L0651L3381L7957M3906M9283N3465N7269O0327O0538N6934
62099B432317N1287M5526L8950K9712J8262P293j533r041j6521k3911l0448l5820
62087B506073m0022m3157m5909m9108n2172n3160n1242m8062m5459m2820l8300
62076A996662l2184k7154k4952k4273k2790k0168j8035j7472j7711j7464j6679
62065A757780j6267j6448j6219j4764j2639j0890r461p436m705k242n38J068L026
62052A650265M664N341N352M768K490k081p159j0080j0347r621q972p978o668
$$ plain form
62039 1609974 1603639 1596086 1587125 1577912 1568923 1559168 1547947 1536524 1527405 1522391 1521678 1524378 1529333 1535589
62025 1535589 1542645 1550526 1559729 1571101 1585601 1603774 1625385 1649652 1675856 1703671 1733136 1764472
62013 1764472 1797659 1831960 1866237 1900258 1935375 1973178 2013541 2054673 2095219 2135666 2177484
62002 2177484 2221353 2266341 2310174 2349988 2383390 2409244 2427163 2436176 2434662 2422179 2400765 2373575
61990 2373575 2342322 2306605 2265473 2218754 2166822 2110074 2049258 1985873 1921569 1857347 1793863
61979 1793863 1732310 1674298 1620612 1570637 1523358 1478584 1436792 1398123 1362306 1329523 1300529
61968 1300529 1275446 1253028 1231776 1211545 1193342 1177594 1163216 1148590 1132954 1116572 1100013
61957 1100013 1083754 1068283 1054066 1041261 1029760 1019552 1010818 1003554 997469 992636 989996 990542 993837
$$ packed form
62039A609974o335p553q961r213q989r755j1221j1423r119n014p13K700M955O256
62025A535589P056P881R203J1372J4500J8173K1611K4267K6204K7815K9465L1336
62013A764472L3187L4301L4277L4021L5117L7803M0363M1132M0546M0447M1818
62002B177484M3869M4988M3833L9814L3402K5854J7919R013j514j2483k1414k7190
61990B373575l1253l5717m1132m6719n1932n6748o0816o3385o4304o4222o3484
61979A793863o1553n8012n3686m9975m7279m4774m1792l8669l5817l2783k8994
61968A300529k5083k2418k1252k0231j8203j5748j4378j4626j5636j6382j6559
61957A100013j6259j5471j4217j2805j1501j0208q734p264o085m833k640N46L295
$$ plain form
61944 993837 997986 1001570 1005125 1010061 1016506 1023302 1030036 1037680 1046503 1054416 1058637 1058632 1056360 1053790 1051159
61929 1051159 1047637 1042572 1035606 1026417 1015086 1002455 989620 977100 964679 951899 938623 925355
61917 925355 913162 902995 894909 888051 881511 875185 869823 866323 864779 864090 862900 861308 861235 864310
61903 864310 869566 874151 876454 877617 879622 882828 886208 889357 893112 898192 904217 910588 917883 927677
61889 927677 940841 956412 972606 988875 1006499 1027017 1050660 1076684 1104513 1133830 1164034
61878 1164034 1194763 1226727 1260782 1296045 1330140 1361716 1391642 1421155 1449986 1477076 1502102
61867 1502102 1525146 1545629 1562760 1576605 1587653 1595635 1599878 1600603 1598916 1595702 1591474 1587066 1583325
61854 1583325 1580223 1577460 1576036 1577997 1584464 1595087 1609558 1628149 1650066 1672700 1693669 1712681
$$ packed form
61944I93837M149L584L555M936O445O796O734P644Q823P913M221nk272k570k631
61929A051159l522n065o966r189j1331j2631j2835j2520j2421j2780j3276j3268
61917I25355j2193j0167q086o858o540o326n362l500j544o89j190j592p3L075
61903H64310N256M585K303J163K005L206L380L149L755N080O025O371P295R794
61889I27677J3164J5571J6194J6269J7624K0518K3643K6024K7829K9317L0204
61878A164034L0729L1964L4055L5263L4095L1576K9926K9513K8831K7090K5026
61867A502102K3044K0483J7131J3845J1048P982M243P25j687l214m228m408l741
61854A583325l102k763j424J961O467J0623J4471J8591K1917K2634K0969J9012
$$ plain form
61842 1712681 1730302 1745818 1757616 1765082 1768595 1767889 1761990 1751108 1737251 1722325 1706425 1688618
61830 1688618 1668811 1648221 1628335 1609920 1592809 1576213 1559310 1541703 1523242 1503476 1481764
61819 1481764 1458130 1433572 1409214 1385535 1362785 1341790 1323764 1309398 1298457 1290216 1284107 1280161
61807 1280161 1279076 1281536 1287101 1294116 1301302 1309279 1319991 1334727 1353300 1374943 1399141 1425489
61795 1425489 1453681 1484235 1518701 1558555 1603899 1653311 1704578 1755621 1805453 1854646 1904331
61784 1904331 1954208 2001914 2044610 2080707 2109719 2131307 2145315 2152225 2152645 2146574 2134192 2117334
61772 2117334 2099314 2082954 2069208 2057779 2048666 2043034 2042769 2048964 2060460 2074186 2087339 2098753
61760 2098753 2107659 2112036 2109554 2099855 2084419 2064122 2038270 2006400 1969689 1929959 1888436 1846169
$$ packed form
61842A712681J7621J5516J1798P466L513p06n899j0882j3857j4926j5900j7807
61830A688618j9807k0590j9886j8415j7111j6596j6903j7607j8461j9766k1712
61819A481764k3634k4558k4358k3679k2750k0995j8026j4366j0941q241o109l946
61807A280161j085K460N565P015P186P977J0712J4736J8573K1643K4198K6348
61795A425489K8192L0554L4466L9854M5344M9412N1267N1043M9832M9193M9685
61784A904331M9877M7706M2696L6097K9012K1588J4008O910M20o071j2382j6858
61772B117334j8020j6360j3746j1429r113n632k65O195J1496J3726J3153J1414
61760B098753Q906M377k482r699j5436k0297k5852l1870l6711l9730m1523m2267
$$ plain form
61748 1846169 1804525 1764118 1723974 1682815 1640902 1599804 1560764 1524120 1489981 1458509 1429442
61737 1429442 1402034 1375693 1350323 1326089 1303168 1281768 1262186 1244811 1230013 1217742 1207227
61726 1207227 1197473 1188109 1179282 1170758 1161906 1152821 1144598 1137989 1132523 1127541 1123362 1120675 1119326 1118589
61712 1118589 1118312 1119038 1121219 1124931 1130034 1136007 1141971 1147636 1153987 1162358 1173044 1185413 1198961 1213406
61698 1213406 1227981 1241585 1253707 1264518 1274033 1281659 1286434 1287230 1283090 1274102 1261796 1248040 1233716
61685 1233716 1219036 1204568 1190871 1177488 1163570 1149521 1136838 1126149 1116511 1106865 1097090 1087360
61673 1087360 1077755 1069156 1063280 1060743 1059804 1058063 1054997 1051994 1050271 1049719 1049629 1049582 1049488 1049498 1050306 1052963 1057860
61656 1057860 1063902 1069044 1071788 1072035 1070418 1067056 1061404 1053438 1044428 1036005 1028501 1020740 1011578 1001323
$$ packed form
61748A846169m1644m0407m0144m1159m1913m1098l9040l6644l4139l1472k9067
61737A429442k7408k6341k5370k4234k2921k1400j9582j7375j4798j2271j0515
61726A207227r754r364q827q524q852r085q223o609n466m982m179k687j349p37
61712A118589k77P26K181L712N103N973N964N665O351Q371J0686J2369J3548J4445
61698A213406J4575J3604J2122J0811R515P626M775P96m140q988j2306j3756j4324
61685A233716j4680j4468j3697j3383j3918j4049j2683j0689r638r646r775r730
61673A087360r605q599n876k537r39j741l066l003j723n52r0m7r4J0Q08K657M897
61656A057860O042N142K744K47j617l362n652p966r010q423p504p761r162j0255
$$ plain form
61642 1001323 991425 982910 975386 967725 959554 951683 944778 938136 930516 922007 913967 906914 899737 891610
61628 891610 883530 876895 871514 866301 861084 856160 850638 843178 834408 826802 821761 818317 815154 812306
61614 812306 810138 808182 806134 804910 805473 807353 809428 811562 814319 817451 819903 821372 822997 826180
61600 826180 831087 836443 840736 843680 846465 850282 854849 859096 863118 868272 874995 881683 886497 889392
61586 889392 891550 893692 896002 899025 903306 908410 913392 918070 922744 926741 928481 927382 924880 923095
61572 923095 922965 923867 924457 923555 920638 915959 910093 903364 895973 888611 882323 877486 873354 869038 864614
61557 864614 860821 857832 854983 851817 848744 846130 843108 838121 830707 822054 813556 805463 797281 788803
61543 788803 780137 771350 762773 755076 748184 740773 731912 722632 714517 707247 699407 691609 686531 685103
$$ packed form
61642A001323r898q515p524p661q171p871o905o642p620q509q040p053p177q127
61628H91610q080o635n381n213n217m924n522p460q770p606n041l444l163k848
61614H12306k168j956k048j224N63J880K075K134K757L132K452J469J625L183
61600H26180M907N356M293K944K785L817M567M247M022N154O723O688M814K895
61586H89392K158K142K310L023M281N104M982M678M674L997J740j099k502j785
61572I23095j30R02N90r02k917m679n866o729p391p362o288m837m132m316m424
61557H64614l793k989k849l166l073k614l022m987p414q653q498q093q182q478
61543G88803q666q787q577p697o892p411q861r280q115p270p840p798n078j428
$$ plain form
61529 685103 684717 682550 679059 676535 675483 674460 672850 671671 671501 671350 670228 668680 667985 668443 669055 668689
61513 668689 667201 665394 664047 663216 662713 662963 664614 667285 669663 671181 672730 675192 678194 681018 683750
61498 683750 686594 688908 690183 691411 694166 698552 703107 706631 709126 711142 713084 715031 716454 716460 715149
61483 715149 714215 715052 716719 717155 716221 716068 718363 722585 727380 732301 737639 743554 749865 755915 760296
61468 760296 761589 759834 756603 753371 750498 747839 745320 742657 739597 736864 735790 736519 737632 738124 738612
61453 738612 739756 740658 740082 738530 737660 737958 738285 737735 736829 736637 737612 739649 742637 746535 751268 756810
61437 756810 763040 769242 774185 777223 779325 782448 787627 793886 799354 803286 806477 809665 812281 813212
61423 813212 812412 811119 810701 811760 814087 816860 819013 820111 820872 822330 824590 827043 829618 832909 836870
$$ packed form
61529F85103l86k167l491k524j052j023j610j179j70j51j122j548o95M58O12l66
61513F68689j488j807j347q31n03K50J651K671K378J518J549K462L002K824K732
61498F83750K844K314J275J228K755M386M555L524K495K016J942J947J423Oj311
61483G15149r34Q37J667M36r34j53K295M222M795M921N338N915O311O050M381
61468G60296J293j755l231l232k873k659k519k663l060k733j074P29J113M92M88
61453G38612J144R02n76j552q70K98L27n50r06j92R75K037K988L898M733N542
61437G56810O230O202M943L038K102L123N179O259N468L932L191L188K616R31
61423H13212q00j293m18J059K327K773K153J098P61J458K260K453K575L291L961
$$ plain form
61408 836870 840308 842143 842599 842727 843140 843602 843567 842913 842258 842479 843546 844120 843032 841073 840368 841886 844544
61391 844544 847079 849624 852728 855863 858077 859623 861774 865018 868361 870619 871862 873349 876236 880454
61377 880454 884751 887939 890081 892144 894563 896749 898187 899268 900511 901616 902115 902538 903968 906545 909283
61362 909283 911540 913893 917251 921610 925977 929167 930359 929448 927344 925605 925144 925217 924194 921457 918060
61347 918060 915360 913464 911415 908492 904728 900523 896573 894086 894083 896179 898839 901075 903100 904966 905789
61332 905789 905139 904254 904675 906390 908478 910960 914453 918420 921565 924133 928136 934695 942551 949875 956457
61317 956457 963243 970612 977936 984331 989323 993326 997783 1004064 1011859 1019497 1026144 1032571 1039205 1044756
61303 1044756 1047922 1049534 1051706 1055415 1060158 1065622 1072343 1080653 1089923 1099194 1108001 1116487 1125096 1134153
$$ packed form
61408H36870L438J835M56J28M13M62l5o54o55K21J067N74j088j959p05J518K658
61391H44544K535K545L104L135K214J546K151L244L343K258J243J487K887M218
61377H80454M297L188K142K063K419K186J438J081J243J105M99M23J430K577K738
61362I09283K257K353L358M359M367L190J192r11k104j739m61P3j023k737l397
61347I18060k700j896k049k923l764m205l950k487lK096K660K236K025J866Q23
61332I05789o50q85M21J715K088K482L493L967L145K568M003O559P856P324O582
61317I56457O786P369P324O395M992M003M457O281P795P638O647O427O634N551
61303A044756L166J612K172L709M743N464O721Q310R270R271Q807Q486Q609R057
$$ plain form
61289 1134153 1143538 1153003 1162823 1173532 1184718 1194880 1203075 1209965 1216416 1221758 1224503 1224382 1222552
61276 1222552 1220037 1217064 1213928 1211397 1209885 1208882 1207438 1204890 1201234 1197276 1194172 1192128 1189774 1185683
61262 1185683 1180515 1176718 1175878 1177050 1177966 1177262 1175301 1173392 1172800 1174243 1177883 1183555 1190923 1199491 1208925
61247 1208925 1219654 1232830 1249189 1268014 1287472 1305653 1321113 1333049 1341660 1347915 1352222 1353603
61235 1353603 1350967 1344886 1337246 1329352 1321372 1313444 1306079 1299221 1292030 1284142 1276346 1269588 1264032 1259534
61221 1259534 1256219 1253990 1252143 1250279 1249207 1250270 1253993 1259882 1267201 1275287 1283282 1290251 1295761 1300060
61207 1300060 1303774 1307689 1312706 1319495 1328062 1337912 1348721 1360706 1374309 1389688 1406415 1423368
61195 1423368 1438885 1451413 1460398 1466585 1471259 1475060 1477520 1477671 1474974 1469636 1462244 1453391 1443705 1433968
$$ packed form
61289A134153R385R465R820J0709J1186J0162Q195O890O451N342K745j21j830
61276A222552k515k973l136k531j512j003j444k548l656l958l104k044k354m091
61262A185683n168l797q40J172R16p04j961j909n92J443L640N672P368Q568R434
61247A208925J0729J3176J6359J8825J9458J8181J5460J1936Q611O255M307J381
61235A353603k636o081p640p894p980p928p365o858p191p888p796o758n556m498
61221A259534l315k229j847j864j072J063L723N889P319Q086P995O969N510M299
61207A300060L714L915N017O789Q567R850J0809J1985J3603J5379J6727J6953
61195A423368J5517J2528Q985O187M674L801K460J51k697n338p392q853r686r737
$$ plain form
61181 1433968 1424885 1416638 1408776 1400736 1392525 1384759 1377887 1371510 1364851 1357940 1351826 1347368 1344249 1341703
61167 1341703 1339929 1340131 1343191 1348703 1355139 1360545 1363493 1364224 1364804 1367296 1371704 1376458 1380778 1385472 1391373
61152 1391373 1398202 1405329 1412388 1418636 1423038 1425786 1428552 1432273 1435851 1438243 1440669 1445220 1452126 1460164
61138 1460164 1469288 1481075 1496612 1515486 1536799 1559544 1581837 1601456 1617795 1632127 1645393
61127 1645393 1656780 1664856 1669021 1669390 1666367 1661101 1655382 1650225 1645087 1639074 1632267 1625157 1617345 1607700
61113 1607700 1595673 1581904 1567562 1553400 1539375 1524989 1509987 1494555 1478607 1461247 1441667
61102 1441667 1420607 1400173 1381977 1365966 1351110 1336641 1322483 1309207 1297831 1289169 1283163 1279263
61090 1279263 1277380 1277662 1279287 1280366 1279410 1276185 1270986 1263980 1255682 1247137 1238979 1230948 1222940 1215848
$$ packed form
61181A433968r083q247p862q040q211p766o872o377o659o911o114m458l119k546
61167A341703j774K02L060N512O436N406K948P31N80K492M408M754M320M694N901
61152A391373O829P127P059O248M402K748K766L721L578K392K426M551O906Q038
61138A460164R124J1787J5537J8874K1313K2745K2293J9619J6339J4332J3266
61127A645393J1387Q076M165L69l023n266n719n157n138o013o807p110p812r645
61113A607700j2027j3769j4342j4162j4025j4386j5002j5432j5948j7360j9580
61102A441667k1060k0434j8196j6011j4856j4469j4158j3276j1376q662o006l900
61090A279263j883K82J625J079r56l225n199p006q298q545q158q031q008p092
$$ plain form
61076 1215848 1210653 1207149 1204316 1201708 1199997 1200421 1204124 1211692 1222797 1236389 1251496 1267665 1284634
61063 1284634 1302160 1320447 1340298 1362396 1386708 1412730 1439897 1467601 1495258 1522629 1549860
61052 1549860 1577215 1605033 1633543 1661971 1688315 1711346 1732657 1755017 1778271 1798595 1812704
61041 1812704 1821218 1826603 1829191 1827013 1818753 1805131 1787727 1768002 1747399 1726940 1706615 1686076
61029 1686076 1665775 1646388 1627482 1608123 1588757 1571070 1555788 1541962 1528892 1517514 1509170
61018 1509170 1503931 1500905 1499547 1499866 1501760 1504870 1508973 1514035 1520018 1527003 1535419 1545836 1558500 1573180
61004 1573180 1589568 1607807 1628544 1652205 1678139 1704857 1731517 1759048 1789453 1824009 1862292
60993 1862292 1902717 1943814 1985284 2028257 2074405 2124575 2178456 2235637 2296395 2360915 2428303
$$ packed form
61076A215848n195l504k833k608j711M24L703P568J1105J3592J5107J6169J6969
61063A284634J7526J8287J9851K2098K4312K6022K7167K7704K7657K7371K7231
61052A549860K7355K7818K8510K8428K6344K3031K1311K2360K3254K0324J4109
61041A812704Q514N385K588k178q260j3622j7404j9725k0603k0459k0325k0539
61029A686076k0301j9387j8906j9359j9366j7687j5282j3826j3070j1378q344
61018A509170n239l026j358L19J894L110M103N062N983O985Q416J0417J2664J4680
61004A573180J6388J8239K0737K3661K5934K6718K6660K7531L0405L4556L8283
60993A862292M0425M1097M1470M2973M6148N0170N3881N7181O0758O4520O7388
$$ plain form
60982 2428303 2497172 2567145 2639297 2715330 2796720 2884322 2978202 3078010 3184012 3297394 3419004
60971 3419004 3548306 3684394 3827780 3980326 4143650 4318425 4504993 4703651 4914310
60962 4914310 5136641 5370464 5615331 5870098 6133998 6408197 6695592 6999457 7323052
60953 7323052 7669685 8041320 8437443 8857327 9303912 9784342 10307276 10882117 11520697
60944 11520697 12236366 13040208 13941353 14953254 16097509 17400478 18891040 20606610
60936 20606610 22597889 24919498 27611481 30684023 34097349 37719196 41281145 44401539
60928 44401539 46714523 48042130 48481260 48339308 47981634 47706214 47689053 47956577 48352734
60919 48352734 48545894 48135609 46830201 44579158 41571002 38119516 34535229 31053094
$$ packed form
60982B428303O8869O9973P2152P6033Q1390Q7602R3880R9808J06002J13382J21610
60971C419004J29302J36088J43386J52546J63324J74775J86568J98658K10659
60962D914310K22331K33823K44867K54767K63900K74199K87395L03865L23595
60953G323052L46633L71635L96123M19884M46585M80430N22934N74841O38580
60944A1520697P15669Q03842R01145J011901J144255J302969J490562J715570
60936B0606610J991279K321609K691983L072542L413326L621847L561949L120394
60928D4401539K312984J327607M39130j41952l57674k75420j7161K67524L96157
60919D8352734J93160m10285j305408k251043l008156l451486l584287l482135
$$ plain form
60911 31053094 27818347 24899919 22311919 20037452 18048191 16313498 14802139 13483974
60903 13483974 12333002 11327949 10449994 9681215 9005134 8407461 7875922 7400094 6971474
60894 6971474 6583127 6229248 5905348 5608390 5336112 5086441 4857767 4648816 4457242
60885 4457242 4278968 4109972 3948300 3793368 3644060 3499075 3358821 3225167 3099049
60876 3099049 2979717 2866585 2760163 2660516 2566317 2476513 2391813 2313466 2241381 2174474 2112134
60865 2112134 2054325 2000864 1951704 1907359 1867840 1831495 1796181 1761564 1729181 1700171 1673979
60854 1673979 1649494 1626512 1605601 1587090 1570625 1555297 1540064 1524384 1508629 1493602 1479679
60843 1479679 1466768 1454931 1444433 1435033 1425682 1415029 1401937 1385830 1367257 1348126 1330499 1314734
$$ packed form
60911C1053094l234747k918428k588000k274467j989261j734693j511359j318165
60903A3483974j150972j005053q77955p68779o76081n97673n31539m75828m28620
60894F971474l88347l53879l23900k96958k72278k49671k28674k08951j91574
60885D457242j78274j68996j61672j54932j49308j44985j40254j33654j26118
60876C099049j19332j13132j06422r9647r4199q9804q4700p8347p2085o6907o2340
60865B112134n7809n3461m9160m4345l9519l6345l5314l4617l2383k9010k6192
60854A673979k4485k2982k0911j8511j6465j5328j5233j5680j5755j5027j3923
60843A479679j2911j1837j0498r400r351j0653j3092j6107j8573j9131j7627j5765
$$ plain form
60831 1314734 1299330 1282987 1266258 1250668 1236592 1222788 1208128 1193177 1179493 1167480 1155481
60820 1155481 1141415 1125011 1107965 1092074 1077945 1065351 1053846 1042727 1031407 1020438 1011255
60809 1011255 1004267 998231 992317 987598 985204 984163 982833 981675 982524 985498 988956 992525 997778 1005202
60795 1005202 1012685 1018036 1021330 1023705 1025557 1027146 1029460 1033100 1037364 1041600 1046189 1051060 1054638 1055703
60781 1055703 1055004 1053426 1049967 1043507 1035394 1027895 1020810 1012209 1002209 993293 986608 980537 973763 967351
60767 967351 962481 957989 951791 943588 934648 925761 916818 907833 899084 890455 881665 873031 865041 857248
60753 857248 848463 838316 828025 819212 812121 805319 797244 787932 779019 772028 766977 762836 758864 755040
60739 755040 751598 748869 747402 747499 748609 749844 750973 752237 753248 753085 751721 750499 750782 752724 755762
$$ packed form
60831A314734j5404j6343j6729j5590j4076j3804j4660j4951j3684j2013j1999
60820A155481j4066j6404j7046j5891j4129j2594j1505j1119j1320j0969r183
60809A011255o988o036n914m719k394j041j330j158Q49K974L458L569N253P424
60795A005202P483N351L294K375J852J589K314L640M264M236M589M871L578J065
60781A055703o99j578l459o460q113p499p085q601j0000q916o685o071o774o412
60767I67351m870m492o198q203q940q887q943q985q749q629q790q634p990p793
60753H57248q785j0147j0291q813p091o802q075r312q913o991n051m141l972l824
60739G55040l442k729j467R7J110J235J129J264J011j63j364j222K83J942L038
$$ plain form
60724 755762 759610 764155 768788 772477 774548 775224 775451 776212 777807 779812 781891 784365 787608 791293 794855
60709 794855 798363 801983 804784 805308 803600 801601 801029 801655 802105 801568 800181 798458 796956 795921 794711
60694 794711 792126 787791 782706 778089 774470 772339 772552 775034 777828 778763 777833 776794 776576 776168 774102
60679 774102 770019 764521 758321 751911 745536 739176 732906 727285 722851 719204 715241 710538 705964 702682
60665 702682 701065 700834 701608 702835 703741 704076 704644 706345 708778 710542 711093 711608 713612 717257 721458 725360
60649 725360 728969 732540 736085 739626 743371 747389 751584 756199 761722 767859 773175 776443 778156 780091
60635 780091 783432 787759 791722 794217 795058 795007 795160 795879 796378 795783 794367 793241 793075 793812 795435 798068
60619 798068 801199 803735 805215 806354 808100 810649 813497 815778 816366 814475 810600 806238 802289 798333
$$ packed form
60724G55762L848M545M633L689K071O76K27P61J595K005K079K474L243L685L562
60709G94855L508L620K801N24j708j999n72O26M50n37j387j723j502j035j210
60694G94711k585m335n085m617l619k131K13K482K794R35r30j039k18m08k066
60679G74102m083n498o200o410o375o360o270n621m434l647l963m703m574l282
60665G02682j617k31P74J227R06L35N68J701K433J764N51N15K004L645M201L902
60649G25360L609L571L545L541L745M018M195M615N523O137N316L268J713J935
60635G80091L341M327L963K495Q41n1J53P19M99n95j416j126j66P37J623K633
60619G98068L131K536J480J139J746K549K848K281N88j891l875m362l949l956
$$ plain form
60605 798333 793716 788451 782561 775587 767691 760541 755879 753559 751950 750048 748098 746314 744293 742108
60591 742108 741002 742249 745816 750705 756200 762091 767751 771726 772734 770919 767680 764161 760274 755527
60577 755527 750413 746328 744065 742989 741884 740116 737762 735302 733605 733655 735626 738502 741080 743053 744688
60562 744688 745977 746828 747777 749595 752201 754727 756768 758834 761362 763927 765834 767044 768129 769630 771736
60547 771736 774340 777126 779794 782453 785579 789235 792554 794450 794940 795351 796982 799785 802665 804946 807118
60532 807118 810114 814301 819476 825480 832279 839514 846477 852673 858102 862916 867124 870745 873981 877094
60518 877094 880351 884106 888722 894364 901096 909121 918536 928941 939828 951397 964379 978922 994386
60505 994386 1010635 1028836 1050226 1074435 1099657 1124257 1147492 1168699 1186564 1199702 1207838 1212139
$$ packed form
60605G98333m617n265n890o974p896p150m662k320j609j902j950j784k021k185
60591G42108j106J247L567M889N495N891N660L975J008j815l239l519l887m747
60577G55527n114m085k263j076j105j768k354k460j697N0J971K876K578J973J635
60562G44688J289Q51R49J818K606K526K041K066K528K565J907J210J085J501K106
60547G71736K604K786K668K659L126L656L319J896M90M11J631K803K880K281K172
60532H07118K996M187N175O004O799P235O963O196N429M814M208L621L236L113
60518H77094L257L755M616N642O732Q025R415J0405J0887J1569J2982J4543J5464
60505I94386J6249J8201K1390K4209K5222K4600K3235K1207J7865J3138Q136M301
$$ plain form
60493 1212139 1214289 1215203 1214696 1212470 1209256 1206666 1206022 1207765 1211971 1218828 1228346 1240139 1253962 1270292
60479 1270292 1290148 1314497 1343894 1378337 1417407 1460931 1509515 1563748 1622666 1683539 1743300
60468 1743300 1799448 1849439 1890369 1920120 1938229 1945034 1940762 1926276 1903996 1876888 1846824 1814721
60456 1814721 1781901 1750264 1721399 1696450 1676538 1662245 1652828 1647148 1645452 1649165 1658772 1673036
60444 1673036 1690724 1712133 1738364 1769960 1807006 1850070 1900243 1958233 2023795 2096070 2174340
60433 2174340 2258292 2347148 2438176 2526489 2607040 2676926 2735605 2783466 2821208 2850447 2873883
60422 2873883 2894470 2914892 2937494 2963450 2991509 3018155 3039083 3049690 3044398 3017490 2966056
60411 2966056 2891640 2798387 2690441 2571858 2447752 2323582 2203214 2088684 1981702 1884069
$$ packed form
60493A212139K150R14n07k226l214k590o44J743M206O857R518J1793J3823J6330
60479A270292J9856K4349K9397L4443L9070M3524M8584N4233N8918O0873N9761
60468A743300N6148M9991M0930K9751J8109O805m272j4486k2280k7108l0064l2103
60456A814721l2820l1637k8865k4949j9912j4293r417n680j696L713R607J4264
60444A673036J7688K1409K6231L1596L7046M3064N0173N7990O5562P2275P8270
60433B174340Q3952Q8856R1028Q8313Q0551O9886N8679M7861L7742K9239K3436
60422B873883K0587K0422K2602K5956K8059K6646K0928J0607n292k6908n1434
60411B966056p4416r3253j07946j18583j24106j24170j20368j14530j06982r7633
$$ plain form
60401 1884069 1796323 1717125 1644671 1578254 1518060 1464118 1416133 1374030 1337850 1306865 1279243
60390 1279243 1253007 1227407 1203255 1181856 1163618 1147735 1133104 1119355 1106902 1096187 1087043
60379 1087043 1078769 1070594 1062017 1052863 1043369 1034293 1026586 1020442 1014687 1007720 999357 991253 984972 979989
60365 979989 974280 966708 958082 949918 943026 937522 933387 930430 928229 926696 926319 927237 928406 928460 927408
60350 927408 926844 928255 931519 935231 938113 939844 940851 941762 943135 945329 948310 951626 954744 957499 960171
60335 960171 963120 966520 970386 974613 978925 983135 987638 993254 1000087 1006796 1011608 1014168 1015876 1018280
60321 1018280 1021545 1024769 1027423 1029978 1033114 1036699 1039908 1042441 1045303 1049766 1055548 1060748 1064162 1067028
60307 1067028 1071471 1077426 1082271 1083797 1082607 1081130 1081172 1083161 1086964 1092294 1098458 1104728 1111218 1118852
$$ packed form
60401A884069q7746p9198p2454o6417o0194n3942m7985m2103l6180l0985k7622
60390A279243k6236k5600k4152k1399j8238j5883j4631j3749j2453j0715r144
60379A087043q274q175q577r154r494r076p707o144n755o967q363q104o281m983
60365I79989n709p572q626q164o892n504m135k957k201j533l77R18J169N4j052
60350I27408n64J411L264L712K882J731J007R11J373K194K981L316L118K755K672
60335I60171K949L400L866M227M312M210M503N616O833O709M812K560J708K404
60321A018280L265L224K654K555L136L585L209K533K862M463N782N200L414K866
60307A067028M443N955M845J526j190j477M2J989L803N330O164O270O490P634
$$ plain form
60293 1118852 1128301 1139397 1151636 1164649 1177911 1190412 1201135 1209796 1216906 1223114 1228523 1232487
60281 1232487 1233858 1231570 1225408 1216420 1206425 1196789 1187610 1178238 1168635 1159981 1153705 1150068 1147876 1145511
60267 1145511 1142032 1137437 1132336 1127503 1123446 1120098 1116921 1113404 1109478 1105532 1102250 1100498 1101161 1104882
60253 1104882 1111812 1121514 1133062 1145543 1158823 1173834 1191790 1212983 1236472 1260955 1285752 1310930
60241 1310930 1336691 1362703 1387700 1409572 1426090 1435858 1438682 1434923 1424501 1406667 1380965 1348614
60229 1348614 1312939 1278100 1247100 1220809 1198552 1179144 1161384 1144412 1128320 1114154 1102699
60218 1102699 1093357 1084681 1075886 1067299 1059471 1052417 1045780 1039238 1032778 1026945 1022531 1019397 1015922 1010678
60204 1010678 1004612 1000333 998862 998359 996779 994583 993594 993979 993914 992135 989346 986786 984549 982166 980098
$$ packed form
60293A118852R449J1096J2239J3013J3262J2501J0723Q661P110O208N409L964
60281A232487J371k288o162q988r995r636r179r372r603q654o276l637k192k365
60267A145511l479m595n101m833m057l348l177l517l926l946l282j752O63L721
60253A104882O930R702J1548J2481J3280J5011J7956K1193K3489K4483K4797K5178
60241A310930K5761K6012K4997K1872J6518R768K824l759j0422j7834k5702l2351
60229A348614l5675l4839l1000k6291k2257j9408j7760j6972j6092j4166j1455
60218A102699r342q676q795q587p828p054o637o542o460n833m414l134l475n244
60204A010678o066m279j471n03j580k196r89L85o5j779k789k560k237k383k068
$$ plain form
60189 980098 979732 981874 985793 989914 993141 995394 997181 999065 1001583 1005159 1009578 1013709 1016371 1017630
60175 1017630 1018721 1020498 1022591 1024532 1027071 1031518 1038010 1045284 1052228 1058879 1065673 1072494 1078934 1084969
60161 1084969 1090757 1096142 1101089 1106524 1113936 1123839 1135134 1146387 1157295 1168384 1179632 1190264
60149 1190264 1200074 1210142 1221630 1234194 1246152 1256209 1264567 1272358 1280395 1288587 1296295 1303016 1308779
60136 1308779 1313850 1318043 1320542 1320720 1319053 1316840 1315008 1313473 1311636 1309051 1305411 1300388 1294051 1287362
60122 1287362 1281785 1278045 1275396 1272434 1268767 1265650 1264637 1265719 1267234 1267637 1266888 1265926 1265412 1265401 1265699 1265903
60106 1265903 1265398 1263957 1262039 1259898 1256762 1251828 1245846 1240655 1237057 1234113 1230793 1227329 1224442 1222176
60092 1222176 1220307 1219400 1220613 1224565 1230842 1238447 1246408 1254193 1261894 1269844 1277825 1284879 1290148 1293663
$$ packed form
60189I80098l66K142L919M121L227K253J787J884K518L576M419M131K662J259
60175A017630J091J777K093J941K539M447O492P274O944O651O794O821O440O035
60161A084969N788N385M947N435P412R903J1295J1253J0908J1089J1248J0632
60149A190264R810J0068J1488J2564J1958J0057Q358P791Q037Q192P708O721N763
60136A308779N071M193K499J78j667k213j832j535j837k585l640n023o337o689
60122A287362n577l740k649k962l667l117j013J082J515M03p49r62n14j1K98K04
60106A265903n05j441j918k141l136m934n982n191l598k944l320l464k887k266
60092A222176j869r07J213L952O277P605P961P785P701P950P981P054N269L515
$$ plain form
60078 1293663 1296120 1298242 1300606 1303735 1307887 1312833 1318118 1323485 1328939 1334497 1339975 1344966 1349198 1353073
60064 1353073 1357653 1363631 1370546 1377482 1384321 1391631 1399632 1408320 1418499 1431364 1446666 1462484 1477423
60051 1477423 1491946 1506811 1521368 1534475 1546164 1557123 1567202 1575784 1583178 1590185 1596428 1600462
60039 1600462 1601653 1600803 1598800 1595811 1592109 1588532 1585539 1582618 1579191 1575385 1571354 1566480 1559925 1551581
60025 1551581 1541949 1531391 1520069 1508334 1496602 1484799 1472328 1458617 1443496 1427128 1409845
60014 1409845 1392020 1373888 1355536 1337276 1319931 1304398 1290753 1278060 1265253 1252165 1239500
60003 1239500 1227964 1217702 1208513 1200114 1192010 1183608 1174909 1166804 1160162 1154756 1149619 1144345 1139486
59990 1139486 1135681 1133047 1131465 1130868 1131067 1131847 1133372 1135832 1138590 1140435 1141043 1141459 1142703 1144633 1146642
$$ packed form
60078A293663K457K122K364L129M152M946N285N367N454N558N478M991M232L875
60064A353073M580N978O915O936O839P310Q001Q688J0179J2865J5302J5818J4939
60051A477423J4523J4865J4557J3107J1689J0959J0079Q582P394P007O243M034
60039A600462J191q50k003k989l702l577k993k921l427l806m031m874o555q344
60025A551581r632j0558j1322j1735j1732j1803j2471j3711j5121j6368j7283
60014A409845j7825j8132j8352j8260j7345j5533j3645j2693j2807j3088j2665
60003A239500j1536j0262r189q399q104q402q699q105o642n406n137n274m859
59990A139486l805k634j582n97J99P80J525K460K758J845O08M16J244J930K009
$$ plain form
59975 1146642 1148714 1150984 1152833 1153255 1151826 1148692 1144050 1138370 1132692 1127782 1123080 1117325 1110179 1102583
59961 1102583 1095544 1089231 1083234 1077084 1070391 1062878 1054443 1045126 1035347 1026361 1019850 1016360 1014571 1012758
59947 1012758 1010610 1008843 1007533 1006017 1004355 1003684 1004679 1006458 1007477 1006990 1005355 1003302 1001254 999164 996933
59932 996933 994972 994147 994956 997199 1000766 1006054 1013033 1020551 1027533 1034274 1041336 1047589 1050933 1050997 1049688
59917 1049688 1048808 1048513 1048433 1048709 1049083 1048381 1046164 1043890 1043217 1043772 1043866 1042967 1042167 1042329 1043047 1043628 1044131 1044947
59899 1044947 1046023 1047024 1047954 1049102 1050381 1050999 1050061 1047533 1044388 1041527 1038799 1035622 1032489 1031022 1032139
59884 1032139 1034833 1037354 1039086 1040574 1042021 1042758 1042341 1041451 1041382 1043006 1046488 1051562 1057568 1063429 1068194
59869 1068194 1071996 1076306 1082915 1092470 1104065 1116268 1128423 1140931 1154399 1168573 1181991 1192722
$$ packed form
59975A146642K072K270J849M22j429l134m642n680n678m910m702n755p146p596
59961A102583p039o313n997o150o693p513q435r317r779q986o511l490j789j813
59947A012758k148j767j310j516j662o71R95J779J019m87j635k053k048k090k231
59932I96933j961q25Q09K243L567N288O979P518O982O741P062O253L344O4j309
59917A049688q80k95q0K76L74p02k217k274o73N55R4q99q00J62P18N81N03Q16
59899A044947J076J001R30J148J279O18r38k528l145k861k728l177l133j467J117
59884A032139K694K521J732J488J447P37m17q90o9J624L482N074O006N861M765
59869A068194L802M310O609R555J1595J2203J2155J2508J3468J4174J3418J0731
$$ plain form
59857 1192722 1199869 1204597 1209351 1215686 1223066 1230082 1236439 1243098 1250654 1258444 1265382 1271002 1275292 1278144
59843 1278144 1279590 1280306 1281325 1283183 1285602 1287982 1290059 1292072 1294506 1297770 1302070 1307467 1313937 1321389
59829 1321389 1329763 1339050 1348932 1358447 1366525 1373120 1379440 1386638 1394613 1402445 1409617 1416203 1422223 1427533
59815 1427533 1432283 1436822 1441062 1444434 1446409 1446657 1444931 1441442 1437228 1433393 1429930 1425929 1420921 1415343
59801 1415343 1409746 1404431 1399909 1396736 1394470 1391674 1387556 1383068 1379951 1379199 1380777 1384207 1388877 1394229
59787 1394229 1400237 1407569 1417049 1429192 1444234 1461824 1480332 1497058 1509705 1517450 1520546 1519639 1515900
59774 1515900 1511078 1506712 1503573 1502086 1502421 1503398 1502083 1495747 1484285 1470023 1455256 1440653 1425892
59761 1425892 1410948 1396479 1383458 1372666 1364170 1357174 1350662 1344262 1338205 1332507 1326566 1319749 1312164
$$ packed form
59857A192722P147M728M754O335P380P016O357O659P556P790O938N620M290K852
59843A278144J446P16J019J858K419K380K077K013K434L264M300N397O470P452
59829A321389Q374R287R882R515Q078O595O320P198P975P832P172O586O020N310
59815A427533M750M539M240L372J975K48j726l489m214l835l463m001n008n578
59801A415343n597n315m522l173k266k796m118m488l117p52J578L430M670N352
59787A394229O008P332R480J2143J5042J7590J8508J6726J2647P745L096r07l739
59774A515900m822m366l139j487L35R77j315o336j1462j4262j4767j4603j4761
59761A425892j4944j4469j3021j0792q496o996o512o400o057n698n941o817p585
$$ plain form
59748 1312164 1304660 1298032 1292272 1286694 1280924 1275518 1271219 1267662 1263492 1257995 1252147 1247680 1245518 1245404
59734 1245404 1246405 1247301 1247092 1246014 1245722 1247513 1250447 1252133 1251479 1249726 1248428 1247323 1244953 1240864 1236244
59719 1236244 1232407 1229467 1226794 1224212 1222254 1221379 1221413 1221749 1221838 1221467 1220914 1220934 1222240 1224829 1228115 1231886
59703 1231886 1236714 1243070 1250486 1258104 1265778 1273996 1282896 1292049 1301227 1310817 1321472 1333844 1348455
59690 1348455 1364956 1381474 1395637 1406682 1415789 1424088 1431172 1436200 1439580 1442635 1446028 1449509 1452942
59677 1452942 1456611 1460301 1462902 1463439 1462196 1460414 1459002 1457834 1456380 1454693 1453328 1452201 1450128 1446029
59663 1446029 1440341 1434550 1429409 1424336 1418722 1413047 1408338 1405069 1403074 1402164 1402296 1403384 1405301 1408061
59649 1408061 1411842 1416932 1423640 1431994 1441587 1452049 1463563 1476377 1489902 1503004 1515285 1527408
$$ packed form
59748A312164p504o628n760n578n770n406m299l557m170n497n848m467k162j14
59734A245404J001Q96k09j078k92J791K934J686o54j753j298j105k370m089m620
59719A236244l837k940k673k582j958q75L4L36Q9l71n53K0J306K589L286L771
59703A231886M828O356P416P618P674Q218Q900R153R178R590J0655J2372J4611
59690A348455J6501J6518J4163J1045R107Q299P084N028L380L055L393L481L433
59677A452942L669L690K601N37j243j782j412j168j454j687j365j127k073m099
59663A446029n688n791n141n073n614n675m709l269j995r10J32J088J917K760
59649A408061L781N090O708Q354R593J0462J1514J2814J3525J3102J2281J2123
$$ plain form
59637 1527408 1540062 1553258 1566758 1580375 1593579 1605653 1616529 1626636 1635532 1641654 1644053 1643612
59625 1643612 1641938 1639864 1637583 1635301 1632810 1629149 1623627 1616692 1609033 1600517 1590933 1581054 1571854 1563263
59611 1563263 1554817 1547026 1540804 1535975 1531792 1528645 1527672 1528563 1529404 1529202 1529275 1531385 1535659 1541155 1547603
59596 1547603 1555512 1565040 1575705 1587160 1599425 1612106 1623712 1632088 1635663 1634314 1628992 1620519 1608962
59583 1608962 1594210 1576690 1557125 1535925 1513328 1489925 1466519 1443638 1421677 1401418 1383713
59572 1383713 1368602 1355107 1342005 1328594 1314960 1301827 1289959 1279281 1268829 1257842 1246423
59561 1246423 1234608 1221506 1206451 1190594 1176169 1164117 1153461 1143052 1132859 1123427 1115209 1108748
59549 1108748 1104432 1101571 1098733 1095578 1093352 1092854 1092985 1092422 1091825 1092858 1095325 1096830 1095579 1092372 1089352
$$ packed form
59637A527408J2654J3196J3500J3617J3204J2074J0876J0107Q896O122K399m41
59625A643612j674k074k281k282k491l661n522o935p659q516r584r879r200q591
59611A563263q446p791o222m829m183l147r73Q91Q41k02P3K110M274N496O448
59596A547603P909R528J0665J1455J2265J2681J1606Q376L575j349n322q473j1557
59583A608962j4752j7520j9565k1200k2597k3403k3406k2881k1961k0259j7705
59572A383713j5111j3495j3102j3411j3634j3133j1868j0678j0452j0987j1419
59561A246423j1815j3102j5055j5857j4425j2052j0656j0409j0193r432q218o461
59549A108748m316k861k838l155k226m98J31n63n97J033K467J505j251l207l020
$$ plain form
59534 1089352 1087777 1087590 1088267 1089056 1088860 1087032 1084440 1082852 1082910 1083324 1082531 1080594 1078838 1077955 1077259 1075743
59518 1075743 1073078 1069390 1064815 1059791 1055315 1052268 1050553 1049259 1047602 1045390 1042695 1039496 1035853 1032291
59504 1032291 1029682 1028438 1027910 1027103 1026226 1026872 1029970 1034097 1036942 1038302 1040289 1044407 1049706 1054534 1058926
59489 1058926 1064249 1071208 1079219 1087348 1095083 1102577 1110827 1121225 1134285 1149188 1165151 1182751 1203277
59476 1203277 1227286 1254172 1282132 1307592 1325806 1333831 1332973 1327314 1320108 1312519 1305115 1298675 1293327
59463 1293327 1288479 1284194 1281509 1280767 1280559 1279038 1275767 1271684 1267466 1262353 1254680 1243667 1230677 1218222
59449 1218222 1207422 1197040 1185483 1172975 1161019 1150548 1141661 1134487 1128941 1124079 1119100 1114703
59437 1114703 1112122 1111157 1110706 1110958 1113230 1117475 1121748 1124603 1126468 1128251 1130247 1132999 1137631 1144383 1152073
$$ packed form
59534A089352j575j87O77P89j96j828k592j588N8M14p93j937j756q83o96j516
59518A075743k665l688m575n024m476l047j715j294j657k212k695l199l643l562
59504A032291k609j244n28q07q77O46L098M127K845J360J987M118N299M828M392
59489A058926N323O959Q011Q129P735P494Q250J0398J3060J4903J5963J7600K0526
59476A203277K4009K6886K7960K5460J8214Q025q58n659p206p589p404o440n348
59463A293327m848m285k685p42k08j521l271m083m218n113p673j1013j2990j2455
59449A218222j0800j0382j1557j2508j1956j0471q887p174n546m862m979m397
59437A114703k581r65m51K52K272M245M273K855J865J783J996K752M632O752P690
$$ plain form
59422 1152073 1159770 1167801 1176422 1184822 1192274 1198953 1204768 1208759 1210840 1212784 1216164 1220267 1223367 1225036
59408 1225036 1225778 1225329 1223109 1219900 1217413 1216401 1216563 1218108 1221838 1227640 1234265 1240902 1247830 1255216 1262451
59393 1262451 1269157 1275931 1283408 1291222 1298537 1305260 1312130 1319588 1326927 1332709 1335964 1336786 1335627 1332403
59379 1332403 1326965 1320462 1315191 1312386 1310697 1307696 1302674 1297310 1293793 1292992 1294423 1297293 1301298 1306752
59365 1306752 1314086 1323198 1333483 1344761 1357906 1374124 1393667 1415621 1438919 1463228 1488873 1516278
59353 1516278 1545754 1577798 1613238 1652224 1692339 1727940 1752521 1762622 1759632 1748159 1733334
59342 1733334 1719404 1709333 1704628 1705890 1713827 1728763 1748338 1766632 1776933 1775455 1762146 1739064
59330 1739064 1709550 1678411 1650533 1628161 1610312 1595371 1583442 1575525 1571303 1568849 1566278 1562927
$$ packed form
59422A152073P697Q031Q621Q400P452O679N815L991K081J944L380M103L100J669
59408A225036P42m49k220l209k487j012J62J545L730N802O625O637O928P386P235
59393A262451O706O774P477P814P315O723O870P458P339N782L255Q22j159l224
59379A332403n438o503n271k805j689l001n022n364l517q01J431K870M005N454
59365A306752P334R112J0285J1278J3145J6218J9543K1954K3298K4309K5645K7405
59353A516278K9476L2044L5440L8986M0115L5601K4581J0101k990j1473j4825
59342A733334j3930j0071m705J262P937J4936J9575J8294J0301j478j3309k3082
59330A739064k9514l1139k7878k2372j7849j4941j1929p917m222k454k571l351
$$ plain form
59318 1562927 1558976 1554786 1550847 1547837 1546199 1545743 1545896 1546308 1547103 1548574 1550802 1553490 1556108 1558362 1560736
59303 1560736 1564349 1569871 1576739 1583987 1591732 1601086 1612461 1624916 1637594 1650801 1664903 1679148
59291 1679148 1692806 1706863 1723200 1742393 1763545 1785992 1809649 1833804 1857214 1879758 1902426
59280 1902426 1925220 1946469 1964780 1980155 1992361 1999715 2000734 1995985 1987161 1975233 1960629 1944233
59268 1944233 1926737 1907487 1885367 1860585 1834550 1808191 1781395 1753964 1726254 1698916 1672645
59257 1672645 1647957 1624694 1602059 1579615 1557763 1536798 1516284 1496022 1476712 1458763 1441470
59246 1441470 1424619 1409939 1399311 1392140 1386291 1381352 1378971 1379866 1382599 1386117 1391813 1401886 1416755
59233 1416755 1435271 1456560 1480105 1503936 1523914 1535609 1537051 1529634 1516447 1499857 1480899 1460681
$$ packed form
59318A562927l951m190l939l010j638m56J53M12P95J471K228K688K618K254K374
59303A560736L613N522O868P248P745R354J1375J2455J2678J3207J4102J4245
59291A679148J3658J4057J6337J9193K1152K2447K3657K4155K3410K2544K2668
59280A902426K2794K1249J8311J5375J2206P354J019m749q824j1928j4604j6396
59268A944233j7496j9250k2120k4782k6035k6359k6796k7431k7710k7338k6271
59257A672645k4688k3263k2635k2444k1852k0965k0514k0262j9310j7949j7293
59246A441470j6851j4680j0628p171n849m939k381Q95K733L518N696J0073J4869
59233A416755J8516K1289K3545K3831J9978J1695J442p417j3187j6590j8958k0218
$$ plain form
59221 1460681 1441368 1425215 1413198 1405397 1402174 1403958 1410081 1418876 1429077 1440387 1452756 1465966
59209 1465966 1479975 1494954 1510890 1527687 1545339 1563110 1578911 1590850 1599422 1606852 1613925 1618896
59197 1618896 1620038 1617876 1614023 1609068 1602853 1595960 1589469 1583607 1577931 1572713 1568936 1566756 1565024 1562829
59183 1562829 1560833 1560509 1562383 1565461 1568276 1570260 1572038 1574519 1577807 1581039 1583203 1583890 1583285 1581730 1579370
59168 1579370 1575837 1570058 1560793 1547833 1532461 1516411 1500585 1485185 1470668 1457628 1445698 1433656
59156 1433656 1421150 1409578 1400402 1393141 1386093 1378860 1372953 1369586 1367922 1366150 1363537 1360742 1358710
59143 1358710 1358202 1360002 1364573 1371420 1379423 1387670 1395455 1401945 1406906 1411666 1418248 1427276 1437547 1447731
59129 1447731 1457584 1467321 1476922 1486511 1496441 1506433 1515462 1523009 1529476 1534785 1537613 1536900 1533196 1527470
$$ packed form
59221A460681j9313j6153j2017p801l223J784O123Q795J0201J1310J2369J3210
59209A465966J4009J4979J5936J6797J7652J7771J5801J1939Q572P430P073M971
59197A618896J142k162l853m955o215o893o491n862n676n218l777k180j732k195
59183A562829j996l24J874L078K815J984J778K481L288L232K164O87o05j555k360
59168A579370l533n779r265j2960j5372j6050j5826j5400j4517j3040j1930j2042
59156A433656j2506j1572r176p261p048p233n907l367j664j772k613k795k032
59143A358710n08J800M571O847Q003Q247P785O490M961M760O582R028J0271J0184
59129A447731R853R737R601R589R930R992R029P547O467N309K828p13l704n726
$$ plain form
59115 1527470 1519465 1508645 1496235 1484675 1474879 1465293 1454021 1440956 1427538 1415292 1405141 1397451
59103 1397451 1391931 1387472 1382587 1376251 1368392 1359554 1350120 1340009 1329276 1318758 1309586 1301931 1294587
59090 1294587 1285921 1275026 1262221 1248977 1237217 1227823 1219728 1211234 1202173 1193775 1186374 1178803 1170647
59077 1170647 1163556 1159082 1156274 1152872 1148322 1144292 1142495 1143174 1145650 1149362 1154262 1160780 1169364 1179641
59063 1179641 1190395 1200849 1211593 1223859 1238352 1255154 1273960 1293834 1313548 1332856 1352654
59052 1352654 1373263 1393564 1412644 1431042 1449164 1465665 1479008 1489689 1499088 1506850 1511407 1512784
59040 1512784 1512791 1512347 1510497 1506459 1500973 1495100 1489019 1482647 1476367 1470584 1465297 1460387 1455667 1450588 1444692
59025 1444692 1438324 1432058 1425560 1417892 1408756 1398467 1387018 1374377 1361443 1349404 1338178 1326712
$$ packed form
59115A527470q005j0820j2410j1560r796r586j1272j3065j3418j2246j0151p690
59103A397451n520m459m885o336p859q838r434j0111j0733j0518r172p655p344
59090A294587q666j0895j2805j3244j1760r394q095q494r061q398p401p571q156
59077A170647p091m474k808l402m550m030j797O79K476L712M900O518Q584J0277
59063A179641J0754J0454J0744J2266J4493J6802J8806J9874J9714J9308J9798
59052A352654K0609K0301J9080J8398J8122J6501J3343J0681R399P762M557J377
59040A512784Pm44j850m038n486n873o081o372o280n783n287m910m720n079n896
59025A444692o368o266o498p668r136j0289j1449j2641j2934j2039j1226j1466
$$ plain form
59013 1326712 1314805 1303375 1293048 1283858 1276229 1270640 1266104 1260536 1253124 1245127 1238041 1232155 1227088
59000 1227088 1222385 1217277 1211173 1204780 1199475 1195358 1191261 1186964 1183794 1182485 1181983 1181075 1179912 1179210 1179179
58985 1179179 1179934 1181805 1184542 1187312 1190031 1193486 1197576 1200761 1202035 1202232 1202628 1203512 1204973 1207697 1211886
58970 1211886 1216567 1221253 1227338 1236549 1248696 1262159 1276138 1291364 1308796 1328346 1348591 1367434
58958 1367434 1383591 1397729 1411291 1423924 1433261 1437801 1438785 1438357 1437035 1434156 1429864 1425320 1421483
58945 1421483 1418801 1417780 1418878 1421966 1426480 1431833 1437347 1442256 1446208 1449259 1451255 1451901 1451476 1450414
58931 1450414 1448104 1443520 1437327 1431662 1427203 1422305 1416064 1410327 1407089 1405656 1404414 1404040 1406538 1411858
58917 1411858 1417972 1424222 1432271 1443324 1456218 1469007 1481178 1493713 1507784 1523809 1541093 1558034
$$ packed form
59013A326712j1907j1430j0327r190p629n589m536n568p412p997p086n886n067
59000A227088m703n108o104o393n305m117m097m297l170j309n02r08j163p02l1
58985A179179P55J871K737K770K719L455M090L185J274J97L96Q84J461K724M189
58970A211886M681M686O085R211J2147J3463J3979J5226J7432J9550K0245J8843
58958A367434J6157J4138J3562J2633R337M540R84m28j322k879m292m544l837
58945A421483k682j021J098L088M514N353N514M909L952L051J996O46m25j062
58931A450414k310m584o193n665m459m898o241n737l238j433j242l74K498N320
58917A411858O114O250Q049J1053J2894J2789J2171J2535J4071J6025J7284J6941
$$ plain form
58905 1558034 1573146 1586047 1597240 1607277 1616508 1625105 1632485 1637071 1637446 1633567 1626349 1616476 1604346
58892 1604346 1590589 1575696 1559430 1541505 1522572 1503746 1485483 1467732 1450795 1435083 1420416
58881 1420416 1406620 1394651 1386016 1381065 1378719 1377841 1378002 1378916 1380041 1380964 1381575 1381772 1381497 1381000 1380483 1379532
58865 1379532 1377429 1374033 1369910 1365727 1361854 1358321 1354804 1351004 1347463 1345499 1345821 1347644 1349805 1352233
58851 1352233 1355595 1359953 1364751 1369957 1376361 1384770 1395526 1408655 1423817 1440211 1457055 1474145
58839 1474145 1491673 1509796 1528683 1548419 1568419 1587552 1605502 1623398 1642382 1662190 1682011
58828 1682011 1702122 1723535 1746375 1769709 1792869 1815797 1838007 1858159 1874930 1887757 1896652
58817 1896652 1901887 1904041 1903989 1902745 1901324 1900357 1899499 1897633 1894075 1889174 1883423 1876563 1868124 1858251 1847353
$$ packed form
58905A558034J5112J2901J1193J0037R231Q597P380M586L75l879p218r873j2130
58892A604346j3757j4893j6266j7925j8933j8826j8263j7751j6937j5712j4667
58881A420416j3796j1969q635m951k346q78J61R14J125R23O11J97k75m97n17r51
58865A379532k103l396m123m183l873l533l517l800l541j964L22J823K161K428
58851A352233L362M358M798N206O404Q409J0756J3129J5162J6394J6844J7090
58839A474145J7528J8123J8887J9736K0000J9133J7950J7896J8984J9808J9821
58828A682011K0111K1413K2840K3334K3160K2928K2210K0152J6771J2827Q895
58817A896652N235K154n2j244j421r67q58j866l558m901n751o860q439r873j0898
$$ plain form
58802 1847353 1835390 1822140 1807726 1792241 1775283 1756387 1735537 1712934 1688932 1664640 1641660
58791 1641660 1620545 1600344 1580311 1561002 1542794 1524598 1505489 1486653 1469991 1455216 1440006
58780 1440006 1422951 1405033 1388246 1373862 1361969 1351542 1340978 1329484 1317899 1307518 1298619
58769 1298619 1290948 1284914 1280928 1278116 1275201 1272436 1271170 1271649 1272715 1273673 1274963 1276842 1278841 1280822
58755 1280822 1283220 1285862 1287733 1288485 1289240 1291336 1294911 1298967 1302155 1303456 1302948 1301934 1301393 1300218 1296079
58740 1296079 1288312 1279020 1270845 1264484 1258841 1252859 1246540 1240514 1235165 1230317 1225809 1222380 1221489 1223824
58726 1223824 1228364 1233539 1238993 1245598 1254126 1264700 1277245 1291450 1306252 1320088 1331861 1341308
58714 1341308 1348648 1354292 1358532 1360926 1360341 1356096 1348697 1339040 1327683 1315513 1304175 1294648 1286011
$$ packed form
58802A847353j1963j3250j4414j5485j6958j8896k0850k2603k4002k4292k2980
58791A641660k1115k0201k0033j9309j8208j8196j9109j8836j6662j4775j5210
58780A440006j7055j7918j6787j4384j1893j0427j0564j1494j1585j0381q899
58769A298619p671o034l986k812k915k765j266M79J066R58J290J879J999J981
58755A280822K398K642J871P52P55K096L575M056L188J301n08j014n41j175m139
58740A296079p767r292q175o361n643n982o319o026n349m848m508l429q91K335
58726A223824M540N175N454O605Q528J0574J2545J4205J4802J3836J1773R447
58714A341308P340N644M240K394n85m245p399r657j1357j2170j1338r527q637
$$ plain form
58701 1286011 1276721 1266565 1256359 1246449 1236882 1228554 1222623 1218896 1216004 1213150 1210649 1209014 1208446 1208942
58687 1208942 1209958 1210438 1210175 1210555 1212892 1216804 1221533 1227901 1237181 1248668 1260302 1271336 1282540 1294141
58673 1294141 1305582 1317110 1329426 1341621 1351530 1358507 1364040 1369394 1374455 1379160 1384054 1388974 1393057
58660 1393057 1396679 1401530 1408146 1415168 1421822 1429290 1438557 1448401 1456619 1462025 1464427 1463818 1460459 1454688
58646 1454688 1445965 1433244 1416853 1398609 1379377 1357927 1333154 1306131 1278993 1252983 1228591
58635 1228591 1206346 1186196 1166982 1147836 1129479 1113032 1098078 1083081 1067564 1052978 1041315
58624 1041315 1033193 1027223 1021117 1013654 1005569 998361 992705 988639 986600 987004 989056 991443 994246 998843
58610 998843 1005789 1014028 1022351 1030328 1037731 1044602 1052184 1062209 1074616 1087137 1097498 1104775 1108390
$$ packed form
58701A286011r290j0156j0206r910r567q328n931l727k892k854k501j635n68M96
58687A208942J016M80k63L80K337L912M729O368R280J1487J1634J1034J1204J1601
58673A294141J1441J1528J2316J2195R909O977N533N354N061M705M894M920M083
58660A393057L622M851O616P022O654P468R267R844Q218N406K402o09l359n771
58646A454688q723j2721j6391j8244j9232k1450k4773k7023k7138k6010k4392
58635A228591k2245k0150j9214j9146j8357j6447j4954j4997j5517j4586j1663
58624A041315q122n970o106p463q085p208n656m066k039M04K052K387K803M597
58610I98843O946Q239Q323P977P403O871P582J0025J2407J2521J0361P277L615
$$ plain form
58597 1108390 1107522 1102316 1094409 1085451 1076040 1066458 1057176 1048150 1038818 1029280 1020405 1012470 1005001 998109
58583 998109 992424 987454 981795 975538 970666 968339 967464 966712 966144 965956 965506 964819 965317 967617 970070 970895
58567 970895 970422 969738 968388 965089 959912 954304 949581 946535 945750 947140 949783 953014 956980 961483 965473
58552 965473 968690 972557 978254 984908 990984 996562 1002837 1010013 1017046 1023129 1028391 1033453 1038983 1045277
58538 1045277 1051616 1056630 1059869 1062403 1065479 1069441 1074407 1080945 1089323 1098939 1109037 1119228 1129059
58525 1129059 1138328 1148274 1161036 1177242 1195411 1214295 1234226 1255232 1275452 1292755 1306853 1318908
58513 1318908 1330246 1342333 1356524 1372642 1389104 1405615 1424410 1447592 1474585 1503580 1534177
58502 1534177 1567005 1601779 1637315 1672652 1706748 1737856 1764623 1787092 1805454 1818628 1825359
$$ packed form
58597A108390q68n206p907q958r411r582r282r026r332r538q875p935p469o892
58583I98109n685m970n659o257m872k327q75p52n68j88m50o87M98K300K453Q25
58567I70895m73o84j350l299n177n608m723l046p85J390K643L231L966M503L990
58552I65473L217L867N697O654O076N578O275P176P033O083N262N062N530O294
58538A045277O339N014L239K534L076L962M966O538Q378R616J0098J0191R831
58525A129059R269R946J2762J6206J8169J8884J9931K1006K0220J7303J4098J2055
58513A318908J1338J2087J4191J6118J6462J6511J8795K3182K6993K8995L0597
58502A534177L2828L4774L5536L5337L4096L1108K6767K2469J8362J3174O731
$$ plain form
58491 1825359 1826005 1822009 1814244 1802972 1788810 1772689 1755382 1737713 1720403 1702983 1683872 1662238
58479 1662238 1638838 1614464 1588946 1562362 1535645 1509048 1481642 1453515 1426865 1403566 1383057
58468 1383057 1363877 1345756 1328898 1312915 1298064 1285879 1276843 1268928 1260334 1252205 1246612 1243105
58456 1243105 1239456 1234823 1230013 1225333 1220259 1214896 1210079 1206314 1203721 1202287 1201190 1198991 1195695 1193403
58442 1193403 1193676 1195538 1197322 1198908 1200782 1202662 1204657 1208049 1213110 1218028 1221851 1226404 1233116 1240269
58428 1240269 1246217 1253133 1264141 1278483 1293202 1308315 1326314 1347276 1368502 1388965 1410390 1433551
58416 1433551 1456842 1478935 1499768 1518267 1532030 1540142 1543908 1544234 1540585 1533051 1523110 1511912 1500035
58403 1500035 1489181 1481479 1476463 1471345 1465309 1461261 1462137 1467525 1475131 1483780 1493564 1504411 1515938
$$ packed form
58491A825359O46l996p765j1272j4162j6121j7307j7669j7310j7420j9111k1634
58479A662238k3400k4374k5518k6584k6717k6597k7406k8127k6650k3299k0509
58468A383057j9180j8121j6858j5983j4851j2185r036p915q594q129n593l507
58456A243105l649m633m810m680n074n363m817l765k593j434j097k199l296k292
58442A193403K73J862J784J586J874J880J995L392N061M918L823M553O712P153
58428A240269N948O916J1008J4342J4719J5113J7999K0962K1226K0463K1425K3161
58416A433551K3291K2093K0833J8499J3763Q112L766L26l649p534r941j1198j1877
58403A500035j0854p702n016n118o036m048Q76N388P606Q649R784J0847J1527
$$ plain form
58390 1515938 1527829 1539348 1548972 1555206 1557405 1555682 1550575 1542817 1532940 1521478 1510052 1501208 1495958
58377 1495958 1492330 1487858 1482806 1479219 1477640 1476918 1476932 1479129 1484038 1490288 1496702 1503901 1513180 1524893
58363 1524893 1538287 1552046 1564749 1575526 1584322 1591095 1595285 1596607 1595640 1592874 1588064 1581223 1573188
58350 1573188 1564374 1554344 1543600 1534219 1527374 1521880 1516664 1512916 1512028 1513201 1515132 1518309 1523471 1529574
58336 1529574 1535665 1542955 1552340 1561629 1568267 1573288 1579450 1586817 1593527 1599632 1606591 1613848 1619624 1624472
58322 1624472 1630519 1637582 1643666 1649128 1656852 1668265 1682353 1698552 1717392 1738123 1758778 1778756
58310 1778756 1798718 1818164 1835939 1852851 1870806 1889708 1908154 1926592 1946543 1967200 1986286
58299 1986286 2003899 2021905 2039895 2055583 2069188 2083524 2099491 2115180 2129623 2143752 2157425
$$ packed form
58390A515938J1891J1519R624O234K199j723n107p758r877j1462j1426q844n250
58377A495958l628m472n052l587j579p22J4K197M909O250O414P199R279J1713
58363A524893J3394J3759J2703J0777Q796O773M190J322r67k766m810o841q035
58350A573188q814j0030j0744r381o845n494n216l748q88J173J931L177N162O103
58336A529574O091P290R385R289O638N021O162P367O710O105O959P257N776M848
58322A624472O047P063O084N462P724J1413J4088J6199J8840K0731K0655J9978
58310A778756J9962J9446J7775J6912J7955J8902J8446J8438J9951K0657J9086
58299A986286J7613J8006J7990J5688J3605J4336J5967J5689J4443J4129J3673
$$ plain form
58288 2157425 2169381 2180640 2194103 2210108 2225929 2240334 2255183 2272079 2290940 2312235 2336850
58277 2336850 2363176 2388154 2411903 2437603 2466257 2495471 2524170 2554372 2587047 2620030 2651385
58266 2651385 2681382 2709945 2735579 2758132 2779577 2801148 2822673 2845076 2869905 2895892 2919845
58255 2919845 2941757 2965233 2992132 3020699 3049770 3080586 3113305 3145900 3178055 3212400 3250449
58244 3250449 3290772 3332229 3375329 3419350 3461955 3502911 3544599 3587886 3631158 3674306 3719866
58233 3719866 3769253 3821481 3876201 3934214 3994615 4055490 4117767 4184124 4254044 4324514 4395459
58222 4395459 4469286 4545179 4619805 4694110 4773118 4858030 4944784 5031758 5122634 5219946 5322013
58211 5322013 5428063 5540254 5658632 5780026 5903807 6032825 6167104 6303107 6441044
$$ packed form
58288B157425J1956J1259J3463J6005J5821J4405J4849J6896J8861K1295K4615
58277B336850K6326K4978K3749K5700K8654K9214K8699L0202L2675L2983L1355
58266B651385K9997K8563K5634K2553K1445K1571K1525K2403K4829K5987K3953
58255B919845K1912K3476K6899K8567K9071L0816L2719L2595L2155L4345L8049
58244C250449M0323M1457M3100M4021M2605M0956M1688M3287M3272M3148M5560
58233C719866M9387N2228N4720N8013O0401O0875O2277O6357O9920P0470P0945
58222D395459P3827P5893P4626P4305P9008Q4912Q6754Q6974R0876R7312J02067
58211E322013J06050J12191J18378J21394J23781J29018J34279J36003J37937
$$ plain form
58202 6441044 6586302 6741609 6904409 7073871 7253261 7442967 7638308 7836895 8041243
58193 8041243 8251854 8465283 8681644 8906314 9141386 9383290 9631837 9893461 10172234
58184 10172234 10465852 10773769 11100918 11450130 11819822 12212940 12639304 13105270 13610130
58175 13610130 14156097 14751840 15402404 16106625 16869402 17705585 18626316 19631961 20722968
58166 20722968 21905301 23179030 24533906 25963562 27473326 29068903 30750647 32525401
58158 32525401 34409991 36415857 38544653 40806162 43224480 45818048 48590255 51548892
58150 51548892 54716887 58113409 61743541 65619606 69776231 74256294 79106647 84402872
58142 84402872 90256119 96780827 104078268 112263737 121481274 131880455 143620088 156921862
$$ packed form
58202F441044J45258J55307J62800J69462J79390J89706J95341J98587K04348
58193H041243K10611K13429K16361K24670K35072K41904K48547K61624K78773
58184A0172234K93618L07917L27149L49212L69692L93118M26364M65966N04860
58175A3610130N45967N95743O50564P04221P62777Q36183R20731J005645J091007
58166B0722968J182333J273729J354876J429656J509764J595577J681744J774754
58158C2525401J884590K005866K128796K261509K418318K593568K772207K958637
58150E1548892L167995L396522L630132L876065M156625M480063M850353N296225
58142H4402872N853247O524708P297441Q185469R217537J0399181J1739633J3301774
$$ plain form
58134 156921862 172091030 189473609 209441677 232423816 258848810 288986673 322868095
58127 322868095 360237890 400104122 439789370 474419081 498026166 506071533 497583519
58120 497583519 475305885 444042467 408689819 373072769 339621688 309489769 282882378
58113 282882378 259461535 238636750 219697733 201953749 184954270 168621062 153148854
58106 153148854 138789288 125715042 113995496 103604688 94439901 86367663 79262479
58099 79262479 73001586 67451666 62490477 58033509 54023255 50405268 47130579 44166375
58091 44166375 41483647 39042013 36801103 34737222 32834827 31071264 29423894 27883607
58083 27883607 26447542 25105265 23843605 22657600 21545038 20496925 19504177 18567577
$$ packed form
58134A56921862J5169168J7382579J9968068K2982139K6424994L0137863L3881422
58127C22868095L7369795L9866232L9685248L4629711K3607085Q045367q488014
58120D97583519k2277634l1263418l5352648l5617050l3451081l0131919k6607391
58113B82882378k3420843k0824785j8939017j7743984j6999479j6333208j5472208
58106A53148854j4359566j3074246j1719546j0390808r164787q072238p105184
58099G9262479o260893n549920m961189m456968m010254l617987l274689k964204
58091D4166375k682728k441634k240910k063881j902395j763563j647370j540287
58083B7883607j436065j342277j261660j186005j112562j048113r92748r36600
$$ plain form
58075 18567577 17691191 16871802 16103458 15385133 14714073 14077942 13463683 12869572 12300421
58066 12300421 11756620 11236293 10742512 10279142 9843629 9431707 9044832 8685603 8350433
58057 8350433 8033994 7736373 7458683 7196348 6944332 6704661 6481298 6271484 6069580
58048 6069580 5875727 5693204 5520356 5352499 5189318 5033621 4885045 4741311 4603482
58039 4603482 4474027 4351708 4233736 4120654 4013852 3910855 3808520 3708483 3614219 3525077
58029 3525077 3438420 3355203 3278083 3206061 3136169 3068553 3004986 2944204 2883439 2822699 2763020
58018 2763020 2702565 2639188 2575073 2514235 2456995 2401031 2345891 2292227 2238695 2184222 2131484
58007 2131484 2083625 2039111 1994221 1948992 1906258 1866342 1827260 1789031 1753470 1720504 1688451
$$ packed form
58075A8567577q76386q19389p68344p18325o71060o36131o14259n94111n69151
58066A2300421n43801n20327m93781m63370m35513m11922l86875l59229l35170
58057H350433l16439k97621k77690k62335k52016k39671k23363k09814k01904
58048F069580j93853j82523j72848j67857j63181j55697j48576j43734j37829
58039D603482j29455j22319j17972j13082j06802j02997j02335j00037r4264q9142
58029C525077q6657q3217p7120p2022o9892o7616o3567o0782o0765o0740n9679
58018B763020o0455o3377o4115o0838n7240n5964n5140n3664n3532n4473n2738
58007B131484m7859m4514m4890m5229m2734l9916l9082l8229l5561l2966l2053
$$ plain form
57996 1688451 1656959 1626289 1595193 1563031 1532310 1505406 1480517 1454845 1429915 1409312 1392576
57985 1392576 1375963 1358270 1341431 1325993 1310354 1294185 1278583 1263030 1245952 1228177 1212299
57974 1212299 1198623 1184892 1169898 1154358 1138476 1121597 1104086 1086950 1069866 1051965 1033869
57963 1033869 1016625 999669 982326 966013 952142 939162 924787 909971 897402 887137 877107
57952 877107 867144 858990 852843 847216 841812 837438 833484 828503 822958 818467 814745 810244 805399 802356
57938 802356 801818 802843 805146 808925 813188 817298 823361 833657 846075 855525 859806 860982 861072 859613
57924 859613 855758 849846 842555 834860 828666 825029 822168 817835 813003 810185 808829 806024 801531 798309
57910 798309 797656 797491 796242 795071 795178 795885 796460 797219 797765 796645 793748 790805 788681 786230 782448 777582
$$ packed form
57996A688451l1492l0670l1096l2162l0721k6904k4889k5672k4930k0603j6736
57985A392576j6613j7693j6839j5438j5639j6169j5602j5553j7078j7775j5878
57974A212299j3676j3731j4994j5540j5882j6879j7511j7136j7084j7901j8096
57963A033869j7244j6956j7343j6313j3871j2980j4375j4816j2569j0265j0030
57952H77107r963q154o147n627n404m374l954m981n545m491l722m501m845l043
57938H02356n38J025K303L779M263M110O063J0296J2418R450M281J176R0j459
57924H59613l855n912p291p695o194l637k861m333m832k818j356k805m493l222
57910G98309o53j65j249j171J07P07N75P59N46j120k897k943k124k451l782m866
$$ plain form
57894 777582 771660 764252 756208 749275 743407 736944 730053 725354 724128 724390 723907 722874 722430 722689 723687
57879 723687 726431 731512 737969 744643 751415 758384 765247 772253 780262 789074 797137 803653 809519 815261
57865 815261 819377 819772 815962 809259 801607 794546 788306 781591 773156 763585 754532 746645 739706 734333
57851 734333 731438 730020 727705 724008 721146 721010 723121 726153 729656 733459 736922 739655 741776 742968
57837 742968 742688 741718 741991 744198 746989 749130 751045 753529 756309 758719 760819 763147 766092 769754 773530
57822 773530 775871 775551 773219 770501 767839 764649 761219 758458 755783 751546 746059 742043 741156 741854 741680
57807 741680 740037 737696 735035 732006 729005 726809 726244 728068 732275 737469 742142 746703 752843 760868
57793 760868 769287 777194 785191 793439 800672 805990 810188 814484 819108 823645 827510 829753 829903 829292 829936
$$ packed form
57894G77582n922p408q044o933n868o463o891m699j226K62m83j033m44K59R98
57879G23687K744N081O457O674O772O969O863P006Q009Q812Q063O516N866N742
57865H15261M116L95l810o703p652p061o240o715q435r571r053p887o939n373
57851G34333k895j418k315l697k862j36K111L032L503L803L463K733K121J192
57837G42968k80r70K73K207K791K141J915K484K780K410K100K328K945L662L776
57822G73530K341l20k332k718k662l190l430k761k675m237n487m016q87O98j74
57807G41680j643k341k661l029l001k196n65J824M207N194M673M561O140Q025
57793G60868Q419P907P997Q248P233N318M198M296M624M537L865K243J50o11O44
$$ plain form
57778 829936 831804 832858 832032 830146 827540 823208 817182 811408 807033 802962 798465 795053 793996 793867 792500
57763 792500 789978 787762 786107 784160 781648 778740 775116 770780 766935 764576 763113 761828 761593 763323
57749 763323 765611 765947 763733 760186 755678 749377 741644 734642 729833 726393 722961 719789 718049 717751 717511
57734 717511 716311 714615 713439 713030 713149 714309 717562 722702 727808 731475 734614 738975 744744 751085 758287
57719 758287 767323 777499 786768 794757 803451 814261 826171 837434 847331 855529 861649 866516 872074
57706 872074 878731 884345 887167 888371 890267 893296 896300 898613 900314 901272 901416 901279 901068 899986 897576
57691 897576 894810 892674 890640 887928 885398 884790 886696 890443 895077 899266 901372 901306 901516 904376 909184
57676 909184 913346 915848 917705 919542 920871 921811 923467 926224 929303 932444 936468 941492 945930 948285
$$ packed form
57778H29936J868J054q26j886k606m332o026n774m375m071m497l412j057j29j367
57763G92500k522k216j655j947k512k908l624m336l845k359j463j285k35J730
57749G63323K288L36k214l547m508o301p733p002m809l440l432l172j740k98k40
57734G17511j200j696j176m09J19J160L253N140N106L667L139M361N769O341P202
57719G58287R036J0176R269P989Q694J0810J1910J1263R897Q198O120M867N558
57706H72074O657N614K822J204J896L029L004K313J701R58J44j37k11j082k410
57691H97576k766k136k034k712k530o08J906L747M634M189K106o6K10K860M808
57676I09184M162K502J857J837J329R40J656K757L079L141M024N024M438K355
$$ plain form
57662 948285 949225 951108 955725 962892 970854 977670 982393 985231 986890 988149 989939 992958 996662 999260
57648 999260 999456 997836 996033 994978 994519 994253 993962 993531 993028 992673 992430 992118 992146 993352 995640 997670 998522
57631 998522 998818 999539 1000644 1001768 1003328 1005882 1009080 1012224 1015118 1017559 1019048 1020287 1023981 1032630 1046134
57616 1046134 1062938 1082724 1106221 1133075 1162095 1193710 1230311 1273860 1324751 1383191 1449604
57605 1449604 1522387 1596102 1662795 1714755 1746182 1753818 1737562 1700671 1648885 1588982 1527428
57594 1527428 1469197 1417055 1371779 1332965 1299738 1271307 1247426 1228145 1212943 1200628 1190385
57583 1190385 1182239 1176075 1171058 1166745 1163967 1163690 1165560 1168324 1171006 1172891 1173320 1172583 1172166 1172873 1173575
57568 1173575 1173169 1172914 1175044 1179635 1184570 1188304 1190900 1192606 1193359 1193894 1195653 1199201 1203996 1209674 1216109
$$ packed form
57662I48285R40J883M617P167P962O816M723K838J659J259J790L019L704K598
57648I99260J96j620j803j055m59k66k91m31n03l55k43l12K8J206K288K030Q52
57631I98522K96P21J105J124J560K554L198L144K894K441J489J239L694Q649J3504
57616A046134J6804J9786K3497K6854K9020L1615L6601M3549N0891N8440O6413
57605A449604P2783P3715O6693N1960L1427P636j6256l6891n1786n9903o1554
57594A527428n8231n2142m5276l8814l3227k8431k3881j9281j5202j2315j0243
57583A190385q146o164n017m313k778k77J870K764K682J885M29p37m17P07P02
57568A173575m06k55K130M591M935L734K596J706P53N35J759L548M795N678O435
$$ plain form
57553 1216109 1222268 1226774 1229857 1233130 1237160 1240978 1244329 1248513 1254163 1259871 1264143 1267504 1271594 1277099
57539 1277099 1283401 1289456 1294299 1297509 1299852 1302776 1306833 1311305 1315560 1319623 1323190 1325594 1327484 1331118
57525 1331118 1337883 1346471 1354596 1361527 1367894 1373908 1379243 1384226 1389846 1396580 1404089 1411941 1419871 1427364
57511 1427364 1433613 1438037 1440652 1442216 1444191 1448069 1454244 1461730 1469232 1476192 1482740 1489193 1495895 1502901
57497 1502901 1509516 1514786 1518913 1523676 1530872 1540564 1551132 1560769 1568842 1576320 1585103 1596416 1609658
57484 1609658 1623210 1636330 1649577 1663428 1677517 1691607 1706284 1722105 1738666 1755052 1770657
57473 1770657 1785245 1798941 1812552 1827118 1842558 1857470 1870870 1883551 1897098 1912044 1927456
57462 1927456 1941832 1954028 1963921 1972675 1981961 1992566 2004173 2016442 2029409 2042657 2055315 2067470
$$ packed form
57553A216109O159M506L083L273M030L818L351M184N650N708M272L361M090N505
57539A277099O302O055M843L210K343K924M057M472M255M063L567K404J890L634
57525A331118O765Q588Q125O931O367O014N335M983N620O734P509P852P930P493
57511A427364O249M424K615J564J975L878O175P486P502O960O548O453O702P006
57497A502901O615N270M127M763P196R692J0568R637Q073P478Q783J1313J3242
57484A609658J3552J3120J3247J3851J4089J4090J4677J5821J6561J6386J5605
57473A770657J4588J3696J3611J4566J5440J4912J3400J2681J3547J4946J5412
57462A927456J4376J2196R893Q754R286J0605J1607J2269J2967J3248J2658J2155
$$ plain form
57450 2067470 2080544 2095480 2111420 2126927 2141678 2156209 2170837 2185789 2201602 2218313 2234789
57439 2234789 2249839 2263565 2276853 2290077 2303166 2316368 2330022 2344057 2358580 2374408 2392032
57428 2392032 2410506 2428335 2445171 2461787 2478832 2496507 2514926 2533677 2551367 2566726 2580049
57417 2580049 2592776 2606018 2620310 2636095 2653131 2669786 2684429 2697534 2711231 2726796 2743712
57406 2743712 2761025 2778299 2795203 2811630 2828516 2847107 2866979 2886080 2903408 2920509 2939570
57395 2939570 2961034 2983956 3007777 3032589 3058070 3083306 3107727 3131535 3155190 3178963 3203019
57384 3203019 3227483 3252258 3276953 3301219 3325198 3349527 3374657 3400136 3424977 3449013 3473540
57373 3473540 3500162 3529160 3559307 3589035 3617426 3644593 3671783 3700781 3732350 3765321 3797861
$$ packed form
57450B067470J3074J4936J5940J5507J4751J4531J4628J4952J5813J6711J6476
57439B234789J5050J3726J3288J3224J3089J3202J3654J4035J4523J5828J7624
57428B392032J8474J7829J6836J6616J7045J7675J8419J8751J7690J5359J3323
57417B580049J2727J3242J4292J5785J7036J6655J4643J3105J3697J5565J6916
57406B743712J7313J7274J6904J6427J6886J8591J9872J9101J7328J7101J9061
57395B939570K1464K2922K3821K4812K5481K5236K4421K3808K3655K3773K4056
57384C203019K4464K4775K4695K4266K3979K4329K5130K5479K4841K4036K4527
57373C473540K6622K8998L0147K9728K8391K7167K7190K8998L1569L2971L2540
$$ plain form
57362 3797861 3829506 3861181 3893469 3925830 3957677 3989255 4021158 4053688 4086964 4120987 4155246
57351 4155246 4188865 4221521 4253778 4286215 4318585 4350137 4380497 4410129 4440132 4471529 4504444
57340 4504444 4538027 4571505 4605082 4639374 4674431 4709953 4746051 4782757 4819139 4854119 4888145
57329 4888145 4922752 4958399 4994124 5029655 5066122 5103771 5140571 5174639 5207181 5241331 5278447
57318 5278447 5317058 5355397 5393427 5431911 5470820 5509646 5548500 5587774 5626883 5664358 5699601
57307 5699601 5733985 5769609 5807195 5845624 5883373 5919802 5955137 5990020 6025412 6062183 6100247
57296 6100247 6138528 6176182 6213296 6249959 6285511 6319605 6353281 6387888 6423329 6458466 6492943
57285 6492943 6527420 6562206 6596957 6631723 6667114 6703262 6739621 6775866 6811958 6847396 6881643
$$ packed form
57362C797861L1645L1675L2288L2361L1847L1578L1903L2530L3276L4023L4259
57351D155246L3619L2656L2257L2437L2370L1552L0360K9632L0003L1397L2915
57340D504444L3583L3478L3577L4292L5057L5522L6098L6706L6382L4980L4026
57329D888145L4607L5647L5725L5531L6467L7649L6800L4068L2542L4150L7116
57318E278447L8611L8339L8030L8484L8909L8826L8854L9274L9109L7475L5243
57307E699601L4384L5624L7586L8429L7749L6429L5335L4883L5392L6771L8064
57296F100247L8281L7654L7114L6663L5552L4094L3676L4607L5441L5137L4477
57285F492943L4477L4786L4751L4766L5391L6148L6359L6245L6092L5438L4247
$$ plain form
57274 6881643 6915312 6949728 6985237 7021209 7057644 7095097 7132810 7168854 7202890 7237016 7272849
57263 7272849 7309317 7344549 7378594 7412818 7447588 7481985 7515175 7546872 7576988 7605815 7634141
57252 7634141 7662394 7690367 7718342 7747513 7778351 7809537 7839710 7869578 7901221 7935930 7973650
57241 7973650 8013760 8055165 8096132 8135107 8171483 8205083 8235751 8264099 8291405 8317561 8340223
57230 8340223 8357455 8370358 8381700 8392750 8403034 8412472 8421941 8432087 8443181 8456000 8471537 8490142
57218 8490142 8512130 8538512 8569516 8602903 8635587 8666642 8697021 8726634 8753794 8777612 8798766
57207 8798766 8817168 8830588 8836674 8835532 8829649 8821873 8813612 8804353 8792825 8779087 8765128 8752930
57195 8752930 8742856 8735003 8731080 8733166 8741199 8753513 8769518 8789973 8814906 8843300 8874883 8910213
$$ packed form
57274F881643L3669L4416L5509L5972L6435L7453L7713L6044L4036L4126L5833
57263G272849L6468L5232L4045L4224L4770L4397L3190L1697L0116K8827K8326
57252G634141K8253K7973K7975K9171L0838L1186L0173K9868L1643L4709L7720
57241G973650M0110M1405M0967L8975L6376L3600L0668K8348K7306K6156K2662
57230H340223J7232J2903J1342J1050J0284R438R469J0146J1094J2819J5537J8605
57218H490142K1988K6382L1004L3387L2684L1055L0379K9613K7160K3818K1154
57207H798766J8402J3420O086j142n883p776q261r259j1528j3738j3959j2198
57195H752930j0074p853l923K086Q033J2314J6005K0455K4933K8394L1583L5330
$$ plain form
57183 8910213 8948719 8988450 9027993 9066908 9104131 9137961 9168029 9195438 9220375 9241401 9257669
57172 9257669 9270041 9279302 9284990 9286878 9286136 9284237 9282016 9280230 9279376 9278191 9273928 9265027 9252213 9236462
57158 9236462 9217683 9196487 9175653 9158497 9146670 9140371 9139396 9142891 9149213 9157365 9168162 9183266
57146 9183266 9203465 9227991 9254546 9279698 9300335 9315223 9324475 9327763 9324297 9314307 9298740 9277289
57134 9277289 9248391 9211415 9167098 9115491 9055401 8986497 8910295 8828393 8741114 8648249 8549637
57123 8549637 8444957 8334797 8222067 8110421 8001061 7893026 7786410 7682823 7582762
57114 7582762 7485650 7392893 7307481 7229239 7153288 7074435 6990464 6900203 6801741 6694593 6581182
57103 6581182 6464475 6346355 6229703 6119548 6020443 5934675 5864019 5810561 5774442 5753047
$$ packed form
57183H910213L8506L9731L9543L8915L7223L3830L0068K7409K4937K1026J6268
57172I257669J2372R261N688J888p42j899k221j786q54j185m263q901j2814j5751
57158I236462j8779k1196k0834j7156j1827o299r75L495O322Q152J0797J5104
57146I183266K0199K4526K6555K5152K0637J4888R252L288l466r990j5567k1451
57134I277289k8898l6976m4317n1607o0090o8904p6202q1902q7279r2865r8612
57123H549637j04680j10160j12730j11646j09360j08035j06616j03587j00061
57114G582762r7112r2757q5412p8242p5951p8853q3971r0261r8462j07148j13411
57103F581182j16707j18120j16652j10155r9105q5768p0656n3458l6119k1395
$$ plain form
57093 5753047 5743309 5742171 5744334 5743161 5734856 5718324 5690227 5644837 5580410 5501158 5410896 5309350
57081 5309350 5196897 5077696 4954817 4826926 4693323 4557885 4424514 4293136 4163980
57072 4163980 4041192 3927952 3822208 3721442 3627513 3542736 3465724 3395377 3333868 3280392
57062 3280392 3226138 3160007 3074000 2957553 2791805 2555674 2233319 1810944 1273284 611128
57051 -172539 -1070824 -2082499 -3208065 -4444636 -5794049 -7269409 -8883202 -10632259
57043 -10632259 -12498848 -14454553 -16449910 -18407605 -20238726 -21861333 -23197381 -24167965
57035 -24167965 -24710025 -24788189 -24372873 -23413821 -21844904 -19595808 -16585056 -12733174 -8010722
57026 -8010722 -2441898 3945567 11026775 18216167 24164752 27070733 25619970 19807631
$$ packed form
57093E753047r738j138K163j173q305j6532k8097m5390o4427p9252r0262j01546
57081E309350j12453j19201j22879j27891j33603j35438j33371j31378j29156
57072D163980j22788j13240j05744j00766r3929q4777p7012p0347o1509n3476
57062C280392n4254o6131q6007j16447j65748k36131l22355m22375n37660F11128
57051a72539q98285j011675j125566j236571j349413j475360j613793j749057
57043a0632259j866589j955705j995357j957695j831121j622607j336048r70584
57035b4167965n42060p8164M15316R59052J568917K249096L010752L851882M722452
57026h010722b441898C945567P081208P189392N948585K905981j450763n812339
$$ plain form
57018 19807631 10913880 758615 -9018883 -17209740 -23020509 -26124745 -26748171 -25570507
57010 -25570507 -23438700 -21090767 -19019204 -17449268 -16380902 -15674300 -15143725 -14616344
57002 -14616344 -13958628 -13097343 -12028822 -10796276 -9453922 -8052927 -6644860 -5275804
56994 -5275804 -3974094 -2752741 -1620931 -584025 363048 1230808 2024823 2747951 3408693
56985 3408693 4017806 4579136 5092155 5560614 5990301 6380986 6729364 7038240 7314892
56976 7314892 7561748 7775978 7956974 8107676 8230224 8326998 8404665 8470992 8528752 8578056
56966 8578056 8622838 8669780 8722898 8784415 8858762 8951274 9066416 9211375 9393783 9605203
56956 9605203 9809892 9961541 10034132 10032573 9977689 9891205 9793760 9703622 9629664 9570006 9520522
$$ packed form
57018A9807631q893751G58615i018883q190857n810769l104236o23426J177664
57010b5570507K131807K347933K071563J569936J068366P06602N30575N27381
57002a4616344O57716Q61285J068521J232546J342354J400995J408067J369056
56994e275804J301710J221353J131810e84025C63048Q67760P94015P23128O60742
56985C408693O09113N61330N13019M68459M29687L90685L48378L08876K76652
56976G314892K46856K14230J80996J50702J22548R6774P7667O6327N7760M9304
56966H578056M4782M6942N3118O1517P4347R2512J15142J44959J82408K11420
56956I605203K04689J51649P2591j559n4884q6484r7445r0138p3958n9658m9484
$$ plain form
56945 9520522 9480538 9449419 9423836 9401439 9383011 9368903 9357142 9346631 9338582 9333497 9330179 9328470
56933 9328470 9329247 9330994 9330334 9326945 9324313 9324664 9326788 9329827 9335642 9346134 9361226 9380214 9402120 9424102
56919 9424102 9442708 9457398 9470052 9480796 9487502 9489542 9488388 9484032 9474418 9459157 9440388 9419295
56907 9419295 9395269 9369299 9344557 9322460 9301402 9280416 9260749 9242629 9223907 9203428 9182559
56896 9182559 9161491 9136604 9103120 9058094 8999658 8926242 8838477 8739949 8634558 8524787 8413326
56885 8413326 8303962 8199354 8099606 8003987 7912268 7823634 7736342 7649566 7564069 7480608 7399404
56874 7399404 7321311 7247078 7174876 7100580 7020773 6933084 6833448 6716327 6579167 6424923 6259711
56863 6259711 6090153 5922926 5763285 5612281 5467525 5327635 5193862 5067074 4946293
$$ packed form
56945I520522l9984l1119k5583k2397j8428j4108j1761j0511q049n085l318j709
56933I328470P77J747o60l389k632L51K124L039N815J0492J5092J8988K1906K1982
56919I424102J8606J4690J2654J0744O706K040j154m356r614j5261j8769k1093
56907I419295k4026k5970k4742k2097k1058k0986j9667j8120j8722k0479k0869
56896I182559k1068k4887l3484m5026n8436p3416q7765r8528j05391j09771j11461
56885H413326j09364j04608r9748r5619r1719q8634q7292q6776q5497q3461q1204
56874G399404p8093p4233p2202p4296p9807q7689r9636j17121j37160j54244j65212
56863F259711j69558j67227j59641j51004j44756j39890j33773j26788j20781
$$ plain form
56854 4946293 4831363 4723974 4624387 4529678 4436988 4346481 4259842 4178027 4101700 4031444 3966106
56843 3966106 3903109 3841627 3783088 3727409 3671575 3613664 3555538 3499543 3445091 3390861 3338142
56832 3338142 3289432 3245370 3205166 3168356 3133878 3099063 3061907 3023109 2983874 2943159 2899215
56821 2899215 2852456 2804405 2754780 2701938 2645561 2586986 2527562 2468483 2411496 2357913 2307349
56810 2307349 2259037 2214014 2174619 2142245 2116788 2097681 2084245 2075426 2070384 2069229 2072561 2080372
56798 2080372 2091006 2099923 2099649 2083180 2048653 1999638 1940873 1875806 1808445 1744037 1685680 1632375
56786 1632375 1582425 1536839 1497477 1464086 1435838 1414173 1401310 1397130 1400241 1411328 1432748 1465091
56774 1465091 1506159 1552570 1599799 1640877 1667629 1674099 1658112 1620563 1565392 1499793 1431799
$$ packed form
56854D946293j14930j07389r9587r4709r2690r0507q6639q1815p6327p0256o5338
56843C966106o2997o1482n8539n5679n5834n7911n8126n5995n4452n4230n2719
56832C338142m8710m4062m0204l6810l4478l4815l7156l8798l9235m0715m3944
56821B899215m6759m8051m9625n2842n6377n8575n9424n9079n6987n3583n0564
56810B307349m8312m5023l9395l2374k5457j9107j3436q819n042j155L332P811
56798B080372J0634Q917k74j6469l4527m9015n8765o5067o7361o4408n8357n3305
56786A632375m9950m5586l9362l3391k8248k1665j2863m180L111J1087K1420L2343
56774A465091M1068M6411M7229M1078K6752O470j5987l7549n5171o5599o7994
$$ plain form
56763 1431799 1366433 1304894 1247099 1193601 1145210 1102439 1065768 1035495 1011226 992441 979604
56752 979604 974036 976797 988104 1007235 1032167 1059664 1086389 1109551 1126132 1132490 1125642 1104613
56740 1104613 1070511 1026583 978409 931996 890156 851729 815162 781367 752108 727441 706380
56729 706380 688677 674397 663151 655304 652413 654747 659972 666200 674583 686432 699262 708489 711947
56716 711947 709906 701565 685034 660906 632959 604669 577123 550489 525308 501800 479729 459407
56704 459407 441397 425200 409779 395322 382936 372754 363948 356259 349730 343170 334895 324967 314954
56691 314954 305729 297383 290945 287746 286928 285793 282961 279188 275047 270268 265812 263965 265175 266822
56677 266822 266302 263777 260845 258148 255468 252906 250789 249171 248140 247790 247568 246658 245285 244380 243833 242519
$$ packed form
56763A431799o5366o1539n7795n3498m8391m2771l6671l0273k4269j8785j2837
56752I79604n568K761J1307J9131K4932K7497K6725K3162J6581O358o848k1029
56740A104613l4102m3928m8174m6413m1840l8427l6567l3795k9259k4667k1061
56729G06380j7703j4280j1246p847k891K334N225O228Q383J1849J2830R227L458
56716G11947k041q341j6531k4128k7947k8290k7546k6634k5181k3508k2071k0322
56704D59407j8010j6197j5421j4457j2386j0182q806p689o529o560q275r928j0013
56691C14954r225q346o438l199q18j135k832l773m141m779m456j847J210J647
56677B66822n20k525k932k697k680k562k117j618j031l50k22r10j373r05n47j314
$$ plain form
56661 242519 240419 239070 239423 240699 241916 242968 243573 242899 241194 240223 240918 241823 241127 239129 237434 236613
56645 236613 235945 234871 233454 231653 229076 225475 221037 216375 212382 209651 207816 205901 203395 200542
56631 200542 197776 195576 194582 194758 194658 192890 190430 189982 192672 196678 199734 201684 203841 206921 210475
56616 210475 213652 215899 217529 219942 224477 230626 236170 239379 240322 239969 239170 238817 239658 241315 242547
56601 242547 243118 244351 247120 250367 252518 253564 254828 257157 260102 262540 263580 263222 262417 262190 262642
56586 262642 263290 264120 265387 266489 266284 264789 263494 263668 265257 267597 270061 271834 272269 271879 271831 272183
56570 272183 271931 271046 270909 272131 273525 274058 274294 274813 274657 272787 269978 267783 266312 264514 262145 260022
56554 260022 258381 256140 252136 246590 241207 237884 237085 237451 237381 236839 236943 238083 239634 241360 243538 245407
$$ packed form
56661B42519k100j349L53J276J217J052O05o74j705r71O95R05o96j998j695q21
56645B36613o68j074j417j801k577l601m438m662l993k731j835j915k506k853
56631B00542k766k200r94J76j00j768k460m48K690M006L056J950K157L080L554
56616B10475L177K247J630K413M535O149N544L209R43l53p99l53Q41J657J232
56601B42547N71J233K769L247K151J046J264K329K945K438J040l58q05k27M52
56586B62642O48Q30J267J102k05j495j295J74J589K340K464J773M35l90m8L52
56570B72183k52q85j37J222J394N33K36N19j56j870k809k195j471j798k369k123
56554B60022j641k241m004n546n383l323p99L66p0n42J04J140J551J726K178J869
$$ plain form
56538 245407 245282 243076 241143 241510 243486 245246 246601 248724 251866 254815 256419 256594 256061 255854 256780 258740
56522 258740 260874 262799 265084 268072 271084 273565 276220 280118 285129 290023 293739 296024 297357 298829
56508 298829 301623 306061 311544 317620 324367 331561 338552 345458 353490 363521 375221 387976 401400
56495 401400 414306 424618 431356 435687 439085 441604 442937 443816 444910 445369 444028 441422 439224 438237
56481 438237 438110 438382 438498 437489 434930 431820 429213 426609 423002 418985 416263 415333 415042 414265 412635 409739
56465 409739 405153 399576 394767 391793 389987 387840 384474 380204 376084 372845 370027 366524 362158 357944
56451 357944 354433 350815 346494 342461 339916 338286 335961 332481 328725 325383 322542 320437 319226 318138
56437 318138 316101 313347 311376 311216 312507 314216 315540 316195 316569 317433 318997 320609 321881 323465 325901
$$ packed form
56538B45407j25k206j933L67J976J760J355K123L142K949J604J75n33k07R26J960
56522B58740K134J925K285K988L012K481K655L898N011M894L716K285J333J472
56508B98829K794M438N483O076O747P194O991O906Q032J0031J1700J2755J3424
56495D01400J2906J0312O738M331L398K519J333Q79J094M59j341k606k198r87
56481D38237j27K72J16j009k559l110k607k604l607m017k722r30k91p77j630k896
56465D09739m586n577m809k974j806k147l366m270m120l239k818l503m366m214
56451C57944l511l618m321m033k545j630k325l480l756l342k841k105j211j088
56437C18138k037k754j971j60J291J709J324O55L74Q64J564J612J272J584K436
$$ plain form
56422 325901 328432 329981 330691 331349 331817 331315 329967 328880 328785 329480 330286 330260 328546 325595 323380 323126 323418
56405 323418 321987 318885 316233 315217 315141 315488 317034 320372 324727 328826 331938 333696 333953 333305 332925 333572
56389 333572 335232 337612 340214 342081 342541 342254 342607 344145 346437 349207 352421 355396 357228 358283 360078
56374 360078 363373 367392 371099 374175 376471 377613 377667 377432 377763 379176 381962 385711 388742 389359 388067
56359 388067 387468 389289 392437 394696 395640 396995 400297 404940 408735 410194 409990 409989 411135 412808 414173 415107
56343 415107 415516 414835 413040 411130 409668 407795 404887 402254 401679 402850 403832 403762 403554 404077 405098 406029
56327 406029 406436 405867 404350 403033 403235 405065 407912 411676 416122 419614 420393 418986 417638 417359 417210 416499
56311 416499 415758 415240 414359 413271 413447 415860 419815 424089 428125 431644 434228 435734 436257 435564 433711 432178
$$ packed form
56422C25901K531J549P10O58M68n02j348j087r5O95Q06k6j714k951k215k54K92
56405C23418j431l102k652j016p6L47J546L338M355M099L112J758K57o48l80O47
56389C33572J660K380K602J867M60k87L53J538K292K770L214K975J832J055J795
56374C60078L295M019L707L076K296J142N4k35L31J413K786L749L031O17j292
56359C88067n99J821L148K259R44J355L302M643L795J459k04jJ146J673J365R34
56343D15107M09o81j795j910j462j873k908k633n75J171R82p0k08N23J021R31
56327D06029M07n69j517j317K02J830K847L764M446L492P79j407j348k79j49p11
56311D16499p41n18q81j088J76K413L955M274M036L519K584J506N23o93j853j533
$$ plain form
56295 432178 432918 436038 439856 443413 447310 451676 455028 456098 455549 455040 455558 457167 459414 461416 462483
56280 462483 463054 464192 466023 467686 468924 470474 472810 475802 479712 485037 491130 496582 501313 506634
56266 506634 512818 518338 522183 525303 528844 532480 535501 538262 541492 545139 548792 552449 556269 560402
56252 560402 565354 571431 577560 582034 584890 588143 593121 598955 604363 609504 615283 622048 629751 638255
56238 638255 646889 654826 662441 671116 681319 692117 702877 713883 724834 734538 742926 751833 762972
56225 762972 776424 791618 808105 824814 840441 855543 872473 892230 912992 932707 951480
56214 951480 970449 990125 1010957 1033735 1058233 1083098 1108279 1135800 1167026 1201052 1237142
56203 1237142 1276613 1320545 1367540 1415839 1466109 1520227 1578775 1641756 1710399 1786117 1868722
$$ packed form
56295D32178P40L120L818L557L897M366L352J070n49n09N18J609K247K002J067
56280D62483N71J138J831J663J238J550K336K992L910N325O093N452M731N321
56266E06634O184N520L845L120L541L636L021K761L230L647L653L657L820M133
56252E60402M952O077O129M474K856L253M978N834N408N141N779O765P703Q504
56238F38255Q634P937P615Q675J0203J0798J0760J1006J0951R704Q388Q907J1139
56225G62972J3452J5194J6487J6709J5627J5102J6930J9757K0762J9715J8773
56214I51480J8969J9676K0832K2778K4498K4865K5181K7521L1226L4026L6090
56203A237142L9471M3932M6995M8299N0270N4118N8548O2981O8643P5718Q2605
$$ plain form
56192 1868722 1957691 2054179 2159843 2274541 2397070 2527226 2665215 2809726 2958469 3110066
56182 3110066 3263889 3418676 3572659 3723981 3869322 4003036 4119612 4216496 4293102 4347990
56172 4347990 4378739 4383997 4364099 4320268 4254710 4170867 4072130 3960781 3839114 3710412 3577490
56161 3577490 3441422 3303259 3165849 3032261 2903429 2778976 2659364 2545587 2437772
56152 2437772 2335877 2240715 2152602 2069990 1991257 1916801 1847597 1782907 1721497 1663987 1611744
56141 1611744 1564334 1520341 1479952 1444370 1413149 1384333 1356933 1331411 1308173 1287382 1269683
56130 1269683 1255298 1242988 1231587 1221657 1213814 1206617 1198401 1190254 1184684 1181986 1180374 1179011 1178292
56117 1178292 1177635 1175844 1173609 1172978 1174141 1175168 1175338 1176505 1180547 1187189 1194806 1202022 1208362 1214621 1222612
$$ packed form
56192A868722Q8969R6488J05664J14698J22529J30156J37989J44511J48743J51597
56182C110066J53823J54787J53983J51322J45341J33714J16576R6884P6606N4888
56172D347990L0749N258j9898m3831o5558q3843r8737j11349j21667j28702j32922
56161C577490j36068j38163j37410j33588j28832j24453j19612j13777j07815
56152B437772j01895r5162q8113q2612p8733p4456o9204o4690o1410n7510n2243
56141A611744m7410m3993m0389l5582l1221k8816k7400k5522k3238k0791j7699
56130A269683j4385j2310j1401r930p843p197q216q147n570k698j612j363p19
56117A178292o57j791k235o31J163J027J70J167M042O642P617P216O340O259P991
$$ plain form
56102 1222612 1233483 1246496 1260322 1274778 1290314 1307018 1325453 1347099 1372262 1398956 1425626
56091 1425626 1453449 1483932 1516113 1548765 1583722 1623939 1669535 1718920 1772787 1833649 1902201
56080 1902201 1977492 2060222 2152633 2255344 2367131 2487173 2614260 2744097 2870620 2989968
56070 2989968 3100614 3200538 3287924 3364383 3433931 3498445 3556751 3607410 3648908 3677692 3690137
56059 3690137 3686816 3671616 3646933 3613303 3572948 3528741 3479049 3418124 3342845 3255442 3159128
56048 3159128 3055482 2947448 2840558 2739091 2644203 2557182 2480902 2416319 2360752 2311530
56038 2311530 2268701 2232862 2203246 2179347 2161670 2149643 2141362 2136204 2134825 2136044 2137225 2138776
56026 2138776 2144651 2157000 2173428 2190839 2208660 2226954 2244764 2262010 2280107 2299350 2318587
$$ packed form
56102A222612J0871J3013J3826J4456J5536J6704J8435K1646K5163K6694K6670
56091A425626K7823L0483L2181L2652L4957M0217M5596M9385N3867O0862O8552
56080A902201P5291Q2730R2411J02711J11787J20042J27087J29837J26523J19348
56070B989968J10646R9924Q7386P6459O9548O4514N8306N0659M1498K8784J2445
56059C690137l321j5200k4683l3630m0355m4207m9692o0925p5279q7403r6314
56048C159128j03646j08034j06890j01467r4888q7021p6280o4583n5567m9222
56038B311530m2829l5839k9616k3899j7677j2027q281n158j379J219J181J551
56026B138776N875J2349J6428J7411J7821J8294J7810J7246J8097J9243J9237
$$ plain form
56015 2318587 2338477 2361626 2388255 2415158 2440442 2465876 2493162 2521402 2549974 2580495 2614018
56004 2614018 2649257 2685149 2722138 2759606 2795363 2829156 2863360 2898791 2933369 2966406 3000620
55993 3000620 3038219 3078433 3120497 3165476 3213470 3262626 3312643 3365849 3423155 3482340 3541601
55982 3541601 3601283 3661145 3720026 3779307 3842310 3909072 3976377 4044083 4116231 4194397 4275523
55971 4275523 4358384 4446535 4542172 4642517 4745015 4850809 4960363 5071332 5183983 5303310
55961 5303310 5432257 5568000 5708110 5855010 6010801 6173073 6339614 6512215 6692343
55952 6692343 6878219 7069398 7268783 7477035 7690991 7910848 8142415 8388649 8645821
55943 8645821 8912133 9193054 9493753 9813537 10152708 10517707 10914345 11343118 11806192
$$ packed form
56015B318587J9890K3149K6629K6903K5284K5434K7286K8240K8572L0521L3523
56004B614018L5239L5892L6989L7468L5757L3793L4204L5431L4578L3037L4214
55993C000620L7599M0214M2064M4979M7994M9156N0017N3206N7306N9185N9261
55982C541601N9682N9862N8881N9281O3003O6762O7305O7706P2148P8166Q1126
55971D275523Q2861Q8151R5637J00345J02498J05794J09554J10969J12651J19327
55961E303310J28947J35743J40110J46900J55791J62272J66541J72601J80128
55952F692343J85876J91179J99385K08252K13956K19857K31567K46234K57172
55943H645821K66312K80921L00699L19784L39171L64999L96638M28773M63074
$$ plain form
55934 11806192 12311143 12862392 13457293 14097051 14793426 15558120 16393461 17299505 18280643
55925 18280643 19337353 20460581 21642993 22888083 24201456 25583295 27037744 28579085
55917 28579085 30219261 31959694 33804809 35771974 37877471 40124814 42518898 45079725
55909 45079725 47830109 50783130 53955384 57379788 61092962 65127481 69534106 74396355
55901 74396355 79806738 85847322 92612566 100230871 108844735 118599586 129686079 142377154
55893 142377154 157008692 173971831 193763266 216977642 244144001 275514881 310884908
55886 310884908 349218415 387962789 422638204 447650129 458368840 453145004 433775952
55879 433775952 404286396 369179959 332264011 296246188 262762782 232590056 205941965
$$ packed form
55934A1806192N04951N51249N94901O39758O96375P64694Q35341R06044R81138
55925A8280643J056710J123228J182412J245090J313373J381839J454449J541341
55917B8579085J640176J740433J845115J967165K105497K247343K394084K560827
55909D5079725K750384K953021L172254L424404L713174M034519M406625M862249
55901G4396355N410383O040584O765244P618305Q613864R754851J1086493J2691075
55893A42377154J4631538J6963139J9791435K3214376K7166359L1370880L5370027
55886C10884908L8333507L8744374L4675415K5011925J0718711n223836j9369052
55879D33775952k9489556l5106437l6915948l6017823l3483406l0172726k6648091
$$ plain form
55872 205941965 182726708 162671849 145385680 130449421 117504476 106261994 96469564
55865 96469564 87909234 80413166 73846314 68076141 62976748 58448957 54412341 50784970
55857 50784970 47490874 44480735 41727241 39205103 36889271 34763782 32814718 31018281
55849 31018281 29349214 27796199 26356716 25022016 23779050 22621442 21545747 20540620
55841 20540620 19591048 18689803 17834724 17019121 16235553 15485700 14776145 14106865 13472646
55832 13472646 12872522 12308421 11777015 11271761 10791047 10336610 9906550 9497758 9112727
55823 9112727 8756094 8426675 8120400 7838658 7585844 7360531 7156827 6972833 6809740
55814 6809740 6663062 6522036 6377943 6227232 6067244 5895364 5712810 5524109 5332583
$$ packed form
55872B05941965k3215257k0054859j7286169j4936259j2944945j1242482r792430
55865I6469564q560330p496068o566852n770173n099393m527791m036616l627371
55857E0784970l294096l010139k753494k522138k315832k125489j949064j796437
55849C1018281j669067j553015j439483j334700j242966j157608j075695j005127
55841B0540620r49572r01245q55079q15603p83568p49853p09555o69280o34219
55832A3472646o00124n64101n31406n05254m80714m54437m30060m08792l85031
55823I112727l56633l29419l06275k81742k52814k25313k03704j83994j63093
55814F809740j46678j41026j44093j50711j59988j71880j82554j88701j91526
$$ plain form
55805 5332583 5140397 4951792 4771293 4599410 4434524 4277873 4131960 3995299 3863803
55796 3863803 3736800 3616999 3505037 3398514 3296033 3198012 3103851 3012204 2923778 2840401
55786 2840401 2761810 2686412 2614269 2546293 2481835 2420206 2362777 2310030 2258492 2204742 2150816
55775 2150816 2101232 2056018 2011262 1965599 1921230 1878846 1836285 1792727 1750171 1710057 1671648
55764 1671648 1634169 1597570 1560925 1522895 1484122 1446867 1412282 1379956 1349487 1320311 1290911
55753 1290911 1260737 1232110 1207800 1187563 1169435 1153284 1140351 1130385 1122147 1115912 1112626 1111315
55741 1111315 1110096 1109117 1109834 1112048 1114047 1114898 1114240 1110750 1103202 1092034 1077746 1059268 1036433 1012322
55727 1012322 990275 970171 950639 933122 920074 910464 900809 889653 877461 863304 845763 826566
$$ packed form
55805E332583j92186j88605j80499j71883j64886j56651j45913j36661j31496
55796C863803j27003j19801j11962j06523j02481r8021r4161r1647q8426q3377
55786B840401p8591p5398p2143o7976o4458o1629n7429n2747n1538n3750n3926
55775B150816m9584m5214m4756m5663m4369m2384m2561m3558m2556m0114l8409
55764A671648l7479l6599l6645l8030l8773l7255l4585l2326l0469k9176k9400
55753A290911l0174k8627k4310k0237j8128j6151j2933r966q238o235l286j311
55741A111315j219r79P17K214J999Q51o58l490p548j1168j4288j8478k2835k4111
55727A012322k2047k0104j9532j7517j3048r610r655j1156j2192j4157j7541j9197
$$ plain form
55715 826566 809282 794673 781060 769047 761911 761065 764697 771106 779753 788427 792843 790262 781259
55702 781259 767549 750416 731352 711693 691403 670366 650508 634148 620769 608188 596443
55691 596443 587514 581543 576477 571311 566556 561587 554716 546058 537233 528232 517683 506378 497204 491181
55677 491181 486566 482186 478555 475427 471537 467278 464330 461964 457029 448556 439270 431459 424312 416494
55663 416494 408548 401448 395244 390183 386714 383584 378565 372095 367561 366885 368381 370113 372676 377239
55649 377239 383228 389489 395671 401104 404280 404746 403722 401768 397736 390955 382453 373111 362695 351774
55635 351774 342426 335720 330289 324620 319069 314684 311738 310247 310121 310041 308193 304939 302834 303196 304723
55620 304723 306146 307885 310116 311704 312331 313448 315751 317890 318998 320200 322069 322799 320783 317147 314018
$$ packed form
55715H26566j7284j4609j3613j2013p136q46L632O409Q647Q674M416k581r003
55702G81259j3710j7133j9064j9659k0290k1037j9858j6360j3379j2581j1745
55691E96443q929n971n066n166m755m969o871q658q825r001j0549j1305r174o023
55677D91181m615m380l631l128l890m259k948k366m935q473r286p811p147p818
55663D16494p946p100o204n061l469l130n019o470m534o76J496J732K563M563
55649C77239N989O261O182N433L176M66j024j954m032o781q502r342j0416j0921
55635C51774r348o706n431n669n551m385k946j491j26q0j848l254k105L62J527
55620C04723J423J739K231J588O27J117K303K139J108J202J869P30k016l636l129
$$ plain form
55605 314018 311886 310252 309184 308545 307266 304955 302901 302196 302327 302764 304135 306577 308905 310839 313944
55590 313944 318691 322784 324478 325384 327498 329266 327535 322192 315928 310103 303694 296187 288963 283402
55576 283402 279365 275796 271525 265562 257952 250390 244927 242104 241003 240580 240131 239204 238138 238038 239156
55561 239156 239923 238709 235950 233369 231601 229670 226436 221572 215519 209399 204557 201369 198763 195538
55547 195538 191738 188294 185884 184558 183792 182533 180053 177175 175677 176185 177735 179613 181974 184109 183989
55532 183989 180774 176335 173024 171156 169866 169118 169473 170871 172946 175634 178383 179895 179835 179612 180311 181127
55516 181127 181242 181880 184743 189434 194250 198807 204144 210803 218336 226182 233561 239038 241641 242127 242031
55501 242031 242086 242528 243839 245671 245943 242855 237297 231707 227027 222335 216958 211265 205642 200298 195854
$$ packed form
55605C14018k132j634j068o39j279k311k054p05J31M37J371K442K328J934L105
55590C13944M747M093J694R06K114J768j731n343o264n825o409p507p224n561
55576B83402m037l569m271n963p610p562n463k823j101m23m49r27j066j00J118
55561B39156P67j214k759k581j768j931l234m864o053o120m842l188k606l225
55547A95538l800l444k410j326p66j259k480k878j498N08J550J878K361K135j20
55532A83989l215m439l311j868j290p48L55J398K075K688K749J512o0k23O99Q16
55516A81127J15O38K863M691M816M557N337O659P533P846P379N477K603M86r6
55501B42031N5M42J311J832K72l088n558n590m680m692n377n693n623n344m444
$$ plain form
55486 195854 192625 189564 185459 181007 178172 177488 177520 177162 177066 178361 180960 183534 184609 183711 181926 181169
55470 181169 182367 184758 187321 189931 192299 192939 190732 186830 183478 181339 179335 176708 173603 169776
55456 169776 164462 157881 151698 147618 146176 146800 148119 148324 146235 142266 137873 134286 132233 132129 133485
55441 133485 134610 134040 132141 130555 130438 132007 135073 138794 141401 141493 139449 136681 133975 131561 130032
55426 130032 129792 130039 129748 129342 129907 131084 131393 130580 130038 130704 131917 132664 132694 132124 131037 129786 128834 128128
55408 128128 127369 126781 126727 126795 126352 125828 126283 127714 128937 129167 128572 127324 125388 123422 122631 123286 124259 124402
55390 124402 123689 122911 122988 124544 127298 129794 130577 129736 128678 128532 129431 131025 132728 133721 133747 133758 134809
55373 134809 136570 137894 138442 138541 137900 136043 133890 133150 133882 134281 133406 132730 134229 137996 142417 145967
$$ packed form
55486A95854l229l061m105m452k835o84L2l58r6J295K599K574J075q98j785p57
55470A81169J198K391K563K610K368O40k207l902l352k139k004k627l105l827
55456A69776n314o581o183m080j442O24J319K05k089l969m393l587k053j04J356
55441A33485J125n70j899j586j17J569L066L721K607R2k044k768k706k414j529
55426A30032k40K47k91m06N65J177L09q13n42O66J213P47L0n70j087j251r52p06
55408A28128p59n88n4O8m43n24M55J431J223K30n95j248j936j966p91O55R73J43
55390A24402p13p78P7J556K754K496P83q41j058j46Q99J594J703R93K6J1J051
55373A34809J761J324N48R9o41j857k153p40P32L99q75o76J499L767M421L550
$$ plain form
55357 145967 148233 149813 151627 153933 155906 156670 156546 156556 156977 157341 157631 158254 158836 158263 156120 153077 149745
55340 149745 146230 142937 140647 139468 138627 137493 136033 134280 132391 131194 131477 132654 133255 132899 132594
55325 132594 132978 133546 133811 133970 134051 133665 132957 132664 132909 133084 133140 133670 134450 134355 133181 132072 131587 130835 129337
55306 129337 128219 128479 129331 129401 128541 127359 125927 124219 122978 122806 122797 121246 117690 113556 111054 111756 115662
55289 115662 121010 125522 128389 130636 133297 136094 138341 140058 141327 141465 139935 137509 135481 134124
55275 134124 132796 131212 129646 128178 126669 125367 124719 124573 124262 123609 123278 123996 125761 127951 130001 131846
55259 131846 133612 134924 134875 133143 130805 129362 129030 128761 127907 126925 126249 125495 124274 122961 122087 121657 121625
55242 121625 122390 124241 126753 129230 131315 132799 133357 132936 131976 130933 130034 129629 130116 131204 131971 132059 132199
$$ packed form
55357A45967K266J580J814K306J973P64j24J0M21L64K90O23N82n73k143l043l332
55340A49745l515l293k290j179q41j134j460j753j889j197K83J177O01l56l05
55325A32594L84N68K65J59Q1l86p08k93K45J75N6N30P80r5j174j109m85p52j498
55306A29337j118K60Q52P0q60j182j432j708j241j72rj551l556m134k502P02L906
55289A15662N348M512K867K247K661K797K247J717J269J38j530k426k028j357
55275A34124j328j584j566j468j509j302o48j46l11o53l31P18J765K190K050J845
55259A31846J766J312m9j732k338j443l32k69q54r82o76p54j221j313q74m30l2
55242A21625P65J851K512K477K085J484N58m21r60j043q99m05M87J088P67Q8J40
$$ plain form
55225 132199 133194 134981 136978 138643 139367 138687 137098 135917 135881 136550 137397 138485 139593 139811 138810 137495
55209 137495 136455 134713 131224 126894 123782 122690 122777 123333 124684 127184 130244 132714 133838 133832 133776 134676
55193 134676 136248 137094 136443 135147 134396 134176 133892 133874 135067 137437 139821 141324 141846 141169 138699 134582
55177 134582 130320 127672 127247 128393 130066 131433 131934 131178 129067 126094 123469 122619 124168 127433 131047
55162 131047 134000 136130 137968 140289 143396 146537 148353 148229 146945 145723 144939 144221 143472 143242 144036 145555
55146 145555 146713 146478 144853 143030 142179 142127 141774 140898 140764 142462 145243 147248 147576 147031 146855 147354 147839
55129 147839 147635 146901 146434 146636 146891 146284 144858 143691 143636 144450 145213 145254 144602 143944 144121 145218 146314 146682
55111 146682 146932 148049 149523 149750 148416 147096 146931 147056 146104 144196 142478 141642 141851 143261 145539 147571
$$ packed form
55225A32199R95J787J997J665P24o80j589j181l6O69Q47J088J108K18j001j315
55209A37495j040j742l489m330l112j092Q7N56J351K500L060K470J124on6R00
55193A34676J572Q46o51j296p51k20k84j8J193K370K384J503N22o77k470m117
55177A34582m262k648m25J146J673J367N01p56k111k973k625q50J549L265L614
55162A31047K953K130J838K321L107L141J816j24j284j222p84p18p49k30P94J519
55146A45555J158k35j625j823q51n2l53q76j34J698K781K005L28n45j76M99M85
55129A47839k04p34m67K02K55o07j426j167n5Q14P63M1o52o58J77J097J096L68
55111A46682K50J117J474K27j334j320j65J25r52j908j718q36K09J410K278K032
$$ plain form
55095 147571 148745 149911 152055 154644 156442 157376 158206 158750 157989 155991 154298 154005 154503 154534 153639 152118
55079 152118 150376 148916 148571 150041 153098 156385 158210 157794 155903 154047 153016 152581 152606 153617 155735
55064 155735 157788 158413 157697 156944 156901 156975 156166 154294 152351 151899 153868 157524 160965 163012 164207 165512
55048 165512 166730 166937 165943 164347 162528 160583 159101 159044 160728 163567 166677 169116 169915 169002 168120 169751
55032 169751 174641 180888 185603 187017 185148 181354 177485 174789 173187 171817 170258 168804 167785 167324
55018 167324 167706 169083 170634 170874 169261 166956 165547 165517 166293 167302 168318 169022 168925 167959 166857 166564 167267
55001 167267 168291 169091 169988 171343 172308 171417 168762 166551 166714 168682 170489 171476 172548 173995 174575 173247
54985 173247 170656 168189 166294 164492 162554 160862 159684 158712 157449 155829 154477 154438 156425 160020 163658
$$ packed form
55095A47571J174J166K144K589J798R34Q30N44p61j998j693k93M98L1q95j521
55079A52118j742j460l45J470L057L287J825m16j891j856j031m35K5J011K118
55064A55735K053O25p16p53m3P4q09j872j943m52J969L656L441K047J195J305
55048A65512J218K07r94j596j819j945j482n7J684K839L110K439P99r13q82J631
55032A69751M890O247M715J414j869l794l869k696j602j370j559j454j019m61
55018A67324L82J377J551K40j613k305j409l0P76J009J016P04r7r66j102k93P03
55001A67267J024Q00Q97J355R65q91k655k211J63J968J807R87J072J447N80j328
54985A73247k591k467j895j802j938j692j178r72j263j620j352l9J987L595L638
$$ plain form
54970 163658 165753 165991 165370 164910 164553 163577 161844 160089 158897 158050 157286 157129 158266 160428 162759 165088
54954 165088 167944 171285 174134 175685 175995 175448 174396 173480 173263 173245 172303 170452 169062 168833 168832 168289 167954
54937 167954 168573 169281 168985 168434 169293 171751 174638 177465 180661 183926 186020 186502 186363 186569 187046 187379 187518
54920 187518 187392 186639 185162 183461 182317 182506 184558 188067 191462 193330 193920 194560 195783 196961 197661 198292
54904 198292 199231 200208 200813 200906 200490 199863 199850 201100 203240 205465 207765 210491 212925 213594 212210 210057 208083
54887 208083 205786 202513 198870 196091 194702 194358 194429 194365 194071 194307 196132 199597 203495 206609 208632 209784
54871 209784 210409 211340 213737 217900 222793 227327 231673 236784 243093 250255 257891 266003 274751 284156 293991
54856 293991 303658 312271 319022 323566 326060 326778 325545 321658 314791 306003 297147 289018 280841 272058
$$ packed form
54970A63658K095K38o21m60l57r76j733j755j192q47p64j57J137K162K331K329
54954A65088K856L341K849J551L10n47j052r16k17j8r42j851j390k29jn43l35
54937A67954O19P08k96n51Q59K458K887K827L196L265K094M82j39K06M77L33J39
54920A87518j26p53j477j701j144J89K052L509L395J868N90O40J223J178P00O31
54904A98292R39R77O05R3m16o27j3J250K140K225K300K726K434O69j384k153j974
54887B08083k297l273l643k779j389l44P1o4k94K36J825L465L898L114K023J152
54871B09784O25R31K397M163M893M534M346N111O309P162P636Q112Q748R405R835
54856B93991R667Q613O751M544K494P18j233l887o867q788q856q129q177q783
$$ plain form
54842 272058 263637 256688 250765 244857 239442 235871 234002 232120 229436 227143 226593 227721 229745 232238
54828 232238 234870 237079 238692 240234 242186 244513 247143 250258 253977 258461 264351 272237 281653 291464
54814 291464 301082 310263 317926 322722 324880 325859 325883 323451 317878 310496 302495 293228 281989 270085
54800 270085 259689 251553 245116 239969 235932 232379 228808 225595 223214 221344 219649 218563 218088 216689
54786 216689 212881 207475 202725 199538 196980 194433 192690 192528 193380 193940 193348 191483 188772 186057 184199
54771 184199 183478 183569 184083 184844 185745 186670 187523 188118 188247 188003 187704 187285 186224 184407 182576 181547 181512 182520
54753 182520 184896 188489 192051 194223 194936 195220 195889 196921 197802 197968 197339 196822 197665 199744 201266 201062
54737 201062 200408 201381 203962 206312 207757 209796 213640 218056 220610 220422 218945 218312 219404 221363 222563
$$ packed form
54842B72058q421o949n923n908n415l571j869j882k684k293n50J128K024K493
54828B32238K632K209J613J542J952K327K630L115L719M484N890P886R416R811
54814B91464R618R181P663M796K158R79K4k432n573p382q001r267j1239j1904
54800B70085j0396q136o437n147m037l553l571l213k381j870j695j086m75j399
54786B16689l808n406m750l187k558k547j743j62Q52N60n92j865k711k715j858
54771A84199p21R1N14P61R01R25Q53N95J29k44k99m19j061j817j831j029l5J008
54753A82520K376L593L562K172P13K84O69J032Q81J66o29n17Q43K079J522k04
54737B01062o54R73K581K350J445K039L844M416K554j88j477o33J092J959J200
$$ plain form
54722 222563 222090 220554 219551 220408 223316 227419 231533 235033 238224 241623 244870 247082 248708 252343 260632
54707 260632 273382 287453 299627 309023 316797 324248 331620 338289 343514 346854 348079 347009 343769
54694 343769 339147 334242 329459 324142 317419 309193 300103 290912 282211 274388 267448 260980 254587 248235
54680 248235 242196 237017 233649 232918 234442 236564 237923 238810 240563 243996 248946 254940 261535 268094 273893
54665 273893 278765 283274 288115 293393 298602 303286 307661 312388 317546 322169 325217 326650 326829 325141
54651 325141 320382 312683 303991 296084 288941 281593 273782 266094 259062 252884 247659 243397 240071 237859
54637 237859 236788 236042 234455 232005 229846 228494 227086 225049 223286 222703 222639 221910 220581 219447 218426
54622 218426 216813 214720 213090 212493 212865 214054 215700 217032 217769 218680 220154 220786 218762 214416 210061
$$ packed form
54722B22563m73j536j003Q57K908M103M114L500L191L399L247K212J626L635Q289
54707B60632J2750J4071J2174R396P774P451P372O669N225L340J225j070l240
54694C43769m622m905m783n317o723q226r090r191q701p823o940o468o393o352
54680B48235o039n179l368p31J524K122J359Q87J753L433M950N994O595O559N799
54665B73893M872M509M841N278N209M684M375M727N158M623L048J433J79j688
54651C25141m759p699q692p907p143p348p811p688p032o178n225m262l326k212
54637B37859j071p46j587k450k159j352j408k037j763n83o4p29j329j134j021
54622B18426j613k093j630n97L72J189J646J332P37R11J474O32k024m346m355
$$ plain form
54607 210061 207361 206019 205026 203951 202812 201613 200227 198176 194765 190138 185849 183498 183216 184332 186780
54592 186780 190487 194014 195600 195566 196042 198213 201335 204512 207680 210408 211526 210888 210118 210595 211647 211690
54576 211690 210310 208319 206490 205158 204611 204975 205753 205958 204800 202308 199583 198312 199361 201800 203875
54561 203875 204885 205475 206284 207295 208491 210024 211497 212124 211974 212068 212836 213457 213202 212428 211579 210188 207826
54544 207826 205411 204638 206275 209560 212967 215169 215724 215439 215850 217860 220973 223991 226068 226834 226009 223488
54528 223488 219759 215968 213451 213047 214531 216756 218657 220025 221105 221841 222091 222231 222748 223423 223754 223993
54512 223993 224775 225847 226257 225948 226015 227133 228678 229779 230294 230442 230457 230940 232480 234443 235095 233548 230777
54495 230777 228274 226585 225636 225381 225391 224906 224211 225063 228588 233377 236896 238476 239939 243390 249158 255738
$$ packed form
54607B10061k700j342r93j075j139j199j386k051l411m627m289k351k82J116K448
54592A86780L707L527J586l4M76K171L122L177L168K728J118o38p70M77J052M3
54576B11690j380j991j829j332n47L64P78K05j158k492k725j271J049K439K075
54561B03875J010N90Q09J011J196J533J473O27j50R4P68O21k55p74q49j391k362
54544B07826k415p73J637L285L407K202N55k85M11K010L113L018K077P66q25k521
54528B23488l729l791k517m04J484K225J901J368J080P36K50J40N17O75L31K39
54512B23993P82J072M10l09O7J118J545J101N15J48J5M83J540J963O52j547k771
54495B30777k503j689r49k55J0m85o95Q52L525M789L519J580J463L451N768O580
$$ plain form
54479 255738 260997 263567 263748 263139 263067 263442 263333 262341 261096 260589 261232 262243 261975 259429 255611 252676 251511
54462 251511 250990 249878 248450 247585 247266 246982 246912 247631 249009 250374 251544 252798 253937 254127 252860 250659
54446 250659 248856 248771 250711 253478 255285 255445 254722 253903 252976 252160 252643 255195 258763 261577 263227 264516
54430 264516 265619 265674 264317 262479 261356 261310 262053 263246 264628 265966 267174 268364 269774 271724 274351
54415 274351 277112 279003 279693 280126 281491 283975 287057 290579 294683 298866 301939 303073 302475 301222 300911
54400 300911 303019 307610 312621 315332 314928 313173 312395 313243 314479 314377 312093 308142 303891 300485 298166
54385 298166 296686 296122 296821 298518 299964 299659 296963 292586 288183 285289 284220 283913 283027 281216 279281
54370 279281 278165 277957 277790 276671 274471 272131 270684 270194 270054 270179 271222 273453 276107 278152 279122 278986
$$ packed form
54479B55738N259K570J81o09p2L75j09r92j245n07O43J011k68k546l818k935j165
54462B51511n21j112j428q65l19k84p0P19J378J365J170J254J139J90j267k201
54446B50659j803q5J940K767J807J60p23q19r27q16M83K552L568K814J650J289
54430B64516J103N5j357j838j123m6P43J193J382J338J208J190J410J950K627
54415B74351K761J891O90M33J365K484L082L522M104M183L073J134n98j253l11
54400C00911K108M591N011K711m04j755p78Q48J236j02k284l951m251l406k319
54385B98166j480n64O99J697J446l05k696m377m403k894j069l07q86j811j935
54370B79281j116k08j67j119k200k340j447m90j40J25J043K231K654K045R70j36
$$ plain form
54354 278986 278068 277551 279144 283301 288258 291639 292667 292183 291234 290711 291785 295220 300078 304211 306375
54339 306375 307126 307455 307395 306367 304305 302069 300946 301803 304332 307077 308530 308215 306497 303731 300293 297139
54323 297139 295348 294933 294768 293955 292584 291066 289520 288319 288542 291003 294892 298053 298928 298073 297577 298982
54307 298982 302020 305516 309138 313539 318775 323560 326714 328591 330256 331832 332745 333247 334335 335958 336563
54292 336563 335024 332150 329643 328184 327202 325943 323963 320885 316601 311756 307298 303278 298623 292532
54278 292532 285793 280215 276831 275094 273873 272732 271957 271809 272262 273171 274129 274408 273711 272827 272732 273174 273099
54261 273099 272529 272810 274628 276956 278561 279461 280051 279963 278933 277856 277627 277613 276653 275013 273898 273484 273020
54244 273020 272575 272907 273608 273253 271669 270261 269517 268098 265395 263224 263450 265227 266349 266430 266839 267745 267255
$$ packed form
54354B78986r18n17J593M157M957L381J028m84r49n23J074L435M858M133K164
54339C06375P51L29o0j028k062k236j123Q57K529K745J453l15j718k766l438l154
54323B97139j791m15j65q13j371j518j546j201K23K461L889L161Q75q55m96J405
54307B98982L038L496L622M401N236M785L154J877J665J576R13N02J088J623O05
54292C36563j539k874k507j459r82j259j980l078m284m845m458m020m655o091
54278B92532o739n578l384j737j221j141p75j48M53R09R58K79o97q84r5M42p5
54261B73099n70K81J818K328J605R00N90q8j030j077k29j4r60j640j115m14m64
54244B73020m45L32P01l55j584j408p44j419k703k171K26J777J122Q1M09R06m90
$$ plain form
54227 267255 264037 259466 256364 256276 258526 261370 263433 264300 264335 264065 263486 261963 258994 255101 251783 250374
54211 250374 251039 252976 255456 258302 261438 264573 267587 270694 273705 275587 275373 273373 270906 269052 268260
54196 268260 268764 270465 272372 273176 272653 271820 271518 271613 271771 272149 272837 273388 273439 273154 272594 271380 269595 268259
54178 268259 268063 268182 267264 265205 262989 261146 259567 258766 259959 263332 267179 269503 269957 269672 269656 270047
54162 270047 270519 270658 269986 268319 266217 264578 263707 263275 263179 263807 265160 266438 267016 267290 267945 268877 269542
54145 269542 269971 270482 270671 269859 268600 268409 269601 270573 269935 268316 267217 266990 267018 267073 267245 267068 266141 265466
54127 265466 266785 270350 274340 276710 276840 275362 273408 272244 272703 274479 276524 278266 279868 281368 282466
54112 282466 283288 284398 285741 286475 286266 285846 285809 285646 284572 282623 280388 278253 276482 275470 275269 275288 274943
$$ packed form
54227B67255l218m571l102q8K250K844K063Q67L5k70n79j523k969l893l318j409
54211B50374O65J937K480K846L136L135L014L107L011J882k14k000k467j854p92
54196B68260N04J701J907Q04n23q33l02R5J58L78O88N51N1k85n60j214j785j336
54178B68259j96J19r18k059k216j843j579q01J193L373L847K324M54k85j6L91
54162B70047M72J39o72j667k102j639q71m32r6O28J353J278N78K74O55R32O65
54145B69542M29N11J89q12j259j91J192R72o38j619j099k27K8N5J72j77r27o75
54127B65466J319L565L990K370J30j478j954j164M59J776K045J742J602J500J098
54112B82466Q22J110J343P34k09m20l7j63j074j949k235k135j771j012k01J9l45
$$ plain form
54095 274943 274191 273081 271462 269697 268934 269793 271259 271681 270589 268747 266771 264671 262663 261457 261429 262088
54079 262088 262590 262445 261693 260883 261010 262944 266573 270709 274029 276001 276879 277068 276770 276144 275547 275388 275670
54062 275670 275849 275347 274268 273506 274096 276450 280028 283615 286103 287272 287778 288235 288720 289461 291401 295111
54046 295111 299232 301128 299590 296310 294256 295058 298176 301998 305232 307601 309686 312087 314706 317108
54032 317108 319441 322272 325477 328133 329769 330884 331738 331452 329034 324750 319866 315518 312428 311040 311132
54017 311132 311678 311861 311899 312277 312691 312698 312970 314889 318955 324404 330240 335777 340328 343383 345254 346786 348329
54000 348329 349706 351060 352783 354532 355415 355515 356177 358234 360625 361455 359856 356418 352536 350012 350516
53985 350516 354296 359588 364232 367896 371978 377411 383509 389343 395380 402999 412704 423519 434121 444065
$$ packed form
54095B74943p52j110j619j765p63Q59J466M22j092j842j976k100k008j206k8O59
54079B62088N02j45p52q10J27J934L629M136L320J972Q78J89k98o26n97j59K82
54062B75670J79n02j079p62N90K354L578L587K488J169N06M57M85P41J940L710
54046B95111M121J896j538l280k054Q02L118L822L234K369K085K401K619K402
54032C17108K333K831L205K656J636J115Q54k86k418m284m884m348l090j388R2
54017C11132N46J83L8L78M14PK72J919M066N449N836N537M551L055J871J532J543
54000C48329J377J354J723J749Q83J00O62K057K391Q30j599l438l882k524N04
53985C50516L780N292M644L664M082N433O098N834O037P619R705J0815J0602R944
$$ plain form
53971 444065 453792 463862 474390 484971 494952 503927 512139 520190 528168 535219 540318 543419 545508
53958 545508 547504 549412 550798 551856 553615 556749 560258 561741 559489 554313 548776 544433 540318 534516
53944 534516 526566 517651 508964 500914 493692 487413 481456 474776 467382 460664 455697 451968 448326 444395
53930 444395 440304 435710 430155 424133 418906 415261 413046 411750 410894 409912 408340 406302 404487 403545 403653
53915 403653 404388 404859 404276 402744 401182 400335 400371 401626 404714 409182 413070 414892 415422 416353 417988 419811
53899 419811 422696 428313 436315 444333 451459 459623 470416 482460 493651 504454 516748 530204 542074
53886 542074 550418 555458 557605 556379 552288 548082 546582 547951 550198 551861 553214 555216 558396 562766
53872 562766 567987 573424 578557 583393 588005 591771 593788 594210 594513 596091 599095 603032 608017 614805 623796
$$ packed form
53971D44065R727J0070J0528J0581R981Q975Q212Q051P978P051N099L101K089
53958E45508J996J908J386J058J759L134L509J483k252n176n537m343m115n802
53944E34516p950q915q687q050p222o279n957o680p394o718m967l729l642l931
53930D44395m091m594n555o022n227l645k215j296q56r82j572k038j815r42J08
53915D03653P35M71n83j532j562q47L6J255L088M468L888J822N30R31J635J823
53899D19811K885N617Q002Q018P126Q164J0793J2044J1191J0803J2294J3456J1870
53886E42074Q344N040K147j226m091m206j500J369K247J663J353K002L180M370
53872E62766N221N437N133M836M612L766K017M22L03J578L004L937M985O788Q991
$$ plain form
53857 623796 634526 646059 657394 667607 676278 684052 692319 701977 712765 724025 735642 747678
53845 747678 759350 769240 776739 782578 787391 790379 790288 787520 784148 781508 778743 774382 768480 762146
53831 762146 755664 748618 741659 736256 731990 725712 714729 699982 684815 671299 659113 647469 636349
53818 636349 625649 614657 603117 591890 582000 573630 566270 559155 551375 542470 533259 525177 518381
53805 518381 511428 503369 495206 488525 483578 479591 476167 473160 469639 464344 457405 450717 446292 444620
53791 444620 444646 444878 444391 443035 440715 436761 430583 423075 416447 412040 409070 406235 403771 402785 403151 403444
53775 403444 402876 402079 401874 402397 403561 405285 406899 407385 406735 406284 407102 408683 409731 409715 409180 408955 409505
53758 409505 410646 411619 411816 411729 412659 415193 418553 421797 424942 428233 430991 432256 432479 433656 437631 444808
$$ packed form
53857F23796J0730J1533J1335J0213Q671P774Q267R658J0788J1260J1617J2036
53845G47678J1672R890P499N839M813K988r1k768l372k640k765m361n902o334
53831G62146o482p046o959n403m266o278j0983j4747j5167j3516j2186j1644j1120
53818F36349j0700j0992j1540j1227r890q370p360p115p780q905r211q082o796
53805E18381o953q059q163o681m947l987l424l007l521n295o939o688m425j672
53791D44620K6K32m87j356k320l954o178p508o628m407k970k835k464r86L66K93
53775D03444n68p97k05N23J164J724J614M86o50m51Q18J581J048j6n35k25N50
53758D09505J141R73J97q7R30K534L360L244L145L291K758J265K23J177L975P177
$$ plain form
53742 444808 454501 465726 477336 488122 497527 506132 514894 523897 532243 539248 545335 551448 557832
53729 557832 563847 568963 573502 578106 582790 586885 589784 591285 591214 589294 585760 581767 578629 576563 574518
53714 574518 571334 566787 561395 555588 549541 543567 538052 532788 526969 520099 512479 504427 495585 485737
53700 485737 475927 467810 461866 457076 452452 447992 443878 439758 435497 431857 429540 427886 425391 421499
53686 421499 417320 414570 414072 415204 416494 416824 416106 414690 412367 408719 404411 401029 399146 397604 395519
53671 395519 393961 394505 396890 399505 401622 403613 405252 405617 404984 405189 407343 410311 412268 412795 412644 412251
53655 412251 411505 410632 410367 411297 413561 417173 422223 428714 436287 444055 450759 455490 458441 460706 463233
53640 463233 466140 469050 471728 474327 477279 481005 485504 490293 494984 499601 503994 507463 509728 511799
$$ packed form
53742D44808R693J1225J1610J0786R405Q605Q762R003Q346P005O087O113O384
53729E57832O015N116M539M604M684M095K899J501p1j920l534l993l138k066k045
53714E74518l184m547n392n807o047n974n515n264n819o870p620q052q842r848
53700D85737r810q117n944m790m624m460m114m120m261l640k317j654k495l892
53686D21499m179k750m98J132J290L30p18j416k323l648m308l382j883j542k085
53671C95519j558N44K385K615K117J991J639L65o33K05K154K968J957N27j51l93
53655D12251p46q73k65R30K264L612N050O491P573P768O704M731K951K265K527
53640D63233K907K910K678K599K952L726M499M789M691M617M393L469K265K071
$$ plain form
53626 511799 514763 517852 519057 517846 516012 515303 515419 515117 514184 513312 512764 512296 511865 511419 510389 508420
53610 508420 506389 505626 506152 506647 506303 505857 506508 508497 511122 513647 515727 517138 517491 516306 513430 509471
53594 509471 505704 503353 502909 504206 506816 510030 512720 513912 513748 513478 514183 515619 516583 516297 515210 514486
53578 514486 515034 517163 520844 525719 530869 535158 538242 540918 544062 547536 550627 553274 556121 559342
53564 559342 562247 564337 566200 568929 572963 577839 582956 588356 594868 603375 613636 623934 632360 638451
53550 638451 643157 647482 651949 657295 664393 672879 680782 686419 690176 693660 697555 701125 703537 704836
53536 704836 705704 706976 709401 713233 717858 722245 725812 728654 730982 732737 733647 733359 731579 728436 724669
53521 724669 721200 718568 716909 716142 715818 715095 713388 710959 708376 705518 701626 696468 691015 686861 685125
$$ packed form
53626E11799K964L089J205j211j834p09J16l02r33q72n48m68m31m46j030j969
53610E08420k031p63N26M95l44m46O51J989K625K525K080J411L53j185k876l959
53594E09471l767k351m44J297K610L214K690J192j64k70P05J436R64k86j087p24
53578E14486N48K129L681M875N150M289L084K676L144L474L091K647K847L221
53564E59342K905K090J863K729M034M876N117N400O512Q507J0261J0298Q426O091
53550F38451M706M325M467N346P098Q486P903N637L757L484L895L570K412J299
53536G04836Q68J272K425L832M625M387L567K842K328J755R10k88j780l143l767
53521G24669l469k632j659p67l24p23j707k429k583k858l892n158n453m154j736
$$ plain form
53506 685125 685771 687618 689053 689192 688416 687551 686727 685594 684573 685065 688040 692894 698178 703024 707329 710833
53490 710833 712971 713862 714737 716820 720142 724078 728728 734868 742391 749839 756130 762057 769205 777829 786772
53475 786772 795290 803840 812985 822658 832959 844686 858347 873297 888569 904136 920724 938762
53463 938762 958162 978734 1000214 1022095 1044111 1066780 1090963 1117045 1144989 1174872 1206665
53452 1206665 1239563 1272336 1304673 1337798 1373510 1412547 1453845 1495308 1535604 1575289 1615735
53441 1615735 1656823 1696496 1733219 1768270 1804458 1842749 1881213 1917448 1951071 1983479 2016070
53430 2016070 2049403 2083522 2118098 2152185 2184495 2214470 2243000 2271739 2301455 2331077 2358647
53419 2358647 2383295 2406085 2428838 2452364 2475899 2497840 2516797 2532347 2545207 2556474 2566399
$$ packed form
53506F85125O46J847J435J39p76q65q24j133j021M92K975M854N284M846M305L504
53490G10833K138Q91Q75K083L322L936M650O140P523P448O291N927P148Q624Q943
53475G86772Q518Q550R145R673J0301J1727J3661J4950J5272J5567J6588J8038
53463I38762J9400K0572K1480K1881K2016K2669K4183K6082K7944K9883L1793
53452A206665L2898L2773L2337L3125L5712L9037M1298M1463M0296L9685M0446
53441A615735M1088L9673L6723L5051L6188L8291L8464L6235L3623L2408L2591
53430B016070L3333L4119L4576L4087L2310K9975K8530K8739K9716K9622K7570
53419B358647K4648K2790K2753K3526K3535K1941J8957J5550J2860J1267R925
$$ plain form
53408 2566399 2574066 2578426 2579117 2575956 2568284 2555609 2538617 2518854 2497623 2475738 2453922 2432458
53396 2432458 2410509 2386669 2360404 2332328 2303094 2272739 2241152 2208459 2174879 2141006 2108290
53385 2108290 2078339 2051431 2026490 2002700 1980241 1959231 1939176 1920192 1903651 1890506 1879681
53374 1879681 1869327 1859381 1851746 1847996 1847836 1849905 1853319 1858266 1865676 1876455 1890657 1907381 1925795
53361 1925795 1946025 1968592 1993410 2020140 2049202 2081310 2115991 2151803 2188452 2227589 2270769
53350 2270769 2317513 2366225 2416327 2468515 2523325 2580505 2639644 2700525 2762925 2826923 2893409
53339 2893409 2963395 3036669 3111967 3188603 3267047 3347600 3429516 3512002 3595220 3679543 3764522
53328 3764522 3849529 3934832 4020832 4106367 4188876 4266520 4339442 4408876 4475713 4540170 4602074
$$ packed form
53408B566399P667M360O91l161p672j2675j6992j9763k1231k1885k1816k1464
53396B432458k1949k3840k6265k8076k9234l0355l1587l2693l3580l3873l2716
53385B108290k9951k6908k4941k3790k2459k1010k0055j8984j6541j3145j0825
53374A879681j0354r946p635l750j60K069L414M947P410J0779J4202J6724J8414
53361A925795K0230K2567K4818K6730K9062L2108L4681L5812L6649L9137M3180
53350B270769M6744M8712N0102N2188N4810N7180N9139O0881O2400O3998O6486
53339B893409O9986P3274P5298P6636P8444Q0553Q1916Q2486Q3218Q4323Q4979
53328C764522Q5007Q5303Q6000Q5535Q2509P7644P2922O9434O6837O4457O1904
$$ plain form
53317 4602074 4660912 4715907 4766344 4811605 4850811 4882836 4906956 4923249 4932289 4934596 4930265 4918650
53305 4918650 4898373 4868151 4827765 4777976 4719714 4654072 4582998 4508864 4432725 4353688 4270658
53294 4270658 4184255 4096454 4008894 3922335 3837432 3755028 3675464 3598287 3522949 3449420 3377838
53283 3377838 3307837 3238580 3169561 3101259 3034791 2970842 2909114 2849116 2791360 2737248 2687640
53272 2687640 2642012 2599275 2559107 2522121 2489001 2459787 2433934 2410813 2390100 2371542 2354240
53261 2354240 2336486 2317058 2296681 2277501 2260807 2245828 2231023 2215940 2201460 2188871 2179208
53250 2179208 2172917 2169497 2167844 2167527 2169397 2174425 2182347 2192019 2202691 2214298 2226873 2240516 2255727
53237 2255727 2273010 2292211 2312918 2335459 2360790 2389327 2420443 2453261 2487442 2523015 2559713
$$ packed form
53317D602074N8838N4995N0437M5261L9206L2025K4120J6293R040K307m331j1615
53305D918650k0277l0222m0386m9789n8262o5642p1074p4134p6139p9037q3030
53294D270658q6403q7801q7560q6559q4903q2404p9564p7177p5338p3529p1582
53283C377838p0001o9257o9019o8302o6468o3949o1728n9998n7756n4112m9608
53272B687640m5628m2737m0168l6986l3120k9214k5853k3121k0713j8558j7302
53261B354240j7754j9428k0377j9180j6694j4979j4805j5083j4480j2589r663
53250B179208o291l420j653l17J870N028P922R672J0672J1607J2575J3643J5211
53237B255727J7283J9201K0707K2541K5331K8537L1116L2818L4181L5573L6698
$$ plain form
53226 2559713 2596564 2632039 2664849 2694872 2723060 2750086 2775417 2798086 2817996 2835727 2851266
53215 2851266 2863585 2871551 2874692 2873099 2867045 2856755 2842212 2823263 2800128 2773602 2744359 2712289
53203 2712289 2676992 2638644 2597921 2555251 2510693 2464390 2416674 2367872 2318382 2268670 2218728
53192 2218728 2168011 2116473 2065286 2015825 1968305 1922174 1877402 1834337 1792510 1750740 1708593
53181 1708593 1666812 1626169 1586679 1548069 1510194 1472796 1435635 1399125 1364256 1331685 1301359
53170 1301359 1273001 1246335 1220935 1196607 1173923 1153576 1135227 1117841 1101184 1085903 1071865
53159 1071865 1057491 1041287 1023345 1004831 986525 968226 949120 928460 906350 884026 862879
53148 862879 843267 824831 807670 792255 778319 765102 752754 742058 732449 721859 709260 695989
$$ packed form
53226B559713L6851L5475L2810L0023K8188K7026K5331K2669J9910J7731J5539
53215B851266J2319P966L141j593o054j0290j4543j8949k3135k6526k9243l2070
53203B712289l5297l8348m0723m2670m4558m6303m7716m8802m9490m9712m9942
53192B218728n0717n1538n1187m9461m7520m6131m4772m3065m1827m1770m2147
53181A708593m1781m0643l9490l8610l7875l7398l7161l6510l4869l2571l0326
53170A301359k8358k6666k5400k4328k2684k0347j8349j7386j6657j5281j4038
53159A071865j4374j6204j7942j8514j8306j8299j9106k0660k2110k2324k1147
53148H62879j9612j8436j7161j5415j3936j3217j2348j0696r609j0590j2599j3271
$$ plain form
53136 695989 683642 672021 660362 649346 640140 632046 622837 611467 599117 587565 577603 569089
53124 569089 561361 553237 543600 532655 522168 513976 508398 504267 500275 496131 492521 490077 488380 486133
53110 486133 482408 477543 472732 468940 466396 464791 463661 462713 462008 461673 461298 459868 456628 452037 447695
53095 447695 445228 444931 445343 444467 441789 438839 437267 436919 436563 436055 436368 437563 438288 437783 436947 436640 436252
53078 436252 435061 433870 433902 434739 434856 433880 432959 432946 433434 433780 434030 434517 435287 436314 437820 440082 443143
53061 443143 446743 450282 452997 454481 454999 455094 455091 455093 455041 454565 453350 452063 452180 454270 457019 458654 458758 457903
53043 457903 456185 453359 450054 447499 445951 444467 442285 439493 436316 432958 430331 429696 430883 431886
53029 431886 431023 428831 426979 425823 424042 420619 416393 413380 412883 414419 416227 416625 415100 412482 410371
$$ packed form
53136F95989j2347j1621j1659j1016r206q094r209j1370j2350j1552r962q514
53124E69089p728q124r637j0945j0487q192n578m131l992m144l610k444j697k247
53110D86133l725m865m811l792k544j605j130r48p05l35l75j430l240m591m342
53095D47695k467k97M12q76k678k950j572l48l56n08L13J195P25n05q36l07l88
53078D36252j191j191L2Q37J17r76r21j3M88L46K50M87P70J027J506K262L061
53061D43143L600L539K715J484N18R5lKn2m76j215j287J17K090K749J635J04q55
53043D57903j718k826l305k555j548j484k182k792l177l358k627o35J187J003
53029D31886q63k192j852j156j781l423m226l013m97J536J808L98j525k618k111
$$ plain form
53014 410371 410189 412195 415129 417258 418118 418831 420355 421991 422335 421246 419843 418789 417844 417239 418064 420485
52998 420485 422619 422336 419693 416591 414348 412683 411028 409611 408808 408374 408022 408172 409286 410717 411123 410148
52982 410148 409026 409194 410797 412850 414362 414808 413944 411896 409401 407381 406137 405315 404530 403555 401999 399554
52966 399554 396804 395069 394990 395717 395974 395593 395481 396196 397157 397376 396755 396476 398008 401630 405995 409329 411018
52949 411018 411790 412562 413525 414315 414569 414267 413918 414332 415650 416748 416315 414633 413444 413908 415468 416891 417492
52932 417492 416993 415319 413269 412479 413774 416180 418304 420061 422175 424655 426824 428450 429869 431263 432690
52917 432690 434558 437124 439683 441121 441199 440562 439779 439206 439520 441219 443504 444637 443708 441373 438667 435866
52901 435866 432819 429721 427083 425188 423931 423143 422963 423734 425271 426389 425860 424033 422676 422711 422999 422090
$$ packed form
53014D10371j82K006K934K129Q60P13J524J636L44j089j403j054r45o05Q25K421
52998D20485K134k83k643l102k243j665j655j417q03m34l52J50J114J431M06r75
52982D10148j122J68J603K053J512M46q64k048k495k020j244q22p85r75j556k445
52966C99554k750j735p9P27K57l81j12P15R61K19o21k79J532L622M365L334J689
52949D11018P72P72R63P90K54l02l49M14J318J098m33j682j189M64J560J423O01
52932D17492m99j674k050p90J295K406K124J757K114K480K169J626J419J394J427
52917D32690J868K566K559J438P8o37p83n73L14J699K285J133r29k335k706k801
52901D35866l047l098k638j895j257p88j80P71J537J118n29j827j357L5K88r09
$$ plain form
52885 422090 420356 419262 419149 419006 418125 416700 414886 412542 410087 408573 408656 410083 412220 414359 415767
52870 415767 416327 417007 418727 420900 422028 421612 420355 418653 416258 413639 412309 413220 415697 418293 419965
52855 419965 420237 419167 417452 415817 414209 412384 411073 411340 412775 413768 413792 413974 415056 416286 416979 417614
52839 417614 418527 418861 417874 416253 415108 414649 414751 415713 417417 418741 418967 418849 419195 419394 418782 418450 419940
52822 419940 422650 424397 424472 424439 425655 427476 428519 428702 429295 431364 434506 437039 437693 437353 438525 442431
52806 442431 447287 450411 451402 451977 453198 454499 455362 456132 456582 455313 451632 446912 443044 440253 437449
52791 437449 434060 430401 426543 422056 416899 411636 406554 401396 396328 392454 390693 390399 389772 387710 384876
52776 384876 382831 382498 383658 385535 387356 388479 388511 387646 386645 386291 386937 388551 390894 393398 395114 395148
$$ packed form
52885D22090j734j094j13j43q81j425j814k344k455j514Q3J427K137K139J408
52870D15767N60O80J720K173J128m16j257j702k395k619j330R11K477K596J672
52855D19965K72j070j715j635j608j825j311K67J435R93K4J82J082J230O93O35
52839D17614R13L34r87j621j145m59J02R62J704J324K26j18L46J99o12l32J490
52822D19940K710J747P5l3J216J821J043J83N93K069L142K533O54l40J172L906
52806D42431M856L124R91N75J221J301Q63P70M50j269l681m720l868k791k804
52791D37449l389l659l858m487n157n263n082n158n068l874j761k94o27k062k834
52776C84876k045l33J160J877J821J123L2q65j001l54O46J614K343K504J716L4
$$ plain form
52760 395148 393382 390713 388472 387465 387436 387539 387366 387334 387863 388524 388455 387578 386878 387385 389243 391873 394589
52743 394589 396853 398271 398673 398150 396959 395450 393943 392377 390318 387670 385140 383437 382173 380386 378100
52728 378100 376463 376093 376157 375455 373847 372212 371640 372824 375415 377538 376838 372723 367099 362537 360400 361010
52712 361010 364264 368985 372738 373811 373095 372814 373791 375116 376099 376963 377627 377356 376178 375416 376097 377672
52696 377672 378940 379528 379874 380416 381437 383237 385678 387922 389242 390001 391282 393609 396499 399201 401425
52681 401425 403271 404901 406534 408442 410585 412333 412960 412615 412534 413949 416793 419793 421828 422870 423503
52666 423503 423974 424142 424111 424363 425068 425516 424440 421080 415966 410610 406284 403124 400539 398324 397025 397259
52650 397259 399089 402074 405455 408146 409161 408479 407193 406477 406646 407345 408256 409254 410214 411057 411793 412322 412471
$$ packed form
52760C95148j766k669k241j007k9J03j73l2N29O61o9q77p00N07J858K630K716
52743C94589K264J418M02n23j191j509j507j566k059k648k530j703j264j787k286
52728C78100j637l70O4p02j608j635n72J184K591K123p00m115n624m562k137O10
52712C61010L254M721L753J073p16k81R77J325R83Q64O64k71j178p62O81J575
52696C77672J268N88L46N42J021J800K441K244J320P59J281K327K890K702K224
52681D01425J846J630J633J908K143J748O27l45q1J415K844L000K035J042O33
52666D23503M71J68l1K52P05M48j076l360n114n356m326l160k585k215j299K34
52650C97259J830K985L381K691J015o82j286p16J69O99R11R98R60Q43P36N29J49
$$ plain form
52633 412471 412493 413076 414563 416535 418509 420602 422986 425007 425461 423753 420542 417389 415864 416464 417992
52618 417992 418443 416937 414447 412260 410399 408314 406553 406516 408470 410709 411158 409410 406884 405239 404866
52603 404866 404930 404806 405159 407179 410758 414251 416377 417719 419770 423107 427174 431402 435749 440358 445299
52588 445299 450361 454607 456596 455791 453393 451092 449385 447763 445925 443799 440871 436820 432626 429845
52574 429845 428766 428421 428337 429029 430629 432394 433985 436123 439384 443167 446253 447658 446752 443560 439344
52559 439344 435911 433851 432328 430902 430370 431215 432474 433153 433737 435053 436380 436116 434062 431792 430700
52544 430700 430723 431138 431686 432477 433376 434058 434545 435409 437307 440184 442968 444340 443905 442406 440863 439940 440094
52527 440094 441509 443518 444832 444964 444888 445662 446897 447363 446677 445516 444389 443203 442158 442145 443764 446316
$$ packed form
52633D12471K2N83J487J972J974K093K384K021M54j708l211l153j525O00J528
52618D17992M51j506k490k187j861k085j761l7J954K239M49j748k526j645l73
52603D04866O4j24L53K020L579L493K126J342K051L337M067M228M347M609M941
52588D45299N062M246J989q05k398k301j707j622j838k126k928m051m194k781
52574D29845j079l45q4O92J600J765J591K138L261L783L086J405r06l192m216
52559D39344l433k060j523j426n32Q45J259O79N84J316J327k64k054k270j092
52544D30700K3M15N48P91Q99O82M87Q64J898K877K784J372m35j499j543r23J54
52527D40094J415K009J314J32p6P74J235M66o86j161j127j186j045j3J619K552
$$ plain form
52511 446316 448149 447989 446029 443856 443082 443652 443780 442117 439692 438838 440251 442111 442509 441779 441624 442635
52495 442635 443785 444182 444195 444479 444804 444560 443922 443728 444245 444698 444170 442448 439859 436822 433972 432234 432104
52478 432104 432938 433497 433364 433417 434783 437552 440699 443019 444100 444568 445557 447773 450910 454032 456529 458554
52462 458554 460514 462341 463456 463406 462387 461056 459915 459095 458787 459482 461309 463290 464120 464003 465080 469314
52446 469314 476241 483320 488212 490230 489979 488474 486623 484799 482643 479593 475541 470733 465388 460087
$$ packed form
52511D46316J833j60j960k173p74N70J28j663k425q54J413J860L98p30j55J011
52495D42635J150L97J3K84L25k44o38j94N17M53n28j722k589l037k850j738j30
52478D32104Q34N59j33N3J366K769L147K320J081M68R89K216L137L122K497K025
52462D58554J960J827J115n0j019j331j141q20l08O95J827J981Q30j17J077M234
52446D69314O927P079M892K018k51j505j851j824k156l050m052m808n345n301
$$ [...]
##END NTUPLES=NMR SPECTRUM
##END=
