
##TITLE=UV1015_M1-1003-1002_6269021_UjVlAg0RKP
##JCAMPDX= 6.0         $$ Bruker NMR JCAMP-DX V2.0
##DATA TYPE= NMR SPECTRUM
##DATA CLASS= NTUPLES
##ORIGIN= BRUKER
##OWNER= Administrator
$$ 1.72 TOPSPIN		Version 2.1
$$ 2012-06-01 22:54:12.703 -0500  Administrator@TOPSPIN
$$ Compression mode = diff/dup
##.OBSERVE FREQUENCY= 400.13188235
##.OBSERVE NUCLEUS= ^1H
##.ACQUISITION MODE= SIMULTANEOUS (DQD)
##.ACQUISITION SCHEME= undefined
##.AVERAGES= 8
##.DIGITISER RES= 22
##SPECTROMETER/DATA SYSTEM= spect
##.PULSE SEQUENCE= zg30
##.SOLVENT NAME= COFFEE_calctemp
##.SHIFT REFERENCE= INTERNAL, COFFEE_calctemp, 1, 14.98061
##AUDIT TRAIL= $$ (NUMBER, WHEN, WHO, WHERE, PROCESS, VERSION, WHAT)
$$ ##TITLE= Audit trail, TOPSPIN		Version 2.1
$$ ##JCAMPDX= 5.01
$$ ##ORIGIN= Bruker BioSpin GmbH
$$ ##OWNER= Administrator
$$ $$ C:\Bruker\TOPSPIN/data/COFFEE/nmr/UV1015_M1-1003-1002_6269021_UjVlAg0RKP/10/pdata/1/auditp.txt
$$ ##AUDIT TRAIL=  $$ (NUMBER, WHEN, WHO, WHERE, PROCESS, VERSION, WHAT)
(   1,<2012-06-01 22:54:04.062 -0500>,<Administrator>,<TOPSPIN>,<go>,<TOPSPIN 2.1>,
      <created by zg
	started at 2012-06-01 22:52:57.484 -0500,
	POWCHK enabled, PULCHK disabled,
       configuration hash MD5:
       D5 CA 7A 23 FE 6B EE E2 50 67 74 61 24 F7 5E 3B
       data hash MD5: 64K
       32 B0 7C 88 B5 CD 13 11 77 A6 32 DE AE 65 87 CF>)
(   2,<2012-06-01 22:54:07.906 -0500>,<Administrator>,<TOPSPIN>,<proc1d>,<TOPSPIN 2.1>,
      <Start of raw data processing
       efp LB = 0 FT_mod = 6 PKNL = 1 PHC0 = 0 PHC1 = 0 SI = 32K 
       data hash MD5: 32K
       9A E5 00 88 F1 A4 F6 0F 74 48 79 AE 49 88 1B D0>)
(   3,<2012-06-01 22:54:08.250 -0500>,<Administrator>,<TOPSPIN>,<proc1d>,<TOPSPIN 2.1>,
      <pk PHC0 = 207.6086 PHC1 = 0 
       data hash MD5: 32K
       64 36 20 42 02 E6 A0 8A 11 E8 FA DF 21 BD 57 9E>)
(   4,<2012-06-01 22:54:08.312 -0500>,<Administrator>,<TOPSPIN>,<proc1d>,<TOPSPIN 2.1>,
      <abs ABSG = 1 
       data hash MD5: 32K
       64 F3 13 95 D5 42 A0 D2 F6 B9 E2 6F 02 07 49 42>)
(   5,<2012-06-01 22:54:08.343 -0500>,<Administrator>,<TOPSPIN>,<proc1d>,<TOPSPIN 2.1>,
      <abs ABSG = 2 
       data hash MD5: 32K
       A6 42 7D A8 70 51 79 99 12 C9 4B D9 ED 30 78 61>)
(   6,<2012-06-01 22:54:08.375 -0500>,<Administrator>,<TOPSPIN>,<proc1d>,<TOPSPIN 2.1>,
      <abs ABSG = 3 
       data hash MD5: 32K
       42 99 23 99 AA 04 63 75 6A B0 FE 03 26 8A F8 84>)
(   7,<2012-06-01 22:54:08.406 -0500>,<Administrator>,<TOPSPIN>,<proc1d>,<TOPSPIN 2.1>,
      <abs ABSG = 4 
       data hash MD5: 32K
       96 F4 57 F3 D6 8F 7D EB 21 5E 9D 9C 56 FC 01 15>)
(   8,<2012-06-01 22:54:08.437 -0500>,<Administrator>,<TOPSPIN>,<proc1d>,<TOPSPIN 2.1>,
      <abs ABSG = 5 
       data hash MD5: 32K
       E8 71 52 5B 0C C2 37 D6 E0 BA E6 7D EC 46 5E C3>)
$$ ##END=
$$ 
$$ $$ hash MD5
$$ $$ 4D 19 D9 C5 52 F5 69 52 45 70 2D 82 F2 49 66 95
##$RELAX= 
##$RELAX= 
##$RELAX= 
##$RELAX= 
##$RELAX= 
##$RELAX= 
##$RELAX= 
$$ Bruker specific parameters
$$ --------------------------
$$ [...]
##$TP= (0..7)
150 150 150 150 150 150 150 150
##$TP07= 0
##$TPNAME0= <>
##$TPNAME1= <>
##$TPNAME2= <>
##$TPNAME3= <>
##$TPNAME4= <>
##$TPNAME5= <>
##$TPNAME6= <>
##$TPNAME7= <>
##$TPOAL= (0..7)
0.5 0.5 0.5 0.5 0.5 0.5 0.5 0.5
##$TPOFFS= (0..7)
0 0 0 0 0 0 0 0
##$TUNHIN= 0
##$TUNHOUT= 0
##$TUNXOUT= 0
##$USERA1= <user>
##$USERA2= <user>
##$USERA3= <user>
##$USERA4= <user>
##$USERA5= <user>
##$V9= 5
##$VALIST= <valist>
##$VCLIST= <CCCCCCCCCCCCCCC>
##$VD= 0
##$VDLIST= <DDDDDDDDDDDDDDD>
##$VPLIST= <PPPPPPPPPPPPPPP>
##$VTLIST= <TTTTTTTTTTTTTTT>
##$WBST= 2048
##$WBSW= 25
##$XGAIN= (0..3)
0 0 0 0
##$XL= 0
##$YL= 0
##$YMAX_a= 523156
##$YMIN_a= -646352
##$ZGOPTNS= <>
##$ZL1= 120
##$ZL2= 120
##$ZL3= 120
##$ZL4= 120
##$ABSF1= 14.98061
##$ABSF2= -5.57192
##$ABSG= 5
##$ABSL= 3
##$ALPHA= 0
##$AQORDER= 0
##$ASSFAC= 0
##$ASSFACI= 0
##$ASSFACX= 0
##$ASSWID= 0
##$AUNMP= <proc_prof1d_extract_pilot.lims>
##$AXLEFT= 0
##$AXNAME= <>
##$AXNUC= <1H>
##$AXRIGHT= 0
##$AXTYPE= 0
##$AXUNIT= <>
##$AZFE= 0.1
##$AZFW= 0.1
##$BCFW= 0
##$BC_mod= 0
##$BYTORDP= 0
##$COROFFS= 0
##$CY= 15
##$DATMOD= 1
##$DC= 0
##$DFILT= <>
##$DTYPP= 0
##$F1P= 0
##$F2P= 0
##$FCOR= 0.5
##$FTSIZE= 32768
##$FT_mod= 6
##$GAMMA= 0
##$GB= 0
##$INTBC= 1
##$INTSCL= 1
##$ISEN= 128
##$LB= 0
##$LEV0= 0
##$LPBIN= 0
##$MAXI= 10000
##$MC2= 0
##$MEAN= 0
##$ME_mod= 0
##$MI= 0
##$NCOEF= 0
##$NC_proc= -8
##$NLEV= 6
##$NOISF1= 0
##$NOISF2= 0
##$NSP= 0
##$NTH_PI= 0
##$NZP= 0
##$OFFSET= 14.98061
##$PC= 1
##$PHC0= 207.6086
##$PHC1= 0
##$PH_mod= 1
##$PKNL= yes
##$PPARMOD= 0
##$PPDIAG= 0
##$PPIPTYP= 0
##$PPMPNUM= 2147483647
##$PPRESOL= 1
##$PSCAL= 4
##$PSIGN= 0
##$PYNMP= <proc.py>
##$REVERSE= no
##$SF= 400.13
##$SI= 32768
##$SIGF1= 0
##$SIGF2= 0
##$SINO= 400
##$SIOLD= 32768
##$SPECTYP= <>
##$SREGLST= <1H.CDCl3>
##$SSB= 0
##$STSI= 32768
##$STSR= 0
##$SW_p= 8223.68421052632
##$SYMM= 0
##$S_DEV= 0
##$TDeff= 65536
##$TDoff= 0
##$TI= <>
##$TILT= no
##$TM1= 0
##$TM2= 0
##$TOPLEV= 0
##$USERP1= <user>
##$USERP2= <user>
##$USERP3= <user>
##$USERP4= <user>
##$USERP5= <user>
##$WDW= 1
##$XDIM= 32768
##$YMAX_p= 457699694
##$YMIN_p= -689449
##$CURPLOT= <Network HP LaserJet P1505>
##$CURPRIN= <$Network HP LaserJet P1505>
##$DFORMAT= <normdp>
##$LAYOUT= <+/1D_H.xwp>
##$LFORMAT= <normlp>
##$PFORMAT= <normpl>
##$SURQMSG= 1
$$ End of Bruker specific parameters
$$ ---------------------------------
##NTUPLES= NMR SPECTRUM
##VAR_NAME=  FREQUENCY,     SPECTRUM/REAL,   SPECTRUM/IMAG
##SYMBOL=    X,             R,               I
##VAR_TYPE=  INDEPENDENT,   DEPENDENT,       DEPENDENT
##VAR_FORM=  AFFN,          ASDF,            ASDF
##VAR_DIM=   32768,         32768,           32768
##UNITS=     HZ,            ARBITRARY UNITS, ARBITRARY UNITS
##FACTOR=    0.250966925370066, 1,           1
##FIRST=     8223.43324360095, -48903,       300822
##LAST=      0,             -373427,         -60863
##MIN=       0,             -689449,         0
##MAX=       8223.43324360095, 457699694,    0
$$ Real data points
##PAGE= N=1
##DATA TABLE= (X++(R..R)), XYDATA
$$ [...]
23814 -43368 101007 176659 -42981 -187189 84081 -164834 -28548 98087 -330324 -168830 117614
23802 -78454 23474 -423585 -545799 194092 -29157 -62940 214006 29185 35800 -254750 -72425
23790 193358 -212031 4207 98532 65521 201993 12884 -87315 -118649 -62122 283114 -182433
23778 -227341 -132368 -55455 114017 -148269 204343 -101877 239606 157239 -172377 37904
23767 -26442 256535 -99356 67818 -301078 265011 320718 275115 44078 121457 -138701 -29825
23755 152519 82953 -275452 170948 -135992 -196810 414845 -83887 71125 -109744 226382
23744 -85652 13400 -152622 -267968 -59290 -458259 -59004 137112 228841 -216250 148532
23733 -12552 -177366 -100449 -166839 251427 96070 -27103 70068 161755 -48388 -150497 57977
23721 30826 135327 -248576 123322 113574 -108198 50605 18864 -93931 -163981 -108596 -172598
23710 -172598 38985 29707 256770 122877 244298 330631 -58581 161866 134015 188173 -89118
23698 -401801 -302232 -203326 -87877 203639 -72822 -233219 324055 -345501 71452 -161350
23687 77793 -348798 -271896 -382082 -89718 -264129 -7409 115103 -172036 -56250 2002 109452
23676 109452 98 -368904 -286500 -220979 72307 278762 -5064 174928 -39252 56834 106282 100284
23664 100284 -272254 -66590 -44343 -62184 325175 -69823 -364276 71949 -390542 -156266
23653 -136295 -132561 -105690 103296 -46846 171171 228344 295183 87248 -246343 268374 51019
23641 128761 180681 -355309 -78946 167194 12330 61449 156892 159978 134217 -354758 11235
23629 150276 -75594 -152509 -162732 46372 423864 313448 -17822 36689 77210 -71207 -103139
23618 -103139 29807 5564 77757 59582 -174597 100917 12771 582433 -56332 100693 -214676
23606 156045 76628 69731 -78089 174265 59371 38081 -306231 -71149 -91312 116655 37038
23594 -69254 204805 -99456 -27771 -5770 69484 955 47491 183114 32999 -192294 -99971 175060
23581 -1792 -172054 37762 192978 112006 -244753 11707 93812 -15143 398527 127314 -65401
23569 173730 79787 -129615 -224534 106136 -303278 26294 15310 245028 -315930 -90411
23558 -91431 17322 3950 220189 265078 -100474 -198548 99407 -92129 45615 113351 -165820
23546 -176097 51182 64677 -106699 2725 37290 203755 -259077 -20622 -86190 -95916 -87536
23535 -87536 94919 -231412 186655 -303432 111174 46816 -308198 271216 408491 74351
23524 24992 -318253 6694 -120457 316216 -98956 -94490 -4880 -130231 -31768 -92799 -103581
23513 -103581 -94117 -67917 -189305 8568 38518 70400 -155525 -219195 -105071 258886 -130132
23501 85073 -230378 59678 -96069 -6057 -66852 -138009 -23782 -17141 30216 -17681 242334 -26868
23488 75990 -142117 -42799 -26667 14627 158461 444286 -490653 138444 256341 43774
23477 57513 25854 -190784 318280 -10393 -329295 62441 -31423 237323 -204452 169394
23466 -124183 -89368 1834 104158 -193263 -135987 46979 50104 -163242 -157393 -31285 2709 -169885
23453 -59539 184216 199578 12498 -223156 -67688 7752 32646 -177709 98232 -75839 -52438
23442 -52438 113334 203593 439906 -104221 -120373 87851 90048 34062 -65170 351763 -206819
23430 89285 126070 -109238 -21858 -85847 -332444 -57494 79315 71369 -147552 -14135 215759
23418 -85210 -222203 -26229 -218133 131105 23458 225086 172376 -185446 -21939 -86777 -218722
23407 -218722 -87846 24517 169636 248718 170659 36790 -106801 -82831 60783 49433 394365
23396 394365 -243117 130365 -315760 -250057 -196311 446894 259609 63433 -37956 134659
23385 -301379 -76172 -80771 -1125 99896 323697 -230082 82372 180225 -112878 -17228 -55209
23374 -55209 184709 49944 -182291 193341 -38882 87623 123600 -128924 151344 -11553 -32622
23363 -32622 -258960 148412 28774 -520055 76252 -140257 98977 9483 56276 -42077 -25482
23352 -25482 -166739 -149829 -159246 -394966 -176882 -94764 277213 -299338 -1232 -212390 160207
23340 -29152 -103073 -179549 66691 58962 52501 -55125 173877 -250553 -175998 -188359 113869
23328 -18043 111995 -163936 476661 -307394 -51783 -169703 81819 -264471 193925 78001
23317 147826 -202302 87868 16329 191745 -620736 65586 275607 12181 -11194 -279329
23307 -279329 -79222 -99923 125369 -137984 -155527 464614 -263035 4551 -267963 -239186 -37993
23295 123303 -110906 25983 18303 279246 266788 -98152 51208 117920 110584 8566 139933
23284 139933 189286 -348434 -25290 148005 -177932 -48750 -283977 -15202 184870 -147633
23273 107700 -68719 -86923 105389 -254353 -270906 122416 -339024 -385647 -302001 -272474 -399240
23262 -399240 -126240 -292000 122547 -129561 -310585 -416297 -48578 65901 268356 -183963
23251 -48858 174508 43527 -119636 116318 27157 -98263 38336 -104641 5091 64930 -45420
23239 105940 59313 -104247 -96442 -7322 219976 52332 -102803 242145 94082 35138 59815
23228 59815 277468 -1712 -33292 -243465 347208 -206875 25382 110566 156319 -318946 -410627
23217 -410627 169550 -264375 217492 279839 -177304 62891 -131453 90379 36815 -223003
23206 -36793 39491 252982 40602 4014 -57922 -376527 -359863 12519 15942 3494 196731 47309
23193 109088 73497 -109627 -195060 16021 -100179 -51623 -36460 331235 -30821 92319 125571
23182 125571 603574 -369166 -148166 240742 65028 89350 -138830 -217961 65069 -221805
23171 -25586 -114674 -14523 293062 -359941 -126942 -29300 -166264 109322 -127437 -273003
23161 -273003 -33832 -68955 -89879 314047 71158 -47914 -427962 -28551 194738 -14584 279182
23149 282783 -146425 -138316 -107317 -189522 322312 -52302 -39302 252090 -375250 -19365 80241
23137 -192118 71201 -49509 7373 -177521 -294386 -20911 161129 9536 -81491 -37671 16478
23125 259671 230434 -6965 -252115 -98925 -273359 -87707 -134351 338216 -136236 336591 249884
23114 249884 -215581 132167 -122957 269094 248520 217991 -20048 37634 93003 -145447
23103 -169337 100185 161684 -62983 146431 25699 29213 141346 -132018 109928 13272 222789
23092 222789 31771 108550 172265 212848 52722 249848 -160077 277567 -236389 -29711 -35037
23081 -35037 80167 -78572 219194 46308 139698 166568 -9466 174080 -193372 93507 -85567
23069 200884 60665 -81627 170099 -11993 45372 126418 52809 -228227 -174512 81303 26917
23057 125681 -331675 -91329 -226625 46049 -66708 -198030 61860 -205542 -23728 -458207
23047 -458207 -205203 94320 38322 -38874 -56425 28902 -431456 87916 -5633 -144856 -49647
23035 -68791 -39860 104182 -96072 424633 184351 -128340 404069 -165651 -120050 -478391
23025 -478391 58372 -441263 -167515 -224728 -99395 43644 46226 -2456 173526 250320 -16447
23013 -137247 61660 -44351 -260785 155519 229955 -38951 -290547 68131 104212 280568 237582
23002 237582 -134733 -29248 162807 -392820 -67583 -54001 244926 -335528 255966 17209
22991 69617 128245 -154380 -102082 -269988 240040 -1937 -226432 73284 -180169 -22882 -37703
22980 -37703 -170052 -47541 163343 -192634 -67396 -17128 181575 -58890 -290462 -59928 -31133
22969 -31133 -43027 -265634 -149325 156479 -49252 21570 71511 -66575 -202056 -118042 -300918
22958 -300918 -269523 214444 -120514 227154 -26108 -287301 -174632 48557 117406 -27743
22947 -47969 171827 -162997 56563 80776 129520 -88553 -196480 176074 178360 -150441 -174459
22936 -174459 -252842 733 51531 183075 -29118 -191404 185086 -136408 -192829 -60616 -166672
22925 -166672 -438611 51170 46288 89306 -271653 361205 30608 -40167 -268982 80 96554
22914 96554 -57812 13522 -98116 -74015 80872 397 114361 49055 165079 -90623 -229318
22903 -229318 -311234 -310948 400396 172234 -27729 131939 318811 -209726 68191 -73968 -185931
22892 -185931 -274265 -61839 82258 -93146 -438768 40258 53720 3594 421576 110429 -152413
22880 -177590 29567 -75832 -24029 98928 168460 -55868 -99101 -80923 -155048 -416273 -302485
22869 -302485 -379571 177877 69126 150119 -95694 -71626 -81802 -136669 -239489 74312 -20489
22857 -107703 151863 232067 -264846 251948 9896 4245 -217140 -290162 -145264 111633 267494
22846 267494 24323 212586 117898 107640 60732 -208254 -101419 122832 -14796 -27172 72218
22834 158950 -214769 380813 48560 154621 -217837 234165 -212516 -204721 29598 -167641
22823 186054 -35047 -38083 -44168 -219932 -133263 -155650 -67371 -116638 29584 -158048 -166143 158905
22810 -84611 -112869 -165825 171579 -71247 240231 104511 -122444 -166640 -88749 -3798 -208047
22799 -208047 -26257 -108215 -42096 355327 -63387 -247484 -84637 -89475 -233900 130037 47475
22787 171104 68278 -83100 -180555 -281830 -224512 172503 82769 13692 112432 42649 46592
22776 46592 -156304 1849 -183690 -350829 -198164 133666 -117213 -62774 -182345 25399
22765 -219493 -159772 -226378 -38233 -1159 -177591 97634 -83141 -16565 -118647 77024 177322
22754 177322 -115954 -8412 75614 -22032 -266684 -206326 -200983 147264 -8754 -225294 -70069
22742 -62221 -165310 61177 -142459 -221807 -83301 -238584 -92949 -32786 149944 155438 251892
22731 251892 -230336 21041 267113 -134376 -84721 -267137 18514 71859 -47905 10256 -311154
22719 -57254 115527 39379 -125153 273365 -80891 142748 -265247 92474 385128 50564
22708 -77379 -1461 -129565 -130802 288637 -101684 159280 -291878 110083 -103148 136198
22697 -9387 -216266 94641 118882 316071 -10678 158837 63431 66184 -211551 -177723 -112138
22686 -112138 -160947 -114639 237613 -36896 142719 -71978 70540 -128066 -7601 -158142 66887
22674 109122 130162 64715 -22088 -218076 77577 -101385 -2098 78673 -60996 -196530 -37324
22662 -155499 -199632 94993 -63181 -177358 -299889 124053 -176064 -37006 255758 234307
22652 234307 -371326 16932 58545 114991 319643 -178744 219011 -69089 -130631 126506
22641 227509 -28018 -36734 -73872 -158798 52841 -534873 -68159 -314104 -10528 -35277 -189155
22630 -189155 -215395 -6673 201687 -229553 -168649 69318 -99399 94968 116834 -221330 -74829
22618 -321870 134111 34653 121865 36841 209859 -139587 -188713 -215716 -189565 -229676 96338
22606 -263156 13310 -389660 73002 -255649 -66015 70796 -171480 -166470 -68392 -55252 -92302
22595 -92302 -64235 -204662 -25057 -159449 -149854 40953 -223350 -139572 -149419 -93908 47657
22583 282872 -175476 -228906 379961 -203358 -108555 -97701 113038 -124952 290492 81241
22572 -37895 -128332 -117039 -32676 -96594 -538687 178575 -72243 72308 -40083 71925 -226943
22560 -203332 49176 -13176 -240266 -295798 387073 38421 73279 -106052 -106190 -107137 -93697 171592
22547 80753 258265 120653 176319 -48836 127892 -236120 -31953 109685 -54692 188891
22536 147338 -177265 36001 -51696 -222529 -240734 -250980 -137631 -41016 93844 -296952 117361
22524 -44193 -12270 37500 -261828 -114840 153884 -178080 -175711 -103993 149396 144529 -21056
22512 -173319 63739 38598 13863 -264397 3033 -220378 -66553 -129359 128806 178916 -73565
22500 -123146 311114 -73288 4602 -100528 -125193 275578 2560 -29219 22630 181693 -101282
22488 -193612 -42484 -122724 95386 -6988 91981 -220249 -371353 103020 -162695 -91747 -87342
22477 -87342 -154751 -230651 -340301 74194 -304995 -254541 31712 -232062 -79178 -148681 111339
22465 23710 51226 57455 -190870 -83535 -43933 -166086 -46859 121271 283837 -161691 -44379
22453 35884 -261015 -127909 -327009 -170084 -43311 -194013 188458 358726 408369 239263
22443 239263 -172670 2342 125498 -99653 -140734 -259495 -168146 -210159 -83187 -159222 -268983
22432 -268983 -351133 -164513 -104306 121338 170716 -73938 -158510 132971 -40804 115339 -238999
22420 -125863 -52915 160145 135139 -100037 49575 127112 168326 -409196 -51985 -280405 62893
22408 102936 -16804 -211044 -72679 167102 -371909 245772 1261 227377 -517 -15923 325333
22396 -257664 113020 -136386 -199004 36520 -16674 -68928 -80711 -113169 149186 -223071 813
22384 -29183 85084 -305657 -2427 233060 36372 42724 -54894 -205012 420484 230655 372010
22373 372010 -309111 24824 -161672 -136818 85787 -169838 -477997 -271884 -85772 -77167 -88030
22362 -88030 23496 -104654 -298911 -21000 -243926 53765 -365582 -45974 -149670 151800
22351 -148043 69079 -189274 -103715 192703 -174447 -122751 -41008 9051 -123102 -136811 -140158
22340 -140158 128538 164916 80795 49230 -29050 19218 333087 189045 -257067 -24356 8558
22328 -329342 -106368 18594 -222478 -52290 70848 40024 479118 -206683 53674 -291340
22317 -102472 -88956 141748 153205 -236324 150294 271471 185350 25009 -249189 169695
22306 152449 -218106 112211 193527 -189316 225502 277058 -33753 -134098 63530 -6638 -252633
22295 -252633 177565 -263694 -17992 -220483 -99960 199587 -4552 -174420 -195575 -69162 41572
22283 -341839 48445 -150533 -250986 -31521 128879 -52611 -50246 139804 -294321 102113
22272 -234372 -107942 -341355 309314 200236 172890 83502 -296263 -288494 122863 -96501
22261 -245267 11457 50045 -349053 75218 242993 -124672 -158739 -2282 -187676 -311268 -49077
22249 54314 -173509 385718 -430296 -108392 8984 104472 -54920 -145802 96969 -217869 -467708
22238 -467708 -252105 31277 -269397 43703 -212631 -271081 -24810 -36753 40070 -127062 -257317
22227 -257317 -203152 -7305 -290297 250369 27791 -80802 -268894 -269235 -32040 -5167 -142725
22216 -142725 81994 67513 -65222 -174930 308415 -352488 55607 -255640 183650 28770
22205 -101131 -50566 -99973 8243 152057 149469 -13749 -193640 -512078 -13691 -89694 -156841
22194 -156841 -117173 -10039 -141728 -113610 101463 -157550 318537 -139950 191859 203414
22184 203414 -17676 -73610 -117355 -275790 31278 126466 -19845 120187 23453 -457591 -72494
22172 93271 14204 -194572 74133 -231942 128164 223600 122530 -106253 -22061 34137 298033
22161 298033 99296 -171712 15595 -135861 -32537 -208091 207856 -119086 -123522 120747
22150 -60087 236522 -287254 337907 -207645 -227355 239740 343749 -31668 -131068 46882
22139 -38400 -241384 -75049 117276 -131011 -196482 -169563 21668 -17530 -273824 -229608 271067
22127 159361 -352918 -233752 77208 93994 -189147 189885 -83802 -132843 -224520 -290126 -147647
22116 -147647 -67519 203020 48868 261784 -87724 168827 -170654 176789 55009 -30954
22105 227770 391654 -312184 126915 -48019 -105700 -88687 -150137 -187197 -535556 -43659 -60024
22094 -60024 -154943 54491 -210891 -292617 -239511 52161 48930 47792 -99054 -72401 -43660 -260872
22082 -260872 88304 -179191 171550 254017 -54403 -117888 134306 -262604 -211334 -159073 439707
22070 -215168 239604 346231 29158 -369359 187167 62785 -38604 -32617 -63797 -1125 24742
22058 201882 57810 41255 189930 11646 79117 40728 -88470 -99608 -10786 -129157 -383648
22047 -383648 -111260 -202441 80091 383291 -158854 92076 291136 -203856 -21238 -115675
22037 -115675 -410033 76561 32823 131873 36944 -163122 278214 104376 -22454 -258490
22027 -258490 -20441 2379 -355 138490 -108867 -85164 -24367 64335 146736 -133619 256965
22015 8577 115892 -142943 -54452 -95859 20883 -176760 -212565 170008 31812 106945 121558
22004 121558 -39650 -263652 12779 5628 257824 -22145 150380 -255738 -103620 -53163 58145
21992 47700 -5187 377796 20976 330050 -23915 18375 61946 80356 108190 41130 205018
21981 205018 -346359 -140053 36056 187410 97887 52511 200040 -36635 211837 227137
21971 227137 -173850 269818 432912 -44525 -90602 -25569 -149915 -129850 -157725 -63462 -196993
21960 -196993 -118851 -340470 -475657 -17899 -310834 -133774 39321 -216229 -71775 -164101
21950 -164101 259287 -12922 24988 166091 117029 216752 145416 20978 17133 106563 228553
21939 228553 -55597 -24931 103779 -501971 -66570 -22877 121965 173189 199887 -61453 -414692
21928 -414692 -107988 120212 70020 97170 -110375 -85565 -159893 236717 72976 -311054
21917 -67306 112061 147195 -227684 -18349 -44793 60568 -261057 -115522 73407 130716 -92003
21905 192871 -299729 -64455 86296 125102 -114315 -19510 -272876 21220 91113 -64387 -18405
21893 159167 173621 152829 19242 -276943 51455 -151192 304257 178378 -383473 -306183
21883 -306183 -194073 -276818 169601 -13016 134814 143624 -26346 -80939 310594 17228 375903
21872 375903 67391 -106905 156133 207326 -375128 -49175 -202959 -225615 -17346 -60855 122264
21860 -265560 32281 -99403 90772 -62180 -36386 -126830 -344015 81236 -158782 -445786 -206518
21848 -434771 -83557 48389 -12957 -137928 -59347 -42605 2472 116057 330287 -159325 254394
21836 100281 -53062 165553 255757 -141319 56927 68210 91702 104182 180491 17657 -115245
21824 176691 -159260 -255462 -196065 81757 -432047 -197441 132274 -42512 -22259 -177543
21814 -177543 -138666 -195144 -95771 162899 234158 62339 -52418 -145622 -46335 -168613 292324
21802 -242177 -146064 -80966 -272935 -54580 23435 30124 -46282 -176090 196392 -13813 -318186
21791 -318186 -65143 6093 -432792 -299663 111136 -174518 -28218 -148844 -61094 -362256
21781 -362256 332026 79506 81717 63310 -159311 140442 -286757 123067 115338 84756 591095
21770 591095 100788 -128688 -33507 94578 158316 4492 -235493 -315764 37695 197180 10495
21758 -160216 -144001 318349 -146629 78112 69886 -196563 18523 -178705 116685 -256277
21747 50331 -43204 -105522 -222688 -86323 172942 101126 -409762 38599 -38441 144510 -98695
21735 49608 70724 252134 37671 30848 -79113 -134978 73136 -62872 -225041 131067 -71548
21723 -76703 -27890 -17472 160098 -33654 155971 -144746 -46722 -10258 184928 169580 86233
21712 86233 16437 -152138 -262981 56668 45322 -15758 141719 55470 305101 63775 24792
21700 -42346 -126464 -4985 42339 158850 -54381 266993 118804 -110179 -118110 21378 -268756
21688 9791 50866 -78251 180957 222156 -270699 -276026 -126984 -66178 -34016 168759 -289883
21676 -84591 -111363 -11302 -74153 -282417 225600 334446 -151777 103762 -122457 -58690
21665 -335905 121820 -30754 -82223 -140204 -45600 40249 -158324 85033 -49080 498911 -113123
21653 -341727 -12772 -208954 224045 129004 -296241 -638944 131988 22445 -129738 32051
21642 -203688 -18496 136504 -135813 192136 -117111 -120163 91971 -158729 -79261 -202809
21632 -202809 -340852 164956 124372 66879 -48646 -519218 162900 -201213 -184005 12012
21621 -267208 45390 -186805 46545 94425 50332 312322 121417 -383613 101749 235637
21611 235637 -25469 -283062 -122499 -7796 53775 200622 65353 -156012 -192756 31776 224862
21600 224862 -74250 -109956 191790 352498 111423 171686 -93046 -64022 -303760 110805
21589 -225564 -100565 17136 -27380 -80068 -25378 -186998 -73248 -252087 129309 64765 44200
21578 44200 18146 -157275 -93718 -271748 451004 -42494 -163852 -274552 -20027 -42327 -231135
21567 -231135 165128 -99591 -19905 -247622 259474 130710 46490 179793 -127434 22579
21556 -134554 126389 -166910 -104557 -2984 -9657 39673 45168 -130245 78746 -157972 -38653
21544 26430 -71631 93976 -160347 14492 -102416 -147512 89354 -231314 -239161 -132187 403122
21532 -79901 106415 302852 205066 73669 -128982 -88874 -53268 25867 -177850 3434 -109646
21520 2785 -158296 -171601 -120682 -167292 102565 -183 62360 -69754 95853 -175425 62571 -302691
21507 -199063 240542 -126107 -49782 73942 -141898 14724 26652 -77423 -303213 140606
21496 126305 229179 19981 -15717 103700 -95434 -132778 108658 -299804 -161025 119728
21485 -295008 -139586 -123193 -211608 -95970 -30960 -187026 -179604 160301 -372860 -144947 -32781
21473 867 170480 286911 -133154 -101526 -207095 85515 -230223 -163904 -198605 69216 -164005
21461 92363 147433 -108380 -217720 -203237 -50750 -158803 47440 6302 -169214 75490 7407
21449 -185475 33434 -37445 -244910 57415 24505 50814 178314 188618 29276 -68154 -34584
21438 -34584 -17258 -295393 213194 -8882 -195251 -182002 73220 -310849 -36262 -7290 114818
21426 226878 148852 138943 383277 46859 524773 444499 345579 -85038 -108091 9715 -42818
21414 42794 -129169 -22039 -93966 -122588 64156 219398 -82623 -194221 114143 30960 -37009
21402 -225380 -70389 52038 34218 6235 -174787 -36934 -312434 -57322 -345712 136579 1441
21390 -61605 -115311 -325158 37976 61182 -326802 42596 -194707 -37465 11267 11188 86404 -96007
21377 194622 1468 -282745 -64118 -65272 1679 -205035 -117319 -164750 108291 37468 -465802
21365 -217771 72893 -120306 -121464 -74369 -152442 196868 115417 193567 -266301 246072 -87051
21353 20611 -68829 -19100 -294542 72661 -80416 35141 348514 -131594 67390 -265384 -193774
21342 -193774 -97347 -207284 57740 -140686 -117333 -251646 -134607 28319 -96226 -172621 -140170
21331 -140170 292569 188259 -320363 -20524 -345876 -116695 -100352 15409 -122662 -258691
21321 -258691 48684 263489 52408 -6570 -28667 -72753 16558 178246 205412 -3824 158167
21309 -315407 -365676 -233939 -62378 149255 -41693 39276 -78306 18308 -135259 67294 -166053
21297 -73273 -52255 46555 -112038 -213565 -211127 -151481 264626 -22787 65976 134554 112931
21286 112931 280286 -16455 -165347 -60633 156804 -92329 -151514 -43525 57655 -232705 59367
21274 -195031 -106620 92179 -344250 -196913 61700 9913 157139 -57908 -370978 113422 42267
21262 -8771 139442 -295460 -221602 92773 -109717 -308474 105738 -134511 16503 -86245 111839
21250 225290 254 74668 -183882 185162 198271 44706 -47079 -150750 9840 -182522 89049
21238 -5310 -227220 -60191 -224039 90802 -89561 -26564 3113 -253623 234500 -276841 -134694
21226 -114892 -210426 -726 90009 -133239 -83942 -57245 337671 -64512 -157753 213796 -155485
21214 208732 -393629 -263193 57743 -12968 45316 -220526 -144451 -260209 37575 62989 93664
21203 93664 -142370 -30337 -177071 -295951 12902 -131986 -278171 -107394 -119891 161286
21192 149766 189035 -124306 290676 -43135 -73708 -131232 59830 -30816 -144396 -79204 -17881
21180 -130663 27380 39041 -45164 74592 117060 177259 -72325 57227 49578 13702 -141455
21168 -164078 -229248 194160 -159873 -68145 -247197 -43197 42758 268980 -270077 146956
21157 172917 87639 238933 -161711 -89676 177459 95501 -60327 -494563 -153227 -17077
21146 -291916 28906 -117359 -254371 -369425 -170431 -277943 -75724 150842 -425474 163251
21135 -302616 -210931 29576 -18319 -430188 -145800 -88476 -130483 -169983 -168483 -128137 -150945
21124 -150945 -164583 68088 -176524 48083 -94327 78139 97080 242388 178849 -19977 -18862
21113 -18862 -68906 -131718 61383 -91419 -151481 -18946 17436 31761 294508 136036 -121670
21101 -195129 -206338 -385563 -21117 -61595 -44159 337775 72304 -242622 17016 -262790 359111
21089 -210788 207991 -253986 -322907 308928 -91095 -148120 -21799 19313 17507 113677 9894
21077 103827 -209325 -241233 290671 -269479 110814 -23272 21178 175937 -77666 -112429
21067 -112429 308599 -399677 -4288 -278783 -92933 -93930 -96286 -369954 -184846 -277351 -31400
21055 -53666 -345013 -119852 -79897 -13177 -76452 -19250 -26741 -149893 -42183 65458 7705
21043 -159424 66219 240766 -226411 -386201 -206135 -135804 102858 -289565 -90810 -93776
21033 -93776 -279046 -69091 -79810 6049 -160179 114780 193077 60170 -215812 295701 67781
21021 -284017 -17902 -168411 -382705 94376 327663 -28974 -10416 -250208 -66859 197254
21010 -9404 43895 -300037 121215 -79041 -333629 -99652 -250561 -114342 4527 -109189 -349045
20999 -349045 39490 -111848 38979 85220 -7565 -312073 296143 120647 -176023 -102863 -138992
20988 -138992 -149609 164864 -387005 51135 -100675 48663 -234054 -2102 95864 345688 -251318
20976 -77311 -229974 -442119 -64877 -218673 -1802 -233093 240748 -499 -41188 273341 166604
20965 166604 -221861 99675 176568 -129028 -193668 46883 -186313 -282182 -159525 145441
20954 9268 152564 -141677 270672 -54141 -155671 -128176 -78270 149331 87879 -154982 -143314
20943 -143314 -356412 -93033 -334795 -230209 -21496 -111844 -13528 -78142 -208918 -15554 113914
20931 213651 -62934 -120380 54066 -85105 187057 159942 77753 183325 -295829 -104907 101534
20919 108556 -149304 -38390 -119782 181472 -59864 -594 -335730 93917 -253957 -72980 -93478
20908 -93478 95560 155154 -142591 -38335 -253427 -300014 -271913 193484 133567 -154645 -28654
20896 56053 -237804 -53973 -27650 142509 240 -112505 -15170 -157088 -18930 -24985 -155439
20885 -155439 222063 -220855 -173517 -227989 288759 263973 -32254 -9640 -119382 -47554 132581
20873 48426 68470 35328 -64697 -5281 12976 42610 -225175 -159918 -2447 -336054 -71265 -245122
20861 -245122 -362927 19341 91169 404465 -91359 154295 70372 -310805 -73410 -57115 -179613
20850 -179613 -36918 70094 -40142 -206820 -191473 208122 -149863 162661 -117326 -272877
20840 -272877 118879 111407 -92779 119747 -8825 -170861 -152631 -108059 -121969 76055 -128466
20828 -301673 -130705 -99278 223248 -100376 -172628 -442798 195736 -241693 150616 59697
20817 -258811 -174730 -260314 194586 -39977 -136819 -93198 -89054 -51552 63979 -35412 69194
20805 211544 -212616 -217798 -36771 150940 -81293 -220219 -283292 -56964 -39594 -322156 85181
20793 170608 -283417 -97751 34323 -9366 -278 -72272 -108288 151797 -192913 -224274 -17851
20781 -49714 -110653 -24220 -41960 -36246 -40569 232619 -320021 -279735 -180030 -279408 -203645 -336864
20769 -336864 -32543 -284926 141429 187469 129442 -6692 -126000 -10981 12310 208231 -121564
20757 -70863 104472 99961 -198423 3998 -338284 -4239 -167944 -257036 -140396 6379 128957
20746 128957 125395 39703 40426 -45205 113634 31447 131980 479764 -57246 -129654 -189912
20735 -189912 -53576 -89853 -101968 -54678 21317 104072 37396 196255 143884 440886 -20401
20723 125968 445351 -358266 -71554 -73449 -217334 -434111 199841 -135855 8227 39531 132061
20712 132061 103696 -400394 -50171 -22006 99086 -169614 -182505 -217467 78570 -48216 269093
20700 -146019 13954 114026 114628 -197390 36030 -341249 -131314 -55119 87089 -349732 -347554
20689 -347554 52265 306709 -83140 -12448 -243554 -29597 -148055 345120 2596 -192438 -159168
20678 -159168 -28792 -256977 151585 -246438 -58361 -32074 -40754 73075 -124412 -273608 -127298
20666 -528193 22124 175587 -360355 67557 -12687 -138237 -216939 -86301 -338730 -152581
20655 -57365 16399 -357128 -180083 -233807 28857 -22503 -282341 -20543 16787 100653 196844
20644 196844 -220533 -125254 97290 -171675 -187746 -2041 -16468 82333 -242155 -216221 184234
20632 113944 -122878 -435203 -337052 -59868 252221 -349768 184308 -393306 -136021 109973
20621 192466 -101397 239910 -101294 -40404 28035 -144296 -86695 -14236 -273613 -279553 -294590
20610 -294590 116139 -222641 -293363 299728 326245 36971 -68657 -53798 8535 140983 -188519
20598 -56445 -191976 132905 -99994 206866 107192 221165 156638 131976 90445 31515 137222
20587 137222 -10571 -57020 -81547 -56367 -192765 186885 -223701 -73960 -185527 -225593 193090
20575 85382 -26209 -84283 19776 346235 48029 100237 27398 -105294 107465 -256061 38189
20563 135082 -13080 1268 -149683 -333911 -69564 -2952 -366353 -101137 176382 -21803 -107597
20552 -107597 -195138 57454 191617 -117169 -274368 -30109 375814 -303484 -112606 -97683
20542 -97683 -11373 71423 77785 -28903 -100691 -3839 136768 -30371 -11426 -257708 -191127 -155648
20530 -155648 -101932 187287 -281473 -170046 -292823 354112 53553 -140827 -193445 -342709
20520 -342709 -482984 -272634 163080 -117289 63526 -104962 -93228 243366 -177831 -142928
20510 -142928 -1262 -74396 -76144 28478 -90861 -89542 20977 -254472 177180 -177816 114752
20498 -7568 123654 54823 111095 224839 -372065 -66573 -192855 -163546 -102096 -157290 22775
20486 115807 40524 -11977 65787 -212796 -264042 -80788 -200841 -163561 42156 277773 -168102
20474 -40330 109507 -213862 -72144 198517 173440 -109845 -181489 18863 388872 -22050 -76507
20463 -76507 731 -312984 -227363 -94345 -185716 125070 124184 -279239 -39011 137268 -146659
20451 139946 58936 -339807 267812 -172655 -269817 335651 -183599 -1599 39403 -96657 136623
20439 83587 2849 80356 -24571 -282369 86389 -191068 -312539 -321259 -39824 -49606 -172747
20428 -172747 24397 -318415 75772 -39988 41113 -42608 -149459 1611 74361 -98163 -123160
20417 -123160 -148597 115880 240845 17969 121152 -223080 54538 30340 -139528 -229168
20407 -229168 -180006 60931 244365 250056 -191861 -64043 -180362 -47581 -238170 -135351 -127458
20396 -127458 103766 -45049 -187961 -229014 24013 123863 -223289 -214883 126333 -191230 30798
20384 23504 -128304 92752 -80492 -17295 194693 164778 -62532 99634 -123383 -147317 64308
20372 -113581 -96542 71675 -79960 -225958 -266236 -233394 -258572 -464807 -18088 64073 -105105
20360 -112413 -24704 -186599 -94188 72240 -150797 -37393 -50537 -734 329147 236905 214665
20349 214665 -154737 107335 87049 -33916 172142 -17472 71511 44548 69232 -88292 -44620
20338 -44620 -168194 -66787 -159790 -81103 30049 36114 -204961 -16920 52365 -244937 -16360
20326 -65986 231957 -148317 -331904 -396088 -248173 -145687 69053 -218236 10648 27338
20316 27338 -17895 -130878 -9732 144263 132555 -10271 -103022 183582 -184194 89727 34793
20304 52369 -102459 269646 146609 -146210 -543794 -195390 -74038 -298527 -95555 62442
20293 -94162 166852 -183280 -147383 -92548 -34098 -126206 338656 -119894 19009 7615 -163513
20281 -67148 -80568 34428 -151282 271558 -85773 -243623 -232258 -399740 56423 18217 62351
20270 62351 -204189 -117746 -142835 121462 -79092 -199516 69043 -184420 -113745 9106 -68036
20258 173073 -12965 -468380 176602 -97983 112940 -70841 306297 147704 51620 266558
20248 266558 283012 135390 -108817 -107865 -216774 -268210 -492167 -230051 -49208 78897 64724
20237 64724 -95186 85335 -119815 -53113 -191372 39212 86353 -118795 -5489 -136245 -47691
20225 -82946 -476019 -344560 -40942 -247047 215838 -162687 114158 -11009 -370818 -49188
20214 -69424 -186563 -11493 -125525 -21620 -232436 -89599 -100878 -46840 -270230 41992 -130034
20202 -192784 117627 229823 -72394 -154047 -238085 -144800 -31162 -157139 239123 55929 -538444
20190 -27617 155073 -151888 -291925 -54573 -56082 -164091 -224913 244949 -179040 -112984 -50123
20178 112020 136322 84252 6884 316306 -14345 -32229 -316453 115152 172470 -112110 241420
20166 64706 1410 244112 -26085 34516 -358496 -250019 -184764 32562 185191 -235010 35445
20154 68793 -102153 -163794 35735 223648 -229055 -2414 353078 -226977 -107415 95018 122249
20143 122249 -192674 -26638 -13968 -15511 -344328 -183192 -80492 7569 -68626 -52481 316736
20131 8989 -122620 -71190 -90279 218356 -18062 -114463 -93408 87518 -165894 -193555 131608
20119 -20465 157637 249161 143178 -104113 -242064 -13838 -83818 199131 -49307 199950
20108 6818 104564 257282 -119836 226838 -206656 25720 -78445 -229094 -31876 226759 -150563
20096 -140403 -555232 -281300 126059 -83044 -504645 54321 43624 145919 -170419 163820
20085 193537 17235 -204948 -39351 -250972 290043 -330628 -147249 -49895 -156100 -286012
20075 -286012 -24832 26267 44223 -85770 -53623 -36265 316487 -68425 159251 -206757 -63917
20063 -176181 -142762 -215050 -238607 69969 -23212 36526 -44355 131312 -92553 -198161 26847
20051 11172 -52777 -37449 -161929 -9134 -9202 -84105 45263 81184 -156541 -76620 83222 18664
20038 -227116 -122292 104076 16810 -248347 -9972 -26664 -4218 -160595 -130939 -96993 155905
20026 277742 -237308 72035 -103195 10030 -180620 -154647 -177202 62569 12830 66197 300658
20015 300658 -158212 -269662 -312604 -390970 -250417 -145018 82217 -286265 155603 241334
20005 241334 96131 -81695 126336 86304 -94974 66800 -359634 57155 260674 -47511 -146249
19994 -146249 -105698 28333 462316 -191069 -40171 -73064 96797 -50361 -56798 -12599 -72942
19983 -72942 59887 -173468 -265393 243689 118983 -360159 192779 26106 -71341 97265 -57436
19971 -121047 122875 137258 -216465 81518 -17242 -82356 -183097 -334908 -376702 -38140 2149
19959 -74003 -29747 -216876 -337596 127905 60712 219004 106914 168193 78653 -201212
19948 269929 -14385 -35223 -226810 25853 -161101 -201872 -40655 -57258 290201 -81744 -111883
19937 -111883 40853 15402 9796 340457 -34007 242811 90462 -62802 183462 -72403 5997
19925 74126 -354429 -100343 45133 -20865 -93014 -402201 -38222 -6796 -51089 -134678 183366
19913 -82947 128823 -320612 -173482 -20211 -118993 -226154 -163710 56104 -16845 70235 -149298
19901 -37734 -67064 -148542 -3058 -88222 118138 142426 -103207 50479 184054 34959 -177568
19889 103974 286552 -290330 98337 76115 -271337 95052 -88861 58374 -6681 170221 -394425
19877 -131246 65206 -369034 -192852 175349 -98978 84698 139923 -355135 -129872 -30994
19866 -101625 -144282 -255093 -81403 -278521 -146669 -236984 -252917 -9829 252749 -201554 -160061
19855 -160061 -176306 -16916 -229547 253233 -120079 -124095 -22013 79200 -67399 -78014 -145456
19844 -145456 -44392 -209704 6338 183692 -248344 -336688 -23766 -131347 -192647 164449 211631
19833 211631 -166593 41789 302508 193485 -48567 -106170 -168540 -183383 -42115 180875 -183802
19821 -243127 5978 -206522 -54652 413629 -189318 -29629 -75277 25978 220853 -76317 118708
19809 183883 -458550 -83843 128065 -93735 69505 -155271 -41615 44981 -323533 147882
19798 164745 392343 -169666 -31104 -222917 -103513 -190245 -282054 34261 197948 -409611
19787 26332 -303253 -33230 -511334 3479 -110338 -59689 94608 -156242 -256779 -57686 -169125
19776 -169125 -105764 -31755 260170 -221459 111164 -67283 -185208 -162305 -127791 11900 -265973
19764 92517 137291 -254075 198952 102850 -3067 -173914 -107269 -125249 -227768 -70924 102948
19752 -158436 150709 135235 145429 -414451 -258447 -152102 -23530 -64044 148024 -213424
19741 -213037 -271991 -300211 -253044 -80264 54089 -71281 -273449 -310892 -143599 -241604 -226431
19730 -226431 -55749 -138255 -98259 -136969 105868 163112 -36505 -83351 123496 109746 -188052
19718 -111329 -194069 -46857 261737 5535 -190161 99120 -200218 82488 19085 88777 62698
19707 62698 -251940 -37154 87738 -71775 179705 282631 -87255 217956 114385 -142255
19696 -80718 -349399 -28442 -201901 -12799 90416 -85698 -54953 222780 -60807 36302 40575
19685 40575 33882 78723 -85135 39213 -144306 -120842 151134 -118010 -184483 -380342 66691
19673 47235 358220 -161357 -125955 -307175 -53643 129879 -186603 90279 -43882 312234
19662 31209 -356120 40129 76644 -306963 99576 55181 300098 -216905 -23748 -91506 -176335
19651 -176335 -103387 -543486 -78368 -265438 32682 57106 -135834 -385351 -99679 8267 -11626
19639 -12422 44471 -128699 173152 -355111 45627 -40464 227764 231320 257235 -63226 -355454
19628 -355454 -286873 144408 -285077 -178330 168404 321052 96444 96238 -37009 -50720 122734
19616 -111165 29482 -553518 78190 15991 -123300 -189830 -144357 148775 9464 -102906 -179200
19605 -179200 -103208 -98522 -96445 87575 -103365 -57007 -84901 -190918 -191221 -249737 265621 163177
19593 163177 22878 42371 -43907 -198031 -189696 -191495 93786 -153579 -127648 -39609 -41756 22355
19580 -125733 -220140 -301790 -169066 -28306 -95199 -71155 -7711 118071 -128956 148531 -142746
19568 -28997 33844 -14526 134402 51 -32308 -6480 -11994 85157 -140651 -102402 -219453 -369052
19556 -369052 -304832 -81012 -169335 -96706 -276214 -354750 -63834 69363 -25161 -19491 128036
19544 86369 -29645 -82283 95610 30966 -33380 -120528 -292462 -102128 154489 271937 191492
19533 191492 7875 153401 -337477 -36380 21779 -355718 -278906 3028 139952 234627 -111141
19521 -33634 46846 401832 21498 -204974 -200375 213569 -311616 -158379 65817 156222 -220349
19509 -93876 -93956 104330 -187359 139378 -469004 -120299 -46284 -4053 -74930 -127148 22279
19497 -123670 -91873 -129349 270628 -324618 -464827 132533 -84820 -171415 96981 91815 139656
19486 139656 368634 3877 33778 34770 -45070 -103334 -98015 33558 9085 -143796 133240 -188777
19473 -103014 288269 -262900 -8199 16748 126079 284384 111818 19220 -280815 175295
19462 206812 90115 -123078 203073 -109884 193658 150032 -72626 -46194 -190301 -213907
19452 -213907 -33318 -83721 -150789 10628 167640 165452 -23758 -35655 -124258 -261401 -31838
19440 -235416 -7866 -126931 -291359 276514 31041 -131910 -195158 -226435 -413605 74630 -341186
19428 -37176 -194724 42984 -70103 132652 70130 136004 -71979 -188524 -222311 -147561 -42316
19416 -115240 -192368 -48922 -197013 -68320 -88376 131704 105553 -67037 -318753 -328617 -80501
19404 -78728 -146087 29160 -309957 -237908 256312 -38435 -220983 -106096 -294096 -307265 -45377
19392 -90251 -177947 -56532 -37937 -191287 -167269 -143801 -46204 -24196 -8068 -98956 -830 -78773
19380 -78773 -324341 -180869 365625 19404 -107713 96284 -282997 143047 -131751 -150125
19370 -150125 129561 20307 -262202 -12681 -74102 -147611 -61727 -49040 97559 107961 -170605
19358 -211527 166960 -255673 260785 312449 -135973 4930 -153307 -207118 145369 -203848
19347 -131441 83855 -61997 -51233 -62966 -222490 -404105 -201945 -259512 67753 73700 90869
19336 90869 180697 -54327 -102999 -58448 29376 27169 -236998 -406388 -29327 -216969 -394319
19325 -394319 -168360 -12389 -288565 -100255 -113315 196998 93943 169781 109357 -188522
19314 102384 -330976 14918 -92930 -51480 56868 15901 -61050 -58486 208239 292803 42806
19302 -129113 -123909 62973 -76339 -17746 117050 195711 -80907 93818 81792 -274669 -205462
19291 -205462 20528 -51247 -100147 -214352 51467 -88740 74130 134387 126858 -119630 5265
19279 -244162 -195539 42136 53258 220349 -2873 188742 -199401 176064 -372526 44484 -77113
19267 -57571 18703 125739 28593 -386223 284339 -21162 -29959 -337328 -85557 329835 -54990
19255 220232 -39396 -42758 18025 -106342 -143547 -61510 -125090 -179239 -47015 -317347 -246394
19244 -246394 -190287 -87887 -149824 112417 109654 29048 -52851 183185 -34058 -161177 -71926
19232 88476 -8540 -266034 -162789 -68083 -5518 -155691 72950 -154146 -65884 54727 -236806
19220 -82210 39321 236215 -16019 -89248 -488633 278790 -45259 69832 146435 -348587 82886
19208 67080 109192 -238448 -222173 200452 -107692 -151682 -98148 7987 90005 44107 306353
19197 306353 -396182 18335 -117885 168637 -281020 347715 -150319 126958 -71117 -84628
19187 -84628 -167556 8154 19242 -1598 551099 -113940 -293178 40048 100265 126016 -124897
19175 -213129 -29375 -245976 -73532 -293517 -55524 -192020 -72395 -257755 -95650 300071
19164 -175699 67249 10217 27569 -243408 -101709 75863 -68499 -64536 -18182 -60074 -25298
19152 58481 124878 -100028 -119178 -107614 -13445 -14895 -128718 182577 -103135 -375535 -244211
19141 -244211 19505 -86500 849 -194994 275583 99449 -106087 -143659 -77478 23314 54785
19130 54785 -161003 -272658 -234288 -106505 -108437 63204 -90349 -54130 -6505 -51202 -125673
19119 -125673 -13547 16837 -235709 -132824 -4066 65755 39570 7564 -44744 57209 58416 -121210
19106 -84988 -64815 32857 -72366 -174290 -50661 -227102 -155751 -67575 5988 135872 -180594
19094 -5616 78678 -191896 -112730 253409 -100564 -158462 -220538 68095 -285987 -124307 -311
19082 -247071 -49031 213949 -219869 -54602 -1670 222247 -258301 -140541 86801 -277916
19071 12851 -172708 -34128 -60409 101951 47795 -121889 -64366 75125 -18075 453847 52472
19059 -427075 12720 186461 -224739 -77584 -139869 30818 230977 -70263 215178 -168638
19048 -188594 68034 -270938 32475 -137587 181160 67756 107971 -175293 -14356 177052
19037 -104272 696 178150 337155 218967 -135253 -42078 -208494 -213524 112829 -246911 173801
19025 254717 -162892 -32049 -395720 37615 144435 -11512 -251501 -61543 -65546 10025 211494
19014 211494 52883 152864 23429 -226174 84480 105934 -201836 127177 -52890 129586 -184586
19002 -74229 292863 -128198 184121 -60788 101651 -94813 -186520 359813 90469 -296988
18991 -249614 -89650 -272029 -144645 38684 -42747 -118177 -139313 -97776 431184 -109759 22402
18979 -104345 -196176 -132995 -436059 -145171 3502 -23558 232959 -349416 -84103 -158711 179997
18967 -116433 407712 -61771 -259116 54697 -277205 -42556 -169742 12913 -38167 -31288 82354
18955 -93071 -133650 128253 151036 -2185 -168738 -29456 -66540 183590 154219 147579 -62768
18943 -223875 -80701 35699 -263789 -218309 -122157 177520 293611 -3398 -255295 97534 -386832
18931 279515 133874 -253451 87072 263152 -232987 -370703 -155963 -27324 10324 -147659
18920 -203396 -88204 85074 34961 -116494 27045 -221867 -61906 304094 82593 -52633 -306645
18909 -306645 1628 -91679 -129599 432539 -196016 -124178 109485 -68554 -137684 -159288 396232
18897 -65915 -91906 -268466 134199 -72334 158596 -162890 -13998 -92617 186750 -87327 -112510
18886 -112510 -63724 -104201 -47073 161183 224724 -1800 -7799 198876 59885 67030 -24785 -16237
18874 -16237 -192337 -19577 -98660 141888 48563 41217 -250455 -176254 -23984 -108684 -110166
18863 -110166 -191703 -370116 -18144 -76693 -423285 53791 15216 -161968 69269 -37842 231735
18851 -91343 -156385 -53659 165058 145191 2514 -82498 9845 -260626 -39113 33609 -140461
18839 -251915 200230 201131 10300 3450 258930 117599 130893 46364 -77037 36478 177625
18828 177625 -423411 325215 -463330 13254 27205 -339430 -196887 -196369 -51290 -32236 184326
18816 113050 -29449 206015 17782 256692 -20063 254550 159793 37423 142051 -71292 29358
18804 -28997 52423 -107699 276285 -305359 51260 185082 188022 287698 193217 168836 175195
18793 175195 -62153 88771 -281814 267925 -77110 34303 -413591 -84090 -269021 41899 -209293
18781 28949 -229636 -155393 86476 -74209 310713 316259 -27881 127150 246342 101813 -183832
18769 -192925 -169322 -10277 -169605 -141139 -296088 -116402 -442401 -303337 -131031 18300
18758 -770 -248150 -57608 218168 -220975 -189230 150475 39256 38592 -281198 -27739 -19365 -14172
18746 -14172 -100274 -227049 -333279 -108552 -244140 -20145 -210642 -323622 -30038 23468
18735 -24380 -62614 -244755 307653 89171 -191313 234934 96518 130989 -170095 -178765 149491
18723 25620 -254332 264355 -51215 -156015 -188767 -256126 -183121 -1929 -258483 -58722 -205303
18712 -205303 -99542 -82321 -46960 -188435 -170151 -313539 95615 30913 65512 9307 118139
18701 118139 -329037 -123210 -248904 245659 -86808 -252592 82335 135664 36050 -164460
18690 7155 86415 139236 42721 22715 -30444 101254 -172045 -96345 -232236 -40625 -33583
18679 -33583 213205 -185284 143434 -27934 205175 -237746 -90569 -207480 -24769 -72168
18669 -72168 -242510 -19142 122125 -34937 -28476 -15098 34108 -288921 -4040 -82526 -185625
18658 -185625 -96627 149069 -155342 68326 40317 -215344 -21951 -23869 31242 169997 -6712
18646 -1942 -369023 -85887 -3093 174501 -162422 -307403 89056 -382015 -162694 -15104 -194402
18635 -194402 68098 -88694 161001 328741 -65290 -36993 -5396 -110984 509213 137180 -97860
18623 -193350 -390192 -35336 62222 -319442 -141481 -102070 204783 -79559 -17063 28270 -180697
18611 -89493 -309954 -36556 137419 70322 121997 -87678 -152777 -163068 -252177 -292813 187219
18599 17344 133417 -15215 181584 -146289 486930 -188367 -135068 -66011 72736 -110402
18588 306169 -155120 31972 -198940 118371 -32883 -282420 -129670 -34927 -336618 -432200
18578 -432200 -141342 -68371 -356175 -173462 -204290 40843 -502268 -100875 42673 -3252 156700
18566 -296431 -93538 -184516 17723 -21879 -170208 -104529 -43507 139323 51768 -72331 179057
18554 7790 166447 3554 4373 5725 59650 81215 -381690 -259385 -113484 72141 -360537 13149
18541 43831 -138460 -220191 -76008 -328681 12804 -220780 111889 -26982 -75326 -106057 -110303
18530 -110303 219896 70691 -155036 -69988 -212433 -165761 -94687 -185457 -41331 -176240 -14236
18518 -40864 -139133 -147604 -266701 155650 -138531 256271 112561 -471567 -20713 154494
18507 8760 -200801 239674 -118126 170411 2570 -129975 78025 -128862 244516 -58370 223305
18495 -188380 -215741 -181233 26248 -243803 -43278 -327934 194289 -115767 18009 32731 -279582
18483 331620 -444164 -1643 -160105 60750 -125404 -96177 -257599 -162813 -322641 -113579
18472 27292 19340 69738 12228 -85064 175152 -78071 -68444 147633 330737 -105330 -650884
18461 -650884 6338 203600 10209 -1520 -89784 -45255 -185955 117992 240173 88224 -134029
18449 31305 126862 221695 117699 166194 -219668 226087 -14998 -209729 -192651 -237845 66799
18437 6260 251228 -167065 -49672 -71261 -102174 149254 -3766 2015 -32328 220932 -281733
18425 77096 -269513 106625 221525 198335 135125 147263 -211959 -312672 -33487 433436
18414 187139 -181975 -23889 -209466 138173 103680 -85901 -227796 -52032 -248948 245512
18403 -150050 -146987 8791 -224906 135271 208937 99021 52986 -120673 197605 58441 -6139
18391 -187758 12954 -351166 -220209 -121981 -114569 -51013 178075 -454879 308571 30339 -152480
18379 -198184 89439 81664 -99420 -103236 99187 10800 102168 -190898 225164 -152389 -18518
18367 229053 33743 9170 -35071 -347231 -45434 -131941 -139333 -132734 -310561 22987 -368230
18355 -222962 -17103 -209761 -10272 -59331 24581 82396 -284007 -10616 65470 -65189 -32454
18343 47120 16075 -65263 -169981 -180292 172162 -488623 -18287 -164796 -176742 15151 -113711
18331 148615 109383 10047 250168 -118160 31051 375746 390440 180771 -370175 -53597
18320 107392 187388 235035 -137239 240673 -126491 -317210 -36328 230759 78389 -52996
18309 -76989 101954 -45262 18944 -187188 -214591 -236856 90037 108168 -273680 -204753 -66045
18297 112171 17692 87660 -442621 -299626 82425 -241712 -199497 -61471 -174100 -185578 -84136
18285 190171 -275663 -136067 203964 283466 -203920 -15360 -96630 -238378 -17250 -29784
18275 -29784 194953 -167830 5073 247530 -45850 -174015 221340 43289 -28902 135452 104190
18264 104190 -67310 -139876 -41526 -160309 -57528 38895 305895 115962 -81060 -92818 -97630
18253 -97630 -134304 -63696 -43509 -7726 -45066 -23892 15143 -11290 -39044 46239 -122122 -325519
18241 -325519 -116554 83143 -272114 146050 324262 -231513 -298331 -13374 160619 -250780
18230 -165441 -183511 -450955 32542 453188 -105115 -127636 -97714 -120625 -255752 -32062 102381
18218 -5858 -184024 74067 -9930 -207630 -118588 228943 195985 -166099 322258 -66947 -235380
18207 -235380 -152243 -302034 16800 -298505 215708 -61874 -96328 419210 -138848 33358
18196 -115993 62942 -116821 3836 210281 7701 -216011 -226474 -271911 156838 -269216 -1039
18184 91354 -14987 109921 -156128 167394 225142 -22754 28865 -230908 -439143 -190700
18173 -225317 -25084 181479 301885 -265656 197391 -122450 321809 119318 -146221 -23563
18162 -106949 -12292 -129105 -41036 -105693 19295 -148323 -71899 402181 -34772 76770 -92829
18150 -331105 -207562 171787 -104395 56004 -150057 -57307 63495 -67732 -269545 -4719 -240169
18139 -240169 -177202 -28943 58130 -38405 21752 -161268 337518 89525 15959 -53682 -142589
18128 -142589 166102 -64125 270693 -49135 56636 -403 -403283 -198239 -149902 122332 210422
18117 210422 -203549 64639 -97086 189677 -283330 -112145 35453 121459 -106381 -183144
18107 -183144 125136 223815 -24678 -47514 -57375 243869 -97240 -221632 -21068 48111 293052
18096 293052 -213888 -77121 -290015 -59981 -87838 -166826 -275658 -183703 -9161 214415 15075
18084 296704 -57927 -62157 393203 -62703 -192614 280722 176774 92831 -74571 63610 -192479
18072 -105402 -246467 -204776 -224117 -149958 -255751 -143309 -16414 123452 28908 -252576
18061 -108404 -218037 -109937 131001 31736 145880 60679 2624 -218049 333559 26261
18050 -138732 -169956 -85957 -292960 -1328 76459 192765 -143251 141168 8374 297495 86287
18038 -61869 266294 -268126 41013 111744 167176 97355 -290546 -147978 -121287 34146 -210012
18026 335780 -23325 15 -53861 -394116 401160 -362172 211605 -126268 -61952 71940 -189245
18014 154030 103889 -3866 46943 -235279 -33353 93778 10162 125605 -71503 242246 134694
18003 134694 -73360 -256430 -213455 241374 -179015 -212741 270431 23118 355641 -77161
17992 106983 993 -53581 -181134 -47089 -40581 -128716 -333023 -124119 -160705 -399585 85541
17980 46803 -428658 60393 -179713 -200089 -265509 -1913 -176745 -61874 48252 -273840 -320493
17969 -320493 -48838 -52172 17057 -156564 64931 29326 -176482 25742 34517 -295755 -118930
17957 -133282 -297779 55844 -218361 374296 -8056 -168455 -73304 29783 162038 82519 -70789
17945 123916 252344 113572 238524 52578 79275 177057 -39220 158649 62306 -29225 -16268
17934 -16268 -37042 75064 -63868 85527 -41923 -91414 60200 -537904 -203788 60936 -167062
17922 -176298 54158 -269351 -586147 -159331 -33688 -489949 114076 14004 -15858 143752
17911 115314 -289797 -97241 98482 -119054 110719 201919 328888 -65142 -62180 -307308 -262714
17900 -262714 16363 111978 173948 -110468 363365 50110 -371249 74314 -8194 -47331 13660
17888 -49242 -81323 287992 -94849 -478698 132066 -44755 -18604 -11492 61580 -115418 -15064
17876 87700 233751 40998 171892 199346 -70848 242101 -82719 88757 -78537 -112450 41496
17864 267930 174445 91565 157221 -339688 -257707 170148 -156243 -222185 352700 45751 138397
17853 138397 39072 91866 -134638 -251955 27874 60992 446695 15570 -12349 -327068 240081
17841 354912 85286 -205860 199673 -101876 45698 -102181 -215634 -487860 -131274 169558
17830 -233503 -304898 1412 -164830 35319 85395 59167 -135396 -315301 60303 111568 -154273
17818 97206 -11811 20790 96838 173779 -46439 51282 -58647 187249 149558 -110777 -158232
17807 -158232 -114713 109259 244863 67996 299239 219166 103016 106048 -140148 -168151 -306437
17796 -306437 94131 -179474 159888 161872 113032 -223926 -320414 -71558 -10968 46938 34204
17785 34204 286878 -270834 241894 -182087 -241329 212508 -23104 68963 118470 352665
17775 352665 -202170 52361 -29245 -23031 219091 106200 -34570 -65019 8877 18898 -10396
17763 -140730 97444 148964 -75730 180388 -179008 -90052 -42761 -176215 -266381 -63792 -201759
17752 -201759 305784 53827 27004 170846 329480 86706 333414 444752 150836 -155993
17741 249721 -103098 -235557 -118739 -382521 204120 37908 -132522 75055 278945 57067
17730 -37073 104610 252075 113913 -22920 -22272 -1164 -275772 -47081 67047 177267 -179470
17718 126448 -77254 179630 17154 -78350 153138 55074 -150671 82979 208969 53740 -178458
17706 41168 -52309 -198686 -35818 -52969 80305 -62205 -159532 -40083 -263122 -279628 -66637
17694 26732 -264880 323458 105735 -205652 140217 300447 -1063 128737 -126568 -190374
17684 -190374 42616 -103248 -154378 71046 -33096 205065 -134305 205781 -241595 128326
17673 14709 131959 -107842 -166382 -190836 -174617 -148512 -562633 64048 365362 256443 75457
17661 -13549 124792 -179838 300880 7375 -289612 -66891 -70135 202414 -96556 -9314 95462
17649 -158684 174357 -309085 -223768 64432 158271 76560 182190 423736 -80785 58583 319396
17638 319396 270089 11077 220967 -87337 102029 -150343 -107936 -65971 95292 40087 7029
17626 133012 242936 195129 55993 45734 -242939 -109481 111162 -47579 279633 -193703
17615 -82427 177540 355475 49220 -264710 -42880 77374 64737 -275217 -35989 -33873 96291
17603 191280 -27610 57555 86831 296379 -5611 -264787 107949 -190341 -4535 98799 -304426
17591 -16474 352893 154323 152951 129060 104731 420429 279554 -220457 10008 247568 -2466
17579 86572 -65890 7460 450585 21834 -125285 153237 264645 -188 344475 60336 -172218
17567 111027 16169 186293 -45441 185145 43358 4089 217589 112795 248836 13591 32988
17556 32988 20078 -101555 511316 121179 222341 6680 -113203 21387 110460 48557 5348
17544 285409 -289968 203739 -292494 -259965 58563 38100 -40541 -233653 99370 126140 13268
17532 141058 230816 -92201 51376 102343 36856 24305 -29541 487124 266635 -34669 69701
17520 54260 76715 -69165 -152326 88844 301443 176648 96479 15565 247435 -208507 170631
17508 11535 -113819 -95841 -97330 222855 123231 102433 559456 297935 50605 405446 192992
17496 110684 -200285 97021 363828 218090 311557 -118595 257828 9906 -294723 29172
17485 -75602 322169 154408 61593 -65523 193124 254678 -126348 -199015 -97729 128572 135216
17474 135216 140568 119634 -17352 69396 405964 60124 39193 -33904 -208777 151821 134119
17463 134119 -348914 148397 197545 -10828 90964 185972 567750 116457 -56170 285034
17452 199109 24032 406824 -95642 -26046 211883 194525 -157442 352376 -70579 227176
17441 270388 107778 137935 362691 111351 312365 -88225 554875 373058 143578 393810
17431 393810 195926 51672 228364 162454 221382 -114989 223036 510686 261983 285178
17421 285178 182990 349509 157740 131502 334967 566742 137542 293327 317074 320019
17411 320019 206256 201013 365235 569650 207459 479884 -26150 293664 246611 247165 524009
17400 524009 162611 16462 152636 245756 139938 -61661 128092 -226304 -113163 5833
17389 256026 103289 172810 219021 249 163399 -160984 62044 269434 -9563 198324 16066
17377 23189 156893 78458 345028 249695 145837 158666 35801 170763 248234 37444 429217
17366 429217 49716 357669 139467 320376 377808 276313 234462 96644 258109 178124
17356 178124 -38759 -14722 -37097 334458 215922 485558 -93676 -96169 226115 174790 19373
17344 374424 148559 232826 -34126 80441 21967 -21045 -1451 -35081 393136 71363 256674
17333 256674 -56305 202843 289180 -147534 439740 50958 137763 279053 43813 -7997 174886
17321 112835 439550 202017 -59427 134555 -77572 130674 -355063 191732 285832 -217531
17310 43799 141149 250271 145826 344185 107753 591040 -17538 -21257 -58251 153378 79957
17299 79957 156737 -132114 -163095 355610 -88043 159763 114172 109909 133348 307997 233713
17288 233713 249911 234076 36935 -44113 -175316 -38171 117547 290501 168403 259192 221983
17277 221983 375370 -21294 262703 206801 -44223 59715 138692 -82788 48319 182521 290218
17266 290218 338776 86188 -56175 12047 61175 43694 203822 63346 277968 247325 256091
17255 256091 42491 500134 567813 278385 115353 167384 181422 710952 122478 83716
17245 83716 124065 -78667 296678 131702 253762 -20376 192821 390618 246223 148272
17235 148272 412727 336998 310862 377528 251025 140354 278308 521953 97768 98026 66160
17224 66160 191130 263848 204710 330605 95323 329808 112055 261702 3310 -7022 400150
17212 280472 -15552 281723 -16493 463959 169897 276302 182095 302582 192808 405381
17202 405381 -34843 613255 345328 561951 -31001 370097 72247 202907 397465 128802
17191 482242 312290 386416 194414 2458 281760 -86780 260106 258191 186619 314909 594619
17180 594619 154642 290943 197961 -133080 86468 254750 454999 148093 315192 101828
17169 251379 367644 509725 202788 559949 288636 445710 166536 193720 449296 84165
17158 171754 595538 589739 595759 224648 340106 358110 268833 -151782 219752 266877 381232
17147 381232 253444 157254 148787 454552 157969 445002 252356 206491 232717 178810 535497
17136 535497 344823 483113 402025 214271 276407 230301 462081 125870 647540 582482
17126 582482 545976 412277 260001 153801 381302 -12399 248299 25261 169966 699137
17116 699137 238664 424998 544535 649060 475920 160497 493114 348282 56421 443603
17106 443603 380954 170350 61350 285096 206646 158713 275328 346027 358581 483285 289533
17095 289533 421017 501992 571720 496503 53861 449220 264311 522725 263783 540157
17085 540157 200203 606342 572353 524560 418435 664341 11500 269127 643303 337292
17075 337292 556662 505583 633460 626723 249479 460267 323083 476361 553174 416939
17065 416939 642116 520098 465532 168918 559405 279360 225483 440961 674842 351730
17055 351730 674106 419812 420514 314400 436178 556725 332732 336451 331186 403766 499602
17044 499602 492354 392222 266743 433870 552593 409616 587753 700950 476154 367825
17034 367825 795655 551302 692470 591795 385185 492295 900447 503181 926627 619629
17024 619629 863765 565411 677421 687709 722614 589264 426817 478102 700058 423530
17014 423530 445384 638309 316789 746896 803906 625355 826449 800292 647687 553359
17004 553359 671290 735840 511425 491423 579915 563158 876018 400564 660079 602045
16994 602045 557141 779847 802874 678995 675928 1152389 753530 773632 832257 945841 424886
16982 501649 787039 843598 681241 681844 724503 805719 657464 934069 867134 753063 887608
16971 887608 961508 1033571 799460 1071459 901329 910191 1251373 912937 793924 725045
16961 725045 933925 789993 1003135 1058420 1229126 826008 866861 963620 823356 496383
16951 496383 807714 956174 1057268 944444 994347 1180410 1279624 868570 886656 1076986
16941 1076986 804230 1137211 1089564 1331052 1261936 861814 1079447 1401046 1434261 1457841
16931 1457841 1237784 989376 1521729 996342 1543366 944950 1505137 1045061 1460863
16922 1460863 1256899 1563286 966792 1032218 1415155 1053601 1131374 1196241 1113798 1377746
16912 1377746 1549137 1784121 1286810 1506911 1337378 1256732 1710548 1325647 1640013 1509478
16902 1509478 1732227 1332896 1805343 1329390 1713646 1719493 1805874 1332495 1598437 1645317
16892 1645317 1719825 1720039 1720131 1978746 1967558 1647382 1733716 1822292 1810478 1867550 1871202 1836497
16880 1836497 2229131 2101755 2071601 2086463 2249428 1832602 2244372 1980203 2331559 2264648
16870 2264648 2481602 2182094 2160424 2120639 2492712 2461534 2524747 2166369 2191335 2657665
16860 2657665 2565483 2567196 2751428 2633024 2772710 2861868 3112830 2609052 2995659 2793089
16850 2793089 2860006 3037138 2886220 3032854 2956227 3108730 3147587 3175100 3247438 3261141
16840 3261141 3392581 3425013 3573308 3614801 3354165 3754762 4008652 3399172 3835358 3707807
16830 3707807 3927449 4273751 4062833 4322000 3935945 4217997 4394330 4127199 4393131
16821 4393131 4423910 4511782 4624667 4870344 4839127 5060048 4918290 4829889 5097216 5176682
16811 5176682 5782886 5525111 5486683 5928337 6035680 5858503 5940699 6071481 6346846 5994690
16801 5994690 6476285 6824982 6391901 7030964 6878507 7231423 7349594 7686671 7776828 7865999
16791 7865999 7776858 8219221 8126302 8694033 8837644 8969652 9207196 9517092 9768334 10133104
16781 10133104 9888215 10441501 11088741 10671120 11209318 11470425 11723667 12345868 12568575
16772 12568575 12773148 13511924 13751685 14253081 14431997 14871468 15478288 15788925 16168584
16763 16168584 16679516 17292887 18037888 18542444 18867036 19581001 20221706 20847893 21896762
16754 21896762 22471171 23365109 24100823 25352913 26204855 26998951 28196256 29494205 30400747
16745 30400747 32048322 32986972 34414963 35955474 37785435 39207045 40925295 43226937
16737 43226937 44805324 47078302 49573254 51955236 54396554 57296228 60063850 63405397
16729 63405397 66467750 70220368 73974380 77835203 82123590 86695393 91229080 96275427
16721 96275427 101797368 107192932 112709888 118750465 124836602 130875714 137136986 143227405
16713 143227405 149249064 155296414 160623040 166140877 170489019 174586121 177986286 180025787
16705 180025787 181364306 181756927 181348139 179540301 176946227 173523939 168929951 163977094
16697 163977094 158564255 153046057 146410291 140156301 133629380 127327893 120720495 114376488
16689 114376488 108675574 102226347 96800557 91387639 86329048 81698354 77047135 72911260
16681 72911260 69228236 65387621 61865964 58588319 55523619 52852743 49883843 47832445
16673 47832445 45331113 43121829 41203375 39090004 37606009 35514558 33966962 32398942
16665 32398942 31234373 29594768 28389398 27696489 26265862 25286297 24353180 23316824
16657 23316824 22546573 21620697 20712900 20051327 19214100 18585976 17849554 17229704 16940244
16648 16940244 16304840 15770644 15300646 14562718 14091474 13906992 13182737 12956743 12507405
16639 12507405 12307311 11750093 11527221 11388534 10761110 10625637 10228726 10090073 9859577
16630 9859577 9488127 9198889 9102031 8762997 8391461 8414910 8074123 7852373 7650144 7659725
16620 7659725 7100059 7363538 7349390 6954678 6497788 6538108 6618301 6274980 6182696 5957993
16610 5957993 5784999 5860373 5606049 5865189 5363880 5158653 4991958 5085198 5235333 5211514
16600 5211514 4875318 5062310 4511919 4403704 4512993 4224564 3953652 4427217 4115518
16591 4115518 4188232 4214094 3644696 3715055 3888453 4075586 3717133 3368485 3125294 3534123
16581 3534123 3284918 3074138 3513724 3297729 3155530 3173062 2931255 2944165 2819577 2882064
16571 2882064 2796682 2634853 2737912 2851628 2833910 2976114 2510541 2638628 2699257 2288167
16561 2288167 2366967 2421479 2409022 2524249 2652715 2405577 2257407 2354336 1897535 2226915
16551 2226915 2240363 1924355 2013143 1918715 2093322 1802218 2072868 1938211 1953500 1657997
16541 1657997 1753409 2041611 1871687 1815613 1734889 1791729 1684391 1811285 1606472 1612131
16531 1612131 1627905 1626263 1714870 1568248 1575076 1468732 1688426 1484073 1683475 1178712
16521 1178712 1720137 1685735 1517907 1470092 1329661 1776105 1357103 1297416 1437551 1255300
16511 1255300 1263485 1299801 1404781 1264978 1231068 1170531 897701 1494679 1170535 1192420
16501 1192420 735634 1169306 1075911 1342479 1187439 1293479 1436372 1089660 844450 1118716
16491 1118716 1077493 1174660 1126434 960444 1123623 915349 1247642 548527 1202503 1149483
16481 1149483 827433 938469 925441 985777 775451 1088286 796697 780395 863446 664776
16471 664776 1028977 808318 785972 902110 765011 975345 1017118 916984 593895 902796
16461 902796 569535 858797 754055 542761 853162 881060 656800 759409 709485 730415
16451 730415 743005 900869 553555 846378 748350 763683 805574 536497 619111 562146 596556
16440 596556 809661 530007 748560 587130 587858 746957 543802 623678 608834 606444 265261
16428 744671 629256 257325 553557 265278 432270 401046 674482 458958 702620 493132
16418 493132 484809 741640 489854 491435 478002 467730 768719 769090 883911 477412 536105
16407 536105 280686 605109 389727 628259 367787 337698 669773 366275 435240 441399
16397 441399 442409 458365 274190 532175 492631 353656 525731 378247 179805 488043
16387 488043 350505 626623 397819 752266 699619 198238 376761 590538 327595 652160
16377 652160 353205 584055 415545 363270 240591 287909 659620 670005 199411 347224
16367 347224 524226 590447 376466 454505 140004 479388 157720 307011 785891 355348
16356 381041 279737 585493 146192 214100 265096 256956 482482 357690 494032 363286
16346 363286 242476 354817 247515 190821 207321 387688 738250 206819 207344 414701
16336 414701 156128 -12460 490089 218551 156973 306463 248839 308952 -30335 182340
16325 514191 253370 124109 416806 337961 391655 65740 246263 -69255 309019 75793
16314 136152 279683 156945 8622 261209 23531 424618 296960 380964 182730 223405
16304 223405 274966 345256 185329 60422 234228 425441 441443 368862 245240 239829 307412
16293 307412 -22522 182458 138649 -152346 206504 350654 419762 187549 203329 407330
16283 407330 1447 41680 316089 102769 231711 105029 113232 -159177 -111258 138089 38023
16271 16369 350224 161411 231511 395753 383255 10955 248417 380403 120833 303881
16261 303881 115950 187466 10129 136336 101558 -121396 273162 331836 399950 92219 -442392
16249 68136 119480 286926 86676 -1482 157777 143211 423095 524845 75451 10881 177177
16238 177177 168286 -119791 73442 257455 38346 121211 139539 -45148 263502 123126 -135931
16226 19880 -19332 234001 134327 188287 -110774 39060 216415 -17384 -101004 -85406 -179229
16215 -179229 -15584 18169 60820 285554 21353 -50687 441900 259080 334315 150130 90685
16204 90685 166735 70992 -181510 158237 -48902 -86438 191955 234567 458020 138442 -11007
16192 122690 -255093 104072 -97602 302611 62646 -40922 -17786 192028 146540 -34453 -335491
16181 -335491 351275 103331 246090 -258299 258376 231912 -96508 -210902 216250 -29338
16170 -299902 -157222 158302 41954 248295 -11949 98481 18991 125941 246986 -12673
16159 172625 78700 -20312 278652 127834 -89985 -48270 42897 -284846 237113 -42717 235792
16147 162822 235455 51334 -36998 -61232 279516 149078 -300602 352742 4684 138091 21967
16135 74156 -39946 177722 10159 121312 37063 -187589 -218623 45124 -170666 267274 -134232
16123 211921 -175998 -131072 -30584 181537 256714 288349 38055 61974 1722 -293034 -211
16111 -180676 -148186 385613 -261714 -104645 -284869 -306654 -177897 31187 411 193261 106387
16100 106387 134920 194103 6940 -6848 21921 -34146 164406 -11371 -259274 20483 94276
16089 94276 309277 332401 21147 -113433 311712 320513 11869 144074 -20232 -219622 -63358
16077 269758 117912 325306 -108614 230586 -311518 -204654 37198 -250812 178788 114759
16067 114759 -272561 225247 -253452 184456 191147 -29221 -53838 179631 2858 66992 -95437
16055 310965 -87977 -143155 198517 -33098 -121317 98613 108331 296423 80144 -175339 68929
16043 29345 11272 167430 242042 75943 -143252 -18698 224296 249692 -127400 233096 -103164
16031 -43934 -167671 -352525 131236 -155 100331 -161530 160103 -67917 176545 175017 149217
16020 149217 -102506 -66226 -3067 71598 302737 -4061 -229631 -200185 137905 215884 -158171
16008 97130 -168182 -249143 327288 -23080 380067 58966 85793 43104 155515 140519 155679
15997 155679 80122 46518 -362370 -77316 36886 153007 -59728 123216 -96070 294833 -71841
15985 169282 215644 56539 118041 125512 326849 5314 -133653 285915 -287618 -125164 169590
15973 34319 -183743 472219 -4573 242820 463980 207595 221111 -120547 310665 266604
15963 266604 262014 -83650 80431 -122652 117529 11471 -129973 -207886 112661 62834 -180110
15951 -21294 4208 147616 -183307 140169 -106018 -165016 155772 -282099 -3462 198148 -1728
15939 -161326 -196162 65765 175859 -267526 -123583 -100463 -79268 123610 58033 -8971 -337104
15928 -337104 -39039 59522 -25686 575451 -185010 105548 124964 -58046 -172573 218123
15917 -124833 -146699 154630 -188511 -70855 -147664 -49562 -286714 -73534 -282107 -188483 33835
15905 -189980 -214679 34523 -162656 97744 -418672 -16230 25855 47559 246271 261106 46419
15893 -400695 3464 162155 159966 -182780 134956 -255412 163132 85096 -16553 23125 71810
15882 71810 -138784 -167859 -60839 -99823 -326740 108678 -229610 12841 -108818 69662 -293006
15870 66009 -203064 -169495 -161823 -397007 -85571 -268510 -93306 -149325 -59585 -39377 440542
15858 -160749 103435 21684 -91032 -212245 15448 -64278 -123380 140621 35383 -85724 -329316
15847 -329316 259935 82573 26255 44529 65170 -47668 -411196 -52485 -13382 343862 100623
15835 -137005 120895 -272678 -91957 -19594 181297 30760 80394 158752 293033 -195954
15824 -153153 250019 -65727 244989 -20264 119719 243337 -207966 -45162 -232535 331803
15813 -152591 -309434 -33254 58592 -243763 -278585 -177909 34671 -171362 65264 -107893
15802 -101519 30162 -223473 -207849 173209 63588 -85759 -98863 268127 -333065 108397
15791 184330 -227202 9054 -197785 -19323 -55955 -163214 -82857 -52494 126867 -156984 268928
15779 -405118 -38931 -845 147913 -20989 277223 134857 -136901 142945 -149051 -206951 -283371
15768 -283371 136311 -134062 166344 -168150 -226916 -90471 87286 125575 89739 219131
15758 219131 86429 49521 -40335 102642 -75941 -174958 274074 43789 -346116 -174156 54553
15746 -163849 -296278 180129 -131323 134273 -4106 -164553 277357 -188081 150861 183445
15736 183445 -73768 209197 -71883 172931 -248053 -61713 18022 -305129 -197741 -30498
15725 -191914 42474 243083 -17022 -204158 -145971 153780 354881 159330 -126380 -99209
15715 -99209 -160799 253426 -283339 -162754 209227 183821 206163 -58698 328565 -31268 16512
15703 -176335 -177743 -97700 -248366 -109521 -259307 95880 -83658 24517 -80866 -254376 32185
15691 136047 116335 -152838 -373145 224421 -18983 180054 -192 -287950 104871 -139743
15680 -129129 34055 173344 -41004 -57234 204429 274878 99444 220890 -109234 33532 278959
15669 278959 190616 115935 57134 132458 -175554 -168443 -123195 154858 -45475 -251570 -14773
15657 104341 154774 372009 109145 -285539 -4836 231902 190076 209844 -209256 153720
15646 -6176 -104349 -21517 -147521 27457 192720 -19911 -136218 78335 -69911 -395123 -165456
15634 -382063 -220686 -131638 -215482 -221731 213157 -5012 -23003 241547 -280111 -32407 -155398
15623 -155398 -51813 -189061 -89035 243209 101888 -241596 14707 235398 -173174 -4771
15612 -5820 -11981 130298 102098 232655 -40287 308328 25759 240721 -122246 -57338 156637
15600 -81752 -72878 -4186 16936 107275 -7909 -64054 -55218 -84687 34097 7695 -64131 53871 -121776
15586 352629 254325 -151193 -407684 126341 -80606 -54663 -174333 -93623 157669 43032
15575 -210336 122056 -28805 26598 -48989 219302 -240795 -96331 73874 -166593 -61588 -108463
15564 -108463 -168725 -98794 -51396 359781 -119100 -93242 -138252 266713 3643 -161885 -53364
15552 171662 -17078 56258 -431224 -122005 -10851 203342 309667 12015 -224013 49478
15541 168610 103218 -164246 20341 194676 191183 -211040 -161154 214401 -314758 179060
15530 -59960 186185 -112128 -219567 -40391 137983 -192009 -187833 170555 -175460 -84558
15519 32096 85607 -57068 -232436 12568 123168 -42985 -133219 135417 223087 -86500 205256
15507 162514 186562 -107881 -283419 301488 -35608 213237 -292455 -92869 39207 129759
15497 129759 38335 -52779 -44892 -189535 -252151 74548 -2130 255387 -22048 -63358 197607
15485 69509 64157 131044 -308914 -64658 -141670 67746 70062 272582 -18797 44435 -121630
15473 -152443 -63637 305320 119400 115825 -30637 -325509 -59718 170918 -358752 -164379
15462 -292615 -113027 -417949 -253727 -2436 116188 269988 119125 274153 -108541 -92925
15452 -92925 85737 -33662 -12600 133910 55111 125224 38103 -245154 -186061 -5320 45992
15440 48878 -71555 -107621 -65290 -80375 -109329 -61583 -28571 6265 154037 120153 -175695
15428 -152979 131665 98415 -80304 65720 -153351 -150223 60436 193906 -91592 244092 -9046
15416 -162024 135585 -82152 40690 295605 -65578 -233010 138027 164544 -127 175910 -309526
15404 101180 -187939 -235645 -111066 -149636 54929 58098 257181 -109288 287037 197407 183847
15393 183847 53340 245507 356509 -178950 -42157 -341070 -199344 -363253 154601 13535
15382 76550 251637 -53802 254946 151050 -218365 77211 54493 172364 -20163 105678
15371 246402 382679 -165731 17466 272995 -141508 19730 154406 146110 339810 -141186
15360 19828 26456 98238 83041 21400 138045 -137282 118791 -27040 -88058 -76637 415129
15348 174090 -120054 -64968 52214 122071 -143164 -44995 -417393 -147010 361525 -147349
15337 7215 -255181 -11804 -84885 -275140 56160 72238 420550 132831 -59700 16333 -110683
15325 239567 -73145 -275706 48515 -8533 -160018 144253 226020 58970 -106657 -132165 154855
15313 45070 198808 48979 -144138 65124 -285071 111081 32860 136359 6659 288594 -28050
15301 -30191 244902 202836 43015 194923 -120098 -41502 148406 49622 220300 -46129 -8825
15289 345550 39752 -187000 222089 146632 86424 -200934 26716 57045 329945 33208 -227401
15277 -48768 109701 159658 111686 133552 -156675 246552 -179535 312063 152970 154743 39845
15265 -164569 -218209 93765 130514 -104344 135577 -120384 91845 75060 126423 200954 -73073
15253 243373 170672 -154886 339654 18844 112608 351911 59494 313412 -101658 22991
15242 -219175 188920 244477 -247596 39961 -79425 335719 565143 931002 545661 1245421
15232 1245421 1371895 1474272 1457599 1466458 556297 456056 394306 381861 193704 206469
15222 206469 141116 -296010 130994 357574 110980 -48500 -36868 88617 -49731 205175
15211 -4746 151568 -1594 -25360 12508 138959 -186095 164092 -162952 -144982 -78626 153385
15199 -26440 -169968 -220420 -409874 95570 -9469 28739 63586 306526 -161894 110344 420370
15188 420370 -49324 391500 20431 228213 97246 151566 236767 -13842 356959 69795 -196087
15176 152524 315712 -15351 36289 -35441 26151 61407 234592 129236 243589 541965
15166 541965 -53916 -261660 97470 80491 93800 198278 43335 528355 220949 307728 45788
15154 1223 -26290 -110013 301664 136062 309736 110228 -136172 172105 -142623 164522
15143 120426 39611 113657 124927 307140 118417 -248679 -295473 -39334 -53168 -91924 101020
15131 250147 104338 127570 -27167 107261 68068 70641 415200 -67572 -116413 -149746 53128
15119 512647 324330 331330 95340 -259132 853 -38903 154078 35880 95118 124939 167871
15108 167871 18563 -39079 374653 127953 187267 -73897 -200556 285132 56127 339882
15098 339882 -63908 379387 394436 67604 394898 302874 -52658 143533 4306 218947 -45145
15086 350984 208263 354403 95884 182647 -22065 139857 -192541 -53682 165662 176230
15076 176230 172482 -12046 135666 248711 103774 533029 171490 119209 1866 211371 100741
15064 338104 169088 20872 -8625 -111724 543021 99331 430018 167544 155538 51920 -85899
15052 391549 -27970 199474 321756 166378 217711 297831 234016 169575 322154 267391 18040
15040 25994 112518 439107 244956 186530 269553 28984 151935 419593 -158395 250709
15029 -64543 301551 42957 -75526 -53531 181943 353415 102890 251938 -3404 -7482 131330
15017 177930 330349 193894 334978 250916 174473 235906 301177 201250 -11566 480788 -133067
15005 246563 -140179 358880 25385 -45135 157785 239937 379012 192658 431221 -51935
14994 274568 -348687 70096 403742 39581 317263 467531 256169 316019 167431 479554
14984 479554 287220 461078 265806 297949 331909 28947 461255 264918 173943 359596
14974 359596 405977 179436 109528 470137 249237 236996 358905 413696 245670 348510
14964 348510 306552 102591 337994 355894 87520 227858 125176 120351 482239 208681
14953 594510 107370 179396 243090 458006 58461 460839 459592 -30661 85328 295133 377244
14942 377244 159681 159189 -112657 193335 267427 42191 203330 136246 171710 426579 534214
14931 534214 243891 235530 268911 438814 318081 318866 25502 101218 37160 503328 25037
14919 320326 324519 477843 89789 515526 380009 538128 466241 134912 214277 228903 434910
14908 434910 478413 412526 356516 145526 386815 271684 223628 455462 378959 -95823 515274
14896 301850 210108 288940 355003 541938 580973 432955 295792 173443 112430 269509
14886 269509 477209 309143 340232 104949 334237 546938 156156 229125 307464 634521
14876 634521 -11937 227843 383208 314886 223502 45175 289518 225544 525452 581583 770643
14865 770643 289355 292586 127799 217700 394887 -33537 319182 90238 285058 267037 218015
14854 218015 380463 382013 193252 213060 418989 527341 236993 562989 256212 205490
14844 205490 486484 370791 545062 322064 390522 638055 310583 456609 577042 186109
14833 293993 345999 704699 329883 449840 471769 117693 582580 357847 620200 625951
14823 625951 325680 425223 580392 126262 551373 551468 326952 427715 495076 346580 544200
14812 544200 493612 297024 601343 541691 561512 724805 828239 698018 571351 190963
14801 629735 595320 630100 734806 246871 675342 341724 382896 727021 602810 865068
14791 865068 625547 686516 497443 767870 137058 419426 342492 689273 588301 366129
14781 366129 553202 506657 496465 648648 138367 637314 319382 498394 767896 299329
14770 784963 506811 758025 665111 649123 758035 386977 458547 667673 670161 1030039
14760 1030039 963090 531967 230462 434201 632163 545584 433233 514296 646894 743653
14750 743653 513502 548294 786015 608042 673655 581625 625761 716106 599629 809633
14740 809633 704970 729007 700236 827975 613790 386025 363145 366859 746438 844383 476665
14729 476665 726616 423654 888510 811646 1059942 671329 609758 568507 958311 863437
14719 863437 799616 725044 606755 909331 720917 767292 954086 742933 741373 1137223
14709 1137223 618281 348141 791853 909871 611780 903253 984481 537595 757195 932665
14699 932665 1186124 795336 750592 622470 1004453 782691 1116927 886645 1070789 825636
14689 825636 949505 869188 758788 845611 694161 796693 812539 1350753 1076944 821631
14679 821631 884117 652447 868806 850949 782420 1217878 1080987 1059077 853404 1031509
14669 1031509 607387 1185029 1155278 1019100 849795 1521214 724243 910700 1068736 963908
14659 963908 1025019 933452 1152157 839650 921850 959563 928272 1246046 943866 979314 884400
14648 884400 1272645 1100431 991566 1010329 1112704 971145 1225564 874597 1141914 1131912
14638 1131912 1280566 1199717 1065941 1028749 1383587 966831 1208597 1635597 1213273 1462424
14628 1462424 1217901 1479810 1235567 1410931 1396041 1500401 1266446 1269051 1494455 1347067
14618 1347067 1310032 1321825 1405968 1484738 1468914 1301952 1349197 1586569 1391170 1564922
14608 1564922 1268174 1314507 1468021 1369878 1479583 1722497 1475423 1318912 1572139 1678014
14598 1678014 1650612 1382891 1647737 1274724 1535715 1378877 1586715 1823576 1691552 1688176
14588 1688176 1563086 1748753 1479742 1547987 1749407 1859641 1513244 1621758 1917626 1710218
14578 1710218 1501787 1960800 1895642 1945292 2155954 1781611 2010700 1700781 1996083 1922865
14568 1922865 2207531 2187071 2035689 2151122 2116402 1976786 1987738 2047586 2193381 2133435
14558 2133435 2250096 2289375 2005503 2521471 2224762 2705629 2454402 2657073 2255999 2549313
14548 2549313 2718030 2832800 2754797 3173466 3227732 3129847 3807475 3810811 4249237 4361295
14538 4361295 5018428 5170317 6980120 8030079 11087503 14395211 20511072 30811620
14530 30811620 29850419 19794532 12586614 7931135 5531754 3791543 3264836 2901326
14522 2901326 2498715 2652018 2416582 1926238 2376991 2347903 2353835 2213840 2453455 2234326
14512 2234326 2191777 2347743 2284499 2424385 2258339 2589873 2313356 2747369 2570002 2240549
14502 2240549 2706033 2750534 2301907 2673559 2738593 2577288 2589326 3064442 2810576 2894453
14492 2894453 2876586 3019163 2863719 3048401 3120864 2964964 3427400 2988321 3671068 3159984
14482 3159984 3197482 3388682 3090336 3469415 3504104 3520955 3664241 3230707 3476468 3681160
14472 3681160 3527548 3465927 3414829 3944005 3700841 3867136 3971750 3867632 4022015 3517267
14462 3517267 4269901 4082541 4391028 4190969 4164825 4101501 4255236 4717099 4379023 4733361
14452 4733361 4642656 4585815 4517145 4678152 4899584 4730269 5222989 4799564 4932736 5295716
14442 5295716 5174915 5112461 5122550 5677882 5133514 5799075 5712156 5518510 5473912 5941135
14432 5941135 5600432 5713741 5963940 6120783 5836556 6330139 6325307 6538619 6473235 6760961
14422 6760961 7014242 6999276 7059994 7099680 7222682 7196966 6999858 7426506 7356336 7246973
14412 7246973 7575721 7780103 7743396 8100507 7838226 8246728 8339544 8261159 8369431 8854527
14402 8854527 8910284 8716626 9022085 9095404 9425247 9593053 9816854 9597155 9776001 9827401
14392 9827401 10122059 10249505 10228317 10654579 10706975 10916432 11119711 11102692 11475739 11561214
14382 11561214 12037792 11715451 11869253 12116504 12683828 12782244 12923287 13229126 13558925
14373 13558925 13514221 13307899 14304415 14232501 14575986 15089509 15306715 15442726 15553309 16071768
14363 16071768 16088866 16670435 16963980 17216998 17605000 18132164 18450109 18562359 18858449
14354 18858449 19517754 20230538 20252266 20527764 21176638 21473509 22107994 22571148 23163910
14345 23163910 23613974 24205646 24525976 25268534 25792642 26472507 27240570 27399137 28533520
14336 28533520 28926763 29670959 30398002 31463398 32286860 32924768 33958683 34896216 35954067
14327 35954067 36644773 37574197 38856403 39845324 40710350 42485014 43524247 44675849 46352039
14318 46352039 47365332 48938348 50320270 51994190 53386122 55641606 57023383 59081908
14310 59081908 61162055 63230140 65641173 67812475 70001737 72700087 75097783 77974237
14302 77974237 80836321 83692762 87268666 90854915 94518001 98240656 102118233 106396414
14294 106396414 111254799 115935230 120650747 126363492 131478432 137403182 143568672 150473648
14286 150473648 157639664 164969623 173006474 181060277 189879420 198869240 208933423 219265415
14278 219265415 230298873 241723350 253673193 266524377 279520255 292982674 307415132
14271 307415132 322346398 336781048 351002350 365082367 378462412 391517768 403303935
14264 403303935 414314954 424515407 434421219 442898000 449139115 452151650 454380528 456004790
14256 456004790 457371853 457699694 449140263 445239766 437536902 427956455 418063468 407923009
14248 407923009 396893412 382577106 367918043 354320344 340177727 325827784 310752498
14241 310752498 295593213 280935856 266991087 253488999 240728136 228629622 217563429
14234 217563429 206524764 196104584 186469765 177405326 168608717 160960288 153030474 146013843
14226 146013843 138814028 132544631 126414749 121036482 116019468 110811109 106082398 101352271
14218 101352271 97051440 93550377 89881223 86676445 82791279 79713020 76671263 73550141
14210 73550141 70930931 68644949 66061478 63875509 61563864 59731823 57603468 55453305
14202 55453305 53759636 52088488 50224264 49479828 47921328 46560020 44604256 43537440
14194 43537440 42299391 41133837 40140965 39110912 37834312 36857305 35875792 34680001
14186 34680001 34186501 33455559 32297586 31428674 30565998 30106830 29526203 28626335 28146369
14177 28146369 27165555 26510962 25941219 25126003 24857379 24107952 23790638 22749813 22535110
14168 22535110 22031239 21792536 21035131 20802950 20221289 19915937 19538608 18795869 18766498
14159 18766498 18347725 17921275 17812239 17503505 16970810 16694904 16228112 15956547 16008752
14150 16008752 15899513 15223311 14642937 14318856 13980867 14003469 13905693 13788973 13436172 13168486
14140 13168486 12786686 12825653 12343372 12284554 12098466 12187403 11515938 11434031 11325146 11121582
14130 11121582 10746003 10959596 10467770 10621883 10407281 9986642 9893504 9870273 9677353 9662250
14120 9662250 9591130 9251767 8905312 8908562 8621708 8503839 8833330 8589928 8072675 8107342
14110 8107342 7959185 8151543 7786019 7752896 7620219 7393680 7573121 7466311 7067380 7488125
14100 7488125 7059017 6928755 7282369 6965366 6673105 6660572 6766462 6730791 6451174 6293312
14090 6293312 6419225 6048095 6130334 5793201 6151317 6139967 5603843 5797216 5737168 5852172
14080 5852172 5654425 5557046 5676590 5654459 5504925 5261773 4933553 5424652 5200021 5156810
14070 5156810 5124611 4734461 4553349 4938537 4813839 4942771 4946097 4675339 4745254 4790666
14060 4790666 4554882 4410919 4268424 4436678 4439182 4354110 4124671 4164787 4212722 4090494
14050 4090494 4201253 3816783 4109692 4266393 4527943 4153834 4178954 4067123 3822758 3851805
14040 3851805 3987624 3768953 3748953 3651384 3646345 3346876 3468694 3550361 3621966 3498905
14030 3498905 3597891 3081132 3616044 3249593 3190588 3141852 2958836 3099278 3081387 3038008
14020 3038008 3201846 3155790 3149842 3182015 2930965 2918288 3203352 2802346 2976172 2675616
14010 2675616 2918156 2576795 2793430 2796124 2598358 2826999 2627385 2687262 2608011 2407007
14000 2407007 2294972 2096002 2567859 2635773 2339370 2530963 2515086 2358696 2489616 2427827
13990 2427827 2099670 2867499 2229731 2039567 2618607 1963403 2294779 2291419 2514799 2653823
13980 2653823 2620110 2545928 2968763 3383100 3853767 5340870 7308366 10078794 15478428
13971 15478428 26381091 29661842 21200574 14273257 9768633 7379786 6167372 5131351
13963 5131351 4086393 3696116 3581703 2920022 3112073 2731002 2547547 2923822 2764076
13954 2764076 2527273 2398376 2504145 2503496 1981263 2395613 2182270 2278628 2119503 1811393
13944 1811393 2332148 1839851 2127815 1624652 1967664 1962511 1884249 1771646 1905759 2048481
13934 2048481 2029410 1892260 1942220 2042566 1636929 1668955 1636264 1642498 1694366 2198491 1930494
13923 1930494 1660384 1981895 1442418 1575202 1760774 1591037 1651365 1711935 1470158 1768410
13913 1768410 1694379 1604626 1685789 1548372 1375570 1586398 1543142 1413095 1604294 1414429
13903 1414429 1412396 1634015 1224570 1624319 1881241 1591099 1295674 1304234 1344865 1274254
13893 1274254 1594071 1550267 1364685 1102333 1302896 1279527 1323898 1270554 1166886 1257863
13883 1257863 1513144 1373737 1278355 1009935 1445595 1358576 1617870 1152842 1181146 1347477
13873 1347477 1396323 1365979 1396851 1104850 1143035 1060969 1312457 1148456 1146948 1231787 940626
13862 940626 967396 1096830 1254840 1020580 1196071 1391044 1166206 1308181 1261293 1013065
13852 1013065 1301691 1507121 791888 1306713 1068161 1163347 1148165 806077 918485 997888
13842 997888 903947 917607 1261193 940565 858444 1278697 1042290 1121482 1137586 1027857
13832 1027857 1337872 1109669 985502 774726 961067 830150 1108671 824513 1086950
13823 1086950 959422 978753 774509 756204 1066027 653360 913998 855418 838792 808638
13813 808638 917509 1129584 842129 1102161 692699 640582 973410 662420 415045 841538
13803 841538 790836 688342 1193996 654558 838450 842369 946478 700916 969784 718124
13793 718124 823407 723044 839322 822272 813007 788588 709870 518841 871133 1059515
13783 1059515 785830 748160 803084 603842 1122434 998101 1037318 992478 508548 758478
13773 758478 921141 832485 314178 548049 609318 706851 576678 847605 498073 929666
13763 929666 354891 724947 301091 640554 796194 709234 878148 593868 1151939 559775
13752 658721 233453 539804 578050 682648 865037 563805 482234 575794 662090 725684
13742 725684 620120 459850 834144 781247 681464 699680 640268 670351 673930 1197997 751509
13731 751509 643629 465032 728134 733936 242232 745137 584708 674718 364061 469038
13721 469038 491833 724720 653372 470320 443409 179193 572694 669720 681176 737037 649460
13710 649460 628580 573554 175371 535222 688981 515770 579503 430820 374651 587971
13700 587971 655186 539327 337409 537374 660025 381235 529679 450122 498310 673828
13690 673828 605746 324310 590881 726196 585291 344844 136851 415862 301564 480146
13680 480146 975611 537439 570935 689882 599366 661924 476501 509551 622390 402889
13670 402889 533479 7853 292238 831888 279073 15263 626350 322801 344912 486648
13660 486648 738991 582304 430246 413354 615979 793886 570927 384821 460075 414869
13650 414869 294777 391581 566537 609860 402744 597169 518036 338524 639552 543692
13640 543692 326443 -46517 453915 346200 456237 685226 412785 326139 107080 315881
13630 315881 185131 412766 733536 281385 492224 411339 562343 224409 304063 407584
13620 407584 505500 451727 260902 417758 303366 317889 587163 274249 342812 741315
13610 741315 442957 823183 597958 532449 19547 471863 376899 529594 483802 175375
13599 420155 172840 626728 378233 405880 490963 171241 421230 291618 551378 315402
13589 315402 121237 547544 721351 105009 556640 423825 354017 355949 182132 301585
13579 301585 563827 322307 35453 329268 200610 379369 280480 300196 709203 177227
13568 365797 644682 465600 364967 249901 347199 485122 537739 175489 385311 115778
13557 386465 462577 235891 97916 665834 315691 332795 283376 540385 681325 310446
13546 253298 236143 640742 67484 297447 320141 258797 327540 463836 -243171 293018
13535 214637 412692 650168 414445 285194 57475 356179 226321 182086 173122 181859 171831
13524 171831 167318 250162 168814 298261 203982 271980 399362 130307 248238 130311 469999
13513 469999 224229 -107575 633055 414223 345731 148241 101789 111999 203391 232199
13503 232199 457495 370498 210699 208823 155412 510698 164599 35827 154090 170909 37418
13491 351569 263987 204377 173207 197017 263038 269674 541677 385244 184723 363817 -158371
13479 160005 347495 349497 216448 -46308 36413 335183 92391 184013 239797 287417 -20387
13467 159236 295469 530077 506977 104680 186902 262464 159233 267126 71563 326984
13457 326984 284279 140191 212596 317907 240102 534979 372884 14152 302259 244702
13447 244702 26550 228792 345973 597877 397090 174895 -114109 367773 217842 149417
13437 149417 -22659 384821 14560 435831 601527 -63176 175811 -4082 329615 146693
13426 16027 304527 19674 -76551 132188 781630 294846 68862 170378 -52540 260619
13415 374436 394879 228489 278143 432791 29103 199034 331348 176923 504784 -161476
13404 550292 211340 250468 508015 61644 374219 101990 -80306 476112 -192775 556673
13393 326027 72007 715343 337568 575247 -170329 262716 100616 389413 131531 312003
13383 312003 197344 397682 182679 178029 283052 253545 130881 271410 352848 -116733
13372 -145420 193463 111421 321887 -82736 198369 265317 222452 168312 523069 390769
13362 390769 132901 6571 567915 112692 219696 -191212 98468 -18829 52507 -183361
13351 445982 516835 229042 40040 231844 16547 -45175 111551 -62369 7935 247121 -57921
13339 417827 127275 80845 167275 419530 229003 97832 258317 219991 245975 253228 194156
13328 194156 186321 210024 504878 231598 401046 334964 442653 282244 197132 514768
13318 514768 51942 299977 -110105 135997 49170 154224 174645 117620 -60527 -113264 48778
13306 93192 386092 390460 90440 186226 128449 128266 -215145 330550 243922 215175 75518 447117
13294 447117 263961 208010 284065 458848 255461 199251 31010 -118524 77343 81956 245211
13283 245211 160225 264878 -224817 77324 139436 429658 335581 -91186 204180 10633 107335
13272 107335 306867 146103 -7480 286305 -16703 -88678 362272 191772 38703 105808 229945
13261 229945 -177330 104552 -3819 284553 37908 87850 -131421 191599 315507 306924 310272
13250 310272 -275004 59251 123377 500510 107400 91144 83324 3636 356707 88278 440661
13239 440661 -64163 119212 246156 -75387 118314 227375 -198130 -267533 -1657 291267
13228 138109 171810 -40603 4225 375965 86339 -115525 148351 499366 -98424 -42360 -140152
13217 -140152 -70687 -47188 83589 112734 253785 306535 218355 299379 247005 75313 -284608
13205 77966 87053 256065 69333 -175874 228349 87245 304769 -50945 59309 367103 611850
13194 611850 200232 -170449 97500 -133803 -220236 -239588 138524 6827 281594 -14587 -49459
13183 -49459 -163254 247287 -93042 245093 -13717 78482 -153276 -56710 22028 117007 62617
13172 62617 63995 -37217 255863 136835 -60743 -187798 23820 147387 154644 148339 198223
13161 198223 -13672 21605 -272606 86658 271223 -117070 -228457 -167828 -83683 38547 115834
13150 115834 -84014 -88872 -112064 -26962 205558 -189300 141537 90508 226330 168891 188152
13139 188152 94108 125584 212029 -60138 22982 9472 -226032 193343 489316 70591 108905
13128 108905 324180 -48839 144453 -249531 33574 245659 -325504 68555 329126 38507
13117 238539 47651 366423 67751 -45337 -24087 71313 -17164 91156 -30789 91469 349483
13106 349483 132155 126246 277329 -12331 88923 -155030 163542 -9005 -342442 16841 254146
13095 254146 381299 -25681 228408 -46669 -70515 238445 233675 150751 218194 106727 254097
13084 254097 346892 -211028 64478 65771 168949 328666 113958 239417 76248 32384 101374
13073 101374 107229 281492 277159 -285245 -57279 29861 -82887 223369 135534 89794 80251
13062 80251 -274968 93715 -95396 547903 72487 -140881 13710 -46362 235901 55313 147479
13051 147479 54649 134998 -13072 45854 -46627 29411 -34024 157882 246235 110068 5608
13039 37716 143410 107851 -116945 310407 236132 -53876 185187 -111135 74676 106259 267765
13028 267765 -84639 309333 50231 173239 -94559 -17345 -154989 242499 -25721 100136
13017 158787 364972 194243 -26230 404671 -48580 183630 -56505 -37208 -134434 -304197
13007 -304197 -51859 89532 -93721 -270661 301393 275198 -130481 42297 -171236 37458 -84448
12995 207134 171105 503404 282401 -114988 -64648 84288 201534 -26426 44326 103833 -124985
12983 4289 -156606 223602 348606 275846 -346 209277 -182850 75882 133862 25387 85793
12972 85793 204208 203307 116073 12213 14978 211494 130618 -160779 -36196 119636 -183116
12960 106495 -86576 61015 -29970 -288796 65021 -137797 240442 -80792 -52639 323163 -218937
12948 228625 -122525 48324 104377 -158190 -44169 33825 161197 122750 -69424 -79211 239868
12936 -135804 -49222 209497 -93839 -82450 190068 93581 218162 93131 336911 -190791
12925 -130469 -92346 23840 -94529 167431 198849 -39401 -164395 -335438 226180 246192 297661
12914 297661 256794 49778 155598 -108144 -13509 -25458 -69488 -121876 -112497 101825 -217195
12902 251974 -253859 247468 182687 -106056 -142470 93625 -37745 11961 311348 114285
12891 -87365 -159779 195190 225837 186286 -61064 76697 116523 -13590 363853 -55303 29835
12879 66236 -18221 133261 245883 4827 -217792 -86889 211241 -24851 195753 -26603 -120737
12868 -120737 41851 -333427 121022 35603 -50146 70597 260319 -143000 282189 77697
12857 -19567 -479213 -221109 -409122 38014 -76306 -172139 141763 -186967 -32 -134290 -199942
12846 -199942 52306 114991 29540 -9261 93984 176102 71685 -20851 -99939 -28770 397644
12834 209262 243483 -281355 -257761 -1177 245327 218012 -181922 -13139 109341 -6049 -167688
12823 -167688 -232832 -9300 91577 270898 150420 -46377 -68846 -54512 -54061 -202298 26926
12811 -234643 66312 -51279 61974 57707 -99404 -139986 239366 49804 182131 32700 194368
12800 194368 -36515 59421 -198185 -88342 235591 216503 41003 99641 46123 -296097 180006
12788 -109787 -148897 -2047 355547 38556 -126255 -58132 170323 -53115 75052 119574 -86525
12776 -167362 -153 -67075 146662 252662 -257310 298714 200261 79727 27943 80509 -86666
12764 -63197 113756 -43478 274697 278831 -61162 46632 -232697 -39033 -59266 22233 303033
12753 303033 -56022 -137681 -275628 155682 -292524 -417550 99941 -369458 264233 8164
12742 256994 138529 5836 -77124 -7258 36820 -123901 -118156 239449 21061 258732 25026
12730 -127172 177086 252690 -19219 -133650 -373915 -88162 58312 -296427 112146 -228404
12719 -19588 129139 -114066 215706 -217548 105434 239281 32673 548173 218433 169065
12709 169065 116115 -301371 -209639 -86189 112367 342360 137326 200918 265402 -174147
12698 297734 129293 -177879 432980 -137718 98224 466957 171983 201653 -39220 41877
12687 -93303 -156044 257712 84138 261121 120530 -74695 -40139 196911 -164553 -192105 22871
12675 -199856 253098 128847 263468 80345 -135315 -21960 89746 -157143 -18099 -68461
12665 -68461 95108 -178543 39276 38525 94777 187358 -62436 -223732 117010 412615 405054
12654 405054 169997 -25576 -2689 119338 34140 -59854 186133 56373 64482 223638 108435
12642 131064 182194 184664 99949 111142 -219175 171007 169336 -104103 -108886 280157 18129
12630 272638 -231403 54142 191400 -296685 -112060 -61767 -285951 137065 390203 -57737
12619 218288 -7839 188759 -45968 247845 18024 267563 165218 293946 304441 227695 140721
12608 140721 49224 196439 -316133 114328 111552 -38159 -1923 236272 -129585 -27967 -213009
12597 -213009 -217112 103303 -214712 -15614 31571 102316 259819 46426 29626 141323 42731
12585 72113 132029 12028 -49402 200955 302493 422853 395796 94809 -6259 43411 -132093
12573 -59004 56944 -5485 125186 -204078 -315728 129409 91062 -60791 51007 41476 146447
12562 146447 4149 150174 140165 203284 140825 118316 -113599 -274964 173426 -44300 256689
12550 43134 -218404 -220949 -140525 176408 155101 -275933 -144962 -143761 207745 -39635 -225364
12539 -225364 -489561 -277919 -78865 202099 -153838 53325 35529 64812 177112 -175543
12528 112909 -63385 -109735 -8488 -137584 -118312 224046 67258 -21805 -151676 81112 -101496
12516 -239694 190846 181112 -292943 152912 127817 -75115 -81032 318161 -109966 -59119 -72552
12505 -72552 230077 312324 250552 11911 187854 476504 219016 240776 78265 253187 55311
12493 -208095 38376 -391250 231465 -207351 137709 -96173 75507 109230 397436 -136701
12482 250357 242912 21223 136954 -69167 38234 -44361 -25530 185079 46740 -21203 93420
12470 134598 -393608 181938 -158723 -181981 -47998 163837 -117421 398214 -74920 -325079
12460 -325079 -74715 148024 -132922 -144673 173634 -211722 -95649 17173 -25387 60999 140219
12449 140219 -14453 -345091 38712 124317 -54739 138435 10511 245379 -123064 112327
12438 7383 21393 -110319 42423 -75852 -231392 262513 -66736 -322388 -285443 -172880 15441
12426 -228360 141712 -117816 -29591 -301174 -184301 96044 -213752 50358 -19392 53460
12415 -184221 25808 366352 -174198 138285 234295 8151 836 -194645 -124432 161624 -89644
12403 142683 122913 -328727 -16862 -244351 43319 75922 -73316 97830 -105714 -187234 -31066
12391 -221742 69347 -256273 459053 59277 45278 170276 13439 -99440 -136796 26323 207084
12380 207084 -4002 209596 79276 -588663 191688 -199970 172361 67846 262359 52 159524
12369 159524 -185407 102292 -52014 48384 -38798 -52755 244091 81945 -120357 -325135
12359 -325135 -153232 -74265 -54593 -331022 -137811 -163445 112183 201603 191767 -135040 105968
12347 -410825 127935 -269021 132801 35199 192563 13908 -123923 290205 -192463 -316933
12337 -316933 -98225 317080 202805 105041 96172 -40781 -67469 58872 -55862 174173 379668
12326 379668 -238398 30147 -349526 -170810 149208 41108 12090 251662 121846 465415
12316 465415 -12348 -311346 -68773 -63539 -102886 -222136 -9111 -29374 239584 -105300 -2251
12304 -4550 23696 153639 -183941 47897 -167097 -72030 -221181 -266410 -1072 -235923 3070
12292 -274305 253630 32626 82190 -242928 46819 -429231 -253101 -186412 -91521 -107049 149898
12280 -102435 -73130 56363 -86208 29647 -127044 -107336 57276 330815 82487 -109888 157660
12268 183433 92130 -87144 -61408 168591 59724 -86307 99796 -9608 253426 -53809 24779
12256 105692 189375 271916 -69248 126454 131847 106119 -109441 97628 152044 -189117 281204
12244 163389 100063 189486 178785 -35938 77815 -124946 51434 47055 33095 92640 -78552
12232 472234 -49492 -33491 163680 146245 -98702 -109204 353206 37246 -132347 -7188 -5632
12221 -5632 -65211 -146772 3783 456847 210693 -152129 -83964 -49561 113890 48675 193905
12210 193905 32167 213324 450511 149810 289649 -74702 -13972 132107 88849 -152015
12199 100179 315856 11973 -11253 -120474 125030 250362 169416 110695 132485 96324 251306
12188 251306 280330 58447 215431 306528 402562 3797 141856 -82366 507753 332575 203510
12177 203510 112203 108030 365509 140822 55507 104131 173024 157564 -75956 35026 -117772
12165 365752 83634 199641 364732 -202319 282502 189353 287445 49596 208531 464046
12155 464046 72732 62893 146193 470779 66719 129927 148239 -209519 158358 243421 306730
12144 306730 318995 -101724 177144 -9108 233139 123016 124601 136424 -29789 -63566 192964
12132 348895 -204210 83701 76373 -56975 110458 -64266 -425816 -141414 -23267 125780 86569
12121 86569 -13649 166850 -1237 46462 61511 18806 -13752 -266746 -144603 181375 150704
12110 150704 206974 285920 -241328 126885 -198179 -124712 -57389 -49085 35194 -182496 138327
12098 -169869 -67918 167473 328642 -83621 102110 -122949 -32261 -144195 -70548 247585
12087 148512 -235843 -212713 82825 56349 -80660 105304 -216368 -274925 -152031 150570
12076 274673 111022 97261 -98886 -277933 153954 59221 -285926 -7387 62316 414692 -221814
12064 134493 45220 -217739 5061 492050 343667 864164 895636 365991 376400 45767 -205791
12052 133064 -1024 -73493 144460 -45503 84283 347567 150227 109519 42269 -39833 9856
12040 185891 41231 -13634 -259323 12253 -346234 79179 -55136 -552027 -153709 91637 141394
12029 141394 204235 189508 86675 81903 340046 -240383 -52404 132786 66269 -166710 168471
12017 -164116 -311347 -95169 -281077 273333 7454 32292 75279 238943 -38092 54380 -136583
12005 -75403 -88914 90530 -93151 -241731 86747 -142733 19355 -59196 -188481 -177520 -110825
11994 -110825 -44337 -378788 -232273 -163951 109329 157826 -425432 -49195 -10047 -24017 176204
11982 95594 -73883 20798 -386752 -4698 64533 12490 20562 -170893 -194100 -27493 -32008 264399
11969 -13199 -192568 -48818 -20850 -217455 44594 -204462 -129452 -94812 -104136 78493 132578
11958 132578 -202853 -101662 42302 -158739 44356 -62775 27604 12651 30022 -57784 61667
11946 235288 -160656 -111019 -133360 50944 116680 -125566 -378651 -227755 -277756 84357 -146975
11934 60342 213466 7701 123696 332287 136970 84204 148061 -308542 -123468 -18010 -250743
11923 -250743 -259483 -146752 389758 -60929 -76166 -64803 105951 88092 203002 -175917 -67339
11911 97969 -205767 208895 165055 -133504 65631 -85515 -273098 -109362 -55208 -246955
11901 -246955 110387 385219 -68864 101625 255916 31515 -11539 226643 -1811 -276888
11891 -276888 -265546 30517 29770 10650 300502 -86184 -63504 -58445 -3722 296408 32665 -24474
11878 -207161 -55164 -90601 -54691 43079 -145172 207955 -337572 -108004 -169095 81385 59635
11867 59635 -111331 -53271 67474 30299 -87568 206703 -79639 -27349 -132388 -276970 -200840
11856 -200840 -8254 341752 -120030 63953 154426 -218030 -45430 125017 95562 -204348 -351301
11845 -351301 83609 -117083 -46060 -135145 179715 -119973 178673 78497 -127564 20193
11834 163528 19195 93494 240127 23716 -16614 -233783 56100 -149410 -454746 329257
11823 84889 -35056 -2669 -70203 -135391 -449080 -71089 -192940 14055 88549 -166464 -157731
11812 -157731 -71180 -88999 -42427 21044 -153701 -375063 -155179 -140789 -221657 85275 108240
11801 108240 -48812 -185374 224469 -194920 -220026 -219505 -268537 -162272 -1717 -126556 69368
11789 -257221 -126870 -113740 102595 123988 -201086 25414 26479 -346740 -183942 95547 55663
11778 55663 -81970 183784 241328 102003 -114377 -4002 -54432 -58917 -141930 -30580 -127736
11767 -127736 118895 153159 -116684 92389 -139602 -3862 -308189 178671 -332772 419677
11756 3171 187976 -230640 134488 -57342 -159374 -94970 27819 -52082 -39407 -313849 180267
11744 120150 -67450 -224065 13839 65662 -131649 281605 132863 146988 -177697 -157623
11734 -157623 11019 -42860 -152691 -153810 225940 25283 -434458 -81745 184583 -20899 89647
11722 89562 -20493 -86674 -321557 30257 65784 7068 211949 162148 169368 24338 70395 114571
11710 114571 164530 -29874 -188260 -63756 -301949 97199 257580 228912 -42755 -185213 56407
11698 -169816 221707 388551 -65434 -56467 106953 307847 102583 95174 300145 -88485 115659
11686 77974 10307 -269315 72492 -559626 265447 -268147 154811 -40367 -415599 -99646
11675 3907 399692 19120 -55164 -155613 272514 -114393 122369 -337822 -58698 -70519 85682
11663 27371 -255097 299026 -55172 94022 8069 -25694 -72265 -56589 411933 61450 -26298
11651 135522 15340 154230 -32611 65972 -124173 -112641 -241678 306941 20503 243313
11641 243313 -50786 -60570 88542 53940 -266306 384063 -91013 -95603 -157007 -121380 -295964
11630 -295964 -138966 160970 17452 -4084 -175629 -2987 -188434 -34340 -204938 -306671 124983
11618 -164781 -259914 -43814 65808 408375 -158267 117007 122222 8897 96965 100859 63527
11607 63527 117110 149623 -31542 128925 109305 -99619 41432 -253113 -50032 77496 -210737
11595 169411 120314 14717 182758 40092 -80121 355784 -272193 -37278 -133274 -305614 -130611
11583 -28547 -292662 6125 245485 72932 160185 142036 3975 -66158 34238 -66643 243587
11571 174256 86226 266355 159578 -65546 74608 -38900 -34501 -171934 165232 299135 -26595
11559 -181473 5333 54850 118492 59659 -110080 8888 24184 207515 254967 195255 -75248
11547 111705 98253 42248 18374 113561 73933 195439 31660 92557 -32322 495253 118568
11535 119396 369576 361474 123719 -80716 -98238 80902 185132 67757 -104450 268330 -39170
11523 180490 -89735 306161 184525 -177576 257889 197029 40801 2033 80068 44763 -11712
11511 -299621 20291 294634 97794 128294 -212482 271945 39877 106116 -75389 478261 201652
11499 7795 134250 66244 -2417 270167 -102300 106701 -29909 427026 57558 47457 118780
11488 118780 221332 183808 -61004 -242743 -181000 81873 145089 201961 -216096 -130167 53224
11476 132350 -18468 243182 -4278 430727 -59539 158598 255214 452431 -50471 -38303 188940
11464 111489 231926 -80851 50611 134238 109699 124133 120270 11362 -5818 163837 -23375
11452 122366 333513 114287 135836 250671 -16452 278130 307066 105222 39007 57354
11442 57354 -143102 349196 -125035 312204 229396 256384 247121 -313073 -127403 212105
11431 118549 23745 -249312 -55773 -110434 22741 47343 -192180 143895 -103596 -262522
11421 -262522 -68744 88607 -33441 391664 25515 166932 -44459 -230634 -123056 124972
11410 130966 63642 317293 164183 -53756 -172659 390569 324221 22969 -78277 -33472 -91839
11399 -91839 -107849 -199684 186238 40699 17429 -58500 -161611 285082 111168 -99073 521775
11387 106577 241545 33744 222638 106967 -344967 -93727 -2327 426438 -91059 -84896 -112407
11376 -112407 -92448 -152898 432050 174797 29748 -14556 34938 -124280 76734 -17743 152495
11364 303674 -20633 -238941 -71093 323767 -128621 52111 147602 -45225 210424 180999 -139244
11352 45980 40448 165484 64312 192912 -80890 80330 -147527 126663 199723 -49996 166205
11340 -193568 -50131 100355 -20953 -72993 -6263 152615 -100162 -37421 47292 -55665 -420666
11329 -420666 165372 -398812 -39223 -113415 177168 -118373 24559 75475 -315914 95713
11318 -72015 -21321 -85606 -163515 -171331 249916 55057 7889 48066 -113534 50981 -155079
11306 -129872 -154858 68979 -176545 -246425 16489 79130 -277176 40162 142859 77246 -6237
11294 -130788 -246836 -100130 -323979 -42245 137538 -122444 297256 -39145 62077 -179352
11283 18716 -343522 54969 -257500 121483 82858 -92992 -469566 -181406 39718 60920 71790
11272 71790 18469 -56021 65520 -154569 -329225 -29770 -347073 -168207 -278142 -137617
11261 -161592 30901 53117 97150 175323 -83575 -131135 -276274 148667 419778 184149 57033
11249 -136924 46759 -110994 -165683 -284808 -227854 -73628 -23231 -128523 3876 -388210 -116513
11237 68903 92900 66946 -146225 -243476 7608 -157359 4495 -121541 211450 92491 57688
11226 57688 206016 294281 -68109 -298826 -112919 -227120 -160203 -102931 -228758 25998 37104
11215 37104 -268360 -248506 275312 -90054 -129886 -194881 87330 -12333 -125625 -37153 -18337
11203 -77209 78940 -270537 -30348 -134285 10567 284706 72612 209650 97274 80190 -212726
11191 -118998 -170401 -117316 314265 -7125 269251 -119758 -218164 23517 -74361 221529 -60006
11179 171168 -137414 -58229 -245426 105429 -175047 158733 -256056 186760 -14170 -277810
11169 -277810 -314921 -395089 -286171 -22659 -38194 39985 338254 -34996 31917 -30434 -136515
11158 -136515 56752 -302797 -74420 -40521 208185 92844 -80779 -319667 -152251 -176638 -206220
11147 -206220 -84148 84422 -183540 -218514 -45973 148701 -222054 124094 116883 -171368 -172517
11136 -172517 195387 -133851 211442 -92922 -104480 49734 120934 151795 203986 54706 237617
11125 237617 35506 -137712 162291 -53144 240558 -32541 -146266 -72269 -343292 220840
11114 -11920 208721 58523 188030 301641 -37215 -28084 12361 44430 62860 170319 370054
11103 370054 277539 289459 -178284 119396 -166729 -248074 -429226 -49821 160010 135084
11093 135084 -94307 216059 68921 251929 -69372 -195342 214725 58051 123352 171761 380435
11082 380435 -36635 107198 465687 132700 107636 -364 159849 371465 102619 51434 484904
11071 484904 66029 -36751 287897 87931 9832 547374 375181 176527 324970 196372
11061 196372 227687 219296 517385 443317 123050 456128 242836 219171 313226 419501 263554
11050 263554 412483 371134 323122 434769 420664 410657 747648 619139 328373 219947
11040 219947 471932 490056 505257 705736 748674 739208 168584 644368 642322 714948 683531
11029 683531 623509 678482 522176 862643 650441 505813 704281 768304 390968 722075
11019 722075 662464 644922 564778 604185 603173 608582 804113 641783 487983 584934 663425
11008 663425 555904 631304 833910 578600 766998 866708 444547 411793 672182 481076
10998 481076 569459 654067 445310 272623 422195 662964 628353 618289 559587 784954
10988 784954 372600 677754 625534 410461 813701 547151 562687 706400 776494 779276
10978 779276 643040 741220 688234 773176 632626 713980 649403 680609 993692 1038761 1061330
10967 1061330 1331189 1164101 1388909 1299055 1472606 1620884 1809883 1917285 2320365 2313419
10957 2313419 2722451 2708724 2513798 2934871 2937271 2222916 2254070 1863650 1841332 1808694
10947 1808694 1219798 1629683 1384167 1388550 1290734 1457599 1736776 1273775 1238612 1159703
10937 1159703 995741 851830 1000939 635722 665434 502044 550064 357578 456043 230164
10927 230164 376200 99751 -136014 581400 -158025 242510 -80283 167783 -60201 212060
10916 12916 253341 125171 88981 445420 453205 35070 342957 163218 281006 -96085 71937
10904 -171425 -207263 -51656 154459 301679 -472688 -23501 -133349 71229 -93936 -137102 282853
10892 146913 172358 -184175 -171031 62006 -118851 50750 62074 262304 -250453 144736
10881 43854 -84396 -144309 -28610 -238457 -50964 230470 -23173 220480 -119728 -7570 199385
10869 -24073 168911 -169311 -25276 254413 -159840 -198042 231749 348092 81349 69043
10859 69043 105534 43688 70244 332821 286228 -305318 -154662 -1154 -131116 72256 11897
10847 -122631 -114003 54764 117855 -506147 80619 -105359 -246496 -89558 113265 -112367 -41845
10835 -34474 48823 -151817 247259 -174710 747 -67748 65750 -221813 143658 64560 -18992
10823 -220637 -95087 -127111 44513 -288014 -261808 -239414 -205242 17026 269630 54182 -451804
10811 -114649 -47863 -24859 12726 -229203 -253423 -64259 -71415 -33732 132368 73640 206655
10800 206655 40544 46838 -403358 -500263 -191236 170947 -371587 -74121 -260943 -184738 -218378
10789 -218378 -136505 -233700 -177986 -175604 312440 -257350 62369 -88217 -286061 227428 -137055
10777 -105870 -30629 137625 -289662 -246671 -136900 -174289 68142 313495 -21367 -202884
10767 -202884 39577 -241812 -90519 -264822 -151918 -164235 98127 -245382 170326 38442
10756 283551 -140943 -249286 203668 -188621 179275 -40467 -139761 55791 -34995 -133201
10746 -133201 274088 -185698 80133 -146099 -139446 -127294 139139 -82068 -251916 -106638
10735 4297 -81895 301621 -111551 -16972 59750 -162381 252197 240680 2908 -201758 -127188
10724 -127188 -188192 -100073 -230172 -117478 -66039 -31027 20488 62776 -254013 -79024 2429
10712 -44713 -83774 90138 -284989 69279 -40159 27048 -62042 -160264 -104063 50148 291209
10701 291209 -404732 -79912 -366188 -404039 212315 -121376 -247785 94117 192164 -236847
10690 -164881 -48456 110725 51427 165023 -21991 221366 149930 99799 185783 -166602 199655
10678 42828 64006 43786 -16542 19746 196850 156438 -166007 -163221 10199 -122545 -264797
10667 -264797 76837 -176638 -176637 -209983 -18368 78451 72527 300549 22954 46586 154936 -337731
10654 -244732 333063 -233335 -428104 8896 24702 -100987 78320 -25408 -96144 24593 102883
10643 102883 -63071 124161 19522 -105402 -135391 -108514 -286195 56388 123006 -148025 75428
10631 -193354 27248 -148578 193327 -406550 -175483 -41398 -192638 62220 -9585 37478 107123
10620 107123 322609 -40518 178224 -118256 -121350 37285 -2801 -71567 -218161 -121310 -294314
10609 -294314 -264077 154775 -238264 -266433 -57479 43601 -367392 -194476 -356571 -306364
10599 -306364 -47128 17963 240345 -157328 -185972 90194 143132 -112785 -30029 40606 -41976
10587 126443 29712 -86952 37751 -350790 6327 85733 44051 -2471 143848 153793 -226483
10575 -280043 -58554 -161686 -272905 -185829 -164422 313144 -70242 78805 34716 627368 -202851
10563 -417585 150590 -154411 -373247 157421 249580 -154709 -116448 -279980 -56423 111506
10552 375712 -94877 100747 38629 -39764 46959 -124447 66005 190821 49121 10660 142759
10541 142759 -265099 135505 -156244 222531 -162842 88972 -198126 -49119 -343283 -88165
10530 -29886 121236 220333 -76030 312089 -73942 -109052 -88660 32739 -69326 138684 16015
10518 -52646 -86528 -188130 81768 -85914 -215656 21752 17878 110617 -296968 -4777 123762
10506 -242231 266005 13464 -181693 205741 -28029 -236799 208078 45208 -143333 -94120
10496 -94120 -365013 -168146 -79844 219073 238818 -251281 121889 634 117601 182563 -10862
10484 -98575 -29409 -143774 -60916 -145324 -18491 186333 -184315 -211598 142429 -59462 -57229
10473 -57229 -220925 -167385 148617 -95188 -30939 113956 115800 53630 440796 289895 148617
10462 148617 122632 7717 162600 50690 47208 44965 -139507 -422833 -60596 -292216 215021
10450 -7003 92059 -11370 -78736 -15634 -63067 -221543 300560 -143489 257518 -79871 -224667
10439 -224667 -75055 -65051 -72703 -160570 -141404 -59608 -67735 325967 -267683 -288863 67781
10427 -69155 -121021 -256716 59121 -124562 -134869 181850 1198 -132526 113407 -120550 165277
10415 -241795 -200858 37215 90887 -18071 207870 -196854 -311454 2614 -7779 -150716 -86546
10404 -86546 -301281 -178559 56360 -43859 -52365 280543 678 153665 65732 -245313 -16926
10392 122717 167060 277664 -250445 162265 -24784 16941 133322 127390 19281 -7022 330505
10380 -94570 97390 -131420 53795 113279 324744 -74746 231165 142382 444315 113852 182102
10369 182102 148581 -31567 -347136 100085 -15440 276427 257383 -216917 -159 -5140 271215
10357 222375 -57375 4180 235836 50270 320159 292811 63612 132143 111599 71376 418450
10346 418450 494212 64178 125410 2986 -59002 213315 195979 98430 55829 32718 182813
10335 182813 359643 302813 486380 113685 165643 421315 64727 287144 479702 89810
10324 25734 256623 402689 142105 -8652 244101 211332 -112095 -48305 -40830 209029 104961
10313 104961 105410 152132 166666 220973 353615 182557 287151 307705 434503 13401 334240
10302 334240 106052 -32697 60613 -60588 163003 65092 -54798 83741 12442 -163282 150865
10290 208261 171409 82284 -125780 19300 188799 -67229 175113 165720 71437 87985 94909
10279 94909 92265 -596 -4327 -259326 -210889 9101 -304164 59562 30250 -91137 123804 -107984
10266 -271176 -37264 8726 -274103 -173265 -348778 25179 -134283 37942 -107835 37812 -114001
10254 -138305 -313415 16978 -106898 -119485 67326 -8167 -21636 257238 186759 459691 -8462
10242 39314 276022 -30340 258482 485895 -271450 -164913 148328 190703 7672 -199038
10231 -213022 34230 63876 200728 93896 210157 234229 174320 305338 -243820 35380 -576
10219 77694 -162050 -213123 -16231 10203 50719 -1581 74082 -18746 181994 73509 -274316
10207 -342074 40820 299498 147163 154690 -47310 -101945 -124855 3334 199491 -90436 68868
10195 -141780 129428 -384392 -130176 -121047 308336 -100003 -525538 153155 -186360 -97060
10185 -97060 -155526 52326 -32974 -240999 42116 -274002 -162166 -115653 359691 -35087 -243892
10174 -243892 -107589 -105201 -65286 -85754 190522 -247321 -220372 -173109 -18462 134310 21432
10162 314735 204938 140443 63620 137296 110007 -207276 15498 -273702 66843 109244 -84621
10150 32774 107130 -84834 -61658 -195406 -169299 -122057 40639 30340 -179940 -63168 88002
10138 240778 -160946 205135 -519236 170300 -482829 -124648 -82187 -79421 15905 -171563
10127 -68258 -47779 380016 -185592 -59046 -42612 -508339 31634 -63878 25929 164961 -76245
10115 -111274 -39373 -89624 76838 -23271 86343 -208854 -117724 -87324 -165665 181621 24085
10103 -73701 41915 105935 -96825 114861 91764 103641 -7704 -2616 -109444 60689 98492 308545
10091 308545 -238764 32450 -80883 35017 -37997 260511 21936 136433 -256588 -80869 -314258
10080 -314258 -304601 230576 -357482 130003 -309038 -147838 -69986 -358369 161247 -207005
10069 158280 -3867 -224259 -19972 -267669 2806 183988 -39086 -339870 -184841 -59634 49051
10057 -339711 -6609 -316289 103234 -19658 63865 65238 -144021 -8681 -68937 -207165 -338993
10046 -338993 -45430 131467 -182249 -138222 -7233 -21628 -197287 -83442 64027 60716 -84597
10034 260503 187242 -142452 76656 -457913 151195 -141067 397959 -179017 -146192 -158516
10024 -158516 -87759 69660 -26443 -314649 -87927 55921 -371130 -273064 26547 41530 -260023
10012 -155533 47901 295501 -220675 42312 57063 20827 -378500 221534 70150 -475693
10001 -404685 -229748 -307390 -26401 110050 -19945 -65911 -268485 3316 230023 -274203 131797
9989 77250 -118399 -138329 55347 -439132 97096 199918 162290 -207606 -267957 132769 -175348
9977 -53264 -319896 67208 -232376 52291 156373 -84343 80706 -22818 -168274 28442 -75221
9965 -176296 -488735 -118153 310241 30960 -4325 226518 -187769 140303 -253508 -123128
9954 -187923 -62117 -86411 -257239 -273931 -164358 -177752 -125950 137171 -51049 25582 -134847
9942 33925 -257942 -112271 -41073 25107 1046 233312 57493 162283 118116 106585 120931
9931 120931 -133016 8977 250017 -107150 -78778 120192 -73897 100169 28343 -52372 -103781
9920 -103781 176726 -498077 -90182 -95551 205059 -179202 -51812 160263 52724 -254382 -246396
9909 -246396 104127 210700 -68342 -189573 155570 284151 -78123 -224664 -141601 -286934
9899 -286934 4000 -109648 -408568 13556 56166 21751 -254868 313542 -81242 -240993 96778
9887 261296 -115815 85888 -84568 92642 -1201 -189482 -121899 -327200 -120182 -189243 -312541
9876 -312541 -30174 -105878 181685 -285345 -337265 -414932 -140847 -153393 -196009 54672 -143548
9864 -122183 -234030 -193385 59770 -232795 190634 -98626 -267403 -402149 90247 -46757 -47573
9853 -47573 92097 -64733 -52337 79950 -142297 -127006 2992 112667 55859 -139500 178555
9841 -188776 -318772 282569 -183827 20622 -26742 284313 12146 -207990 53283 118974 -154988
9829 -12093 270206 -127115 -70206 104943 140176 -259761 -22151 -143964 -183365 -248559 -87104
9817 -213644 6872 141345 -48401 -96347 -132595 142645 -175565 -292979 -234387 12280 49342
9806 49342 -251921 -45487 -113241 -269686 -214361 -62937 -53003 198039 52918 -202827 245755
9794 -4788 267740 -166099 -220227 26887 -228311 16439 111902 -212303 -62236 -153518 -39138
9782 -196952 45690 27239 -69803 129386 -176572 10059 -173336 56240 2095 -58042 -43593
9771 -43593 16056 -61808 -89928 116163 24291 8719 -153896 -38428 144318 -200451 -190087
9760 -190087 -119061 -33381 -108954 6054 -308390 -185022 -143519 -303134 -185038 351549 219926
9749 219926 -78030 27626 -27886 -141509 -2055 -99805 122904 -248971 10610 -304914 -282461
9738 -282461 -40260 69488 22575 -50889 33625 88964 171907 -277135 -192216 54005 -55143
9726 -155160 -323826 -184471 -144334 -64743 -108003 -355250 -140291 -214190 -216446 55273 143762
9715 143762 -142770 73585 140574 -168432 -135345 192387 142202 -232651 -61472 -235607 165582
9703 157240 -178455 -299205 134438 -245720 95494 235905 -44574 -158062 131448 176733
9693 176733 -76397 130338 28667 62973 101938 -161441 237295 -196239 -47414 52233 -107519
9681 220234 116955 -153544 19276 -83453 -179306 -114963 25298 -309854 -34213 82225 -184538
9669 404048 13525 -136961 41970 -306926 -89865 60097 -53985 -128483 -90365 -14726 -232154
9658 -232154 56645 -264823 178541 31572 37465 -63280 -20390 -38182 -212698 -199098 -11195
9646 -290391 72487 16237 -69006 -20159 -542061 7396 47137 -180242 106872 -76505 -46931
9635 -46931 -313169 -149360 -28951 62615 -508574 -143400 -68604 107813 -265582 -46354 -215784
9624 -215784 -61296 275536 -63197 -263750 -429540 -147650 -40854 106224 -192860 -264963
9614 -264963 101969 -161182 -58386 -262229 -226191 -438465 143052 -196894 145821 226937
9604 226937 154605 116764 -391252 -250691 -97284 -323417 -370774 -27173 17656 -138762 96154
9592 -98267 -253550 20599 13251 -94030 -217236 -225979 352209 -265777 -92050 -83581 76880 -152831
9579 77070 103617 -289841 -370001 65147 -216399 -74625 -11234 -87556 -474611 -363290 -280974
9568 -280974 -269368 -425306 112472 139650 -123953 117649 -112741 -11503 -154299 -146633 -378086
9557 -378086 -91953 91380 -289123 -105037 -8606 27408 -466 -131473 -163549 173279 -35615
9545 147998 22623 248995 -89523 -118318 -75538 68150 24885 -10956 -219135 -11530 -97997
9534 -97997 -75805 18635 -29191 62102 -26473 -87936 -128454 -365019 -19398 -167969 -167410 -59411
9521 -27559 -249339 -14171 90463 292108 126508 35402 116175 -155751 -201569 -133571 -15228
9509 -169946 -371932 53407 37665 -198970 20258 -37699 72669 -41707 144949 -33736 -366052
9498 -366052 -155791 -112875 81145 -166012 -359145 -537671 -171314 22510 -114150 -272062
9488 -272062 -323902 -195987 -203552 189176 -197470 50191 70195 -131115 -34652 -98117 138765
9476 -127547 -281923 -190285 95147 -97261 78435 -262796 -190828 2257 -201075 154204 17885
9464 -487224 -26420 192812 -223016 -120200 152310 -397855 -13324 -39636 18172 -220284
9453 177186 65892 -153900 -156495 82179 64716 79945 -416239 77327 217655 143915 -192487
9441 122543 -20933 -87518 -193117 -345865 109390 -76238 281133 -108429 -207206 -210512 -343946
9430 -343946 -31397 -98537 -91641 -33629 112578 -168787 -52667 -19431 -198041 -145776 -125330
9419 -125330 -143163 285126 -166340 363540 -19669 -238714 -8002 -181045 -229570 -93113 197463
9407 -26841 -387097 148302 -99916 131127 52818 -373715 363386 -152417 -369282 302625
9396 262449 145413 -194898 -122435 130388 -105501 -286650 -359624 18896 -7443 -51928 -261804
9385 -261804 254190 114700 73523 32653 97834 -58175 -68648 233561 -271234 -102468 102199
9373 327439 27346 -155694 359645 35069 -140110 -222847 126547 -51354 -215187 29513 206934
9362 206934 -7256 -66749 -57261 108366 260723 -87196 12967 102354 46959 96128 191037 -205624
9349 -128558 -238677 -303283 178464 -59073 -430966 -88592 103235 -146477 137493 -229175
9338 234808 -205359 217037 22828 313257 -88413 -213746 190510 52805 10668 -80135 -90729
9327 -90729 16754 72198 -160353 187790 47039 -193999 -73614 -219925 -303428 -38862 136242
9315 -83496 -105986 140926 57764 45678 -18506 -304441 -120889 -300312 130947 -132149 -29534
9303 1055 -131834 -219465 -247244 -180748 12570 -45493 -129862 -156553 -137949 -39893 48356 -49914
9290 -54562 -181060 -365419 -18868 -188469 178466 -200622 -32102 -20667 125014 -185156
9279 -138801 134625 122741 184086 -175822 -110030 -73556 -258405 -281419 -18428 -114054 121706
9267 -285118 -12292 -238606 -92820 38583 272600 -88135 4190 -363086 1533 98792 -267658
9255 -188567 -60175 -16930 90092 -84059 157694 -47403 3543 156145 153680 -123970 -236589
9244 -236589 -170747 29536 70835 37168 -287076 324516 -158274 -301292 205815 249900 -184484
9232 -230473 146033 -12980 -51824 -191522 -103398 -340506 -34863 -104478 -42078 30345 -257
9220 185835 -39392 79430 -14002 -136088 210628 52602 -31218 -183923 -389088 -280142 121901
9208 71906 -366288 -15336 115660 -222922 50632 -55842 83362 114955 -201079 -119946 -160102
9197 -160102 85648 -276639 12171 -210325 -26081 -364586 94813 160777 -259708 -140690 -250350
9186 -250350 46318 -209370 -91786 57684 -103902 -99367 -10553 -76693 -15041 205155 -140725
9174 -8264 155532 -22751 216964 167509 284424 1621 -245751 -268258 -81041 120582 141318
9163 141318 -19956 3660 107674 222330 83087 -89944 -181988 91599 -109402 -139714 -308025
9152 -308025 5601 99406 239859 -281011 -57192 -458201 -22523 -105561 321696 -253244 -131963
9141 -131963 -123405 -154144 -344876 -86851 -13139 -74628 57139 12818 30210 -12909 11107 -534373
9128 229279 -189116 -63450 -7342 147143 -384115 -73829 286168 -63366 -180079 -111539 -86769
9117 -86769 -67784 186691 -135567 -102503 -117321 210539 -47017 151504 81009 90019 -45161
9105 -274825 -226324 -238830 -352747 120265 161697 -282302 -160633 317513 -239272 567 -148813
9093 103110 -40313 -63773 -124927 -16265 -79014 -149853 132696 -100522 -319198 -197183 3054
9081 119668 -312300 -66046 -69998 -91560 -72454 -36986 -138499 -174002 86806 -129610 136580
9069 42750 275007 -185533 212286 -178269 26559 -64219 139625 -15862 271210 -186630
9058 70326 -24359 -101649 -11221 -199211 108397 -257788 -136383 -208819 -21497 -100286 -90803
9047 -90803 -138465 -277092 110322 56211 61098 79079 -13257 8243 -46667 -176469 -112000 96137
9034 -142341 -105304 -134267 -2789 -68541 -106227 -8688 -41146 -338736 122203 147041 -172716
9022 -146376 34425 -147631 -71947 47153 -71669 88437 -54648 154839 58540 -407220 -140033
9010 297106 -338493 284579 48178 -95755 -310176 63175 152026 -115311 -138435 -243298 -29110
8998 -30975 -48408 47681 -170747 -285233 -323002 3117 68487 45909 -81557 101852 121562
8987 121562 -210805 -18612 -88092 -50010 64939 132462 48414 94303 -41551 3382 126468
8976 126468 149052 81303 -215149 -418202 196044 -151068 -50740 25175 -32490 100435 110534
8965 110534 -62414 142014 141808 -194131 -38690 22299 -90732 -337422 -36015 -132148 -2116 -229580
8953 -229580 -208798 35235 -162987 -61348 -199808 96503 -113098 -32997 -157639 113263 -22909
8941 -330228 -219085 -160857 -115309 -338947 -8380 82087 -334322 132335 -37557 46972 -298322
8929 -25411 111399 83626 85093 -50253 146194 -157442 -53186 -14259 22789 -21249 281693
8917 201042 352175 304979 191314 215711 167521 461698 1108154 847516 1356132 2178648
8907 2178648 3425778 8282128 9914950 5144167 2602641 1111816 1067105 463775 350032
8898 350032 278103 480579 315661 268228 -12139 123347 379604 315395 -102326 126285
8887 112648 -398746 -91997 44868 331530 198415 -117857 103319 -188580 217664 -199000
8876 -153611 -167616 216786 -298389 -148952 129205 -56486 -18051 -200387 -334073 70436
8865 -31462 165648 -53095 43755 -52979 -40352 -25528 -211137 -142864 -76089 23486 -12660
8853 -33465 90249 -405308 262781 -301229 -171013 172124 -91225 -406448 -52545 39150 -182619
8841 155704 -10879 211574 104433 116956 -172407 -97035 411486 15745 -174536 -64866 161934
8829 -292731 -438283 159684 102260 12476 -271817 -192904 -111552 99110 -78311 -227119 -358740
8818 -358740 -68458 103349 -400756 130326 -38304 -379606 264691 -30192 -417386 253495
8807 36877 230319 -171744 -144330 -54887 -23470 8541 -90329 -10128 35117 -195648 -57126
8795 -89200 -125261 -85264 -36850 -109651 48290 -240373 -38856 309713 -52953 64294 -194062
8783 194702 436388 -285770 -41594 270321 -81985 8288 -205229 181602 -98276 -62261 -46656
8772 -46656 -206207 49217 -143218 107285 60418 -205328 9262 -130396 150442 -114199 -179415
8761 -179415 80149 -165170 -146236 -130951 28469 -150123 -137496 -43925 381778 -127277 232024
8749 -213656 330445 170419 -147938 -26428 -28971 -169686 33076 -348563 -184543 -177262 -191209
8738 -191209 -221956 -177266 211365 -52972 159900 6312 122116 160884 -137007 47720 175803
8727 175803 16261 -149889 -254310 -185621 20238 45012 94286 106097 -181070 -351784 -144831
8715 171682 42998 -125138 -89348 233494 -108246 -115667 65762 -45411 450505 -60129 97653
8703 239693 -148282 -208238 141637 -51669 -81778 191953 -8426 -60052 -14875 -237867 -143237
8692 -143237 71380 -98361 -51035 -111067 -83757 43531 -39413 13962 360190 -122991 84758
8680 -18454 -65121 -272125 -187849 -177921 -17716 -144887 -29928 -85849 -10517 -98171 26864 -79716
8667 -285669 -206994 -67851 136076 -166728 -137460 223058 -41807 423772 359149 129366 48329
8655 -10329 -77682 -174421 -186949 46061 44628 -392872 40295 -48037 -81374 6525 224034 -50199
8642 -38911 -178482 129336 -121992 -154376 -117284 -341870 202574 -30768 131767 44161 -145497
8630 -191280 -134088 -47040 99112 -194195 199065 76234 131071 212698 -145744 -243048 -38355
8618 -82455 171071 44553 -237248 -245133 35921 -406426 -149876 -163584 -107545 51815 -63503
8606 120056 -273561 -205851 145618 -162526 179900 224070 -3518 206064 -189221 -125502 -131354
8595 -131354 -96916 34081 220069 60116 -164413 284057 -48553 348397 10181 -165006 -188052
8584 -188052 -27740 146696 -36209 -71368 -86407 -11788 -128004 -127648 -342870 232038 -268151
8572 -70840 143508 -60139 223172 -368338 246468 -436603 106743 -41754 -189101 -134804
8562 -134804 -126588 317300 110291 -294046 -52943 86820 -5289 -20963 19017 73475 -23101
8550 -184912 -200794 112628 -97681 212208 9644 -35723 2781 -106575 -372167 10947 -182804
8538 -153023 41698 -314144 -266592 -52037 -37923 -177635 -309166 142115 243120 128599
8528 128599 -170384 5612 7332 -35948 -68145 -272733 6126 107514 66472 120631 250789
8517 250789 -215233 253802 -31735 145390 -5206 -314934 -57793 122852 -166606 -256699 9576
8505 -8790 69683 -99294 174434 214059 -72321 250263 -162156 8498 -85948 -10629 -57019 -225558
8493 -225558 68719 -104598 37471 127653 31227 54107 11086 92160 -309171 -114777 -341252
8482 -341252 349389 -27484 -353168 98087 -154336 -155333 58915 167468 -41551 -566245 -327848
8471 -327848 77711 -115227 117859 -68172 -67080 -50727 37060 54238 -35043 -119549 59577
8459 -70184 -120984 304662 5972 -129799 -222770 -108318 -489215 59694 -37909 -7642 -53392
8448 -53392 -10427 176480 -70676 136597 -30837 54581 180734 -66392 -133376 82524 -193885
8436 7977 -173723 236231 178381 -94680 -223668 -100520 24412 -112364 -249747 -145737 -291407
8425 -291407 -172008 -183539 -369554 6340 173223 67996 15168 114556 -197169 -34821 -178709
8414 -178709 -254482 122774 -175427 -506946 -106935 -19912 -126603 192771 -282731 223195
8403 -197525 -271007 -96031 33181 -97929 -73399 1286 -143809 -581227 48931 -32909 -86488
8392 -86488 -57157 49575 -392112 77291 -162186 -71180 -27552 48013 45226 -97459 46228 -44897
8379 -443268 17435 -209089 161055 -337035 -18244 -289723 226279 -175536 -109553 180444
8368 -116577 152885 -177556 299954 1868 180647 -404259 -285671 -297550 -501967 -44584
8357 -208873 -154837 45139 -118412 13475 -115878 -145794 -249 -27355 40437 60753 -49313 286239
8344 -168493 -43577 261290 -142147 4273 175305 -72526 -23084 -329507 -279674 255473 56007
8332 -64103 109186 -450852 -24668 -104284 -301544 30543 -282694 94311 130480 -163006 -215683
8321 -215683 163485 230944 71265 37825 -52697 -192821 -36259 -609416 65275 68423 135844
8310 135844 -254191 27212 -179262 -263469 -6392 -280172 -552403 -214568 -196191 -149695 -277429
8299 -277429 2080 80222 213418 124668 -72683 -277161 -4565 122760 -373763 -150603 127502
8287 27134 49723 -342762 75565 79200 -37875 -128110 -197925 19181 -223226 304474 144006
8275 333681 93345 8608 68871 -231573 -500158 -281088 -14830 -14892 113859 -188312 -257846
8264 -257846 -25726 235839 -207802 -76429 -122249 118207 2548 165887 -12106 374883 75472
8252 -330004 -371244 -223223 -379650 -19730 160723 -51620 -211326 -103670 -166475 4142 98259
8241 98259 63136 -28573 -10846 -223597 -292451 336696 226330 -145582 254356 -289999 60988
8229 122772 -237467 434362 -104433 109212 216785 -165195 -110059 289473 -53667 86962
8218 -87569 39402 -102222 230970 -214373 106058 214755 -454551 43510 -30834 48408 212009
8207 212009 55729 -50202 -100095 -211826 12414 262539 163884 -53099 -54630 146780 -355852
8195 222335 53617 -114647 -248880 -85746 112914 -119618 129607 -319132 -66733 -41100
8185 -41100 8711 189734 204961 -246195 58148 20893 -200171 -59916 -241808 83874 -100790
8173 -101609 -36665 73359 -361688 -227155 -10107 -219605 6326 69253 -101255 111230 -97747
8161 76919 221031 -521928 2634 -291741 62124 2101 141757 -278936 -37795 24674 -95044
8149 -66999 96349 -56370 224105 -94266 -6481 -22671 -10766 -150935 36276 71422 -330868
8137 -170892 86277 351535 -16666 -26935 -198854 267945 186995 34477 -93510 -93371 -49162
8126 -49162 94806 -288731 321000 -7148 -182840 7099 123408 67072 162604 -140416 -128109
8115 -128109 -58472 227218 14323 -100546 69079 -47399 -165775 68551 -102636 -306001 95052
8103 139704 198859 -5709 -34057 -256677 -216486 176672 180969 -119810 -89904 165791 59451
8091 -52909 -135458 -126106 -104845 -170239 -156228 33444 20797 -57145 -29111 -299644 -276174 -57948
8078 1918 -23594 -160383 -186188 7843 -325466 199213 -168685 -173429 29638 -163912 211464
8066 66784 -170086 -150299 167052 160153 -57090 -290770 -109522 123549 -61474 -27271 257684
8054 23883 -229051 -25707 -162748 -100145 153376 -108995 -191942 -204052 -255778 146697 -130049
8042 -169147 32640 -6878 6057 -148649 90136 -92841 -332664 364191 -215629 134199 5002
8030 100591 -149133 32602 114047 -146437 438052 -39715 -318253 -255736 -286926 -5534 76708
8018 184954 -303238 -179435 47124 -103598 -201780 -200730 -105278 110283 34950 -350020 -16664
8006 33582 12841 -281358 -16734 -156376 184706 112501 -92712 -329525 215579 -216002 -334079
7995 -334079 39560 117015 -437816 102412 70209 -2075 -403829 -247908 127114 -50737 178438
7983 -104218 126346 71888 208859 42538 -173328 -72818 17408 113652 53619 347610 -145554
7971 143499 99614 -312026 -41865 -282515 -79789 39798 108310 3341 -218527 -246833 -255067
7960 -255067 -351959 150053 -165797 168802 -132309 82941 -195406 85096 113236 22396 26878
7949 26878 162740 -43447 112012 -26974 -14217 -105602 -227860 -240738 -161899 -289819 289724
7937 24457 -15491 -84665 -96560 1322 -26050 73998 116459 15403 -249087 -376827 -179519
7925 -155457 -359312 76901 51900 -87136 -23423 113492 -109345 -65545 -127028 -85861 -88375
7914 -88375 53435 -89991 -203452 114487 -95682 -5121 250725 -69644 -5931 55507 -278 405643
7901 -300392 205492 36147 -139466 -68132 -162573 -130731 79621 -72588 64815 -34785 -26609
7890 -26609 -425578 -378204 -56476 -7755 230792 -20313 73336 -26376 -123742 -57867 -209437
7879 -209437 -142346 143348 198854 -211535 -67198 358213 166279 -180904 173132 -164898
7868 -118604 -147939 65492 -160653 -253774 236547 446878 -260242 -119640 165673 33090
7857 -205864 -188471 -114154 -142312 -15646 -66590 331386 59507 -161466 -22848 169882 55828
7845 -109343 -148290 -284046 234022 430269 67650 76194 -162542 -217938 -97742 112485 -356719
7833 469474 -126723 -42835 -187764 181289 128890 -150628 -10562 -46513 -2097 -135139 128973
7821 -397605 217352 -404485 -224731 -42761 -97611 -75513 180396 161569 -16333 116790 -34687
7809 68778 -50615 111475 102878 91631 -239738 -94919 -219400 51039 -162944 -158010 -204394
7798 -204394 29748 -145991 237591 -527875 105372 -17258 -341732 31241 38692 -201064 145020
7786 -19316 110439 -199673 320439 -253131 -208881 55368 24192 43072 -96984 -345693 210919
7774 -129166 -36101 167182 -210114 -88473 -341061 -56345 -44266 -177220 130052 -130847
7763 79566 249316 -292388 89723 40026 -62763 77767 -86632 48570 -27427 -38055 45042
7751 230402 219888 127076 -175023 -149785 -135330 -77814 25068 -57065 -74936 -3168 -42584 31152
7738 -277390 -70558 81902 -213625 -112686 -164375 -198088 -47101 -125305 -135490 -12152 -167712
7727 -167712 91527 -29369 268143 64827 -206646 -332689 379907 -155598 -146675 -283752 -338849
7716 -338849 -31447 101626 -184481 -108232 -233714 -233888 -115165 35132 187290 -90012 -537784
7705 -537784 -66895 -84632 -145999 -185721 -89053 -44830 172689 -162417 24196 99531 -73188
7693 34788 -41399 -256038 -96965 26808 65982 -118544 -24528 -28498 -7999 36040 -58734 212912
7680 141058 -108616 -19296 -462329 7261 -13924 119721 212040 -93639 32637 130860 -48548
7668 198156 -52523 93921 -294902 -82119 -298878 508909 235868 -135829 -190905 -121978 169101
7656 113920 -145244 -281310 19522 203995 83235 -276642 -136566 -243260 -102915 76680
7645 226962 1445 -245538 -6311 -128867 -151505 -137851 -76865 122089 -134606 -278732 -157291
7634 -157291 150628 -21635 -321158 -14233 254887 293976 -261597 26772 -224806 289559
7623 -288878 -32404 -34675 -18647 26790 -14735 -81177 -281480 -51162 90725 -127696 147002
7611 123126 -95157 168668 -168912 -24362 -152908 -271993 126276 121507 -17298 -386496 -213728
7600 -213728 -38537 -138966 -58744 -276276 -135379 -135817 -275849 59873 133438 -122369 100519
7588 -107084 159819 -108819 -164707 48617 -170152 236288 -257568 66578 183567 -3803 34201
7576 -22255 69042 1309 -125672 -141687 140000 128118 387350 -154707 -311701 119967 2666
7564 -155336 -93263 -171235 59712 35299 -41681 -138354 17363 -263521 148116 394827 -6775
7552 258101 5193 -151498 244671 -326602 230208 73884 -10498 113809 -342453 -383848 276007
7540 -197852 -39261 258275 107026 -20047 175234 95654 38735 -267046 150291 145878 189915
7529 189915 -204838 142630 -109336 -356450 144633 18970 -24180 -54554 -93743 -29126 -216626
7518 -216626 296929 -43979 229138 -5416 -171342 126158 -361403 333096 -283948 -54325
7507 -117810 21459 176079 -289703 -124803 99884 18119 -172358 226690 -100247 -5815 -349933
7496 -349933 -161821 -111023 6547 -376380 -121809 -123033 -344642 36154 -61106 281337 252916
7485 252916 198789 204555 -104796 9327 -103261 151092 -114959 8261 172058 17235 146140
7474 146140 94379 165735 -65053 -78845 62965 -29571 -42529 -300717 -209120 -216893 34384 -137931
7461 103291 -128548 -33214 -302311 -144245 -223834 188859 88081 175492 -334115 57452 -50465
7449 266477 157691 194433 -143951 52265 -349842 -205263 158352 47084 -93909 31653 -149882
7437 -282881 48074 -69275 59958 -202284 73188 -231323 163786 -123692 -95707 -244627 86771
7425 58841 -139809 51912 77916 -169019 -170202 138580 343545 -149165 203572 36025 16601
7413 -163970 71176 -396205 156529 -111563 233410 -205179 69771 -328373 121677 -37876
7402 -92134 68359 -214488 -28468 -323587 129319 -171641 76761 152661 81509 -112657 183865
7390 82826 60298 -247385 173102 -256199 2675 68034 18839 164931 -258425 -15906 328696
7378 236632 -40651 -142457 -33432 335360 -293217 43715 -102107 -2822 -375317 54435 278907
7367 278907 -184742 -285654 -155419 6874 159704 73090 -140725 57239 22021 -38127 52778
7355 17969 113621 125836 -261394 -183684 -91891 -13073 136687 -107168 -151558 -7458 -28387
7344 -28387 183902 -179641 -130572 -217667 61258 -267190 -167964 49328 -153756 -242969 198694
7332 -125496 -76638 -118548 -49482 1852 -209670 -120850 -279554 19043 -138376 182308 142450
7321 142450 -70295 -8930 -139201 60312 -403838 39464 -90603 -184620 -177960 241787 44760
7309 -90543 -307863 71154 92192 263086 221117 76646 177656 -78917 150050 -217110 -174988
7298 -174988 58947 -149072 161103 187880 -204253 -516845 -127213 72007 72078 -23838 158858
7286 -21083 -249434 -259865 59378 225550 -70163 -305296 -67309 93384 12241 -112345 -312301
7275 -312301 75858 161077 34087 -70303 -325604 73643 -132594 -318444 -30054 -173402 -283372
7264 -283372 229216 -66575 -144029 125268 86214 -142063 -268682 237641 -18799 -49180 140636
7252 16283 172463 -285896 -439679 -34166 137193 -81291 -385171 -62967 -121782 131625 -166725
7240 -237945 77632 301453 -229901 104671 -81663 128284 68730 111282 -126004 323060
7229 20054 110573 -113554 135182 -94704 -104567 -29049 -83846 23054 -72156 -105238 145684
7217 -104885 -168425 -1829 -49460 -214591 48866 -241192 -39437 48037 -275342 80455 35944
7205 -225641 -142405 26201 -192432 -235631 107122 -23996 -10606 -11603 165141 -49620 54356
7193 321696 -176039 265264 -119415 -71914 -130171 57118 54413 5331 196568 117705 144425
7182 144425 -202629 -364464 98694 -41754 -42017 29747 208858 168200 -146199 -113038 5561
7170 -2218 53381 88308 -132518 241145 13865 297403 -4591 58993 242717 161278 -214479
7158 -128764 -52381 -13750 -86604 -43270 -148057 341022 -106288 134335 -148611 -152131 -63721
7146 121078 129582 -74995 -158752 -237946 30051 -130012 -236612 -65600 -70835 -269097 -73210
7134 202291 260119 -137101 -77542 177397 -122755 -116568 -129446 -130620 -6473 -11240 -37496 25286
7121 -161311 24592 -64013 22863 -162071 327931 -251189 216212 -164008 120845 44461
7110 229216 212293 -119599 -134422 -24570 -262430 -58649 -393610 195903 86930 52075 -35332
7098 -77729 -249529 -197059 85056 -145482 -197929 -169592 94689 -62825 196650 -15757 -172694
7087 -172694 6610 -12880 -142282 -14588 -241900 -245858 -369778 -399219 99911 179662 -54260
7075 1156 -75110 -227573 -181611 213893 -67554 22965 232228 72040 -291954 292232 63838
7063 -45710 127651 -174076 -371298 28040 255542 325461 216993 320592 -188624 -133301
7053 -133301 48409 -356101 -45533 52615 -188748 -231468 171265 -179910 -166761 242910 -235354
7041 61391 39051 -46204 -233518 -167274 125322 -142625 60389 87886 56731 104942 -211474
7029 -206653 71654 39762 -108673 -144218 -109344 -395216 -133181 43661 -127915 -65880 92175
7017 -348541 105165 -262469 -212604 -182152 -444286 86239 -193680 -321512 119023 113512 243293
7006 243293 -82224 34645 30466 -80977 -204331 276434 276434 195616 257713 -26736 -71616 -241700
6994 -241700 29560 -112927 -55137 -358298 92409 -140541 -92082 110388 149493 -88606 32936
6982 32518 -93395 -24675 202261 -173332 -11912 -135112 -84936 12179 39556 -206293 278392
6970 -84711 -103912 -117817 -100162 -130357 -147083 -94655 77564 -58337 -202505 -158244 69162 140501
6958 140501 95943 284908 -45362 -180156 251428 2242 -44939 -174764 106814 -253850 102491
6946 -96211 198513 -178485 37794 545345 214557 215556 -191140 -143692 -67559 -1173 -34053
6935 -34053 -431252 179561 -249814 -250556 -186123 -389719 -194084 236638 116101 -247777 -103280
6923 -242527 311922 190042 -207029 -99309 -141569 129389 -142257 115460 -122942 -33234
6912 -12666 10953 -59996 -106195 -73568 -58297 -235592 125077 21131 54735 72189 -49315
6900 244724 -345358 9499 130642 75207 -28962 140839 90820 -87852 36685 69732 -156445
6888 -130738 182122 137349 361321 -61077 351789 -254163 212046 -86398 185317 16403
6877 22809 -277654 194166 82653 31634 -102930 34960 104369 -94371 229206 -5624 -288664
6866 -288664 -166858 -36642 -145853 -325339 337743 44979 -224999 -75877 -67811 160980 -80059
6854 -92612 231191 -531214 -345457 -176965 173981 41993 -124855 114101 -273069 170858
6843 55918 -118205 428764 -31685 85448 -132936 -32514 30511 -217661 -29855 -23253 64521
6831 -118181 44487 113933 -72407 -244205 68450 -108773 -62142 305093 -69563 -102784 -257818
6820 -257818 -159545 81784 220952 22195 -201111 110435 195415 -111765 -294135 125291
6809 -36108 115236 -44153 3757 17907 -72539 194922 102686 293182 109327 -257707 -176477
6798 -176477 -114487 203110 -247535 120383 -152826 59203 -161871 11097 -218267 -200658
6788 -200658 156874 -203492 -75020 300779 -75585 -329244 -436109 -51686 331436 170340
6778 170340 -223598 158158 74604 -172152 14571 -353191 268904 28059 112418 -139054
6767 222175 -113 27561 162578 301429 103580 -71194 -125491 141964 11104 185756 -326438
6755 -9406 176977 -60908 -6880 -50379 182682 -334733 -1915 -114945 -14787 -134112 -10960
6743 -253360 143505 43134 81433 -19026 -102351 26765 -2341 -402212 -76165 90216 -270701
6731 -428308 -229241 167671 -190405 -13231 232799 -118327 -153691 -10946 68554 124286 222233
6720 222233 155600 -35343 -54330 -90376 57117 -41079 44058 41334 66290 5094 -43991 -12480
6707 50164 -27929 102294 204839 284955 99372 -78818 219295 95817 71628 -321265 -65621
6695 237214 78068 509387 20511 19468 69768 -8583 -76989 96048 350001 415372 -70302 91196
6682 162528 -202100 -256904 -109687 -170657 102989 63080 -21655 78788 50015 183730 59003
6670 -358802 -110755 -166041 137273 -39283 14184 343171 170466 -48654 75155 -49796 -101992
6659 -101992 -45662 -124155 -82657 49623 -134781 -214656 -557650 -419065 316479 175133 56830
6647 -392341 72354 -18308 -134379 -78393 -177980 -186637 41510 -314386 -140174 -128051 185959
6635 90378 101301 26986 73974 -163899 -10766 65443 59822 -280740 1501 70170 -124904 329380
6622 54405 -204389 114753 207861 303626 148300 45689 -1806 293125 254197 -306194 187865
6610 19477 72880 -247176 -125517 -196139 -164543 84366 -151762 117743 42376 25921 88103
6599 88103 -102488 -50134 -68051 -79678 76700 -122332 78034 162083 74302 180164 -36186
6587 106110 -126800 210886 90589 9029 137353 -172919 -108725 -83323 -197427 -17669 -203512
6576 -203512 -322579 173471 85328 55681 132392 85777 186543 -185655 -128917 64363 -90413
6564 -263566 94324 21993 -242435 39666 136937 93163 -112732 -73278 73195 124090 -145610
6552 -265112 -190990 -175585 -106734 -266148 -229175 151730 8821 191300 20048 154626 133569
6541 133569 -203152 131779 106111 -46055 42656 176394 60259 -185044 -67723 -225273 -105180
6529 320880 76326 189097 -193460 -1121 -98296 82220 -231279 -85836 -114413 35974 84302
6518 84302 -236741 182900 -232716 -11422 -126284 -344688 20144 63904 114437 -147866 -48734
6506 111380 286982 116085 -273018 85390 -128383 -1601 14148 -260005 -104647 -23324 23873
6494 63658 -199009 -331641 247388 142203 36661 -307677 -80158 -163916 -8841 -120665 -88732
6483 -88732 -266133 -195778 58389 69067 -107687 77083 174529 34971 -195865 -39268 40553
6471 28298 -167160 -253997 65690 177816 70197 51006 -56782 73197 -47393 -61101 -37695
6460 -37695 -47795 91988 38640 103759 -140692 136611 96592 -101214 10019 79567 65692
6449 65692 62149 -102246 -52072 69915 -124246 -130772 -150608 289597 -10728 -59201 -10402 168786
6436 217740 141872 96803 -102757 132049 -117655 -308153 -187071 -347452 124555 144781
6426 144781 118866 -182580 182194 -353300 116116 -17586 -146050 -11797 -391386 153257
6415 58111 -100589 76231 3662 92981 231947 196363 38932 -105686 97837 -6424 23934 158967
6403 158967 -406221 201111 -6676 260697 34652 49880 -80470 -10776 -96473 69092 -375000
6391 -163143 59383 145801 59986 -33770 -112081 25990 192622 397109 130117 137808 -138455
6379 -333130 101571 144262 -138425 64052 -81201 -127600 -11252 104760 -6498 -5818 -12622 -176466
6367 -176466 -149714 8253 -12895 -175744 33702 134342 -211003 -179640 25326 -2543 291930
6355 11705 -91433 -231575 -68461 283906 -56600 241643 46870 511 -195785 -38722 -177855
6344 -177855 -84599 -135489 -71541 188045 -27756 -12584 3464 -77390 -74539 170402 -498491
6332 259966 -188735 125552 -328824 -182867 -175782 -17206 -108001 -235382 -183341 -176097 66177
6320 150574 276008 -345290 171336 -141934 150747 -113338 197038 354974 -29948 97482
6309 -231624 -339447 27362 34357 21169 364294 -153918 -48482 61166 26493 31350 -3837 -164456
6297 -164456 -253671 92302 -23178 52891 -353216 38697 220510 231536 12408 85285 45254
6286 45254 147358 -68891 -105777 46435 -29430 288300 330006 -78279 -75546 35444 -49898 153343
6273 -241030 176865 -42152 313739 191991 94486 201128 -11612 209756 130394 -115798
6262 -109371 -40128 -198456 68778 -116370 95562 250085 -214025 -351318 -39385 -20821 57729
6250 -211226 -120228 -7311 -261536 -111044 -101672 -10819 -6897 -246907 18038 75844 -149418
6238 -275126 62090 3207 219722 -130319 -269447 -20662 -106486 -124647 -7831 -3590 250607
6226 -112847 107310 116898 52352 24628 -106793 139743 -466905 -173169 139494 246357
6216 246357 -201451 -54123 -268252 -348668 68254 4066 43560 -122530 -281637 -72875 -22111
6204 -9915 166912 120711 76713 -147749 -99313 107683 -168900 39862 -216231 286968 -189194
6192 217612 -362436 174684 319813 -180006 -31703 12025 196288 126835 24409 -310353
6181 -305198 50179 -98027 -115861 119736 -44131 482313 13739 -172691 -61951 67649 53987
6170 53987 201683 -56783 -138362 -101575 -23650 -216996 241487 -763 -52596 199784 88582
6158 -83167 -252471 -104589 91864 231236 -69653 52441 362984 -79383 32553 53048 154385
6147 154385 -119342 -38 181123 -171275 107904 -196584 314634 185199 -169603 203141
6136 123746 -41499 280277 -63642 -42731 5279 -133484 129961 -310872 -181000 93537 107113
6125 107113 230162 -174373 289339 6616 -137001 208996 511955 -201790 50082 22101
6114 -16218 -87868 -30572 -252739 -269424 -165608 -8755 118737 -151628 -240043 5660 62082
6103 62082 10561 -122594 57207 171583 -106928 -123380 51369 -13750 136170 238374 544
6091 72542 290755 46856 -183746 62342 218955 -255592 -312010 149690 68243 68833 -114562
6079 -36190 -160502 -88770 19830 -154556 568274 187110 143438 269319 10245 -148717 -259761
6068 -259761 217847 -116308 120728 50234 -24902 220279 -98068 88730 74590 84701 -186808
6056 147547 176305 -175489 287936 -173773 62920 -141145 120291 166642 -43348 94625 -130989
6044 90622 -311618 37274 -365305 -279069 213538 279140 60995 172725 -211265 -149384 65236
6032 86465 158801 5416 249221 217858 80680 -205436 -156292 -8363 -243220 -277116 205754
6020 -193298 -16601 4360 70267 8154 -375017 14603 14860 102770 -20740 -159736 -194222 -86158
6007 -107453 78016 137980 -173305 18237 -111158 -225559 48536 60587 89059 -210658 -117423
5996 -117423 -50019 123862 -7203 -25236 451411 142134 88509 -34634 -43653 -240346 28621
5984 61960 -822 69634 132255 125433 89542 117748 -274580 -142271 -82298 27644 -288423 75620
5971 150282 90093 6102 -10772 -97606 -159195 -330341 -100418 29419 -14862 113570 106998
5960 106998 -1786 -128336 -565075 -207240 443016 -72983 48776 114205 8544 212164 -125963
5948 219987 -126614 -14336 47155 108231 -39495 90097 -157706 41570 -228393 -60692 2849
5936 115656 -62406 382632 -18523 141749 -143205 234613 -12802 327100 -183206 18705
5925 37361 -94233 368712 -126263 -140509 25744 132928 -7763 -59244 269533 -306403 47089
5913 -60859 -144812 -231404 186883 -16318 -161852 61659 -203165 -96495 -249737 -102410 -183958
5902 -183958 18306 220012 -66855 -20131 225030 97209 27447 -27144 298874 220151 15410
5890 -55383 294995 181281 299263 76815 -287454 -135780 -111441 -169987 225758 -10400 13695
5878 -79444 7983 -102520 97087 150438 -247452 37925 -91358 139618 70639 -90725 -105667
5867 -105667 377936 151121 181163 -68169 -109228 16991 -122618 86393 -128272 -238304 84151
5855 348506 -178363 49084 382363 -178447 -28379 -34836 -120672 -108436 174276 -21041 35212
5843 74445 341185 -18048 -166107 89869 85800 -176829 -111344 82648 -191155 70684 26728
5831 -54448 376537 291333 158632 309028 170985 -207317 -73574 -165697 -74010 147898 262839
5820 262839 131173 194419 -153378 -51937 171529 144628 -173366 126540 -556208 72267
5809 -297217 11770 166804 29484 405843 -75136 -337772 -218745 -88092 4769 123189 264455
5798 264455 -142441 -26208 -161597 -91071 -31834 -58528 -67715 -215167 116239 58921 197958
5787 197958 57486 51165 67128 106097 119062 -28711 187231 -4326 -276280 -326223 104442
5775 -84777 -116692 -67756 -74734 -335966 -43453 -189360 69254 255402 126416 -350157 -50913
5763 100746 13311 -55616 153267 281978 -125609 -267561 -170322 -69274 -124551 -69272 -135092
5752 -135092 -120895 -11357 -66416 -228533 -397379 -146872 49400 -228786 -128611 411561
5741 42127 309927 198995 -63414 -77420 56695 203921 -112431 -54820 -349319 109336 85134
5730 85134 19120 159409 183996 68204 124164 140956 6765 21869 303279 98103 -194707
5718 -90529 7254 91216 -420 120467 233814 161559 56273 -71528 409047 75401 -296269 316881
5705 349296 105919 174536 -66552 -218619 77965 -74137 -112558 -241141 15687 303186 168659
5694 168659 201185 62944 -319583 114436 -126973 -128550 -183240 -201997 -93435 -154648 148023
5682 -146826 25155 -65618 -78396 -102537 -15264 -399548 -242738 305653 33057 -371543 -34108
5670 -243887 -25481 -68322 264236 -384503 123196 -273426 91208 278348 -20081 293926
5659 342337 -237285 -121736 -13876 276685 69283 1002 255926 49824 167279 187814 -30599
5647 -26593 -174107 88738 4814 128299 -28902 13824 221641 127799 46886 -25236 73293
5635 -88824 -154512 93219 -172881 82683 325859 -48646 107474 141401 53571 -97276 -61649
5624 -61649 -237068 -113258 79344 104374 -301311 -30091 -56676 -13178 15922 204252 -42901
5612 147724 -169969 -210373 91872 -107822 -86130 219483 -236184 8392 113369 -170729 77303
5600 -50891 134911 -42175 122301 -61806 -126242 281189 -54300 103132 -35137 2822 -147765
5588 341477 64980 -420922 -176284 -56255 388915 128011 200187 54998 113809 -28239 -54947
5577 -54947 336347 79672 79282 -192832 -149194 145833 -72615 -36055 305679 -340143 -79582
5565 -135610 132195 159181 380589 -141018 40693 19237 -383864 132601 -94076 228919
5554 -280155 -127682 -14795 -96511 -326984 -4635 -132925 23691 -195095 148413 -314766 315715
5542 11408 362820 180310 -16758 151474 95688 -386728 -157122 -21774 441785 45215 -2620
5530 -385764 -323894 86360 148794 -48222 204545 32997 37131 -269659 33784 153910 476406
5519 476406 -244498 -251042 -80702 231551 298428 -115472 -205066 28893 -193807 -11666 -49812
5508 -49812 136828 -49304 -305922 246615 -185244 119296 143424 -58696 137701 225325 258216
5497 258216 160141 -7419 918 15993 -53192 -70272 255041 55749 -52598 -25213 19680 46939
5485 46939 13452 -99501 -97282 -38838 -86764 -171654 -247238 180622 51913 31136 123914 -26798
5472 -162028 -329500 -58296 205056 77289 304546 -112496 -32990 -35356 -241096 92019 -57665
5460 27126 185849 -344718 31990 -139702 -95891 -93795 -141336 221616 -272065 -11039 -85711
5449 -85711 -41413 23746 104931 -23523 247091 -317342 -38132 20614 -277091 -206254 -18822
5437 65406 -52999 -38252 149010 17048 45012 27023 113410 -128119 -17667 -6702 170990
5425 17349 -547743 -407589 -179316 -143709 63674 19489 -65173 -328845 -53699 88875 223108
5414 223108 -84937 -44074 33828 2875 -441962 -229344 -15245 -6514 -47065 -192055 -288886
5403 -288886 -131485 -119753 82644 18098 334667 -309468 52499 200664 -79763 23328 180870
5392 180870 -89479 -337220 -152553 -246932 70457 155183 133143 317322 121734 -146439 265690
5380 170739 -55279 106666 299805 141955 -14620 -140531 -133736 168513 2155 -52994 220973
5368 117048 -70474 -62901 -339475 -273588 -106150 32619 258493 47553 92728 -85287 65865
5356 38470 267205 -161462 -63062 88887 85143 160374 99995 -127058 44974 -109903 -234987
5345 -234987 -90398 -262698 163916 -98219 310683 -1106 -189794 -134737 -102982 -110577 -63290
5334 -63290 -72897 11566 -225076 228688 158735 499597 -17020 -14767 64234 249787 -66283
5322 88734 234452 -404355 8829 -161028 -107578 101373 22586 -3616 -167651 191090 -34457
5310 -46176 82225 -129178 139592 -173429 99716 -85843 237909 29267 -76511 76759 120762
5299 120762 93301 461616 54234 401358 -279960 -241613 -147234 348916 393281 -30724 34737
5287 -166860 -213385 14037 84531 -289101 59259 -4201 117702 -96 111826 206461 50910 55684
5275 55684 -19967 291731 461810 416849 255411 139920 -250502 -221687 -13935 -479259 10468
5263 -115071 -61443 -179650 312732 -51751 -2274 -195333 -181619 65664 47262 -88975 152685
5251 -37316 -97529 -116623 -180442 34569 -59100 160785 -207538 -98618 49627 9747 -267999
5239 -202597 348567 -87136 -91318 139361 10271 -161019 -4084 -27800 -57358 126844 -177915
5227 -14572 -185236 64221 -39549 -271344 104677 -385283 -24629 -104854 296407 66884 43812
5216 43812 115762 -107128 56306 -82331 46652 153719 111983 150483 273655 24265 218013
5205 218013 -58616 59241 225325 -29465 33928 -203846 276393 123545 39339 -123820 298173
5193 -192654 57763 -208849 56606 -171852 40765 223189 218939 109939 -73271 21090 51357
5182 51357 -10193 -217353 -209848 214775 -46375 -94682 12893 87093 11332 42905 134646 -24858
5169 -286095 125771 -236193 -100596 -193086 -39979 -107042 -93728 -140030 -7361 108365 -101479
5157 -19484 101119 -84712 -105149 -47242 151047 -285461 -107455 73822 -223522 171792 -251100
5145 23472 -68447 -18727 -126062 -344152 -10794 292677 240038 -67616 -114301 330631 230665
5134 230665 -16917 87093 54504 -78147 156652 -17166 -77582 -6449 -90352 -34441 -32606 -21715
5122 -21715 -35920 349796 -167172 -86635 -288510 190165 190269 205013 -51502 -198414 -400996
5111 -400996 -141200 -122951 -165491 -99644 76618 -325799 -14941 130250 22458 42768 -143051
5099 43502 3686 15865 291804 35153 -252181 -140755 232770 272771 113237 263158 222306
5088 222306 -190425 -7161 362779 139180 27708 249120 55945 230069 -17395 -91892 215260
5076 -204271 -274473 191711 125724 18419 -168354 -21736 -45936 104192 294977 158214 137474
5065 137474 165099 232910 -165650 4263 -73745 -79830 57347 -100307 93120 -285255 -119577
5053 -72524 -53775 -192965 51290 -336760 131417 -70415 20302 -102774 83625 220097 -175248
5041 67542 -45539 249581 294896 -87748 -101863 134820 167091 204047 262016 40327 121653
5030 121653 -103381 -69833 -120407 88830 -89217 -118552 209170 -81080 -159862 139301 -57872
5018 -63509 296047 -304077 63208 64498 248620 165730 100642 -117618 -116134 117848 -135885
5006 2716 -79862 194626 -76971 270398 95918 46564 129336 151669 -38212 202578 297722
4995 297722 -132143 155730 44126 111328 -196752 -77814 -133759 112407 82806 109238 220909
4984 220909 100765 -47010 -120796 233755 199890 -25039 47757 -77615 -129266 305611 22847
4972 -142866 98795 -72569 157912 213378 35896 200554 -3919 -14266 -60112 -225930 -83350
4960 -209122 -313772 -25490 183374 214222 53455 25373 -131986 37783 112426 155821 -254070
4948 -23224 -413916 112813 -15855 164000 -204827 104191 192226 -126769 -80465 -121829 -237914
4937 -237914 -158141 -175911 -9499 195001 -118616 172283 -32573 205212 -44699 105497 -161978
4925 40604 -65169 -94705 -96334 181143 -14912 -92641 101719 -139405 23818 -170634 262207
4913 196877 143810 213369 336812 -232886 307534 -211701 -44401 21227 52344 333900 70325
4901 141972 129310 67078 -110093 -388070 -68255 79697 174521 -157394 -448757 340071 169627
4889 40254 81893 208054 -57702 -15569 55394 105002 -359453 -61629 99533 176963 307980
4878 307980 -58496 59793 104502 29527 366704 -89470 142685 184061 111160 128580 -275360
4866 202210 -120696 64827 -114204 -116533 -40417 164335 207944 -272934 -58855 -244261 236728
4854 -130610 249255 -5234 -225264 -31042 -157585 -231347 270843 -210152 -59688 41263 -98690
4842 -69670 -3829 84059 -113054 129542 108167 43284 284506 -185588 79558 -329600 4093
4830 237671 160423 26888 319651 -96232 -210691 -85095 164607 -47751 -254865 -327818 -16730
4818 15727 -204459 150365 78575 210922 283488 446947 -32141 -218277 -121094 49531 58124
4807 58124 133875 -50709 -89072 1211 247267 87066 108818 -2827 65670 148034 -113991 -180396
4795 -180396 172190 -174794 -141877 24151 215693 -14332 38569 -689449 -114361 -71610 -195981
4784 -195981 6269 375930 -261352 304579 6719 187538 11963 108207 201331 -312721 336653
4772 90977 117163 39111 -3961 356402 317879 257 -156176 -397104 117153 -112328 239962
4760 38615 -207774 -183444 138593 -9027 369616 -28974 52111 -360178 40323 74119 -151659
4748 -145494 183891 -59199 131903 27228 100186 -58427 -171484 -14332 77449 104692 -109148
4736 -157029 33812 292079 -63682 12311 -74218 8436 221798 78235 116722 -238349 -125504
4725 -125504 43974 19274 307411 -665359 250112 -139743 -255640 143081 -62376 -285685
4715 -285685 68647 -49587 175228 83206 -210033 28138 -162984 115038 -80578 -61541 20764
4703 154935 -191217 28960 -61496 98115 129235 1038 -39272 14502 153596 75495 625998
4692 625998 92177 -52875 -87108 162552 81201 -122216 64868 22859 78597 -155941 -86712
4681 -86712 -2236 -52320 -101042 -371848 -10267 -181523 -208660 132321 251504 -10026 6858
4669 44048 61479 70626 -577144 279417 221966 -78680 -108243 -38198 156345 -157332 196641
4657 174800 91079 384026 -316148 34427 119518 161438 -48301 383639 268102 -259909 98285
4645 113157 -235244 111214 -61371 322247 69130 -339259 45865 9880 33276 -347188 -239782
4634 -239782 -124558 -112320 41569 285616 27586 115011 -47319 307385 144299 113351 234459
4623 234459 284875 -182893 141995 322831 -204215 -101138 -326643 68441 -176387 -218222
4613 -218222 -157863 -1022 -100746 26982 -9103 -21932 -342367 -95234 -50191 42264 138384 -3070
4600 36659 -22232 99762 91928 83924 -16033 143655 106014 18878 -57932 112167 -21286 -69540
4588 -69540 42532 -131743 11573 -213387 65355 99216 3741 -7785 69581 -167573 68339 -102581
4575 -111328 188559 -28136 -125761 -107350 15151 62363 148274 -91649 -190472 108153 -42297
4563 -179831 180078 -23274 -293991 -81800 -48468 141589 -18063 -128961 -227058 152802 -172109
4551 -238417 306699 -36469 21935 -71855 289475 201934 -124989 118056 -135861 10243 66063
4540 66063 -88315 -356094 -121937 -45519 33879 89055 -59165 -133857 34921 -250448 562071
4528 432918 -237373 -96143 -205337 905 -199575 55918 217415 42802 101341 -20951 -217429
4517 -217429 274199 106586 146307 213020 -24764 18795 93843 -194389 451603 159114 -309654
4505 188080 -26549 179858 126528 138155 52702 177811 -62481 -213532 -76912 -274988 33369
$$ [...]
##END NTUPLES=NMR SPECTRUM
##END=
