
##TITLE=UV1015_M1-1003-1002_6269021_UjVlAg0RKP
##JCAMPDX= 6.0         $$ Bruker NMR JCAMP-DX V2.0
##DATA TYPE= NMR SPECTRUM
##DATA CLASS= NTUPLES
##ORIGIN= BRUKER
##OWNER= Administrator
$$ 1.72 TOPSPIN		Version 2.1
$$ 2012-06-01 23:07:15.890 -0500  Administrator@TOPSPIN
$$ Compression mode = diff/dup
##.OBSERVE FREQUENCY= 400.13188235
##.OBSERVE NUCLEUS= ^1H
##.ACQUISITION MODE= SIMULTANEOUS (DQD)
##.ACQUISITION SCHEME= undefined
##.AVERAGES= 64
##.DIGITISER RES= 22
##SPECTROMETER/DATA SYSTEM= spect
##.PULSE SEQUENCE= noesygpps1d.comp
##.SOLVENT NAME= COFFEE_calctemp
##.SHIFT REFERENCE= INTERNAL, COFFEE_calctemp, 1, 14.96692
##AUDIT TRAIL= $$ (NUMBER, WHEN, WHO, WHERE, PROCESS, VERSION, WHAT)
$$ ##TITLE= Audit trail, TOPSPIN		Version 2.1
$$ ##JCAMPDX= 5.01
$$ ##ORIGIN= Bruker BioSpin GmbH
$$ ##OWNER= Administrator
$$ $$ C:\Bruker\TOPSPIN/data/COFFEE/nmr/UV1015_M1-1003-1002_6269021_UjVlAg0RKP/12/pdata/1/auditp.txt
$$ ##AUDIT TRAIL=  $$ (NUMBER, WHEN, WHO, WHERE, PROCESS, VERSION, WHAT)
(   1,<2012-06-01 23:07:10.796 -0500>,<Administrator>,<TOPSPIN>,<go>,<TOPSPIN 2.1>,
      <created by zg
	started at 2012-06-01 22:55:40.640 -0500,
	POWCHK enabled, PULCHK disabled,
       configuration hash MD5:
       D5 CA 7A 23 FE 6B EE E2 50 67 74 61 24 F7 5E 3B
       data hash MD5: 64K
       6D D6 06 65 D8 47 49 F6 CC 1A 55 8D 90 7A 6D 0F>)
(   2,<2012-06-01 23:07:13.781 -0500>,<Administrator>,<TOPSPIN>,<proc1d>,<TOPSPIN 2.1>,
      <Start of raw data processing
       efp LB = 0.3 FT_mod = 6 PKNL = 1 PHC0 = 0 PHC1 = 0 SI = 128K 
       data hash MD5: 128K
       2F 4F 53 42 36 26 BA 1F BA 18 60 A3 69 E1 11 FE>)
(   3,<2012-06-01 23:07:15.109 -0500>,<Administrator>,<TOPSPIN>,<proc1d>,<TOPSPIN 2.1>,
      <pk PHC0 = 29.9707 PHC1 = 0 
       data hash MD5: 128K
       4F 42 58 8D DC EB 17 5C 6D BD 64 C8 BA F5 DD 38>)
(   4,<2012-06-01 23:07:15.562 -0500>,<Administrator>,<TOPSPIN>,<proc1d>,<TOPSPIN 2.1>,
      <abs ABSG = 1 
       data hash MD5: 128K
       9F 15 89 F8 11 E9 CF 56 A7 B8 54 B8 D8 58 4D 78>)
(   5,<2012-06-01 23:07:15.640 -0500>,<Administrator>,<TOPSPIN>,<proc1d>,<TOPSPIN 2.1>,
      <abs ABSG = 2 
       data hash MD5: 128K
       E7 95 FF 90 7B C5 7D E9 15 D0 6C 2F 4F 3B 93 B5>)
(   6,<2012-06-01 23:07:15.687 -0500>,<Administrator>,<TOPSPIN>,<proc1d>,<TOPSPIN 2.1>,
      <abs ABSG = 3 
       data hash MD5: 128K
       81 2F 3E DA A4 A1 E2 BA 16 AD EF 8E 89 77 AF A5>)
(   7,<2012-06-01 23:07:15.750 -0500>,<Administrator>,<TOPSPIN>,<proc1d>,<TOPSPIN 2.1>,
      <abs ABSG = 4 
       data hash MD5: 128K
       43 28 9D 5D A5 35 0B 68 BD 6F 1B 26 20 58 71 F3>)
(   8,<2012-06-01 23:07:15.812 -0500>,<Administrator>,<TOPSPIN>,<proc1d>,<TOPSPIN 2.1>,
      <abs ABSG = 5 
       data hash MD5: 128K
       A7 F0 46 9B 44 C6 2E 6D EA AC C5 BB B8 58 92 4C>)
$$ ##END=
$$ 
$$ $$ hash MD5
$$ $$ 2B B7 F4 85 C7 D5 5C 6E 6C 6E 8F A6 BD 98 6E 4C
##$RELAX= 
##$RELAX= 
##$RELAX= 
##$RELAX= 
##$RELAX= 
##$RELAX= 
##$RELAX= 
##$RELAX= 
$$ [...]
##$TP07= 0
##$TPNAME0= <>
##$TPNAME1= <>
##$TPNAME2= <>
##$TPNAME3= <>
##$TPNAME4= <>
##$TPNAME5= <>
##$TPNAME6= <>
##$TPNAME7= <>
##$TPOAL= (0..7)
0.5 0.5 0.5 0.5 0.5 0.5 0.5 0.5
##$TPOFFS= (0..7)
0 0 0 0 0 0 0 0
##$TUNHIN= 0
##$TUNHOUT= 0
##$TUNXOUT= 0
##$USERA1= <user>
##$USERA2= <user>
##$USERA3= <user>
##$USERA4= <user>
##$USERA5= <user>
##$V9= 5
##$VALIST= <valist>
##$VCLIST= <CCCCCCCCCCCCCCC>
##$VD= 0
##$VDLIST= <DDDDDDDDDDDDDDD>
##$VPLIST= <PPPPPPPPPPPPPPP>
##$VTLIST= <TTTTTTTTTTTTTTT>
##$WBST= 2048
##$WBSW= 25
##$XGAIN= (0..3)
0 0 0 0
##$XL= 0
##$YL= 0
##$YMAX_a= 12269003
##$YMIN_a= -6579149
##$ZGOPTNS= <>
##$ZL1= 120
##$ZL2= 120
##$ZL3= 120
##$ZL4= 120
##$ABSF1= 14.96692
##$ABSF2= -5.58561
##$ABSG= 5
##$ABSL= 3
##$ALPHA= 0
##$AQORDER= 0
##$ASSFAC= 0
##$ASSFACI= 0
##$ASSFACX= 0
##$ASSWID= 0
##$AUNMP= <proc_prof1d_extract.lims>
##$AXLEFT= 0
##$AXNAME= <>
##$AXNUC= <1H>
##$AXRIGHT= 0
##$AXTYPE= 0
##$AXUNIT= <>
##$AZFE= 0.1
##$AZFW= 0.1
##$BCFW= 0
##$BC_mod= 0
##$BYTORDP= 0
##$COROFFS= 0
##$CY= 15
##$DATMOD= 1
##$DC= 0
##$DFILT= <>
##$DTYPP= 0
##$F1P= 0
##$F2P= 0
##$FCOR= 0.5
##$FTSIZE= 131072
##$FT_mod= 6
##$GAMMA= 0
##$GB= 0
##$INTBC= 1
##$INTSCL= 1
##$ISEN= 128
##$LB= 0.3
##$LEV0= 0
##$LPBIN= 0
##$MAXI= 10000
##$MC2= 0
##$MEAN= 0
##$ME_mod= 0
##$MI= 0
##$NCOEF= 0
##$NC_proc= -3
##$NLEV= 6
##$NOISF1= 0
##$NOISF2= 0
##$NSP= 0
##$NTH_PI= 0
##$NZP= 0
##$OFFSET= 14.96692
##$PC= 1
##$PHC0= 29.9707
##$PHC1= 0
##$PH_mod= 1
##$PKNL= yes
##$PPARMOD= 0
##$PPDIAG= 0
##$PPIPTYP= 0
##$PPMPNUM= 2147483647
##$PPRESOL= 1
##$PSCAL= 4
##$PSIGN= 0
##$PYNMP= <proc.py>
##$REVERSE= no
##$SF= 400.130005478748
##$SI= 131072
##$SIGF1= 0
##$SIGF2= 0
##$SINO= 400
##$SIOLD= 131072
##$SPECTYP= <>
##$SREGLST= <1H.CDCl3>
##$SSB= 0
##$STSI= 131072
##$STSR= 0
##$SW_p= 8223.68421052632
##$SYMM= 0
##$S_DEV= 0
##$TDeff= 65536
##$TDoff= 0
##$TI= <>
##$TILT= no
##$TM1= 0
##$TM2= 0
##$TOPLEV= 0
##$USERP1= <user>
##$USERP2= <user>
##$USERP3= <user>
##$USERP4= <user>
##$USERP5= <user>
##$WDW= 1
##$XDIM= 131072
##$YMAX_p= 444745227
##$YMIN_p= -23573
##$CURPLOT= <Network HP LaserJet P1505>
##$CURPRIN= <$Network HP LaserJet P1505>
##$DFORMAT= <normdp>
##$LAYOUT= <+/1D_H.xwp>
##$LFORMAT= <normlp>
##$PFORMAT= <normpl>
##$SURQMSG= 1
$$ End of Bruker specific parameters
$$ ---------------------------------
##NTUPLES= NMR SPECTRUM
##VAR_NAME=  FREQUENCY,     SPECTRUM/REAL,   SPECTRUM/IMAG
##SYMBOL=    X,             R,               I
##VAR_TYPE=  INDEPENDENT,   DEPENDENT,       DEPENDENT
##VAR_FORM=  AFFN,          ASDF,            ASDF
##VAR_DIM=   131072,        131072,          131072
##UNITS=     HZ,            ARBITRARY UNITS, ARBITRARY UNITS
##FACTOR=    0.0627417313425165, 1,          1
##FIRST=     8223.62146879498, -438,         -113466
##LAST=      0,             2606,            -113103
##MIN=       0,             -23573,          0
##MAX=       8223.62146879498, 444745227,    0
$$ Real data points
##PAGE= N=1
##DATA TABLE= (X++(R..R)), XYDATA
$$ [...]
61222A137425l211m504m999l634j125J464L910O173P766Q548R370J0952J2581
$$ 1137425 1134214 1129710 1124711 1121077 1119952 1121416 1125326 1131499 1139265 1147813 1157183 1168135 1180716
61209A180716J2813J1402R825R739J1189J2678J2949J2540J3110J5197J7309J7749
$$ 1180716 1193529 1204931 1214756 1224495 1235684 1248362 1261311 1273851 1286961 1302158 1319467 1337216
61197A337216J6637J5285J4086J2242R496O843N188M097K422m20m026p322r281
$$ 1337216 1353853 1369138 1383224 1395466 1404962 1411805 1416993 1421090 1423512 1423092 1419066 1411744 1402463
61184A402463r850j0111j0896j1418j0281p770o015o472q266r477r123p519n547
$$ 1402463 1392613 1382502 1371606 1360188 1349907 1342137 1336122 1329650 1321384 1311907 1302784 1295265 1289718
61171A289718m190l990m366m002k360k84J190J852J870J166j01j115j151k73J017
$$ 1289718 1285528 1281538 1277172 1273170 1270810 1270526 1271716 1273568 1275438 1276604 1276503 1275388 1274237 1273964 1274981
61156A274981K262K883K396J263P43J327K163K586L112M091M435L002N80q54m53
$$ 1274981 1277243 1280126 1282522 1283785 1284528 1285855 1288018 1290604 1293716 1297807 1302242 1305244 1305824 1304970 1304517
61141A304517J172L568O904J0735J3723J4997J4898J4109J2956J1942J1980J3248
$$ 1304517 1305689 1309257 1316161 1326896 1340619 1355616 1370514 1384623 1397579 1409521 1421501 1434749
61129A434749J4387J3627J0720P193M620K963Q75k423n894p648p016n188l756
$$ 1434749 1449136 1462763 1473483 1480676 1485296 1488259 1489134 1486711 1480817 1473169 1466153 1460965 1457209
61116A457209l257l432m162n426o815p942r209j1242j3535j4495j3213j0718r026
$$ 1457209 1453952 1450520 1446358 1440932 1434117 1426175 1416966 1405724 1392189 1377694 1364481 1353763 1344737
61103A344737r338j1290j3576j4862j4475j2794j1161j0947j2274j3656j3185
$$ 1344737 1335399 1324109 1310533 1295671 1281196 1268402 1257241 1246294 1234020 1220364 1207179
61092A207179j0308o386l379k086j708r96M32J684J291j429n379q374r317r361
$$ 1207179 1196871 1190485 1187106 1185020 1183312 1182316 1182748 1184432 1185723 1184294 1178915 1170541 1161224 1151863
61078A151863j0216j1627j1655r435o386m195k726p48K133N169P610R221J0066
$$ 1151863 1141647 1130020 1118365 1108930 1102544 1098349 1095623 1094875 1097008 1102177 1109787 1119008 1129074
61065A129074J0519J1260J2653J4393J6257J8601K1445K3659K4129K3439K3333
$$ 1129074 1139593 1150853 1163506 1177899 1194156 1212757 1234202 1257861 1281990 1305429 1328762
61054A328762K4510K5906K6208K5233K3576K1712J9924J8599J8092J8267J8362
$$ 1328762 1353272 1379178 1405386 1430619 1454195 1475907 1495831 1514430 1532522 1550789 1569151
61043A569151J7310J4445J0139N598J847r45l081m803o438q467j0988j3443j5324
$$ 1569151 1586461 1600906 1611045 1616643 1618490 1617545 1614464 1609661 1603223 1594756 1583768 1570325 1555001
61030A555001j6732j7809j8284j8049j7517j6734j5070j2595j0813j0770j1240
$$ 1555001 1538269 1520460 1502176 1484127 1466610 1449876 1434806 1422211 1411398 1400628 1389388
61019A389388j0338q272o742o031m744k402k62Q75J764K997M072M985O891J0033
$$ 1389388 1379050 1370778 1364036 1358005 1353261 1350859 1350597 1351472 1353236 1356233 1360305 1365290 1372181 1382214
61005A382214J2606J3190J3048J4456J7739K1438K4595K7262K9468L1187L2994
$$ 1382214 1394820 1408010 1421058 1435514 1453253 1474691 1499286 1526548 1556016 1587203 1620197
60994A620197L5355L7618L9013M0226M2579M6057M9634N3224N7518O1999O5126
$$ 1620197 1655552 1693170 1732183 1772409 1814988 1861045 1910679 1963903 2021421 2083420 2148546
60983B148546O6883O9274P3481P8300Q2362Q6415R1920R8482J04306J08655J12327
$$ 2148546 2215429 2284703 2358184 2436484 2518846 2605261 2697181 2795663 2899969 3008624 3120951
60972C120951J16071J20013J24719J31382J40321J50246J59597J68077J76411
$$ 3120951 3237022 3357035 3481754 3613136 3753457 3903703 4063300 4231377 4407788
60963D407788J85127J94356K04698K17547K34232K54955K78946L05818L36535
$$ 4407788 4592915 4787271 4991969 5209516 5443748 5698703 5977649 6283467 6620002
60954F620002L72631M14281M59564N06178N54034O05938O65762P36077Q17444
$$ 6620002 6992633 7406914 7866478 8372656 8926690 9532628 10198390 10934467 11751911
60945A1751911R09590J013263J131337J268299J428644J616268J836193K095710
$$ 11751911 12661501 13674764 14806101 16074400 17503044 19119312 20955505 23051215
60937B3051215K398569K729772L039511L242351L242180K975981K453324J766705
$$ 23051215 25449784 28179556 31219067 34461418 37703598 40679579 43132903 44899608
60929D4899608J062993M88970J38503K5180Q5859K04736K46695R6858k97614r00444
$$ 44899608 45962601 46451571 46590074 46615254 46701113 46905849 47152544 47249402 46951788 46051344
60919D6051344j596475k242078k726856l007609l100002l047399k895508k683523
$$ 46051344 44454869 42212791 39485935 36478326 33378324 30330925 27435417 24751894
60911B4751894k443430k198515j961995j739608j534412j349061j185001j041951
$$ 24751894 22308464 20109949 18147954 16408346 14873934 13524873 12339872 11297921
60903A1297921r19048q15451p29155o56118n91861n33944m82227m36668l95675
$$ 11297921 10378873 9563422 8834267 8178149 7586288 7052344 6570117 6133449 5737774
60894E737774l57144l20660k87722k59569k35358k13229j92876j76207j64934
$$ 5737774 5380630 5059970 4772248 4512679 4277321 4064092 3871216 3695009 3530075
60885C530075j58137j52864j46812j39659j31929j23705j14960j06375r8975r3109
$$ 3530075 3371938 3219074 3072262 2932603 2800674 2676969 2562009 2455634 2356659 2263550
60875B263550q8214q3467p8361p2876o7473o2660n8317n3734m8607m3591l9440
$$ 2263550 2175336 2091869 2013508 1940632 1873159 1810499 1752182 1698448 1649841 1606250 1566810
60864A566810l6119l3233l0752k8599k6161k3269k1085k0668k0844j9161j5233
$$ 1566810 1530691 1497458 1466706 1438107 1411946 1388677 1367592 1346924 1326080 1306919 1291686
60853A291686j1459r771r244q005o138n098n183n377n283n500n984n683m209k647
$$ 1291686 1280227 1270456 1261212 1253207 1247069 1241971 1236788 1231411 1226128 1220628 1214644 1208961 1204752 1202105
60839A202105k136k592l374m380n744p184q307r206j0141j0963j1330j1214j0855
$$ 1202105 1199969 1197377 1194003 1189623 1183879 1176695 1168388 1159182 1149041 1138078 1126748 1115534 1104679
60826A104679j0512j0524j1194j2197j2652j2290j2075j2949j4386j5032j4513
$$ 1104679 1094167 1083643 1072449 1060252 1047600 1035310 1023235 1010286 995900 980868 966355
60815I66355j3692j3087j2065j0088p856o533o310o401o237n841n155l800j857
$$ 966355 952663 939576 927511 917423 909567 903034 896724 890323 884086 878245 873090 869290 867433
60802H67433k24L81M62J114K422L218K651J379N51J45p50k054k231k35K785M617
$$ 867433 867209 867590 868052 869166 871588 874806 877457 878836 879387 879532 878782 876728 874497 874262 877047 881664
60786H81664M434L374K794K859K902K407J257m44k311l780m554m648l937k148
$$ 881664 886098 889472 892266 895125 898027 900434 901691 901247 898936 895156 890602 885954 882017 879869
60772H79869K54J752J005j725m831o839p361o848n989n147m053k274l58J46j392
$$ 879869 880123 881875 882880 881155 876324 869485 862124 855276 849287 844140 840087 837813 837455 837601 836209
60757H36209l287l391k160k249m803p744q614p625o588o047n286m529m991o637
$$ 836209 832922 829531 827371 825122 820319 812575 803961 796336 789748 783701 778415 773886 768895 762258
60743G62258p746p351o593o811p493p322o339n721n817n741m958m089l818l770
$$ 762258 754512 747161 740568 733757 726264 718942 712603 706882 701065 695324 690366 686277 682459 678689
60729F78689l178k099j327j125p49N01K083K672J842P31P08J700K495K503K481
$$ 678689 675511 673412 672085 670960 670211 670712 672795 675467 677309 678040 678748 680448 682943 685446 687927
60714F87927L246M454N114M943M564M537M703M578M063L558L429L497L196K319
$$ 687927 691173 695627 700741 705684 710248 714785 719488 724066 728129 731687 735116 738613 741809 744128
60700G44128J380R54Q82O17J60k7j37j087l029m619m490k997j766j781k552l018
$$ 744128 745508 746462 747344 747961 748121 748094 747957 746870 743841 739222 734732 731735 729969 728188 725636 722618
60684G22618k667j852j451k053l239l928l753l542l988m617m849n212o280p001
$$ 722618 719951 718099 716648 714595 711356 707428 703675 700133 696145 691528 686679 681467 675187 668186
60670F68186n809l320k118l311m904m459k162j44K65n90j811k640k317o23J419
$$ 668186 662377 659057 656939 653628 648724 644265 642103 641959 642224 641634 639823 637183 634866 634243 635662
60655F35662K331J933J587K437M006M836M162K588J335J035J395J897K492L283
$$ 635662 637993 639926 641513 643950 647956 652792 656954 659542 660877 661912 663307 665204 667696 670979
60641F70979L894L808L387L713N074O403O700O324O210O467O488O003N140L898
$$ 670979 674873 678681 682068 685781 690855 697258 703958 710282 716492 722959 729447 735450 740590 744488
60627G44488K459J681K259L563M273M071L767L813L747L173K220R70n44j617j434
$$ 744488 746947 748628 750887 754450 758723 762794 766561 770374 774121 777294 779514 780484 779940 778323 776889
60612G76889o60j157l386n379n285l878l290m104n147n757o519p557p616n706
$$ 776889 776229 775072 771686 766307 761022 757144 753854 749750 744603 738846 732327 724770 717154 711448
60598G11448k864j307j988l574l997k651p10O39J653L162M717M698K558j71j761
$$ 711448 708584 707277 705289 701715 697718 695067 694357 694996 696649 699811 704528 709226 711784 711613 709852
60583G09852k336l092m175m556l710k255r11J24O26K53p74j649j934j786j181
$$ 709852 707516 704424 700249 695693 691983 689728 688817 688941 689567 689820 689046 687397 685463 683677 682496
60568F82496J10J503J798R86Q42K709N384O317M606J842Q3j50K12J04o39j229
$$ 682496 682606 684109 685907 686893 687735 690444 695828 702145 706751 708593 708676 708526 708738 708842 708203 706974
60552G06974p57P41K329L462M664O267P056N409J832q83n97J904M197M999M891
$$ 706974 706217 706958 709287 712749 717413 723680 730736 736145 737977 737094 736497 738401 742598 747597 752488
60537G52488M832N074N463N830N788M836L192J960J968K708L001K491J850J585
$$ 752488 757320 762394 767857 773687 779475 784311 787503 789463 791431 794139 797140 799631 801481 803066
60523H03066J438J287J846L741O261P832P799P055O804P482R052J1531J4531J6906
$$ 803066 804504 805791 807637 811378 817639 825471 833270 840325 847129 854611 863663 875194 889725 906631
60509I06631J7790J7802J8391J9942K1380K1717K1184K0421J9355J7512J4931
$$ 906631 924421 942223 960614 980556 1001936 1023653 1044837 1065258 1084613 1102125 1117056
60498A117056J1867Q013L053j911m673m250k215q65m68O67L542P006R471J1132
$$ 1117056 1128923 1136936 1139989 1138078 1133405 1129155 1126940 1126075 1125607 1126274 1129816 1136822 1146293 1157425
60484A157425J3535J7327K1538K5171K8563L2666L7605M2654M7276N1469N5007
$$ 1157425 1170960 1188287 1209825 1234996 1263559 1296225 1333830 1376484 1423760 1475229 1530236
60473A530236N7034N6684N3918M9447M3871L7039K8270J7272M934o862j6390k3145
$$ 1530236 1587270 1643954 1697872 1747319 1791190 1828229 1856499 1873771 1878705 1871843 1855453 1832308
60461A832308k7739l0803l2208l1409k8440k4241k0011j6296j2926r641o335k593
$$ 1832308 1804569 1773766 1741558 1710149 1681709 1657468 1637457 1621161 1608235 1598594 1592259 1589666
60449A589666K394Q768J5119J9570K2081K4807K9762L6812M4527N2280O0335O8289
$$ 1589666 1592060 1600828 1615947 1635517 1657598 1682405 1712167 1748979 1793506 1845786 1906121 1974410
60437A974410P4861P9572Q3311Q6608Q8179Q6133Q0150P1563O1696N1082M0441
$$ 1974410 2049271 2128843 2212154 2298762 2386941 2473074 2553224 2624787 2686483 2737565 2778006
60426B778006L1388K5546K3131K2804K2831K2142K0282J6616R966o68j5267l2872
$$ 2778006 2809394 2834940 2858071 2880875 2903706 2925848 2946130 2962746 2972712 2972044 2956777 2923905
60414B923905n2368p2556r1391j06067j14623j17242j15636j11541j06310j01207
$$ 2923905 2871537 2798981 2707590 2601523 2486900 2369658 2254022 2142481 2036171 1934964
60404A934964r6852r2391q6374p8726p0942o4102n7707n1028m4624l9497l5553
$$ 1934964 1838112 1745721 1659347 1580621 1509679 1445577 1387870 1336842 1292218 1252721 1217168
60393A217168l1933k8549k6023k4230k2084j9165j6554j5507j5869j6240j5401
$$ 1217168 1185235 1156686 1130663 1106433 1084349 1065184 1048630 1033123 1017254 1001014 985613
60382I85613j3248j0662q794q129q044p506o271m982m080l357k788l019m371o062
$$ 985613 972365 961703 952909 944780 936736 929230 922959 917977 913897 910540 907752 904733 900362 894300
60368H94300p129p639q078q019o531l868j636r09j038p61J23P38L12j074k684
$$ 894300 887171 879532 871454 863435 856904 853036 851400 850491 849453 848692 848815 849553 849865 848791 846107
60353H46107l699l683k768j409O5J525K791L644M002L783K811J331L37N90J463
$$ 846107 842408 838725 835957 834548 834613 836138 838929 842573 846575 850358 853169 854500 854837 855427 856890
60338H56890J715J437J976L617M732M075K702K260K397J552q9l81J726M544N863
$$ 856890 858605 860042 862018 865635 870367 874442 877144 879404 881801 883353 883264 882883 884609 889153 895016
60323H95016N582N237N598N862N029L198J374M92P30J579K399K921L267L690M369
$$ 895016 900598 905835 911433 917295 922324 925522 926896 927388 928118 929697 932096 935017 938284 941974 946343
60308I46343N231N771N366M101K999K918L538L988M209M878O080P059P386P486
$$ 946343 951574 957345 962711 966812 969811 972729 976267 980255 984464 989342 995422 1002481 1009867 1017353
60294A017353P708P834P963Q934J1063J3078J3265J1341Q652O620N608M911L410
$$ 1017353 1025061 1032895 1040858 1049792 1060855 1073933 1087198 1098539 1107191 1113811 1119419 1124330 1127740
60281A127740M71l265o194p374p492p739q237q225p489o592n843n026m304m434
$$ 1127740 1128211 1124946 1118752 1111378 1103886 1096147 1087910 1079685 1072196 1065604 1059761 1054735 1050431 1045997
60267A045997n635o882o872n404l444k109j811k183k529k332j417L45L033O139
$$ 1045997 1040362 1033480 1026608 1021204 1017760 1015651 1013840 1011657 1009128 1006796 1005379 1005724 1008757 1014896
60253A014896Q506R504J0079J1741J4580J7278J9194K1313K4496K7830K9609K9215
$$ 1014896 1023402 1032906 1042985 1054726 1069306 1086584 1105778 1127091 1151587 1179417 1209026 1238241
60241A238241K7014K3046J7127J0039L213k944r260j6035k2173k6580k9396l1047
$$ 1238241 1265255 1288301 1305428 1315467 1318680 1315736 1306476 1290441 1268268 1241688 1212292 1181245
60229A181245l1023k8673k4760k1019j8373j6508j5124j4457j4330j3700j1738
$$ 1181245 1150222 1121549 1096789 1075770 1057397 1040889 1025765 1011308 996978 983278 971540
60218I71540q862o314n007n011n591n651m716l694l929n242n812m605k935k665
$$ 971540 962678 956364 951357 946346 940755 935104 930388 926694 922765 917523 911711 907106 904171 901506
60204I01506l654m232l739l137l082k903j959q93p75j589k223j654J69K282L398
$$ 901506 897852 893620 889881 886744 883662 880759 878800 877907 877132 875543 873320 871666 871835 874117 877515
60189H77515L140K569K930L910L995K696J249P21O02J30L0J513M101N704N104
$$ 877515 880655 883224 886154 890064 894059 896755 898004 898725 899327 899457 899487 901000 905101 910805 915909
60174I15909L341K459L396N222O104N067L001J865K558M048M869M882M954N452
$$ 915909 919250 921709 925105 930327 936431 941498 944499 946364 948922 952970 957839 962721 967675 973127
60160I73127O012O464P031P695Q156Q425Q721Q900Q779Q769R295R671Q729O700
$$ 973127 979139 985603 992634 1000329 1008485 1016910 1025631 1034531 1043310 1052079 1061374 1071045 1079774 1086474
60146A086474N331N769P291Q561R064Q748P325M987L104L024M317N168M463K819
$$ 1086474 1091805 1097574 1104865 1113426 1122490 1131238 1138563 1143550 1146654 1149678 1153995 1159163 1163626 1166445
60132A166445J511J104J285J475J230L53j094k820m389n323n348m661l868l386
$$ 1166445 1167956 1169060 1170345 1171820 1173050 1173403 1172309 1169489 1165100 1159777 1154429 1149768 1145900 1142514
60118A142514k961k009m31J073J621J066J44l13j66M5k17j111k479l798m228l466
$$ 1142514 1139553 1137544 1137113 1138186 1139807 1140873 1141017 1140704 1140538 1140583 1140366 1139255 1136776 1132978 1128750 1125284
60102A125284k652l403n399o070l685O1K025J600J084K132L799M567M595M878
$$ 1125284 1122632 1119229 1113830 1107760 1104075 1104136 1106161 1107761 1108845 1110977 1114776 1119343 1123938 1128816
60088A128816N434N571N212M761M245L505K838K656K883L423M642O541Q096Q395
$$ 1128816 1134250 1139821 1145033 1149794 1154039 1157544 1160382 1163038 1165921 1169344 1173986 1180527 1188623 1197018
60074A197018P982P945Q097P304N499M023L795M256M531M640N082N944O959P928
$$ 1197018 1205000 1212945 1221042 1228346 1233845 1237868 1241663 1245919 1250450 1255090 1260172 1266116 1273075 1281003
60060A281003Q662Q960Q949R093R620J0180J0286R723Q544P032N750N148N103
$$ 1281003 1289665 1298625 1307574 1316667 1326287 1336467 1346753 1356476 1365020 1372052 1377802 1382950 1388053
60047A388053N259N789P101Q719R302Q086N649K871j49l402n879o219m432k187
$$ 1388053 1393312 1399101 1406202 1414921 1424223 1432309 1437958 1440829 1440680 1437278 1431399 1425180 1420748 1418561
60033A418561j141j437k072k348k563l267m273m828m814n277p196j0012j2017
$$ 1418561 1417420 1415983 1413911 1411563 1409000 1405733 1401460 1396632 1391818 1386541 1379345 1369333 1357316
60020A357316j2373j1982j2091j2771j3407j4085j5481j7476j8848j8707j7508
$$ 1357316 1344943 1332961 1320870 1308099 1294692 1280607 1265126 1247650 1228802 1210095 1192587
60009A192587j6260j5191j3822j2110j0839j0708j1374j1741j1015r344p529o266
$$ 1192587 1176327 1161136 1147314 1135204 1124365 1113657 1102283 1090542 1079527 1070183 1062654 1056388
59997A056388n696n453n093m526m086m117m539m884m733l981k755j280J85J485
$$ 1056388 1050692 1045239 1040146 1035620 1031534 1027417 1022878 1017994 1013261 1009280 1006525 1005245 1005430 1006915
59983A006915K649L600L921L222J865P70L77K51K4Q7P94J437R12p94k614l914
$$ 1006915 1009564 1013164 1017085 1020307 1022172 1022942 1023319 1023570 1023594 1023681 1024475 1025912 1026824 1026030 1023416 1019502
59967A019502n094o478p484p436o574n554m396k764j140q06k344m715o298o546
$$ 1019502 1014408 1007930 1000446 993010 986436 980882 976486 973722 972582 971776 969432 964717 958419 951873
59953I51873o184n934n636m844l788l165l147l026k128p45L1o00k311l703l435
$$ 951873 945689 939755 934119 929275 925487 922322 919175 916149 914021 913276 913307 912707 910396 906693 903258
59938I03258j582J76L07p00r06M53J878J738N58J91J320K976M255N197N922O076
$$ 903258 901676 901852 902159 901459 900553 901006 902884 904622 905180 905371 906691 909667 913922 919119 925041 931117
59922I31117N506M562L441K110J086J234K339K889J950L99m61p02j231k147k693
$$ 931117 936623 941185 944626 946736 947822 949056 951395 954284 956234 956633 956172 955470 954239 952092 949399
59907I49399k555k105j515n64N78J299J416J440J725J880J332R8j178j809j584
$$ 949399 946844 944739 943224 942660 943238 944537 945953 947393 949118 950998 952330 952428 951250 949441 947857
59892I47857q70j78L05N59K75q27k018j843m0J638J489J71k55P18J605J416J054
$$ 947857 946987 946809 947114 947673 947948 947121 945103 943260 943220 944858 946347 946518 946263 946981 948586 950002 951056
59875I51056J687L047M213M994N620N939N987O589Q210R779R982R290R348J0419
$$ 951056 952743 955790 960003 964997 970617 976556 982543 989132 997342 1007121 1017103 1026393 1035741 1046160
59861A046160J1161J1104J1558J3178J4307J3262J1227J0850J2397J3235J1426
$$ 1046160 1057321 1068425 1079983 1093161 1107468 1120730 1131957 1142807 1155204 1168439 1179865
59850A179865Q085N471M337M237N093O769P806O521L420R65N06P53o9j793k917
$$ 1179865 1187950 1193421 1197758 1201995 1207088 1213857 1221663 1228184 1231604 1232569 1233075 1233828 1233759 1231966 1229049
59835A229049k815k235j952j956j992k023j942j335K00K506M698N630M859L268
$$ 1229049 1226234 1223999 1222047 1220091 1218099 1216076 1214134 1212799 1212999 1215505 1220203 1225833 1230692 1233960
59821A233960K303K489L154L754M611N766O117M793K799J938K288K177Q20n33
$$ 1233960 1236263 1238752 1241906 1245660 1250271 1256037 1262154 1266947 1269746 1271684 1273972 1276149 1276969 1276436
59807A276436o63k25m99j231j016N36K221K822K247J090l5m41L77J906K698K040
$$ 1276436 1275773 1275548 1275049 1273818 1272802 1273338 1275559 1278381 1280628 1281718 1281683 1281242 1281619 1283525 1286223 1288263
59791A288263J096J641L837O207P697Q691R641R759Q103N336L148K054Q49j465
$$ 1288263 1289359 1291000 1294837 1301044 1308741 1317432 1327073 1336832 1344935 1350271 1353419 1355473 1356322 1354857
59777A354857m206n892n827m462k895k430l861o593r076j0662j2200j4234j5663
$$ 1354857 1350651 1344759 1338932 1334470 1331575 1329145 1325284 1318691 1309615 1298953 1286753 1272519 1256856
59764A256856j5270j3730j2590j1857j0267p731n636m561l476j840p96j255k139
$$ 1256856 1241586 1227856 1215266 1203409 1193142 1185411 1179775 1175214 1171738 1169898 1169102 1167847 1165708
59751A165708j864o98k78j276k686l247k723j809j412j830k296j743l71K56p48
$$ 1165708 1163844 1163146 1162868 1161592 1158906 1155659 1152936 1151127 1149715 1147885 1145589 1143846 1143475 1143731 1142983
59736A142983k162k272j163l41n56j319k295l648m879m849l648l188m958p907
$$ 1142983 1140821 1138549 1137386 1137045 1136489 1135170 1132875 1129227 1124348 1119499 1115851 1112663 1107705 1099798
59722A099798r475q414n887l964l698m579n257m660k723k96J661K745L023K698
$$ 1099798 1090323 1081909 1076022 1072058 1068360 1063781 1058524 1053864 1051141 1050845 1052506 1055251 1058274 1060972
59708A060972K166K203L517N896Q091Q948Q615Q324Q910R938J0583J0915J1658
$$ 1060972 1063138 1065341 1068858 1074754 1082845 1091793 1100408 1108732 1117642 1127580 1138163 1149078 1160736
59695A160736J2825J3410J2765J1481J0441R534Q101O242M869M464M487M177L398
$$ 1160736 1173561 1186971 1199736 1211217 1221658 1231192 1239293 1245535 1250404 1254868 1259355 1263532 1266930
59682A266930K526J875J461J053L71o61j826k925m066n409o762p632p626o620
$$ 1266930 1269456 1271331 1272792 1273845 1274216 1273555 1271729 1268804 1264738 1259329 1252567 1244935 1237309 1230689
59668A230689m824k926j844j903k396k348j551n59%k63j376k663k935j794l02
$$ 1230689 1225865 1222939 1221095 1219192 1216796 1214448 1212897 1212338 1212338 1212075 1210699 1208036 1205101 1203307 1203005
59653A203005L67N41J347K863M334N938Q602J1721J2932J1179Q602Q025R494J0727
$$ 1203005 1203372 1203913 1205260 1208123 1212457 1218395 1226997 1238718 1251650 1262829 1271431 1279456 1288950 1299677
59639A299677J0491R901J0373J1675J2523J2292J1440J0562R494P613M918K535
$$ 1299677 1310168 1320069 1330442 1342117 1354640 1366932 1378372 1388934 1398428 1406041 1410959 1413494
59627A413494J656K054K224J168n76j999k902l603m081m247m552n425o438o904
$$ 1413494 1415150 1417204 1419428 1420596 1420020 1418021 1415119 1411516 1407435 1403188 1398636 1393211 1386773 1379869
59613A379869o998p378p841p471o171m947m379l784k380n11J002K112L452N154
$$ 1379869 1372871 1365493 1357652 1350181 1344010 1339063 1334684 1330900 1328520 1328009 1329011 1331123 1334575 1339729
59599A339729O458O593N709M832M966O267P999R210R314Q141N903L336J366K4
$$ 1339729 1346187 1352780 1358489 1363321 1368287 1374554 1382553 1391763 1401077 1409218 1415121 1418457 1419823 1419847
59585A419847j995n856j0827j4818j6761j7591j8611j9774k0098j9120j7227j5086
$$ 1419847 1417852 1411996 1401169 1386351 1369590 1351999 1333388 1313614 1293516 1274396 1257169 1242083
59573A242083j3332j2501j2521j2502j1586r983q717q557r577j1400j3242j3975
$$ 1242083 1228751 1216250 1203729 1191227 1179641 1169658 1160941 1152384 1142807 1131407 1118165 1104190
59561A104190j3051j1468j0996j2162j3651j3990j3120j1855j0429q439n947l778
$$ 1104190 1091139 1079671 1068675 1056513 1042862 1028872 1015752 1003897 993468 985029 979082 975304
59549I75304k589k231k219k393k803l216l177k548j801j586j979k229j478K15
$$ 975304 972715 970484 968265 965872 963069 959853 956676 954128 952327 950741 948762 946533 945055 945270
59535I45270J843K620K822L085L254K657J373K80l77j509l604n484n570l998k437
$$ 945270 947113 949733 952555 955640 958894 961551 962924 963204 962827 961318 957714 952230 946660 942662 940225
59520I40225j915j917j666j293j333j835k561l467m404m800m165k745j229j19
$$ 940225 938310 936393 934727 933434 932101 930266 927705 924238 919834 915034 910869 908124 906895 906776
59506I06776L12j46j267k145j959r00J94J062K215L815M981M669L014J355R44
$$ 906776 907088 906942 905675 903530 901571 900671 900865 901927 904142 907957 912938 917607 920621 921976 922920
59491I22920J830L153M315N459O795P988Q710R435J0962J3199J5303J7143J9623
$$ 922920 924750 927903 932218 937677 944472 952460 961170 970605 981567 994766 1010069 1027212 1046835
59478A046835K3020K5797K5898K2711J7119J0265L285k300n317o137o170o015
$$ 1046835 1069855 1095652 1121550 1144261 1161380 1171645 1174930 1172630 1167313 1161176 1155006 1148991
59466A148991n113l387k012j936k527k560j959j724k341l202l652l956m833o351
$$ 1148991 1143878 1140491 1138479 1136543 1134016 1131456 1129497 1127773 1125432 1122230 1118578 1114622 1109789 1103438
59452A103438p734q342q455q747r151q914p914p167p397p805p213o033n773o612
$$ 1103438 1095704 1087362 1078907 1070160 1061009 1052095 1044181 1037014 1029617 1021812 1014599 1008566 1002793 996181
59438I96181o845n246k758j057m00J29R20J575J933K241K420K263K304L437N378
$$ 996181 989336 984090 981332 980275 979875 980004 980924 982499 984432 986673 989093 991356 993660 997097 1002475
59423A002475O559O192N553O261P746P752N445K850K394L706M139K397K07k55
$$ 1002475 1009034 1015226 1020779 1027040 1034786 1042538 1047983 1050833 1053227 1056933 1061072 1063469 1063676 1063421
59409A063421N46M20j138k227j530k94l04j085o33J593L977N077N241N487N917
$$ 1063421 1063967 1064387 1063249 1061022 1059492 1059198 1058894 1057809 1057176 1058769 1062746 1067823 1073064 1078551 1084468
59394A084468O065O064O541P595Q640R129Q847P600N390L017J734J814J921N45
$$ 1084468 1090533 1096597 1103138 1110733 1119373 1128502 1137349 1144949 1150339 1153356 1155090 1156904 1158825 1159370
59380A159370k187m690n763n612m942l842k072m3J222J124J56n81k22J411L944
$$ 1159370 1157183 1152493 1146730 1141118 1136176 1132334 1130262 1130219 1131441 1132565 1132721 1132140 1131918 1133329 1137273
59365A137273O787R373J1183J1911J1831J1876J2779J4247J5602J7319K0847K6307
$$ 1137273 1144060 1153433 1164616 1176527 1188358 1200234 1213013 1227260 1242862 1260181 1281028 1307335
59353A307335L1337L3263L1815K8571K4212J7844R148j95p607j1319j0749o383
$$ 1307335 1338672 1371935 1403750 1432321 1456533 1474377 1483525 1483330 1475723 1464404 1453655 1447272
59341A447272J43O634J1506J3900J2889P811j99q344j4564j8720k0933k0393j7074
$$ 1447272 1447415 1454049 1465555 1479455 1492344 1500155 1499956 1491612 1477048 1458328 1437395 1417002 1399928
59328A399928j3201j1088j0231q387n132k330j046JK181M779O137N951N314N113
$$ 1399928 1386727 1375639 1365408 1357021 1351889 1349559 1348513 1348514 1350695 1355474 1361611 1367562 1372876 1377989
59314A377989N280N350M972M032K823K045K154K734K844K000O36l54l26P14K281
$$ 1377989 1383269 1388619 1393591 1397623 1400446 1402491 1404645 1407379 1410223 1412223 1412859 1412505 1412179 1412893 1415174
59299A415174L814N055O080P061Q003Q704R096R572J0767J2636J4118J4312J3836
$$ 1415174 1418988 1424043 1430123 1437184 1445187 1453891 1462987 1472559 1483326 1495962 1510080 1524392 1538228
59286A538228J4261J6015J7820J8600J8968K0050K1586K2245K1341J9232J6319
$$ 1538228 1552489 1568504 1586324 1604924 1623892 1643942 1665528 1687773 1709114 1728346 1744665
59275A744665J2726Q839N220J948j170l869n718p135r055j1586j3858j5376j6636
$$ 1744665 1757391 1766230 1771450 1773398 1772228 1768359 1762641 1755506 1746451 1734865 1721007 1705631 1688995
59262A688995j8111j9543k0537k1169k1687k2195k2834k3654k4180k3821k2810
$$ 1688995 1670884 1651341 1630804 1609635 1587948 1565753 1542919 1519265 1495085 1471264 1448454
59251A448454k1844k0788j8777j5992j3973j3522j3345j1776q987o384m451k459
$$ 1448454 1426610 1405822 1387045 1371053 1357080 1343558 1330213 1318437 1309450 1303066 1298615 1296156
59239A296156j2K481M945Q098J2206J6004J7364J4952R080J298o500j2786j6743
$$ 1296156 1296144 1298625 1303570 1311668 1323874 1339878 1357242 1372194 1381274 1382572 1376072 1363286 1346543
59226A346543j8396j8491j7924j6988j5333j2853j0208q023n991l528r61J004
$$ 1346543 1328147 1309656 1291732 1274744 1259411 1246558 1236350 1228327 1222336 1218808 1217847 1218851
59214A218851K772N464Q770J0714J0316R198R460J0963J1988J1796J1182J0776
$$ 1218851 1221623 1227087 1235857 1246571 1256887 1266085 1275545 1286508 1298496 1310292 1321474 1332250
59202A332250J0202Q920O894M395J983N00J84p7j547l679m519l337j744j738l396
$$ 1332250 1342452 1351372 1358266 1362661 1364644 1365144 1365328 1365251 1363704 1360025 1355506 1352169 1350425 1348687 1345291
59187A345291n090n401m280k656j378m00R90K952M375M070K521J584K238L565
$$ 1345291 1340201 1334800 1330520 1327864 1326486 1326086 1327076 1330028 1334403 1338473 1340994 1342578 1344816 1348381
59173A348381M308M415M424M219L392K393K124K435J868o76m476p449q042o640
$$ 1348381 1352689 1357104 1361528 1365747 1369139 1371532 1373656 1376091 1377959 1377283 1372807 1365358 1357316 1350676
59159A350676n226n499p292r057r769r805r831r689q989q143p901q121p914o861
$$ 1350676 1345450 1339951 1332659 1323602 1313833 1304028 1294197 1284508 1275519 1267376 1259475 1251354 1243440 1236579
59145A236579n281l425j306O10J538J487J310J416J318R92J530L610O210P884
$$ 1236579 1231298 1227873 1226567 1227177 1228715 1230202 1231512 1232928 1234246 1235238 1236768 1240378 1246588 1254472
59131A254472Q722R758J0944J1219J0497J0010J0343J0492R632Q554Q355Q624
$$ 1254472 1263194 1272952 1283896 1295115 1305612 1315622 1325965 1336457 1346089 1354643 1362998 1371622
59119A371622Q007O086L625J342n76j920k408k238j948j807j954k852m715o630
$$ 1371622 1379629 1385715 1389340 1390682 1390106 1388186 1385778 1383540 1381592 1379785 1377831 1374979 1370264 1363634
59105A363634p407p326p829r148r538p775n318m717o384q377r289j0000j1959
$$ 1363634 1356227 1348901 1341072 1331924 1322386 1314611 1309293 1304576 1298192 1289815 1280526 1270526 1258567
59092A258567j4730j6250j5346j3124j1677j1799j2406j2010j0392q729q239q906
$$ 1258567 1243837 1227587 1212241 1199117 1187440 1175641 1163235 1151225 1140833 1132104 1123865 1114959
59080A114959r541r034p565o420o446o941o479m790l073k280j750k24K336M691
$$ 1114959 1105418 1096384 1088819 1082399 1075953 1069012 1062533 1057743 1054670 1052390 1050640 1050416 1052752 1057443
59066A057443N903O225O509P424R239J1642J3701J4562J4432J4412J5246J6643
$$ 1057443 1063346 1069571 1076080 1083504 1092743 1104385 1118086 1132648 1147080 1161492 1176738 1193381
59054A193381J7799J8152J7590J6512J5686J5518J5411J4436J2631J0955R918
$$ 1193381 1211180 1229332 1246922 1263434 1279120 1294638 1310049 1324485 1337116 1348071 1357989
59043A357989Q961P376N145K665L53j323k132k665l849n540o353n385l474k221
$$ 1357989 1366950 1374326 1379471 1382136 1382489 1381166 1379034 1376369 1372520 1366980 1360627 1355242 1351768 1349547
59029A349547k327l369m695o007p321q773j0235j1235j1586j1856j2489j2734
$$ 1349547 1347220 1343851 1339156 1333149 1325828 1317055 1306820 1295585 1283999 1272143 1259654 1246920
59017A246920j1672j0049r592j0313j0337q992q014q569r055p712n749n555o824
$$ 1246920 1235248 1225199 1215607 1205294 1194957 1185965 1177951 1169382 1160327 1152615 1146866 1141311 1134487
59004A134487o994n221l473l530m938o381p180o859m981k311p77j217k204j977
$$ 1134487 1127493 1122272 1118799 1115269 1110331 1103950 1096770 1089911 1084930 1082619 1081842 1080625 1078421 1076444
58990A076444q04l36j203k234k010n35R11J290R30Q62J301J450J072J209K574
$$ 1076444 1075640 1075304 1074101 1071867 1069857 1069322 1070233 1071523 1072453 1073315 1074616 1076066 1077138 1078347 1080921
58975A080921M110M339L562L321M069M887N361O134P482Q842R967J1182J2297
$$ 1080921 1085031 1089370 1092932 1096253 1100322 1105209 1110570 1116704 1124186 1133028 1142995 1154177 1166474
58962A166474J2865J3671J6148J9621K1135J9065J5246J2219J0007P319M379K429
$$ 1166474 1179339 1193010 1209158 1228779 1249914 1268979 1284225 1296444 1306451 1313770 1318149 1320578
58950A320578J204p52l449n184n089m180l499k757j397K74J748K997L841L587
$$ 1320578 1321782 1321030 1317581 1312397 1307308 1303128 1299629 1296872 1295475 1295749 1297497 1300494 1304335 1307922
58936A307922K126O10Q2M9o01j724k157j750j902l525n546o316n788n231n004
$$ 1307922 1310048 1310658 1310740 1310789 1310188 1308464 1306307 1304557 1302655 1299130 1293584 1287268 1281480 1276249 1271245
58921A271245l973j439J528L511M610N863P351Q107P893P779Q605R835J0480J0460
$$ 1271245 1267272 1265833 1267361 1270872 1275482 1281345 1288696 1296803 1304696 1312475 1321080 1330915 1341395 1351855
58907A351855J0378J0409J0035Q831P169O115O508P854Q246O063J808k356n061
$$ 1351855 1362233 1372642 1382677 1391508 1398677 1404792 1411300 1419154 1427400 1433463 1435271 1432915 1427854
58894A427854o945r150j1573j3322j4171j4626j4914j4868j4668j4760j4947j4388
$$ 1427854 1420909 1411759 1400186 1386864 1372693 1358067 1343153 1328285 1313617 1298857 1283910 1269522
58882A269522j2777j0919r728r081q087o246l971k073j093j083j641k146k290
$$ 1269522 1256745 1245826 1236098 1227017 1218930 1212684 1208713 1206640 1205547 1204464 1202823 1200677 1198387
58869A198387k510l440m699m892l342j301m47n64j16Q86M00k428n159m772j479
$$ 1198387 1195877 1192437 1187738 1182846 1179504 1178203 1177756 1177192 1177076 1177962 1178362 1175934 1170775 1166003 1164524
58854A164524J782L055K870K487K549L518N644Q030R268R454J0147J1910J3432
$$ 1164524 1166306 1169361 1172231 1174718 1177267 1180785 1186429 1194459 1203727 1213181 1223328 1235238 1248670
58841A248670J3656J3248J3092J2929J2608J3238J5549J8149J9070J8330J7505
$$ 1248670 1262326 1275574 1288666 1301595 1314203 1327441 1342990 1361139 1380209 1398539 1416044
58830A416044J7275J7057J6763J7235J8636J9795J9662J8500J7127J5711J3941
$$ 1416044 1433319 1450376 1467139 1484374 1503010 1522805 1542467 1560967 1578094 1593805 1607746
58819A607746J1974J0472R602Q390N612J502j946l055k485k355l445m517m602
$$ 1607746 1619720 1630192 1639794 1648184 1653796 1655298 1653352 1650297 1647812 1645457 1642012 1637495 1632893
58806A632893m535n443o948p965q514r519j1378j3692j6038j7994j8960j8989
$$ 1632893 1628358 1622915 1615967 1608002 1599488 1589969 1578591 1564899 1548861 1530867 1511907 1492918
58794A492918j9355k1118k3323k3754k1525j7996j5123j3703j3361j3410j3458
$$ 1492918 1473563 1452445 1429122 1405368 1383843 1365847 1350724 1337021 1323660 1310250 1296792
58783A296792j3573j4053j4869j5470j5338j4376j2621j0223p997p168p873q657
$$ 1296792 1283219 1269166 1254297 1238827 1223489 1209113 1196492 1186269 1178272 1171104 1163231 1154574
58771A154574q180o737n396m502l905l715l706k832o80J387K031J975K510K819
$$ 1154574 1146394 1139657 1134261 1129759 1125854 1122139 1118433 1115601 1114921 1116308 1118339 1120314 1122824 1125643
58757A125643J208j338j644J093L717L311Q45r10j251j396j645j002M52P87j490
$$ 1125643 1126851 1125513 1123869 1124962 1128679 1131990 1132835 1131925 1130674 1129278 1127633 1126631 1127083 1127870 1126380
58742A126380n337q039p917n843m183m383n704o322n387l659k410k224k760l039
$$ 1126380 1121043 1113004 1105087 1099244 1095061 1090678 1084974 1078652 1073265 1069606 1067196 1064972 1062212 1059173
58728A059173k032L79K979M422M911N953Q291J0876J2232J2155J1576J1197J0768
$$ 1059173 1057141 1057520 1060499 1064921 1069832 1075785 1084076 1094952 1107184 1119339 1130915 1142112 1152880
58715A152880R656P807O057N198M655K681j449n959q193p577o025n578o612q274
$$ 1152880 1162536 1170343 1176400 1181598 1186253 1188934 1187485 1181526 1173333 1165756 1159731 1154153 1147541 1139267
58701A139267r516r504q103o384n840o744p901q116p147n258k885r10j62l06j26
$$ 1139267 1129751 1120247 1112144 1105760 1099920 1093176 1085275 1077159 1070012 1064754 1061869 1060959 1060797 1060491 1060365
58686A060365Q06J835K701M013N881P373Q008Q437R063R268Q933R202J0530J1290
$$ 1060365 1061171 1063006 1065707 1069720 1075601 1082974 1090982 1099419 1108482 1117750 1126683 1135885 1146415 1157705
58672A157705R910P363N900O085O791P467Q402Q966P822N276L501L646M326L935
$$ 1157705 1167615 1174978 1180878 1186963 1193754 1201221 1209623 1218589 1226411 1231687 1235188 1238834 1243160 1247095
58658A247095L127L554N149O247O101N643N552M948K751n91l677n954q005j0203
$$ 1247095 1250222 1253776 1258925 1265172 1271273 1276916 1282468 1287416 1290167 1289576 1285899 1279945 1271940 1261737
58644A261737j2157j3637j5137j7078j9271k1542k4100k6501k7162k5055k1488
$$ 1261737 1249580 1235943 1220806 1203728 1184457 1162915 1138815 1112314 1085152 1060097 1038609
58633A038609j8954j8236j7792j6080j3463j1477j0940j1185j0680q432n147k844
$$ 1038609 1019655 1001419 983627 967547 954084 942607 931667 920482 909802 901370 896223 893379
58621H93379k708l745m271m114m072l885k562o06K28k52j07J640L341L356K636
$$ 893379 890671 886926 882655 878541 874469 870584 868022 867416 867644 867392 867285 868925 872266 875622 878258
58606H78258L125M904O624P802Q914R719R208P138M393J855k29j952l533n151
$$ 878258 881383 886287 892911 900713 909627 919346 928554 935692 940085 941940 941711 939759 936226 931075
58592I31075o435o666n988n613o190o929p100p233p684p328n324l135k795l770
$$ 931075 924640 917974 911986 906373 900183 893254 886154 878921 871237 863909 858585 855450 852655 848885
58578H48885l774k397j691k835m314m200k615r64P7Q42J721K675L277K937J645
$$ 848885 845111 842714 841023 838188 833874 829674 827059 826095 826172 827014 828735 831410 834687 837624 839269
58563H39269M85N47J269R66q12k573k983k461k041j775j167m00K8M65J804M066
$$ 839269 839754 840301 841570 842536 841724 839151 836168 833707 831666 829891 828724 828324 828352 828817 830621 834687
58547H34687O147P183P491P873Q364Q224P098N751N148N085M510L295K728L628
$$ 834687 840834 848017 855508 863381 871745 879969 887067 892818 897966 903051 907561 910856 913584 917212
58533I17212M852M795L863M105O392R260J0927J1408J1988J3358J5037J6220J6667
$$ 917212 922064 926859 930722 934827 941219 950479 961406 972814 984802 998160 1013197 1029417 1046084
58520A046084J6718J6700J6345J5011J2737J0756J0377J1512J2904J3788J4514
$$ 1046084 1062802 1079502 1095847 1110858 1123595 1134351 1144728 1156240 1169144 1182932 1197446
58509A197446J5559J6690J7467J7909J8438J9506K1457K4230K7061K8947K9537
$$ 1197446 1213005 1229695 1247162 1265071 1283509 1303015 1324472 1348702 1375763 1404710 1434247
58498A434247K9110K7751K5182K1494J7333J3125Q774M303J68l312o174q334r583
$$ 1434247 1463357 1491108 1516290 1537784 1555117 1568242 1577016 1581319 1581487 1578175 1572001 1563667 1554084
58485A554084j0287j1316j2915j4473j5861j7964k1211k4409k6079k6321k6249
$$ 1554084 1543797 1532481 1519566 1505093 1489232 1471268 1450057 1425648 1399569 1373248 1346999
58474A346999k6096k5144k3341k1605k0213j8303j5589j3447j3219j4028j3600
$$ 1346999 1320903 1295759 1272418 1250813 1230600 1212297 1196708 1183261 1170042 1156014 1142414
58463A142414j1135q221o739o829p377p641p492o704n066l163k150k430l251l733
$$ 1142414 1131279 1123058 1116319 1109490 1102113 1094472 1086980 1080276 1075210 1072047 1069897 1067467 1064216 1060483
58449A060483l736l467k794j456L36J855K330J487n8j035o13O64J535J579J466
$$ 1060483 1056747 1053280 1050486 1049030 1049366 1051221 1053551 1055038 1054980 1053945 1053332 1053996 1055531 1057110 1058576
58434A058576J689K020K387L296M844O267P104P952R351J0806J1760J2764J4543
$$ 1058576 1060265 1062285 1064672 1067968 1072812 1079079 1086183 1094135 1103486 1114292 1126052 1138816 1153359
58421A153359J6557J7692J8003J8584J9802K0685K0069J7622J3893J0087P544
$$ 1153359 1169916 1187608 1205611 1224195 1243997 1264682 1284751 1302373 1316266 1326353 1333897
58410A333897O583N896L762j36m510p779r076q505p134o269n979m828j791K132
$$ 1333897 1340480 1346376 1350138 1350002 1345492 1337713 1328637 1320132 1312998 1306729 1300750 1295922 1294131 1296263
58396A296263N129O771P859Q731R064R009R126R224Q460O598M146J363j772m758
$$ 1296263 1301392 1308163 1316022 1324753 1333817 1342826 1351952 1361176 1369636 1376234 1380380 1381743 1379971 1375213
58382A375213o802p800q144p748o312m279k452r91J98N49k70r86J48K962N566
$$ 1375213 1368411 1360611 1352467 1344719 1338407 1334128 1331676 1330685 1330883 1331432 1331162 1330176 1330324 1333286 1338852
58367A338852O894P526Q163Q768R340J0047J0554J0415R963R400P588L565j186
$$ 1338852 1345746 1353272 1361435 1370203 1379543 1389590 1400144 1410559 1420522 1429922 1437510 1441075 1439889
58354A439889m163n278o472q067q226o470m764m332m045l131k718l226k790k36
$$ 1439889 1435726 1430448 1423976 1415909 1407683 1401213 1396449 1392117 1388072 1384941 1382223 1378997 1376207 1375971
58340A375971K509L063J988J589K795N036P793J0331J1150R707P814P494Q336
$$ 1375971 1378480 1381543 1383531 1385120 1387915 1392951 1400744 1411075 1422225 1431932 1439746 1447240 1455576
58327A455576Q509P532O425N840N730O197P137P652P050N974N475N685O443Q109
$$ 1455576 1464085 1471617 1478042 1483882 1489612 1495809 1502946 1510598 1517648 1523622 1529097 1534782 1541225 1549334
58313A549334J0611J2632J3054J2370J1616J1037J0796J1615J3423J4745J4931
$$ 1549334 1559945 1572577 1585631 1598001 1609617 1620654 1631450 1643065 1656488 1671233 1686164
58302A686164J5487J7554J9654J9905J8986J8669J8736J7965J7045J7661J9196
$$ 1686164 1701651 1719205 1738859 1758764 1777750 1796419 1815155 1833120 1850165 1867826 1887022
58291A887022J9169J6966J4684J4085J4841J5888J6610J6606J6026J6176J8078
$$ 1887022 1906191 1923157 1937841 1951926 1966767 1982655 1999265 2015871 2031897 2048073 2066151
58280B066151K0645K1954K1943K1972K2381K2681K3777K7085L1347L3184L1522
$$ 2066151 2086796 2108750 2130693 2152665 2175046 2197727 2221504 2248589 2279936 2313120 2344642
58269B344642K8992K7978K7662K6256K4036K2470K1817K1254K0418J9496J8506
$$ 2344642 2373634 2401612 2429274 2455530 2479566 2502036 2523853 2545107 2565525 2585021 2603527
58258B603527J7728J8204K0686K4300K7111K8114K8151K8818L0637L2530L3316
$$ 2603527 2621255 2639459 2660145 2684445 2711556 2739670 2767821 2796639 2827276 2859806 2893122
58247B893122L3441L4491L6888L9239M0376M0825M1458M2095M2569M3794M6191
$$ 2893122 2926563 2961054 2997942 3037181 3077557 3118382 3159840 3201935 3244504 3288298 3334489
58236C334489M8216M8290M7242M7088M8377N0623N4164N9144O3485O4767O3926
$$ 3334489 3382705 3430995 3478237 3525325 3573702 3624325 3678489 3737633 3801118 3865885 3929811
58225C929811O4377O7391P0876P3007P4450P6304P8218P9553Q0661Q2065Q3766
$$ 3929811 3994188 4061579 4132455 4205462 4279912 4356216 4434434 4513987 4594648 4676713 4760479
58214D760479Q5937Q9058R2983R7139J01738J07411J13637J19029J23265J27359
$$ 4760479 4846416 4935474 5028457 5125596 5227334 5334745 5448382 5567411 5690676 5818035
58204E818035J32019J37162J42860J49337J56283J63488J71566J80564J88817
$$ 5818035 5950054 6087216 6230076 6379413 6535696 6699184 6870750 7051314 7240131
58195G240131J95084K00946K08819K18591K28600K38909K50787K63852K76975
$$ 7240131 7435215 7636161 7844980 8063571 8292171 8531080 8781867 9045719 9322694
58186I322694K91323L09081L29614L50459L71808L96075M23092M49828M75426
$$ 9322694 9614017 9923098 10252712 10603171 10974979 11371054 11794146 12243974 12719400
58177A2719400N02490N32634N64624N97838O33782O73094P14695P58933Q07864
$$ 12719400 13221890 13754524 14319148 14916986 15550768 16223862 16938557 17697490 18505354
58168A8505354Q61158R15276R67825J019383J070475J120826J172645J230445
$$ 18505354 19366512 20281788 21249613 22268996 23339471 24460297 25632942 26863387
58160B6863387J296161J368387J447645J538350J644503J767477J908678K069616
$$ 26863387 28159548 29527935 30975580 32513930 34158433 35925910 37834588 39904204
58152C9904204K248960K445472K665456K921913L225017L578402L983488M437824
$$ 39904204 42153164 44598636 47264092 50186005 53411022 56989424 60972912 65410736
58144F5410736M927607N433367N950039O495977P100472P792342Q603533R569240
$$ 65410736 70338343 75771710 81721749 88217726 95318198 103110540 111714073 121283313
58136A21283313J0713224J2039098J3539724J5204566J7022334J9014100K1283642
$$ 121283313 131996537 144035635 157575359 172779925 189802259 208816359 230100001
58129B30100001K3969922K7014953K9869588L1427515L0373973K5823012J7871631
$$ 230100001 254069923 281084876 310954464 342381979 372755952 398578964 416450595
58122D16450595P712173k801662j1903611j8545553k2576742k4477577k4936730
$$ 416450595 424162768 421361106 409457495 390911942 368335200 343857623 318920893
58115C18920893k4552037k3725575k2674890k1488968k0200362j8840936j7451905
$$ 318920893 294368856 270643281 247968391 226479423 206279061 187438125 169986220
58108A69986220j6064966j4696386j3361209j2081200j0877001r760901q737724
$$ 169986220 153921254 139224868 125863659 113782459 102905458 93144557 84406833
58101H4406833p805293o954435o176527n472419m848466m304726l833088l425687
$$ 84406833 76601540 69647105 63470578 57998159 53149693 48844967 45011879 41586192
58093D1586192l077701k781820k527127k305040k111280j941533j790382j654975
$$ 41586192 38508491 35726671 33199544 30894504 28783224 26841691 25051309 23396334
58085B3396334j534604j426022j323809j225730j133273j046707r64228q86129
$$ 23396334 21861730 20435708 19111899 17886169 16752896 15706189 14741961 13855832
58077A3855832q14963p50998o92000o37958n91319n51825n15647m80516m47470
$$ 13855832 13040869 12289871 11597871 10959913 10368594 9816769 9301122 8820606 8373136
58068H373136m16796l86814l57739l32244l10622k89609k67603k47103k30244
$$ 8373136 7956340 7569526 7211787 6879543 6568921 6279312 6011709 5764606 5534362
58059E534362k15773k02262j90601j81053j71360j60122j49203j40515j33001
$$ 5534362 5318589 5116327 4925726 4744673 4573313 4413191 4263988 4123473 3990472
58050C990472j25001j17108j10549j05024j00081r6471r4247r1565q7353q3275
$$ 3990472 3865471 3748363 3637814 3532790 3432709 3336238 3241991 3150426 3063073 2979798
58040B979798q1162q0328p9222p7890p6926p5610p3025o9782o6895o4112o0797
$$ 2979798 2898636 2818308 2739086 2661196 2584270 2508660 2435635 2365853 2298958 2234846 2174049
58029B174049n7297n4073n0666m6780m3240m0686l8493l5989l3588l1742l0055
$$ 2174049 2116752 2062679 2012013 1965233 1921993 1881307 1842814 1806825 1773237 1741495 1711440
58018A711440k8372k7451k7652k8268k8812k9481k9690k8080k4963k2860k3229
$$ 1711440 1683068 1655617 1627965 1599697 1570885 1541404 1511714 1483634 1458671 1435811 1412582
58007A412582k4476k4541k3706k3206k2776k1446j9451j7623j5938j4272j3522
$$ 1412582 1388106 1363565 1339859 1316653 1293877 1272431 1252980 1235357 1219419 1205147 1191625
57996A191625j4326j5638j6082j5858j5926j6263j6241j5788j4879j3091j0936
$$ 1191625 1177299 1161661 1145579 1129721 1113795 1097532 1081291 1065503 1050624 1037533 1026597
57985A026597j0330j1978j3652j3004j1036j0483j1606j2072j0668q749p741p396
$$ 1026597 1016267 1004289 990637 977633 966597 956114 944508 932436 921768 913019 905278 897882
57973H97882p081p057p702q764r924j1145j1980j1591r932q215p597p947q280
$$ 897882 890801 883744 876042 867278 857354 846209 834229 822638 812706 804491 796894 788947 780667
57960G80667q050p652p768q469r016q636p315n549l576j527j10j27j120j623j139
$$ 780667 772617 764965 757197 748728 739712 731076 723761 718212 714636 713109 712999 712872 711752 710129 708990
57945G08990p71j351k141k180j885k177k880l028k300j176k20J09m67j411j436
$$ 708990 708219 706868 704727 702547 700662 698485 695605 692577 690277 689101 688881 688990 688523 687112 685676
57930F85676q1J443J728Q93R2K8O56J525J704K49k308l956l684k942l349m108
$$ 685676 685595 687038 688766 689659 689751 689779 690435 691960 693664 693913 691605 687649 683965 681023 677674 673566
57914F73566l380j326J27K23J16P02J466J707J420O88m59j283p68P08J333M7k094
$$ 673566 670186 668860 668987 669210 669326 670028 671494 673201 674621 675309 674850 673567 672799 673507 674840 674887 672793
57897F72793l317l126k305j660j505k054l466n303o353n576l370j450j047j485
$$ 672793 669476 666350 664045 662385 660880 658826 655360 650057 643704 638128 634758 633308 632261 630776
57883F30776j226NJ192J950L065M790O110O414O483O929P009O141N262N222N098
$$ 630776 629550 629555 630747 632697 635762 640552 646662 653076 659559 666488 673497 679638 684900 690122 695220
57868F95220L783K179J787K027J111q39j858j287p18j381k552l188l490m015m502
$$ 695220 699003 701182 702969 704996 706107 705268 703410 702123 701405 700024 697472 694284 690794 686779 682277
57853F82277m420l829l045k116r60M61K201L906M591L820K784L088M503N258M444
$$ 682277 677857 674028 670983 668867 667907 668368 670569 674475 679066 682886 685670 688758 693261 698519 702963
57838G02963K840J225o09k720m214m288l123j489k13j63j619l419l925l043k127
$$ 702963 705803 707028 706419 703699 699485 695197 692074 690585 690372 690209 688590 685171 681246 678203 676076
57823F76076j807j357n40m29j577k935l469l579l882l839k808j431p18m87j1N04
$$ 676076 674269 672912 672372 671943 670366 667431 663962 660383 656501 652662 649854 648423 647705 647218 647207 647711
57807F47711L62j67r2P76J716K369L147M271N376O167O786P287P343O733N827
$$ 647711 648073 647906 647814 648590 650306 652675 655822 660093 665469 671636 678422 685709 693052 699785 705612
57792G05612N326N606O332O653N983M571L191K246J503O71k22j107k073l117m113
$$ 705612 710938 716544 722876 729529 735512 740083 743274 745520 747023 747694 747472 746365 744292 741175 737062
57777G37062n121o210o840o073l795j300j38o31j744k263j806r34m64o98j334
$$ 737062 731941 725731 718891 712818 709023 707723 707585 706954 705210 702947 701141 700207 699743 699045 697711
57762F97711k077k901l451k939j320M1j17j109j247k98M41M20M66P78J35k006
$$ 697711 695634 692733 689282 686343 685023 685064 684947 683838 682591 682293 682734 683154 683620 684398 684533 682527
57746F82527m191m935m735m785m784l567j289O23J344J080O7j378j911n9L568
$$ 682527 678336 673401 668666 663881 659097 655530 654241 654864 656208 657288 657355 655977 654066 654007 657575
57731F57575O338O579N353M656M928N352N678O312O935O518N130M454N658P610
$$ 657575 663913 670492 675845 680501 685429 690781 696459 702771 709706 716224 721354 725808 731466 739076
57717G39076Q269P335O219N615M683L136K420L705N765O416N282L620J966k16
$$ 739076 747345 754680 760899 766514 771197 774333 776753 780458 786223 792639 797921 801541 803507 803291
57703H03291k642m026m178m523n758o601n857m345l556l507l290k913l120l851
$$ 803291 800649 796623 792445 787922 782164 775563 769706 765361 761805 758298 755008 752095 748975 745124
57689G45124m176l598k348o31J333K723K735J951K068L921O406P641O777M512
$$ 745124 740948 737350 735002 734371 735704 738427 741162 743113 745181 749102 755508 763149 769926 774438
57675G74438K382J761L098N668Q044Q980Q092O008L929K822K790L385M355N651
$$ 774438 776820 778581 781679 787347 795391 804371 812463 818471 822400 825222 828012 831397 835752 841403
57661H41403O686O438M700K656J617J560J470Q24J24L8N16Q24K20j323k892l386
$$ 841403 848089 854527 859227 861883 863500 865060 866530 867354 867478 867516 868032 868856 869076 867753 864861 861475
57645H61475k671j762j592j885j583j71J788L322L952L917L683L390K912K389
$$ 861475 858804 857042 855450 853565 851982 851811 853599 856921 860873 864790 868473 871863 874775 877164
57631H77164K287K722L158L190L220L773M615N280O021P308Q731R587J0288J1921
$$ 877164 879451 882173 885331 888521 891741 895514 900129 905409 911430 918738 927469 937056 947344 959265
57617I59265J4461J6878J9003K1675K4914K7814L0774L5828M3569N1481N6562
$$ 959265 973726 990604 1009607 1031282 1056196 1084010 1114784 1150612 1194181 1245662 1302224
57606A302224N8047N6011M8955L5322J6854j727j6669k7486l5467m1352m4710
$$ 1302224 1360271 1416282 1465237 1500559 1517413 1515686 1499017 1471531 1436064 1394712 1350002
57595A350002m4707m1244l5749l0521k6635k3080j8691j4134j0871q944p177n177
$$ 1350002 1305295 1264051 1228302 1197781 1171146 1148066 1129375 1115241 1104370 1095426 1088249 1083072
57583A083072l625k670j551j2J091J038K96KQ62K524L670L093J331O37K440N252
$$ 1083072 1079447 1076777 1075226 1075214 1076305 1077343 1077639 1077641 1078503 1081027 1084697 1087790 1089121 1089758 1092198 1097450
57567A097450O220M471J870O53J368L009M104L677K115J014J358K200K121J460
$$ 1097450 1103670 1108141 1110011 1110664 1112032 1115041 1119145 1122822 1124937 1125951 1127309 1129509 1131630 1133090
57553A133090J721L058L984L767L374L612L807L136K127J878K584L583M404N073
$$ 1133090 1134811 1137869 1141853 1145620 1148994 1152606 1156413 1159549 1161676 1163554 1166138 1169721 1174125 1179198
57539A179198N712O271O433N760M391L494M254O260P623P097N437M356M664N750
$$ 1179198 1184910 1191181 1197614 1203374 1207765 1211259 1215513 1221773 1229396 1236493 1241930 1246286 1250950 1256700
57525A256700O551O625O403O532O987P104O598O035N884N770N299M987N429O031
$$ 1256700 1263251 1269876 1276279 1282811 1289798 1296902 1303500 1309535 1315419 1321189 1326488 1331475 1336904 1342935
57511A342935N719M656M179N076O857Q642R758R659Q385P148P313Q708R848R911
$$ 1342935 1348654 1353310 1357489 1362565 1369422 1378064 1387822 1397481 1405866 1413014 1420327 1429035 1438883 1448794
57497A448794R442R122Q930Q644Q152P169N693M819N874Q511J0783J1368J0706
$$ 1448794 1458236 1467358 1476288 1484932 1493084 1500253 1505946 1510765 1516639 1525150 1535933 1547301 1558007
57484A558007R835R325R565J0745J2118J2545J2243J2611J3875J4317J2808J0666
$$ 1558007 1567842 1577167 1586732 1597477 1609595 1622140 1634383 1646994 1660869 1675186 1687994 1698660
57472A698660R827J0296J0734J0793J1272J2277J2707J1829J0398R747J0182J0659
$$ 1698660 1708487 1718783 1729517 1740310 1751582 1763859 1776566 1788395 1798793 1808540 1818722 1829381
57460A829381J0012Q325P026P295Q735R894J0009R579R419R896J1101J2976J4927
$$ 1829381 1839393 1847718 1854744 1862039 1870774 1880668 1890677 1900256 1909675 1919571 1930672 1943648 1958575
57447A958575J5981J5736J4854J4473J5318J7251J9293K0271J9907J9010J8235
$$ 1958575 1974556 1990292 2005146 2019619 2034937 2052188 2071481 2091752 2111659 2130669 2148904
57436B148904J7297J6011J5263J5824J6940J7460J7696J8554J9508J9394J8787
$$ 2148904 2166201 2182212 2197475 2213299 2230239 2247699 2265395 2283949 2303457 2322851 2341638
57425B341638J9259K0264J9434J6587J4801J6185J8850J9720J8516J7097J6292
$$ 2341638 2360897 2381161 2400595 2417182 2431983 2448168 2467018 2486738 2505254 2522351 2538643
57414B538643J5514J4752J4904J6281J8072J9308J9552J8984J8498J9117K0686
$$ 2538643 2554157 2568909 2583813 2600094 2618166 2637474 2657026 2676010 2694508 2713625 2734311
57403B734311K1762K1553K1156K2005K3808K5012K4800K3730K2771K2566K3317
$$ 2734311 2756073 2777626 2798782 2820787 2844595 2869607 2894407 2918137 2940908 2963474 2986791
57392B986791K4652K5781K6221K6149K5906K5653K5653K6169K6871K7144K7107
$$ 2986791 3011443 3037224 3063445 3089594 3115500 3141153 3166806 3192975 3219846 3246990 3274097
57381C274097K7472K8214K8455K7832K6954K6301K5896K6140K7477K8957K8796
$$ 3274097 3301569 3329783 3358238 3386070 3413024 3439325 3465221 3491361 3518838 3547795 3576591
57370C576591K6923K5386K5652K7118K8725L0100L0513K8995K6575K6065K8186
$$ 3576591 3603514 3628900 3654552 3681670 3710395 3740495 3771008 3800003 3826578 3852643 3880829
57359C880829L0122K9612K8168K8204K9151K9107K8501K9133L0718L1403L1003
$$ 3880829 3910951 3940563 3968731 3996935 4026086 4055193 4083694 4112827 4143545 4174948 4205951
57348D205951L1005L1758L2217L2241L2713L3545L3772L3554L3955L4837L5072
$$ 4205951 4236956 4268714 4300931 4333172 4365885 4399430 4433202 4466756 4500711 4535548 4570620
57337D570620L4746L5056L5973L6109L5020L3762L3104L3046L4010L6432L9058
$$ 4570620 4605366 4640422 4676395 4712504 4747524 4781286 4814390 4847436 4881446 4917878 4956936
57326D956936L9880L9079L8927M0266M1275M0536L9303L9476M0876M1807M1281
$$ 4956936 4996816 5035895 5074822 5115088 5156363 5196899 5236202 5275678 5316554 5358361 5399642
57315E399642L9727L8239L7790L8537L9485L9580L9194L9584M0867M1703M1239
$$ 5399642 5439369 5477608 5515398 5553935 5593420 5633000 5672194 5711778 5752645 5794348 5835587
57304E835587M0122L9268L8660L7918L7169L6893L7320L8105L8300L7082L5071
$$ 5835587 5875709 5914977 5953637 5991555 6028724 6065617 6102937 6141042 6179342 6216424 6251495
57293F251495L4128L4993L6012L5489L4198L3855L4098L3259L1440L0320L0139
$$ 6251495 6285623 6320616 6356628 6392117 6426315 6460170 6494268 6527527 6558967 6589287 6619426
57282F619426K9588K8761K9353L1418L2746L2511L2805L5107L7589L7879L6531
$$ 6619426 6649014 6677775 6707128 6738546 6771292 6803803 6836608 6871715 6909304 6947183 6983714
57271F983714L5627L5387L4409L2556L1460L2162L3755L4595L4042L2840L2113
$$ 6983714 7019341 7054728 7089137 7121693 7153153 7185315 7219070 7253665 7287707 7320547 7352660
57260G352660L2019L1604L0393K9654L0945L3658L5486L5410L4643L4303L3920
$$ 7352660 7384679 7416283 7446676 7476330 7507275 7540933 7576419 7611829 7646472 7680775 7714695
57249G714695L2943L2003L1681L1347L0376K9340K8868K8278K6441K3399K0311
$$ 7714695 7747638 7779641 7811322 7842669 7873045 7902385 7931253 7959531 7985972 8009371 8029682
57238H029682J8223J7415J7274J6573J4758J3047J3116J4536J4964J3258J0759
$$ 8029682 8047905 8065320 8082594 8099167 8113925 8126972 8140088 8154624 8169588 8182846 8193605
57227H193605Q904P451O016N557O821Q734R819J0234J1002J2235J3568J5505J8777
$$ 8193605 8202509 8209960 8215976 8221533 8228354 8237088 8246907 8257141 8268143 8280378 8293946 8309451 8328228
57214H328228K2849K6427K9153L1664L4216L6125L6378L4290K9983K4624J9523
$$ 8328228 8351077 8377504 8406657 8438321 8472537 8508662 8545040 8579330 8609313 8633937 8653460
57203H653460J4685R184L311j051k982m107o445r748j2202j2767j1545q565l617
$$ 8653460 8668145 8677329 8680640 8679589 8676607 8672500 8666055 8656307 8644105 8631338 8619793 8611228 8607611
57190H607611L079J1085K0175K9767L8612M6028N2659N9168O4888O8858P1389
$$ 8607611 8610690 8621775 8641950 8671717 8710329 8756357 8809016 8868184 8933072 9001930 9073319
57179I073319P3381P4646P4122P1357O6790O0913N4149M7204M0650L4385K8149
$$ 9073319 9146700 9221346 9295468 9366825 9433615 9494528 9548677 9595881 9636531 9670916 9699065
57168I699065K2047J6053R717L190k320n975q451j0735j2516j2972j2473j2207
$$ 9699065 9721112 9737165 9746882 9750072 9747752 9741777 9733326 9722591 9710075 9697103 9684630 9672423
57156I672423j2468j2437j1477r697p453n072k891r32J236L802O383Q717J1055
$$ 9672423 9659955 9647518 9636041 9626344 9618891 9613819 9610928 9609996 9611232 9615034 9621417 9630134 9641189
57143I641189J3408J5222J6446J7883J9824K1233K1130J9703J7072J2018L326
$$ 9641189 9654597 9669819 9686265 9704148 9723972 9745205 9766335 9786038 9803110 9815128 9818454
57132I818454q176k0039l0174l7578m2007m3993m4600m4079m1485l6647l1684
$$ 9818454 9810278 9790239 9760065 9722487 9680480 9636487 9591887 9547808 9506323 9469676 9437992
57121I437992k9270l0011l2670l6291m0825m6309n2882o1247p1699q2961r3338
$$ 9437992 9408722 9378711 9346041 9309750 9268925 9222616 9169734 9108487 9036788 8953827 8860489
57110H860489j02815j12615j22419j29369j30444j25300j16286j05867r4486q1265
$$ 8860489 8757674 8645059 8522640 8393271 8262827 8137527 8021241 7915374 7820888 7739623
57100G739623o6694n3683m5107m0874l8552l6420l4271l1753k8099k3827k0537
$$ 7739623 7672929 7619246 7574139 7533265 7494713 7458293 7424022 7392269 7364170 7340343 7319806
57089G319806j8280j5078r705l192L003Q232J1515J1634R385P450O977O671O097
$$ 7319806 7301526 7286448 7276743 7273551 7276554 7284786 7296301 7307935 7317320 7324770 7331747 7338418 7344515
57076G344515O815Q710Q552M526o55l771n490q119j1614j4955j9174k5575l2732
$$ 7344515 7351330 7360040 7368592 7373118 7372463 7368692 7363202 7355083 7343469 7328514 7309340 7283765 7251033
57063G251033l8431m3176m8957n6183o4435p4205q5100r4412j00418j04971j10011
$$ 7251033 7212602 7169426 7120469 7064286 6999851 6925646 6840546 6746134 6645716 6540745 6430734
57052F430734j14056j14958j12833j06321q9113n4622j652O7812J52386K48233
$$ 6430734 6316678 6201720 6088887 5982566 5893453 5838831 5837179 5904991 6057377 6305610
57042F305610L46873M42623N39492O46181P69384R17958J106338J343086J619209
$$ 6305610 6652483 7095106 7634598 8280779 9050163 9968121 11074459 12417545 14036754
57033A4036754J916314K223202K542258K896736L342873L940610M658489N306480
$$ 14036754 15953068 18176270 20718528 23615264 26958137 30898747 35557236 40863716
57025D0863716N621891N460671M879411M007659K891595J537166R5398j095414
$$ 40863716 46485607 51946278 56825689 60833348 63724943 65262109 65357507 64262093
57017F4262093j734009j823710j683682j685993j982002k455227k887862l149651
$$ 64262093 62528084 60704374 59020692 57334699 55352697 52897470 50009608 46859957
57009D6859957l255772l296181l340317l398462l438512l414686l286656l036144
$$ 46859957 43604185 40308004 36967687 33569225 30130713 26716027 23429371 20393227
57001B0393227k680194k265385j843247j450462j108173q28020o11666m50069
$$ 20393227 17713033 15447648 13604401 12153939 11045766 10217746 9606080 9156011
56993I156011l30636k44265j83617j39678j05440q0466o7311o5241p0627q0920
$$ 9156011 8825375 8581110 8397493 8257815 8152375 8071909 8004598 7939357 7868730 7787810
56983G787810r4152j06738j16027j23971j34460j47754j60520j70325j76932j80123
$$ 7787810 7693658 7586920 7470893 7346922 7212462 7064708 6904188 6733863 6556931 6376808
56973F376808j79547j76399j72412j67339j59562j48498j33978j14001q5913m9756
$$ 6376808 6197261 6020862 5848450 5681111 5521549 5373051 5239073 5125072 5039159 4989403
56963D989403q507L3901P1628R4456R0966N7412K941n5233j01995j31121j44987
$$ 4989403 4980896 5014797 5086425 5180881 5271847 5329259 5332200 5276967 5174972 5043851 4898864
56952D898864j49559j49104j44405j34924j21443j06012r0393p5878o4031n6197
$$ 4898864 4749305 4600201 4455796 4320872 4199429 4093417 4003024 3927146 3863115 3806918
56942C806918n2137n0183m8783m7375m6159m5876m7422n0815n4772n7963o0280
$$ 3806918 3754781 3704598 3655815 3608440 3562281 3516405 3468983 3418168 3363396 3305433 3245153
56931C245153o2257o3895o4970o5796o6663o7025o6367o5392o5198o5638o5691
$$ 3245153 3182896 3119001 3054031 2988235 2921572 2854547 2788180 2722788 2657590 2591952 2526261
56920B526261o5258o5387o6708o8560o9646o8982o6423o2984o0390n9543n9666
$$ 2526261 2461003 2395616 2328908 2260348 2190702 2121720 2055297 1992313 1931923 1872380 1812714
56909A812714n9414n8350n6773n4899n2968n1354m9592m6148m0243l3218k6960
$$ 1812714 1753300 1694950 1638177 1583278 1530310 1478956 1429364 1383216 1342973 1309755 1282795
56898A282795k1894j7788j5459j5880j8378k1640k5863l1652l7347m0026l9337
$$ 1282795 1260901 1243113 1227654 1211774 1193396 1171756 1145893 1114241 1076894 1036868 997531
56887I97531l7843l7160l6230l3995l1165k8069k3277j6252r446n489l556o54
$$ 997531 959688 922528 886298 852303 821138 793069 769792 753540 744094 738605 735049 734395
56875G34395M184R001J1816J2624J2549J2372J1954J0187N653j765j0177j7335
$$ 734395 738579 747580 759396 772020 784569 796941 808895 819082 824735 822970 812793 795458
56863G95458k2508k5970k7477k6636k4396k2620k2138k2324k2425k2100k0860
$$ 795458 772950 746980 719503 692867 668471 645851 623713 601389 578964 556864 536004
56852E36004j8375j5515j3784j3357j2845j1295r354q032p375o864o163m989l180
$$ 536004 517629 502114 488330 474973 462128 450833 441479 433447 426072 419208 413045 408056 404876
56839D04876j416r21j816k585j899j17J699L430N506P567Q749R086R632J1069
$$ 404876 403460 402539 400723 398138 396239 396122 397821 401251 406757 414324 423073 432159 441791 452860
56825D52860J2880J3894J3125J0348O446L035J171M18l22j302j763j064N93K539
$$ 452860 465740 479634 492759 503107 509553 512588 513759 514177 513855 512553 510790 509726 510319 512858
56811E12858M298N921P970J1003J4692J7983K0447K3013K6789L1573L6232L9986
$$ 512858 517156 523077 531047 542050 556742 574725 595172 618185 644974 676547 712779 752765
56799G52765M2434M2640L9282L1753K0536O930o740j7237k2268k2441k0393j7909
$$ 752765 795199 837839 877121 908874 929410 936340 929600 912363 890095 867654 847261 829352
56787H29352j4949j1325p644m144m2N110J0575J5761K1488K8823L7339M5395N1734
$$ 829352 814403 803078 795434 791290 791248 796358 806933 822694 844182 873005 910344 955739 1007473
56774A007473N5941N7626N5908M9714L8422K2578M315j3326k7829l7969m3630
$$ 1007473 1063414 1121040 1176948 1226662 1265084 1287662 1291977 1278651 1250822 1212853 1169223
56763A169223m5625m5553m4657m2643l8489l2511k6291k0457j4080o826j8N372
$$ 1169223 1123598 1078045 1033388 990745 952256 919745 893454 872997 858917 852091 852073 857445
56751H57445J0222J5555K0813K5110K8646L1165L0423K4398J4251K959q196j9444
$$ 857445 867667 883222 904035 929145 957791 988956 1019379 1043777 1058028 1060987 1052791 1033347
56739A033347k9495l5626l7277l7009l6984l6568l4342l0600k6526k2303j7514
$$ 1033347 1003852 968226 930949 893940 856956 820388 786046 755446 728920 706617 689103
56728F89103j2421p711l537J73L197N622Q213J1259J3447J2987R559M543o48n717
$$ 689103 676682 668971 665434 665607 668804 674426 682639 693898 707345 720332 729891 734434 733786 728069
56714G28069j1083j6731k1723k4876k6077k6528k7179k7228k5228k1609j8753
$$ 728069 716986 700255 678532 653656 627579 601051 573872 546644 521416 499807 481054
56703D81054j8056j8027j6233j2390q540o551o459p120p616p690p323o437n143
$$ 481054 462998 444971 428738 416348 407808 401257 394798 387678 380062 372372 365049 358612 353469
56690C53469m121m233n467o635o573n477m348l506k556j685j807l100m373m454
$$ 353469 349348 345115 339648 333013 326440 320963 316615 313109 310553 308868 307061 303961 299588 295134
56676B95134l494k441j918k001k483k847k576j828j322j198p11O61K319L208K793
$$ 295134 291640 289199 287281 285280 282797 279950 277374 275546 274224 273026 272315 272976 275295 278503 281296
56661B81296J142j153k860k765r73J074K252K671K721K376J993K534L911M274
$$ 281296 282438 281285 278425 275660 274687 275761 278013 280684 283405 285781 287774 290308 294219 298493
56647B98493K240q41k354j688o59p93j575j675p01O69J628J819J426R61Q55J185
$$ 298493 300733 299892 297538 295850 295191 294398 292823 291148 290447 291116 292744 294563 295989 296950 297805 298990
56631B98990J808K502K849K459J594J011Q52L37r54k134k113j066l5M61O65P86
$$ 298990 300798 303300 306149 308608 310202 311213 312065 312402 311448 309314 307201 306135 306100 306561 307226 308012
56615C08012P85P48O95L80k07n00k20nm47j033r99o98j031j932k593k821l016
$$ 308012 308797 309545 310240 310620 310413 309913 309693 309688 309241 308208 307209 306511 305480 303548 300955 298134 295118
56598B95118l161l130l634n406p442p687n733l450k545k720k647j622J73K056
$$ 295118 291957 288827 285193 279787 272345 264658 258925 255475 252930 250210 247563 245941 246114 248170
56584B48170L047K653J728J560K089K204J891K371L710M156K770J105R59J864
$$ 248170 251217 253870 255598 257158 259247 261451 263342 265713 269423 273579 276349 277454 278413 280277
56570B80277K153J425N20n2j40P27K573M095L962K549J099q0j190j477j71J531
$$ 280277 282430 283855 284375 284323 284183 284910 287483 291578 295540 298089 299188 299108 297918 296441 296270 297801
56554B97801J567N8p78m9N70k05j085k03K143M040M289K979P14j491k226r33J121
$$ 297801 299368 299426 298648 298599 299169 298964 297879 297676 299819 303859 308148 311127 311841 310350 308124 307191 308312
56537C08312K125J685Q29N18R16J691K213J906J201J519L329M881M189J877M30
$$ 308312 310437 312122 312951 313469 314385 316076 318289 320195 321396 322915 326244 331125 335314 337191 337621
56522C37621P78J374Q73Ln4N47J199K207L856N130M925M003M109N349O074N495
$$ 337621 338399 339773 340646 340649 340595 341142 342341 344548 348404 353534 358459 362462 366571 371920 377994 383489
56506C83489M888N598P166Q242Q400Q128P742P344P411Q309R321R105P391N442
$$ 383489 388377 393975 401141 409383 417783 425911 433653 440997 448408 456717 466038 475143 482534 487976
56492D87976M550M622M587L803K595J626J175R69N09l72j188j218m47J34l74j593
$$ 487976 492526 497148 501735 505538 508133 509759 510934 511903 512412 512040 510852 509634 509187 509321 508947 507354
56476E07354k310k171k118k830l495l024k010k204l998n632n525m275l486l439
$$ 507354 505044 502873 500755 497925 494430 491406 489396 487192 483194 477562 472037 467762 464276 460837
56462D60837l208k552k172k144j666p17n51j746l116l480l438m041m644l835k076
$$ 460837 457629 455077 452905 450761 449095 448378 447827 446081 442965 439485 436047 432006 427362 423527 421451
56447D21451j490k824m283m136l001k601l263l855l549k461r11Q25K042J939O56
$$ 421451 419961 417137 412854 408718 405717 403116 399853 395998 392449 389988 389077 389902 391944 393883 394539
56432C94539o90j256j236j263j498j539r12M39J927K696K544K229K391K351Q99
$$ 394539 393849 392593 391357 390094 388596 387057 386145 386584 388511 391207 393751 395980 398371 400722 401621
56417D01621j693l401k706l49J755K764L184L435L213K330J200J62r60k070k236
$$ 401621 399928 396527 393821 393472 395227 397991 401175 404610 407823 410153 411353 411515 410555 408485 406249
56402D06249p66J325J868m4k736l668k220p8J109J586K514L932M756M575M235
$$ 406249 405483 406808 408676 408632 405896 402228 400008 399930 401039 402625 405139 409071 413827 418402 422637
56387D22637M340M199K995J244K54N07J366K119K537K493J826O82n06j409j801
$$ 422637 426977 431176 434171 435415 435669 436176 437542 439661 442198 444691 446517 447199 446693 445284 443483
56372D43483j415l58N16M52j23j88L23N85M88R29K093K773K164J270J363J963
$$ 443483 442068 441710 442226 442678 442555 442367 442690 443275 443763 444692 446785 449558 451722 452992 454355 456318
56356D56318J721P82O21J607K329J768Q55R34J724J943J391J104J398J061q93
$$ 456318 458039 458821 459442 461049 463378 465146 466001 466935 468659 470602 471993 473097 474495 475556 474663
56341D74663l395m244k710m06N96l7r52q17M94K100K949K576J486P40Q57J311
$$ 474663 471268 467024 464314 463908 464504 464467 463515 462698 463192 465292 468241 470817 472303 473043 473900 475211
56325D75211J380J154J063Q82P9r88j342q75n17o61n97j2J25r16k073j609O14
$$ 475211 476591 477745 478808 479690 479769 478781 477439 476564 476047 475386 474789 474777 474902 473986 471913 470304 470918
56308D70918K918L691K693P79r47j588p73J150L216M267L704K362K168L929N634
$$ 470918 473836 477527 480220 480999 480052 478464 477691 478841 482057 486324 490028 492390 494558 498487 504121
56293E04121M480P40k074j612N99J897K137K833M164N079N444N849N707L854Q62
$$ 504121 508601 509341 507267 505655 506254 508151 510288 513121 517285 522364 527808 533657 539364 543218 544080
56278E44080j251j621r32N30K904M897M529K302J203K600M466M802M490N082N940
$$ 544080 542829 541208 540276 540806 543710 548607 553136 555438 556641 559241 563707 568509 572999 578081 584021
56263E84021N652M761M751N345M978L450K108J782K211L157M379M836L700K177
$$ 584021 589673 594434 599185 604530 609508 612958 615066 616848 619059 622216 626595 631431 635131 637308
56249F37308K463M638O327O046N277O249Q815J0720J0436Q685P285P280Q359R515
$$ 637308 639771 644409 650736 656782 662059 668308 677123 687843 698279 706964 714249 721529 729888 739403
56235G39403R991R672Q946Q370Q370Q946R613R979J0375J1484J3219J4540J4653
$$ 739403 749394 759066 768012 776382 784752 793698 803311 813290 823665 835149 848368 862908 877561
56222H77561J3903J3225J3293J4461J6735J9166K0115J9066J7650J7910J9899
$$ 877561 891464 904689 917982 932443 949178 968344 988459 1007525 1025175 1043085 1062984
56211A062984K2023K3413K4626K6127K7569K9075L1863L6550M1734M5400M7407
$$ 1062984 1085007 1108420 1133046 1159173 1186742 1215817 1247680 1284230 1325964 1371364 1418771
56200A418771M9482N2766N6524N9679O2690O6998P3084Q0046Q7116R4589J02758
$$ 1418771 1468253 1521019 1577543 1637222 1699912 1766910 1839994 1920040 2007156 2101745 2204503
56189B204503J10796J17497J22791J27603J32259J35835J37266J36444J33888
$$ 2204503 2315299 2432796 2555587 2683190 2815449 2951284 3088550 3224994 3358882
56180C358882J29723J23337J13830J00737Q4456O5987M6167K5436M478j5467l3643
$$ 3358882 3488605 3611942 3725772 3826509 3910965 3976952 4023119 4048555 4053033 4037566 4003923
56169D003923n0594o7110q2620r5493j04831j11055j14952j17223j18750j19974
$$ 4003923 3953329 3886219 3803599 3708106 3603275 3492220 3377268 3260045 3141295 3021321
56159C021321j19976j17505j13091j08686j04847r9977r3017q5370p9079p4487
$$ 3021321 2901345 2783840 2670749 2562063 2457216 2357239 2264222 2178852 2099773 2025286
56149B025286p0758o7459o4329o0540n5687n0755m6759m3140l8896l4608l1702
$$ 2025286 1954528 1887069 1822740 1762200 1706513 1655758 1608999 1565859 1526963 1492355 1460653
56138A460653l0104k8302k5553k2471j9439j6141j2979j1406j1940j2953j2308
$$ 1460653 1430549 1402247 1376694 1354223 1334784 1318643 1305664 1294258 1282318 1269365 1257057
56127A257057r643o298l517j543l21p5q05j556r26J468M436O350O553N405L663
$$ 1257057 1247414 1241116 1237599 1236056 1235735 1235660 1234855 1233299 1232373 1233841 1238277 1244627 1251180 1256585 1260248
56112A260248K500L404O740J0622J2650J2739J2833J3699J3985J3002J2379J3624
$$ 1260248 1262748 1266152 1272892 1283514 1296164 1308903 1321736 1335435 1349420 1362422 1374801 1388425
56100A388425J5764J7048J7773J9492K2289K4837K6772K9218L2847L6817L9825
$$ 1388425 1404189 1421237 1439010 1458502 1480791 1505628 1532400 1561618 1594465 1631282 1671107
56089A671107M1366M2041M3427M7253N3783O1388O8551P5737Q4227R3745J02708
$$ 1671107 1712473 1754514 1797941 1845194 1898977 1960365 2028916 2104653 2188880 2282625 2385333
56078B385333J10431J17573J24267J29147J30482J27483J20392J10214R8597Q7284
$$ 2385333 2495764 2613337 2737604 2866751 2997233 3124716 3245108 3355322 3453919 3541203
56068C541203P7488O9741O3773N8026N0215L9464K7333J5842N119n807j6666k6003
$$ 3541203 3618691 3688432 3752205 3810231 3860446 3899910 3927243 3943085 3948204 3942397 3925731 3899728
56056C899728l3588m1242n0869o2549p4863q6286r5953j03390j07909j08571j05243
$$ 3899728 3866140 3824898 3774029 3711480 3636617 3550331 3454378 3350988 3243079 3134508 3029265
56045C029265r9416r3025q6314p8137o8470n8969n0514m2129l3421k6078k1291
$$ 3029265 2929849 2836824 2750510 2672373 2603903 2544934 2494420 2452291 2418870 2392792 2371501
56034B371501j7503j2723p523l616p16K680O344Q664R423R917J0749J1683J3254
$$ 2371501 2353998 2341275 2333752 2330136 2329420 2332100 2338444 2347108 2356531 2366448 2377197 2388880 2402134
56021B402134J6220J9668K1788K2409K2922K3993K5282K6908K9166L1184L2041
$$ 2402134 2418354 2438022 2459810 2482219 2505141 2529134 2554416 2581324 2610490 2641674 2673715
56010B673715L2727L4783L7462L8729L8626L9025M0393M1554M2513M4473M6954
$$ 2673715 2706442 2741225 2778687 2817416 2856042 2895067 2935460 2977014 3019527 3064000 3110954
55999C110954M7955M7432M7657M9418N0814N0675N0449N1572N3466N5334N7590
$$ 3110954 3158909 3206341 3253998 3303416 3354230 3404905 3455354 3506926 3560392 3615726 3673316
55988C673316O0270O2146O2623O2761O3447O4433O5785O8234P1321P3384P4233
$$ 3673316 3733586 3795732 3858355 3921116 3984563 4048996 4114781 4183015 4254336 4327720 4401953
55977D401953P5666P8410Q0876Q1984Q3009Q5473Q9205R3761R9645J06819J13801
$$ 4401953 4477619 4556029 4636905 4718889 4801898 4887371 4976576 5070337 5169982 5276801 5390602
55966E390602J19551J24668J29698J34019J37513J41684J47954J56170J65613
$$ 5390602 5510153 5634821 5764519 5898538 6036051 6177735 6325689 6481859 6647472
55957F647472J76029J86958J97520K07549K17704K28293K39319K51505K65342
$$ 6647472 6823501 7010459 7207979 7415528 7633232 7861525 8100844 8352349 8617691
55948H617691K79628K93264L08120L27192L49954L72747L94031M16050M40671
$$ 8617691 8897319 9190583 9498703 9825895 10175849 10548596 10942627 11358677 11799348
55939A1799348M66924M93424N20238N47472N74989O04256O37516O74601P13665
$$ 11799348 12266272 12759696 13279934 13827406 14402395 15006651 15644167 16318768 17032433
55930A7032433P55276Q02093Q53802R06178R56112J004207J051936J100258J151755
$$ 17032433 17787709 18589802 19443604 20349782 21305894 22310101 23362037 24462295 25614050
55921B5614050J210137J276700J350886J434349J530456J640441J765149J909755
$$ 25614050 26824187 28100887 29451773 30886122 32416578 34057019 35822168 37731923
55913C7731923K080124K275002K489343K726055K996984L311743L673705M086441
$$ 37731923 39812047 42087049 44576392 47302447 50299431 53611174 57284879 61371320
55905F1371320M552571N064192N607047O179791O799849P487791Q259060R135490
$$ 61371320 65923891 70988083 76595130 82774921 89574770 97062561 105321621 114457111
55897A14457111J0149937J1332553J2707739J4311819J6194576J8392272K0918200
$$ 114457111 124607048 135939601 148647340 162959159 179153735 197546007 218464207
55890B18464207K3777930K6917594L0048465L2477126L3161757L1057995K5584951
$$ 218464207 242242137 269159731 299208196 331685322 364847079 395905074 421490025
55883D21490025J6967490O287712m811524j4684347k2232439k7134065k9666775
$$ 421490025 438457515 444745227 439933703 425249356 403016917 375882852 346216077
55876C46216077l0350821k9699240k8148310k6060328k3717286k1319083j9002853
$$ 346216077 315865256 286166016 258017706 231957378 208240092 186921009 167918156
55869A67918156j6858550j4930075j3224011j1731450j0439251r324489q354093
$$ 167918156 151059606 136129531 122905520 111174070 100734819 91410330 83056237
55862H3056237p496903o730366o035996n399022m815191m289141l822731l411115
$$ 83056237 75559334 68828968 62792972 57393950 52578759 48289618 44466887 41055772
55854D1055772l050616k741657k481242k259735k067974j901684j756872j627123
$$ 41055772 38005156 35263499 32782257 30522522 28454548 26552864 24795992 23168869
55846B3168869j508165j399901j301690j210164j123349j042222r66588q93946
$$ 23168869 21660704 20260803 18959113 17748949 16625600 15583378 14616790 13722844
55838A3722844q23929p59294p00974o46443n94413n46722n04006m63795m24676
$$ 13722844 12898915 12139621 11438647 10792204 10197791 9651069 9147063 8683268 8258592
55829H258592l88360l55756l24866k94301k65478k39560k15478j92498j71550
$$ 8258592 7870232 7514476 7189610 6895309 6629831 6390271 6174793 5982295 5810745
55820E810745j52658j34274j16830j03921r8359r9572j05857j16139j28364j39345
$$ 5810745 5658087 5523813 5406983 5303062 5204703 5105131 4999274 4883135 4754771 4615426
55810D615426j47737j54554j59676j60893j57702j52882j48627j43969j37667
$$ 4615426 4467689 4313135 4153459 3992566 3834864 3681982 3533355 3389386 3251719
55801C251719j30913j25138j19617j13283j07052j02425r9181r5947r1721q6043
$$ 3251719 3120806 2995668 2876051 2762768 2655716 2553291 2454110 2358163 2266442 2180399
55791B180399p9129p2484o7677o4122n9951n5188n1566m9028m5415m0400l6598
$$ 2180399 2101270 2028786 1961109 1896987 1837036 1781848 1730282 1681254 1635839 1595439 1558841
55780A558841l5398l4603l1835k7825k4532k2234k0350j9327j9916k1796k4090
$$ 1558841 1523443 1488840 1457005 1429180 1404648 1382414 1362064 1342737 1322821 1301025 1276935
55769A276935k5937k6168k4235k1922k1750k3301k3729k2521k2400k4399k5545
$$ 1276935 1250998 1224830 1200595 1178673 1156923 1133622 1109893 1087372 1064972 1040573 1015028
55758A015028k3535k0458j9260j9223j7881j5261j3220j2060j0707r027p612o185
$$ 1015028 991493 971035 951775 932552 914671 899410 886190 874130 863423 854396 846784 840599
55746H40599m385l065k854k547r38R46J469J112J471K599L448L983M558M039R47
$$ 840599 836214 833149 830295 827748 826810 827756 829225 830337 831808 834407 837855 841838 846396 850435 851382
55731H51382l938q064j0090j0711j0925j1103j1363j1417j0554r015q589j0371
$$ 851382 847444 839380 829290 818579 807654 796551 785188 773771 763217 754202 745613 735242
55719G35242j2755j3359j2190j1003j0255q751o011l001m11J986M149N293M814
$$ 735242 722487 709128 696938 685935 675680 666929 660918 657917 657506 659492 663641 668934 673748
55706F73748K662j049n767j0162j3123j4697j5215j4389j2443j1108j1695j3012
$$ 673748 676410 675361 669594 659432 646309 631612 616397 602008 589565 578457 566762 553750
55694E53750j3080j2152j1863j2010j0824q484p452q542r188p087l677k211l566
$$ 553750 540670 528518 516655 504645 493821 485337 477885 469343 460155 453068 449391 447180 443614
55681D43614n589o002m525k412j030j025k209l996n925p603q325p447n299l177
$$ 443614 438025 432023 427498 425086 424056 423031 420822 416826 410901 403298 394973 387526 382227 379050
55667C79050k151k365l565n552p681q619p466m928k774j984j903j386k75O99J227
$$ 379050 376899 374534 370969 365417 357736 349117 341651 336723 333949 331965 330062 328676 328401 329100 330327
55652C30327J866K956L825L664K686J613M14j324l079l776l642m213n932p175
$$ 330327 332193 335149 338974 342638 345324 346937 347351 346027 342948 339172 335530 331317 325385 318210
55638C18210o536m979m569n817p439q196p901o962n876m991m164k972j654j082
$$ 318210 311674 306695 302126 296309 288870 280674 272773 265811 259935 254944 250780 247808 246154 245072
55624B45072j211n52J795M494N630N340N284N890N770L937J271o07r56j73P43
$$ 245072 243861 243309 245104 249598 255228 260568 265852 271742 277512 281449 282720 282113 281157 280984 281727
55609B81727P56m98k235l241l019j880k90J264K088J826J072O81O75N77N77J369
$$ 281727 282483 281985 279750 276509 273490 271610 271320 272584 274672 276498 277570 278251 278926 279503 280080 281449
55593B81449K874M027L983K936J708J069J275J634Q44j519m061m922l930k621
$$ 281449 284323 288350 292333 295269 296977 298046 299321 300955 301799 300280 296219 291297 287367 284746
55579B84746k358l240m611n727o041n741n790o596p035n913l966l008l272l295
$$ 284746 282388 279148 274537 268810 262769 257028 251238 244642 237607 231694 227728 224720 221448 218153
55565B18153k463j801j779j243M61J858J198j150l408m634n025m670l512k249
$$ 218153 215690 213889 212110 210867 211328 213186 214384 213234 209826 205192 200167 195497 191985 189736
55551A89736j837k137k049j153k14j3m65j196k139l152l631l146k100j325j086
$$ 189736 187899 185762 183713 182560 182346 182333 181868 180672 178533 175381 171750 168604 166504 165179 164093
55536A64093r80p32o61j098j649j529o12K96M88K86N47J459K386K842L008L149
$$ 164093 163113 162381 161720 160622 158973 157444 156832 157128 157616 157902 158449 159908 162294 165136 168144 171293
55520A71293L055K525K018K241L171L942L938L654M162N813P785Q976R054Q406
$$ 171293 174348 176873 178891 181132 184303 188245 192183 195837 199999 205812 213597 222573 231627 240033
55506B40033P367N904M008J993K28j163k241l153m099n100n840o015n749n356
$$ 240033 247400 253304 257312 259305 259533 258370 256129 252976 248877 243777 237937 231922 226173 220817
55492B20817m848m185l857m450n696o702p083o935n786l060Q4J116o38k655k446
$$ 220817 215969 211784 207927 203477 197781 191079 183996 177061 171275 168215 168299 169415 168777 166122 163676
55477A63676p78j8m67n72mk2p37n59J025K255J706L28k74k11n35j235j399q02
$$ 163676 162898 162880 162413 161841 161837 161815 161078 160519 161544 163799 165505 165833 165559 165348 164813 163578 162179 161377
55459A61377j45m6o58j881l195l769l402k960l197l717l800l606l625l547k784
$$ 161377 161232 161186 160528 158647 155452 151683 148281 145321 142124 138407 134607 131001 127376 123829 121045
55444A21045j803j735k668l272k417m16J435K055J315J22k89M16J240J171N73
$$ 121045 119242 117507 114839 111567 109150 108734 110169 112224 113539 113661 113372 113788 115028 116199 116772
55429A16772N14R67P59n74j907j942p38O32J323J201O05J64M36J288J888J692
$$ 116772 117286 118253 119012 118438 116531 114589 113851 114483 115806 117007 117612 117776 118212 119500 121388 123080
55413A23080J066O42M77K66j0j83l43o64j014j229j520k024k166j276K38J051
$$ 123080 124146 124788 125265 125531 125521 125338 124995 124331 123317 122088 120568 118544 116378 115102 115340 116391
55397A16391N68l67p06n34o03j010j036l12N11N22k51p97l15P67J278P99J15m
$$ 116391 116959 116592 115886 115352 114749 113739 112703 112391 112902 113424 113173 112376 112061 112828 114106 114905 115020 115016
55379A15016J43o1k53L14J235J257L74J76J428K586J841k65j580j123K48J577
$$ 115016 115159 115098 114845 115159 116394 117651 118025 118201 119629 122215 124056 123791 122211 121088 121336 122913
55363A22913K747L596L460K069Q2j516j961p52J795M038M173K279K52n92p75j225
$$ 122913 125660 129256 132716 134785 134867 133351 131390 130638 132433 136471 140644 142923 143175 142583 141808 140583
55347A40583j727j516n62N78J538K053J657K11j590k743k668j401K73P80j021
$$ 140583 138856 137340 136778 137356 138894 140947 142604 142815 141225 138482 135814 134413 134686 135466 134445
55332A34445m114n840m916k899j867j802j427n58r2j74l5N08Q04P34J064K139
$$ 134445 130331 124491 119575 116676 114809 113007 111580 111022 110930 110756 110721 111229 112033 112767 113831 115970
55316A15970L154L025J475p77k299j815L75K082J335j256l170l021j848j278j586
$$ 115970 119124 122149 123624 122847 120548 118733 119108 121190 122525 121269 118099 115078 113230 111952 110366
55301A10366j972j866j301m41N54J388J649J080J3m48P13K961M192L013N49r71
$$ 110366 108394 106528 105227 104786 105340 106728 108377 109457 109470 109022 109735 112696 116888 119901 120450 119479
55285A19479r97q42j320j722j362p91q04j166j079l30O74J517J969J917J465Q98
$$ 119479 118482 117640 116320 114598 113236 112445 111641 110475 109396 109066 109740 111257 113226 115143 116608 117506
55269A17506L55j57m57l01J81O44J030J390J380O40l90p95l54L58R99J641J911
$$ 117506 117861 117704 117247 116946 117127 117771 118801 120191 121571 122211 121821 121026 120672 121030 122029 123670 125581
55252A25581J009j082l285m621m956m320k506J01K196K730J905O51l15n98j08
$$ 125581 126590 125508 122223 117602 112646 108326 105820 105921 108117 110847 112752 113403 113088 112490 112382
55237A12382N84O20P2R2J292K765L294K877K269J676P78l03r46r08o39p22j329
$$ 112382 112966 113586 113658 113750 115042 117807 121101 123978 126247 127923 128701 128398 127452 126544 125905 125183 123854
55220A23854k045k170j363j91M67N90J047K220L399L851L692L258K379R90k58
$$ 123854 121809 119639 118276 118085 118552 119142 120189 122409 125808 129659 133351 136609 138988 139978 139720
55205A39720p77r13j251j551j189k97L95O58Q92J292J468R26n48k726m746n395
$$ 139720 138943 138030 136779 135228 134039 133742 134137 134795 135687 136979 138447 139373 138825 136099 131353 125958
55189A25958m177j967j02R06J298J120J74j137j686o40J628L687M132K798J021
$$ 125958 121781 119814 119712 120618 121916 123036 123210 122073 120387 119747 121375 125062 129194 131992 133013
55174A33013K86N35L56q86k041j855q19k99m69k74P86K032K822L254L331K386
$$ 133013 133299 133834 134190 133304 131263 129408 128589 128290 127821 127547 128333 130365 133187 136441 139772 142158
55158A42158Q7k452l284j603J081K064J43k879l976k357l21k27j528j844k95J593
$$ 142158 142245 139793 136509 134906 135987 138051 138194 135315 131339 128982 128661 128434 126906 125062 124767 126360
55142A26360K174J477N03n3J37J225K725L441K660J056o7k39k8p8m30q27j139
$$ 126360 128534 130011 130514 130461 130598 131823 134548 137989 140649 141705 141638 141399 141371 141293 140863 140036 138897
55125A38897j298j065k69P62J232P33j23l38K20O46L87Q0N37J385J491N99l52
$$ 138897 137599 136534 136265 137027 138259 138992 138869 138531 138751 139397 139784 139864 140401 141786 143277 143876 143524
55108A43524n76l91n08r59j231j117q82o44r1J004K227K852K726K376K130J566
$$ 143524 142948 142557 142049 141090 139859 138742 137860 137216 137125 138129 140356 143208 145934 148310 150440 152006
55092A52006L40p93o98M46J091K75j216k134k381k598k820k491j511m10M03Q76
$$ 152006 152346 151553 150855 151301 152392 152667 151451 149317 146936 144338 141518 139027 137516 137106 137509 138385
55076A38385R22M82q2l07k60l63o97r26p27N2J335K485K511J307J04r8O1m79j201
$$ 138385 139307 139789 139707 139400 139140 138777 138080 137154 136427 136479 137814 140299 142810 144117 144221 144123 144184 143705 142504
55057A42504p33O46J046j68j281p63N24Q18K5m79k2P48J168J364J635J894J975
$$ 142504 141771 142417 143463 143295 142014 141251 141775 142593 142618 142139 142117 142865 144033 145397 147032 148926 150901
55040A50901J875J562Q94r6j071j592j314k10J172J797R56q15j967j395L97J842
$$ 150901 152776 154338 155232 155136 154065 152473 151159 150949 152121 153918 154874 154059 152092 150697 151094 152936
55024A52936K022J497J191R04k18j818k154m24J629J623m32k298k487j719j233
$$ 152936 154958 156455 157646 158550 158332 156514 154360 153936 155565 157188 156756 154458 151971 150252 149019
55009A49019j035m66N08J357J679J329M57j35N13K051K704J397p06j681j193m45
$$ 149019 147984 147518 148026 149383 151062 152391 152848 152713 153226 155277 157981 159378 158672 156991 155798 155353
54993A55353k97o15j070j454j280k50R02J035J50o68q91j029j278r70J25J063
$$ 155353 155056 154441 153371 151917 150637 150387 151289 152324 152474 151806 150915 149886 148608 147638 147763 148826
54977A48826J044N60M51N99M93L33N55P73L69k08RP81Q29j22p68j64Q89J134N96
$$ 148826 149870 150430 150881 151480 151973 152306 152861 153634 154003 153795 153804 154585 155414 155292 154524 154360 155249 156383 156979
54958A56979K25M63J012J476J456M80j184k113j235M91R87k98j715j570R4K079
$$ 156979 157204 157667 158679 160155 161611 162091 160907 158794 157559 158050 159037 158739 157024 155454 155548 157627
54942A57627L376L536K654J639J689K861L762L225J638P7j070j768j510k9J510
$$ 157627 161003 164539 167193 168832 170521 173382 177144 180369 182007 182084 181014 179246 177736 177707 179217
54927A79217J413m25k277k622j581k27O51P75K47l35j12J173K712L294K381N90
$$ 179217 180630 180205 177928 175306 173725 173498 174149 174924 175171 174836 174724 175897 178609 181903 184284 184874
54911A84874p26n52P25J518P75o89j202l08R37J627J854J842J329M25RM89Q57
$$ 184874 184148 183596 184321 185839 186614 185925 184723 184415 185352 186979 188833 190675 192004 192429 192438 192927 193784
54894A93784m3j723k491j597p8P18O98O80R64Q83j41j583k264j723n85N87K127
$$ 193784 193741 192018 189527 187930 187852 188570 189268 189948 190912 191795 191654 190071 187807 186084 185499 186086 188213
54877A88213M282N912N306K459m83j497p22L47R24J392K162L050L830M588N381
$$ 188213 192495 198407 203713 206172 205689 204192 203470 203817 204741 206133 208295 211345 215175 219763 225144
54862B25144O136P013Q276R483R469P766N676N184O571P809O672L031j344m829
$$ 225144 231280 238293 246569 256052 265521 273287 278963 284147 290718 298527 305199 308230 306886 302057
54848C02057p030q051p852o712n528m993m878m683m476m518m532m121l533l246
$$ 302057 295027 286976 279124 272412 266884 261891 257013 252330 247854 243336 238804 234683 231150 227904
54834B27904l133k857k646k677k174l68J790K476J641J238K398L939M455M334
$$ 227904 224771 221914 219268 216591 214417 214049 215839 218315 219956 221194 223592 227531 231986 236320
54820B36320M628N342O196P900J0863J3334J2785R105M914K559K091K239J961
$$ 236320 240948 246290 252486 260386 271249 284583 297368 306473 311387 313946 316037 318276 320237
54807C20237N85k188n638q167q873q507q310q457q221p235n966n088m877n175
$$ 320237 320822 318634 312996 304829 295956 287449 279139 270682 262461 255226 249260 244172 239295 234120
54793B34120n607n799n566m998m279l519k699j734o58J07Kr45j851j978j769k283
$$ 234120 228513 222714 217148 212150 207871 204352 201653 199919 199261 199368 199370 198425 196574 194596 192827 190544
54777A90544l523m016k627k65Q32k85j997j869L87K384J873m22j678n20J440K042
$$ 190544 187021 183005 180378 180113 180945 180660 178663 176794 177181 179565 181438 181016 179338 178818 180258 182300
54761A82300J342R43J392J793J626J423J362O47j090k769l045j924m75M97R31
$$ 182300 183642 184585 185977 187770 189396 190819 192181 192828 191738 188969 185924 184000 183525 184022 184953
54746A84953J064J215J595J899J379j40j612j792p06L65L15p60j797j688k87J192
$$ 184953 186017 187232 188827 190726 192105 191965 190353 188561 187855 188220 188535 187775 185978 184290 184003 185195
54730A85195J159m91j935j420O52K433L054L345M134M942M839L828K808K454K584
$$ 185195 186354 185863 183928 182508 183160 185593 188647 191992 196126 201068 205907 209735 212543 214997 217581
54715B17581K529K013J760K942N551P704P506N618M796O574R528J1410J1716J1199
$$ 217581 220110 222123 223883 226825 232376 240080 247586 253204 258000 264574 274102 285512 297228 308427
54701C08427R921P441M340J891K63j476l442m609m749n171o672q086p952o635
$$ 308427 318348 325789 330129 332020 332283 330807 327365 322756 318007 312836 306164 298078 290126 283491
54687B83491n545n035m387l423k723k313j541l85K34j46q27j110j227j623k032
$$ 283491 277946 272911 268524 265101 262378 260065 258524 258139 258373 258227 257400 256290 255063 253440 251408
54672B51408j984j614j252n97Q75K912M604N482N990O786Q041R378J0102R484
$$ 251408 249424 247810 246558 245961 246836 249748 254352 259834 265824 272610 280651 290029 300131 309615
54658C09615P295M311J913Q33M00p30l127n986p977q521q098p452o809o039n325
$$ 309615 316910 321221 323134 323967 324367 323637 320510 314524 306547 298026 289928 282476 275667 269628 264303
54643B64303n181n732o331o102m789k963j565j274j969k701k401r21P46J440Q78
$$ 264303 259122 253390 247059 240957 236168 233205 231640 230366 228397 225696 223295 222374 223120 224560 225438
54628B25438l58j534k105j660j76J560K305J449m05k103l007l298l421l493l233
$$ 225438 225080 223546 221441 219781 219605 221165 223470 224919 224514 222411 219404 216106 212685 209192 205959
54613B05959k362j147m68j065k565l552k987j397k02P4L32J449K941L626L195
$$ 205959 203597 202450 201982 200917 198352 194800 191813 190416 190214 190288 190620 192069 195010 198636 201831
54598B01831K381J626N04j225k715k914k024j347j644k218j912o73L72L75j71
$$ 201831 204212 205838 206342 205117 202402 199488 197464 196117 194473 192255 190343 189670 190042 190417 190246
54583A90246j16P88J585J524J136J386K266L014L425L821L802K402Nj380p58J18
$$ 190246 190130 190918 192503 194027 195163 196549 198815 201829 205254 209075 212877 215279 215284 213904 213146 213264
54567B13264q85l051l756k252n06q9j91L71Q66r4k044k941j837N5R09K24r51j171
$$ 213264 212379 209328 205572 203320 202814 202725 202534 202905 203771 203677 201633 198692 196855 196910 197819 198043 197092 195921
54549A95921R4J939K839K264J199Q51J263J691J835J924J834J095k7l80O55K109
$$ 195921 196015 197954 200793 203057 204256 205107 206370 208061 209896 211820 213654 214749 214722 214342 214997 217106
54533B17106K496J610N96K10j73j302k421j940K63K229K279J081M52O98O11j37
$$ 217106 219602 221212 221808 222018 221845 220543 218122 216182 216445 218674 220953 222034 222486 223184 223795 223658
54517B23658k64R08J995J379m79j809j920j530j075q2J505K576K076L42j219j549
$$ 223658 223394 224302 226297 227676 227197 225388 223468 221938 220863 220781 222286 224862 226938 227280 226061 224512
54501B24512p09M80J288J624J845K084J979J294M93L03P68J229J182Q14O25Q22
$$ 224512 223803 224283 225571 227195 229040 231124 233103 234397 234890 235193 235961 237190 238372 239186 239811 240633
54485B40633J202J362J171J071J775L239M274L731J961N13L02P41R14Q81J191
$$ 240633 241835 243197 244368 245439 247214 250453 254727 258458 260419 260932 261234 261975 262889 263770 264961
54470B64961J539Q11j293l360l596j906j5N81J90J20P88J449J522J299J125P22
$$ 264961 266500 267311 266018 262658 259062 257156 257141 257722 257912 258032 258820 260269 261791 263090 264215 264937
54454B64937j36r08r16m11l69j308k648l239k346l64J272J293n5j254j344r60
$$ 264937 264801 263893 262977 262566 262197 260889 258241 255002 252656 252292 253564 254857 254802 253548 252204 251244
54438B51244j023j159m09R35J438O50J5J000K954L767K511P48P46K710M452M073
$$ 251244 250221 249062 248653 249588 251026 251676 251691 252691 255645 259412 261923 262671 263417 266127 270579 274652
54422B74652K374J864L468N229M659J631j651l041k157j59J484K081K113K415
$$ 274652 277026 278890 282358 287587 292246 293877 292226 289185 287028 286869 288353 290434 292547 294962
54408B94962K892K556J122j94j76P62J311J091P91Q30R86J142J409J570J318R89
$$ 294962 297854 300410 301532 301338 301162 301924 303235 304326 305117 305947 306933 308075 309484 311054 312372 313361
54392C13361J127J336O10j079k556l019k909k896k865k436j766j356j451j860
$$ 313361 314488 315824 316434 315355 312799 309780 306871 303975 301110 298674 296908 295552 294101 292241
54378B92241k030j286L84J787J546k09j913k443k113j607q90K91J626K631L199
$$ 292241 290211 288925 289309 291096 292642 292433 290520 288077 285964 284357 283467 283758 285384 288015 291214
54363B91214L353K860J680L39n35p80n14J34Q45J131Q84N45M70M68J53o30j811
$$ 291214 294567 297427 299107 299446 298911 298131 297617 297751 298596 299727 300611 301156 301626 302094 302247 301617 299806
54346B99806l079l741l185j609J64J564K459K633K021J382J612K267J954M69p75
$$ 299806 296727 292986 289801 288192 288356 289920 292379 295012 297033 298415 300027 302294 304248 304717 303942
54331C03942r35q88j424j769j041K8L21K58Q89J774J516P4j081j113o14j44N32
$$ 303942 303007 302119 300695 298926 297885 297913 298234 298492 299381 301155 302671 302745 301664 300551 299937 299793 300325
54314C00325J399J709J100K88J31P29J759K934L717L448K290J429J721K615K939
$$ 300325 301724 303433 304533 304821 304952 305681 307440 310374 314091 317539 319829 321258 322979 325594 328533
54299C28533K330J396P36L95J80J4j12l32r15k064l676n252o164o084n165l889
$$ 328533 330863 332259 332995 333390 333570 333584 333472 333140 332225 330161 326485 321233 315069 308985 303820 299931
54283B99931k774k035j483q92n09q15j672k170j715q59n58q93j189j151j243j867
$$ 299931 297157 295122 293639 292747 292238 291423 289751 287581 285866 285007 284449 283556 282367 281216 279973 278106
54267B78106k699k949k055k11J398J334m92k251k050k10J259J406J281J771J925
$$ 278106 275407 272458 270403 270192 271590 272924 272432 270181 268131 267921 269180 270586 271867 273638 275563
54252B75563N49j511k159q95O23R30M10Q1n6n40j062p56K91Q59J29j351k449k521
$$ 275563 276112 274601 272442 271547 272170 273100 273510 273591 273535 272995 271933 271177 271468 272327 272456 271105 268656 266135
54234B66135j498K15J518J094j046l074l302k235j665k035j993o77R12J433R80
$$ 266135 264637 264852 266370 267464 266418 263344 260042 257807 256142 254107 252114 251437 252349 253782 254762
54219B54762N08K56k29q49q07K21J411J587M98q13r52L71J986K535J991J318Q25
$$ 254762 255270 255526 255297 254448 253641 253862 255273 256860 257358 256545 255593 255964 257950 260485 262476 263794 264619
54202B64619j52j666k371j089J575L909M861M432K952R21p15j129n01J85J58o54
$$ 264619 264467 262801 260430 259341 260916 264825 269686 274118 277070 277991 277276 276147 275646 275831 275989 275335
54186B75335j749k178j142R00K207J604j67j684k689l660m228l560j997o92K19
$$ 275335 273586 271408 270266 271166 273373 274977 274810 273126 270437 266777 262549 258989 256992 256300 256519
54171B56519J470K617K015m91k605k356n51O79O52K93L58R20J969L199L450J706
$$ 256519 257989 260606 262621 262130 259525 257169 256618 257297 257949 258242 258600 259520 261489 264688 268138 269844
54155B69844j262l399l676l016k679k591j779N8J983K612J283j382l851m751l707
$$ 269844 268582 265183 261507 258491 255812 253221 251442 251500 253483 256095 257378 255996 252145 247394 243687
54140B43687j328J388L459M242L850L138K755K356J277j12o16QL64p49k436k733
$$ 243687 242359 243747 247206 251448 255298 258436 261191 263547 264824 264712 264096 264104 264468 263719 261283 258550
54124B58550j340j85q91k587k989j108J792L706L612J884j73j135m79R09J630
$$ 258550 257210 257025 256134 253547 250558 249450 251242 254948 258560 260444 260271 259136 258657 259566 261196
54109B61196J212K93n23j119j196j48J811L294L143J723J72r76j737j889j211
$$ 261196 262408 262701 262178 261059 259863 259715 261526 264820 267963 269686 269858 268882 267145 265256 264045
54094B64045j64M68M37p2r17j613j089R38K763K270l40k693l229k606j854q24
$$ 264045 263881 264349 264786 264714 263797 262184 261095 262033 264796 267066 266726 264033 260804 258198 256344 255520
54078B55520O89J686J219J11K3J125J937J445K53n25o28l79J96J219K159J998
$$ 255520 256209 257895 259114 259225 259248 260373 262310 263755 264008 263483 262855 262476 262672 263891 266050 268048
54062B68048O25n53r7J577K626K214J450J467J676J055J76L88J463J824J115O80
$$ 268048 268673 268120 268023 269600 272226 274440 275890 277357 279033 280088 280264 280652 282115 283939 285054 285734
54046B85734J116J164j04j533j592n78R4m6m00n24j97R86K835L879K905Q70m1
$$ 285734 286850 288014 287910 286377 284785 284207 284301 284255 283855 283331 283134 284120 286955 290834 293739 294609 294568
54029B94568R38K781M572O240P276O549M098J763J028J181N55j079k357k212j011
$$ 294568 295506 298287 302859 309099 316375 322924 327022 328785 329813 330994 331549 330470 328113 325901 324890
54014C24890P5K53l04o21J26J568K266J372j97p90j6J008J345J353J756K397K515
$$ 324890 324965 325218 324914 324293 324419 325987 328253 329625 329428 328638 328622 329630 330975 332328 334084 336481 338996
53997C38996J858Q44r1o16j22J754M036M865L728K486L249N786Q062Q940R014
$$ 338996 340854 341698 341607 340991 340869 342623 346659 351524 355252 357738 360987 366773 374835 383775 392789
53982C92789Q897Q167O571M980M276M155L963M012N070P001Q820R793R750Q719
$$ 392789 401686 409853 416424 421404 425680 429835 433798 437810 442880 449881 458701 468494 478244 486963
53968D86963P135O083O246O811O372M850L501L009K752K194J845K209K652K184
$$ 486963 494098 500181 506427 513238 519610 524460 527961 530970 533722 535916 537761 539970 542622 544806
53954E44806Q32n09j300j884k890m526o353p567p660o996o478o563o951p252p441
$$ 544806 545638 545129 543829 541945 539055 534529 528176 520609 512949 505953 499475 492912 485961 478709 471268
53939D71268p454o957n977n197n147n489n567n265m716l738k333j359j731k941
$$ 471268 463814 456857 450880 445683 440536 435047 429480 424215 419499 415761 413428 412069 410338 407397
53925D07397l493k935k481l203m529n171m768l792k414n18J357K155J652Q34O56
$$ 407397 403904 400969 398488 395285 390756 385585 380817 377025 374611 374093 375450 377605 379257 380091 380747
53910C80747J061J516J914K359K493J757L22q01p27M96K116L540M799O211P662
$$ 380747 381808 383324 385238 387597 390090 391847 392169 391368 390641 391137 393253 396793 401592 407803 415465
53895D15465Q330P319M742K062J214L149P051J0822J2666J2602J2359J3373J4937
$$ 415465 423795 431114 435856 437918 439132 442281 449332 460154 472820 485422 497781 511154 526091
53882E26091J5002J2764R594P160N582M150K921K462K500K118J223P61J334K513
$$ 526091 541093 553857 563451 570611 576193 580343 583264 585726 588226 590344 591567 592328 593662 596175
53868E96175L568M039L603K372J501K341M612O479O864O571O555O364N385M584
$$ 596175 599743 603782 607385 609757 611258 613599 618211 624690 631554 638125 644680 651044 656429 661013
53854F61013N577Q346J1163J2596J2558J1540R994Q549P788P405O305M025J495
$$ 661013 666590 674936 686099 698695 711253 722793 732787 741336 749124 756529 762834 766859 768354
53841G68354P5R0N76K44j378l598n269n923o050o218o369o403o830q163r946j1159
$$ 768354 768429 768519 769095 769339 767961 764363 759094 753171 747121 740903 734534 728131 721301 713138 703192 692033
53825F92033j1588j2012j2997j4189j4889j4714j3595j1809j0125r298r148q773
$$ 692033 680445 668433 655436 641247 626358 611644 598049 586240 576115 566817 557669 548896
53813E48896p863p168p379q201q913r171q776p449n553m446n012o183o050m526
$$ 548896 541033 533865 526486 518285 509372 500201 491425 483976 478423 473977 468965 462782 456732 452206
53799D52206l602m560o069o029m461l218l181l273k576j886k251k999k626j144
$$ 452206 448604 444044 437975 431946 427485 424267 421086 417813 415237 413351 411100 408101 405475 404331
53785D04331q9l30j152j643j699j323l16O34p7k732n113m805k187L42J459J724
$$ 404331 404242 403912 402760 401117 399418 398095 397779 398413 398336 395604 390491 385686 383499 383841 385300 387024
53769C87024J587N59j253k439k087j165j093j663j459J93K538M424N232M906L909
$$ 387024 388611 389170 387917 385478 383391 382226 381133 379470 378011 378204 380742 385166 390398 395304 399213
53754C99213L172L404M203M362L352K176K335M021N829O310N575M943N289O268
$$ 399213 402385 405789 409992 414354 417706 419882 422217 426238 432067 438377 443952 448895 454184 460452
53740D60452P239Q147R106R675R357Q531Q102Q305Q506Q197P487O488N044L324
$$ 460452 467691 475838 484944 494619 503976 512507 520609 528914 537420 545617 553104 559592 564636 567960
53726E67960K039J634J682J430O07n82j831k790l241l453m033n025n720n801o086
$$ 567960 569999 571633 573315 574745 575352 574770 572939 570149 566908 563455 559422 554397 548677 542876 536790
53711E36790p351q772q640o788n284o084q589j0337r869q025o362n275m287l527
$$ 536790 529439 520667 512027 505239 499955 493871 485282 474945 465076 457051 450689 445414 441127 437600
53697D37600l750m919n810n488m475l832l641l060j683j13O97L65o49j348j024
$$ 437600 433850 428931 423121 417633 413158 409326 405685 402625 400942 400829 401526 401891 401242 399894 398870
53682C98870o2L86j47q67r58p19o76l26R85K424K441J072J3J63N26R9o65r09p97
$$ 398870 398808 399194 399047 398180 397222 396503 395827 395501 396486 398910 401351 402423 402436 402599 403125 403224 402559 401650 400853
53663D00853p71n12L23J080J005N82Q10J531J619Q13K74J129L140N024N641M808
$$ 400853 400082 399570 399893 400973 401978 402560 403370 404901 406520 407333 407607 408736 411876 416900 422541 427349
53647D27349L347K339K147K208J953J547J463J734K106K530K998L297L474M072
$$ 427349 430696 433035 435182 437390 439343 440890 442353 444087 446193 448723 451721 455018 458492 462564
53633D62564N238N998N270L396J795J261J338J347J226J174J201J241J241R66
$$ 462564 467802 473800 479070 482466 484261 485522 486860 488207 489433 490607 491808 493049 494290 495256
53619D95256K17p97j720k565l376l512k208Q7J796J979J228N31Q8j75J14J081
$$ 495256 495473 494676 492956 490391 487015 483503 481295 481382 483178 485157 486385 486916 487004 486829 486943 488024
53603D88024J808J331J88j66N17Q71lj177j402j073j492k589k813j529j33J2l15
$$ 488024 489832 491163 491351 491185 491702 492573 492570 491393 489991 488918 487426 484837 482024 480495 480362 480374 480059
53586D80059O43K949M812N004M042K826J384l65j623j481j18J480K593K992K607
$$ 480059 480702 483651 488463 493467 497509 500335 501719 501354 499731 498250 498132 499612 502205 505197 507804
53571E07804J713J064J093J266R03L24N70K128M526O876Q245P943O294M765M538
$$ 507804 509517 510581 511674 512940 513843 514167 514737 516865 521391 528267 536512 544455 550749 555514 560052
53556E60052N151N460N575O489P958Q258O610M584M299N943P892Q571P627N716
$$ 560052 565203 570663 576238 582727 590685 598943 605553 610137 614436 620379 628271 636842 644469 650185
53542F50185L923L033K849K474J604J099J711K735K740J388j33n60J42J017J236
$$ 650185 654108 657141 659990 662464 664068 665167 666878 669613 672353 673741 673608 673048 673190 674207 675443
53527F75443Q07M27O39J113Q57n48k162k538j409r7%j017j935k080k027k340k359
$$ 675443 676250 676677 677316 678429 679286 678738 676576 674038 672629 672532 672532 671515 669580 667500 665473 663133 660774
53510F60774j049J199K661K425J456J007Q73K87k89L61K166L611L795L397L281
$$ 660774 659725 660924 663585 666010 667466 668473 669346 669633 669344 669705 671871 675482 679277 682674 685955
53495F85955L314L079K761K626K466K186K249K843L422L676M130N025N445M622
$$ 685955 689269 692348 695109 697735 700201 702387 704636 707479 710901 714577 718707 723732 729177 733799
53481G33799L482L632N218O946P936Q430Q826R307J0380J2558J5244J7018J7415
$$ 733799 737281 740913 746131 753077 761013 769443 778269 787576 797956 810514 825758 842776 860191
53468H60191J7429J7998J8987J9968K0910K1549K1232K0251K0315K2592K5869
$$ 860191 877620 895618 914605 934573 955483 977032 998264 1018515 1038830 1061422 1087291
53457A087291K7901K8244K8587L0342L3107L5628L7303L8249L8741L9127L9825
$$ 1087291 1115192 1143436 1172023 1202365 1235472 1271100 1308403 1346652 1385393 1424520 1464345
53446A464345M0840M1542M1360M0431L9259L8084L6979L6229L6007L5861L5215
$$ 1464345 1505185 1546727 1588087 1628518 1667777 1705861 1742840 1779069 1815076 1850937 1886152
53435A886152L4322L4020L4394L4446L3498L2151L1233L0512K9384K8354K8448
$$ 1886152 1920474 1954494 1988888 2023334 2056832 2088983 2120216 2150728 2180112 2208466 2236914
53424B236914K9215K8789K6461K3867K2797K2884K2528K1252J9744J8128J5778
$$ 2236914 2266129 2294918 2321379 2345246 2368043 2390927 2413455 2434707 2454451 2472579 2488357
53413B488357J2716R700O817L407l33l308n567q773j3652j8367k0719k0905k0693
$$ 2488357 2501073 2510773 2517590 2520997 2520664 2517356 2511789 2503016 2489364 2470997 2450278 2429373 2408680
53400B408680k0875k1226k2165k4340k6830k7930k7957k9154l2116l4358l3657
$$ 2408680 2387805 2366579 2344414 2320074 2293244 2265314 2237357 2208203 2176087 2141729 2108072
53389B108072l1094k9164k8253k6909k4759k3073k2547k2460k2260k2198k1994
$$ 2108072 2076978 2047814 2019561 1992652 1967893 1944820 1922273 1899813 1877553 1855355 1833361
53378A833361k0444j7235j3807j1333q856m749O26N037P003P197P265Q303J0633
$$ 1833361 1812917 1795682 1781875 1770542 1761686 1756937 1757563 1762600 1769603 1776800 1784065 1792368 1803001
53365A803001J4039J7717K0610K2341K3513K4915K6842K9419L2857L6907M0544
$$ 1803001 1817040 1834757 1855367 1877708 1901221 1926136 1952978 1982397 2015254 2052161 2092705
53354B092705M3042M4972M7397N0192N2093N2589N2840N4234N6696N9136O1111
$$ 2092705 2135747 2180719 2228116 2278308 2330401 2382990 2435830 2490064 2546760 2605896 2667007
53343B667007O3245O6116O9540P3080P6581P9956Q2839Q4749Q5415Q4897Q3679
$$ 2667007 2730252 2796368 2865908 2938988 3015569 3095525 3178364 3263113 3348528 3433425 3517104
53332C517104Q2685Q2655Q3346Q3800Q3601Q3284Q3072Q1912P8554P3333O7987
$$ 3517104 3599789 3682444 3765790 3849590 3933191 4016475 4099547 4181459 4260013 4333346 4401333
53321D401333O3703O0094N6171N1530M6252M0286L3594K6574J9767J3226O570
$$ 4401333 4465036 4525130 4581301 4632831 4679083 4719369 4752963 4779537 4799304 4812530 4819100
53310D819100m22p574j4733k2141l0272l9385m9152n8653o6789p2826p6680p8796
$$ 4819100 4818678 4811104 4796371 4774230 4743958 4704573 4655421 4596768 4529979 4457153 4380473 4301677
53298D301677p9927q1007q2902q5906q9385r1970r2245q9547q4566p9399p6493
$$ 4301677 4221750 4140743 4057841 3971935 3882550 3790580 3698335 3608788 3524222 3444823 3368330
53287C368330p6793p8590p8777p5787p1274o8350o8078o8365o6586o2539n8032
$$ 3368330 3291537 3212947 3134170 3058383 2987109 2918759 2850681 2782316 2715730 2653191 2595159
53276B595159n4162n0356m6080m1914l8284l4525l0287k6885k5661k5675k4673
$$ 2595159 2540997 2490641 2444561 2402647 2364363 2329838 2299551 2272666 2247005 2221330 2196657
53265B196657k2173j9873j8845j8128j6728j5296j4687j4126j2199q993n914l805
$$ 2196657 2174484 2154611 2135766 2117638 2100910 2085614 2070927 2056801 2044602 2035609 2029695 2025890
53253B025890k378j203j26J173K989M985O651Q351J0958J4361J7171J8315J8292
$$ 2025890 2023512 2022309 2022183 2023356 2026345 2031330 2037981 2046332 2057290 2071651 2088822 2107137 2125429
53240B125429J8621K0449K3745K7387K9864L0557L0479L1268L3284L5186L5571
$$ 2125429 2144050 2164499 2188244 2215631 2245495 2276052 2306531 2337799 2371083 2406269 2441840
53229B441840L4523L3279L2781L2895L2728L1466K9076K6361K4084K1944J8838
$$ 2441840 2476363 2509642 2542423 2575318 2608046 2639512 2668588 2694949 2719033 2740977 2759815
53218B759815J4245R068M731J754n85l374p178j1776j6488k0670k4144k7213l0365
$$ 2759815 2774060 2783128 2787859 2789613 2789028 2785654 2778476 2766700 2750212 2729542 2705398 2678185 2647820
53205B647820l3887l7689m1257m3872m5185m5734m6633m8467n0578n1626n1013
$$ 2647820 2613933 2576244 2534987 2491115 2445930 2400196 2353563 2305096 2254518 2202892 2151879
53194B151879m9648m9122n0071n1530n2064n1226m9631m7890m6213m4930m4544
$$ 2151879 2102231 2053109 2003038 1951508 1899444 1848218 1798587 1750697 1704484 1659554 1615010
53183A615010m4841m4712m3387m1382l9689l8518l7386l5941l4104l1897k9823
$$ 1615010 1570169 1525457 1482070 1440688 1400999 1362481 1325095 1289154 1255050 1223153 1193330
53172A193330k8834k9003k8716k6362k2614j9754j8706j8022j6205j3920j3060
$$ 1193330 1164496 1135493 1106777 1080415 1057801 1038047 1019341 1001319 985114 971194 958134
53161I58134j4327j6506j7881j7890j7327j7185j7414j7117j6039j5174j5334
$$ 958134 943807 927301 909420 891530 874203 857018 839604 822487 806448 791274 775940
53150G75940j5792j5349j4275j3829j4132j3892j2520j1014j0359j0371j0661
$$ 775940 760148 744799 730524 716695 702563 688671 676151 665137 654778 644407 633746
53139F33746j1407j2348j2279j0592q483p552p814q065p614o752n954n511n611
$$ 633746 622339 609991 597712 587120 578637 571085 563271 555206 547592 540840 534886 529375 523764
53126E23764o114o550o793p266p972q106p224n951m764l026l36K013K242L46k077
$$ 523764 517650 511100 504307 497041 489069 480963 473739 467788 463024 459998 459662 461675 463917 464263 462186
53111D62186l825m675m490l278k060k189l547m624m534l895l497l266k859k257
$$ 462186 458361 453686 449196 445918 443858 441669 438122 433498 428964 425069 421572 418306 415447 413190
53097D13190j411k12P80N58r43k369k372q63J337L290M074L063P69j194j659j028
$$ 413190 411779 411567 412347 412905 411962 409593 407221 406358 407695 410985 415059 418122 418891 417697 416038 415010
53081D15010m68m48o48p85r22j074j080q37m97l94p30j175q94N45K401L398L162
$$ 415010 414542 414094 413446 412661 411739 410665 409585 408748 408251 407857 407127 405952 405058 405603 408004 411402 414564
53064D14564K423J851J400R86R57J490K121K323K083J633J112P88R76J337R63
$$ 414564 416987 418838 420238 421224 422181 423671 425792 428115 430198 431831 432943 433731 434707 436044 437007
53049D37007l94j724k015j534j299j754k600l385l618k738r25M54K36q08q20N35
$$ 437007 436613 434889 432874 431340 430041 428287 425687 422302 418684 415946 415021 415475 415711 414903 414083 414618
53033D14618J426L38j851l125k905k286k008j515l36P31O05m45j182j038n39q9
$$ 414618 416044 416382 414531 411406 408501 406215 404207 402692 402356 403087 403692 403247 402065 401027 400488 400399
53017D00399N05J098R41P3j29J098K166Q58k479n017m864l025j587j258j440j592
$$ 400399 400904 402002 402943 403016 402887 403985 406151 407009 404530 399513 394649 391624 390037 388779 387339 385747
53001C85747j494r10k5K33p33k095k424j436k70l7p39j504j463m49Q37J470J306
$$ 385747 384253 383343 383318 383551 382818 380723 378299 376863 376593 376556 375817 374313 372850 372401 373238 374708 376014
52984C76014R93P58m1j594k615j737M30J871J698R92Q76Q94L4j379j773l35J733
$$ 376014 377007 377765 377724 376130 373515 371778 372208 374079 375777 376769 377645 378539 378573 377194 375421 375086 376819
52967C76819K343Q79r15q29J115K538J706k51r12J89J194O98n45j105q65o90r35
$$ 376819 379162 380041 379126 378297 379412 381950 383656 383405 382493 382682 383876 384574 384029 382924 382059 381369 380434
52950C80434j242j345j220p60j9M50K89J95J198K965L761K468K9j630j659p39
$$ 380434 379192 377847 376627 375867 375848 376298 376587 376782 377980 380945 384706 387174 387203 385573 383914 383175
52934C83175J73P96J200J339J230J170J251R88K6r21m76J719M270N391M690L236
$$ 383175 383348 384144 385344 386683 387913 389083 390334 391322 391348 390427 389951 391670 395940 401331 406021 409257
52918D09257K162J700J461J067M58n2K5O68R62L3j591k216r85J017K076J638K58
$$ 409257 411419 413119 414580 415647 416105 416053 416078 416746 417708 417741 416150 413934 412949 413966 416042 417680 417938
52901D17938j482k929k846m77K679L628J249k102l288j950l74l36j452k437k655
$$ 417938 416456 413527 410681 410204 412883 416511 417760 415658 412370 410420 410046 409710 408258 405821 403166
52886D03166k144j185m33n76j346j668j284j276k308l226k587q28L73N70Q50J735
$$ 403166 401022 399837 399404 398828 397482 395814 394530 393254 390946 387720 385133 384305 384678 385248 386098 387833
52870C87833K282J708O08j51o41j188j344o64J30j52j481k566k503j660p85nR57
$$ 387833 390115 391823 392431 392280 391639 390451 389107 388443 388573 388421 386940 384374 381871 380211 379426 379421 380378
52853C80378J950K267J452K0q61o41m7k2k32M60J953K490R85j194j859p35N59
$$ 380378 382328 384595 386047 386067 385206 384565 384518 384496 384264 384724 386677 389167 390152 388958 387099 386364 386923
52836C86923R15O66K94l50j136j182k6J555K494K497J702J58j566k115p88J107
$$ 386923 387838 388504 388798 388448 387312 386130 386104 387659 390153 392650 394352 394510 392944 390829 390041 391148
52820C91148J426k75k284k852j854j48J716L428M257L547J851P80J305K648L229
$$ 391148 392574 392299 390015 387163 385309 385161 386877 390305 394562 398109 399960 400740 402045 404693 407922
52805D07922K440J070J81J26P19J746K774K899J351j452l994m994m481l434k712
$$ 407922 410362 411432 411613 411739 412458 414204 416978 419877 421228 419776 415782 410788 406307 402873 400161
52790D00161k608l071l799m172l651k521j836k177k732k245q06K0p55k093k211
$$ 400161 397553 394482 390683 386511 382860 380339 378503 376326 373594 371349 370543 370563 369808 367715 365504
52775C65504q69N35R48O91M38K29K0J91Q26J207P90Q9k38m51r01q49N22K337K827
$$ 365504 364635 365170 366118 366809 367247 367476 367496 367687 368513 369720 370510 370599 370361 369910 369009 368160 368682 371019 373846
52756C73846J861J065J206J148J33o22K54K055L023K735J993J025n03j941j897
$$ 373846 375707 376772 377978 379126 379259 378637 378891 380946 383969 386704 388697 389722 389219 387278 385381
52741C85381m17N56l77k294l393l357l174l248k843j520j25J79o08j402j491j386
$$ 385381 384964 385520 385143 382849 379456 376099 372925 369677 366834 365314 365189 365368 364760 363358 361867 360481
52725C60481j965l084l529k461m81J012J326R87R34J471K083K030J139R5j98L79
$$ 360481 358516 355432 351903 349442 348961 349973 351299 352286 353220 354691 356774 358804 359943 360038 359840 360219
52709C60219J043J134Q34N08j61j554k921k831r58J423L059L949M545M548L359
$$ 360219 361262 362396 363230 363738 363577 362023 359102 356271 355313 356736 359795 363744 368289 372837 376196
52694C76196J272o65j752j982j575r41p73j344j757q25J176K646K787K609L267
$$ 376196 377468 376803 375051 373069 371494 370553 369780 368436 366679 365854 367030 369676 372463 375072 378339
52679C78339M295M376L221J766P98L62L47P63J320J530J404J429J730J844J479
$$ 378339 382634 387010 390231 391997 392795 393157 393504 394267 395587 397117 398521 399950 401680 403524 405003
52664D05003R47N60J64n22j589l062m686n433m190j540N2j115l644m473k465M13
$$ 405003 405950 406510 406674 406152 404563 401501 396815 391382 387192 385652 385704 384589 380945 376472 374007 374420
52648C74420J590O07j081k031j938j205k02Q68J638J553N08n99m79J041K596K877
$$ 374420 376010 376617 375536 373505 371567 370362 370160 371028 372666 374219 374727 374128 373649 374690 377286 380163
52632C80163K137J443R46J8j074j050M62K128K625K191J721J257M03n19r21j070
$$ 380163 382300 383743 384689 384707 383633 382583 383045 385173 387798 389989 391710 392967 393370 392851 391930 390860
52616C90860j614k233j978q77n2l9k02j4K09L26R12K011K396J203m21n93P76K043
$$ 390860 389246 387013 385035 384158 384106 384067 383865 383851 384060 384386 385298 387309 389705 390908 390487 389894 390670 392713
52598C92713K253K146K473K768K497K337L214M656N158L993J825l14j818k355
$$ 392713 394966 397112 399585 402353 404850 407187 410401 415057 420215 424208 426033 425719 423901 421546
52584D21546j859r18m90r15j611j930j761j217l62M15M56k67q24m13O95J700K294
$$ 421546 419687 418769 418279 417364 415753 413823 412062 410845 410483 410898 411354 411087 410263 409850 410545 412245 414539
52567D14539K565K413J736Q57O1q74k057k739k244j208q97j358j467q00j52J7
$$ 414539 417104 419517 421253 422110 422171 421297 419240 416501 414257 413049 412152 410794 409327 408527 408375 408392
52551D08392K49N79j96k597m784m300j121K193L353K312M40j170k174k413j618
$$ 408392 408641 409220 409024 406427 401643 397343 396222 398415 401768 404080 404520 403350 401176 398763 397145
52536C97145K44K479L775L265J664P66J424K482K309R25j95j57M72Q03P76Q16
$$ 397145 397389 399868 403643 406908 408572 409338 410762 413244 415553 416478 416283 416126 416598 417401 418177 418993
52520D18993J061J368J632J737J502R43L55o1m63j050j717k161k179j756j107
$$ 418993 420054 421422 423054 424791 426293 427236 427591 427530 427067 426017 424300 422139 419960 418204 417097
52505D17097p05r47j628k010j635r15o19r58j405j366p53J39R97J560J513P20
$$ 417097 416392 415445 413817 411807 410172 409257 408638 407680 406275 404909 404156 404295 405292 406852 408365 409085
52489D09085l72r66q04n47q59j344j013K14J057L02j755l573l726j870J131L717
$$ 409085 408713 407747 406943 406396 405537 404193 403180 403394 404451 404753 402998 399425 395699 393829 394960 398677
52473C98677M667M008K787J812J099O11O82J251J481R65N34R68J545J108J16K03
$$ 398677 403344 407352 410139 411951 413050 413661 414343 415594 417075 418040 418574 419542 421087 422195 422311 422514
52457D22514J685K978K749J508N00J18N8K03O08J169J778K499L237L762M214M784
$$ 422514 424199 427177 429926 431434 431934 432052 432110 432313 432921 434090 435868 438367 441604 445366 449580 454364
52441D54364M742K812q36m004m813l833k989k995l133l019l123l450l080j561
$$ 454364 459106 461918 461082 457078 452265 448432 445443 442448 439315 436296 433173 429723 426643 425082
52427D25082J42P43K07l67j95L14K64m35p51K45K075L244L016K206J882K012K043
$$ 425082 425224 425967 426174 425807 425612 425926 426190 425755 425004 425249 427324 430568 433584 435790 437672 439684 441727
52410D41727K015K188J992P09q35p08J586M089M677L467K089J322N96m50j213
$$ 441727 443742 445930 447922 448631 447796 447088 448674 452763 457440 460907 462996 464318 464914 464464 463251
52395D63251j205r45j247k058k601k411j797j307j179j332j663k083k400k319
$$ 463251 462046 461101 459854 457796 455195 452784 450987 449680 448501 447169 445506 443423 441023 438704
52381D38704j715q51k52j87k96R3J129K052J835L08j622k807k759j753m36N11
$$ 438704 436989 436138 435886 435699 435403 435496 436625 438677 440512 440820 439198 436391 433632 431879 431443 431954
52365D31954P82P89J247K081K112N86j319j375J066M138N534M865L427K319J662
$$ 431954 432736 433525 434772 436853 438965 439551 438232 436857 437923 442061 447595 452460 455887 458206 459868
52350D59868J435J960L258M659N550O166O956P455O571M288K269K042K994L125
$$ 459868 461303 463263 466521 471180 476730 482896 489852 497307 503878 508166 510435 512477 515471 518596
52336E18596J705l4j075k073l640m499l115n53L99r71k410k094r47m56j02J287
$$ 518596 520301 520267 519192 517119 513479 508980 505865 505312 505711 504740 502330 500236 499289 498833 498731 500018
52320E00018K959L195K110J462J794J851J018M84J237K550L296L571M008M466
$$ 500018 502977 506172 508282 509744 511538 513389 514407 514891 516128 518678 521974 525545 529553 534019
52306E34019M459M199M167M064L226J800O54K09J25K08Q86K475M381N387M729
$$ 534019 538478 542677 546844 550908 554134 555934 556588 556797 556922 557130 558016 560491 564872 570259 574988
52291E74988K808Q71n5J82J223K824M683N951N808M608L636L524L662L586L898
$$ 574988 577796 578667 578612 578794 580017 582841 587524 593475 599283 603891 607527 611051 614713 618299 622197
52276F22197N075O256O459O322P333R503J1294J1949J2415J3475J4344J4115J3550
$$ 622197 627272 633528 639987 646309 653642 663145 674439 686388 698803 712278 726622 740737 754287
52263G54287J4156J5966J7568J8154J8443J9312K0536K1227K0996K0221J9517
$$ 754287 768443 784409 801977 820131 838574 857886 878422 899649 920645 940866 960383
52252I60383J9268J9443J9765K0255K1412K3386K5071K4846K2502J9627J7827
$$ 960383 979651 999094 1018859 1039114 1060526 1083912 1108983 1133829 1156331 1175958 1193785
52241A193785J7201J7042J7110J7453J7719J7596J7395J7147J5742J2312Q151
$$ 1193785 1210986 1228028 1245138 1262591 1280310 1297906 1315301 1332448 1348190 1360502 1368653
52230A368653N603N002M278K002q35k746l789m485m198k278P4R16J46o16o32p61
$$ 1368653 1374256 1379258 1383536 1385538 1384703 1381957 1378168 1373683 1369485 1367207 1367281 1368197 1368343 1367727 1367095 1366334
52214A366334j444j607k77J890L607M651N716P117Q430R261R691R940J0026R893
$$ 1366334 1364890 1363283 1363006 1364896 1368503 1373154 1378870 1385987 1394417 1403678 1413369 1423309 1433335 1443228
52200A443228R727R948J0719J1564J1814J1647J2199J4242J7020J8852J8642J6552
$$ 1443228 1452955 1462903 1473622 1485186 1497000 1508647 1520846 1535088 1552108 1570960 1589602 1606154
52188A606154J3583J0972R466Q577P020M517K412J697J231o07l233m573m308m393
$$ 1606154 1619737 1630709 1640175 1648752 1655772 1660289 1662701 1664398 1665629 1665022 1661789 1657216 1652908 1648515
52174A648515o049q103r021q920q646q306p829p790q550r496j0140j0928j1933
$$ 1648515 1642466 1634363 1625342 1616422 1607776 1599470 1591641 1583851 1575301 1565805 1555665 1544737 1532804
52161A532804j1880r854p056n317m523l071n60J574K162J673J225J261J544J792
$$ 1532804 1520924 1511070 1504014 1498697 1494174 1491103 1490543 1492117 1494279 1495952 1497177 1498438 1499982 1501774
52147A501774K045K629L668M520M303L257K720L104L125J993J137K157M126M846
$$ 1501774 1503819 1506448 1510116 1514636 1518939 1522196 1524916 1528020 1531145 1533138 1534275 1536432 1540558 1545404
52133A545404M174L906M613M973M438M187M647M285K109m00j366j166j472k644
$$ 1545404 1549578 1553484 1558097 1563070 1567508 1571695 1576342 1580627 1582736 1582336 1580970 1579804 1578332 1575688
52119A575688l591l755l816m673o614r168j1027j0668p973m761k956k650k764
$$ 1575688 1572097 1568342 1564526 1559853 1553239 1544071 1533044 1522376 1514403 1509642 1506686 1504036 1501272
52106A501272k910l477m275m428l518j882J17K162L437L208K095J653K379L128
$$ 1501272 1498362 1494885 1490610 1486182 1482664 1480782 1480899 1483061 1486498 1489706 1491801 1493454 1495833 1498961
52092A498961K911K271K238K760K990K628K137J943K230L307N191O840O696M500
$$ 1498961 1501872 1504143 1506381 1509141 1512131 1514759 1516896 1518839 1521069 1524376 1529567 1536407 1543103 1547603
52078A547603J947R63J740K980L672L926M241M903O205Q367J0805J2318J2686
$$ 1547603 1549550 1550513 1552253 1555233 1558905 1562831 1567072 1571975 1578180 1586547 1597352 1609670 1622356
52065A622356J3384J5787J9197K1727K2985K4533K7444L0508L1675L0570K8698
$$ 1622356 1635740 1651527 1670724 1692451 1715436 1739969 1767413 1797921 1829596 1860166 1888864
52054A888864K7538K7158K6767K6007K5301K5032K4676K3146K0113J6640J4094
$$ 1888864 1916402 1943560 1970327 1996334 2021635 2046667 2071343 2094489 2114602 2131242 2145336
52043B145336J2731J1845J0924R940Q725P138N843N811O626O377L841p6l804p093
$$ 2145336 2158067 2169912 2180836 2190776 2199501 2206639 2212482 2218293 2224919 2231296 2235137 2235061 2231257 2224164
52029B224164j0520j3725j5430j5297j4622j4863j5989j6729j6167j4842j4165
$$ 2224164 2213644 2199919 2184489 2169192 2154570 2139707 2123718 2106989 2090822 2075980 2061815
52018B061815j4663j5071j3666j0510p642o759p324p419n884k993K93L051M715
$$ 2061815 2047152 2032081 2018415 2007905 2000263 1993504 1986180 1978761 1972877 1969884 1970177 1973228 1977943
52005A977943N419N887O551P128P380P623Q014Q032P584P751R385J1442J1970
$$ 1977943 1983362 1989249 1995800 2002928 2010308 2017931 2025945 2033977 2041561 2049312 2058697 2070139 2082109
51992B082109J0425P955N692M037L333L590L470J105l520q238j1176j2441j2969
$$ 2082109 2092534 2100489 2106181 2110218 2113551 2117141 2120611 2121716 2118196 2109958 2098782 2086341 2073372
51979B073372j3107j3098j3688j5125j6387j6406j5456j4417j3451j2359j1774
$$ 2073372 2060265 2047167 2033479 2018354 2001967 1985561 1970105 1955688 1942237 1929878 1918104
51968A918104j2718j5192j8020k0004k0588j9698j7909j6508j6413j6929j6457
$$ 1918104 1905386 1890194 1872174 1852170 1831582 1811884 1793975 1777467 1761054 1744125 1727668
51957A727668j4533j2496j1838j2592j3598j3976j3912j4244j5467j7145j8450
$$ 1727668 1713135 1700639 1688801 1676209 1662611 1648635 1634723 1620479 1605012 1587867 1569417
51946A569417j9185j9955k1064k1852k1696k1146k1212k1813k2002k1710k2032
$$ 1569417 1550232 1530277 1509213 1487361 1465665 1444519 1423307 1401494 1379492 1357782 1335750
51935A335750k3401k4538k4003k2007j9937j8531j7474j6539j6154j6667j7660
$$ 1335750 1312349 1287811 1263808 1241801 1221864 1203333 1185859 1169320 1153166 1136499 1118839
51924A118839j8335j8353j8093j8193j8811j9212j8323j5898j3053j1262j0997
$$ 1118839 1100504 1082151 1064058 1045865 1027054 1007842 989519 973621 960568 949306 938309
51913I38309j1547j1988j1823j0833r029o829m774k890p25J798M082N600O405
$$ 938309 926762 914774 902951 892118 883089 876260 871486 868596 867871 869669 873751 879351 885756
51900H85756O612O087M979L972L415K765J547L06k99p58j924l261l250j604K85
$$ 885756 892368 898455 903434 907406 910821 913586 915133 915439 915140 914382 912458 909197 905947 904343 904628
51885I04628J396K259L563N025O529R100J3252J7286J8852J7948J6904J7348J8485
$$ 904628 906024 908283 911846 916871 923400 932500 945752 963038 981890 999838 1016742 1034090 1052575
51872A052575J8642J7357J5424J3679J2261J0663Q270N270L020K854M382N709
$$ 1052575 1071217 1088574 1103998 1117677 1129938 1140601 1148871 1154141 1157161 1160015 1164397 1170106
51860A170106N465L916J836q39m722j0019j6310k2818k8375l1703l2434l1520
$$ 1170106 1175571 1179487 1181323 1180484 1175762 1165743 1149433 1126615 1098240 1066537 1034103 1002583
51848A002583l0123k8349k5692k2387j9475j7477j5646j3061j0014p781o959o638
$$ 1002583 972460 944111 918419 896032 876557 859080 843434 830373 820359 812578 805619 798981
51836G98981n605m084l520m477n735n977n690o325q059r522r714q894p561n697
$$ 798981 793376 789292 785772 781295 775560 769583 763893 757568 749509 739987 730273 721379 713818 708121
51822G08121l541j817o98M74J783K251J703J917M460Q022R504P716M566K526K007
$$ 708121 704580 702763 702065 702539 704322 706573 708276 710193 714653 722675 732179 739895 744461 746987 748994
51807G48994J746P56o98j652j565j060j519l531n837o481m980k781j362o22L87
$$ 748994 750740 751496 750798 749146 747581 746521 745002 741471 735634 729153 724173 721392 720030 719408 719795
51792G19795J716K303J414l71j986l279m859o587p144n902m406m700o364o867
$$ 719795 721511 723814 725228 724857 722871 719592 714733 708146 701002 695100 690694 685994 679630 672763
51778F72763n232l612m149n791n884l994k131j658j817j471o24J66N55K34r13
$$ 672763 667531 663919 659770 653979 648095 644101 641970 640312 638495 637024 636400 636566 637121 637355 636442
51763F36442k126k396j952j888k202j722l54K95o20j658j205K03J038J186J643
$$ 636442 634316 631920 629968 628080 625878 624156 623802 624097 623477 621819 620614 620817 621855 623041 624684
51748F24684K578L266L474L510L189K121Q06J56L4m39j260j511r50l05J44Q64
$$ 624684 627262 630528 634002 637512 640701 642822 643628 643784 643818 643379 642119 640608 639658 639353 639497 640361
51732F40361J644J336l48k006k391j982j931k336k549k392j977j034M10J291P98
$$ 640361 642005 643341 642993 640987 638596 636614 634683 632347 629798 627406 625429 624395 624805 626096 626894
51717F26894l2N18K196K956K147J730L419O076P317O755O006O087O507O894P658
$$ 626894 626862 627380 629576 632532 634679 636409 639828 645904 653221 659976 665982 672069 678576 685470 693128
51702F93128Q625Q609P209N597M465K503j507n995p944o716m750m317n223o157
$$ 693128 701753 710362 717571 723168 727633 730136 728629 722634 714690 707974 703224 698907 693684 687527
51688F87527o594o501n540l827k440k111k161j755j316j377r96J027L804N185
$$ 687527 680933 674432 668892 665065 662625 660514 658353 656598 655282 653905 652909 653936 657740 662925
51674F62925M926N087O870Q824R075P753O109M475K635J290J457K684L431L280
$$ 662925 667851 672938 679808 688632 697707 705460 711569 716044 718679 719969 721426 724110 727541 730821
51660G30821L300L909L719J434j984m141l898k468j763k460l796m706m706m003
$$ 730821 734121 738030 741749 743183 741199 737058 733160 730692 728929 726469 722673 717967 713261 709258
51646G09258l227l057l703m501m294k558k00J065L04j656k975k557r98J54M4o79
$$ 709258 706031 702974 699271 694770 690476 687918 687718 688783 689087 687431 684456 681899 680901 681055 681099 680420
51630F80420p03L03J128J87k696n871p267o244l993k234j620j529j186n46L6N93
$$ 680420 679717 680020 681148 681335 678639 672768 665501 659257 655264 653030 651410 649881 648695 648149 648185 648778
51614F48778J430K478L323L893M556N374N926O174O909Q709J0920J2213J1887
$$ 648778 650208 652686 656009 659902 664458 669832 675758 681932 688841 697550 708470 720683 732570
51601G32570J0213P802N317L404K092M37k476o078q600q843p178m900l134k327
$$ 732570 742783 750585 755902 759306 761398 761835 759359 753281 744681 735838 728660 723760 720626 718299
51587G18299k047j476p51j505m886r241j1302j0029p655o331n419l414j035m84
$$ 718299 716252 714776 714025 712520 707634 698393 687091 677062 669407 663076 657657 654243 653208 652724
51573F52724k210m245m771l915k881k472k683k817j831N78L127M056L116J668
$$ 652724 650514 646269 641498 637583 634702 632230 629547 626730 624899 625477 628604 632660 635776 637444
51559F37444Q12L82j30o92j131j539j865j788j351r36n15K53R17L34j560l090
$$ 637444 638256 638638 638508 637816 636685 635146 633281 631493 630142 629206 628691 628944 629861 630195 628635 625545
51543F25545k800j314k03L17J468L791O161P153O730O214O820Q454R806R528P351
$$ 625545 622745 621431 621228 621545 623013 626804 632965 640118 646848 653062 659882 668336 678142 687670 695021
51528F95021M066P06j894l048k429n57J458K889L689L930L670L521M437O501Q679
$$ 695021 699087 699793 697899 694851 692422 691865 693323 696212 699901 703831 707501 711022 715459 721960 730639
51513G30639J0204J1373J2553J3315J3369J3492J4464J5684J5802J4474J2703
$$ 730639 740843 752216 764769 778084 791453 804945 819409 835093 850895 865369 878072
51502H78072J1790J2573J5132J8444K0992K2539K4460K7324K9133K7647K3670
$$ 878072 889862 902435 917567 936011 957003 979542 1004002 1031326 1060459 1088106 1111776
51491A111776K0107J7985J5434J0753M466k178q832j5300k0685k4312k6437k7407
$$ 1111776 1131883 1149868 1165302 1176055 1180521 1178343 1169511 1154211 1133526 1109214 1082777 1055370
51479A055370k7241k6583k6614k7261k6863k4664k2134k0664j9393j6859j3644
$$ 1055370 1028129 1001546 974932 947671 920808 896144 874010 853346 833953 817094 803450
51468H03450j1484j0485r203p063m893l116j190Q14J614K43k647n399o630n978
$$ 803450 791966 781481 772278 765215 760322 757206 756016 756830 758444 758687 756040 750641 744011 738033
51454G38033m371l566m569o525p863q247q484q774q408p188n902n134m616m013
$$ 738033 733662 730096 725527 719002 711139 702892 694408 685634 677226 670038 664136 659002 654386 650373
51440F50373l439l006k769l052l837m040k800j404k020m210m862k511L81J029
$$ 650373 646934 643928 641159 638107 634270 630230 627430 626026 624006 619796 614934 612423 612804 613833
51426F13833K63O34K022J892l92k318j893l68k07j824l520l793k547p26M59J78
$$ 613833 614096 614730 616752 618644 618252 615934 614041 613673 613466 611642 608122 604329 601782 601056 601515 601693
51410F01693j306k724l052k486j878j630j598j674j786j519m32J157K300K468
$$ 601693 600387 597663 594611 592125 590247 588617 587019 585345 583559 582040 581608 582765 585065 587533
51396E87533K043J560R99J86m87l23P20J823K194J832J355J488K815N482Q706
$$ 587533 589576 591136 592135 592321 591834 591511 592231 594054 596248 598080 599435 600923 603738 609220 617926
51381F17926J1001J1448J0618R676Q890P606N694M044L397L351K983J910L06j633
$$ 617926 628927 640375 650993 660669 669559 677165 682859 686903 690300 693651 696634 698544 698850 697217
51367F97217l694n379o208o074m980k854k04J500J060q18k032j569o97j201l006
$$ 697217 693523 688144 681936 675862 670882 668028 667824 669324 670384 669566 667534 665965 665268 664067 661061
51352F61061m283l672j641M50J795K332K123J361Q20J392K901M039L883K985K484
$$ 661061 656778 653106 651465 651915 653710 656042 658165 659526 660346 661738 664639 668678 672561 675546 678030
51337F78030K624K797K716K751L250M319O111Q469J0313J0456R310Q787J0029
$$ 678030 680654 683451 686167 688918 692168 696487 702598 711067 721380 731836 741146 749933 759962
51324G59962J2181J4055J6037J9410K4255K9112L2508L4140L4694L5174L6273
$$ 759962 772143 786198 802235 821645 845900 875012 907520 941660 976354 1011528 1047801
51313A047801L7721L8270L6803L3256K8294K2436J6022R473K855m382j2497k0520
$$ 1047801 1085522 1123792 1160595 1193851 1222145 1244581 1260603 1270076 1272931 1268549 1256052 1235532
51301A235532k7066l1831l5545l8650m0854m1823m1436l9462l5895l1662k8084
$$ 1235532 1208466 1176635 1141090 1102440 1061586 1019763 978327 938865 902970 871308 843224
51290H43224k5646k3952k2820k2306k1710j9799j6426j3056j1189j0955j1439
$$ 843224 817578 793626 770806 748500 726790 706991 690565 677509 666320 655365 643926
51279F43926j1613j0679q514o144m990n216n652n528n217m958m165k725j739j819
$$ 643926 632313 621634 613120 606976 601986 596770 591118 585590 580373 575415 571250 568525 566786 564967
51265E64967j777k75K003L155K587J409O54M45P10J389J857J346J73m98k80Mk18
$$ 564967 563190 562915 564918 568073 570660 572069 572723 573168 573878 575267 577124 578470 578643 578145 577865 577869 577651
51248E77651m34j21L02K09k76p45j273j970k258j607p86j247k908l576j481K046
$$ 577651 577217 577096 577398 577607 577331 576586 575313 573343 571085 569478 568692 567445 564537 560961 559480 561526
51232E61526L639J797j331k727k077j254j060l20J491K831K347J119J026K020
$$ 561526 565165 566962 565631 562904 560827 559573 558513 558193 559684 562515 564862 565981 567007 569027
51218E69027K714L043M210O023O396M248J332O6O48J364J077K15k91J1J092K500
$$ 569027 571741 574784 578994 585017 591413 595661 596993 597059 597707 599071 600148 600363 600072 600083 601175 603675
51202F03675L371L010J753Q03Q27J075L17j437k765k596j680j567k491l250l146
$$ 603675 607046 610056 611809 612612 613439 614514 614831 613394 610629 608033 606353 604786 602295 599045 595899
51187E95899k838k806k357j161m99j425k610j958M3P53p70k548k878k571k867
$$ 595899 593061 590255 587898 586737 586238 584813 582203 580245 580288 581041 580271 577723 574845 572274 569407
51172E69407l049j750O35K550L370L362K430O52n56K64K265L062K024J114J964
$$ 569407 566358 564608 565243 567793 571163 574525 576955 577607 577051 577315 579580 582642 584666 585780 587744
51157E87744L667M288L480K478K233K473K419J675M86m53m87M23J682K709L427
$$ 587744 591411 595699 599179 601657 603890 606363 608782 610457 610943 610490 610003 610426 612108 614817 618244
51142F18244L961M112L501K216J015O05P12L26q73j693q04J261K414J579j05j164
$$ 618244 622205 626317 629818 632034 633049 633654 634366 634692 633819 632126 631322 632583 634997 636576 636471 635307
51126F35307j672k329k649j609L49J517J162K14m20q35j114o46P71K040J848J61
$$ 635307 633635 631306 628657 627048 627397 628914 630076 630290 629870 629035 627921 627275 628046 630086 631934 632095
51110F32095j874l161l362k855k322k121j894j082J84J271J977K588L051K983
$$ 632095 630221 627060 623698 620843 618521 616400 614506 613424 613608 614879 616856 619444 622495 625478
51096F25478K593K626L128L243K620J973J771J383J83j422k731l694m359m221
$$ 625478 628071 630697 633825 637068 639688 641661 643432 644815 644998 643576 640845 637151 632792 628571
51082F28571l117j976j716j955j724r31j42N16J256J877K087K167K347K027P94
$$ 628571 625454 623478 621762 619807 618083 617152 617010 617526 618782 620659 622746 624913 627260 629287 630081
51067F30081k39N57L110N576O503N915M444K678J479J665K978M220M681M639M449
$$ 630081 629842 630399 633509 639085 645588 651503 655947 658625 660104 661769 664747 668967 673648 678287 682736
51052F82736M098L813M046M579M613L888K827J565l7j204o07J621L485L514K411
$$ 682736 686834 690647 694693 699272 703885 707773 710600 712165 712128 710924 710317 711938 715423 718937 721348
51037G21348J561J138P24O52J254J525O0k753m894n129m289l770l543k341M01
$$ 721348 722909 724047 724771 725423 726677 728202 728262 725509 720615 715486 711197 707427 703884 701543 701944
51022G01944L311M219K534Jj309j126l80P73K773M753M876L126J892K652L850
$$ 701944 705255 709474 712008 712009 710700 709574 709194 709967 712740 717493 722369 725495 727387 730039 733889
51007G33889L537K558L229N747Q110R104R532J0544J2429J4944J7365J8231J6687
$$ 733889 737426 739984 743213 748960 757070 766174 775706 786250 798679 813623 830988 849219 865906
50994H65906J4050J2527J2386J2052J1064J0889J2340J4022J4295J3234J1603
$$ 865906 879956 892483 904869 916921 927985 938874 951214 965236 979531 992765 1004368
50983A004368R318O102K604l12k562m282n145n216n551o837q172q303p414o632
$$ 1004368 1013686 1019788 1022392 1022080 1019518 1015236 1010091 1004875 999324 992487 984315 976012 968598 961966
50969I61966o425o593p220q253q571o912l678o90Q31J071O65J57L18J869M535
$$ 961966 955541 948948 941728 933475 924904 917992 914314 913624 914455 915526 916191 916348 916666 918535 923070
50954I23070P315R606J1255J1714J0570R017R190J1466J3634J3565J1593R492
$$ 923070 930385 939991 951246 962960 973530 982547 991737 1003203 1016837 1030402 1041995 1051487
50942A051487Q238P898Q693J0678J2734J3387J2582J1576J0991J0185Q692P136
$$ 1051487 1059725 1067623 1076316 1086994 1099728 1113115 1125697 1137273 1148264 1158449 1167141 1174277
50930A174277O207N648N065N034O414Q837J0818J1497J1716J3020J5909J9418
$$ 1174277 1180484 1186132 1191197 1196231 1202645 1211482 1222300 1233797 1245513 1258533 1274442 1293860
50918A293860K2256K4085K5440K6573K6853K5805K4406K4653K7477L1804L6052
$$ 1293860 1316116 1340201 1365641 1392214 1419067 1444872 1469278 1493931 1521408 1553212 1589264
50907A589264L9977M4247M8712N2277N4490N6181N8103N9903O1038O1923O3222
$$ 1589264 1629241 1673488 1722200 1774477 1828967 1885148 1943251 2003154 2064192 2126115 2189337
50896B189337O4444O4142O1479N6960N1740M6739M2289L7983L2925K6754K0465
$$ 2189337 2253781 2317923 2379402 2436362 2488102 2534841 2577130 2615113 2648038 2674792 2695257
50885B695257J5573J2497J0345Q276O338M796L394J761oj617l241n508r010j3764
$$ 2695257 2710830 2723327 2733672 2741948 2748286 2753082 2756476 2758237 2758231 2756614 2753373 2747865 2738855 2725091
50871B725091j8969k3299k6002k7723k9837l2921l6417l9663m2512m4945m6968
$$ 2725091 2706122 2682823 2656821 2629098 2599261 2566340 2529923 2490260 2447748 2402803 2355835
50860B355835m9025n1518n3644n3833n1940m9853m9091m8785m7087m3801m0333
$$ 2355835 2306810 2255292 2201648 2147815 2095875 2046022 1996931 1948146 1901059 1857258 1816925
50849A816925l7620l5329l2880l0102k7072k4241k2407k1604k0475j7965j5198
$$ 1816925 1779305 1743976 1711096 1680994 1653922 1629681 1607274 1585670 1565195 1547230 1532032
50838A532032j4194j4929j5365j4404j2969j1681r523n882k262l96J33Q46J824
$$ 1532032 1517838 1502909 1487544 1473140 1460171 1448490 1438967 1433085 1430823 1430427 1430560 1431406 1433230
50825A433230J972J369J435K695M038M660N370P258J0059J2698J4661J6019J6678
$$ 1433230 1435202 1436571 1438006 1440701 1444739 1449399 1454769 1462027 1472086 1484784 1499445 1515464 1532142
50812A532142J6780J7593K0708K5920L0741L2836L2521L2191L3628L6743M0797
$$ 1532142 1548922 1566515 1587223 1613143 1643884 1676720 1709241 1741432 1775060 1811803 1852600
50801A852600M5509N0412N4366N6939N9702O4706P1701P8277Q3021Q7280R3091
$$ 1852600 1898109 1948521 2002887 2059826 2119528 2184234 2255935 2334212 2417233 2504513 2597604
50790B597604J00503J07987J14678J20969J27148J32720J37277J41104J44495
$$ 2597604 2698107 2806094 2920772 3041741 3168889 3301609 3438886 3579990 3724485
50781C724485J46960J47525J45443J40529J33087J23706J12764J00019Q5011O8154
$$ 3724485 3871445 4018970 4164413 4304942 4438029 4561735 4674499 4774518 4859529 4927683
50771D927683N1125L5738K2438J0256j692j2868k1619k6737k8415k7793k5855
$$ 4927683 4978808 5014546 5036984 5047240 5045548 5032680 5011061 4984324 4955909 4928116 4902261
50760D902261k3046j9687j6414j4171j3969j6467k1531k8301l6061m4964n5405
$$ 4902261 4879215 4859528 4843114 4828943 4814974 4798507 4776976 4748675 4712614 4667650 4612245
50749D612245o6804p7630q6861r4741j01783j07660j11690j13911j14767j13982
$$ 4612245 4545441 4467811 4380950 4286209 4184426 4076766 3965076 3851165 3736398 3622416
50739C622416j10622j04509r6864q9121q1499p3180o3683n3576m3969l5661k8870
$$ 3622416 3511794 3407285 3310421 3221300 3139801 3066621 3002938 2949362 2905393 2869732 2840862
50728B840862k3294j8235j3017p870m116k819l211l316k407j895l171n543p381
$$ 2840862 2817568 2799333 2786316 2778446 2774330 2771511 2768300 2764984 2762577 2760682 2757511 2751968 2744587
50715B744587q529j0055j2066j3533j4506j6590k0608k5354k9564l3582l7882
$$ 2744587 2736058 2726003 2713937 2700404 2685898 2669308 2648700 2623346 2593782 2560200 2522318
50704B522318m1312m2533m2216m2077m2266m1415l8982l5781l2247k7974k3165
$$ 2522318 2481006 2438473 2396257 2354180 2311914 2270499 2231517 2195736 2163489 2135515 2112350
50693B112350j8988j5976j3412j0717q152n594j964L358R581J5602K1140K6204
$$ 2112350 2093362 2077386 2063974 2053257 2045105 2039511 2037547 2040905 2050486 2066088 2087228 2113432
50681B113432L0680L5111M0719M7478N3393N7035N9853O4309P0281P5148P7412
$$ 2113432 2144112 2179223 2219942 2267420 2320813 2377848 2437701 2502010 2572291 2647439 2724851
50670B724851P8382P9830Q1530Q2029Q0842P8767P6582P4315P1672O8426O4193
$$ 2724851 2803233 2883063 2964593 3046622 3127464 3206231 3282813 3357128 3428800 3497226 3561419
50659C561419N8324N0388M0769L0500K0256R693j769j3433k3241k9610l2862l4185
$$ 3561419 3619743 3670131 3710900 3741400 3761656 3771349 3769580 3756147 3732906 3703296 3670434 3636249
50647C636249l3755l0885k5839k0268j5520j1466p407l383n1K061K591J171k171
$$ 3636249 3602494 3571609 3545770 3525502 3509982 3498516 3491109 3487726 3487675 3489736 3492327 3493498 3491327
50634C491327o801j2227j8445k4967l0285l3329l5023l7052l9120l8926l5233
$$ 3491327 3484526 3472299 3453854 3428887 3398602 3365273 3330250 3293198 3254078 3215152 3179919
50623C179919k9619k4351j9665j4285p830j214N114J1762J8936K5658L1202L6467
$$ 3179919 3150300 3125949 3106284 3091999 3084169 3082955 3088069 3099831 3118767 3144425 3175627 3212094
50611C212094M2918N0479N7332O1830O4033O5184O6090O6325O5028O2062N8164
$$ 3212094 3255012 3305491 3362823 3424653 3488686 3553870 3619960 3686285 3751313 3813375 3871539
50600C871539N3986M9641M5494M2695M1963M2067M0712L7161L2926K9454K6451
$$ 3871539 3925525 3975166 4020660 4063355 4105318 4147385 4188097 4225258 4258184 4287638 4314089
50589D314089K3242K0594J9718K0220K0657K0866K2088K4743K7654K9879L1865
$$ 4314089 4337331 4357925 4377643 4397863 4418520 4439386 4461474 4486217 4513871 4543750 4575615
50578D575615L4144L6197L7388L8004L8283L7292L3935K8660K3082J8254J4100
$$ 4575615 4609759 4645956 4683344 4721348 4759631 4796923 4830858 4859518 4882600 4900854 4914954
50567D914954J0271O673L161n70m874j0382j7943k7557l7656m6124n1947n5106
$$ 4914954 4925225 4931898 4935059 4934489 4929615 4919233 4901290 4873733 4836077 4789953 4738006 4682900
50555D682900n5253n1654m4612l6039k8179k2182j7981j4972j2681j1351j2069
$$ 4682900 4627647 4575993 4531381 4495342 4467163 4444981 4427000 4412028 4399347 4387996 4375927
50544D375927j5834k2509l1120m0944n1562o2038p1183p8810q5633r1683r5809
$$ 4375927 4360093 4337584 4306464 4265520 4213958 4151920 4080737 4001927 3916294 3824611 3728802
50533C728802r7233r6506r4335r0669q5852q1478p8564p5634p0375o3081n6762
$$ 3728802 3631569 3535063 3440728 3350059 3264207 3182729 3104165 3028531 2958156 2895075 2838313
50522B838313n3475n1833m8870m3333l6384k9725k3934j8457j2642o596j140L164
$$ 2838313 2784838 2733005 2684135 2640802 2604418 2574693 2550759 2532302 2519660 2513064 2511924 2515088
50510B515088O845J0928J5607K0068K3750K7004L0165L2680L4003L4915L7139
$$ 2515088 2521933 2532861 2548468 2568536 2592286 2619290 2649455 2682135 2716138 2751053 2788192
50499B788192M1503M7154N2688N7691O2839O8637P4412P8753Q1050Q2252Q3750
$$ 2788192 2829695 2876849 2929537 2987228 3050067 3118704 3193116 3271869 3352919 3435171 3518921
50488C518921Q5588Q6502Q5830Q4730Q4912Q6709Q9052R1141R3423R7002J02576
$$ 3518921 3604509 3691011 3776841 3861571 3946483 4033192 4122244 4213385 4306808 4403810 4506386
50477D506386J09836J17379J23415J27287J30290J34354J39883J45580J50335
$$ 4506386 4616222 4733601 4857016 4984303 5114593 5248947 5388830 5534410 5684745
50468E684745J54315J58013J61190J63356J64517J64667J63219J59682J54446
$$ 5684745 5839060 5997073 6158263 6321619 6486136 6650803 6814022 6973704 7128150
50459G128150J48090J40112J29136J14264R5659P4052N0383K5799J158k3591m8848
$$ 7128150 7276240 7416352 7545488 7659752 7755411 7829463 7879846 7905645 7906803 7883212 7834364
50448G834364p4047r7553j17976j34957j48282j56972j59920j57187j50096j40039
$$ 7834364 7760317 7662764 7544788 7409831 7261549 7104577 6944657 6787470 6637374 6497335
50438F497335j27563j12723r5950p8164o0133m2210k5092j0419J1N540O297J616
$$ 6497335 6369772 6257049 6161099 6082935 6022802 5980592 5955500 5945081 5945092 5950632 5956929 5958545
50426E958545r858k7800m9204p0960r2544j14638j35875j53040j64552j71797
$$ 5958545 5948687 5920887 5871683 5800723 5708179 5593541 5457666 5304626 5140074 4968277
50416D968277j76459j78406j77108j73377j68313j61708j53014j43110j33628
$$ 4968277 4791818 4613412 4436304 4262927 4094614 3932906 3779892 3636782 3503154
50407C503154j24994j16448j07598r8724q9815q0621p1619o3813n7398n1600m5791
$$ 3503154 3378160 3261712 3154114 3055390 2965575 2884954 2813335 2749522 2692124 2640524 2594733
50396B594733m0017l4453k9144k4242j9734j5068r922n065j403J632N492J0361
$$ 2594733 2554716 2520263 2491119 2466877 2447143 2432075 2422153 2417088 2415685 2417317 2422809 2433170
50384B433170J4918J8455K1790K5598K9245L1911L3562L3999L2330K8672K5229
$$ 2433170 2448088 2466543 2488333 2513931 2543176 2575087 2608649 2642648 2674978 2703650 2728879
50373B728879K4117K4707K4688K3450K2759K4009K6446K8638L0451L2585L5079
$$ 2728879 2752996 2777703 2802391 2825841 2848600 2872609 2899055 2927693 2958144 2990729 3025808
50362C025808L7330L9266M1622M4999M9301N4125N9173O4107O8485P2231P5846
$$ 3025808 3063138 3102404 3144026 3189025 3238326 3292451 3351624 3415731 3484216 3556447 3632293
50351C632293P9805Q3828Q7194Q9602R1156R1436Q9422Q4876P9239P4232O9663
$$ 3632293 3712098 3795926 3883120 3972722 4063878 4155314 4244736 4329612 4408851 4483083 4552746
50340D552746O3428N3860M1470K8062J4599M04j5599l3081m9967o4132p5439q5461
$$ 4552746 4616174 4670034 4711504 4739566 4754165 4754569 4738970 4705889 4655922 4591790 4516351 4430890
50328D430890r4846j01776j04085j02260r8882r5197q9805q1244p0215n8448m6795
$$ 4430890 4336044 4234268 4130183 4027923 3929041 3833844 3744039 3662795 3592580 3534132 3487337
50317C487337l5711k6357j9574j4362r218m798l645o942j3095j9983k7440l6553
$$ 3487337 3451626 3425269 3405695 3391333 3382115 3377317 3373672 3366730 3353635 3333652 3306212 3269659
50305C269659m7394n8401o7739p4542p8862q1062q1474q0451p8544p6323p3957
$$ 3269659 3222265 3163864 3096125 3021583 2942721 2861659 2780185 2699734 2621190 2544867 2470910
50294B470910p1068o7325o2985n8581n4268n0011m6096m2791l9360l4283k6999
$$ 2470910 2399842 2332517 2269532 2210951 2156683 2106672 2060576 2017785 1978425 1944142 1917143
50283A917143j9067j3062j0472j0897j3030j5800j8518k0443k0966k0272j9378
$$ 1917143 1898076 1885014 1874542 1863645 1850615 1834815 1816297 1795854 1774888 1754616 1735238
50272A735238j8957j8301j6088j2224q244n502l694j775K73J625K233L101M765
$$ 1735238 1716281 1697980 1681892 1669668 1661424 1655922 1652228 1650453 1650726 1652351 1654584 1657685 1662450
50259A662450O500P483P952Q669R735J0538J0541R713Q351O963O168O345P358
$$ 1662450 1668950 1676433 1684385 1693054 1702789 1713327 1723868 1733581 1741932 1748895 1755063 1761408 1768766
50246A768766Q807J0397J1897J2946J3166J2483J1321J0457J0568J1671J2992
$$ 1768766 1777573 1787970 1799867 1812813 1825979 1838462 1849783 1860240 1870808 1882479 1895471
50235A895471J3678J3646J3524J3849J4715J6157J8263K0769K3025K4532K4984
$$ 1895471 1909149 1922795 1936319 1950168 1964883 1981040 1999303 2020072 2043097 2067629 2092613
50224B092613K3578J8969J0631rj0256j7894k2020k2743k0845j7592j4138j0761
$$ 2092613 2116191 2135160 2145791 2145782 2135526 2117632 2095612 2072869 2052024 2034432 2020294 2009533
50212B009533p034k874R17L296M027L963M366N860P993R911J1451J3309J5945
$$ 2009533 2002499 1999625 2000542 2003838 2007865 2011828 2016194 2022054 2030047 2039958 2051409 2064718 2080663
50199B080663J8781K1098K3353K6759L1478L6108L9523M2495M6631N1962N6441
$$ 2080663 2099444 2120542 2143895 2170654 2202132 2238240 2277763 2320258 2366889 2418851 2475292
50188B475292N7997N6374N2785M8461M4149M0413L7602L5413L3185L0744K8405
$$ 2475292 2533289 2589663 2642448 2690909 2735058 2775471 2813073 2848486 2881671 2912415 2940820
50177B940820K5912K1936J5080N225o541j8989l1346m3047n3388o1538o6765o8810
$$ 2940820 2966732 2988668 3003748 3008973 3002432 2983443 2952097 2909050 2855662 2794124 2727359 2658549
50165B658549o8366o6795o4911o2276n8300n3902n1112n0855n1851n2143n1147
$$ 2658549 2590183 2523388 2458477 2396201 2337901 2283999 2232887 2182032 2130181 2078038 2026891
50154B026891m9700m8614m7830m6678m4361m0461l5566l1284k8928k8116k7126
$$ 2026891 1977191 1928577 1880747 1834069 1789708 1749247 1713681 1682397 1653469 1625353 1598227
50143A598227k4705k1074j7234j3960j1808j1298j2342j3730j3945j2580j0559
$$ 1598227 1573522 1552448 1535214 1521254 1509446 1498148 1485806 1472076 1458131 1445551 1434992
50132A434992q919p874p120o510o066n787n818o375o975o182l016J389M439M674
$$ 1434992 1426073 1418199 1411079 1404569 1398503 1392716 1386898 1380523 1373548 1367366 1364350 1365739 1370178 1374852
50118A374852L053J463Q71J324K659M255M800L726K561L556O779R803J0693J0191
$$ 1374852 1377905 1379368 1380239 1381563 1384222 1388477 1393277 1397003 1399564 1403120 1409899 1419702 1430395 1440586
50104A440586J0302J1636J3083J3654J3681J4226J6038J8996K2158K4272K4704
$$ 1440586 1450888 1462524 1475607 1489261 1502942 1517168 1533206 1552202 1574360 1598632 1623336
50093A623336K4116K4050K5674K8794L2053L4211L5356L6713L9039M1658M3684
$$ 1623336 1647452 1671502 1697176 1725970 1758023 1792234 1827590 1864303 1903342 1945000 1988684
50082A988684M5755M9556N5490O1957O7427P2366P8306Q5686R3528J00770J06950
$$ 1988684 2034439 2083995 2139485 2201442 2268869 2341235 2419541 2505227 2598755 2699525 2806475
50071B806475J11712J14430J14547J11880J06791J00422R4447Q9846Q5981Q1312
$$ 2806475 2918187 3032617 3147164 3259044 3365835 3466257 3560704 3650550 3736531 3817843
50061C817843P4839O6314N5413M1580K4706N326j5852l7945n9465p8749r5061
$$ 3817843 3892682 3958996 4014409 4055989 4080695 4086021 4070169 4032224 3972759 3894010 3798949
50050C798949j08593j19232j26044j28374j26781j22578j16924j10738j04754
$$ 3798949 3690356 3571124 3445080 3316706 3189925 3067347 2950423 2839685 2734931
50041B734931r9034r2814q5583p8110p1887o7544o4252o0609n5783m9965m4103
$$ 2734931 2635897 2543083 2457500 2379390 2307503 2239959 2175707 2115098 2059315 2009350 1965247
50030A965247l9205l5543l2533k9473k6253k3116k0108j7209j4779j3215j2167
$$ 1965247 1926042 1890499 1857966 1828493 1802240 1779124 1759016 1741807 1727028 1713813 1701646
$$ [...]
##END NTUPLES=NMR SPECTRUM
##END=
