
##TITLE=UV1016_M2-1005-1001_6269080_aYreATrUgA
##JCAMPDX= 6.0         $$ Bruker NMR JCAMP-DX V2.0
##DATA TYPE= NMR SPECTRUM
##DATA CLASS= NTUPLES
##ORIGIN= BRUKER
##OWNER= Administrator
$$ 1.72 TOPSPIN		Version 2.1
$$ 2012-06-01 23:33:10.984 -0500  Administrator@TOPSPIN
$$ Compression mode = diff/dup
##.OBSERVE FREQUENCY= 400.13188235
##.OBSERVE NUCLEUS= ^1H
##.ACQUISITION MODE= SIMULTANEOUS (DQD)
##.ACQUISITION SCHEME= undefined
##.AVERAGES= 8
##.DIGITISER RES= 22
##SPECTROMETER/DATA SYSTEM= spect
##.PULSE SEQUENCE= zg30
##.SOLVENT NAME= COFFEE_calctemp
##.SHIFT REFERENCE= INTERNAL, COFFEE_calctemp, 1, 14.98061
##AUDIT TRAIL= $$ (NUMBER, WHEN, WHO, WHERE, PROCESS, VERSION, WHAT)
$$ ##TITLE= Audit trail, TOPSPIN		Version 2.1
$$ ##JCAMPDX= 5.01
$$ ##ORIGIN= Bruker BioSpin GmbH
$$ ##OWNER= Administrator
$$ $$ C:\Bruker\TOPSPIN/data/COFFEE/nmr/UV1016_M2-1005-1001_6269080_aYreATrUgA/10/pdata/1/auditp.txt
$$ ##AUDIT TRAIL=  $$ (NUMBER, WHEN, WHO, WHERE, PROCESS, VERSION, WHAT)
(   1,<2012-06-01 23:33:01.062 -0500>,<Administrator>,<TOPSPIN>,<go>,<TOPSPIN 2.1>,
      <created by zg
	started at 2012-06-01 23:31:54.562 -0500,
	POWCHK enabled, PULCHK disabled,
       configuration hash MD5:
       D5 CA 7A 23 FE 6B EE E2 50 67 74 61 24 F7 5E 3B
       data hash MD5: 64K
       F0 1B 91 DA D0 07 F4 75 F4 B5 B2 CC 2E 6F 2C 44>)
(   2,<2012-06-01 23:33:04.890 -0500>,<Administrator>,<TOPSPIN>,<proc1d>,<TOPSPIN 2.1>,
      <Start of raw data processing
       efp LB = 0 FT_mod = 6 PKNL = 1 PHC0 = 0 PHC1 = 0 SI = 32K 
       data hash MD5: 32K
       78 C3 42 F9 5D 0C 70 AD EA 3F A9 7A 09 B7 9C B2>)
(   3,<2012-06-01 23:33:05.593 -0500>,<Administrator>,<TOPSPIN>,<proc1d>,<TOPSPIN 2.1>,
      <pk PHC0 = 208.125 PHC1 = 0 
       data hash MD5: 32K
       30 59 F0 E6 45 97 73 68 D6 93 95 BE C2 E2 05 43>)
(   4,<2012-06-01 23:33:06.046 -0500>,<Administrator>,<TOPSPIN>,<proc1d>,<TOPSPIN 2.1>,
      <abs ABSG = 1 
       data hash MD5: 32K
       80 42 A2 62 19 FA 20 B5 54 D6 72 86 96 89 BA CB>)
(   5,<2012-06-01 23:33:06.140 -0500>,<Administrator>,<TOPSPIN>,<proc1d>,<TOPSPIN 2.1>,
      <abs ABSG = 2 
       data hash MD5: 32K
       F0 23 30 BB F8 C5 2E E0 D1 6C 44 36 F4 D8 4E 12>)
(   6,<2012-06-01 23:33:06.187 -0500>,<Administrator>,<TOPSPIN>,<proc1d>,<TOPSPIN 2.1>,
      <abs ABSG = 3 
       data hash MD5: 32K
       49 63 F3 5D F3 6E AE 5D FC 65 AF FA EB 0E 34 7B>)
(   7,<2012-06-01 23:33:06.265 -0500>,<Administrator>,<TOPSPIN>,<proc1d>,<TOPSPIN 2.1>,
      <abs ABSG = 4 
       data hash MD5: 32K
       BD A0 5B F9 EF B0 D6 4E 66 09 ED 8E 7F BF EF A1>)
(   8,<2012-06-01 23:33:06.312 -0500>,<Administrator>,<TOPSPIN>,<proc1d>,<TOPSPIN 2.1>,
      <abs ABSG = 5 
       data hash MD5: 32K
       63 59 40 8E 4D 3D 59 53 E3 97 A9 02 4D 80 D0 E8>)
$$ ##END=
$$ 
$$ $$ hash MD5
$$ $$ CA 9B 24 FB 8A 8F A9 6F 31 C8 E8 8E 83 E4 8C E3
##$RELAX= 
##$RELAX= 
##$RELAX= 
##$RELAX= 
##$RELAX= 
##$RELAX= 
##$RELAX= 
$$ Bruker specific parameters
$$ --------------------------
$$ [...]
##$TP= (0..7)
150 150 150 150 150 150 150 150
##$TP07= 0
##$TPNAME0= <>
##$TPNAME1= <>
##$TPNAME2= <>
##$TPNAME3= <>
##$TPNAME4= <>
##$TPNAME5= <>
##$TPNAME6= <>
##$TPNAME7= <>
##$TPOAL= (0..7)
0.5 0.5 0.5 0.5 0.5 0.5 0.5 0.5
##$TPOFFS= (0..7)
0 0 0 0 0 0 0 0
##$TUNHIN= 0
##$TUNHOUT= 0
##$TUNXOUT= 0
##$USERA1= <user>
##$USERA2= <user>
##$USERA3= <user>
##$USERA4= <user>
##$USERA5= <user>
##$V9= 5
##$VALIST= <valist>
##$VCLIST= <CCCCCCCCCCCCCCC>
##$VD= 0
##$VDLIST= <DDDDDDDDDDDDDDD>
##$VPLIST= <PPPPPPPPPPPPPPP>
##$VTLIST= <TTTTTTTTTTTTTTT>
##$WBST= 2048
##$WBSW= 25
##$XGAIN= (0..3)
0 0 0 0
##$XL= 0
##$YL= 0
##$YMAX_a= 530143
##$YMIN_a= -652713
##$ZGOPTNS= <>
##$ZL1= 120
##$ZL2= 120
##$ZL3= 120
##$ZL4= 120
##$ABSF1= 14.98061
##$ABSF2= -5.57192
##$ABSG= 5
##$ABSL= 3
##$ALPHA= 0
##$AQORDER= 0
##$ASSFAC= 0
##$ASSFACI= 0
##$ASSFACX= 0
##$ASSWID= 0
##$AUNMP= <proc_prof1d_extract_pilot.lims>
##$AXLEFT= 0
##$AXNAME= <>
##$AXNUC= <1H>
##$AXRIGHT= 0
##$AXTYPE= 0
##$AXUNIT= <>
##$AZFE= 0.1
##$AZFW= 0.1
##$BCFW= 0
##$BC_mod= 0
##$BYTORDP= 0
##$COROFFS= 0
##$CY= 15
##$DATMOD= 1
##$DC= 0
##$DFILT= <>
##$DTYPP= 0
##$F1P= 0
##$F2P= 0
##$FCOR= 0.5
##$FTSIZE= 32768
##$FT_mod= 6
##$GAMMA= 0
##$GB= 0
##$INTBC= 1
##$INTSCL= 1
##$ISEN= 128
##$LB= 0
##$LEV0= 0
##$LPBIN= 0
##$MAXI= 10000
##$MC2= 0
##$MEAN= 0
##$ME_mod= 0
##$MI= 0
##$NCOEF= 0
##$NC_proc= -8
##$NLEV= 6
##$NOISF1= 0
##$NOISF2= 0
##$NSP= 0
##$NTH_PI= 0
##$NZP= 0
##$OFFSET= 14.98061
##$PC= 1
##$PHC0= 208.125
##$PHC1= 0
##$PH_mod= 1
##$PKNL= yes
##$PPARMOD= 0
##$PPDIAG= 0
##$PPIPTYP= 0
##$PPMPNUM= 2147483647
##$PPRESOL= 1
##$PSCAL= 4
##$PSIGN= 0
##$PYNMP= <proc.py>
##$REVERSE= no
##$SF= 400.13
##$SI= 32768
##$SIGF1= 0
##$SIGF2= 0
##$SINO= 400
##$SIOLD= 32768
##$SPECTYP= <>
##$SREGLST= <1H.CDCl3>
##$SSB= 0
##$STSI= 32768
##$STSR= 0
##$SW_p= 8223.68421052632
##$SYMM= 0
##$S_DEV= 0
##$TDeff= 65536
##$TDoff= 0
##$TI= <>
##$TILT= no
##$TM1= 0
##$TM2= 0
##$TOPLEV= 0
##$USERP1= <user>
##$USERP2= <user>
##$USERP3= <user>
##$USERP4= <user>
##$USERP5= <user>
##$WDW= 1
##$XDIM= 32768
##$YMAX_p= 463973356
##$YMIN_p= -641900
##$CURPLOT= <Network HP LaserJet P1505>
##$CURPRIN= <$Network HP LaserJet P1505>
##$DFORMAT= <normdp>
##$LAYOUT= <+/1D_H.xwp>
##$LFORMAT= <normlp>
##$PFORMAT= <normpl>
##$SURQMSG= 1
$$ End of Bruker specific parameters
$$ ---------------------------------
##NTUPLES= NMR SPECTRUM
##VAR_NAME=  FREQUENCY,     SPECTRUM/REAL,   SPECTRUM/IMAG
##SYMBOL=    X,             R,               I
##VAR_TYPE=  INDEPENDENT,   DEPENDENT,       DEPENDENT
##VAR_FORM=  AFFN,          ASDF,            ASDF
##VAR_DIM=   32768,         32768,           32768
##UNITS=     HZ,            ARBITRARY UNITS, ARBITRARY UNITS
##FACTOR=    0.250966925370066, 1,           1
##FIRST=     8223.43324360095, 49229,        -128577
##LAST=      0,             -69541,          -63089
##MIN=       0,             -641900,         0
##MAX=       8223.43324360095, 463973356,    0
$$ Real data points
##PAGE= N=1
##DATA TABLE= (X++(R..R)), XYDATA
$$ [...]
19523b06661j64898A17076b12146M3774n0061d9297B282b7189n3901B3921J9637
19512D3558c559G7916i1168B50643a1037C51604g8460C81918a48039d0012k36654
19501b76666j36946J89185P0850k06134D4605a38415C03596A49544a50221k11571
19491c61792j31482a43329j74718b1291q8962R99C56627b11400b1195j05664l4728
19480a61587A21928j581J7003b05816B1309b2344m7532J6420k02470A7778J7593
19469C5371J78205a87717A43122e43375b4300l16818D7381a39977o609k81365
19459d27951J63571B46466a43860j2069g935b237j64941A93794d9587o3990N1271
19448f2306J2113g291C5178a37106k1853E0658a16455J0248r5136h4606j16169
$$ y = [-206661, -371559, 117076, -212146, -168372, -218433, -49297, 2282, -27189, -81090, 23921, 43558, -3559, 77916, -91168, 250643, -11037, 351604, -78460, 381918, -148039, -40012, -276666, -413612, -224427, -153577, -359711, 44605, -138415, 303596, 149544, -150221, -361792, -493274, -143329, -318047, -21291, -110253, -109254, 356627, -211400, -21195, -126859, -161587, 121928, 120347, 137350, -205816, 21309, -22344, -69876, -53456, -255926, 17778, 35371, 213576, -187717, 143122, -543375, -24300, -341118, 47381, -139977, -146586, -427951, -264380, 246466, -143860, -155929, -7935, -2237, -167178, 193794, -49587, -113577, -62306, -50193, -7291, 35178, -137106, -158959, 50658, -116455, -106207, -201343, -84606, -200775]
19437b00775I1171l4960a81837G2002c90910D4870b13186a714o8554r0288e4374
19425b2685C22712A22501e4045C06591a47802H3848a96730A12316e7465A23892
19414a41626e7961A29284a65488F8487b07195E3372L4195B8833a60720e0074r1208
19403a41282E450K28589I8511c0603I6432c14366g52q2389j32832A38943g8267
19391b60704F6587R1728b38231J979j66495A17112e68399b13525H9557a19676
19380A70521a24957k06188c0121j9570r1289O6384A15302a76138A17197f2233
19369i3221F0806b11083B3954O2091n407a85739c9274a3033a563k65598Q0602
19358a86559A24302b28069a12049e2552j51273A16548b05841Q7906M8469K3941
$$ y = [-200775, 91171, 56211, -181837, 72002, -390910, 44870, -213186, -1714, -70268, -160556, -54374, -22685, 322712, 122501, -54045, 306591, -147802, 83848, -196730, 112316, -57465, 123892, -141626, -57961, 129284, -165488, 68487, -207195, 53372, 87567, 28833, -160720, -50074, -141282, 5450, 234039, 98511, -30603, 96432, -314366, -752, -83141, -215973, 138943, -78267, -260704, 66587, 158315, -238231, -236252, -402747, 117112, -568399, -213525, 89557, -119676, 170521, -124957, -331145, -30121, -49691, -140980, -74596, 115302, -176138, 117197, -62233, -93221, 60806, -211083, 23954, 86045, 80638, -185739, -39274, -13033, -1563, -267161, -186559, 124302, -228069, -112049, -52552, -203825, 116548, -205841, -117935, -69466, -45525]
19348d5525A41004a85273Q5428l2752N3277m67629A01162Q902e9l08876A3465
19336A721a77866H7461K1943a425B04512b95436P5370O9060A14962c42849a05141
19324d470B9292b7515B63189b06395p7597A79378b04991D4985b92833N8501F5469
19312H1829C8076a83692e0786d983q3335j79394o3533d2011l09921b2423A02716
19300C27760r9007j2304a22135j91228A33814b39146J15931k1730j9035R862b3513
19288c18790a615B7501a5190k39011B095a72394b6233A80818k8988J209b22909
19276e2674p8691A59851D3562c3006q4136j69047b8364B9122d5389j15020A36242
19264A06295d05535B3696M071b04397C35207B885J91343a96630A71722e6683j05888
$$ y = [-45525, 141004, -185273, -99845, -132597, -79320, -546949, 101162, 110064, -59, -308935, 13465, 1721, -177866, 87461, 109404, -1425, 204512, -295436, -220066, -151006, 114962, -342849, -105141, -4470, 29292, -27515, 263189, -206395, -283992, 179378, -204991, 44985, -292833, -234332, 65469, 81829, 38076, -183692, -50786, -4983, -88318, -267712, -331245, -42011, -351932, -22423, 102716, 327760, 228753, 216449, -122135, -313363, 133814, -239146, -123215, -144945, -163980, -154118, -23513, -318790, -1615, 27501, -15190, -254201, 2095, -172394, -26233, 180818, 151830, 153039, -222909, -52674, -131365, 159851, 43562, -33006, -117142, -286189, -28364, 29122, -45389, -160409, 136242, 106295, -405535, 23696, 27767, -204397, 335207, 2885, 194228, -196630, 171722, -56683, -162571]
19253a62571r5408j87415b11705B90637c4837C186a23857j9042D8878p78c4882
19241b62783c3710J494j15984G1701K212a16436N0431C18562a65090k41172A62060
19229B02422I2439h2435A92859J23343a80338B85600a91325B64355q7221b49083
19218a42595j24301P7346A14848b72859D482c87843a04678A319M2695f0508j23209
19207a83717A45126o5184b3762J1116r0238A25413c9727O104j46332o5610B34555
19195a14261n2241A5952g6791k13207J00938p8985J32085A93909J05397A10131
19184b68600g2699m83309a7926B6206a80868A25829b8492j46853A64957j0824
19174A54133f7440H642j27b77027b8196F9233a46683O549B1176d2298k93936Q2627
$$ y = [-162571, -257979, -445394, -211705, 290637, -34837, 3186, -123857, -142899, 48878, 48100, -34882, -262783, -33710, -32216, -148200, 71701, 73913, -116436, -66005, 318562, -165090, -406262, 162060, 202422, 92439, -82435, 192859, 316202, -180338, 285600, -191325, 264355, 177134, -249083, -142595, -266896, -189550, 114848, -272859, 4482, -387843, -104678, 1319, 44014, -60508, -183717, 145126, 79942, -23762, -12646, -102884, 125413, -39727, -33623, -179955, -245565, 234555, -114261, -166502, 15952, -76791, -289998, -189060, -268045, -135960, 193909, 299306, 110131, -268600, -72699, -556008, -17926, 26206, -180868, 125829, -28492, -175345, 164957, 154133, -67440, 8642, 8515, -277027, -28196, 69233, -146683, -140134, 21176, -42298, -336234, -253607]
19162b53607d0375j96932m7210B1589b14283L3912K6593g1426A0371h8191J8997
19151f9194J0445A81495m390a39310N6621J7244A89838c79841J70545m9196f4439
19139h0275B15502d9653j14779I1663a98184A19133a78443A56633g2242K9399
19129d2843F5793a9452k21927a589A21163c26064g3609j83333B00938a99240j1631
19118b10871J2740j13190c64A3432i3345A9984b87640d2544j69231i300j14331
19107a23631j05187H7489g2616E6804k5628a12308j5929f1994I1570c77804b8880
19095f7777J6602m2756m9282a7942B16233f6547B9859b4888j2717j15968j14690
19084b68263B0137J03611c11048a17067C3231L6881a27697A34630d76660A97050
$$ y = [-253607, -40375, -237307, -284517, 21589, -214283, -180371, -153778, -71426, 10371, -88191, -69194, -58749, 181495, 177105, -139310, -82689, -65445, 189838, -379841, -209296, -258492, -64439, -80275, 215502, -49653, -164432, 91663, -198184, 119133, -178443, 156633, -72242, -42843, 65793, -19452, -241379, -1589, 121163, -326064, -73609, -256942, 200938, -199240, -210871, -198131, -311321, -364, 13432, -93345, 19984, -287640, -42544, -211775, -9300, -123631, -228818, 87489, -72616, 56804, 31176, -112308, -128237, -61994, 91570, -377804, -28880, -67777, -51175, -93931, -143213, -17942, 216233, -66547, 29859, -24888, -37605, -153573, -268263, 20137, 123748, -311048, -117067, 33231, 70112, -127697, 134630, -476660, 197050]
19073H2233d1376j51675k58981A98943h617p5112J9538A63262b75221D26648B02198
19061A63429b22161J3139A78796b16578a6490A9268h6827G0581a96217A35818
19050a21633C7741a0450A75923K2663a49183k29551A52240a39374C8123a27985
19039c73088a57309A13637c9475C1687e0667r2805g1678A34484d2744A10395E1974
19027a6279l06524H4218b26664e3278E2130a11524Q347B29856a95701a8789k10444
19016b29233C32178a8718j8004G5927@C085a17844D992b36082M318C28436h1495
19003g1236m48859a21843B83793f2637J8347A90963h3638a8195k11882j20212
18993c50289B22671c49557J72594C8302a72154B50073J5461a54477b8269B77825
$$ y = [82233, -41376, -193051, -452032, 198943, -8617, -83729, -64191, 163262, -275221, 426648, 202198, 163429, -222161, -209022, 178796, -216578, -16490, 19268, -86827, 70581, -196217, 135818, -121633, 37741, -10450, 175923, 198586, -149183, -378734, 152240, -139374, 38123, -127985, -373088, -157309, 113637, -39475, 31687, -50667, -143472, -71678, 134484, -42744, 110395, 51974, -16279, -322803, 84218, -226664, -53278, 52130, -111524, -103177, 229856, -195701, -18789, -229233, 332178, -18718, -36722, 75927, 0, 3085, -117844, 4992, -236082, -231764, 328436, -81495, -71236, -520095, -121843, 283793, -62637, -44290, 190963, -83638, -18195, -230077, -350289, 222671, -349557, -176963, 38302, -172154, 250073, 265534, -154477, -28269, 277825]
18982H1564b40184B95807G8533L5501c91195l197A23441o0731L7356d3649q9315
18971a32964A25058a92815c456B16553d9687j44943h7582p0746A97259J75242
18961C72501b04310D14662k06300A02856d73660a30738J295l07264A6525c6783
18950B17946b27265l10510b53j95865H7719b3601A81674a07792q989e5373j03071
18939a58444L6101a763m6928k20508c3972j81396B22548a47693B5045a00276l9160
18928a39436c9280r3502O2194I379Q2927J4321c5869I7964A5941a81477g3981
18916b65497F9215k8272a95084A00045b06686b2898j45203k7554F1044f5463B611
18904a48030b3981l09971h6759l6511M3172A41527L4254a08981b3905A48554C085
$$ y = [81564, -240184, 295807, 78533, 114034, -391195, -394392, 123441, 62710, 100066, -43649, -132964, 125058, -192815, -3456, 216553, -49687, -194630, -87582, -158328, 197259, 372501, -204310, 414662, 208362, 102856, -473660, -130738, -129443, -436707, 16525, -36783, 217946, -227265, -537775, -253, -196118, 87719, -23601, 181674, -107792, -116781, -55373, -158444, -122343, -1763, -48691, -269199, -33972, -215368, 222548, -147693, 25045, -100276, -139436, -39280, -132782, -70588, 9379, 92306, 106627, -35869, 97964, 15941, -181477, -73981, -265497, 69215, 40943, -195084, 100045, -206686, -22898, -168101, -195655, 61044, -65463, 2611, -148030, -23981, -333952, -86759, -123270, -80098, 141527, 175781, -108981, -23905, 148554, 3085]
18892a59052f2457K2963k31554j21585A65074a40600a2388j88951a00332E7503
18881A34629B3756J96158p4322e9977B7745c13986B39433a19987m5440K8912A15538
18869e54433g073A5312b05707A87573b49444a13104M7914p4427B55213g1884C2130
18857b90590a17876K3519n2328f0813A5049J78558C6495b60219O6814Q751A76881
18845A80435c752k9786o130p4911a2524H810J81244A6960M3019e4168G6207h4144
18832a2220k76826f983A17917j6677a51684k5849n2594c8721m8579J3636B32064
18820a9768k0976a5966k58017a09890D77847I0596D3640O3594i1091C8507a19664
18808h3748i539j11543q1244K2849C82813a47801O5633m3182B03544M6118n4242
$$ y = [-159052, -62457, -39494, -271048, -392633, 165074, -140600, -12388, -201339, -100332, 57503, 134629, 23756, 219914, 145592, -59977, 27745, -313986, 239433, -119987, -165427, -136515, 115538, -554433, -7073, 15312, -205707, 187573, -249444, -113104, -65190, -139617, 255213, -71884, 32130, -290590, -117876, -94357, -146685, -60813, 15049, 193607, 36495, -260219, -193405, -184654, 176881, 180435, -3752, -33538, -39668, -114579, -12524, 8810, 190054, 16960, 59979, -54168, 76207, -84144, -12220, -289046, -6983, 117917, 101240, -151684, -177533, -230127, -38721, -87300, -73664, 232064, -19768, -40744, -15966, -273983, -109890, 477847, 90596, 43640, 107234, -91091, 38507, -119664, -83748, -9539, -121082, -202326, -179477, 382813, -147801, -82168, -125350, 203544, 249662, 195420]
18797A95420a22252p4132j1361j1508A0434a36128n3808B98568b44310D30717
18786f9710k25265J06111N714m8798A53992a35808o2274F5561J9058a45382r9139
18775b44521A99362b36911Q4488p1849J01790A03486b31647A9634a23805H8614
18764g644j86023B558b49808a02966j02595P2755b0063E4118f2729l9830A3909
18752d9539J9631m21j48104o2057D156d5395n022B01136a32555A66972F3465J5699
18740G9164e79197e6133r2577f8232l1554d5231j40170J5342f0897k08940J9868
18729b49969C3962e3635D2176a28947F0713b11824f4825B8469b31087Q1598c6251
18717a43503A02657m1194J47552b14293B66982a01136c0395A26614N9786a75689
$$ y = [195420, -122252, -196384, -207745, -219253, 10434, -136128, -189936, 298568, -244310, 430717, -69710, -294975, -188864, -183150, -231948, 153992, -135808, -198082, 65561, 84619, -145382, -244521, 199362, -236911, -152423, -224272, -122482, 103486, -231647, 19634, -123805, 88614, -7644, -193667, 2558, -249808, -102966, -205561, -132806, -20063, 54118, -62729, -102559, 13909, -49539, -29908, -30329, -178433, -240490, 4156, -45395, -50417, 201136, -132555, 166972, 63465, 79164, -579197, -56133, -148710, -68232, -99786, -45231, -185401, -170059, -60897, -269837, -249969, 33962, -53635, 42176, -128947, 60713, -211824, -64825, 28469, -231087, -149489, -36251, -143503, 102657, 61463, 209015, -214293, 266982, -101136, -30395, 126614, 186400, -175689]
18706a45755B57003a20413A37009h3454p4631d2099j18208d8485l77931J15000
18696c11416J01540B8320a4252l50502I0659C818J69206f3100B4424J6983d4129
18684A05181b15110O0855E8869c43189a10360k34852J59179F9906N0775K16898
18674C37579A34330o20a9112l57098i6145B27868J01409H863b366A06434c1038
18662D7502a76143G4870b0395r1034E7849b13808M1243P3329A28605e2194k0633
18651g2827L4394A46506b39586P7094f3278r2415a0897q4664C07266d1899A5614
18639g3846m74242f7180L0971A0514P7938f265D8614a46928A40152i152l01793
18628c10945B1936Q1243J7656b05220J3001E6833a16923k64124h7060k01269B9219
$$ y = [-145755, 257003, -120413, 137009, -83454, -158085, -42099, -160307, -48485, -426416, -311416, -209876, 28320, -14252, -364754, 90659, 3818, 173024, -63100, 24424, 41407, -44129, 105181, -215110, -154255, 58869, -343189, -110360, -345212, -186033, 69906, 120681, 337579, 134330, 133710, -19112, -376210, -96145, 227868, 329277, 8863, -2366, 106434, -31038, 47502, -176143, 74870, -20395, -111429, 57849, -213808, -172565, -99236, 128605, -52194, -72827, -38433, 146506, -239586, -162492, -63278, -155693, -10897, -95561, 307266, -41899, 15614, -73846, -548088, -67180, -36209, 10514, 88452, -6265, 48614, -146928, 140152, -9152, -310945, 21936, 103179, 120835, -205220, -192219, 56833, -116923, -381047, -87060, -288329, 29219]
18616g6871p325k37969I2788g1246A01173a7946L880j78432E8339j8567f8980
18604H4725B1745b67076B91507j03362H87h3552e292k81817A52598m6470b03216
18592D0320K54712a2303A354J00224r904B6533a35425r1809l4239A97964e19301
18580b97882A75908h3818K747h936p8872I3711h9126o5067A51077f6855A23652
18568A50874K7222D988b15226m9989a20146c5433j46006Q5629d2542a7524j07502
18557a25026K4531A1255J04178g1544m8815A58530A00M4036M6259g047k12809
18546b19856I6453a00358A21787f4883H128J3788N4459d6182m7464m2753C35340
18534i8749D6503J11948a16114B10883a54342K426k14365a8658j27597j9588I0364
$$ y = [-76871, -84196, -322165, 92788, -71246, 101173, -17946, -14066, -192498, 58339, 39772, -68980, 84725, 21745, -267076, 291507, 188145, 887, -83552, -5292, -287109, 152598, 106128, -203216, 40320, 295032, -12303, 1354, 101578, 91674, 26533, -135425, -227234, -261473, 197964, -519301, -297882, 175908, -83818, -81071, -8936, -87808, 93711, -89126, -154193, 151077, -66855, 123652, 150874, 178096, 4988, -215226, -265215, -120146, -35433, -181439, -95810, -42542, -17524, -125026, -100495, 11255, 115433, -71544, -120359, 158530, 100, 44136, 90395, -7047, -219856, 96453, -100358, 121787, -64883, 8128, 21916, 76375, -46182, -93646, -136399, 335340, -98749, 46503, 158451, -116114, 210883, -154342, -151916, -366281, -18658, -146255, -165843, 90364]
18522f0883A94310g4769B68924h4103d617q0301b9305F7154d99667C75224A51668
18510H8711A4428O9502d3371B52105c07215f5930C7696h5096r805k56598M740
18499c46759A854c53718O3136A95404A0382b9704B51506a07234A60961e1958k31318
18488b83276j78494A84104a27563p9420J2624R6303A46257b24474Q1185C3730
18477A10867a09833q9633A18520c05609K991F538b9715B18271n976Q1613d378
18465d4607l86098f7455j8684l5959M52A75917b71716A58909a75171M1717r3539
18454b26993J06138n7511M5531k93680D0049i4475j03995L0356A22429B1878b13727
18442b00457A65316a00425A6477h0157n4870j41862g7194k52014J35647j69772
$$ y = [-60883, 194310, -74769, 268924, -84103, -4617, -84918, -29305, 67154, -499667, 375224, 151668, 88711, 14428, 83930, -43371, 252105, -307215, -65930, 37696, -85096, -94901, -351499, -346759, 1854, -353718, -290582, 195404, 10382, -29704, 251506, -107234, 160961, -51958, -283276, -461770, 184104, -127563, -206983, -194359, -98056, 146257, -224474, -143289, 33730, 110867, -109833, -199466, 118520, -305609, -302618, 6538, -29715, 218271, 212295, 293908, -4378, -44607, -430705, -67455, -86139, -122098, -121646, 175917, -271716, 158909, -175171, -133454, -226993, -120855, -178366, -132835, -426515, 40049, -94475, -198470, -168114, 122429, 21878, -213727, -200457, 165316, -100425, 16477, -80157, -135027, -276889, -77194, -329208, -193561, -363333]
18432c63333a49254A19387C6879a04585J7610m171j39903b5280H9101b27799E7790
18420B14984B9507N9150a36841C7134J7262B6460a04096B21382P3448A38020M339
18409A42359a03328L6449m5453q5446j8869D5709R1806a41161f143n9730K5536
18398d0337k74514O5416F9638a19520H6709J69366f5388q2557k34814E4434b89593
18386B82275a89970J5005g6193l03749a72123O6481F803b54402A74636a47914
18375B1393a63672k11508a80085A90319f0781F7341b16707A1657a50825l07022
18365d57847h2447E0125K28172c15942d960B1403K71406d3959B14013P5881a91062
18353B4186b93676a11365m719l7419o5452J00710k63245O9023i9258j14044a873
$$ y = [-363333, -149254, 119387, 36879, -104585, -86975, -91146, -231049, -25280, 89101, -227799, 57790, 214984, 29507, 88657, -136841, 37134, 54396, 26460, -104096, 221382, 294830, 138020, 142359, -103328, -66879, -112332, -197778, -216647, 45709, 137515, -141161, -6143, -65873, -40337, -314851, -249435, 69638, -119520, 86709, 256075, -65388, -147945, -382759, 54434, -289593, 282275, -189970, -174965, -76193, -379942, -172123, -105642, 6803, -254402, 174636, -147914, 21393, -163672, -375180, -180085, 190319, -60781, 67341, -216707, 11657, -150825, -457847, -82447, 50125, 278297, -315942, -4960, 21403, 292809, -43959, 214013, 289894, -191062, 24186, -293676, -111365, -116084, -153503, -218955, -118245, -381490, -312467, -99258, -213302, -1873]
18341c5371n3603j10545R2752A84329a00879j58527a4003m27331A21897b34797
18330A72330n7717m285B125J29955a34706C83146D2497g0092D3094f257k8732
18319c4989A15065J37956a90743e3117G79R8322M2309P9885A03818b93915h3149
18307H0737L8741N6914A4175L37929a97083b2275B1053b04594A85358b61984A6289
18295C5914b82108G821K11407p9248h1548A81185b3344k20910F4675c40430f4871
18283B04300C5380J3821J23351a23108N1740j85848o8116g9474o3711k73862e0233
18271b08412A01198b19755B3064J72989C3817b05680B16318a38057G6128O594
18261H2722A5034K744K3036d1729j02196r7722N4499g6239o487I6291J6805b06520
$$ y = [-35371, -88974, -199519, -106767, 184329, -100879, -259406, -14003, -441334, 121897, -234797, 172330, 114613, 110328, 2125, 132080, -134706, 383146, 42497, -70092, 43094, -6257, -34989, 115065, 253021, -190743, -53117, 779, 99101, 141410, 221295, 103818, -293915, -83149, 80737, 119478, 176392, 14175, 352104, -197083, -22275, 21053, -204594, 185358, -261984, 16289, 35914, -282108, 7821, 219228, 139980, -81548, 181185, -23344, -244254, 64675, -340430, -64871, 204300, 35380, 49201, 172552, -123108, -71368, -257216, -325332, -79474, -143185, -417047, -50233, -208412, 101198, -219755, 23064, 196053, 33817, -205680, 216318, -138057, 76128, 82722, 15034, 17778, 40814, -41729, -143925, -241647, -187148, -76239, -82726, 96291, 113096, -206520]
18248a52470j978n3726f8415k4096R232R696C8630a13824B34252A05497b20025
18236A70988f2752p2789c9443n1243k2845k7129L7791A4584a22685l37014a48621
18224G8814f8659k07848B3630R588E511O2251a03820M4953K1443A11526h7175
18212i9674k4349b1840B7117a71878G6679a65003M3347n8083k28210A00435m8901
18201E1534k4391b31432n114G5931h5552k3854j6185j04443i1389b9384j37264
18190a66648c0370B56078c45264b6681j60562A97946H9161g7186J6541j14823
18180a75468l3674A64834a15986G5068e0691j5584p0009A17656C8168R8418a58160
18168a3340C55692A48080a12348A45992j2325a08517A89795a9180C81945F4844
$$ y = [-152470, -154448, -208174, -68415, -92511, -83279, -73583, 38630, -113824, 234252, 105497, -220025, 170988, -62752, -135541, -39443, -90686, -113531, -140660, -102869, 14584, -122685, -459699, -148621, 78814, -68659, -276507, 23630, 33218, 5511, 67762, -103820, -58867, -37424, 111526, -87175, -99674, -124023, -21840, 27117, -171878, 76679, -165003, -121656, -179739, -407949, 100435, 51534, 27143, -231432, -236546, 75931, -85552, -109406, -125591, -230034, -91389, -29384, -166648, -30370, 256078, -345264, -26681, -187243, 197946, 89161, -77186, -60645, -175468, -209142, 164834, -115986, 75068, -50691, -66275, -136284, 117656, 38168, 136586, -158160, -13340, 355692, 148080, -112348, 145992, 133667, -108517, 189795, -19180, 381945, 64844]
18157A16994g5574D9946K33353a79105R724B8000J43201g2336k19242G0325b12590
18145B74046i1945l94836i6116C7939c84987G711P3719C5058f4948q1341b2887
18133B33754a63419h043C3052O3437M0269F1826a55059A19889B2051J68896h6543
18121A57424d09509a83245b5890B21590f6191K6382j04675k5267b2762j2065k53705
18110b88532a15375C4173j949Q4014C459a862k1071P669j62781H8849f0103A36268
18097G9167e1398j67487j86127a01397F7825g7335k17558A30847K7604a43409
18086a25615A47450o3080a0113A13120A1118b49125H5263J44738e2001l05488
18076c57489A2024c018j76337J8224e6397A76168c8691A30954J21956d4647a5191
$$ y = [116994, -75574, 49946, 283299, -179105, -169381, 28000, 171201, -72336, -291578, 70325, -212590, 274046, -91945, -486781, -96116, 37939, -384987, 7711, 81430, 35058, -64948, -146289, -22887, 233754, -163419, -8043, 33052, 96489, 136758, 61826, -155059, 119889, 22051, 190947, -86543, 157424, -409509, -183245, -25890, 221590, -66191, -39809, -144484, -169751, -22762, -34827, -288532, -115375, 34173, 32224, 116238, 3459, -1862, -22933, -15264, -178045, 88849, -60103, 136268, 79167, -51398, -218885, -405012, -101397, 67825, -77335, -294893, 130847, 158451, -143409, -125615, 147450, 84370, -10113, 113120, 11118, -249125, 85263, 230001, -52001, -357489, 12024, -3018, -179355, -161131, -56397, 176168, -38691, 130954, 252910, -44647, -15191]
18064b14534j05818A53864a58205c4386l8805b8949G5483h230B2788b6917r6983
18053a23900k456B68953f9597j43476A29385i218k6452k01842A10930e3549C01296
18041A35047B0813a73104Q5054H8793a14904F0211J09332f3904j18252C846b689
18029e3818A55987b14007h603B07183h3581a8138k99047c2567E6110M6361a03197
18017b59050P1470A22120k402C0444A0689K58763A9544g6694B66445A27834d2326
18005C6695L1921Q7263c2841C2169a35382l0294n448b3956q294n9111A01665b1822
17992A29575i2124j7505M5147E9875i1636p3778G0543h9821c7183A51929d15861
17980i9770k97886f4357I8593b83784d757B149a96351D5609a76687I9454f5897
$$ y = [-214534, -320352, 153864, -158205, -34386, -73191, -28949, 75483, -8230, 22788, -26917, -123900, -126356, 268953, -69597, -213073, 129385, -9218, -35670, -237512, 110930, -53549, 301296, 135047, 20813, -173104, -88050, 88793, -114904, 60211, 169543, -63904, -182156, 3846, -2689, -53818, 155987, -214007, -8603, 207183, -83581, -18138, -317185, -32567, 56110, 102471, -103197, -259050, -187580, 122120, 119718, 30444, 10689, 269452, 19544, -76694, 266445, 127834, -42326, 36695, 68616, 155879, -32841, 32169, -135382, -165676, -171124, -23956, -32250, -91361, 101665, -21822, 129575, -92124, -109629, -64482, 59875, -91636, -165414, 70543, -89821, -37183, 151929, -415861, -99770, -397656, -64357, 98593, -283784, -4757, 2149, -196351, 45609, -176687, 99454, -65897]
17968b84248A47185a4765A31969b26574A2613K51561F0964B9382d7621B330P3279
17957G5609g9946K582K725A54749a39444H7519d7564j0663j88326B32962A3502
17945A57494b14014A82004g9623h721l38409e5651o8448d7706k8632B62093a21184
17933I249K84769j40548a31120b8383k50941A12988a93170g2907E9567d2902k27765
17922b70667C8415a20217B33633e6547E9017j6202a89187A16711R3464a2042k09324
17911b21366j90836A8140h5166A33242c0731A3586e5804o07A35749m6328J48941
17900B38362a03701p4598A08926A9245b55895I6378b05676e9441B2352b6350j8052
17889d4402B75273D3880K45740A04733O1860b18301m4730h6693J5111H7575m2667
$$ y = [-284248, 147185, -14765, 131969, -226574, 12613, 264174, 60964, 29382, -47621, 2330, 75609, -79946, -77364, -74639, 154749, -139444, 87519, -47564, -58227, -246553, 232962, 13502, 157494, -214014, 182004, -79623, -8721, -347130, -55651, -124099, -47706, -76338, 262093, -121184, 9249, 294018, 153470, -131120, -28383, -279324, 112988, -193170, -72907, 59567, -42902, -270667, 38415, -120217, 233633, -56547, 59017, 42815, -189187, 116711, 210175, -12042, -221366, -412202, 18140, -85166, 133242, -30731, 13586, -55804, -56411, 135749, 89421, 238362, -103701, -178299, 108926, 19245, -255895, 96378, -205676, -59441, 22352, -26350, -44402, 275273, 43880, 289620, 104733, 166593, -218301, -263031, -86693, -71582, 87575, 44908]
17878D4908b5264A21838A3054P9833P6377L5479b85905A09781L78195i3624A94012
17866B5225a24536b3409B4346a6810B56805r3467a05992F0767b13534B60191b26893
17854h6231j5373Q788a6172m23013A66050b21886D31237A0159d233H3175C2436
17842A99894i3525A34242a72682j38146H0872K71254j05600e2155C050K98754
17832C01804G2907A7666e9717A3619J57479e7094G7282B9466J00710h9011K6602
17821f2409k60654a28498b4875A47450c97009g1895k70761g0398B4432g6311A55004
17809a90025h8076B8094I198a0205j94824k21985D3771b69018C8317b8126B71780
17797H1683c37737a47287B15943i4860n0996e9718r3076c4105j1124B32898p9650
$$ y = [44908, -25264, 121838, 13054, 92887, 169264, 204743, -285905, 109781, 487976, -93624, 194012, 25225, -124536, -23409, 24346, -16810, 256805, 163338, -105992, 60767, -213534, 260191, -226893, -86231, -101604, -92816, -16172, -439185, 166050, -221886, 431237, 10159, -4233, 83175, 32436, 199894, -93525, 134242, -172682, -310828, 80872, 352126, 246526, -52155, 3050, 301804, 72907, 17666, -59717, 13619, 171098, -57094, 77282, 29466, 130176, -89011, -62409, -323063, -128498, -24875, 147450, -397009, -71895, -342656, -70398, 24432, -76311, 155004, -190025, -88076, 28094, 9198, -10205, -205029, -427014, 43771, -269018, 38317, -28126, 271780, 81683, -337737, -147287, 215943, -94860, -145856, -59718, -152794, -34105, -45229, 232898, 153248]
17786A53248K8750G5a92836d5386m5534j0858H7443F986e7722r7375J3462A53808
17773C58247A67362N396J19746a65546m4424C03490b37330A95057A9177i383F4101
17761C24689a7247j34506A65842b1813I1662G734i3244E4603g7537j04652b3767
17749i0429A09285c98816A5376O5456L23021j89740b18710I3652J64004A27371
17738c94875a19954C4571L27380K9974a04924e1326J2429l5989g049D6216L5369
17727H1585K1886a52145H7472O5715C9906a20449j45523B90599j29958b66799
17716A2312K7267L0353a37246C0926b65309B21575a0508o7920j50681B61258E5926
17704b39187I6233b63554C01235h2145A7248E812J41084l7504O509a38120l2148
$$ y = [153248, 181998, 75, -192836, -45386, -90920, -101778, 87443, 6986, -57722, -155097, -141635, 153808, 358247, 167362, 172758, 292504, -165546, -209970, 303490, -237330, 195057, 19177, -9383, 64101, 324689, -17247, -151753, 165842, -21813, 91662, 7734, -93244, 54603, -77537, -182189, -23767, -90429, 109285, -398816, 15376, 80832, 403853, 214113, -218710, 93652, 257656, 127371, -394875, -119954, 34571, 361951, 391925, -104924, -51326, -38897, -74886, -7049, 46216, 81585, 103471, -152145, 87472, 153187, 39906, -120449, -265972, 290599, 160641, -266799, 12312, 39579, 69932, -137246, 30926, -265309, 221575, -10508, -78428, -229109, 261258, 55926, -239187, 96233, -263554, 301235, -82145, 17248, 5812, 146896, 109392, 115901, -138120, -170268]
17693a70268B3568a77635l752A35074C3508c6708A3769Q4656K84790D8007P7158
17682A25165P9080m7932b56666B9269L6119a28534p1821o2216B73668D9435a37288
17670A82512J27954c4158o4950C08569r1875H6911K1422a90002A26162D0157i2177
17658a26537C1160A3355a13548J67A05009c44407A3995K07528C7544a43212A1639
17646F0730b40396B2352K35632E0606b32196A14939a93785B56275i2292D3534
17635I294b03784A02694P2059Q6062c4355F5809J4884a25278c025l31277a41261
17623i0065H5267N8668i0420L5212D4739J23729a12593A68071l6071m1836m3968
17612D6196L6171k4510Q8817k2625k7313e7010D44499b240A62793n4569N7966
$$ y = [-170268, 23568, -177635, -181387, 135074, 33508, -36708, 13769, 98425, 383215, 48007, 125165, 204245, 156313, -256666, 29269, 65388, -128534, -200355, -262571, 273668, 49435, -137288, 182512, 310466, -34158, -99108, 308569, 216694, 86911, 108333, -190002, 126162, 40157, -92177, -126537, 31160, 13355, -113548, -113381, 105009, -344407, 13995, 221523, 37544, -143212, 11639, 60730, -240396, 22352, 257984, 50606, -232196, 114939, -193785, 256275, -92292, 43534, 9294, -203784, 102694, 174753, 260815, -34355, 65809, 80693, -125278, -3025, -334302, -141261, -90065, 85267, 143935, -90420, -55208, 44739, 168468, -112593, 168071, 132000, 90164, 46196, 82367, 57857, 146674, 124049, 96736, -57010, 444499, -2240, 162793, 108224, 166190]
17601A66190K00805F1421J23140L960m9931D8710a96153R4950D4323i3771q2025
17590a75796G2616L8875j0423i238A46165d2304A79346o7657a5993q7377A54039
17578C80970A89055J11251D1620c31989d9635D6299a64696A21517b36486d7047
17567b74198c4251j99031E4294J11374m4211D9803b22597J03250O54B62561b46473
17555B3589L84199g1082A2441f1198A10115c1917C6177a58313K0425N5101K4244
17544e8543B02296E1193i8215j47330B8607J97705a32701A23528K313E0932i709
17532a50573B73191c0124I7111c46471A37099m6498O2364D2927A7635J78378a7198
17520A82976A0329L18224G870c16869B09763b81299a37009B07575a68079D56342
$$ y = [166190, 366995, 61421, 184561, 188521, 138590, 48710, -196153, -101203, 44323, -93771, -175796, 72616, 111491, 101068, -9238, 146165, -42304, 179346, 111689, -15993, -103370, 154039, 380970, 189055, 300306, 41620, -331989, -49635, 46299, -164696, 121517, -236486, -47047, -274198, -34251, -233282, 54294, 165668, 121457, 49803, -222597, -119347, -118693, 262561, -246473, 23589, 407788, -71082, 12441, -61198, 110115, -31917, 36177, -158313, -137888, -82787, -58543, 202296, 51193, -98215, -245545, 28607, 226312, -132701, 123528, 125841, 50932, -9709, -150573, 273191, -30124, 97111, -346471, 137099, 90601, 152965, 42927, 17635, 196013, -17198, 182976, 10329, 328553, 7870, -316869, 209763, -281299, -137009, 207575, -168079, 456342]
17509B3166b4238H1299f1111A07483J66446a04796d2229E7242k081K99707b31716
17497A81205m4721J26344H5077K5076b44963A58821J98763A27891J15188K6345
17487B69424H2963J81365G1455a60290B64637a64831B65137O721A14770e6524
17476G7528A6735P3945P841K57530E7879a31519C33097C7634M41556G2622K71992
17465C44614A50400J862E0674M02972l8190A29063f1565C17305o7883D4604J68818
17454B13422n5446g1007B34073r8739k1116J16489c301H5150H001L48537l8096
17443C18442A00790k0283N2310N1481A1260M90823I6432J12406Q514K17772F1223
17431A95774I1031M3855o7201M67932A29002a51168A05149O3865a8686D57955
$$ y = [23166, -24238, 81299, -61111, 107483, 273929, -104796, -42229, 57242, 55161, 354868, -231716, 181205, 136484, 262828, 85077, 110153, -244963, 158821, 357584, 127891, 243079, 269424, 82963, 264328, 71455, -160290, 264637, -164831, 265137, 271858, 114770, -56524, 77528, 16735, 90680, 98521, 356051, 57879, -131519, 333097, 37634, 479190, 72622, 344614, 150400, 152262, 50674, 453646, 415456, 129063, -61565, 317305, 249422, 44604, 213422, 157976, -71007, 234073, 135334, 114218, 230707, -3301, 85150, 8001, 356538, 318442, 100790, 80507, 132817, 184298, 11260, 502083, 96432, 208838, 217352, 435124, 61223, 195774, 91031, 134886, 67685, 535617, 129002, -151168, 105149, 169014, -18686, 457955]
17420a72102A31761K40857j17017j21051L31588q0268i6117C66178A73334K76367
17410D49701j47285j12153E3536A4162M70408D4972J95346A19539N81735B83828
17399C97414k7500B9693j3887J91003b08704C8129c56692h333k5796J6536C36522
17387F6869j8156K1760K09920a11029A0611a21634A90515I4314M8939A6780f2816
17375F2391J62262L1932a17147D94819A11092n3765Q8063P8680r0086n7148J36854
17364B13690J33062K29463H2297J00422H0106J04890a54269D36523r5578G5507
17353d8339I3353J21255I8381M9853o6235L7423a76401A07416l2088P1821L5845
17342A82994D7279a94396E85873A08581J31519E6022B6449N4565J46817J17727
$$ y = [-172102, 131761, 372618, 255601, 134550, 466138, 385870, -96117, 366178, 173334, 449701, 302416, 190263, 53536, 14162, 484570, 44972, 240318, 119539, 701274, 283828, 397414, 369914, 29693, 15806, 206809, -208704, 38129, -356692, -8333, -34129, -17593, 336522, 66869, 48713, 70473, 280393, -111029, 10611, -121634, 190515, 94314, 143253, 16780, -62816, 62391, 224653, 256585, -117147, 494819, 111092, 57327, 145390, 224070, 133984, 76836, 213690, 346752, 576215, 82297, 182719, 80106, 184996, -154269, 436523, 340945, 75507, -48339, 93353, 214608, 98381, 148234, 81999, 119422, -176401, 107416, 75328, 147149, 182994, 47279, -194396, 585873, 108581, 240100, 56022, 26449, 81014, 227831, 345558]
17332C45558C750c8488B07082a53231D87602A77971O5326b50787G6566R8906e2547
17320C35624J95686A20090b1559B65036H794c5005A86150K76247h8551A82757
17309E45012k56598r5324d7561A4618J85884P914J47188j20524L29498B56694
17298C37245B7800L71457j44951r1144K4663J254c9355A48346h9556I148d1833
17286a02673A64016n3347Q8069b6037C0690J49083a04296B07059b01497H2342
17275C10606A24893K36590G2837j0363L5798K11104P260I6196a19996A56073p5813
17264H0260a7316A24873o0873K39647f5023H0508M28965q5021m3772c5200A13787
17252D63211j62287A07924M774l7561R0166J04087o3081c4974B24376M0676k5218
$$ y = [345558, 3750, -38488, 207082, -153231, 487602, 177971, 243297, -250787, 76566, 175472, -52547, 335624, 531310, 120090, -21559, 265036, 8794, -35005, 186150, 462397, -88551, 182757, 545012, 288414, 193090, -47561, 14618, 200502, 208416, 355604, 235080, 564578, 256694, 337245, 27800, 399257, 254306, 163162, 187825, 189079, -39355, 148346, -89556, 9148, -41833, -102673, 164016, 110669, 198738, -26037, 30690, 179773, -104296, 207059, -201497, 82342, 310606, 124893, 361483, 72837, 62474, 98272, 309376, 316636, 96196, -119996, 156073, 80260, -17316, 124873, 64000, 303647, -65023, 80508, 509473, 424452, 380680, -35200, 113787, 463211, 300924, 107924, 112698, 75137, 165303, 269390, 206309, -34974, 224376, 265052, 239834]
17241B39834J52392j15801r2349R4507K3874j18734q8643J40813L65098j72754
17231D28237A83878I0762K74165j04924J65927G5493L94388j60999L9263G0995
17220B75485e3652C79082A44467J96129j63529N62983C33891A29711K3583k5765
17210A27529K58384A48690M4633a14224D22329A97713J86332H8550K67632H0026
17199A22620K701J3677L86087j73791j62121J27217j7397a18905A10389J16411
17189B26800j05953J97809A04492D0949L60810j48976a38785C93482o9036j52850
17179A71596k3474K84006A22988N5120n8657m99M54929B25489K37974k21895a26730
17167D22905A91130N4713K95593k15033G7526L70885j0909j2462K1759A35001
$$ y = [239834, 392226, 276425, 184076, 278583, 302457, 183723, 95080, 235893, 600991, 428237, 183878, 90762, 364927, 260003, 425930, 75493, 469881, 308882, 348145, 70995, 275485, -53652, 379082, 144467, 340596, 177067, 740050, 333891, 129711, 153294, 127529, 385913, 148690, 193323, -114224, 422329, 197713, 384045, 88550, 356182, 80026, 122620, 125321, 138998, 525085, 351294, 189173, 316390, 298993, -118905, 110389, 226800, 120847, 318656, 104492, 40949, 401759, 252783, -138785, 393482, 324446, 171596, 148122, 432128, 122988, 178108, 119451, 118952, 573881, 225489, 463463, 241568, -126730, 422905, 191130, 245843, 541436, 326403, 77526, 448411, 437502, 425040, 446799, 135001]
17156A32557K03310c5586E58796p5214b6690C52287G0118L09604j21808J99206
17146D57120j86150M06320C165Q2414N7261K31725A07703P0229J21173L8002M6931
17135C84038k7742J79135k24917A32540M41707R3158C10348j18152K69748n8479
17125D03465j27520P4725P9324J61082j16365B06534F0388M00496j17262J67789
17115E11411J53435A25958l7774L21948j5628J78848A75037J98049A17789L00726
17105D18515j8180J03749B36221L88571k03396j50170L94940j10290A69576B2199
17094C18066A57466n4681K64302J28944j65553j40963L42347j78233n3584K18749
17084E18794j92058N5530M4013g289E53468j16135R7857j42678A86976L60807
$$ y = [132557, 335867, -35586, 558796, 483582, -26690, 352287, 70118, 379722, 257914, 457120, 270970, 677290, 3165, 85579, 142840, 374565, 107703, 177932, 299105, 337107, 384038, 356296, 535431, 310514, 132540, 574247, 667405, 310348, 192196, 461944, 403465, 275945, 350670, 429994, 591076, 474711, 206534, 60388, 460884, 343622, 511411, 664846, 125958, 88184, 410132, 394504, 573352, 175037, 373086, 117789, 418515, 400335, 504084, 236221, 624792, 421396, 271226, 666166, 555876, 169576, 22199, 318066, 157466, 102785, 367087, 496031, 330478, 189515, 531862, 353629, 300045, 518794, 326736, 382266, 426279, -7289, 553468, 437333, 535190, 392512, 186976, 547783]
17074E47783L67873m07305A79590M53942B95733J32381K45604k78669J75337K8836
17064E99222k6548O8181B57727K33595Q981k26367P2716J16431A13394M6014K47560
17053D06968L90055l25479l464j99809J93714O6541j40200j33657K87985K807
17043E45461N5704j13566k31010K90694j84415L31172j19067L60718C76421J94792
17033E71213j25172L93416j45744j62502J89847k7392B25651J40442M68658j33457
17023G01294k11188J87176q9000j16126j74953M44130k30845k47835L10274N8063
17013F30990P5226P8845l59159K70717j35103L1168J70905R8749k23477N5841
17003F94702m0702K03890j23889K5990R8975k07519J62214j4760J92257l88297
$$ y = [547783, 915656, 508351, 179590, 633532, 295733, 428114, 673718, 395049, 570386, 599222, 572674, 640855, 257727, 491322, 500303, 273936, 346652, 463083, 113394, 159408, 406968, 797023, 471544, 468080, 268271, 461985, 528526, 388326, 254669, 542654, 545461, 601165, 487599, 256589, 547283, 362868, 694040, 574973, 935691, 376421, 571213, 446041, 839457, 693713, 531211, 721058, 693666, 225651, 366093, 834751, 701294, 490106, 677282, 588282, 472156, 297203, 741333, 510488, 262653, 572927, 630990, 706216, 785061, 425902, 696619, 561516, 592684, 763589, 862338, 638861, 694702, 654000, 857890, 734001, 759991, 858966, 651447, 813661, 798901, 991158, 602861]
16993F02861r2775L10915l73421M65337C25647L55312K53025m48279L74402k93317
16983E66790O16J80797J77181k45629J06690J73897P4853k56572Q3894Q9470O4717
16972A016704j79093j2464J88018l16441K19890n4809P0366j18766k64256O50741
16962A199890k95211J57102j78775o4507k49916K59515K61511J47168m63711M84559
16952A257625k13562R376m3868J39191j01348K28631n68976L86927K81500j91283
16942A184213J62311J4057n55835K60427O7833l16255K48389L58442l16554K80583
16932A387611j8058j83380o6633J93134j07757P8188o9805K66887o1209L4698
16922A453676j24545K7208J24628j36562n8059L93919O9095k07121o4172N184
$$ y = [602861, 510086, 821001, 447580, 912917, 325647, 680959, 933984, 485705, 860107, 566790, 567406, 748203, 925384, 679755, 786445, 960342, 1035195, 778623, 862517, 951987, 1016704, 837611, 825147, 1013165, 696724, 916614, 861805, 932171, 813405, 549149, 1199890, 904679, 1061781, 883006, 818499, 568583, 828098, 1089609, 1236777, 773066, 1257625, 1044063, 1053439, 1009571, 1148762, 1047414, 1276045, 707069, 1093996, 1375496, 1184213, 1346524, 1360581, 804746, 1065173, 1133006, 816751, 1065140, 1423582, 1107028, 1387611, 1369553, 1186173, 1119540, 1312674, 1204917, 1283105, 1213300, 1480187, 1418978, 1453676, 1329131, 1356339, 1480967, 1344405, 1286346, 1680265, 1749360, 1542239, 1478067, 1483251]
16912A483251l1440K73922m17679K85000K86695l35762j62293N2113K00215K36974
16902A870996k96389j11017P1517J10983J43810l51579N39086k10469L6658Q8933
16892A892529l3540N6684M8256R8650q4782J33405j64958l75331L00175J28307
16882A999395R0846k05983o5309L8461K98076N2561k69445K15202J21428O4720
16872B339952L1008N8966p3338K49873l58220M75822k75187J05008K37467l82050
16862B409301P1023k30149O85705k96793L78820k66176P2967j72627J73248J48996
16852B974315K3914j15600J20728k30478N32076J65354n04611L46789J35189j86115
16842C261561J02214L3239K92704l42435M2436K32515N42896l47482P0226j8306
$$ y = [1483251, 1451811, 1725733, 1308054, 1593054, 1879749, 1543987, 1381694, 1433807, 1634022, 1870996, 1574607, 1463590, 1535107, 1646090, 1789900, 1438321, 1977407, 1766938, 1803596, 1892529, 1858989, 1915673, 1963929, 2062579, 1977797, 2111202, 1946244, 1570913, 1871088, 1999395, 2090241, 1884258, 1818949, 1857410, 2155486, 2208047, 1938602, 2153804, 2275232, 2339952, 2370960, 2429926, 2356588, 2606461, 2248241, 2724063, 2448876, 2553884, 2791351, 2409301, 2480324, 2250175, 2935880, 2639087, 3017907, 2751731, 2824698, 2652071, 2825319, 2974315, 2998229, 2882629, 3003357, 2772879, 3304955, 3470309, 2965698, 3312487, 3447676, 3261561, 3363775, 3397014, 3689718, 3347283, 3389719, 3622234, 4165130, 3817648, 3887874, 3869568]
16832C869568M9023K25441k0582L96339R737k57661L9229R1062j09632q264K55545
16821D539805K54260K75849l38536R3034P3703M80825J76409j68523M44665n47978
16811E283513L23955K06381K03499m7731j68253J52861J75091Q5847M75474K14208
16801F904845K40455l41945K50645m3532K18472J32532L41510J16261P0083N92045
16791H481371J19667j84384N01334J85989m55L66455M34178L5087N46107L92436
16781A0877785j246O4169K82862L78279J44996L12229M06917K16745O20221L43380
16771A3646337L35982M12930L58688O98850L52551K46427P10691K12864O27685
16762A7603005P05407N09775N43355J041319M16023N68965J053199P20589Q11559
$$ y = [3869568, 3918591, 4144032, 4123450, 4519789, 4529526, 4271865, 4311094, 4402156, 4292524, 4284260, 4539805, 4794065, 5069914, 4731378, 4824412, 4898115, 5378940, 5555349, 5386826, 5831491, 5283513, 5607468, 5813849, 6017348, 5969617, 5801364, 5954225, 6129316, 6215163, 6690637, 6904845, 7145300, 6803355, 7054000, 7010468, 7228940, 7361472, 7702982, 7819243, 7889326, 8481371, 8601038, 8416654, 8917988, 9103977, 9103522, 9469977, 9904155, 9939242, 10485349, 10877785, 10876539, 10940708, 11223570, 11601849, 11746845, 12059074, 12465991, 12682736, 13302957, 13646337, 13982319, 14395249, 14753937, 15452787, 15805338, 16051765, 16762456, 16975320, 17603005, 18308412, 18818187, 19361542, 20402861, 20818884, 21387849, 22441048, 23161637, 23973196]
16753B3973196R68613J056885Q24790J039873J147360Q90813J260179J123826
16745C2285535J657838J363768J660477J595435J658483J891842J800329K099643
16737D6013350K284035K399411K421946K362973K820337L164455K935218L427698
16729F7829423L595579L914631L864086M297137M473790M531072N064553N366399
16721A02936670N398606N689922N681391O108717O011366O041703O014980O142717
16713A50026072O185569N116046N254751M927267L602335L230942K794743J411312
16705A82549037L84716m88671j122903k370297l324587m253658m863181n055437
16697A61455019n987550n922152o745161o385904o734682o430717n948610o436886
$$ y = [23973196, 24941809, 25998694, 26823484, 27863357, 29010717, 29901530, 31161709, 32285535, 33943373, 35307141, 36967618, 38563053, 40221536, 42113378, 43913707, 46013350, 48297385, 50696796, 53118742, 55481715, 58302052, 61466507, 64401725, 67829423, 71425002, 75339633, 79203719, 83500856, 87974646, 92505718, 97570271, 102936670, 108335276, 114025198, 119706589, 125815306, 131826672, 137868375, 143883355, 150026072, 156211641, 161327687, 166582438, 171509705, 175112040, 178342982, 181137725, 182549037, 182933753, 182445082, 181322179, 178951882, 175627295, 171373637, 166510456, 161455019, 155467469, 149545317, 142800156, 136414252, 129679570, 123248853, 117300243, 110863357]
16689A10863357o007280n302213n553401n027106n202382m600009m347689m093607
16681G0729670l617025l736846l493572l131238k603377k948304k324846k676182
16673D6198280j878597k261487j986995k243688j806572j221123j542533j409229
16665C1848056j444139j272255j175233j140874r21602q13202j321654j158824
16657B2600273o29141o08082r32731o58650q53300q66011j67465o14251p92551
16648A6478091m93373o48971o9058p54487n93797j42380q64349K03322r25725
16639A2189273L1136m07773n03850j73439n79353k98397J00304m65001l20722
16630I572178m49516j98154J69119l63467j41517o21441J53819o11443O9403P0686
$$ y = [110863357, 104856077, 99553864, 94000463, 88973357, 83770975, 79170966, 74823277, 70729670, 67112645, 63375799, 59882227, 56750989, 54147612, 51199308, 48874462, 46198280, 44319683, 42058196, 40071201, 37827513, 36020941, 34799818, 33257285, 31848056, 30403917, 29131662, 27956429, 26815555, 25893953, 25080751, 23759097, 22600273, 21971132, 21363050, 20430319, 19771669, 18918369, 18052358, 17884893, 17270642, 16478091, 15984718, 15335747, 15266689, 14512202, 13918405, 13776025, 12911676, 13114998, 12189273, 12220409, 11812636, 11308786, 11135347, 10555994, 10257597, 10357901, 9892900, 9572178, 9122662, 8924508, 9093627, 8730160, 8588643, 7967202, 8121021, 7509578, 7578981, 7649667]
16620G649667k43828j45177k50994j60349j77971q6102j81698J0859m48966N8598
16610F024039k80341M6349j87639k74830j58123j13000N54382l42235l01904l84375
16600D582323O7170J55973J1695n22084L41609o4088k17135p3099p4411k30717
16590C977236J40670j26412j92476q8783n3712L4181j22510k32773L76549o8653
16580C643317j14101l9334l03893j01512k8254M4947M5926o5515j74532J12532
16570C019581l5951J28940m31695K33555l2680l29923l7534r260o2939K9670k25577
16559B246187J00959R9284q8616l26081J12156m1595J16611k99516M01566k57922
16549B063033j27697J06551J82254l14829J26901j20468R3480k25678K03528j59289
$$ y = [7649667, 7405839, 7260662, 7009668, 6849319, 6671348, 6585246, 6403548, 6414407, 5965441, 6024039, 5743698, 5790047, 5602408, 5327578, 5169455, 5056455, 5610837, 5268602, 4966698, 4582323, 4649493, 4805466, 4817161, 4295077, 4636686, 4572598, 4355463, 4282364, 4207953, 3977236, 4117906, 3991494, 3799018, 3710235, 3656523, 3690704, 3568194, 3335421, 3711970, 3643317, 3529216, 3489882, 3185989, 3084477, 3056223, 3101170, 3147096, 3081581, 2907049, 3019581, 2983630, 3112570, 2680875, 2914430, 2881750, 2551827, 2514293, 2505033, 2442094, 2471764, 2246187, 2347146, 2446430, 2357814, 2031733, 2143889, 2102294, 2218905, 1919389, 2320955, 2063033, 1935336, 2041887, 2224141, 1909312, 2036213, 1915745, 2009225, 1783547, 1987075, 1827786]
16539A827786j9530j93202K44995J93363l66635J56954l36816J85591k83694M59300
16529A868112n4398k49625O4748n2455N2462k36823P8855Q3987m34351R1241K85625
16518A497378Q3107j61087K48480k27858l43240K9283J48924j19481K50750j15728
16508A290528m444R1505m28564K17412P0021j14192M08206l59412J57922J29592
16498A458574k91866l15415K63548j99574L1963l080k4243M33712K0488k88556
16488A085551k10016K23644O5233k24924p4762q8194j31676K30589k422j72598
16478G00425r1196J85925k6854J52955l03410L71157j49906l7312l46892L35112
16468G90004J67254j64742K35679j49613k38356j18929J82755L8731O5060j77518
$$ y = [1827786, 1808256, 1615054, 1860049, 2053412, 1686777, 1843731, 1506915, 1692506, 1408812, 1868112, 1813714, 1564089, 1628837, 1576382, 1628844, 1392021, 1470876, 1554863, 1120512, 1211753, 1497378, 1580485, 1419398, 1667878, 1440020, 1096780, 1126063, 1274987, 1155506, 1406256, 1290528, 1286084, 1377589, 949025, 1166437, 1236458, 1122266, 1530472, 1171060, 1328982, 1458574, 1166708, 851293, 1114841, 915267, 947230, 944150, 919907, 1353619, 1374107, 1085551, 875535, 1099179, 1164412, 939488, 864726, 776532, 644856, 875445, 873023, 700425, 609229, 795154, 768300, 921255, 617845, 989002, 839096, 801784, 454892, 790004, 957258, 792516, 1028195, 878582, 640226, 521297, 704052, 742783, 807843, 630325]
16458F30325K323r893J02754n286j3895j58171M18116D68760j7133J65344O0322
16447F77293j41519B19057L63301L551J27616n4456j3738l21524M90226k51541
16437E62492j41435O0873L21460j14121j93065n2272A71869M94516K62712m60202
16427D68895O2591N4642j87808K66364L8586p5598j23724j93044l157M06036j44740
16416E69043j87095r0667M6675J80239o6958j95667L23293l9220C7747N75762
16406F13509J69180l12311n0181Q9241J55369A89408J57980J38160M2690J00518
16396F28756Q3466B09261J93393L32312N0530G6322M72389k51128j36106J72857
16386C34334J32958K54921k61654A59267L01944j97737J74006J82627J76792B47345
$$ y = [630325, 632648, 622755, 725509, 720223, 706328, 548157, 966273, 468760, 451627, 616971, 677293, 535774, 219057, 582358, 585909, 713525, 659069, 645331, 323807, 814033, 562492, 421057, 481930, 803390, 689269, 496204, 443932, 171869, 666385, 929097, 468895, 531486, 586128, 398320, 664684, 703270, 627672, 503948, 310904, 307747, 713783, 569043, 381948, 291281, 337956, 518195, 451237, 255570, 578863, 539643, 37747, 613509, 782689, 470378, 420197, 509438, 664807, 189408, 347388, 485548, 528238, 628756, 712222, 209261, 402654, 734966, 785496, 76322, 548711, 297583, 161477, 334334, 467292, 722213, 460559, 159267, 461211, 263474, 437480, 620107, 796899, 247345]
16375E82229j41704j42762K02588j37812J95779k17434o3710R7075k9908J6040
16365C60381o0144R0517q9216n0840J38834n7532K594j31968K02555J0590J1652
16354D27423q7913N3352q2721G7914K25756A14855M41726k23725j42266Q7539
16344B78129L9013k9242a16784B55555G2602J2205j1622l0340K90593k9661l8870
16333B64907B5123K80539O6549j8560N8676J1978A46129m8026f8324B72465J05963
16322C78428j88937K78497n7320A20081J4668J72498l0471M1996j01768J13183
16312C30187n1506K31482F4996a57803B85377b17281E02236B22195K05581A65774
16301B05901b11524C8609L8282B532L71073l6731A01841b9226A54932C8155J78095
$$ y = [582229, 440525, 297763, 500351, 362539, 558318, 340884, 277174, 374249, 344341, 360381, 300237, 390754, 301538, 250698, 389532, 332000, 334594, 202626, 405181, 415771, 427423, 339510, 392862, 310141, 77914, 303670, 114855, 556581, 332856, 190590, 278129, 317142, 287900, -116784, 255555, 72602, 84807, 73185, 42845, 333438, 303777, 264907, 25123, 305662, 372211, 353651, 412327, 424305, 146129, 98103, -68324, 272465, 378428, 189491, 467988, 410668, 120081, 134749, 307247, 276776, 318772, 217004, 330187, 278681, 510163, 64996, -157803, 285377, -217281, 502236, 222195, 427776, 165774, 205901, -211524, 38609, 76891, 2532, 373605, 336874, 101841, -29226, 154932, 38155, 216250]
16290B16250a04644D33460m7159g0388B44585m3418N7952J53541h8073E31236
16279H9532M0106J59568j4512a08540d571A40588B3275h1157F5239K16863G3488
16267B5828J20085m0126R3986c30046A25636o789K43732I7121k0010J6859K5110
16256A19080J38719J56750A07598J05534C6909j3422J30963M5943L8197O4734
16246C03324J13523b1333l5187A55682M3062m3602F5618K93309g7933A73975H4946
16234B55884q2358j4806m5919c854D1482a61207A45221J14219H4079K28596a4644
16222F1142K60583b3359A26635a02733l125A4553K45190r4514E6657K58630k2150
16211B93137A24522L09775c8156e291k37676E2320R93i3517G0975d2646c759A42582
$$ y = [216250, -104644, 433460, 386301, -70388, 244585, 201167, 259119, 412660, -88073, 531236, 89532, 129638, 289206, 274694, -108540, -4571, 140588, 23275, -81157, 65239, 282102, 73488, 25828, 145913, 105787, 199773, -330046, 125636, 118847, 362579, 97121, 77111, 93970, 119080, 257799, 414549, 107598, 213132, 36909, 23487, 154450, 200393, 238590, 303324, 416847, -21333, -56520, 155682, 198744, 155142, 65618, 358927, -77933, 173975, 84946, 255884, 173526, 158720, 112801, -3854, 41482, -161207, 145221, 259440, 84079, 312675, -14644, 61142, 321725, -23359, 126635, -102733, -105858, 14553, 259743, 165229, 56657, 315287, 293137, 124522, 434297, -38156, -5291, -242967, 52320, 53313, -93517, 70975, -42646, -3759, 142582]
16198A17970O118k475D751O6357A0356L04329M429D0233P9387m7507b8797H1940
16185F7691K55930B9136Q4417B3841h1169A62617m3590R9271p5600f3649B3737
16173a47590c3409G0999p259c01104G8055b41403H4426g2748C92726b10330C568
16161g7666l6810B8057Q0872c22735D4181J58858q1665a26701c8602i359I0596
16149D554J51169a845D3619p570P4663a9668e507A26195l1862J1019O7812C2434
16136a05236A49272d7331A96531F9630b1809l07282B2148a54571P5802D45238
16125h7154B3704d9898I9260R4416d0333k84593i0696j89161K6104C4847K9210
16114F4057M721d5944C63844E9643a48044I1172b03296B52350h0514B87795b42010
$$ y = [117970, 124088, 121613, 4751, 71108, 10356, 314685, 319114, 40233, 119620, 72113, -28797, 81940, 67691, 323621, 29136, 113553, 23841, -81169, 162617, 119027, 218298, 142698, -63649, 23737, -147590, -33409, 70999, 63740, -301104, 78055, -241403, 84426, -72748, 392726, -210330, 3568, -77666, -114476, 28057, 108929, -322735, 44181, 203039, 121374, -126701, -38602, -9359, 90596, 4554, 155723, -1845, 43619, 36049, 110712, -19668, -5507, 126195, 94333, 105352, 173164, 32434, -105236, 149272, -47331, 196531, 69630, -21809, -329091, 22148, -154571, -78769, 445238, -87154, 23704, -49898, 99260, 193676, -40333, -324926, -90696, -279857, -253753, 34847, 64057, 68778, -45944, 363844, 59643, -148044, 91172, -203296, 252350, -80514, 287795, -242010]
16102I2342h0645j18767D5508b78396g7879j40587A13699J15320d7590B63547
16091c73585A78607E0286a82311B7937K91860J12769A27578n3324B3864a2946
16080C04205j22332E6277b27158L6655C7896e503r269F9096c8396j69295G4898
16068A91666a73775k072M8071A66524g4070B28739j13599O3718a14261C8773m962
16057C3811K86003a00875B33456j03049L4831F671g3274I7770a0527j46905o5699
16046b23131c186o843G5562D720i7457j10306m8201E47758c5613A58569C9101
16034e7940j14344g099A44395F9825j1047N1827K14946F5362i3015B14514c13639
16022I6452c00176c6953j21980d3434B4333c42671o2129e2245j5859l0827r4295
$$ y = [92342, -80645, -199412, 45508, -278396, -77879, -218466, 113699, 229019, -47590, 263547, -373585, 178607, 50286, -182311, 27937, 319797, 432566, 127578, 74254, 23864, -12946, 304205, 181873, 56277, -227158, -190503, 37896, -5503, -14772, 69096, -38396, -207691, 74898, 191666, -173775, -175847, -127776, 166524, -74070, 228739, 115140, 178858, -114261, 38773, 33811, 319814, -100875, 233456, 130407, 165238, 6671, -73274, 97770, -10527, -157432, -223131, -3186, -10029, 75562, 4720, -97457, -207763, -255964, 547758, -35613, 158569, 39101, -57940, -172284, -7099, 144395, 69825, 58778, 110605, 325551, 65362, -93015, 214514, -313639, 96452, -300176, -36953, -158933, -43434, 24333, -342671, -404800, -52245, -68104, -98931, -193226]
16011a93226I6833a72460A82025n2771a08530H3959A5604K08301I4177a78564
16000A242K70898F0008b27113H2019a11177A97190a84342c4322j27674A48309
15989a71558F2524a56412A00386K16510a76841C0745i0l40036a12561D0377a53916
15977f1503F0927c7440B71161b02380O3502F7049Q1410K68631K0618L7842J15457
15966E91007D7665R3387K19001H7960b150B67357A28752L6627a16258F2278a16261
15954a5641j00414A19883c2831j17768A60542b26657d6493A53041a09457C23150
15943a54089B7682h4070p069A26397B2143c4933j4082B66008e0817C01099G5084
15931a38563B19048k6270k8783K5437A1897Q7773a60515O6419p8320E0589A0738
$$ y = [-193226, 96833, -172460, 182025, 129254, -108530, 83959, 15604, 223905, 94177, -178564, 1242, 272140, 60008, -227113, 82019, -111177, 197190, -184342, -34322, -161996, 148309, -171558, 62524, -156412, 100386, 316896, -176841, 30745, -90, -340126, -112561, 40377, -153916, -61503, 60927, -37440, 271161, -202380, -138878, 67049, 148459, 417090, 437708, 475550, 591007, 47665, 141052, 360053, 87960, -2150, 267357, 128752, 165379, -116258, 62278, -116261, -15641, -116055, 119883, -32831, -150599, 160542, -226657, -46493, 153041, -109457, 323150, -154089, 27682, -84070, -91139, 126397, 22143, -34933, -49015, 266008, -50817, 301099, 75084, -138563, 219048, 192778, 163995, 189432, 11897, 99670, -160515, -94096, -172416, 50589, 10738]
15919c4391j36871j8791k14277d7317j74042B4168c15658g7070q0054B01122E7208
15907A12652c89156D13273C6388N6901g2172A27999a88102j24197A81592b10626
15896b76353C40813A35389D6289j4075b79774a00693r0482B08256a89985D2242
15885D8920f8315K2794C0888R8668J22912f7723A2320K19075A0463J61907j1010
15874A61360f2133j01525m8355C7207c60081e658l26081a162A37589l9936R3824
15863A91477q1342B596L9629g1471l29999A9970c8446m7828H8382l4506b50393
15851E7348J06184K2536i5116I4045h9672A25401a56499b2321j79380j53364r0476
15840d45541a55164J1242p809n2367D2686h2422j43670b1283A05531b38546d418
$$ y = [-34391, -171262, -190053, -404330, -47317, -221359, 24168, -315658, -77070, -157124, 201122, 57208, 112652, -389156, 413273, 36388, 93289, -72172, 127999, -188102, -312299, 181592, -210626, -276353, 340813, 135389, 46289, 32214, -279774, -100693, -191175, 208256, -189985, 42242, 48920, -68315, -45521, 30888, 129556, 252468, -67723, 12320, 231395, 10463, 172370, 161360, -62133, -163658, -212013, 37207, -360081, -5658, -331739, -1162, 137589, 97653, 191477, 110135, 2596, 42225, -71471, -401470, 19970, -38446, -86274, 88382, 53876, -250393, 57348, 163532, 186068, -95116, 94045, -89672, 125401, -156499, -22321, -201701, -355065, -445541, -155164, -143922, -151731, -204098, 42686, -82422, -226092, -21283, 105531, -238546, -4418]
15828h2834q0668l0151j40240B79481F9853l0413d6383j54077I9136a9227F2697
15816c46352B47390L6651a99433C4969d11469A26331b68873a25535j05775j26832
15806c58142J73137M7079B53073b08307c7325m1381k72078E0655f9485k74028
15796c43513f4815k3021c5458M43j82406c9911J349E8862K52048a23086D8301
15784A64815b98880J38342g503l33j28502A11317A6879b75479J06653I8863a21178
15772e2870I6989J64042b5215A38584h3508k11354A498c19202B2482O356f0465
15760B23167A3005d6203B19384c17991J47340A47114F0513j6892b17238F4874
15749B13452b3206B82609b33703i6209E7425K55620A55302b17378e0304G2373
$$ y = [-82834, -163502, -193653, -333893, 279481, 69853, 39440, -46383, -200460, 99136, -19227, 62697, -346352, 247390, 284041, -199433, 34969, -411469, 126331, -268873, -125535, -231310, -358142, -185005, -137926, 253073, -208307, -37325, -78706, -350784, 50655, -69485, -343513, -64815, -87836, -35458, -35015, -217421, -39911, -38562, 58862, 310910, -123086, 48301, 164815, -298880, -160538, -7503, -7836, -136338, 111317, 16879, -275479, -168826, 98863, -121178, -52870, 96989, 261031, -25215, 138584, -83508, -294862, 1498, -319202, 22482, 28838, -60465, 223167, 13005, -46203, 219384, -317991, -170651, 147114, 60513, 43621, -217238, 64874, 213452, -23206, 282609, -233703, -96209, 57425, 313045, 155302, -217378, -50304, 72373]
15738F4031c4573f209A56416K1517g5883j06160A34968K4903p8318P2690c03753
15726A72743g7212j54821B86446H0084a14013B8446J27193c24800B47669I875
15715E13Q7459b6688H1598a12623A5485a71118O4790B30064A12660a22617G5203
15703E5180b28313i5077G138a41710D3568M5682J68417a95000d6868A59864c67402
15691a69015N2907n6006c8006k97448a19251B38c9567A35357b59883g072a829
15679h9936F138K515J59669J50355j49525a5463k00402F1856a28900J5378n8641
15668a72163D2278A4980a82933j05586a09958E5128N1542a04686I9351A2756c61505
15656A0227J88613M6746I4788J32996E3696b2416q2625A295g7988m9863p9287
$$ y = [64031, -34573, -6209, 156416, 177933, -75883, -182043, 134968, 159871, 81553, 154243, -303753, 172743, -77212, -232033, 286446, 80084, -114013, 28446, 155639, -324800, 247669, 9875, 513, 87972, -26688, 81598, -112623, 15485, -171118, -106328, 230064, 112660, -122617, 75203, 55180, -228313, -95077, 7138, -141710, 43568, 89250, 257667, -195000, -46868, 159864, -367402, -169015, -116108, -172114, -38006, -335454, -119251, 238, -39567, 135357, -259883, -7072, -1829, -89936, 6138, 8653, 168322, 318677, 169152, -15463, -215865, 61856, -128900, -113522, -172163, 42278, 14980, -182933, -288519, -109958, 55128, 106670, -104686, 99351, 12756, -361505, 10227, 198840, 245586, 94788, 227784, 53696, -22416, -105041, 1295, -77988, -127851, -207138]
15645b07138H6466J39051a0746p3290I6757a13330e2644j77484k0612g2016B85130
15633b99406a22581A84711H9602a32320j19893J07012n4079c4019h116k31943
15623b40059G8560P500A7937J82329n4665a51445B54133g0455j10252j34433a5837
15611a877C97788b4566D6452k0655c80685B32922j11350a09577a4027C16048i532
15599B48643a19359C5805a9602A03188N0931I531M443a72068B67580F2119f40
15587a97407A80040o3833M16715c36501a01992d2920B18077G3002Q2209J35948
15577B91159n4197G3375C6094d1332A44157K6563j9926a77834C2533B429K54435
15566B56864b1329C85328i3895K283A07031D0661c13991F0247j5379j5106a38016
$$ y = [-207138, 86466, 225517, -10746, -84036, 96757, -113330, -52644, -230128, -250740, -72016, 285130, -299406, -122581, 184711, 89602, -132320, -252213, -145201, -199280, -34019, -8116, -240059, 78560, 86060, 17937, 200266, 145601, -151445, 254133, -70455, -180707, -315140, -15837, -1877, 397788, -24566, 46452, 25797, -380685, 232922, 121572, -109577, -14027, 316048, -9532, 248643, -119359, 35805, -19602, 103188, 154119, 9531, 13974, -172068, 267580, 62119, -640, -197407, 180040, 116207, 532922, -336501, -101992, -42920, 218077, 73002, 155211, 291159, 236962, 73375, 36094, -41332, 144157, 170720, 150794, -177834, 32533, 2429, 256864, -21329, 385328, -93895, -91612, 107031, 40661, -313991, 60247, 44868, 29762, -138016]
15554C9046J33628d8048r6438j76808a26252K7785p7143A8444l519a34790A88052
15542B64885j11554J34505k8818A2191P8202J06949b4969j35755c17k63047D14723
15530A6652J67840C6624g1063A83394G2506B6508J80065J18531C3760a40781F0826
15518A00723a24733e6120B87520j24168e6521B1855n087M3400i782A82091Q6197
15507B68288A21576L681E6459a20274p2994A42723C5084b49066o0006G6106J04819
15496A80925O767j5932i1942G1404P9756C383J5500J47871a78340d0816K457k34946
15484b73305N298e4825j35766a9539e912J855k71545h6580j03388A0912J57398
15473A68310J00425h3974r6694F2024a47180A85706a33502b3420D9025J3082a45629
$$ y = [39046, 172674, -48048, -144486, -321294, -126252, -98467, -175610, 18444, 14925, -134790, 188052, 264885, 153331, 287836, 259018, 12191, 90393, 197342, -24969, -160724, -317, -263364, 414723, 16652, 184492, 36624, -71063, 183394, 72506, 26508, 206573, 325104, 33760, -140781, 60826, 100723, -124733, -56120, 287520, 163352, -56521, 21855, 16768, 60168, -9782, 182091, 268288, 121576, 125257, 56459, -120274, -193268, 142723, 35084, -249066, -309072, 76106, 180925, 187692, 171760, -91942, 71404, 151160, 3383, 18883, 166754, -178340, -40816, -38359, -273305, -268007, -54825, -190591, -19539, -5912, -4057, -275602, -86580, -189968, 10912, 168310, 268735, -83974, -180668, 62024, -147180, 185706, -133502, -23420, 49025, 62107, -145629]
15461a46948L3362c7029H3841b4185A74643Q961a0890r7060L0314C42936C5040
15449I0539J3803a24047p3011d9078D4012L88124j87199c06197i915j19450B46376
15437b01956A29958j4342c50362E7794e99C68339A78155k9553m0849f032C95334
15425A93462G551d3633j30325B10466F928c5235l44126g9193A52893e6426G2861
15413H210a64461a7518o6702j14575A94311r3958J54919D0064A3118J04587B7074
15401C55774c39617h7842B289L83082j85625a37010j89809A4240b7017A9318e6585
15389A11066m7956r086b13016J7443I1485J90124a40887B53548d7223A47933l5884
15378A12049J832c4591B76973b46477P7796A1317Q0356b19130H1616c1151k70610
$$ y = [-146948, -113586, -37029, 83841, -24185, 174643, 183604, -10890, -107950, -77636, 342936, 35040, 90539, 104342, -124047, -197058, -49078, 44012, 432136, 244937, -306197, -9915, -129365, 246376, -201956, 129958, 115616, -350362, 57794, -599, 368339, 178155, 148602, 107753, -6032, 395334, 193462, 7551, -43633, -173958, 210466, 6928, -35235, -379361, -79193, 152893, -56426, 72861, 8210, -164461, -17518, -84220, -198795, 194311, 100353, 255272, 40064, 13118, 117705, 27074, 355774, -339617, -87842, 2289, 385371, 199746, -137010, -326819, 14240, -27017, 19318, -56585, 111066, 63110, 54024, -213016, -195573, 91485, 281609, -140887, 253548, -47223, 147933, 112049, 113881, -34591, 276973, -246477, -168681, 11317, 91673, -219130, 81616, -31151, -301761]
15367c01761E3343b54510G9411a15292N4555C23994e371k41072N8421L0219B73671
15355a51630H9269L20456D2622b03551R4924B91835d2231g130o8248a9227j60767
15344a79994A19111l5625k2562L8465m5901d9841A12471B8440K48037a29402M8780
15333h0622p6128A90134b70367A72435p586C1648b40278A32298e0805m00152G3560
15321a29985d4008B63785d15512a81734A36596i1480A55899a0991i29A23240l5869
15310H7371A9833a7515E2089f8265E5279L9615b2976A55808a81797A37317O7576
15299B04893C533a56606B67669a34770A50148k6407a62293j02084i378A6279b5552
15287a65566A07589L74070r0745e0977K4413B14702a10292E2641d0750E2419a54562
$$ y = [-301761, 53343, -254510, 79411, -115292, -60737, 323994, -5371, -246443, -188022, -157803, 273671, -151630, 89269, 409725, 42622, -203551, -108627, 291835, -42231, -7130, -75378, -19227, -179994, 119111, 83486, 60924, 99389, 53488, -49841, 112471, 28440, 276477, -129402, -80622, -156750, 190134, -270367, 172435, 164849, 31648, -240278, 132298, -50805, -450957, 73560, -129985, -44008, 263785, -415512, -181734, 136596, -91480, 155899, -10991, -929, 123240, 87371, 19833, -17515, 52089, -68265, 55279, 94894, -22976, 155808, -181797, 137317, 204893, 3533, -156606, 267669, -134770, 150148, 123741, -162293, -264377, -9378, 16279, -25552, -165566, 107589, 481659, 390914, -50977, -26564, 214702, -110292, 52641, -40750, 52419, -154562]
15275b6189j20389H8885b2906A10058N2916G0235b53115a19634C3880J11811J06701
15264B52392b53058D4325K88367l2172l3838d0946C51488b2656B26572J87617
15254D14189A34663k5168K4121g6588H8587A9312J62728f3824A59443p2778J67227
15243B53892L32596C1531K98588A62693O0884j11591Q8605k2122J62139N25487
15233H66095K50160J2197J02930j94215D98127F0613K22230P6390A20110a80989
15222D0324J73525a71969b0898D4158b68930A58636C28L88450e4335H3076c757
15210A21366A9800N5433i3229o0380G1162b46120e5749O226f565D0686b03899
15198a17176d7556B5983J91770F5226K59606a20244N8062a875A10037H529J86192
$$ y = [-26189, -146578, 88885, -22906, 110058, 162974, 70235, -253115, -119634, 33880, 145691, 252392, -253058, 44325, 332692, 300520, 266682, -40946, 351488, -22656, 226572, 414189, 134663, 109495, 133616, -76588, 88587, 19312, 182040, -63824, 159443, 86665, 253892, 586488, 31531, 330119, 162693, 223577, 111986, 200591, 178469, 340608, 866095, 1116255, 1128452, 1231382, 1037167, 498127, 60613, 282843, 359233, 120110, -180989, 40324, 213849, -171969, -20898, 44158, -268930, 158636, 328, 388778, -54335, 83076, -3757, 121366, 19800, 75233, -93229, -153609, 71162, -246120, -55749, -49523, -6565, 40686, -203899, -117176, -47556, 25983, 217753, 65226, 324832, -120244, -62182, -1875, 110037, 8529, 194721]
15187A94721H6447b25687A17729a65813f1846B14377f1948m8570a7143j80119
15177a97262C9861K57996J8794h1814A30812a00595E9080N1542C0181J77805O1485
15166B69471L1950b6079A72765J62325b8065B4721e3375F2044P6106F6516c8846
15154B08943J26265G5815a90425c4229o0694n8021j50796i237k28725F302J38092
15143A44394a56095B15581A06538K43852j55712D2856A5588d4524C5718Q3138
15133A18856B3814a78895I9532b93668f546A54227P0509l5017K12121A87785a32360
15121B2113a37004e9744j4604D3641J24883M1796a71947C4034N8040J10850C2986
15109D08482H5931O3260k5240P4222e5675B98435a20167r5237C33794j39592C4563
$$ y = [194721, 86447, -225687, 117729, -165813, -61846, 214377, -61948, -110518, -17143, -197262, 39861, 297857, 316651, -81814, 130812, -100595, 59080, 110622, 30181, 207986, 269471, 301421, -26079, 172765, 335090, -28065, 24721, -53375, 62044, 138150, 66516, -38846, 208943, 335208, 75815, -190425, -34229, -94923, -152944, -303740, -9237, -237962, 6302, 144394, -156095, 215581, 106538, 350390, 194678, 42856, 15588, -44524, 35718, 118856, 23814, -178895, 99532, -293668, -6546, 154227, 224736, 189719, 401840, 187785, -132360, 22113, -137004, -59744, -74348, 43641, 168524, 210320, -171947, 34034, 92074, 202924, 32986, 408482, 85931, 149191, 123951, 198173, -55675, 298435, -120167, -215404, 333794, 194202, 34563]
15097A44510c6146C03419p4877A4751L97928A20780K24412E2599Q4338A4157L28960
15086C43117a4270H3810K98571j40657Q3681j7978a23439B88068A13865R3594
15076B07459a43258A93723p5523K36430d6006k9633B44708G4433c417C13522j43979
15065A69543G63L4999P1592d9321C42560J52j65191o1069K43004J2823j58660
15054B13619d6287A94423r0300P4148J86127A60684m8490O4083K2879r6485J51813
15043B54484q0256D9756b6643k10057B83305J17942J8794A85755J1941G74L65037
15032C65811H8118J44387b24575D9884L48000A60636K92645B11810l7241a43499
15021B45643a0876B45328K96485j27321C3373J6161K05893l224o8332B8299a71872
$$ y = [144510, -36146, 303419, 228542, 14751, 412679, 120780, 345192, 52599, 136937, 14157, 343117, -14270, 83810, 382381, 241724, 325405, 307427, -123439, 288068, 113865, 207459, -143258, 193723, 118200, 354630, -46006, -75639, 244708, 74433, -3417, 313522, 169543, 763, 35762, 107354, -49321, 342560, 342712, 177521, 116452, 359456, 372279, 213619, -46287, 194423, 104123, 178271, 364398, 160684, 112194, 176277, 199156, 102671, 254484, 174228, 49756, -26643, -236700, 283305, 401247, 420041, 185755, 197696, 774, 365811, 88118, 232505, -224575, 49884, 397884, 160636, 453281, 211810, 174569, -143499, 245643, -10876, 245328, 541813, 414492, 33373, 49534, 255427, 252203, 183871, 28299, -171872]
15009D34309j77905I0097K26775B4735L86164n9095p2292G8293e4195J4374k2774
14998f2595A31131p24K47057j45820p2355n6733a1918A03452K5197j2371b17004
14986B71130Q8583A38337J65518b0791E012N524L90680e222A66274K53749A13771
14974B09615C6640L46278A9114e25A18761K28853n0330J14469A28248J41161O4380
14963C33789A62815J66376o7132H4768J34601L06424j21738a27253C33293J99286
14953E32579B66008n6216J14887A48458L60042j03303J57953g4592B14000K00219
14943D14219j93690L53316I3272J9536K19935r8142O3457c4233C06926J97176
14933E04102o2406A47989J85563D7539K81656l2960P8585j49132N1665m0693r3640
$$ y = [434309, 256404, 90097, 316872, 24735, 410899, 351804, 279512, 78293, -54195, -39821, -62595, 131131, 130407, 377464, 231644, 159289, 102556, -11918, 103452, 128649, 116278, -217004, 271130, 359713, 138337, 303855, -20791, 5012, 10536, 401216, -5222, 166274, 420023, 113771, 209615, 36640, 382918, 19114, -525, 118761, 347614, 297284, 411753, 128248, 269409, 333789, 162815, 329191, 262059, 84768, 219369, 525793, 404055, -127253, 333293, 532579, 266008, 209792, 324679, 148458, 508500, 405197, 563150, -74592, 214000, 414219, 220529, 573845, 93272, 112808, 332743, 234601, 298058, -34233, 306926, 504102, 441696, 147989, 333552, 47539, 329195, 296235, 374820, 225688, 277353, 236660, 143020]
14922A43020K07475G5444L99781A4654L53303A15298J86343A5839M9963J32682
14912A98484K7586N4008A36456J40729j09316J10795J04613m6291j6971j18868
14902B01147J14274K06224P7794k24753R8605j69697G7278K04078n582E7161L3714
14891I0875e705A28118O75552k79655j06882A66354N6784j02024L37874j67169
14881B91819N2811N9267B682N2974L48136p99K50052l4091M7838C11846J85834
14870D97680a7259F8709M00085j85902J36384A08971J83301M40657l62849M931
14860C75011K29696B09016e4216G12338j95087J10532A89436K30544j25903A23146
14849C73365j02995K45708k53663K86950I8165K48113O9773A92386L22405B35357
$$ y = [143020, 350495, 75444, 475225, 14654, 367957, 115298, 301641, 15839, 65802, 198484, 226070, 280078, 136456, 277185, 167869, 278664, 383277, 336986, 320015, 201147, 315421, 521645, 599439, 374686, 473291, 303594, 77278, 281356, 275774, 57161, 90875, -5705, 128118, 803670, 524015, 417133, 166354, 223138, 121114, 458988, 291819, 344630, 403897, 2682, 55656, 403792, 402993, 653045, 618954, 666792, 311846, 497680, -17259, 68709, 468794, 282892, 419276, 108971, 292272, 732929, 370080, 375011, 604707, 209016, -54216, 712338, 517251, 627783, 189436, 419980, 294077, 123146, 373365, 270370, 516078, 262415, 549365, 98165, 346278, 416051, 192386, 514791, 235357]
14838C29895q988L02387k00199j99211p7306k584O0902K17521j09927J62642L2216
14827E07348k11721K59876k25471L2726K08949o2510k28807L95152A07644L58433
14817D66077B29218K95435L1552l2438F7779L70387Q9251k9216A11415L02882
14807D14297M864j1503L0770n5340K26276j62317j02231J80238j72656J0912L68724
14796G32034B87044J41947H6280L66922J19053j30p3750m4365q9392K02536O9343
14785F36497J43010k78248A84835M22512j78728O8821j27233K66930j90243J49923
14775E96817j47502K89748k774O7210j18772j37730K26785l81365J31486k55364
14765B68539M27759J46577B26141K58829l0463K51658l13508K04914N5593r7542
$$ y = [329895, 320907, 623294, 423095, 223884, 146578, 143994, 204896, 422417, 312490, 475132, 507348, 295627, 555503, 330032, 362758, 571707, 509197, 280390, 675542, 107644, 466077, 229218, 524653, 556205, 523767, 67779, 438166, 527417, 498201, 111415, 414297, 419161, 407658, 438428, 383088, 609364, 447047, 344816, 525054, 352398, 363310, 732034, 287044, 428991, 86280, 453202, 572255, 572125, 498375, 454010, 364618, 567154, 636497, 779507, 501259, 184835, 607347, 428619, 497440, 370207, 637137, 446894, 596817, 449315, 739063, 736289, 803499, 684727, 546997, 773782, 392417, 523903, 268539, 696298, 842875, 226141, 484970, 454507, 706165, 392657, 597571, 653164, 555622]
14755E55622B76024M64782k67391K01364j01596L86480m28474K04793j81569J40445
14745F94858j29013j00286O1971L69546j92903O8199k7185P6093k57425K59001
14735H22856q5513L16255m43180J710n6190K35882n2938r7966J92496o9989j98162
14724E65261j04595N0330K02545k5699J63401k82344L22333n2771k28301Q0815
14714F90975P908J3379J63716q2801j45748J15914J82999p0105j7392k88720B57024
14702G10778Q6050j41655J88317N10779m88960p5416j37020K31698M6019k97478
14692F33112N6268L8029l59612O28305j10493J03951K0808k82996J91400k53245
14682F65527K92593k55478j13078M51992q319m09679K53058k57703M35889j7006
$$ y = [555622, 276024, 740806, 473415, 674779, 573183, 959663, 531189, 735982, 554413, 694858, 565845, 465559, 527530, 897076, 704173, 772372, 745187, 821280, 563855, 822856, 737343, 1053598, 610418, 612128, 555938, 791820, 738882, 640916, 833412, 763423, 565261, 460666, 510996, 713541, 687842, 851243, 568899, 891232, 838461, 610160, 690975, 698883, 712262, 875978, 793177, 647429, 763343, 946342, 876237, 858845, 570125, 257024, 710778, 796828, 655173, 843490, 1354269, 865309, 789893, 652873, 884571, 930590, 633112, 689380, 727409, 367797, 996102, 885609, 989560, 1010368, 727372, 918772, 665527, 958120, 702642, 589564, 1041556, 1033237, 623558, 876616, 618913, 1054802, 1037796]
14672A037796P5382l9309l64724M55363l41853J72995L06168j71995j26497l21573
14662F81753L10975l22309K47891R0954l09433L65239o9354N1552l30863N59323
14652A275728K5629n50744L87004J68501k67476o446j20384j04365L55121O5190
14642A227758J43716m31955J96310M02730l73923q1602j86894K04554m6150L74176
14632A428720j24384k29716q40L58107j0056l95393R5739R6681j16071K72863
14622A375650j11821n869J27633k40936q1114J14152j40978L22516j45807k12358
14612A001068P63621l04279m33850Q89443m89940J06312k83049L35328r5238j2525
14602A476891Q7703o7318j76669K93066k30558j16240K76395N7740j42112p7190
$$ y = [1037796, 1113178, 1073869, 709145, 1164508, 822655, 995650, 1301818, 1129823, 1003326, 681753, 992728, 670419, 918310, 1009264, 699831, 1065070, 995716, 1047268, 716405, 1275728, 1301357, 750613, 1137617, 1306118, 1038642, 1032196, 911812, 807447, 1162568, 1227758, 1371474, 939519, 1135829, 1538559, 1164636, 1083034, 896140, 1100694, 1054544, 1428720, 1304336, 1074620, 1073780, 1431887, 1421831, 1026438, 1122177, 1218858, 1102787, 1375650, 1263829, 1257960, 1385593, 1144657, 1063543, 1177695, 1036717, 1359233, 1213426, 1001068, 1764689, 1460410, 1026560, 1916003, 1426063, 1532375, 1249326, 1584654, 1489416, 1476891, 1564594, 1497276, 1320607, 1613673, 1383115, 1266875, 1543270, 1601010, 1458898, 1381708]
14592A381708J93757K25426j60870M7644j04812j26923j22593J81196K75462k6068
14582A763927j86729N3066J78267j15433K87310l28199K04346m6612M9069j37189
14572A721823P5883o5612k14517M16344J41574l39952L44379q8990J16620l11093
14562A796459K49983K26260q2543j05649n2293K05197j76031J05670M3175j13
14552B210115J99482k6578j51715J76931P3995K73011k8994J87380J16744M20205
14542C450576k15435O11411N8276N86837N2495R59364Q88793J481271K428897
14533A0302485L786804O082882J2225186J811382j4113000q805430m508989k233674
14525D547646o24313r81963j11888k77347m66961K53330k09183k08404L21696
$$ y = [1381708, 1575465, 1800891, 1640021, 1687665, 1582853, 1455930, 1333337, 1514533, 1789995, 1763927, 1577198, 1630264, 1808531, 1693098, 1980408, 1652209, 1856555, 1809943, 1859012, 1721823, 1797706, 1732094, 1517577, 1933921, 2075495, 1735543, 2079922, 1990932, 2107552, 1796459, 2046442, 2272702, 2190159, 2084510, 2032217, 2237414, 2061383, 2167053, 2210228, 2210115, 2409597, 2383019, 2231304, 2408235, 2482230, 2755241, 2726247, 2913627, 3030371, 3450576, 3235141, 3846552, 3904828, 4491665, 4544160, 5503524, 6392317, 7873588, 10302485, 14089289, 20172171, 32397357, 34208739, 20095739, 11290309, 6781320, 4547646, 3923333, 2941370, 2829482, 2552135, 2085174, 2338504, 2129321, 1920917, 2242613]
14516B242613K35403n13885M36415j19159K39523k78250L53475m72932N00983
14507B624186q8528k21904L18958l5303m1795r1548L18029l82391L41617j42190
14497B599131r5512L12304J57399m40436N49788l0335P4269k46436q9230J46897
14487B937839J20810j61949M61181o6395k1399L21027m00553J20845j29371K86815
14477C468850j77714o3643K96502n4659o4580J97129J78182j66432M35611j03565
14467C945681j43647j67360J44563P621K01851J54168l96428J76984L53357K0615
14457D297405j98071K08087n3254J2890j4119K22239j38084L23075J68956k61757
14447D567367M42833J81668n36871L2732K74133J2076J17532j86463L03510J88016
$$ y = [2242613, 2478016, 1964131, 2400546, 2281387, 2520910, 2242660, 2596135, 2123203, 2624186, 2535658, 2313754, 2632712, 2597409, 2555614, 2464066, 2782095, 2399704, 2741321, 2599131, 2503619, 2815923, 2973322, 2532886, 3082674, 3052339, 3126608, 2880172, 2790942, 2937839, 3058649, 2896700, 3357881, 3291486, 3270087, 3591114, 3190561, 3311406, 3182035, 3468850, 3291136, 3227493, 3523995, 3469336, 3404756, 3601885, 3780067, 3613635, 4049246, 3945681, 3802034, 3634674, 3779237, 3786858, 3988709, 4142877, 3746449, 3923433, 4276790, 4297405, 4099334, 4307421, 4254167, 4267057, 4252938, 4475177, 4337093, 4660168, 4829124, 4567367, 5010200, 5191868, 4654997, 4687729, 4961862, 4973938, 5091470, 4905007, 5208517, 5396533]
14437E396533J21912m4811k5985K24937J2208K18465j37663j38522K57369J92167
14427F076610K29721k5703j8533L8022K12012N7065J96453m33062J85253N37777
14417G055615M775K31963m0542K19228n10096M95734n1417P6817J74778L17450
14407G974305o3587L25916R5171j13544K81000O6024J13915K3481n2343N45413
14397I195751K73664j49585J41923L00764J8005n0511L83927J77766L7578J03972
14387A0433254M37939p7742K29737K35401L04068L21942j69880L6021K30087L55765
14377A2336592j22226O21841L11904J19815J44710L04647J03364M87263K23397
14368A4531307M48662j61569P36567m7174P28969l9222K15840L13468O84730K21814
$$ y = [5396533, 5518445, 5473634, 5447649, 5672586, 5684794, 5903259, 5765596, 5627074, 5884443, 6076610, 6306331, 6280628, 6262095, 6300117, 6512129, 6569194, 6765647, 6332585, 6517838, 7055615, 7060390, 7292353, 7251811, 7471039, 6960943, 7456677, 7405260, 7482077, 7656855, 7974305, 7910718, 8236634, 8331805, 8218261, 8499261, 8565285, 8679200, 8702681, 8650338, 9195751, 9469415, 9319830, 9461753, 9762517, 9780522, 9730011, 10113938, 10291704, 10329282, 10433254, 10871193, 10793451, 11023188, 11258589, 11562657, 11884599, 11714719, 11750740, 11980827, 12336592, 12214366, 12836207, 13148111, 13267926, 13412636, 13717283, 13820647, 14307910, 14531307, 14979969, 14818400, 15554967, 15507793, 16236762, 16197540, 16413380, 16726848, 17411578, 17633392]
14358A7633392K43136M07910L50290M36777R4224O32187O03554M42502R6605N32061
14348B1472638Q45584M12993N67908M30289M19421K24851Q20950J136057J13363
14339B6444054Q59113M22505O90019P73952O52556R24338Q88401L85670J024544
14330C3065152Q45120R79295R37592J173213P54691P72730J507642J011608J116901
14321D2163944J378456J590356J392354R41760J574858J465652J937216J512064
14313E3956660J683145J883604J571471K278340K159698K046238K526578K596172
14305G0701906K588495K544070K675950L195267L265435L196084L879125L290051
14297I5336383L862100M251687M334617M778683M956314M860598N370806O191779
$$ y = [17633392, 17876528, 18284438, 18634728, 19071505, 19165729, 19797916, 20401470, 20843972, 20940577, 21472638, 22318222, 22731215, 23299123, 23729412, 24148833, 24373684, 25194634, 26330691, 26444054, 27303167, 27725672, 28415691, 29189643, 29842199, 30766537, 31654938, 32040608, 33065152, 33910272, 34889567, 35827159, 37000372, 37755063, 38527793, 40035435, 41047043, 42163944, 43542400, 45132756, 46525110, 47466870, 49041728, 50507380, 52444596, 53956660, 55639805, 57523409, 59094880, 61373220, 63532918, 65579156, 68105734, 70701906, 73290401, 75834471, 78510421, 81705688, 84971123, 88167207, 92046332, 95336383, 99198483, 103450170, 107784787, 112563470, 117519784, 122380382, 127751188, 133942967]
14289A33942967N560099O796892P175427O842650P805546Q184502Q498544Q792311
14281A93598938R381196J0345850J0804947J1238410J1666594J2289725J2601374
14274B71927034J3276037J4201158J3840116J4416940J3740824J3614603J2884704
14267C67901416J3058986J2769124J1948568J0980854J0018062R633059Q623530
14260D44933599P480691N193854K057284J602371J979466P26091m319462p740556
14252D51913338o821116r043319j1239843j1322270j2745101j3006430j4645372
14245C73089887j4491942j5369425j4944714j5009462j4415212j3724514j3824871
14238B71309747j3852201j3257765j2529143j1924674j1767474j0518516j0191099
$$ y = [133942967, 139503066, 146299958, 153475385, 160318035, 168123581, 176308083, 184806627, 193598938, 202980134, 213325984, 224130931, 235369341, 247035935, 259325660, 271927034, 285203071, 299404229, 313244345, 327661285, 341402109, 355016712, 367901416, 380960402, 393729526, 405678094, 416658948, 426677010, 436310069, 444933599, 452414290, 457608144, 459665428, 461267799, 463247265, 463973356, 459653894, 451913338, 445092222, 436048903, 424809060, 413486790, 400741689, 387735259, 373089887, 358597945, 343228520, 328283806, 313274344, 298859132, 285134618, 271309747, 257457546, 244199781, 231670638, 219745964, 207978490, 197459974, 187268875]
14231A87268875q872311q948539q152128p583330p225192o637031o944739n720671
14223A27184934n610561n220977n177473m599387m475440m175536l947856l565698
14215I0412006l431068l314097l181854l142301k786179k951671k387569k768756
14207F6448511j915430k617422j913157j670960j901439k259449j427200j840364
14199E0903090j357345j288845j611083j317676j141063j562518j326328n69723
14191D0728509j037319j402259r58762j203545j241684m75653n99978j314844
14183C2494465n83111j122153l33481q66737o91328q35272p62241o89479o65878
14174B5944785m57172n42588o04265l66300q99543l16714n43809n33857n75266
$$ y = [187268875, 178396564, 169448025, 161295897, 153712567, 146487375, 139850344, 132905605, 127184934, 121574373, 116353396, 111175923, 106576536, 102101096, 97925560, 93977704, 90412006, 86980938, 83666841, 80484987, 77342686, 74556507, 71604836, 69217267, 66448511, 64533081, 61915659, 60002502, 58331542, 56430103, 54170654, 52743454, 50903090, 49545745, 48256900, 46645817, 45328141, 44187078, 42624560, 41298232, 40728509, 39691190, 38288931, 37330169, 36126624, 34884940, 34409287, 33809309, 32494465, 31911354, 30789201, 30455720, 29588983, 28897655, 28062383, 27300142, 26610663, 25944785, 25487613, 24945025, 24340760, 23974460, 23074917, 22758203, 22214394, 21680537, 21105271]
14165B1105271m54763m44593r2370n32690n44072j78947m69033k84978k03273
14156A7900552m02259m77612l54772p9893l82930l13503n13129R1539l16803n92607
14146A4558583j6742n48244J24901k82988r7055j34172o07119l60033J67233m07855
14136A2396509m2497j86030m57098R9730m6867m97764j17671o1330l27186L30900
14126A1090696n16106m2793m33554k39422J24786j03313j73681j46452m08168
14117I151993K40073j17802o74881M87718j88332m97354j70681L43912m39970
14108H134676J83224L9365n80774k81154K47814k69626O2316q5111o0484N496
14098G395742O0310m03777O5214j37312n905m02116J09358K68555k95213o34353
$$ y = [21105271, 20650508, 20205915, 20113545, 19580855, 19036783, 18857836, 18388803, 18103825, 17900552, 17498293, 17020681, 16665909, 16586016, 16203086, 15889583, 15376454, 15467993, 15151190, 14558583, 14541841, 13993597, 14118498, 13835510, 13738455, 13604283, 12997164, 12637131, 12804364, 12396509, 12354012, 12167982, 11710884, 11810614, 11763747, 11265983, 11148312, 11086982, 10759796, 11090696, 10574590, 10531797, 10098243, 9858821, 9983607, 9880294, 9706613, 9560161, 9151993, 9392066, 9274264, 8599383, 9087101, 8898769, 8401415, 8230734, 8574646, 8134676, 8317900, 8357265, 7776491, 7495337, 7743151, 7473525, 7535841, 7450730, 7390246, 7395742, 7456052, 7052275, 7117489, 6980177, 6974272, 6572156, 6681514, 6950069, 6654856, 6020503]
14088F020503L0561M00710l13339J17844K81776o15850q1915M8101l25712q7589
14078E475090K52122N3067M0099o67435L88684j59870n2166k91641J80630J28245
14068E346825k79384j40935K92671j77095o2215j76730l700l86362L91283j29178
14058D675180k13738K38404p0911j89600K53373j87522j94358K4693K91576j32239
14048D494858q6011k70828k00954M72327m01016K66255k414k74537J79008m44167
14038C732521K10940j24244m5689m3072O4865k88981J99196r2975q0646k6265
14028C505650j0551j96322R8017k76705K04358m6531l56749L84048O2614l68195
14018B999634J99728J17561Q6719k87073p5249k0067Q0594J1694O0422p2772n51273
$$ y = [6020503, 6051064, 6451774, 6138435, 6256279, 6538055, 5922205, 5840290, 5888391, 5562679, 5475090, 5727212, 5780279, 5820378, 5152943, 5541627, 5381757, 5329591, 5037950, 5218580, 5346825, 5067441, 4926506, 5219177, 5042082, 4979867, 4803137, 4799437, 4413075, 4804358, 4675180, 4461442, 4699846, 4628935, 4439335, 4692708, 4505186, 4310828, 4335521, 4627097, 4494858, 4408847, 4138019, 3937065, 4409392, 4008376, 4274631, 4272217, 3997680, 4176688, 3732521, 3943461, 3819217, 3773528, 3730456, 3795321, 3506340, 3705536, 3612561, 3531915, 3505650, 3495099, 3298777, 3396794, 3120089, 3324447, 3277916, 2921167, 3305215, 3367829, 2999634, 3199362, 3316923, 3403642, 3116569, 3041320, 3021253, 3101847, 3113541, 3173963, 3101191, 2549918]
14007B549918K92781j72845q842k17041L57183l21087M87891l64760j3135J88974
13997B779037l85664J16013L05607k21204l6521J23263O6902l00057j28120N16414
13987B835670m43411L23104m32703K71945L0149P760k8043K88903J30679j4162
13977B969891N47186O23946J121002J480829K588192N261863J1960855P684966
13969C4238730j1433590q025575n038195k368202j459481j126521l09407p56269
13961C721490p2851n94607J77020m47829j67970J04361k34375K71254k51121P0458
13951B575830k8315j24974R6830J35923n89269J03136J92314l07404J48004j19402
13941B082673K11177j53429p0327j23364r8699k1446L6649K18523O9489k87286
$$ y = [2549918, 2842699, 2669854, 2661012, 2443971, 2801154, 2480067, 2967958, 2603198, 2590063, 2779037, 2393373, 2509386, 2814993, 2593789, 2557268, 2680531, 2747433, 2447376, 2319256, 2835670, 2392259, 2715363, 2282660, 2554605, 2584754, 2592514, 2564471, 2853374, 2984053, 2969891, 3517077, 4141023, 5262025, 6742854, 9331046, 14592909, 26553764, 34238730, 22805140, 14779565, 9741370, 7373168, 5913687, 4787166, 4477759, 3721490, 3648639, 3054032, 3231052, 2783223, 2615253, 2719614, 2485239, 2756493, 2505372, 2575830, 2547515, 2422541, 2519371, 2655294, 2066025, 2169161, 2361475, 2054071, 2202075, 2082673, 2293850, 2140421, 2070094, 1946730, 1848031, 1826585, 1863234, 2081757, 2151246, 1863960]
13931A863960J34518J73164j67935l90241K64427o0280j55525P9242P7015k0968
13921A797377j93267K58136k79295P9305j56874K20588L0897m6841J14420r609
13911A814837k84991Q8741M6332J02596j82489J26391j44171j55827j8923J55360
13901A547856J16484J62001n07992R7039N5323j98501L77727j43471L03258m15127
13891A394597L74699j09178o5717K47657l39868j45650k13606K0093J29238J41799
13881A434064r3442P1085k3114L0536j55838j13697J82242k58793K09539q097
13871A274485k7593j03882K88150j49715K2712k73432j27077L35678k46424L28692
13861A321594q6925K25393l73621L49812k37594R8898K3339l73328M57296n01917
$$ y = [1863960, 1998478, 2171642, 2003707, 1613466, 1877893, 1817613, 1662088, 1741330, 1818345, 1797377, 1604110, 1862246, 1582951, 1662256, 1505382, 1725970, 1756867, 1710026, 1824446, 1814837, 1529846, 1618587, 1664919, 1767515, 1585026, 1711417, 1567246, 1411419, 1392496, 1547856, 1664340, 1826341, 1318349, 1415388, 1470711, 1272210, 1649937, 1506466, 1809724, 1394597, 1769296, 1660118, 1594401, 1842058, 1502190, 1356540, 1142934, 1163027, 1292265, 1434064, 1340622, 1411707, 1388593, 1419129, 1263291, 1149594, 1331836, 1073043, 1282582, 1274485, 1246892, 1143010, 1431160, 1281445, 1304157, 1030725, 903648, 1239326, 992902, 1321594, 1234669, 1460062, 1086441, 1436253, 1198659, 1297557, 1320896, 947568, 1404864, 902947]
13851I02947O40321l10190r7976J15493j45231J1213P7467j87884L53179j68964
13841A190375j31829K60018n9448k45123J02293k31365Q7800J18339J4326K55917
13831A361303j31066j07812r4927p6942n2534Q484J58276O9067q7250K36524k57710
13820A025413J15525k79048j22976Q3406O1417K86002o4390k75877L03074l8158
13810A094388j60228P949l04808L13078L74370l00714m45184L39260L742L11693
13800A233546q0948l169k61386l37419J16132L72943k61830j00138J28925L81872
13790A188528m59740K14256l64291L32711j06417P7006k81999M79506k90682J47338
13780I36216j17404j39245j05067M32950J274n04220K05005J00574m2505M6245
$$ y = [902947, 1543268, 1233078, 1135102, 1250595, 1105364, 1116577, 1194044, 1006160, 1359339, 1190375, 1058546, 1318564, 1259116, 1013993, 1116286, 884921, 972721, 1091060, 1105386, 1361303, 1230237, 1122425, 1027498, 950556, 898022, 906506, 1064782, 1133849, 1046599, 1283123, 1025413, 1140938, 861890, 738914, 822320, 883737, 1169739, 1105349, 829472, 1132546, 1094388, 934160, 942109, 637301, 950379, 1324749, 1024035, 578851, 918111, 921853, 1233546, 1152598, 1149429, 888043, 550624, 666756, 1039699, 777869, 677731, 806656, 1188528, 728788, 943044, 578753, 911464, 805047, 882053, 600054, 1079560, 788878, 936216, 818812, 679567, 574500, 1007450, 1008724, 504504, 709509, 810083, 767578, 813823]
13770H13823Q6986q4724l8152l6369O781N8646j31395O795K7541j32731J08983
13759F86184j1843J2356L4069q637j64716L28031k12619M9395J58110j94155J69672
13748H45847p3231j29521R3043k04252Q4421J35993j71857m8776m7628K42074
13738G26113k2394P1475j59300K01178J23587j68865j37065J42450j46178j18174
13728E12827k5921K2744k2759r9257L40617p5817l2573K58767l64178J51344r1437
13717E74357m9231O8961L0586j72403L34283C34732K65541q7283p4415M8865k4519
13706D62921m9982N8720J89766J10654j24791j76126K16388C09531L10512J9087
13696F39130K21664C20979M26054k21034j7210K55981o9374k45429J95092k4302
$$ y = [813823, 900809, 816085, 777933, 741564, 748345, 806991, 675596, 682391, 709932, 577201, 686184, 674341, 686697, 720766, 712129, 547413, 875444, 662825, 712220, 870330, 676175, 845847, 772616, 643095, 736138, 531886, 616307, 752300, 580443, 531667, 484039, 726113, 703719, 775194, 615894, 817072, 940659, 771794, 634729, 777179, 631001, 512827, 486906, 509650, 486891, 387634, 728251, 652434, 619861, 878628, 514450, 665794, 574357, 525126, 594087, 624673, 452270, 786553, 334732, 600273, 512990, 438575, 487440, 462921, 412939, 471659, 661425, 772079, 647288, 471162, 687550, 309531, 620043, 639130, 860794, 320979, 747033, 525999, 508789, 764770, 695396, 449967, 645059, 620757]
13686F20757Q1819k83516L6771J4737Q0706K09891l65229M68141j28785l66010
13676C69282M66025l46159J82013j28454q1447j12846M33729B42740K88654R0380
13666F21774j3021j77622L9251l7228J51308j8898j53524J38588M8523J65420
13656G64571k38991J5766j71518L55297C16860N94983l31499O7244j67393J73890
13646F54085j48778J25557K3506j38687q7486p5033q0621J29323J42767k64210
13636B80423K19452B42983r6788O62758l41462J75476n4537l9189k31788A29455
13625E83923K5892N9434n7901J5467k5615j82057K23175B09722L25984B39702
13614D30515N6775o5747H7729N8871N39956k60630o7714J2797K03618A54648K48011
$$ y = [620757, 702576, 419060, 455831, 470568, 551274, 761165, 395936, 864077, 735292, 369282, 835307, 489148, 671161, 542707, 461260, 348414, 782143, 242740, 531394, 621774, 608753, 431131, 470382, 433154, 584462, 565564, 412040, 550628, 599151, 764571, 525580, 541346, 369828, 725125, 316860, 911843, 580344, 647588, 480195, 654085, 505307, 630864, 654370, 515683, 428197, 353164, 272543, 401866, 544633, 280423, 499875, 242983, 146195, 808953, 467491, 642967, 588430, 549241, 317453, 129455, 583923, 609815, 669249, 611348, 626815, 601200, 419143, 642318, 209722, 535706, 239702, 430515, 487290, 421543, 87729, 146600, 686556, 425926, 358212, 371009, 574627, 154648, 402659]
13603D02659Q1277l4207Q0950B28921K75683n6226K18066j75988j08989J07736
13593D89203J33656k39797A08968L46451C2992O16869k52974j67816K04653K89877
13583G23601k31814M4800H1241M88170j98681n3966J13551Q5578j68545J40374
13573D87722J0957A05822M73592j19984j8653J46906j943r2948k08863O887j30998
13562A59818L0288J81414K17568B47604L73971c0633H00467B95195J46146P1717
13552E13058B23910E5443M47644K24864k08798o9742j09010O7366j07643k1143
13542B78981D7621M15752n6411j35222n6537J39506K6856A50531J09613K64597
13532E24741K0130j65030j05990K11813L2908B31390R4733P7351j43190N835p8906
$$ y = [402659, 483936, 449729, 530679, 228921, 504604, 448378, 666444, 490456, 381467, 489203, 622859, 383062, 108968, 455419, 32992, 649861, 396887, 229071, 433724, 723601, 491787, 536587, 81241, 569411, 370730, 316764, 430315, 515893, 347348, 487722, 498679, 105822, 579414, 459430, 440777, 587683, 585740, 492792, 283929, 290816, 159818, 190106, 371520, 589088, 247604, 621575, -30633, 800467, 295195, 441341, 513058, 223910, 55443, 503087, 727951, 519153, 449411, 340401, 407767, 300124, 278981, 47621, 463373, 406962, 271740, 215203, 354709, 381565, 150531, 260144, 524741, 544871, 379841, 273851, 485664, 518572, 231390, 326123, 403474, 260284, 266119, 187213]
13521A87213L33752A49078M03895n8279N3510G1483B1185N11795A42629Q5232
13511B27861m3867J48089n2279L52843k95483o4722L1946M713K21197j84968A62925
13499F49096A49845O4039L85069k32618q9903n0448l6111N3113j05994K3712O2325
13488B23029J47871r9793K3641N161P2961E0872J11283J82027j65720q6875J82137
13477B73724A26615J91639n7687l9374J4489K60759K572A90054O803K04275A84620
13465D16916n3904A49357J68813N5505J8883G4367M66234k31478K7159R6293J39172
13454E71747k83135G8786K85019k1056H0735N8243m7668O8618L99618A60807M650
13443A65457h0982C49134A33388P4969J63748m0567j14392J36584B6726L52210
$$ y = [187213, 520965, 149078, 552973, 494694, 548204, 71483, 21185, 532980, 142629, 227861, 183994, 332083, 279804, 632647, 337164, 272442, 304388, 309101, 530298, 345330, 162925, 649096, 149845, 213884, 598953, 366335, 276432, 225984, 189873, 242986, 136992, 160704, 223029, 370900, 271107, 294748, 299909, 372870, 50872, 162155, 344182, 178462, 91587, 273724, 126615, 318254, 260567, 221193, 235682, 496441, 499013, 190054, 196857, 401132, 184620, 416916, 363012, 149357, 318170, 373675, 392558, 74367, 540601, 309123, 336282, 432575, 571747, 288612, 78786, 363805, 342749, 80735, 138978, 91310, 159928, 559546, 160807, 165457, -80982, 349134, 133388, 208357, 372105, 331538, 217146, 353730, 26726, 378936]
13433C78936H2400M78738B27945L4161A22538J78564R2739j23328J3353P3846
13423C57712j7427H6796C3146R1083K03618a1495B16188a03553A9861j244J85607
13412B04224E0273N2611L27461a5053C77620I6614M87767B32398F5366J52635
13402B18001n7075P4356A3347K48058E5809J56056n7329l3673K42467l3924k9080
13391C00326j32550K50700A70340r868J03868C5975M8209J67088Q2980c1629C9982
13379C10138k8862m0259B8020K70891p390j7177a4441F4846K64728j44396p0867
13368A14311A9954b07A69489j9873J34758J59086B8908K44560A34466m5506O178
13357I5138R9825r0487J47318b87326D9564K51365k6675A07436a26197B22342
$$ y = [378936, 82400, 561138, 227945, 262106, 122538, 301102, 393841, 270513, 283866, 357712, 340285, 86796, 33146, 124229, 327847, -11495, 216188, -103553, 19861, 18617, 204224, 50273, 102884, 430345, -15053, 377620, 96614, 584381, 232398, 65366, 218001, 160926, 235282, 13347, 261405, 55809, 211865, 154536, 120863, 363330, 329406, 300326, 167776, 418476, 170340, 160472, 264340, 35975, 84184, 251272, 334252, -31629, 39982, 310138, 281276, 241017, 28020, 298911, 291521, 274344, -14441, 64846, 329574, 185178, 114311, 19954, -207, 169489, 149616, 284374, 443460, 28908, 273468, 134466, 88960, 95138, 194963, 104476, 251794, -287326, 49564, 300929, 274254, 107436, -126197, 222342]
13346B98158o9823R1864J47095j49970m8800A11062K45032I4373L3626J21712
13336B49711r2913P1712A2153L17835J05896m7280j7321k764L9048j13485M3394
13325C37476r7516J33189g3057E57573k53686O3896J29164J1974G0332L50861
13315D21193A70555h2476B39147M9484m5543D6246K20575p7513J91979f935A10432
13303A46574M26444D7847K70058A54774J62677A03919L3553n2250i5566B62298
13292A18127D3325L04011L05731G6303l7862N42725k48428A05223a4257r5414
13282a09671C44147J92182B15402R8843a0018C66169F8141K03360J0080j6051
13272B65530q1878g1443j8521D361f7033A61091A6998N9864i5300B78014m0780
$$ y = [298158, 228335, 320199, 467294, 317324, 268524, 111062, 356094, 94373, 127999, 249711, 156798, 228510, 12153, 329988, 435884, 388604, 371283, 368519, 407567, 294082, 337476, 239960, 373149, -73057, 557573, 303887, 367783, 496947, 508921, 70332, 421193, 170555, -82476, 239147, 288631, 243088, 46246, 266821, 189308, 381287, -6935, 110432, 146574, 573018, 47847, 317905, 154774, 317451, 103919, 137472, 85222, -95566, 262298, 118127, 43325, 347336, 653067, 76303, 38441, 581166, 332738, 105223, -14257, -109671, 344147, 536329, 215402, 314245, -10018, 366169, 68141, 271501, 281581, 265530, 183652, -71443, -89964, 4361, -67033, 161091, 16998, 76862, -95300, 278014, 237234]
13261B37234J02196g9408B17923b98059A64642p4988K10753F5255b72667A13168
13250B61182o9877H5796J45967R1368o886D8671J70144F771a4329A672a02761
13238C87368a19066H0417K01513j18844h2946D16836j82147g6231A61408K29466
13228C90874c8373A78151f6642A48040c00711B74169a66242p9993a14468B85525
13217A31890d5703l02217A81093M222J38985d2777A27893b10241E0281b38129
13206c9550I5263a00333A38047P4379D5845b27507B51273J95710f1046H9849J14699
13195B04548q6523j9921L35962b9276C2227P7831N6909H3178M8508n2041K20672
13184C00317a46490B77873j13085J90824A71018P081f5124l302A19604O1841J5153
$$ y = [237234, 339430, -79408, 217923, -298059, 164642, 89654, 300407, 65255, -272667, 113168, 261182, 191305, 85796, 231763, 323131, 316245, 48671, 218815, 6771, -14329, 1672, -102761, 387368, -119066, 80417, 281930, 163086, -82946, 416836, 234689, -76231, 161408, 390874, -38373, 178151, -66642, 148040, -300711, 274169, -166242, -246235, -114468, 285525, 131890, -45703, -347920, 181093, 185315, 324300, -42777, 127893, -210241, 50281, -238129, -39550, 95263, -100333, 138047, 212426, 45845, -227507, 251273, 446983, -61046, 89849, 204548, 118025, 98104, 434066, -29276, 32227, 110058, 166967, 83178, 131686, 79645, 300317, -146490, 277873, 164788, 355612, 171018, 178099, -65124, -68426, 119604, 181445, 196598]
13173A96598k4493n2341J42508f319B02643J1366g5493A40232N3034O289N1781
13162B51336j17187i874B76977c5643j49422A08597M1583J19848A29669L003K70077
13151D02749A82353K043i2323B82150F8765a65174Q583e5170p660D49762j78149
13140B71613C0730f4231C02562F8891N6017c9016B36983O477b3299C71446b25672
13128f5082A65711J23892b6601A33326o0005M57394B19520o6255a74903b9788
13117F1260J82897m7222J3933J1130K1385q6694i0650m385c9582C6211b0934A20902
13104c5207A65059O1795L0091P503j25431J7371J25910g7855G989c9486B92517
13092e0100o9267B76807D1641K33178k7577c4382B46639j6270i6704C48478j53671
$$ y = [196598, 172105, 119764, 262272, -6319, 202643, 214009, -75493, 140232, 193266, 199555, 251336, 134149, -9874, 276977, -35643, -185065, 108597, 150180, 270028, 129669, 132672, 402749, 182353, 184396, -92323, 282150, 68765, -165174, -156591, -55170, -62830, 449762, 271613, 30730, -64231, 302562, 68891, 124908, -39016, 236983, 243460, -23299, 371446, -225672, -65082, 165711, 289603, -26601, 133326, 73321, 530715, 219520, 153265, -174903, -29788, 61260, 244157, 196935, 210868, 221998, 243383, 156689, -90650, -95035, -39582, 36211, -20934, 120902, -35207, 165059, 226854, 256945, 264448, 139017, 156388, 282298, -77855, 7989, -39486, 292517, -50100, -119367, 276807, 41641, 274819, 247242, -34382, 246639, 230369, -96704, 348478, 194807]
13081A94807J38213H4507a21306A91331d3731F1321R2092F0237J54421a79592
13070D33391F5515c03191B43156n3704C8478K30201b33114e1684r5146J9159B82885
13058e1504B05746E1263L70928I9178l8843J29191d6160B34247p5863r127K00547
13047C49804j51718i1779q1247C2675K84415F2945j1535a44602A41228o8852g2156
13035B40610n9826p7162b10926b8145k7017A50763a82775A94817j7533h7569E1349
13023C16632J38156P4943I7816Q7781B5771K15920G1810Q6972a61817E1246L33827
13012C85073j88561n0393D9088Q4474J52702A08902N5480J96425j2366f7566a4623
13000A22921d3883C63719N0051G1173B9459j4013O3460a29184b354B29129A12952
$$ y = [194807, 333020, 84507, -121306, 191331, -43731, 61321, 153413, 60237, 214658, -179592, 433391, 65515, -303191, 243156, 189452, 38478, 268679, -233114, -51684, -146830, -127671, 282885, -51504, 205746, 51263, 422191, 99178, 60335, 189526, -46160, 234247, 158384, 149257, 349804, 198086, -91779, -173026, 32675, 317090, 62945, 51410, -144602, 141228, 72376, -72156, 240610, 180784, 103622, -210926, -28145, -55162, 150763, -182775, 194817, 177284, -87569, 51349, 316632, 454788, 529731, 97816, 185597, 25771, 241691, 71810, 158782, -161817, 51246, 385073, 196512, 146119, 49088, 133562, 286264, 108902, 164382, 360807, 348441, -67566, -14623, 122921, -43883, 363719, 413770, 71173, 29459, 15446, 78906, -129184, -2354, 229129, 112952]
12988a12424A32174b9721E77495B40699n8534F686a75668B21542B3035a74047
12977a73415A8565L43057A29743F1496M06781k32768f1650q3801A23275M5807
12967A69082B6422J77937b41426c3276F4435K9474J5551r225C6570K01137g4568
12955a18134J0922p6158J5062P3560E9315J29324g625F6661c84960A70064E185
12943b1837k294e386n0114A61255F1752J02668F5353M1150n2662K87817A67225
12931H5944J12026b39869B58975B3690M9304A1191K48861a88369N5364A08336
12920a9168A26685J26150a0926A858f143k31946B37016P0771a95041N7285C569
12908A05538e8220I3131H424K9897F189a43705G1719J52405H6076L07155a41124
$$ y = [-112424, 132174, -29721, 577495, 240699, 182165, 6686, -175668, 221542, 23035, -174047, -173415, 18565, 361622, 129743, 61496, 468277, 235509, -61650, -145451, 123275, 169082, 26422, 204359, -241426, -33276, 64435, 93909, 109460, 100235, 36570, 237707, -74568, -118134, -107212, -183370, -168308, -94748, 59315, 188639, -7625, 66661, -384960, 170064, 5185, -21837, -24131, -5386, -55500, 161255, 61752, 164420, 65353, 106503, 53841, 341658, 167225, 85944, 197970, -239869, 258975, 23690, 72994, 11191, 260052, -188369, -133005, 108336, -19168, 126685, 252835, -10926, 1858, -6143, -238089, 237016, 307787, -195041, -137756, 3569, 105538, -58220, 93131, 8424, 38321, 6189, -143705, 71719, 224124, 86076, 393231, -141124]
12896B87578C5192J4617h182j03426G3867M67O065b2206C2303K34448a50370G8783
12883H1205M549e7648A99714f4288l1423C93848j55287a08431A02708O0286o0102
12872A02892a18881A28271C0698L8800e2709A45763J16566a09272K5594E7897
12861a52670A63314a68667I300c7380A41501b11544i8738I9087q257B8923J10841
12850A39764J72628a61034d5580B52590b29247O8301c0958j73984B71174k0205
12840B50969K89701A24746a46156D2151b9154C02512B9541K68527A00046R7137
12830A97183B0556c9715P727E8393P4885a3920A47203o363R2493J01401a28064
12818i8057j94707B27129d1960o6470B8002L756J4741a58131E7222h5881A52487
$$ y = [287578, 35192, 49809, -8182, -111608, 73867, 74334, 80399, -22206, 32303, 266751, -150370, 78783, 81205, 85754, -57648, 199714, -64288, -95711, 393848, 238561, -108431, 102708, 162994, 102892, -118881, 128271, 30698, 69498, -52709, 145763, 262329, -109272, -83678, 57897, -152670, 163314, -168667, 9300, -37380, 141501, -211544, -98738, 99087, 90830, 28923, 139764, 312392, -161034, -45580, 252590, -229247, -160946, -30958, -204942, 271174, 250969, 540670, 124746, -146156, 42151, -29154, 302512, 29541, 298068, 100046, 197183, 20556, -39715, -31988, 58393, 133278, -13920, 147203, 140840, 233333, 334734, -128064, -98057, -292764, 227129, -41960, -108430, 28002, 31758, 46499, -158131, 57222, -85881, 152487]
12806A18730a72000A92126g0917A39587p166n8603b2958G7134j6930J10583c5877
12794A94687L6728a8167q2650L7103b1276D7102o845l259G419a78593N8797H2097
12781C1080K0881c4843A17962b54377M2451h7241A91024A6817c92793J46082A7527
12769A04209b26527A36805d8585k7004h969k15610D7238b0199l1625C34038F1542
12757a66924F9076J61770B4067M77030g1229A33462F6354e1168B83233I0950a89873
12745C2333i9715B3940K4918a8043A70622Q1958c9018A80204o9474Q7728B7282
12733a33398C68823F7435e7592C3366a41978G3031j7812H209J25349g2818o3789
12722a36607H1849K1298K7442L36253A08131A7435O7569k972J28445P181b98845
$$ y = [118730, -172000, 192126, -70917, 139587, 132421, 73818, -22958, 77134, 60204, 170787, -35877, 194687, 231415, -18167, -100817, -63714, -21276, 47102, 40257, 36998, 7419, -178593, -119796, 82097, 31080, 51961, -34843, 117962, -254377, -211926, -87241, 191024, 16817, -392793, -246711, 17527, 104209, -226527, 136805, -48585, -75589, -8969, -224579, 47238, -20199, -51824, 334038, 61542, -166924, 69076, 230846, 24067, 501097, -71229, 133462, 66354, -51168, 283233, 90950, -189873, 32333, -99715, 23940, 48858, -18043, 170622, 252580, -39018, 180204, 110730, 198458, 27282, -133398, 368823, 67435, -57592, 33366, -141978, 73031, 55219, 8209, 133558, -72818, -136607, 81849, 103147, 130589, 466842, 108131, 17435, 85004, 82032, 210477, 217658, -298845]
12710A34314j1254I445K84399H0263a61431J6541J6929C64791p2881A00904a51470
12698A14571I008L8772J8476K1054C5930K90699j24556l0270n4951n2156J33786
12687A98482E2197d8637I9102L43999E4013K08771d1212a6868k71582G8854O8841
12676A47695K01208J65558A1281J51986J49350n2089F7386h4376C854L6239J05897
12665A45990e3794k1885B66757J44347A00091K0276Q6516e3512E57584F6924C160
12653A29892J44034g2206j09878B1094K20818a76482H2813J48448A00886a27614
12642C44050m9977A45135R6058I687L03302a14537A11028m5549J96837j03309
12632A59007b8713D77644F3694K11430r2848Q3045E9176c3014m5968j30403B34484
$$ y = [134314, 123060, 9445, 293844, 80263, -161431, -144890, -127961, 364791, 291910, 100904, -151470, 114571, 9008, 47780, 66256, 87310, 35930, 326629, 202073, 171803, 116852, 64696, 198482, 52197, -48637, 99102, 443101, 54013, 262784, -41212, -16868, -288450, 78854, 147695, 348903, 514461, 11281, 163267, 312617, 260528, 67386, -84376, 3854, 40093, 145990, -53794, -75679, 266757, 411104, 100091, 120367, 206883, -53512, 557584, 66924, 3160, 129892, 273926, -72206, -182084, 21094, 241912, -176482, 82813, 231261, 100886, -127614, 344050, 294073, 145135, 241193, 9687, 312989, -114537, 111028, 65479, 262316, 159007, -28713, 477644, 63694, 275124, 182276, 265321, 59176, -33014, -78982, -209385, 234484]
12620g2862A69835Q0083O6269A37757Q5527p6050K02031d7018o0504B31759n5837
12609A75922i4052A57014J81434I4226J27565C1482K60230m9622D4664K7822k802
12598F9684i8308D25927E1084r214h2395A15276E088a49586B16777l1891B5395
12586C1632i3264r9947A58374A0729J03379K2410J27786E4092L9141a76278e4251
12574D6942N5222j2165g8525B1177J45695M7373k8017a76287C3690J58394C1829
12562B8816a38289B9439O0558K61543a72745A6884a97878G8515K05189O308G9087
12550i8435I9649d433k933A18168L32697f1932J0772A15992m9267a58592E80077
12538b5278B26694a58998O1873r1567I2550J06569I962J78593f1795a0716k32830
$$ y = [-72862, 169835, 249918, 316187, 137757, 223284, 147234, 349265, -47018, -107522, 231759, 175922, -94052, 157014, 338448, 94226, 221791, 31482, 291712, 242090, 44664, 72486, 69684, -98308, 425927, 51084, 41870, -82395, 115276, 5088, -149586, 216777, 184886, 25395, 31632, -93264, -193211, 158374, 10729, 114108, 136518, 264304, 54092, 93233, -176278, -54251, 46942, 102164, 89999, -78525, 21177, 166872, 214245, 186228, -176287, 33690, 192084, 31829, 28816, -138289, 29439, 89997, 351540, -172745, 16884, -197878, 78515, 283704, 290012, 79087, -98435, 99649, -4433, -7366, 118168, 450865, -61932, -51160, 115992, 66725, -158592, 580077, -25278, 226694, -158998, -97125, -188692, 92550, 199119, 9962, 188555, -61795, -10716, -243546]
12527b43546a20680J4026B4755g6832n4707B55017h6212n3697C56826j74131J20930
12516C03625a75458B67474f4570B36386P0877C7527J30673h4988A49049a52797
12505a94224G2466K29021g1784H0063f6750j01057M7001A28172M6964J05477D9079
12493A86928b20641A34934a11041j11872h1014c8698H1563L02968j11551b32885
12482a12899j14303d3658A15874N6004n7b6411A28885K74975i7826B39970b309
12470A1275K25a65176J2569n054H757a03928p8042A2950b56272j45540A1575J12515
12458A24090n5686c2842D9338a60395J2418b0143F4293d2471A60376b51510A6340
12446I2999K24463A41618J27485G1973J90226a18211A21599a49373A51865b61869
$$ y = [-243546, -120680, -106654, 24755, -76832, -131539, 255017, -86212, -139909, 356826, 182695, 303625, -175458, 267474, -64570, 236386, 307263, 37527, 168200, -84988, 149049, -152797, -194224, 72466, 301487, -71784, 80063, -66750, -167807, -120806, 128172, 175136, 280613, 49079, 186928, -220641, 134934, -111041, -222913, -81014, -38698, 81563, 384531, 272980, -232885, -112899, -227202, -43658, 115874, 171878, 171821, -26411, 128885, 403860, -97826, 239970, -2309, 11275, 11500, -165176, -152607, -157661, 8757, -103928, -181970, 12950, -256272, -401812, 11575, 124090, 68404, -32842, 49338, -160395, -147977, -20143, 64293, -42471, 160376, -251510, 16340, 92999, 317462, 141618, 269103, 71973, 262199, -118211, 121599, -149373, 151865, -261869]
12435a53446n373P9029K1521A4142h1591L3842B6062J85699b45845b2588k7470
12424e0058B280b61235h7169Q033B259a46875b9217H4059a3455q6738A7047K48770
12412B65817F6838a42947E4926N4415I363a59987j02779J19513j51102A56159
12401B1088J19381B3198M4520K02381G2389K5075D6605l541e1820H3703J8871
12390A02574Q4665a12415c1670A55533F4322k0134O9407J43947O9840a5426D6998
12378b36864B7996a8619p1779A41839B862b47520B77824a47385c801A70879c7622
12366C37932D9571b35930C64277b2342H3653b7999p6917C6660f3358A27721N921
12355A33642J40293a34271q3031d9962o3956k639E8399L4890D4002a9740m3310
$$ y = [-153446, -158819, -79790, -58269, 14142, -81591, -47749, 26062, 211761, -245845, -22588, -50058, 2280, -261235, -87169, -79136, 2259, -146875, -29217, 84059, -13455, -100193, 17047, 265817, 66838, -142947, 54926, 109341, 9363, -159987, -262766, -143253, -294355, 156159, 21088, 140469, 23198, 67718, 270099, 72389, 97464, 46605, 43064, -51820, 83703, 102574, 187239, -112415, -31670, 155533, 64322, 44188, 113595, 257542, 327382, -15426, 46998, -236864, 27996, -18619, -90398, 141839, 2862, -247520, 277824, -147385, -3801, 170879, -37622, 337932, 49571, -235930, 364277, -22342, 83653, -27999, -104916, 36660, -63358, 127721, 133642, 273935, -134271, -217302, -49962, -113918, -116557, 58399, 93289, 44002, -19740, -63050]
12344f3050q5063L8129A11719j8010a86866B68120A10156L1717o7297J83031h8998
12332a42226E6770J4618J2521b9644k47563d1528B72658J0535H1438g2422m1818
12321a14240a4145B85254c55488j574D5189Q8222a6795A02005C3866K49032o1246
12310B21652a12821E8919k1961b65261m351B76225b50773A80543b0328E3480L90613
12299D44093A34620h8686B4640A1019g4101E0841g1938L1257D362h0157J736L7709
12287d0712D7340a51889q5738O6034d1656C69668e9988C17132h3918M0077A71183
12275a97614A20334P741R5753F8292k2267b34909b1407B9544O1739J06438L5275
12264B32996n3686O0678c8341B73256l2069R808e0062C20735E4609J1242J61567
$$ y = [-63050, -148113, -109984, 111719, 93709, -186866, 268120, 110156, 141873, 74576, 257607, -88998, -142226, 56770, 71388, 83909, -29644, -277207, -41528, 272658, 283193, 81438, -72422, -114240, -14145, 285254, -355488, -357062, 45189, 133411, -16795, 102005, 33866, 282898, 221652, -112821, 58919, 36958, -265261, -269612, 276225, -250773, 180543, -20328, 53480, 444093, 134620, -88686, 24640, 11019, -74101, 50841, -71938, -40681, 4362, -80157, -78421, -40712, 47340, -151889, -237627, -171593, -41656, 369668, -59988, 317132, -83918, -43841, 171183, -197614, 120334, 128075, 223828, 68292, 46025, -234909, -21407, 29544, 91283, 197721, 232996, 179310, 239988, -38341, 273256, 241187, 250995, -50062, 320735, 54609, 65851, 227418]
12253B27418I2432K22177D9420c6576F4881f8220H9614Q0145a72895q9276A74394
12241A82755M5963B4433L85040b32439N5963K5958C36795A19631a5374q2726k7822
12230a25922B14089H7904N7012b5947j3270A90099b521H1168b23048C40999j26892
12219B14107l0721b03812h7786F0101J28352R6812A21170J73894J07146A60028
12208C49743J8584J81310A86194R5990A07675d3447I8046J62057H6946J1769L1403
12197A30118J38234l978a54086A10229e8934e003A84030Q3218k2065j18222K1280
12186A48241N01131C8235M18374k05386i8362A92980e8508B02233k3649p3794
12176A04790j0923f2387E4858e1309A5174L11627j09696R9552M0445g639l33789
$$ y = [227418, 92432, 314609, 49420, -36576, 64881, -68220, 89614, 169759, -172895, -262171, 174394, 182755, 228718, 24433, 409473, -232439, -176476, -150518, 336795, 119631, -15374, -98100, -125922, 214089, 87904, 144916, -25947, -39217, 190099, -2521, 81168, -223048, 340999, 214107, 183386, -203812, -87786, 60101, 188453, 285265, 121170, 295064, 402210, 160028, 349743, 368327, 549637, 186194, 282184, 107675, -43447, 98046, 260103, 86946, 98715, 130118, 268352, 264374, -154086, 110229, -58934, -5003, 184030, 267248, 245183, 126961, 148241, 649372, 38235, 456609, 251223, -98362, 192980, -58508, 202233, 178584, 104790, 93867, -62387, 54858, -51309, 15174, 326801, 217105, 316657, 357102, -7639, -341428]
12165c41428C32468m8718C4364e2991I6741P5001K7917E4119M632k2630a03183
12153A02488K21811J01080j75560n1031M9J41996F2104K15168F0219O9563k0632
12142A09150L32205k14822A0430J20137J31606a34267m2380C1970a29427A79739
12131B91900a35534B1075M12363E8339b49078A69165j7809J3460a65214N4309
12121a10905g544p499A02842k5123P9106a98075P1097G4668N8270P2616i6131
12109g2180B53281a41963q8560M3659B75981a7977L36A60088d6196D6316J12037
12098A58353a31500A26590E0996a46781p1132i8213B0220a23108B18488F6905
12087a8597A82475B1876N0672a88932A50462b55864g9784a4651j46595J2356C155
$$ y = [-341428, 332468, 283750, 34364, -52991, 96741, 171742, 199659, 54119, 58751, 36121, -103183, 102488, 324299, 425379, 249819, 198788, 198837, 340833, 62104, 277272, 60219, 129782, 109150, 441355, 226533, 10430, 130567, 262173, -134267, -176647, 31970, -129427, 179739, 291900, -135534, 21075, 433438, 58339, -249078, 169165, 151356, 164816, -165214, -110905, -7544, -15043, 102842, 77719, 156825, -198075, -126978, 74668, 132938, 205554, -96131, -72180, 253281, -141963, -230523, -186864, 275981, -17977, -17641, 160088, -46196, 46316, 158353, -131500, 126590, 50996, -146781, -217913, -98213, 20220, -123108, 218488, 66905, -18597, 182475, 21876, 72548, -188932, 150462, -255864, -79784, -14651, -161246, -148890, 3155]
12075b1869j10309D50700b73577B65593b12544E1385J70531H2817L58298k12837
12065B28278K17754K19936R77543m64040D56742j95265R8687e1768H7464c5382
12054B55163a2380A09984n0775J08824H452J93441J02838A20815a19448e7965
12043a28007A54875i5168C1219J14340n069b02755j2385C6870a22133C19230j50681
12032A68549c02789a21522F2368d6714k17736C1601J75390c5098A76426h2338
12021b6524A87537a63928r8040c8665H4479M2480D9715K64637A16436e0753B3701
12009a63897j1171A9762e2967A18506b97487A55983a58779M2738c8943A51682
11998H8651C4641J15518A8556A866J89821K9487g8912p7336n8491k7688E6878
$$ y = [-21869, -132178, 450700, -273577, 265593, -212544, 51385, 221916, 82817, 441115, 228278, 446032, 665968, 1643511, 1179471, 456742, 261477, 360164, -51768, 87464, -35382, 255163, -12380, 109984, 59209, 168033, 8452, 201893, 304731, 120815, -119448, -57965, -128007, 154875, -95168, 31219, 145559, 140490, -202755, -215140, 36870, -122133, 319230, 168549, -302789, -121522, 62368, -46714, -264450, 31601, 206991, -35098, 176426, -82338, -26524, 187537, -163928, -261968, -38665, 84479, 126959, 49715, 314352, 116436, -50753, 23701, -163897, -175068, 19762, -52967, 118506, -297487, 155983, -158779, -116041, -38943, 151682, 88651, 34641, 150159, 18556, 1866, 191687, 221174, -78912, -156248, -214739, -242427, 56878]
11986B5967l153a73564A97088B4009Q9113f5075A45566b84117Q7514j53272J51831
11975a98044l7162H3525N656C5766Q7851a61071B43325K21536a32434J6093C9351
11963b58669h9501j94619a16285A41196b8183j48986C07081b07027A93066d0726
11952a60733j05445L6703L1039B06320A3237J41169F7526a42477j71297R4710
11942b19064C5627a61800e0601B42925d136l059A28092c06860a40934A68540Q2660
11931B51200a70469E4368O4682a50329B47027F7173a05476a74n5905A41405e5016
11919a89593j47328g9353A96542g5853k07566g5314G0889K0799J10384k1262G420
11907C16500a35152C4741I672b21129e4676l3038p2696D417G96c01403d5278l67690
$$ y = [25967, 22814, -173564, 197088, 24009, 113122, -65075, 145566, -284117, -196603, -349875, -198044, -235206, 83525, 89181, 35766, 123617, -161071, 243325, 464861, -132434, -116341, 39351, -258669, -89501, -284120, -116285, 141196, -28183, -177169, 307081, -207027, 193066, -40726, -160733, -266178, -229475, -198436, 206320, 13237, 154406, 67526, -142477, -313774, -219064, 35627, -161800, -50601, 242925, -4136, -7195, 128092, -306860, -140934, 168540, 251200, -170469, 54368, 119050, -150329, 247027, 67173, -105476, -174, -56079, 141405, -55016, -189593, -336921, -79353, 196542, -75853, -283419, -75314, 70889, 91688, 202072, 180810, 7420, 316500, -135152, 34741, 9672, -221129, -54676, -87714, -160410, 4417, 796, -301403, -45278, -412968]
11895d12968e9022B5147a68127j16772C20321a55403M7275B19693a98441P1266
11885a27175D69772A25332b28258F7660C0250O5047m4943d9180G5128c9521C45017
11873C2560R1294j5749f025Q86j4696j52743d9785D2960A0072a16691n9132k16257
11861c92080f3258R961A424b19991H5340M5303n2073j0378j8710c8982k66700
11850c05682P4831E0872a71911g6300n3683k6244m5258j0042A07600d44537A42802
11838b03467H5149a04519A07425a43699A48043a90595A43073n1799i3045j1571
11828a04616C74085a93156B18871b87916B47533b29172I7621h2012C06342b07150
11817G8820a78093A92559a71391A7418J20019c8474G367c06507a28771a768j14960
$$ y = [-412968, -59022, 25147, -168127, -284899, 320321, -155403, -108128, 219693, -198441, -127175, 469772, 125332, -228258, 67660, 30250, 95297, 50354, -49180, 75128, -39521, 345017, 32560, 123854, 108105, -6025, -5139, -19835, -172578, -49785, 42960, 10072, -116691, -175823, -392080, -63258, -53297, 1424, -219991, 85340, 130643, 78570, 68192, 49482, -38982, -305682, -230851, 50872, -171911, -76300, -129983, -156227, -201485, -211527, 107600, -444537, 142802, -203467, 85149, -104519, 107425, -143699, 148043, -190595, 143073, 91274, -93045, -104616, 374085, -193156, 218871, -287916, 247533, -229172, 97621, -82012, 306342, -207150, 78820, -178093, 192559, -171391, 17418, 137437, -38474, 7367, -306507, -128771, -1768, -116728]
11806a16728B27248a88455g9165j03730a9231j026o3291C8628K3220b93124b0262
11794D03135a82183A28080q006Q6470c2359E8830b56022a10514M5539a513p184
11783h697I4729c3784P194A93960c1951n2820A4972M104E75M2416J0498b19638
11770b14461E2445i0802k7808K6854K0237C95009D5585a97054D97306b8714k39734
11759b68448a02385j03755P9912r2791B50717b07734d2161r0886A58090A9886
11748G5127K25317f7440q9600c2296j11103B19214h2540c6333j91282A69099E6964
11736A26810Q6479b00068E3546c31591J64735m3722Q0789J5986d8880A23138i6509
11724C26890a30460I232c6586q7594j22884b0937m2527j23673A06146d9318G3395
$$ y = [-116728, 227248, -188455, -79165, -182895, -19231, -20257, -83548, 38628, 61848, -293124, -20262, 403135, -182183, 128080, 120074, 206544, -32359, 58830, -256022, -110514, -64975, -1513, -8697, 94729, -33784, -26590, 193960, -31951, -84771, 14972, 19076, 575, 42991, 53489, -219638, -214461, 52445, -90802, -118610, -91756, -71519, 395009, 45585, -197054, 497306, -28714, -268448, -102385, -206140, -126228, -219019, 250717, -207734, -42161, -133047, 158090, 19886, 75127, 300444, -67440, -157040, -32296, -143399, 219214, -82540, -36333, -227615, 169099, 56964, 126810, 213289, -200068, 53546, -331591, -166856, -210578, -129789, -113803, -48880, 123138, -96509, 326890, -130460, 9232, -36586, -124180, -247064, -20937, -63464, -187137, 106146, -49318, 73395]
11712C2019J53318D5641l148f1409B83335h9194c8908r1821B48221a630n215B40308
11699F1735b19326A60692o2194f7626A59428F1143R2993n7490i6618A41236a99426
11687i6353D52782A85491o6136P0586K1216A5240g5671B23196i4231B0667a05407
11675D41946i502H8948d9092A15835k5428K20827A7501H05J3359Q2996Q8352k424
11663A83088i7771A13535j5835B3292a55850n7769B26904G0677O0863K715g7909
11651F910N822g0278j41609H6544c595B0398Q5925O2486a41759G5363f5324b8094
11638a7709A13312a18539K8749M1465C1058J98540j05590E8357B6854J00545A9687
11626h1436p1213k780b3143o3363B34848b37687G8150M5360b87935I0240J46578
$$ y = [32019, 185337, 45641, 42493, -61409, 283335, -89194, -38908, -130729, 248221, -1630, -6845, 240308, 61735, -219326, 160692, 98498, -67626, 159428, 61143, 154136, 96646, -96618, 141236, -199426, -96353, 452782, 185491, 119355, 189941, 211157, 15240, -75671, 223196, -94231, 20667, -105407, 441946, -9502, 88948, -49092, 115835, 90407, 311234, 17501, 805, 14164, 97160, 185512, 183088, -97771, 113535, 97700, 23292, -155850, -213619, 226904, 70677, 131540, 134255, -77909, 6910, 12732, -70278, -211887, 86544, -3595, 20398, 106323, 168809, -141759, 75363, -65324, -28094, -17709, 113312, -118539, -89790, -48325, 31058, 229598, 124008, 58357, 26854, 127399, 19687, -81436, -152649, -155429, -23143, -86506, 234848, -237687, 78150, 123510, -287935, 90240, 236818]
11615B36818J08997a55462P0756L9585G4864g53C21017j15668d599h94l1737A59808
11602d97p9274j64149A48683N043P6407a02113A4809L29573A14554e1101k03523
11591b54624A5770b52786b1213D2645e2707F4712a70107h3959c8746C0829J90806
11580B21635a33766L4924A01314a28585a5634D0544a25894E8073O5462c7535H6826
11568f6016p3593B90777H2020b23729F3418Q8853n4579K4481h0209A97204F7751
11556a21601A33399n0900a26500J1080E42798A68167a17351q0444B6305K92274
11546C18579n8254a32251K1960j13600C13220j16154K4315a07116F2367O0011
11536A22378K6150J7070l5579a57197O7340M3747A19445C7369J82531b46737J6031
$$ y = [236818, 345815, -155462, -84706, -45121, 74864, -753, 321017, 205349, -4599, -894, -32631, 159808, -497, -79771, -243920, 148683, 153726, 230133, -102113, 14809, 344382, 114554, -51101, -254624, 15770, -252786, -21213, 42645, -52707, 64712, -170107, -83959, -38746, 30829, 221635, -133766, -98842, 101314, -128585, -15634, 40544, -125894, 58073, 123535, -37535, 86826, -66016, -139609, 290777, 82020, -223729, 63418, 152271, 97692, 122173, -80209, 197204, 67751, -121601, 133399, 82499, -126500, -115420, 542798, 168167, -117351, -197795, 26305, 318579, 260325, -132251, -110291, -223891, 313220, 197066, 221381, -107116, 62367, 122378, 148528, 165598, 130019, -157197, -89857, -46110, 119445, 37369, 219900, -246737, -230706]
11525b30706h2349A98969a27012A25848K56525I1829b0587D0531J52147a4602
11514a40034A56075E5716L3344K18858J33664p0550A62072D1631K7667N4211L5802
11503A59311O6468o8384N789a59668A01458j398a53908B23331a33245D9390a0776
11491A8240Q7604J87559G3223c5507l5368P688q0200C8324b99623B80801c1163
11479A93342m2838b03695C40689J95373C8376K98554j61097j0417o3952c045j3508
11468a6553C62770k341J24809a6731B22956o6303E6539L8514f8508b212A56668
11456c0101B41187I4169N03450F1124N7107A9850K64101q476D5332a67868B52988
11444A43419b00329A79980o5409A8166R3197b34685A41233g1719A28003l318O3139
$$ y = [-230706, -82349, 198969, -127012, 125848, 382373, 91829, -20587, 40531, 192678, -14602, -140034, 156075, 55716, 89060, 307918, 441582, 371032, 162072, 41631, 69298, 123509, 159311, 225779, 157395, 163184, -159668, 101458, 100060, -153908, 223331, -133245, 49390, -10776, 18240, 105844, 293403, 73223, -35507, -70875, -63187, -143387, 38324, -299623, 280801, -31163, 193342, 150504, -203695, 340689, 536062, 38376, 336930, 175833, 165416, 101464, -3045, -16553, 362770, 360429, 485238, -16731, 222956, 156653, 56539, 95053, -68508, -2212, 156668, -30101, 241187, 94169, 597619, 61124, 118231, 19850, 283951, 275475, 45332, -167868, 252988, 143419, -200329, 179980, 114571, 18166, 111363, -234685, 141233, -71719, 128003, 124685, 187824]
11433A87824b05807e6455A7693L7819a097A74953d0354A83956J17175a49182O8051
11422h1131J9003A09303b8738m7462l2391c2017a5929I2342B0259J92610q8364
11411A24505g3597E12253c10936H3124l1069M76532b42032N3609g7819k08668
11401b86487r0148I9251K1023J47013b16504J05414A36047n0797k2986L4551O8597
11390A65412G8333g7249H8764J27542A03504l5792r457J42682P6374d0002p662
11379d7664j31306f4760E6304a80408r6624D6766g8304m641K2656A06711M976
11368A11687A6150M50367e5354k58665c8013E2815b34146J4985E2257M3591i3873
11356a6442D17000c20911J03809E1907a81310A01686a97496H3774g5837J3337
$$ y = [187824, -205807, -56455, 17693, 55512, -1097, 174953, -40354, 183956, 301131, -149182, -81131, -62128, 109303, -28738, -76200, -108591, -32017, -15929, 92342, 20259, 212869, 124505, -73597, 512253, -310936, 83124, 52055, 528587, -242032, -188423, -77819, -286487, -376635, 99251, 120274, 267287, -216504, -111090, 136047, 85250, 62264, 96815, 165412, 78333, -77249, 88764, 216306, 103504, 67712, 58255, 200937, 277311, -40002, -47664, -178970, -64760, 56304, -180408, -277032, 46766, -78304, -82945, -60289, 106711, 111687, 16150, 466517, -55354, -314019, -38013, 52815, -234146, -219161, 52257, 95848, -93873, -16442, 417000, -320911, -217102, 51907, -181310, 101686, -197496, 83774, -75837, -62500]
11346f2500j83203B71320a18168k18046d2862C1970f0295B33374c3243k44055
11336b77298A65130m3906a65656g481C6208b7103k16304c4311o1707A63720a49064
11324b51541F9839J08731M5662d9592k62500N947A17531J33490r6326c23758A8519
11312F3065K60762a09071n231B90317A23221h9536B03084b699G0981a49297i019
11300B02858K2894A00610h9273B95805d76061J76526G8013a83292j29423a21692
11289I550b8406j80350f0022B51040L4739a87298f89j90611L7846A2673J869f29
11276b04695B69828b779A02057J743a43281l0417G4013L9352K68146e2781E2284
11264a01792j44665j20389J12182A48563K59958b50625a15330A13474a50186f7556
$$ y = [-62500, -245703, 271320, -118168, -336214, -42862, 31970, -60295, 233374, -33243, -277298, 165130, 121224, -165656, -7481, 36208, -27103, -243407, -34311, -96018, 163720, -149064, -251541, 69839, 178570, 224232, -49592, -312092, -306145, 117531, 251021, 154695, -323758, 18519, 63065, 323827, -109071, -114302, 290317, 123221, -89536, 203084, -2699, 70981, -149297, -9019, 202858, 225752, 100610, -89273, 295805, -476061, -299535, 78013, -183292, -312715, -121692, 9550, -28406, -208756, -60022, 251040, 285779, -187298, -689, -191300, -153454, 12673, 14542, -629, -204695, 269828, -2779, 102057, 103800, -143281, -173698, 74013, 113365, 381511, -52781, 52284, -101792, -246457, -366846, -254664, 148563, 408521, -250625, -115330, 113474, -150186, -67556]
11253A74246I593N0451b95139J31875o4998Q0712A80129K19057E0708h4315H3100
11241A28037J73476a87194J2314N2458B07410b47000B13931a57677b1524n32205
11231e53729e0010k14036G0782i2323m298d5842n2261k527n1786l2685K8926A22185
11218B14708d06831Q1121B67457a12701r8719A93516b7767k15905k71635b08682
11207c12481F5091a54006A33185h9614b6481i414j45998n1052A5814b16954D7407
11195b52010B30463A1239d6442A25292j362A2181h9499H8004J49083B8090j3080
11184A5010a05318H3660g7493A18505a0973E2914a65097B18872c3455B05227a28105
11172i7367A81605G2266J46525c3186F3017a88401H2189i0465B35359A13420P569
$$ y = [174246, 9593, 60044, -295139, -163264, -228262, -147550, 180129, 399186, 50708, -84315, 83100, 128037, 301513, -187194, -174880, -122422, 207410, -247000, 213931, -157677, -21524, -553729, -50010, -264046, 70782, -92323, -96621, -45842, -98103, -100630, -152416, -185101, -156175, 122185, 214708, -406831, -325710, 267457, -112701, -211420, 193516, -27767, -243672, -515307, -208682, -312481, 65091, -154006, 133185, -89614, -26481, -9414, -155412, -206464, 15814, -216954, 47407, -252010, 230463, 11239, -46442, 125292, 123930, 12181, -89499, 88004, 237087, 28090, 15010, -105318, 83660, -77493, 118505, -10973, 52914, -165097, 218872, -33455, 205227, -128105, -97367, 181605, 72266, 218791, -33186, 63017, -188401, 82189, -90465, 235359, 113420, 120989]
11161A20989j9784b16666i1412D5132J15749a04908j58075a9206n8711c8957j55942
11150a94899A88855K6644c34002c3273j19006A14529I232f5179j88766a4442l0109
11139d4551j01578A81701p5451D0506e226n7018j55983A94770a88267g683A32436
11127d9293C8929a08117e1902A18689E07J10171K42139e4029I9535b19564C12802
11115e8864j1310a0112A9348c1744A89078a1820k98107A22916f3712r7791B13136
11103A17472L5053R0141j00153J1452k9200J33000b12421a04521C37275a01465
11092B2289A1044J94230J65670E82N5593O6023F239K99488c8025A74441a30065
11080A42605P315C4764K10988j22826j1623M4599F3986K9668K06207C4655J39225
$$ y = [120989, 101205, -216666, -91412, 45132, 160881, -104908, -262983, -19206, -77917, -38957, -194899, 188855, 215499, -334002, -33273, -152279, 114529, 9232, -65179, -253945, -14442, -44551, -146129, 181701, 106250, 40506, -5226, -62244, -218227, 194770, -188267, -7683, 132436, -49293, 38929, -108117, -51902, 118689, 507, 110678, 352817, -54029, 99535, -219564, 312802, -58864, -70174, -10112, 19348, -31744, 189078, -11820, -309927, 122916, -63712, -161503, 213136, 117472, 152525, 242666, 142513, 153965, 124765, 257765, -212421, -104521, 337275, -101465, 22289, 11044, 205274, 370944, 582, 56175, 122198, 6239, 305727, -38025, 174441, -130065, 142605, 149920, 34764, 245752, 122926, 111303, 155902, 63986, 93654, 299861, 34655, 173880]
11069A73880J50186J41145k01670I5530J30312q7099o7439J13017M496K20975
11059D09792K17653j95025o6692A0495K32580P5706P8658A2184K50571G5558K60894
11048C36452p2269J14472R3784j08147O9439O6300j70958M94260B04007K50818
11038D54825K32655j73267K65482k49083J91734J70117r5926C95945L73080J4185
11028G83210K33086l69658C13970N40932j94176n7178K457J79650K8138J80368
11018I94161m78375K18625r2669m7046J40556j00679k33209L85602q4245N77J05938
11007H09236K78616C27290J90422L02443B50095R0288J11308N00483l01782n4431
10997E95961j28326L09829O7097C78817K32173L05322k49423k76987K9882j55894
$$ y = [173880, 324066, 465211, 263541, 95530, 225842, 138743, 71304, 184321, 188817, 409792, 627445, 432420, 365728, 10495, 243075, 318781, 397439, 12184, 262755, 75558, 336452, 264183, 378655, 472439, 364292, 433731, 500031, 329073, 823333, 204007, 454825, 687480, 514213, 779695, 530612, 722346, 892463, 796537, 395945, 769025, 783210, 1016296, 646638, 313970, 854902, 660726, 603548, 606005, 785655, 813793, 994161, 515786, 734411, 641742, 594696, 735252, 634573, 401364, 786966, 702721, 703298, 809236, 1087852, 327290, 517712, 820155, 250095, 340383, 451691, 952174, 650392, 595961, 467635, 777464, 844561, 378817, 610990, 916312, 666889, 389902, 419784, 263890]
10987B63890K05999J34701M5696q7398J53818p7113j28148L78362K9458k14615
10977G04650j30861j47366J26558J60242O7950L4196J91082P2091j85547K7144
10967I20139j19144P43543l98733k29946L31908N75678m8594J79083j66060K44577
10957B032451O6928J94360o2529N66915n38585j37176l89211J53581m42727K96770
10947A740777n4853K00405k73959K61986q7431l21127n8195L12114l61654K19533
10937A577596J28531q39596j08959L74335n16067O240N6523B35447F404M63038
10927D69442j93708L35928B67517A12592B2327J39106F5044j8051M01759A03148
10916A84139O794D2025p088L78708j26311H7645K67494F6050N333K0155b38771
$$ y = [263890, 469889, 604590, 650286, 562888, 716706, 639593, 511445, 889807, 919265, 704650, 573789, 426423, 552981, 713223, 781173, 815369, 1006451, 1078542, 892995, 920139, 800995, 1544538, 1145805, 915859, 1247767, 1823445, 1774851, 1953934, 1787874, 2032451, 2099379, 2293739, 2231210, 2798125, 2259540, 2122364, 1733153, 1886734, 1444007, 1740777, 1685924, 1886329, 1612370, 1874356, 1786925, 1465798, 1407603, 1719717, 1358063, 1577596, 1706127, 866531, 757572, 1131907, 615840, 622080, 678603, 235447, 6404, 469442, 275734, 611662, 267517, 112592, 22327, 161433, 65044, 46993, 448752, 103148, 184139, 190933, 42025, 34937, 413645, 287334, 87645, 355139, 66050, 71383, 91538, -238771]
10904h8329A82708h669o6793m9040j11658H8991a78427J7673D40582k15056r7799
10893A27727b12065q8062a46118I0879K0663b98311J40965C56605a21539A69323
10882a7131C26154B8018a83045R0894L8828G5426a63916e4189B14843a26954k6907
10871a53861p7219O9501B42245a2957B38177h9255H074O942M9473R3041K4500
10860A82030c3208b74j69115D7002a81383C329J08802c9032B3611M00181c6391
10848c1201C48674j69488p6566O671J1960a86735i0187c201q092j25423G5648
10836a34270n9341A6103a55638G9293b1503A52250J23062r2848j0367a3554r3887
10825a07441A30070F2398a2468A54441d17133B03183a45038B46720a72319Q3341
$$ y = [-88329, 182708, -8669, -75462, -124502, -236160, 88991, -178427, -160754, 440582, 225526, 127727, -212065, -300127, -146118, 90879, 111542, -298311, -157346, 356605, -121539, 169323, -17131, 326154, 28018, -183045, -92151, -53323, 75426, -163916, -54189, 214843, -126954, -153861, -231080, -161579, 242245, -12957, 238177, -89255, 8074, 15016, 64489, 157530, 182030, -33208, -274, -169389, 47002, -181383, 3329, 112131, -39032, 23611, 423792, -36391, -31201, 348674, 179186, 102620, 109291, 121251, -186735, -90187, -3201, -11293, -136716, 75648, -134270, -193611, 16103, -155638, 79293, -21503, 152250, 275312, 182464, 172097, -13554, -107441, 130070, 62398, -12468, 154441, -417133, 203183, -145038, 246720, -172319, -88978]
10815h8978C4696Q4157m6331M10993f5811m2389Q923B27421b08797M0187L5197
10804a33413q4518a3524A35563i0386M1016a271j24721d0554j04940A35279g2446
10792B54980q4062i7752I340a77876k50149f1591a7110j33571P4251Q431G1022
10780b22101Q2131H8578B9690D112h553D8485O091G051a7187A79753B5937I380
10767f7104A30349m3751a26798D36909A96392g7313B85888H7585N1022f1989A93904
10755a8641l8759j36849c1857B45524r4790a1157l71693h1601F7989a49384I933
10743i5957A55160a16415C3149J23469p7737a37624a9959l79132a63441I7833
10732a85663B6784J30726j4033h6372A27604a80981b7019F8917K1623C2665c5095
$$ y = [-88978, 34696, 118853, 72522, 483515, -65811, -108200, -99277, 227421, -208797, -168610, -133413, -217931, -13524, 135563, -90386, -49370, -1271, -125992, -40554, -145494, 135279, -72446, 254980, 170918, -97752, 9340, -177876, -428025, -61591, -17110, -150681, -76430, -67999, 71022, -222101, -139970, 88578, 29690, 4112, -8553, 48485, 54576, 7051, -17187, 179753, 25937, 9380, -67104, 130349, 86598, -126798, 436909, 196392, -77313, 285888, 87585, 138607, -61989, 193904, -18641, -57400, -194249, -31857, 245524, 150734, -11157, -382850, -81601, 67989, -149384, 9933, -95957, 155160, -116415, 33149, 156618, 78881, -137624, -19959, -399091, -163441, 97833, -185663, 26784, 157510, 143477, -86372, 127604, -180981, -27019, 68917, 90540, 32665, -35095]
10720b25501O7695E1646Q148c57545A845a49839N4304j31100i461j25740C3167
10708b39075H9501b84274b6995B6103d5117K1234m0002A00990D2762i7513k76564
10697c74077g2108j74696A12496q162a45481d9140j91690I5657a13707C1947a73777
10685a97100f35I4157b01557F3340h5050o3151B38976D4037b29388g3554L6518
10674c7036a7507k4476K106k86863D33324a82455I478a52495l06972h2590O79
10663h1911j4299l65126A47064b4326j47924d1268A39199d411F3277a5544k3661
10652c9205B68815A2125J55081a55386B39410j10310l6073a46845j47395c3247
10641b8482G676J31136h2326A02407b30774Q2664c4190k3285j4212A90071a65617
$$ y = [-225501, -157806, 51646, 59794, -357545, 1845, -149839, -95535, -226635, -9461, -135201, 33167, -239075, 89501, -284274, -26995, 26103, -45117, -23883, -63885, 100990, 42762, -97513, -374077, -72108, -246804, 112496, 104334, -145481, -49140, -240830, 95657, -113707, 31947, -173777, -197100, -635, 94157, -201557, 63340, -85050, -148201, 238976, 44037, -229388, -73554, -37036, -17507, -41983, -39877, -326740, 433324, -182455, 9478, -152495, -459467, -82590, -81911, -96210, -461336, 147064, -24326, -172250, -41268, 139199, -4411, 63277, -15544, -39205, 268815, 12125, 167206, -155386, 239410, 129100, 93027, -146845, -294240, -33247, -28482, 7676, 138812, -82326, 102407, -230774, -148110, -34190, -57475, -71687, 190071, -165617]
10629G7727d6182A02715k4712a64297j02241e2352I316b54699C2387a67603m4348
10618b11951R3918H958P3608f5413j94743A36201a50256l9307k38743a89042A28681
10606I2770J91698a16629c5882k98844B78610A17852a34777d4591D669J86611
10596A91280c48239G8145A8080b4209A50981i1159A39949a77536h0439D43925
10585h5726j27994O2299o9146G870b4801G781h9974F9114N4266B7499a85494e1360
10572a3788E7078K89886h0709J1783j69609p0787C27539j19980b16851g8639o8418
10561a47057k04514B8088h6839j13414J2716b507j50574N1196e436A90230c31727
10549a31210B33326b81586L4504a4614j20945e9813K1249A88468E6673b7853A72570
$$ y = [77727, -46182, 102715, 78003, -164297, -266538, -52352, 9316, -254699, 32387, -167603, -211951, -118033, 8958, 82566, -65413, -260156, 136201, -150256, -189563, -428306, -189042, 128681, 92770, 284468, -116629, -35882, -334726, 278610, 117852, -134777, -44591, 4669, 191280, -348239, 78145, 18080, -24209, 150981, -91159, 139949, -177536, -80439, 443925, -85726, -213720, -151421, -220567, 7870, -24801, 7781, -89974, 69114, 123380, 27499, -185494, -51360, -13788, 57078, 346964, -80709, -68926, -238535, -309322, 327539, 207559, -216851, -78639, -147057, -351571, 28088, -86839, -200253, -187537, -2507, -153081, -101885, -5436, 190230, -331727, -131210, 233326, -281586, -247082, -14614, -135559, -59813, -38564, 188468, 56673, -27853, 172570]
10537a1228C74364i0055B18760a40247E6423a74710m712A05272J98213D1920h0031
10525g5491J7152g370j07293c0145j75977a00725r7490B8371q015a12814J4129
10514i8685j83461G637N3178e2501n2877D61597B1473c5158j86043l1717C7660
10502c541n0843H7632c2238m7657c3066C91174b35777g6481k92555B66213E5748
10490G0183B7139K92593e9129f25j40834q404e6296q3204B02049H5258N6685n2270
10478H9673i6724A902a9165j09057D5182L5622J27270L688a77333A23459K313
10467A25772f8616B78407o1534L63229Q2697l13588B4976J51319N5133K3683j14815
10456A40296K897b03723h9718K5111a0952H45R6261a34366j48631E726h1272h673
$$ y = [-11228, 374364, -90055, 218760, -140247, 56423, -174710, -179422, 105272, 303485, 41920, -80031, -75491, -58339, -7370, -114663, -30145, -206122, -100725, -198215, 28371, 20356, -112814, -98685, -282146, 7637, 60815, -52501, -105378, 461597, 21473, -35158, -221201, -252918, 37660, -3541, -54384, 87632, -32238, -79895, -33066, 391174, -235777, -76481, -369036, 266213, 55748, 70183, 27139, 319732, -59129, -625, -141459, -149863, -56296, -139500, 202049, 85258, 141943, 89673, -96724, 1902, -19165, -128222, 45182, 80804, 208074, 211762, -177333, 123459, 125772, -68616, 278407, 216873, 580102, 662799, 349211, 24976, 176295, 231428, 255111, 140296, 143193, -203723, -89718, -64607, -10952, 845, 97106, -134366, -282997, 5726, -81272, -8673]
10443A98416b5259A98842b20098P7549N563A15949Q9304a08480B83841A358c31245
10431i559k29271A53277c7738j5555l089r2546N1426H0794a78418d7353q3179
10420a30532C5527L1175a35458j10004B8909C479a90786M7724N0083C9213b96496
10408A08183k0786A2720J49071h4343q2100C33046c29324J29590g8804j96954
10398b75758K4753A22846O0457d0204k44511B15192b05032A3248a13232k45573
10388c58805M3846a1712C60108A09662f198A96632B5027a04501B1501I411a17947
10376C49617E5106J17998C1538b27542m4880A14382b45861C50153a21497C61345
10365b4295A50355o5470g8188C55524A51619O6915L44019B06688b18795D01588
$$ y = [198416, -25259, 198842, -220098, -142549, -136986, 115949, 205253, -108480, 283841, 1358, -331245, -9559, -238830, 153277, -37738, -53293, -56382, -148928, -97502, 80794, -178418, -47353, -130532, 35527, 66702, -135458, -245462, 28909, 3479, -190786, -143062, -92979, 39213, -296496, 108183, 87397, 12720, 161791, -84343, -166443, 333046, -329324, -199734, -78804, -275758, -251005, 122846, 183303, -40204, -284715, 215192, -205032, 13248, -113232, -358805, -314959, -11712, 360108, 109662, -6198, 196632, 25027, -104501, 21501, 9411, -117947, 349617, 55106, 173104, 31538, -227542, -272422, 114382, -245861, 350153, -121497, 361345, -24295, 150355, 84885, -78188, 355524, 151619, 218534, 562553, 206688, -218795, 401588]
10354E5559K04798G7935b6335G6813M3841N51946B83285o9068a66998B49601A03254
10342G9455L44020j01700A28475j2714n1986J15328G2992J84105N1847K57979
10332E66923E6100J68343k2054q1043K61683p7688j31204K18120a0338B36912
10321A87488n9112K40198a00682j3479B73150a02419B21918R6705e1862j44572
10311a96434E16981a05714E24170d4682m2846C09018A18972b13633A22426P8750
10301B01176j1999i095B66161c6097r732A17150C7021d948r7269A09120b27093
10289F288h4194o2011A6313O5054a90105A03817E814b87336l9044B20505g622
10277a83325C74399g5644A36548c8368A05863f7695k9452a16B0227a19839A28680
$$ y = [55559, 260357, 77935, -26335, 76813, 120654, 672600, 283285, 214217, -166998, 249601, 103254, 79455, 423475, 321775, 128475, 115761, 63775, 179103, 72992, 257097, 308944, 566923, 56100, 224443, 202389, 121346, 383029, 305341, 174137, 392257, -10338, 236912, 187488, 128376, 368574, -100682, -114161, 273150, -102419, 221918, 318623, -51862, -196434, 516981, -105714, 524170, -44682, -87528, 309018, 118972, -213633, 122426, 201176, 189177, -9095, 266161, -36097, -45829, 117150, 37021, -4948, -102217, 109120, -227093, 6288, -84194, -146205, 16313, 81367, -190105, 103817, 5814, -287336, -326380, 220505, -7622, -183325, 374399, -75644, 136548, -38368, 105863, -67695, -97147, -116, 20227, -119839, 128680]
10265a16843G6633e1872j80433g4084A91490r5013k0406d9333q069f723l07588
10254c14311A79635e1283B23326o6283c32120A53151h3732A93955j002O8296J90697
10243D51946j94314P6779r8030p4784K23938F14J5520d51439C80635C6802j7820
10232A8982J72544g0054b7036C59882a89990e2536B02143D4165A9076c31636a27205
10220I9825e0396A0008e0377p9705l81329B6144c64980d8694B81822a15264G7330
10208b7696j65722M0371L998G5002h1j00482k2397b9008j09511j4005k50503B04010
10195A20351a04883B385a97665j18199G9956k669b36670f0422A94108E3569h9497
10183A23297c143j56267A26294b4602j3984F6990b47914A0864J12537B3693a59786
$$ y = [-116843, 76633, -51872, -232305, -74084, 191490, 96477, 76071, -49333, -57402, -6723, -314311, 179635, -51283, 223326, 157043, -332120, 153151, -83732, 193955, 192953, 261249, 451946, 257632, 334411, 236381, 161597, 385535, 614, 16134, -451439, 380635, 36802, 18982, 191526, -70054, -27036, 359882, -189990, -52536, 202143, 44165, 19076, -331636, -127205, 99825, -50396, 10008, -50377, -130082, -511411, 26144, -364980, -48694, 281822, -115264, 77330, -27696, -193418, -153047, -149049, 75002, -81, -100563, -122960, -29008, -138519, -152524, -403027, 204010, 120351, -104883, 2385, -197665, -315864, 79956, 77287, -236670, -60422, 194108, 53569, -89497, 123297, -3143, -159410, 126294, -24602, -38586, 66990, -247914, 10864, 123401, 23693, -159786]
10171b12862A24528a54786H9927e0304j10879A14673b10893f749j42678P0903
10161g8524j08058e6800A25074b80596e5167H2005a56570J8403A21212n8931K72277
10150C34558a89112j25123g3097D7947h5097A11686J01507a96953G9816i5148
10139b11428A06358b28511j06616B25650a91B57541D3947K47006a08749H286d45042
10127B3366b08466j74950a3438j20907f1899J5920C42587a82641e9577k90887
10117c50464a05248r0092H8106A0508k266a37062j05667e6306A06240c57850B3379
10105c95766E6772a72458q7192P2863A68208b94324j05513e8019p8839C699N9237
10094F2936o936a27133p4127O1901j14678A26737M7773b0945j24818k87715E6183
$$ y = [-212862, 124528, -154786, 89927, -50304, -161183, 114673, -210893, -6749, -149427, -78524, -186582, -56800, 125074, -280596, -55167, 82005, -156570, -138167, 121212, 62281, 334558, -189112, -314235, -73097, 47947, -85097, 111686, 213193, -196953, 79816, -95148, -211428, 106358, -228511, -335127, 225650, -191, 257541, 43947, 290953, -108749, 8286, -445042, 23366, -208466, -383416, -13438, -134345, -61899, -45979, 342587, -182641, -59577, -350464, -105248, -195340, 88106, 10508, 8242, -137062, -242729, -56306, 106240, -357850, 23379, -395766, 56772, -172458, -259650, -186787, 168208, -294324, -399837, -58019, -136858, 3699, 62936, 56000, -127133, -201260, -139359, -254037, 126737, 174510, -20945, -145763, -433478, 56183]
10082e2007A55795a29194A4601e3133j52118O3448H7098d1619j23295j92561f9933
10070a77811B45112a16286e7314j26325C18268a86868G5852K9448J1638b85921
10059I1396c22265L6763A37127g4740r6970c2895j48082D7951a11930N2109a1097
10047a77768c9223q0513k44995g3967f340j53909B67241A12611D6602e24786d2882
10035c3314j85872A99502a02052H1956c17832C7617a01395A08299a70686n6174
10025b26860H4887d4505j34877H7308A5005J5499c14754I9723j9510a24349C5283
10013B4127f4533k239A6911b3652m9989B19242d153k85860h6910H1698N4053b79897
10000b0503A1851Q5228b3513g673j29286l9908P6787r0791b9214p2685I3132K55641
$$ y = [-52007, 155795, -129194, 14601, -53133, -205251, -141803, 87098, -41619, -164914, -357475, -69933, -177811, 245112, -116286, -57314, -183639, 318268, -186868, 75852, 105300, 116938, -285921, 91396, -322265, -285502, 137127, -74740, -171710, -32895, -180977, 47951, -111930, -59821, -11097, -177768, -39223, -119736, -364731, -73967, -6340, -160249, 267241, 112611, 46602, -524786, -42882, -33314, -219186, 199502, -102052, 81956, -317832, 37617, -101395, 108299, -170686, -226860, 84887, -44505, -179382, 87308, 15005, 30504, -314754, 99723, 80213, -124349, 35283, 24127, -64533, -66772, 16911, -23652, -73641, 219242, -4153, -290013, -86910, 81698, 135751, -279897, -20503, 11851, 97079, -23513, -7673, -136959, -176867, -100080, -190871, -29214, -101899, 93132, 348773]
9988C48773b45768H3680d9143A84548d0676q5494I5249a12376L1993K4548b0873
9976A93853b72338B2708E910e30386A17357a1514D19773e5143n9773j5000A03127
9964h1142E9648A0162d1888B72621a57221H2532O5141F3143a91509d9885j30360
9953a80245m7067J00375k63280f0730l7551c6396B68125a02549q1355r7198M8869
9942b32233N4067N9544e6411J3609J9116l11910A06949a6728j41592m1093k36740
9931d36153e784q1210A30389K451a36069A04564f4771j29563A96936c842B01978
9919a97875A61985b79895g6709k68372d7718A02713B2007K126b66025A19801i2897
9907g9343j45557a01192L9584A16797a18539m6983I5692a06928n6391E3488B0367
$$ y = [348773, -245768, 83680, -49143, 184548, -40676, -126170, 95249, -112376, -80383, -55835, -20873, 193853, -272338, 22708, 5910, -530386, 117357, -11514, 419773, -55143, -114916, -129916, 103127, -81142, 59648, 10162, -41888, 272621, -157221, 82532, 147673, 63143, -191509, -49885, -180245, -227312, -126937, -390217, -60730, -98281, -36396, 268125, -102549, -183904, -281102, -232233, -178166, -118622, -56411, -42802, -23686, -335596, 106949, -16728, -158320, -199413, -436153, -5784, -86994, 130389, 132840, -136069, 104564, -64771, -194334, 196936, -3842, 201978, -197875, 161985, -279895, -76709, -345081, -47718, 102713, 22007, 24133, -266025, 119801, -92897, -79343, -224900, -101192, -61608, 116797, -118539, -165522, 95692, -106928, -163319, 53488, 20367]
9895a26109L6587M3212a0627A17037D6521b19460l4237j16483R2516k700a30502
9883a27733e1641p986j62608A6161O6467f4002A35481a52680B90369g2125J6012
9872e6113p4497J9774p3631D8867J23457b08180k06795H1615m0774b52829O5713
9861a87116L5257i816B08028d01690a00861A0123a83063c3858A01840C8896F20
9849B12700n4463a35931j20298n2989P4914e9868d757B87021F2627a9516k9622
9838d9138r1027k9135E0419a32291K7401A76011a68564j06385A33603a09880j79401
9827b89281M9723G6724J15991f9795F0757A6937K95480a33860B4090M4736b9346
9815b58020M5611A10613f4158k06444P1956i0160j65696n0766c0563k06948A9278
$$ y = [-126109, -89522, -46310, -10627, 117037, 46521, -219460, -253697, -370180, -277664, -280364, -130502, -127733, -51641, -59627, -222235, 16161, 82628, -64002, 135481, -152680, 290369, -72125, -56113, -130610, -110836, -184467, 48867, 172324, -208180, -414975, 81615, 40841, -252829, -187116, -151859, -9816, 208028, -401690, -100861, 10123, -183063, -33858, 101840, 38896, 620, 212700, 158237, -135931, -256229, -309218, -234304, -59868, -4757, 287021, 62627, -19516, -49138, -140165, -169300, 50419, -132291, -104890, 176011, -168564, -274949, 133603, -109880, -289281, -239558, 76724, 192715, -69795, 60757, 16937, 312417, -133860, 24090, 68826, -29346, -258020, -212409, 110613, -64158, -270602, -198646, -90160, -255856, -306622, -30563, -237511, 19278]
9803a71796N4492m5949A88982C5177d47913B66267a4792B4952a16180H4384J59229
9792B43613J08650h6932j17549Q5072B0995G9K428e965p4470o0148A37Q1483b3990
9778A63036i7210A23322f4828j35498h4400l5316j70016K061I7820c56216C21681
9766a23624E4423K88863c09350a08580H3202A6619a132j68316D1251j281a80585
9754B6974b29366A09176N004g4428h860C97213H2352C7935a20054l31595J48671
9743c02978a41689A46883a70523q7591A92648e521j41069L3096C96006A95140
9732g9385r7095A65644O7418o6733i0437m0951j17791B36826h6948j35757A8996
9720A58910b07584j89678i5452a2806p3709g117m2921l34593G9498M2075a38712
$$ y = [-171796, -117304, -163253, 188982, 35177, -447913, 266267, -14792, 24952, -116180, 84384, 243613, 352263, -86932, -204481, -119409, 20995, 79, 2507, -5965, -80435, -140583, 137, 81620, -23990, 163036, -97210, 123322, -64828, -200326, -84400, -119716, -289732, -287671, 97820, -356216, 321681, -123624, 54423, 343286, -309350, -108580, 83202, 16619, -1132, -169448, 41251, 39970, -180585, 26974, -229366, 109176, 114180, -74428, -8860, 397213, 82352, 37935, -120054, -451649, -302978, -141689, 146883, -170523, -258114, 192648, -5521, -146590, -113494, 396006, 195140, -79385, -176480, 165644, 233062, 166329, -90437, -131388, -249179, 236826, -86948, -222705, 18996, 158910, -207584, -397262, -95452, -12806, -86515, -7117, -50038, -384631, 79498, 121573, -138712]
9708b51531h8112j099M2323A02840b35882A95633a53561B36811e7878A00541d03304
9696c21907C47077I9851c50557O6633N1711A02176c43119C46a82399f1880a4072
9684C09030b17494Q9256j61046k6454c0317F6695j9904L7761o418a96265j21951
9673c18216h1812k07754B12579a52566A05017b22391a4574j82292j48008p4158
9663d19032a77340j0494m212m3924b3547A5800c55477d8341G9291g6180k3914
9652a00094d9923o2290j58206A27797K05451F4119b10187a04122B7665d6597n2131
9641i8728G3909d12784P2581A54442C2387O9354D8394O2903a67151B48764a491
9629D2156c13677n657E371a31022l4999k3687m976B06582e2679B0018J62934h8224
$$ y = [-251531, -88112, -89211, -46888, 102840, -235882, 195633, -153561, 236811, -57878, 100541, -403304, -321907, 347077, 99851, -350557, -283924, -232213, 102176, -343119, 346, -182399, -61880, -14072, 309030, -217494, -128238, -289284, -315738, -30317, 66695, 46791, 84552, 78134, -196265, -318216, -81812, -289566, 212579, -152566, 105017, -222391, -14574, -196866, -344874, -419032, -177340, -187834, -192046, -235970, -23547, 15800, -355477, -48341, 79291, -76180, -100094, -49923, -112213, -270419, 127797, 333248, 64119, -210187, -104122, 27665, -46597, -98728, 73909, -412784, -340203, 154442, 32387, 101741, 48394, 111297, -167151, 248764, -1491, 42156, -313677, -319334, 5371, -131022, -166021, -189708, -194684, 206582, -52679, 20018, 182952, -88224]
9616a92486P0495h952B38003A8310R4176a12622A260b52192k03605J70100a41089
9604a3929l0895j81249c6331B32893G3483k0537c4227B19172i6693k43773J32692
9593b07774D8336J84859A2835P6424l1139M8946K21197C7457J8291j7675J43073
9582A81146m6116e3860j40805b7809A8624n76a97457k6894j5459E4527J02529
9571A57056a57606d907k38107J16856D9688j0846h7785A94767b02436m0857A96393
9559b0909C1521c7351l53630F77e2517m8845A14246O598a0405j27926F9658K54936
9547C24594a1473l08287A1334J26758h8673m7233C3250d7398P251j87381Q1224
9536a46304f3602j15387A64385a01773B8953b41524a01476H663c07350D8562a13033
$$ y = [-192486, -121991, -8952, 238003, 18310, 112486, -112622, 1260, -252192, -455797, -285697, -141089, -13929, -44824, -226073, -36331, 232893, 73483, 52946, -34227, 219172, -96693, -340466, -207774, 48336, 233195, 12835, 89259, 58120, 107066, 328263, 37457, 55748, 38073, 181146, 135030, -53860, -194665, -27809, 18624, 18048, -197457, -224351, -239810, 54527, 157056, -157606, -4907, -243014, -126158, 49688, 38842, -87785, 194767, -202436, -243293, 196393, -20909, 31521, -37351, -390981, 677, -52517, -101362, 114246, 120844, -10405, -138331, 69658, 324594, -11473, -319760, 11334, 138092, -88673, -135906, 33250, -47398, -40147, -227528, -146304, -63602, -178989, 164385, -101773, 28953, -241524, -101476, 8663, -307350, 48562, -113033]
9524A39814c6091q9359k15A65654a20242A0732O1595J21800m1304b82016P0974
9513b11042h0075c3226j7051n8956j53791Q5832B00890b8793C47889a04521F689
9501h0812b9606j2672A3666a74479M5447A6629a10356j3969j31365a7196l28849
9490c46045A5456a16397B26076a74696A78153a0546q591j29008o4890N055o8689
9479b76669B5379J53503b11566m166l6743J09390l2876O6889j75515f2597j4508
9468g7105B03096E9822d385j31326D41343a50399F8571a10584m9686j42509a05757
9456A9007K66848j1668a11009I8284N1800a19637j920A11539b51234J16220E4467
9444G3302b1505j27264k3245A90902o4266R4604D609a14705a3669A63494k0798
$$ y = [139814, -36091, -125450, -125665, 165654, -120242, 10732, 72327, 194127, 152823, -282016, -211042, -80075, -33226, -50277, -109233, -263024, -177192, 200890, -28793, 347889, -104521, 6689, -80812, -29606, -42278, 13666, -174479, -129032, 16629, -110356, -124325, -255690, -17196, -346045, 15456, -116397, 226076, -174696, 178153, -10546, -19137, -148145, -213035, -207980, -276669, 25379, 178882, -211566, -215732, -252475, -143085, -175961, -109072, -284587, -62597, -77105, 203096, 59822, -4385, -135711, 441343, -150399, 68571, -110584, -160270, -302779, -105757, 19007, 285855, 274187, -111009, 98284, 150084, -119637, -121557, 111539, -251234, -135014, 54467, 73302, -21505, -148769, -172014, 190902, 126636, 221240, 4609, -114705, -13669, 163494, 142696]
9433A42696c7157Q458n4766G8252b362G2O8820b656k89098D2321b65560N4977
9421b10583I4521b4585j16548C5781a20734B07290d6510m25549J91436Q8196m6012
9410b38439c1534j12019N6963C5301D674J7239b01805A400a64045d670j45726
9399a50396A88534b77482g9897c7075D2977b8247F1730a27988A6549c36924a13885
9387i7950J6282B9966e15787D8688L786c401k94385M3429f139C04321A07200b7323
9374D44456c73375a07859I3005d32695g8804P51D9915b63730B87734a30735j19265
9363b50000I2479a69948B8099e0539A95131p073a01414M4360l47118E3018c4517
9351C3556a2829j10830K2715B77501c50088A23052j0097b7199n7197l81550b5105
$$ y = [142696, -37157, -28699, -83465, 78252, -2362, 72, 68892, -2656, -291754, 42321, -265560, -210583, 94521, -24585, -141133, 35781, -120734, 207290, -46510, -472059, -280623, -192427, -238439, -31534, -143553, -86590, 35301, 4674, 21913, -201805, 1400, -164045, -4670, -150396, 188534, -277482, -79897, -37075, 42977, -28247, 61730, -127988, 16549, -336924, -113885, -97950, -81668, 29966, -515787, 48688, 52474, -3401, -297786, -254357, -6139, 304321, 107200, -27323, 444456, -373375, -107859, 93005, -432695, -78804, -78053, 49915, -263730, 287734, -130735, -250000, 92479, -169948, 28099, -50539, 195131, 188058, -101414, -57054, -404172, 53018, -34517, 33556, -12829, -123659, -100944, 277501, -350088, 123052, 112955, -27199, -84396, -465946, -25105]
9339e6792j92223p3054I2678a49672C5770b32584f0413n6625c5963r7042k33649
9328c66654a4098k77800B41713a98958A49411a7381j16756L3101H2889n933f9502
9316c72405F6984c07662H1962a68250D8626J11329N7259d67475K27000a13414
9305a50287n6081j84919B2153N9027L31762j75372A6973b96163a38068N7136n9116
9294a40048l36586F4905f6867k2242l56768a10821j5013A63402B7303b61822A5483
9282h0129F2987a93520R4884L4197B1279K52622K2356r2611b63333N3605B5076
9270d7563A08226n0875b28538C5010Q4988B2792J89087B2434d4163l09143A64185
9258A46397c5581j27766F0478J00080Q4730o9392H2133K32782B0852i0763C8604
$$ y = [-56792, -249015, -322069, 92678, -149672, 35770, -232584, -60413, -117038, -35963, -133005, -366654, -14098, -291898, 241713, -198958, 149411, -17381, -134137, -101036, 82889, 76956, -69502, -372405, 66984, -307662, 81962, -168250, 48626, 159955, 217214, -467475, -240475, -113414, -150287, -206368, -391287, 22153, 81180, 412942, 237570, 16973, -296163, -138068, -80932, -140048, -476634, 64905, -66867, -89109, -445877, -110821, -125834, 163402, 27303, -261822, 15483, -80129, 62987, -193520, -98636, -64439, 21279, 273901, 296257, 203646, -263333, -209728, 25076, -47563, 108226, 57351, -228538, 35010, 119998, 22792, 211879, 22434, -44163, -353306, 164185, 146397, -35581, -163347, 60478, 160558, 245288, 175896, 82133, 314915, 20852, -90763, 38604]
9246b66232J2709B7325P0287b93600B1776c19341a2370A3645L3645h8644B27439
9234c22178D8246N4074b04168f819m6790A22909c24413J16297A1583M5497b10818
9222a34554b8583I9937k0464B6899c17085B0839J29011a79841l2450b0981C16479
9210b124H3346e2478A30374a4186j25812B30462r7781d6296j56124p9855E8415
9198B04243c72886g4741A34547a36771J4254j08323E0773L8953f2084a388k33350
9187b34738A58805c13915P1040I2069J03811i8812F2671l251b70248k41328D3937
9175B93985a79316N5105j37296Q6781F1373h6799L615j30007C8785b19280p0637
9164b89917M6406P5242c9318r766A8208M7426h6510J473a6884r6247j80004J41258
$$ y = [-266232, -253523, 27325, 97612, -293600, 21776, -319341, -12370, 13645, 47290, -88644, 227439, -322178, 48246, 102320, -204168, -6819, -53609, 122909, -324413, -208116, 11583, 57080, -210818, -134554, -28583, 99937, 79473, 26899, -317085, 20839, 149850, -179841, -212291, -20981, 316479, -2124, 83346, -52478, 130374, -14186, -139998, 230462, 132681, -46296, -202420, -282275, 58415, 204243, -372886, -74741, 134547, -136771, -122517, -230840, 50773, 89726, -62084, -1388, -234738, 158805, -313915, -242875, 92069, 195880, -98812, 62671, 59420, -270248, -511576, 43937, 293985, -179316, -124211, -261507, -174726, 61373, -86799, -83184, -213191, 38785, -219280, -289917, -243511, -168269, -39318, -49084, 18208, 65634, -86510, -85037, -16884, -113131, -293135, -151877]
9152a51877j60657B30979a21511l0708A14192K29921H7729K5722D9802J02654
9142A52456B2877b207p5473A73262a4429k39293f4284l3472j59747l7159l7662
9131c32324B53563H0379a47559A85559b19253a4509k12127B15086i2071B27871
9120b06882i8487l0504L2526b6100n6066l8757E2877c17449J25821B01644D6308
9108c65567a73117E86L02889h2105K862K3668j5709j67936f7013j25117a6654
9096E8874a32496G3996k9625a28334j52205G9380a67050j6491A68929G8381a61740
9084E51633h7570H841a5303D5056g2022n8400k0281E6694b65398C6148N1209e7415
9071a58885M6737d4533j5701A4757A60c58138a04287p5413o8442B121b51714A45377
$$ y = [-151877, -312534, 230979, -121511, -152219, 114192, 344113, 87729, 113451, 49802, 152456, 22877, -2207, -77680, 173262, -14429, -253722, -64284, -97756, -257503, -294662, -332324, 253563, 80379, -147559, 185559, -219253, -14509, -226636, 215086, -92071, 227871, -206882, -98487, -128991, -96465, -26100, -82166, -120923, 52877, -317449, -191628, 201644, 46308, -365567, -173117, 586, 303475, -82105, -79243, -55575, -71284, -239220, -67013, -192130, -16654, 58874, -132496, 73996, 44371, -128334, -280539, 79380, -167050, -183541, 168929, 78381, -161740, 551633, -87570, 8841, -15303, 45056, -72022, -130422, -150703, 56694, -265398, 36148, 87357, -57415, -158885, -112148, -44533, -60234, 14757, 160, -358138, -104287, -179700, -248142, 2121, -251714, 145377]
9058a58073g1891j66612A11391h0043A87004C4313J20567K21067a00756j860b9016
9046e337B8377c60255A28541B047M6646a37495o924l33931a63709O8353a3550
9034A79391i4944j28015a1173A88406h4352G4272a54767b0384k26429G2358a61873
9022i807o1320k0182k006D00030b521j00746q152a5414j62581P9185B0937J99497
9010B20434c57878J2082F7177a11035C92646i3504l3141k59694B68053I3393e9497
8998a18876M9423o7912a1879k42B7627a96456H5296B4760c45091a41088D3184
8986C24358i2792D2434J18630F0868J02660b31292R4911B376a04955L8915j29663
8975a95703K8424k40880a13303C3825c99984B2111Q043A1456a07442k13227Q57
$$ y = [-158073, -71891, -238503, 111391, -80043, 187004, 34313, 154880, 375947, -100756, -102616, -29016, -5337, 28377, -360255, 128541, 2047, 48693, -137495, -144419, -478350, -163709, -95356, -13550, 179391, -94944, -222959, -11173, 188406, -84352, 74272, -154767, -20384, -246813, 72358, -161873, -9807, -71127, -91309, -93315, 400030, -2521, -103267, -111419, -15414, -177995, -98810, 20937, 220434, -357878, -345796, 67177, -111035, 392646, -93504, -126645, -386339, 268053, 93393, -59497, -118876, -69453, -137365, -11879, -12121, 27627, -196456, 85296, 24760, -345091, -141088, 43184, 324358, -92792, 42434, 161064, 60868, 163528, -231292, -136381, 2376, -104955, -66040, -195703, -167279, -408159, -113303, 33825, -399984, 22111, 30154, 11456, -107442, -320669, -319812]
8964c19812A64047a7975j82551b6805n534o2560j0387j55869a14216f596k56434
8953b63030e4334A48499B8617J60657G5422b1889j41008a4966k45346k2327A62190
8941g7101J2082H6558a65132A15858a65150L8748E4757c41847m361i8602j5506
8930a14108q1623j06954i8944B6262J20102K5248e5842B27130H4066b6092B64763
8918D34794J17688B32257o0723J17464K65242k29798R0311J3242M06829L88210
8908A223034P42546J109737K771491O535550F017232k859304j302371q67297l33590
8899F54670B54223J88792B14328n4684j8413f7387C66547J88134j46111b9403
8888b7353j03217L4538E8853e2047I3837a32076c4831q2871B75556a19815r9712
$$ y = [-319812, 164047, -17975, -200526, -26805, -32339, -94899, -105286, -261155, -114216, -6596, -263030, -54334, 148499, 28617, 189274, 75422, -21889, -162897, -14966, -260312, -282639, 162190, -77101, -65019, 86558, -165132, 115858, -165150, -126402, 54757, -341847, -346208, -98602, -114108, -195731, -302685, -98944, 26262, 146364, 171612, -55842, 227130, 84066, -26092, 264763, 434794, 552482, 232257, 171534, 288998, 554240, 324442, 414753, 427995, 834824, 1223034, 1965580, 3075317, 5846808, 12382358, 6017232, 3157928, 1855557, 988260, 654670, 254223, 443015, 214328, 159644, 141231, -67387, 366547, 554681, 408570, -29403, -27353, -130570, -96032, 58853, -52047, 93837, -132076, -34831, -117702, 275556, -119815, -219527]
8877b19527M4148c2049A51547J2856b04524N8390d0860N804A14950J5580K30044
8866C60574B3613b66486C5416r183E075c4089j63792c460A88291A5098R1805b4407
8853b11776l0437G3056l933b71639F7389J04437a05439j74865c3736A5134L6536
8842E1670c24047A68987l2126B155i4903k7361H050J50225C0414a9701k31853
$$ y = [-219527, -175379, -32049, 151547, 164403, -204524, -146134, -40860, -35056, 114950, 130530, 360574, 23613, -266486, 35416, 26233, 5075, -34089, -197881, -3460, 188291, 15098, 106903, -24407, -211776, -242213, 73056, 69123, -271639, 67389, 171826, -105439, -280304, -33736, 15134, 51670, -324047, 168987, 136861, 2155, -94903, -122264, 8050, 158275, 30414, -19701, -251554]
$$ [...]
##END NTUPLES=NMR SPECTRUM
##END=
