
##TITLE=UV1016_M2-1005-1001_6269080_aYreATrUgA
##JCAMPDX= 6.0         $$ Bruker NMR JCAMP-DX V2.0
##DATA TYPE= NMR SPECTRUM
##DATA CLASS= NTUPLES
##ORIGIN= BRUKER
##OWNER= Administrator
$$ 1.72 TOPSPIN		Version 2.1
$$ 2012-06-01 23:46:15.125 -0500  Administrator@TOPSPIN
$$ Compression mode = diff/dup
##.OBSERVE FREQUENCY= 400.13188235
##.OBSERVE NUCLEUS= ^1H
##.ACQUISITION MODE= SIMULTANEOUS (DQD)
##.ACQUISITION SCHEME= undefined
##.AVERAGES= 64
##.DIGITISER RES= 22
##SPECTROMETER/DATA SYSTEM= spect
##.PULSE SEQUENCE= noesygpps1d.comp
##.SOLVENT NAME= COFFEE_calctemp
##.SHIFT REFERENCE= INTERNAL, COFFEE_calctemp, 1, 14.96708
##AUDIT TRAIL= $$ (NUMBER, WHEN, WHO, WHERE, PROCESS, VERSION, WHAT)
$$ ##TITLE= Audit trail, TOPSPIN		Version 2.1
$$ ##JCAMPDX= 5.01
$$ ##ORIGIN= Bruker BioSpin GmbH
$$ ##OWNER= Administrator
$$ $$ C:\Bruker\TOPSPIN/data/COFFEE/nmr/UV1016_M2-1005-1001_6269080_aYreATrUgA/12/pdata/1/auditp.txt
$$ ##AUDIT TRAIL=  $$ (NUMBER, WHEN, WHO, WHERE, PROCESS, VERSION, WHAT)
(   1,<2012-06-01 23:46:09.937 -0500>,<Administrator>,<TOPSPIN>,<go>,<TOPSPIN 2.1>,
      <created by zg
	started at 2012-06-01 23:34:39.531 -0500,
	POWCHK enabled, PULCHK disabled,
       configuration hash MD5:
       D5 CA 7A 23 FE 6B EE E2 50 67 74 61 24 F7 5E 3B
       data hash MD5: 64K
       77 EF ED F7 1D 41 5B 35 2F 24 A9 58 B7 D0 95 B5>)
(   2,<2012-06-01 23:46:12.968 -0500>,<Administrator>,<TOPSPIN>,<proc1d>,<TOPSPIN 2.1>,
      <Start of raw data processing
       efp LB = 0.3 FT_mod = 6 PKNL = 1 PHC0 = 0 PHC1 = 0 SI = 128K 
       data hash MD5: 128K
       ED 3E 33 51 B7 85 B2 06 E3 A9 3A F4 DD 48 D7 82>)
(   3,<2012-06-01 23:46:14.296 -0500>,<Administrator>,<TOPSPIN>,<proc1d>,<TOPSPIN 2.1>,
      <pk PHC0 = 29.64661 PHC1 = 0 
       data hash MD5: 128K
       E7 B0 E4 3A D6 6D 63 E2 A8 7C 58 C6 9A 24 8F 7E>)
(   4,<2012-06-01 23:46:14.796 -0500>,<Administrator>,<TOPSPIN>,<proc1d>,<TOPSPIN 2.1>,
      <abs ABSG = 1 
       data hash MD5: 128K
       74 E7 2D 61 0C AD C2 41 D3 91 FD 62 81 28 7E 93>)
(   5,<2012-06-01 23:46:14.875 -0500>,<Administrator>,<TOPSPIN>,<proc1d>,<TOPSPIN 2.1>,
      <abs ABSG = 2 
       data hash MD5: 128K
       6E 4B A2 2C 2B 10 E5 70 D4 1D C5 6E BC 30 D0 0B>)
(   6,<2012-06-01 23:46:14.921 -0500>,<Administrator>,<TOPSPIN>,<proc1d>,<TOPSPIN 2.1>,
      <abs ABSG = 3 
       data hash MD5: 128K
       9A 90 AC 5B 3B C9 82 1D D2 FE 42 93 7F 3A B7 66>)
(   7,<2012-06-01 23:46:14.984 -0500>,<Administrator>,<TOPSPIN>,<proc1d>,<TOPSPIN 2.1>,
      <abs ABSG = 4 
       data hash MD5: 128K
       77 79 9B EA 38 19 73 C1 30 D5 7D C8 5D 78 9B 47>)
(   8,<2012-06-01 23:46:15.031 -0500>,<Administrator>,<TOPSPIN>,<proc1d>,<TOPSPIN 2.1>,
      <abs ABSG = 5 
       data hash MD5: 128K
       27 0E E9 7B 77 D1 5D 69 2F 06 C3 FB 8F 6A 25 1F>)
$$ ##END=
$$ 
$$ $$ hash MD5
$$ $$ B8 B8 4A F7 DD 69 90 51 6C 5E 40 87 F7 C2 FC 62
##$RELAX= 
##$RELAX= 
##$RELAX= 
##$RELAX= 
##$RELAX= 
##$RELAX= 
##$RELAX= 
##$RELAX= 
$$ [...]
##$TP07= 0
##$TPNAME0= <>
##$TPNAME1= <>
##$TPNAME2= <>
##$TPNAME3= <>
##$TPNAME4= <>
##$TPNAME5= <>
##$TPNAME6= <>
##$TPNAME7= <>
##$TPOAL= (0..7)
0.5 0.5 0.5 0.5 0.5 0.5 0.5 0.5
##$TPOFFS= (0..7)
0 0 0 0 0 0 0 0
##$TUNHIN= 0
##$TUNHOUT= 0
##$TUNXOUT= 0
##$USERA1= <user>
##$USERA2= <user>
##$USERA3= <user>
##$USERA4= <user>
##$USERA5= <user>
##$V9= 5
##$VALIST= <valist>
##$VCLIST= <CCCCCCCCCCCCCCC>
##$VD= 0
##$VDLIST= <DDDDDDDDDDDDDDD>
##$VPLIST= <PPPPPPPPPPPPPPP>
##$VTLIST= <TTTTTTTTTTTTTTT>
##$WBST= 2048
##$WBSW= 25
##$XGAIN= (0..3)
0 0 0 0
##$XL= 0
##$YL= 0
##$YMAX_a= 12402320
##$YMIN_a= -6772868
##$ZGOPTNS= <>
##$ZL1= 120
##$ZL2= 120
##$ZL3= 120
##$ZL4= 120
##$ABSF1= 14.96708
##$ABSF2= -5.58545
##$ABSG= 5
##$ABSL= 3
##$ALPHA= 0
##$AQORDER= 0
##$ASSFAC= 0
##$ASSFACI= 0
##$ASSFACX= 0
##$ASSWID= 0
##$AUNMP= <proc_prof1d_extract.lims>
##$AXLEFT= 0
##$AXNAME= <>
##$AXNUC= <1H>
##$AXRIGHT= 0
##$AXTYPE= 0
##$AXUNIT= <>
##$AZFE= 0.1
##$AZFW= 0.1
##$BCFW= 0
##$BC_mod= 0
##$BYTORDP= 0
##$COROFFS= 0
##$CY= 15
##$DATMOD= 1
##$DC= 0
##$DFILT= <>
##$DTYPP= 0
##$F1P= 0
##$F2P= 0
##$FCOR= 0.5
##$FTSIZE= 131072
##$FT_mod= 6
##$GAMMA= 0
##$GB= 0
##$INTBC= 1
##$INTSCL= 1
##$ISEN= 128
##$LB= 0.3
##$LEV0= 0
##$LPBIN= 0
##$MAXI= 10000
##$MC2= 0
##$MEAN= 0
##$ME_mod= 0
##$MI= 0
##$NCOEF= 0
##$NC_proc= -3
##$NLEV= 6
##$NOISF1= 0
##$NOISF2= 0
##$NSP= 0
##$NTH_PI= 0
##$NZP= 0
##$OFFSET= 14.96708
##$PC= 1
##$PHC0= 29.64661
##$PHC1= 0
##$PH_mod= 1
##$PKNL= yes
##$PPARMOD= 0
##$PPDIAG= 0
##$PPIPTYP= 0
##$PPMPNUM= 2147483647
##$PPRESOL= 1
##$PSCAL= 4
##$PSIGN= 0
##$PYNMP= <proc.py>
##$REVERSE= no
##$SF= 400.130005414536
##$SI= 131072
##$SIGF1= 0
##$SIGF2= 0
##$SINO= 400
##$SIOLD= 131072
##$SPECTYP= <>
##$SREGLST= <1H.CDCl3>
##$SSB= 0
##$STSI= 131072
##$STSR= 0
##$SW_p= 8223.68421052632
##$SYMM= 0
##$S_DEV= 0
##$TDeff= 65536
##$TDoff= 0
##$TI= <>
##$TILT= no
##$TM1= 0
##$TM2= 0
##$TOPLEV= 0
##$USERP1= <user>
##$USERP2= <user>
##$USERP3= <user>
##$USERP4= <user>
##$USERP5= <user>
##$WDW= 1
##$XDIM= 131072
##$YMAX_p= 506030743
##$YMIN_p= -27055
##$CURPLOT= <Network HP LaserJet P1505>
##$CURPRIN= <$Network HP LaserJet P1505>
##$DFORMAT= <normdp>
##$LAYOUT= <+/1D_H.xwp>
##$LFORMAT= <normlp>
##$PFORMAT= <normpl>
##$SURQMSG= 1
$$ End of Bruker specific parameters
$$ ---------------------------------
##NTUPLES= NMR SPECTRUM
##VAR_NAME=  FREQUENCY,     SPECTRUM/REAL,   SPECTRUM/IMAG
##SYMBOL=    X,             R,               I
##VAR_TYPE=  INDEPENDENT,   DEPENDENT,       DEPENDENT
##VAR_FORM=  AFFN,          ASDF,            ASDF
##VAR_DIM=   131072,        131072,          131072
##UNITS=     HZ,            ARBITRARY UNITS, ARBITRARY UNITS
##FACTOR=    0.0627417313425165, 1,          1
##FIRST=     8223.62146879498, 764,          -107810
##LAST=      0,             508,             -109782
##MIN=       0,             -27055,          0
##MAX=       8223.62146879498, 506030743,    0
$$ Real data points
##PAGE= N=1
##DATA TABLE= (X++(R..R)), XYDATA
$$ [...]
61211A159972R27N82J805M308O330O829O269N738O194Q144J0954J2729J1913R002
61197A251696O020M507M555N376N913N177L021O55l21M42J756K194J341q6r14
61182A291332n34M36P66K14QJ201L027L674K475O95K49K050N451Q752J0354R997
61166A340147Q838Q197Q409R053R726J0172J0112R571R109R258R914J0656J1171
61153A464333J1053R791P628N925N776O548O607N391M025L992N751Q578J1188
61140A556586J2605J3027J3739J5731J8464K0410K0591J9085J6413J3152R937
61129A729740P099M230P75k928n779p127p402p514q058q990r785r963r906j0754
61115A653638j2951j5305j6255j5800j5292j5522j6011j6191j6142j5908j5091
$$ plain form
61211 1159972 1160899 1161481 1163286 1167594 1173924 1180753 1187022 1192760 1198954 1207098 1218052 1230781 1242694 1251696
61197 1251696 1257716 1262223 1266778 1272154 1278067 1283244 1286265 1286920 1286599 1287041 1288797 1290991 1292332 1292246 1291332
61182 1291332 1290798 1291234 1292000 1292214 1292222 1293423 1296450 1300124 1302599 1303294 1303543 1305593 1311044 1319796 1330150 1340147
61166 1340147 1348985 1357182 1365591 1374644 1384370 1394542 1404654 1414225 1423334 1432592 1442506 1453162 1464333
61153 1464333 1475386 1485177 1492805 1498730 1504506 1511054 1517661 1523052 1527077 1531069 1536820 1545398 1556586
61140 1556586 1569191 1582218 1595957 1611688 1630152 1650562 1671153 1690238 1706651 1719803 1729740
61129 1729740 1736839 1741069 1741844 1738916 1733137 1726010 1718608 1711094 1703036 1694046 1684261 1674298 1664392 1653638
61115 1653638 1640687 1625382 1609127 1593327 1578035 1562513 1546502 1530311 1514169 1498261 1483170
61104A483170j3612j2049j0841r784q658p578o324m231j297J455L365N150P711
61091A426477J0642J2838J3909J4013J2869J0275P315N529M963M351L437L590
61079A530208N654Q599J1148J3452J6100J8589K0124K1292K3430K6692L0024L2854
61067A758166L5534L8189M0495M2684M5490M8865N1856N4103N6220N8382N9756
61056B289740N9893N9487N9032N7871N5491N2658N0208M7628M4005L9746L5979
61045B851738L2731K8807K3267J5994P170k681j2245k0127k6056l0774l4946l8870
61033B794008m2885m6984n0302n1924n2127n1938n1673n0855m9313m7405m5227
61022B253375m2632l9918l7565l5419l3053l0739k8996k7437k5195k2301j9423
$$ plain form
61104 1483170 1469558 1457509 1446668 1436884 1428226 1420648 1414324 1410093 1408796 1410251 1413616 1418766 1426477
61091 1426477 1437119 1449957 1463866 1477879 1490748 1501023 1508338 1513867 1518830 1523181 1526618 1530208
61079 1530208 1535862 1544461 1555609 1569061 1585161 1603750 1623874 1645166 1668596 1695288 1725312 1758166
61067 1758166 1793700 1831889 1872384 1915068 1960558 2009423 2061279 2115382 2171602 2229984 2289740
61056 2289740 2349633 2409120 2468152 2526023 2581514 2634172 2684380 2732008 2776013 2815759 2851738
61045 2851738 2884469 2913276 2936543 2952537 2959707 2957026 2944781 2924654 2898598 2867824 2832878 2794008
61033 2794008 2751123 2704139 2653837 2601913 2549786 2497848 2446175 2395320 2346007 2298602 2253375
61022 2253375 2210743 2170825 2133260 2097841 2064788 2034049 2005053 1977616 1952421 1930120 1910697
61011A910697j6475j2910r324p115o249n000k373O01K632L835M995O338P884R959
60997A887495J2553J5034J7200J9825K3474K7594L1411L5015L8884M2942M6657
60986B198084M9652N1865N3653N5922N9366O3488O7219P0594P4701P9730Q4474
60975B908748Q8385R2757R8931J06315J13265J19314J25514J32896J41319J49713
60965D077157J57165J64095J72391J84061J99782K19148K41817K67474K95247
60956E978337L24508L56123L91715M32211M78375N31935N94120O63871P40091
60947A0491286Q25177R23584J037835J169757J325135J512186J735447J995963
60939B1016370K292095K599666K837955K872847K592466K006036J266591N83466
$$ plain form
61011 1910697 1894222 1881312 1871988 1864873 1858624 1853624 1851251 1851852 1854484 1858319 1863314 1869652 1877536 1887495
60997 1887495 1900048 1915082 1932282 1952107 1975581 2003175 2034586 2069601 2108485 2151427 2198084
60986 2198084 2247736 2299601 2353254 2409176 2468542 2532030 2599249 2669843 2744544 2824274 2908748
60975 2908748 2997133 3089890 3188821 3295136 3408401 3527715 3653229 3786125 3927444 4077157
60965 4077157 4234322 4398417 4570808 4754869 4954651 5173799 5415616 5683090 5978337
60956 5978337 6302845 6658968 7050683 7482894 7961269 8493204 9087324 9751195 10491286
60947 10491286 11316463 12240047 13277882 14447639 15772774 17284960 19020407 21016370
60939 21016370 23308465 25908131 28746086 31618933 34211399 36217435 37484026 38067492
60931C8067492J04699j27646j40758P492K18185L36825K04366k41236r09673j612443
60921C5907303k178616k530488k676349k662968k542775k363390k160550j952032
60913A6840135j743069j538711j347499j175288j022342q87771p72284o75342
60905G677829n93639n23995m65106m15601l73008l35430l02051k71727k43375
60896D153897k17676j95800j76601j57967j40720j27702j18845j10961j02956
60887B804669r7118r3962q9964q2670p4535o9114o6389o4517o3379o3242o2193
60876A977586n8270n2772m8579m6270m4474m2848m1969m1138l8981l5789l2956
60865A493540l0635k8114k5854k4800k4093k1905j8459j5958j5391j5514j5182
$$ plain form
60931 38067492 38172191 38044545 37903787 37911279 38129464 38466289 38670655 38429419 37519746 35907303
60921 35907303 33728687 31198199 28521850 25858882 23316107 20952717 18792167 16840135
60913 16840135 15097066 13558355 12210856 11035568 10013226 9125455 8353171 7677829
60905 7677829 7084190 6560195 6095089 5679488 5306480 4971050 4668999 4397272 4153897
60896 4153897 3936221 3740421 3563820 3405853 3265133 3137431 3018586 2907625 2804669
60887 2804669 2707551 2613589 2523625 2440955 2366420 2297306 2230917 2166400 2103021 2039779 1977586
60876 1977586 1919316 1866544 1817965 1771695 1727221 1684373 1642404 1601266 1562285 1526496 1493540
60865 1493540 1462905 1434791 1408937 1384137 1360044 1338139 1319680 1303722 1288331 1272817 1257635
60854A257635j4684j4358j3778j2892j2383j2276j1625j0112q627p686o601m884
60842A127729l351l018l747m651n125n007m536m685o574r828j2204j1778r109
60829A044116o468n284n125m922m316l632l204l141l450m058m789n381n517m939
60815I79890l757k646k282k417j898n5K230L316K605J031l7K55K159N118P478
60800I90990P568N627L648K697J646n60k749l224k501k445l233l367k522k191
60786I89384l224m705n806o846p942q453q605r795j2165j3717j3166j1946j1755
60773H71259j1655r741o619m966n850p566q151p451o404n575m923m225l461l076
60759G81596l530m237l750j863n57j587l766m331k724j172j399k523k803j984
$$ plain form
60854 1257635 1242951 1228593 1214815 1201923 1189540 1177264 1165639 1155527 1146900 1139214 1132613 1127729
60842 1127729 1124378 1121360 1117613 1112962 1107837 1102830 1098294 1093609 1087035 1077207 1065003 1053225 1044116
60829 1044116 1037648 1032364 1027239 1022317 1018001 1014369 1011165 1008024 1004574 1000516 995727 990346 984829 979890
60815 979890 976133 973487 971205 968788 966890 966835 969065 972381 974986 976017 975980 976235 978394 983512 990990
60800 990990 998558 1004185 1007833 1010530 1012176 1011616 1008867 1005643 1003142 1000697 997464 994097 991575 989384
60786 989384 986160 981455 975649 968803 960861 952408 943803 934008 921843 908126 894960 883014 871259
60773 871259 859604 849863 843244 838278 832428 824862 816711 809260 802856 797281 792358 788133 784672 781596
60759 781596 778066 773829 770079 768216 767659 766072 762306 757975 755251 754079 752680 750157 747354 745370
60745G45370r60j22Q83K259L672M549M432L321J863P88J42m55q40m32N36Q44j41
60728G65709j519k029j551r20q51j719l685o106p220n629k199M40N66j121k811
60713G29355l524l260k110l32J073R75m15j523j219q5N31J61n54q76n03N85K068
60696G20347L059K668J045o25j416j547j694j825j216M21K327L461L694L796M138
60681G36633L934K250m29k418k761k210j971k101j771n77R74K088K307J833J495
60666G37276J999K899K927J631m8j236k055k467j631L26J241n20l289l976k232
60651G30845n00k13m22l92r95k529l546l090k288k339k529j800r27j387k964m038
60635G00886l724k470j098k69l29o87p9J716L194L184K546K693L317L194K462
$$ plain form
60745 745370 744410 744288 745171 747430 751102 755651 760083 763404 765267 766055 766197 765742 764902 764470 765006 765850 765709
60728 765709 764190 762161 760610 759690 758839 757120 753435 747329 740109 734480 732281 732721 733287 732166 729355
60713 729355 725831 722571 720461 720129 721202 722177 721762 720239 719020 718935 719466 719627 719073 718197 717694 718279 720347
60696 720347 723406 726074 727119 726494 725078 723531 721837 720012 718796 719217 721544 725005 728699 732495 736633
60681 736633 740567 742817 742388 739970 737209 734999 733028 730927 729156 728579 729553 731641 733948 735781 737276
60666 737276 739275 742174 745101 746732 746684 745448 743393 740926 739295 739621 740862 740342 737053 733077 730845
60651 730845 730345 730132 729710 729318 728323 725794 722248 719158 716870 714531 712002 710202 709275 707888 704924 700886
60635 700886 697162 694692 693594 693325 692996 692309 692230 693946 697140 700324 702870 705563 708880 712074 714536
60620G14536K464L505M385M214L413K869L058M012N135N153L245K59j967k442
60606G51839j610m18K71k82k120m100m853m241l071j723m5J541K048J267J41m09
60590G34235k02P02K297M092N020M327K259k22k023k460j869j578k633m508n665
60575G31772n290l816j982k18R75J076K67n37o29m9Q65J812K354K151J565J345
60559G31661J617J761J555J593K219K796K543J680J003P88O04J66k46j83N14J749
60543G51820L260M521M824L801J940L82j5O35J527K074K407K988L966M932N261
60528G94323M701L672K897K725L040L811N146O525O746N347L583L027L736M722
60514H54001N759P328R018R677R417R849J1787J4180J5883J7021J7756J7337J5456
$$ plain form
60620 714536 717000 720505 724890 729104 732517 735386 738444 742456 747591 752744 755989 756248 754281 751839
60606 751839 750229 749811 750082 749800 747680 743580 738727 734486 731415 729692 729647 731188 733236 734503 734644 734235
60590 734235 734033 734735 737032 741124 746144 750471 752730 752508 750485 748025 746156 744578 741945 737437 731772
60575 731772 726482 722666 720684 720466 721441 722517 722784 722247 721618 721569 722434 724246 726600 728751 730316 731661
60559 731661 733278 735039 736594 738187 740406 743202 745745 747425 748428 749216 749820 749986 749740 749557 750071 751820
60543 751820 755080 759601 764425 768226 770166 770548 770533 771168 772695 774769 777176 780164 784130 789062 794323
60528 794323 799024 802696 805593 808318 811358 815169 820315 826840 833586 838933 842516 845543 849279 854001
60514 854001 859760 867088 876106 885783 895200 905049 916836 931016 946899 963920 981676 999013 1014469
60501A014469J3306J1819J0060O751K533p70k445l032k880k055j153o54J45K233
60487A048327N215P965J0463J3446J6527J8495J9523K1323K4583K7777K9210K9123
60475A271977K9096L0217L2338L4291L4332L1165K5165J8139J1494N124j604q325
60463A513409j3751j7031j8576j9460k0156k0019j8160j4587j0183n792k022L59
60451A354031J087J728M787J0636J6535J9832K1050K2573K5481K9380L4359M0956
60439A582435M8350N4615N9023O2481O5410O6673O5122O1055N5764N0437M5635
60428B217000M1025L5655K9321K3245J8291J2968M631p434k1628l6421n1249o5039
60416B200365p5875q2833q6576q7557q5321q0336p4857p0701o7309o3023n7336
$$ plain form
60501 1014469 1027775 1039594 1049654 1056405 1058938 1058168 1055723 1052691 1049811 1047756 1046603 1045949 1046094 1048327
60487 1048327 1053542 1061507 1071970 1085416 1101943 1120438 1139961 1161284 1185867 1213644 1242854 1271977
60475 1271977 1301073 1331290 1363628 1397919 1432251 1463416 1488581 1506720 1518214 1523338 1521734 1513409
60463 1513409 1499658 1482627 1464051 1444591 1424435 1404416 1386256 1371669 1361486 1355694 1353672 1354031
60451 1354031 1355118 1356846 1361633 1372269 1388804 1408636 1429686 1452259 1477740 1507120 1541479 1582435
60439 1582435 1630785 1685400 1744423 1806904 1872314 1938987 2004109 2065164 2120928 2171365 2217000
60428 2217000 2258025 2293680 2323001 2346246 2364537 2377505 2382136 2374702 2353074 2316653 2265404 2200365
60416 2200365 2124490 2041657 1955081 1867524 1782203 1701867 1627010 1556309 1489000 1425977 1368641
60405A368641n0920m4457l8562l4197l1892l0775k9143k5984k1698j7652j5126
60394A028235j4239j3757j2572j1232j1067j1927j2096j0700q804p512o391m748
60382I03190l301l246m296m842l886k012n74m38j347k153j921r29k27k01l15l12
60366H73190p24j798k791k852j975o16Q71K052K405K074J990K685L546L662K925
60351H84644J915J275J494K584L666L724L119L379M969O289N791M167L359L941
60337I34316M692M586M085M154M839N412N629O171P475Q511P724N358L787M695
60323A011434O810P726P169O877P613Q224P749O562N073L155J476J510L164M183
60309A088725L180J797K330M464O030O145N824N927O155O031N737N732O361P793
$$ plain form
60405 1368641 1317721 1273264 1234702 1200505 1168613 1137838 1108695 1082711 1061013 1043361 1028235
60394 1028235 1013996 1000239 987667 976435 965368 953441 941345 930645 921841 914329 907938 903190
60382 903190 899889 896643 892347 887505 883619 881607 881033 880595 879248 877095 875174 874245 874018 873817 873502 873190
60366 873190 872466 870668 867877 865025 863050 862434 863305 865357 867762 869836 871826 874511 878057 881719 884644
60351 884644 886559 887834 889328 891912 895578 899302 902421 905800 910769 917058 922849 927016 930375 934316
60337 934316 939008 943594 947679 951833 956672 962084 967713 973884 981359 989870 997594 1002952 1006739 1011434
60323 1011434 1018244 1025970 1033139 1040016 1047629 1055853 1063602 1070164 1075237 1078392 1079868 1081378 1084542 1088725
60309 1088725 1091905 1093702 1096032 1100496 1106526 1112671 1118495 1124422 1130577 1136608 1142345 1148077 1154438 1162231
60295A162231R801J1777J3352J4513J4895J3643J0647P074M006J281j626m412
60283A257182o532q221r884j1065j1137j0505j0059r779q960p608o612o519o880
60270A143421o798n694l788k260k439m350o449p227o470m639j934J195L684N041
60256A101293O295Q664J1742J4051J4877J4615J3814J2926J2492J2448J1666R381
60244A244264O664N261N218N003L777K147N70j591m975r145j3147j6321j8300
60231A209425j8853j8178j6871j5337j3544j1451r360p846p429q052q682q055
60219A065767o317n226n997p490p633o229n124n619o876p144n735l475j827j789
60205I89286l156m673n212m686l545j852M05K437L117K399J504J525K313K903
$$ plain form
60295 1162231 1172032 1183809 1197161 1211674 1226569 1240212 1250859 1257933 1261939 1263220 1261594 1257182
60283 1257182 1250650 1242429 1232545 1221480 1210343 1199838 1189779 1180000 1171040 1163432 1156820 1150301 1143421
60270 1143421 1136623 1130929 1127141 1124881 1122442 1118092 1111643 1104416 1097946 1093307 1091373 1092568 1096252 1101293
60256 1101293 1107588 1116252 1127994 1142045 1156922 1171537 1185351 1198277 1210769 1223217 1234883 1244264
60244 1244264 1250928 1256189 1261407 1266410 1270187 1272334 1272904 1271313 1266338 1257193 1244046 1227725 1209425
60231 1209425 1190572 1172394 1155523 1140186 1126642 1115191 1105831 1097985 1090556 1082504 1073822 1065767
60219 1065767 1059450 1054224 1048227 1040737 1033104 1026875 1021751 1016132 1009256 1002112 996377 992902 991075 989286
60205 989286 986130 981457 976245 971559 968014 966162 966567 969004 972121 974520 976024 977549 979862 982765
60191I82765K611J694J238K237M397O123O082M558K850J781J380J474J791J743
60177A022724R64r6o99o01J98J933M346O126O276N702O151P761R044R286R359
60162A088474R849R983R291Q977J0412J3138J5434J6412J6446J5915J4744J3290
60150A242365J2574J3039J3761J3669J3110J3280J4122J3944J1783R170Q303Q974
60138A388094Q929P252N565N160M753K555o98k715l049l605n643q020q913q116
60124A381549o987o834p820q957q893p190m943l687l746m055l578k258p43J20
60110A311978m08k344m562n696n567n165n237n593n813n845n647m939l679k277
60096A249206j064%R61J672K113K514K889K838K055Q21j16q4R17K095K670K988
$$ plain form
60191 982765 985376 987070 988308 990545 994942 1001065 1007147 1011705 1014555 1016336 1017716 1019190 1020981 1022724
60177 1022724 1023688 1023592 1022893 1022292 1022490 1024423 1028769 1034895 1041171 1046873 1053024 1060785 1069829 1079115 1088474
60162 1088474 1098323 1108306 1117597 1126574 1136986 1150124 1165558 1181970 1198416 1214331 1229075 1242365
60150 1242365 1254939 1267978 1281739 1295408 1308518 1321798 1335920 1349864 1361647 1370817 1379120 1388094
60138 1388094 1397023 1404275 1409840 1415000 1419753 1422308 1421610 1418895 1415846 1412241 1406598 1398578 1389665 1381549
60124 1381549 1374562 1367728 1359908 1350951 1342058 1334868 1329925 1326238 1322492 1318437 1314859 1312601 1311858 1311978
60110 1311978 1311570 1309226 1304664 1298968 1293401 1288236 1282999 1277406 1271593 1265748 1260101 1255162 1251483 1249206
60096 1249206 1248142 1248142 1249103 1250775 1252888 1255402 1258291 1261129 1263184 1264005 1263889 1263805 1264722 1266817 1269487 1272475
60080A272475M222O531Q257P819N905M650M920N640N798N737O030O364O202N716
60066A356266N233M463L233K517L572O044P960Q023P250P519Q932R676Q617O865
60052A446170O002N714M581K741K008L097M444M512L741L171K488R67o73r81M4
60037A488026J071J346J183P34l08j757k931l714m572n689p038r045j1913j4452
60023A430941j5093j4094j3332j3731j4351j4308j4037j4075j3974j3214j2149
60012A278583j1317j0672j0214j0321j0840j0817r950r356r882j0538r722p556
60000A157398n679n013m826m095k799j541o24j3K13n5m40j80J012K434L119L034
59984A141945L095L962N312O435O845O146M106J528Q8M09R35q2k070l002k455
$$ plain form
60080 1272475 1276697 1283228 1291485 1299304 1305209 1309859 1314779 1320419 1326217 1331954 1337984 1344348 1350550 1356266
60066 1356266 1361499 1365962 1369195 1371712 1375284 1381328 1389288 1397311 1404561 1412080 1421012 1430688 1439305 1446170
60052 1446170 1452172 1457886 1462467 1465208 1467216 1470313 1474757 1479269 1483010 1486181 1488669 1489636 1488963 1487982 1488026
60037 1488026 1489097 1490443 1491626 1492360 1492052 1490295 1487364 1483650 1479078 1473389 1466351 1457306 1445393 1430941
60023 1430941 1415848 1401754 1388422 1374691 1360340 1346032 1331995 1317920 1303946 1290732 1278583
60012 1278583 1267266 1256594 1246380 1236059 1225219 1214402 1204452 1195096 1185214 1174676 1164954 1157398
60000 1157398 1151719 1146706 1141880 1137785 1134986 1133445 1132821 1132808 1133021 1132966 1132526 1132346 1133358 1135792 1138911 1141945
59984 1141945 1145040 1149002 1154314 1160749 1167594 1173740 1177846 1179374 1179462 1179871 1180806 1180724 1178654 1175652 1173197
59969A173197k226l737o320q484r641r977r687r116q959r597j0651j1546j1979
59956A061277j1606j0034p551n237l857l189k778k734l203l726l747l454l397
59943I96764l468k939j622l96k91j189j873j479n20l5p1K89J424K729L768M786
59927I95877N576N218L871L493N311P510P252M392J324m96j823l346m276l983
59913A025900l351l568m525n231m987l653j594L15J347J833K550L293L184K415
59899A013928K183K657K520J164j52j16R06J882K614L186K919J222j050k091r30
59884A030842J746M165M701L259J657J844L539M593M001L204L915N868P700Q905
59870A089939R887J0854J1609J1813J0792P906L865P21l95n40j067j487o36R62
$$ plain form
59969 1173197 1170971 1167234 1160914 1152430 1142789 1132812 1123125 1114009 1105050 1095453 1084802 1073256 1061277
59956 1061277 1049671 1039637 1032086 1026849 1022992 1019803 1017025 1014291 1011088 1007362 1003615 1000161 996764
59943 996764 993296 990357 988735 988339 988048 986859 984986 983507 982987 982952 982881 983170 984594 987323 991091 995877
59927 995877 1001453 1006671 1010542 1014035 1019346 1026856 1034108 1038500 1039824 1039328 1037505 1034159 1029883 1025900
59913 1025900 1022549 1018981 1014456 1009225 1004238 1000585 998991 999306 1000653 1002486 1005036 1008329 1011513 1013928
59899 1013928 1016111 1018768 1021288 1022452 1022300 1022184 1023090 1024972 1027586 1030772 1033691 1034913 1033863 1031772 1030842
59884 1030842 1032588 1036753 1041454 1044713 1046370 1048214 1051753 1056346 1060347 1063551 1067466 1073334 1081034 1089939
59870 1089939 1099826 1110680 1122289 1134102 1144894 1152800 1156665 1157386 1156991 1156451 1155384 1153897 1153261 1154223
59856A154223J707J557K217M395O368O107L922K088K213L638M487L703J689o87
59842A197627k938m527m655l328k075k362l598l832k367l95Q56J219R04L34Q71
59827A171734L753P759R849R036P793Q394R812R896Q905Q586R019Q777P710P089
59813A288112P118O378M206J790M18Q7L48J241K529L124K205L97q29p05K99J300
59797A318018K004K946M659O715P806P212N884N607P081R152J0078R323Q008P521
59783A412014P778P282N212K863K142L037L763L334K517J854L82k652o026p811
59769A435689p734p183p309q181r382j0429j0710r866q287o787n829n289m632
59756A334071l242j174L24j15k054l441l183k451k747l864m699m982m945m192
$$ plain form
59856 1154223 1155930 1157487 1159704 1164099 1170467 1176574 1180496 1182584 1184797 1188435 1192922 1196625 1198314 1197627
59842 1197627 1194689 1190162 1185507 1182179 1180104 1177742 1174144 1170312 1167945 1167550 1168406 1169625 1170529 1170863 1171734
59827 1171734 1175487 1183246 1193095 1202131 1209924 1218318 1228130 1238026 1246931 1255517 1264536 1273313 1281023 1288112
59813 1288112 1295230 1301608 1305814 1307604 1308022 1308109 1308457 1309698 1312227 1315351 1317556 1317953 1317124 1316419 1316718 1318018
59797 1318018 1320022 1322968 1327627 1334342 1342148 1349360 1355244 1360851 1367932 1377084 1387162 1396485 1404493 1412014
59783 1412014 1419792 1427074 1432286 1435149 1437291 1440328 1444091 1447425 1449942 1451796 1452178 1449526 1443500 1435689
59769 1435689 1427955 1420772 1413463 1405282 1395900 1385471 1374761 1364895 1356608 1349821 1343992 1338703 1334071
59756 1334071 1330829 1329655 1329979 1329864 1327810 1324369 1321186 1318735 1315988 1312124 1307425 1302443 1297498 1293306
59742A293306k350l39M45k2n31m56l98j089k534m146n061m573k957j590j614k691
59726A263400l664l933l637l008k386k353l059l793l874l522l225k879k251j572
59712A220244q80M64K690M776N654N612N526N497N379N840P444R246R857R544
59698A296893R863J1402J3229J4448J5018J5067J4614J3996J3529J2824J1465
59687A442348J0033R441R465R117Q274P627P239O488N523N336O113O683O035M446
59673A544168K846J863J646J861J724Q11k28m83j49j93q56j447j580j585j618
59658A546780j383q32k27M76J470K353K605K787M110O513Q320Q287P277P368R652
59643A605556J3236J6118J6911J5933J4579J3750J3375J3425J4240J5284J4977
$$ plain form
59742 1293306 1290956 1290617 1291062 1291040 1290509 1290053 1289655 1288566 1286032 1281886 1276825 1272252 1269295 1267705 1266091 1263400
59726 1263400 1259736 1255803 1252166 1249158 1246772 1244419 1241360 1237567 1233693 1230171 1226946 1224067 1221816 1220244
59712 1220244 1219364 1219828 1222518 1227294 1232948 1238560 1244086 1249583 1254962 1260802 1268246 1277492 1287349 1296893
59698 1296893 1306756 1318158 1331387 1345835 1360853 1375920 1390534 1404530 1418059 1430883 1442348
59687 1442348 1452381 1461822 1471287 1480404 1488678 1496305 1503544 1510032 1515555 1520891 1527004 1533687 1539722 1544168
59673 1544168 1547014 1548877 1550523 1552384 1554108 1554919 1554691 1554208 1554059 1553866 1553010 1551563 1549983 1548398 1546780
59658 1546780 1545397 1544565 1544338 1544814 1546284 1548637 1551242 1554029 1558139 1564652 1572972 1581259 1588536 1595904 1605556
59643 1605556 1618792 1634910 1651821 1667754 1682333 1696083 1709458 1722883 1737123 1752407 1767384
59632A767384J2740J0185Q805P700N230K070L25J40m38k224l895m725o035q764
59618A788498j1495j2298j1344j0382j0390j0936j1392j1720j2043j2059j1107
59607A663332q868o043l865k610j194J010K875L234L100M348O560P301N841M507
59593A679528N416P520Q099O041K465j151m308p288j0462j3791j6791j9202k1607
59580A614469k4701k7959k9787k9099k6237k2453j9138j7275j6665j5905j4196
59569A371054j2800j3444j5584j6973j6813j6461j6775j6797j5865j4998j5012
59558A199532j4909j3684j2346j2390j3112j2261r182n834m377m775n129l783
59546A087750r00J837K973K598J870J507J319J166J483K625M149N119M883L688
$$ plain form
59632 1767384 1780124 1790309 1799114 1806814 1812044 1814114 1814439 1814579 1814141 1811917 1808022 1803297 1797262 1788498
59618 1788498 1777003 1764705 1753361 1742979 1732589 1721653 1710261 1698541 1686498 1674439 1663332
59607 1663332 1654464 1648421 1644556 1641946 1640752 1641762 1644637 1647871 1650971 1655319 1661879 1669180 1675021 1679528
59593 1679528 1684944 1692464 1700563 1706604 1709069 1707918 1703610 1696322 1685860 1672069 1655278 1636076 1614469
59580 1614469 1589768 1561809 1532022 1502923 1476686 1454233 1435095 1417820 1401155 1385250 1371054
59569 1371054 1358254 1344810 1329226 1312253 1295440 1278979 1262204 1245407 1229542 1214544 1199532
59558 1199532 1184623 1170939 1158593 1146203 1133091 1120830 1111648 1105814 1101437 1096662 1091533 1087750
59546 1087750 1086850 1088687 1091660 1094258 1096128 1097635 1098954 1100120 1101603 1104228 1108377 1113496 1118379 1122067
59532A122067K680K931L956L818J573j149k196j841k059l204l507k152p79j183
59518A118955l064m990o210o644o184n008l785k931k357k211k825l626l389j973
59504A063758m99N29J755L159L545K637J885K107K158J376J491M121P706R175
59490A104903P909O033N320N743O858Q637J0722J2368J3478J4705J6421J8540
59478A231637K1103K3868K5323K3378J7517R556K160k856n050n203m781m755m745
59465A327152l918k521j688j772j856j302r03j871m180o533p843q187q313q696
59451A267569r366j0321j1506j2357j2029j0468q771p935p685p123o054m858l578
59438A155518k137j163j229j465m23J634K852K600K436L566N009N451N500O509
$$ plain form
59532 1122067 1124747 1127678 1131634 1135452 1137025 1135876 1133680 1131839 1129780 1126576 1123069 1120917 1120138 1118955
59518 1118955 1115891 1110901 1104691 1098047 1091863 1086855 1083070 1080139 1077782 1075571 1072746 1069120 1065731 1063758
59504 1063758 1063259 1063788 1065543 1068702 1072247 1074884 1076769 1078876 1081034 1082410 1083901 1088022 1095728 1104903
59490 1104903 1112812 1118845 1124165 1129908 1136766 1145403 1156125 1168493 1181971 1196676 1213097 1231637
59478 1231637 1252740 1276608 1301931 1325309 1342826 1352382 1354542 1351686 1346636 1341433 1336652 1331897 1327152
59465 1327152 1323234 1320713 1319025 1317253 1315397 1314095 1313192 1311321 1307141 1300608 1292765 1284578 1276265 1267569
59451 1267569 1258203 1247882 1236376 1224019 1211990 1201522 1192751 1184816 1177131 1170008 1163954 1159096 1155518
59438 1155518 1153381 1152218 1150989 1149524 1149101 1150735 1153587 1156187 1158623 1162189 1167198 1172649 1178149 1184658
59424A184658Q096Q505P115N236M377M788N750O483O577O031M979L429J499j00
59410A257423n15J21O67L34n04j081j002j2J999M289N549N469N176N569O272O781
59394A296535P500Q723R715R848R723R977R841Q219N637L700K903K046j66l776
59380A380425p503r415q212m623j063Q08J542K333L070L130L153M405O728Q687
59366A383465R629J0305J1564J3617J6510K0059K3340K5354K6225K6798K7426
59355A594292K8450L1303L7010M3167M4512L7886K5502J2323J402o914j2523j4554
59343A821856j2865q695l218L137R066J1365P238k483j3719k2930k9469l4003
59331A725280l6142l4968l1108k6719k3379k0968j8645j5894j2538q696n094k599
$$ plain form
59424 1184658 1192754 1201259 1208374 1213610 1217987 1222775 1228525 1235008 1241585 1247616 1252595 1256024 1257523 1257423
59410 1257423 1256908 1257029 1257696 1258030 1257526 1256445 1255443 1255431 1257430 1261719 1267268 1272737 1277913 1283482 1289754 1296535
59394 1296535 1304035 1312758 1322473 1332321 1342044 1352021 1361862 1370081 1375718 1379418 1382321 1384367 1384201 1380425
59380 1380425 1372922 1363507 1355295 1350672 1349609 1350417 1351959 1354292 1357362 1360492 1363645 1368050 1374778 1383465
59366 1383465 1393094 1403399 1414963 1428580 1445090 1465149 1488489 1513843 1540068 1566866 1594292
59355 1594292 1622742 1654045 1691055 1734222 1778734 1816620 1842122 1854445 1855847 1848933 1836410 1821856
59343 1821856 1808991 1800296 1797078 1800215 1809281 1820646 1827884 1825401 1811682 1788752 1759283 1725280
59331 1725280 1689138 1654170 1623062 1596343 1572964 1551996 1533351 1517457 1504919 1496223 1491129 1488530
59319A488530j229l35K53J63k89N3J558L126L747L924M813O524Q055Q541Q097
59304A535531P689Q427J0567J3012J4257J3964J3097J2607J2759J3637J5221J6793
59292A687561J7359J6983J6800J7558J9118K1321K3884K5332K3847J9898J6221
59281A905882J4263J2286Q209K775j722m567o820r329j2216j5678j9629k2967
59269A850487k4666k5269k5963k6562k5901k4067k2717k2894k3666k3395k1666
59258A583721j9589j8498j8503j8438j7394j6082j5870j6543j6215j3835j0547
59247A402207p963o268m874l597k081Q65N886J1635J5860J7464J6634J3726R052
59234A468546L257k919q765j3005j4252j2858j1109j0481r867p777m860k675j055
$$ plain form
59319 1488530 1487301 1486966 1487219 1487382 1487093 1487146 1488704 1491830 1495577 1499501 1504314 1510838 1518893 1527434 1535531
59304 1535531 1543220 1551647 1562214 1575226 1589483 1603447 1616544 1629151 1641910 1655547 1670768 1687561
59292 1687561 1704920 1721903 1738703 1756261 1775379 1796700 1820584 1845916 1869763 1889661 1905882
59281 1905882 1920145 1932431 1940640 1943415 1941693 1937126 1930306 1920977 1908761 1893083 1873454 1850487
59269 1850487 1825821 1800552 1774589 1748027 1722126 1698059 1675342 1652448 1628782 1605387 1583721
59258 1583721 1564132 1545634 1527131 1508693 1491299 1475217 1459347 1442804 1426589 1412754 1402207
59247 1402207 1394244 1387976 1383102 1379505 1377424 1378289 1384175 1395810 1411670 1429134 1445768 1459494 1468546
59234 1468546 1471803 1468884 1460119 1447114 1432862 1420004 1408895 1398414 1388547 1380770 1375910 1373235 1372180
59221A372180J363M685P803J0340J2847J5284J7024J8210J9610K1197K2177K2262
59209A544982K1768K0786J9505J8899J9564K0211J8811J5153J0922P302M021Q19
59197A722743j587k545k575l020m932q155j1118j2123j1348j0879j2110j4055
59185A628296j5025j4852j4351j3756j3152j3292j4312j4576j2680r850q439q633
59173A475378q685p846p001o649o489o820q281j0060j0438r346q447q434q183
59160A368699p108o403p121q443q761p460n108k764j406j207j236o15L00P50J048
59145A313165J867K653K440J861K407L790M024K395M27n29p74p90j67J103J792
59130A335664J050k54p01n1R17J622K044K324K381J760m1k734n142o477p084p322
$$ plain form
59221 1372180 1373543 1378228 1386031 1396371 1409218 1424502 1441526 1459736 1479346 1500543 1522720 1544982
59209 1544982 1566750 1587536 1607041 1625940 1645504 1665715 1684526 1699679 1710601 1717903 1721924 1722743
59197 1722743 1721156 1718611 1716036 1713016 1708084 1699929 1688811 1676688 1665340 1654461 1642351 1628296
59185 1628296 1613271 1598419 1584068 1570312 1557160 1543868 1529556 1514980 1502300 1492450 1484011 1475378
59173 1475378 1466693 1458847 1451846 1445197 1438708 1431888 1423607 1413547 1403109 1393763 1385316 1376882 1368699
59160 1368699 1361591 1355188 1348067 1339624 1330863 1323403 1318295 1315531 1314125 1312918 1311682 1311067 1311367 1312117 1313165
59145 1313165 1315032 1317685 1320125 1321986 1324393 1328183 1332207 1334602 1335029 1334500 1333726 1332936 1332769 1333872 1335664
59130 1335664 1336714 1336460 1335759 1335708 1336625 1338247 1340291 1342615 1344996 1346756 1346715 1343981 1338839 1332362 1325278 1317956
59114A317956o713n317m776o249q235q295o374m305k805j226J38K12m26K8J396
59099A265009J394o74k663k965k716l463m890o170p549r076r575q587p805q819
59085A191451j0639j1145j0068q845q211p600o570n455m569l852l299l053k964
59072A105181k485j180Q09K804M192N077O017O949P125O610O903R048J1887J3475
59058A182412J3589J3562J4181J5250J6618J8053J8542J7382J5604J4665J4226
59047A354084J2962J0926R065P005L810M89r33q41j716m202o284o745o619o610
59033A364391n966m811m698n703n683l824k225k427k996k323j440k017l576m788
59019A311914n742o916p552p088o722p590q699q535p459o738o360n722n300n774
$$ plain form
59114 1317956 1311243 1305926 1301150 1294901 1286666 1278371 1271997 1267692 1264887 1263661 1263799 1264011 1263585 1263613 1265009
59099 1265009 1266403 1265729 1263066 1260101 1257385 1253922 1249032 1242862 1235313 1226237 1216662 1208075 1200270 1191451
59085 1191451 1180812 1169667 1159599 1150754 1142543 1134943 1128373 1122918 1118349 1114497 1111198 1108145 1105181
59072 1105181 1102696 1101516 1102325 1105129 1109321 1114398 1120415 1127364 1134489 1141099 1148002 1157050 1168937 1182412
59058 1182412 1196001 1209563 1223744 1238994 1255612 1273665 1292207 1309589 1325193 1339858 1354084
59047 1354084 1367046 1377972 1387037 1394042 1397852 1398341 1397408 1396567 1394851 1390649 1384365 1377620 1371001 1364391
59033 1364391 1358425 1353614 1348916 1343213 1337530 1333706 1331481 1329054 1326058 1323735 1322295 1320278 1316702 1311914
59019 1311914 1306172 1299256 1291704 1284616 1277894 1270304 1261605 1253070 1245611 1238873 1232513 1226791 1221491 1215717
59005A215717o510o601o569p282q091p708o259m891l994l251k809l038l661m246
58991A140807m806n043l972j451J017K241K990M379N752N688M137K078l4k013
58977A151770l065k687j786j407j120p8J142J449J349K459N163Q271J0787J2695
58963A184942J4082J4695J4499J3899J3432J3417J3508J2419R230N204K945L047
58951A315319L260J847L5l80k1m38j019O7K493L891L348K624L434N197O170N662
58935A351489M510L922M325N068N254M847M518M364L655K254J193J171J603J976
58921A400149L086N778R330J2331J4533J6633J8686J9934K0003J9348J8647J8278
58909A576736J8191J7908J7005J5741J4662J3564J1761R382P205N203K677q1j977
$$ plain form
59005 1215717 1209207 1202606 1196037 1188755 1180664 1172956 1166697 1161806 1157812 1154561 1151752 1148714 1145053 1140807
58991 1140807 1136001 1130958 1126986 1125535 1126552 1128793 1131783 1136162 1141914 1147602 1151739 1153817 1153783 1151770
58977 1151770 1148705 1146018 1144232 1142825 1141705 1141627 1142769 1144218 1145567 1148026 1153189 1161460 1172247 1184942
58963 1184942 1199024 1213719 1228218 1242117 1255549 1268966 1282474 1294893 1304123 1309327 1312272 1315319
58951 1315319 1318579 1320426 1320461 1320081 1320060 1319622 1318603 1318670 1321163 1325054 1328402 1331026 1334460 1339657 1345827 1351489
58935 1351489 1355999 1359921 1364246 1369314 1374568 1379415 1383933 1388297 1391952 1394206 1395399 1396570 1398173 1400149
58921 1400149 1403235 1409013 1418343 1430674 1445207 1461840 1480526 1500460 1520463 1539811 1558458 1576736
58909 1576736 1594927 1612835 1629840 1645581 1660243 1673807 1685568 1694950 1702155 1707358 1710035 1709954 1707977
58896A707977l395o248j1021j5663j8522k0363k2268k3519k3212k2274k1866k1301
58884A498325j9425j6994j5608j5125j3995j1648q911o597m998m280m145l627
58872A372972k265q05P1P62J676K277K229K236K590K239N66j111j277l30L77N12
58856A382719N65P70J424L048N074N861N211N232P320J0089J1974J3882J7087
58843A470256K0272K1297K0679K0586K1250K0964J9139J7081J5977J6002J7112
58832A680615J9000K0736K1832K2982K4463K5033K3932K2559K2219K1640J9045
58821A924056J5396J3012J1928J0211P252M183J560q55k471k543k124k941m560
58808A972104n025m235m237o134q895j1475j3946j6293j7937j8930k0102k1747
$$ plain form
58896 1707977 1704582 1698334 1687313 1671650 1653128 1632765 1610497 1586978 1563766 1541492 1519626 1498325
58884 1498325 1478900 1461906 1446298 1431173 1417178 1405530 1396619 1390022 1385024 1380744 1376599 1372972
58872 1372972 1370707 1369902 1369973 1370735 1372411 1374688 1376917 1379153 1381743 1383982 1384548 1383437 1382160 1381830 1382207 1382719
58856 1382719 1383284 1384054 1385478 1388526 1393600 1399461 1404672 1409904 1417224 1427313 1439287 1453169 1470256
58843 1470256 1490528 1511825 1532504 1553090 1574340 1595304 1614443 1631524 1647501 1663503 1680615
58832 1680615 1699615 1720351 1742183 1765165 1789628 1814661 1838593 1861152 1883371 1905011 1924056
58821 1924056 1939452 1952464 1964392 1974603 1981855 1986038 1987598 1986743 1984272 1981729 1979605 1976664 1972104
58808 1972104 1967079 1962844 1958607 1952473 1943578 1932103 1918157 1901864 1883927 1864997 1844895 1823148
58796A823148k3332k4409k4715k3837k2109k1161k2123k3908k4681k4236k3407
58785A565230k2135k0048j8021j7175j7053j6648j6333j6645j6379j4256j1553
58774A378984j0342r931q017m910l397m322n356m702l290k480j951q97L94J192
58760A320975J287Q45K89L91J462K677L202L349L502K906J145l08j6Q07j95l081
58744A339237n831p314p878p723p006o970q542j0256r987q207p112p041o382m741
58730A234247l478l119k602j136J205M382P845R726Q980P639Q425J0820J2148
58717A295082J1754J1047J0163Q027N396M303M264K520j632n875q667j0852j2979
58704A312551j4078j3877j3428j2912j1389r152p731p195o186m811m688n796o226
$$ plain form
58796 1823148 1799816 1775407 1750692 1726855 1704746 1683585 1661462 1637554 1612873 1588637 1565230
58785 1565230 1543095 1523047 1505026 1487851 1470798 1454150 1437817 1421172 1404793 1390537 1378984
58774 1378984 1368642 1358711 1350694 1345784 1342387 1338065 1332709 1328007 1324717 1322237 1320286 1319389 1319783 1320975
58760 1320975 1322262 1323107 1323396 1323787 1325249 1327926 1331128 1334477 1337979 1340885 1342030 1341722 1341706 1342513 1342318 1339237
58744 1339237 1333406 1326092 1318214 1310491 1303485 1296515 1287973 1277717 1267730 1259523 1252411 1245370 1238988 1234247
58730 1234247 1230769 1227650 1225048 1223912 1225117 1229499 1237344 1247070 1256050 1263689 1272114 1282934 1295082
58717 1295082 1306836 1317883 1328046 1336073 1341469 1345772 1350036 1352556 1350924 1345049 1336382 1325530 1312551
58704 1312551 1298473 1284596 1271168 1258256 1246867 1237715 1229984 1222789 1216603 1211792 1207104 1201308 1195082
58691A195082n456m900m857l960k080p21j5J430L319L720L032M141P535R896R139
58676A215305P514P797R410J0265J0048R714R670J0023J0790J0914R075O209M896
58663A331630N533N766M397L075L125L664M054N320P655R234R015Q220P652O070
58649A414410K700j175m487p881j1508j3892j4665j6013j9741k4771k8961l1382
58637A242634l1723k9707k6375k3831k2574k1129j9045j7705j7385j6372j4047
58626A002741j1976j0695q540n135k873l101l781k982j863j997k422j763q72r32
58612I43809q82Q28L551N561O522P132P753Q674J0259J1761J1777J0504R370P891
58598A044510L836k404o926p507o653p531r741j1264j1883j2116j1192q618o020
$$ plain form
58691 1195082 1189626 1184726 1179869 1175909 1173829 1173108 1173093 1174523 1177842 1181562 1184594 1188735 1196270 1206166 1215305
58676 1215305 1222819 1230616 1240026 1250291 1260339 1270053 1279723 1289746 1300536 1311450 1320525 1326734 1331630
58663 1331630 1337163 1342929 1347326 1350401 1353526 1357190 1361244 1366564 1374219 1383453 1392468 1400688 1408340 1414410
58649 1414410 1417110 1415935 1411448 1403567 1392059 1378167 1363502 1347489 1327748 1302977 1274016 1242634
58637 1242634 1210911 1181204 1154829 1130998 1108424 1087295 1068250 1050545 1033160 1016788 1002741
58626 1002741 990765 980070 971530 966395 963522 960421 956640 953658 951795 949798 947376 945613 944741 943809
58612 943809 942927 943755 947306 952867 959389 966521 974274 982948 993207 1004968 1016745 1027249 1036619 1044510
58598 1044510 1048346 1045942 1039016 1031509 1024856 1017325 1007584 996320 984437 972321 961129 952511 946491
58585I46491n107n377n484n254m904m133l314l469l951k629N07K721K783K744
58571I11624L864M185K318L17J59K96j354l611m125l124k289j849j297j115j470
58556I02529j073O38K172K746L966O669Q709Q241O819O737P619Q053Q293Q805
58542I80923Q424O582N126N398N685M077J760R03J384J999K833M078M682M661
58528A038515O390J1169J6627J9882K0972K1044J9912J7814J6812J7703J8200
58517A225040J6750J5299J5576J5947J4992J4925J7709K0920K1526K1035K2657
58506A422376K5816K7830K8946L1245L4154L5329L4742L4063L3165L0777K7269
58495A765712K3405J8012J0267K646k034m848q485j2462j4423j4620j5175j6235
$$ plain form
58585 946491 941384 936007 930523 925269 920365 916232 912918 909449 905498 902869 903376 906097 908880 911624
58571 911624 915488 919673 921991 922308 922467 922763 921409 917798 913673 910549 908260 906411 905114 903999 902529
58556 902529 901456 902094 904266 907012 910978 917647 926356 934597 941416 948153 955772 963825 972118 980923
58542 980923 989347 995929 1001055 1006453 1012138 1016215 1017975 1018878 1020262 1022261 1025094 1029172 1033854 1038515
58528 1038515 1044905 1056074 1072701 1092583 1113555 1134599 1154511 1172325 1189137 1206840 1225040
58517 1225040 1241790 1257089 1272665 1288612 1303604 1318529 1336238 1357158 1378684 1399719 1422376
58506 1422376 1448192 1476022 1504968 1536213 1570367 1605696 1640438 1674501 1707666 1738443 1765712
58495 1765712 1789117 1807129 1817396 1820042 1818008 1813160 1804675 1792213 1777790 1763170 1747995 1731760
58483A731760j6583j6826j8336k0342k1663k3861k8887l4794l7669l6854l4709
58472A441236l2392k9514k6784k5318k4133k1720j9066j7894j7231j5101j2238
58461A199845j0665r978q589p156p153p499o361m867n099n896m744k471j893k810
58447A114664k707j486j237j849j052J383L254L592L390L065K283J711K081K394
58433A129486J877K333N493R510J1398J1384J1609J2232J2378J3118J5647J8234
58421A254699J8806J8823K0719K3269K3707K2554K2013K1284J8004J2834Q155
58410A464867L800j556o362q180q191r136j0402r750q101p688p227m089N20L728
58396A392233O475J1126J5526J5646J2742J1503J2062J0343N592R97k864q362
$$ plain form
58483 1731760 1715177 1698351 1680015 1659673 1638010 1614149 1585262 1550468 1512799 1475945 1441236
58472 1441236 1408844 1379330 1352546 1327228 1303095 1281375 1262309 1244415 1227184 1212083 1199845
58461 1199845 1189180 1179202 1170613 1163457 1156304 1148805 1142444 1137577 1132478 1126582 1121838 1119367 1117474 1114664
58447 1114664 1111957 1110471 1109234 1107385 1106333 1107716 1110970 1114562 1117952 1121017 1123300 1125011 1127092 1129486
58433 1129486 1131363 1133696 1139189 1148699 1160097 1171481 1183090 1195322 1207700 1220818 1236465 1254699
58421 1254699 1273505 1292328 1313047 1336316 1360023 1382577 1404590 1425874 1443878 1456712 1464867
58410 1464867 1468667 1467111 1460749 1452569 1444378 1435242 1424840 1415090 1406989 1399301 1392074 1387985 1388505 1392233
58396 1392233 1398708 1409834 1425360 1441006 1453748 1465251 1477313 1487656 1493248 1494245 1491381 1483019
58384A483019j4441j6723j4756j3009j3560j3670j1678r627q706p241m653k762
58372A352193k014p42J114J803J653K953N703P636Q335R076R140O911L922K952
58358A410635K746j68n138q312r167j0393j1800j0531p276o139p960r438r071
58345A317988q382p274m017J0J387N66J062K934L048J661K379N426P232O906O963
58330A337889P606O619M937N762Q152Q237O711P946J1605J2737J0690J0263J3016
58317A452170J5019J4450J3964J4285J2871J0325J0702J4017J5673J4661J4857
58306A602994J6980J7060J4438J3425J5176J5841J4595J5459J9036K0493J8163
58295A783660J6231J6413J5066J1245R515J1727J3669J3025J2939J4794J5109
$$ plain form
58384 1483019 1468578 1451855 1437099 1424090 1410530 1396860 1385182 1375555 1366849 1359608 1354955 1352193
58372 1352193 1350179 1349437 1350551 1352354 1354007 1356960 1362663 1370299 1378634 1387710 1396850 1403761 1407683 1410635
58358 1410635 1413381 1413213 1408075 1399763 1390596 1380203 1368403 1357872 1350596 1344457 1336497 1327059 1317988
58345 1317988 1309606 1302332 1298315 1298325 1299712 1300278 1301340 1304274 1307322 1308983 1311362 1316788 1324020 1330926 1337889
58330 1337889 1345495 1352114 1357051 1362813 1370965 1379202 1385913 1393859 1405464 1418201 1428891 1439154 1452170
58317 1452170 1467189 1481639 1495603 1509888 1522759 1533084 1543786 1557803 1573476 1588137 1602994
58306 1602994 1619974 1637034 1651472 1664897 1680073 1695914 1710509 1725968 1745004 1765497 1783660
58295 1783660 1799891 1816304 1831370 1842615 1852130 1863857 1877526 1890551 1903490 1918284 1933393
58284A933393J2827J2074J4519J6421J6174J7341K1163K3680K3282K3646K6258
58273B140778K7724K7208K8554L2137L2762K8651K4417K2245J8722J3287J0872
58262B407357J2661J3302J0963J0992J5658J9470J9105J9022K2569K6204K7114
58251B604417K8087L0549L1238K9865L1282L6106L8296L5985L5153L8449M0351
58240B979778L7862L5935L7580L8819L8177M0651M7163N0896M9430M9556N4564
58229C460411N8088N6614N6523O2105O7957P0088P3207P9976Q4443Q3541Q3683
58218D236636Q8647R2454R1744R3182J00660J07230J08112J09603J16500J22900
58208E267668J24423J27360J36449J45624J50112J55614J66241J75783J80201
$$ plain form
58284 1933393 1946220 1958294 1972813 1989234 2005408 2022749 2043912 2067592 2090874 2114520 2140778
58273 2140778 2168502 2195710 2224264 2256401 2289163 2317814 2342231 2364476 2383198 2396485 2407357
58262 2407357 2420018 2433320 2444283 2455275 2470933 2490403 2509508 2528530 2551099 2577303 2604417
58251 2604417 2632504 2663053 2694291 2724156 2755438 2791544 2829840 2865825 2900978 2939427 2979778
58240 2979778 3017640 3053575 3091155 3129974 3168151 3208802 3255965 3306861 3356291 3405847 3460411
58229 3460411 3518499 3575113 3631636 3693741 3761698 3831786 3904993 3984969 4069412 4152953 4236636
58218 4236636 4325283 4417737 4509481 4602663 4703323 4810553 4918665 5028268 5144768 5267668
58208 5267668 5392091 5519451 5655900 5801524 5951636 6107250 6273491 6449274 6629475
58199F629475J85951J96680K05077K07495K12685K26026K39579K48267K60754
58190H611989K82927L05765L21623L37311L58776L78555L91242M05454M27245
58181A1820887M47800M61083M76850N02325N28419N48473N72403O07262O42963
58172A6608465O73100P09823P61029Q13679Q57867R06108R69597J037491J099734
58163B4436893J167341J248737J330019J401288J477748J571322J668136J759454
58155C6060938J866355K006231K164406K328229K517357K748463L004271L273235
58147E5969485L584394L964614M398766M872546N412173O035839O712659P422475
58139I8372951Q208347R115478J0137107J1285735J2648641J4291103J6176701
$$ plain form
58199 6629475 6815426 7012106 7217183 7424678 7637363 7863389 8102968 8351235 8611989
58190 8611989 8894916 9200681 9522304 9859615 10218391 10596946 10988188 11393642 11820887
58181 11820887 12268687 12729770 13206620 13708945 14237364 14785837 15358240 15965502 16608465
58172 16608465 17281565 17991388 18752417 19566096 20423963 21330071 22299668 23337159 24436893
58163 24436893 25604234 26852971 28182990 29584278 31062026 32633348 34301484 36060938
58155 36060938 37927293 39933524 42097930 44426159 46943516 49691979 52696250 55969485
58147 55969485 59553879 63518493 67917259 72789805 78201978 84237817 90950476 98372951
58139 98372951 106581298 115696776 125833883 137119618 149768259 164059362 180236063
58132A80236063J8272858K0649487K3387086K6544552L0347138L5049778M0019610
58125C74506572M2930675M0601566L1346195J6597078M8657j4732163k5873358
58118D65425222l3043460l6636801l7367008l6155453l3872863l1079183k8067786
58111B29202668k5055406k2213651j9604139j7222673j5091456j3239133j1635134
58104A05141076j0220650q977284p908136o984460o167787n457541m865701m368077
58096E0191440l925678l531628l195734k904714k636934k396627k196308k022950
58088B7380867j854993j695719j558296j434790j310368j192215j095092j012734
58080A6226660r31085q55498p98079p51500p01241o51455o14033n83889n48870
$$ plain form
58132 180236063 198508921 219158408 242545494 269090046 299437184 334486962 374506572
58125 374506572 417437247 458038813 489385008 505982086 506030743 491298580 465425222
58118 465425222 432381762 395744961 358377953 322222500 288349637 257270454 229202668
58111 229202668 204147262 181933611 162329472 145106799 130015343 116776210 105141076
58104 105141076 94920426 85943142 78035006 71050546 64882759 59425218 54559517 50191440
58096 50191440 46265762 42734134 39538400 36633686 33996752 31600125 29403817 27380867
58088 27380867 25525874 23830155 22271859 20837069 19526701 18334486 17239394 16226660
58080 16226660 15295575 14440077 13641998 12890498 12189257 11537802 10923769 10339880 9791010
58071I791010n12989m86825m65329m37329m07076l85084l67121l42840l16051
58062F070366k96577k80835k59798k37534k22942k11600j94491j76547j67962
58053D022080j64531j54981j40975j32106j27399j19099j08965j03947j01016
58044B869061r2454q1245p5814p4442o9765o3555o2347o3369n9367n2719n0609
58033B123375n0903m6702m0305l8791m0165l7606l3103l3276l5695l2977k6792
58022A707060k4600k5926k4820k2404k4123k7738k6974k3926k5176k8615k7038
58011A425720k2146k1896k6001k6877k3533k2003k3042k1576j7773j7013j9025
58000A184835j8082j3922j1977j2960j2158r064q073r800j0744j1064j3796j7173
$$ plain form
58071 9791010 9278021 8791196 8325867 7888538 7481462 7096378 6729257 6386417 6070366
58062 6070366 5773789 5492954 5233156 4995622 4772680 4561080 4366589 4190042 4022080
58053 4022080 3857549 3702568 3561593 3429487 3302088 3182989 3074024 2970077 2869061
58044 2869061 2776607 2695362 2619548 2545106 2475341 2411786 2349439 2286070 2226703 2173984 2123375
58033 2123375 2072472 2025770 1985465 1946674 1906509 1868903 1835800 1802524 1766829 1733852 1707060
58022 1707060 1682460 1656534 1631714 1609310 1585187 1557449 1530475 1506549 1481373 1452758 1425720
58011 1425720 1403574 1381678 1355677 1328800 1305267 1283264 1260222 1238646 1220873 1203860 1184835
58000 1184835 1166753 1152831 1140854 1127894 1115736 1106672 1098599 1088799 1078055 1066991 1053195 1036022
57988A036022j6568j3275j2646j4487j4071j1577j1640j4336j5316j4207j4521
57977H83378j5925j4833j1804j0415j0094p895n705p414j0735j0489q138r055
57965G60876j2012j1031o463m403n692n306k571k208m743n379l281l037n651o750
57951F82349m917l686m145l417j517j815l719k793Q56K119j10j282K82J051j44
57936F59112QK087K147q88l066k677k829m832n673m097k824k851j770N52Q33j322
57920F31910k232q93p57k983m185k826j784k338j588J766M605M722L944L833L136
57905F34330J345Q1n54k263m113k937O81K102l38l275m437n399o916p143o153
57890E95011o635q411p718l774o13m13m73J138K382K032K410M765O748O921P178
$$ plain form
57988 1036022 1019454 1006179 993533 979046 964975 953398 941758 927422 912106 897899 883378
57977 883378 867453 852620 840816 830401 820307 812412 806707 799293 788558 778069 769931 760876
57965 760876 748864 737833 731370 726967 721275 715969 713398 711190 706447 701068 697787 694750 689099 682349
57951 682349 677432 673746 669601 666184 664667 662852 659133 656340 657196 659315 659205 657923 658205 659256 659112
57936 659112 659120 661207 663354 662466 659400 656723 653894 649062 643389 639292 636468 633617 631847 632399 633232 631910
57920 631910 629678 628785 628028 625045 620860 618034 616250 613912 612324 614090 618695 623417 627361 631194 634330
57905 634330 635675 635756 635202 632939 628826 625889 626570 628672 628334 625059 620622 615223 608307 601164 595011
57890 595011 588376 579965 572247 568473 567860 567447 566974 568112 570494 572526 574936 579701 586449 593370 600548
57875F00548Q427Q492O659N651O799P544O069M069K836Q30k744o121q571j1504
57861F28984j4357j4073j0606q086q389q400n993l721l786m065k345k14L61M96
57847E45806J486K146J728J706K203N92l549o149m444j371j015k960m264m017
57833E27898k892j008J084J803J123J097K101J803m97k171j871j795l048k912
57819E20715L54L896M681M011M341M931M028K504J966J883J524K152M393O176
57805E67555O091N996P421Q451P344O299P985J0828J1439R729Q059P086N854M600
57791F74737M350M698M566L984L097R52k632n706o771o926p524p723o403m482
57777F48217l136j772J07J058l2j757k358k127j808q32Q58J577O59O3J134K219
$$ plain form
57875 600548 608975 617467 624126 629777 636576 644120 650189 654258 657094 657924 655180 649059 640488 628984
57861 628984 614627 600554 589948 581862 573473 565073 559080 555359 551573 547508 545163 544949 545310 545806
57847 545806 547292 549438 551166 552872 555075 555667 552118 545969 541525 540154 539139 536179 531915 527898
57833 527898 525006 523998 525082 526885 528008 529105 531206 533009 532512 530341 528470 526675 523627 520715
57819 520715 521069 524965 529646 533657 537998 542929 546957 549461 551427 553310 554834 556986 561379 567555
57805 567555 573646 579642 587063 595514 602858 609157 617142 627970 639409 649138 657197 664283 670137 674737
57791 674737 679087 683785 688351 692335 695432 696384 693752 688046 681275 674349 666825 659102 652699 648217
57777 648217 645081 643309 643416 644474 644442 642685 640327 638200 636392 635560 636418 637995 638654 638717 639851 642070
57761F42070J819J367K255K769J047j217j288L71J439J537J648J340m12k874m687
57746F47184o024p262p222n281l490l926n475n923n553n784n953m573k519j874
57732E76325k520k759k299j969j402K49K041K238R61m40j680k979l317j641R79
57717E61787K769L882N369O497N574K878M81m27k17M34Q32J67j337k237k182k813
57701E81457m792n896m232j374J03L23P12Q25l55j455n44J275J459M78J219M338
57685E73541P364Q424P992O978N755N212O223P928Q611Q177P774P431O323N097
57671F72830N315O606O772M965K749J715J835K322K523J902N92k00L24J124Q12
57656G12186k07p38j107k374l897l948k538j410j304j282r25j173k480l628k997
$$ plain form
57761 642070 643889 645256 647511 650280 651327 650110 648822 649193 650632 652169 653817 655157 654745 651871 647184
57746 647184 641160 633898 626676 621395 617905 613979 608504 602581 597028 591244 585291 580718 578199 576325
57732 576325 573805 571046 568747 566778 565376 565625 567666 569904 570865 570425 568745 565766 562449 560808 561787
57717 561787 564556 568438 573807 580304 585878 588756 589237 588810 588593 589027 589859 590026 588689 586452 584270 581457
57701 581457 576665 570769 566537 565163 565266 565589 566301 567126 566771 565316 564772 566047 567506 567984 569203 573541
57685 573541 580905 589329 597321 604299 610054 615266 621489 629417 638028 646205 653979 661410 667733 672830
57671 672830 678145 684751 691523 696488 699237 700952 702787 705109 707632 709534 710126 709926 710250 711374 712186
57656 712186 711979 711241 710134 707760 703863 699915 697377 695967 694663 693381 692456 691283 688803 685175 682178
57641F82178k86L134N109M553K833K346L176K884N34j245r5K382L186K372K043
57626G15104K438K307K219L985P132R258R969J1291J3952J6225J7164J8219K0740
57613H50003K4193K7822L2107L7614M4070N1149N8545O4530O5825N9798M6012
57602A361668K5886K230k0895l9593n2059n8504n9651n6556n1291m5947m0950
57591I64338l5857l1372k8655k6916k3961j9386j5280j3161j2014j0039p002m076
57579G36619k408k336l250m043m204m309m745m601k908l92J303J688J481J041
57565G08936J35j147k437l693m700m784m069l903m607m179j204K282L168J605
57551F81403L99Q00J435J136J45j250k828l343j802K81M81q43j132N3M22r15j860
$$ plain form
57641 682178 681892 685026 690135 694688 697521 699867 703043 705927 706461 705216 705121 707503 710689 713061 715104
57626 715104 717542 719849 722068 726053 733185 742443 752412 763703 777655 793880 811044 829263 850003
57613 850003 874196 902018 934125 971739 1015809 1066958 1125503 1190033 1255858 1315656 1361668
57602 1361668 1387554 1389784 1368889 1329296 1277237 1218733 1159082 1102526 1051235 1005288 964338
57591 964338 928481 897109 868454 841538 817577 798191 782911 769750 757736 747697 740695 736619
57579 736619 734211 731875 728625 724582 720378 716069 711324 706723 703815 703423 704726 706414 707895 708936
57565 708936 709071 707924 705487 701794 697094 692310 688241 684338 679731 675552 674348 676630 679798 681403
57551 681403 681802 682602 684037 685173 685318 684068 681240 677897 676095 676376 676857 676014 674882 674935 675357 674442 672582
57534F72582r02N34P64L91O84J382J714J958K414K227P21j122j733p90Q28K112
57518F83764K384J539L91o0O8j77r35j291p84k0L82L38j84r53j049N6J243J189
57500F85901O64J494L409M175L069J902K174L335M508N747O778O559N221M603
57486G39539N728P284P695P204O841O754O662O803P287P469O857N810M827M080
57472H30840L976M894O063O034M779L864M112M580M483M516N386O430O620N899
57458I02476M787L743L364M045N025N042M146L421K786J083j220j610J126N099
57444I43313P914R309R948R642Q319P210P341P991Q178Q492R909J1772J2519J1750
57430A073607J0325R088Q602R260J0550J1018J0031Q681Q007P466O408N774O756
$$ plain form
57534 672582 671680 672214 672978 673369 674053 675435 677149 679107 681521 683748 684469 683347 681614 680824 681652 683764
57518 683764 686148 687687 688078 688018 688086 687909 686974 685683 684899 684879 685261 685599 685415 684462 683413 683469 684712 685901
57500 685901 686565 688059 691468 695643 698712 700614 702788 706123 710631 716378 723156 729715 734936 739539
57486 739539 745267 752551 760246 767450 774291 781045 787707 794510 801797 809266 816123 821933 826760 830840
57472 830840 834816 839710 845773 851807 856586 860450 864562 869142 873625 878141 883527 889957 896577 902476
57458 902476 907263 911006 914370 918415 923440 928482 932628 936049 938835 939918 938698 937088 938214 943313
57444 943313 951227 960536 970484 980126 988445 995655 1002996 1010987 1019165 1027657 1037566 1049338 1061857 1073607
57430 1073607 1083932 1093020 1101622 1110882 1121432 1132450 1142481 1151162 1159169 1166635 1173043 1178817 1185573
57417A185573Q457Q759P187N411M966N725O704P394Q036R023J0109J0321R254
57404A286919Q261R278J2109J4311J4291J3103J2278J1466R710P742P121P749
57392A414338Q116P776P903R276J1065J2098J2327J2570J3262J3987J4047J3439
57380A550204J3070J3755J5097J5876J5544J4757J4338J4465J4888J5247J5144
57369A712385J4723J5091J6994J9161J9476J7886J6465J6203J5735J4159J3039
57358A891317J4005J6030J6939J6563J6483J7392J8546J9301J9573J9042J7613
57347B082804J6476J7121J9152K0483J9950J8574J7924J8283J8845J8869J8163
57336B286644J7104J6582J7429J9371K0916K0890J9989K0135K2032K3939K3666
$$ plain form
57417 1185573 1194030 1202789 1209976 1215387 1220353 1226078 1232782 1240176 1248212 1257235 1267344 1277665 1286919
57404 1286919 1295180 1304458 1316567 1330878 1345169 1358272 1370550 1382016 1391726 1399468 1406589 1414338
57392 1414338 1422454 1430230 1438133 1447409 1458474 1470572 1482899 1495469 1508731 1522718 1536765 1550204
57380 1550204 1563274 1577029 1592126 1608002 1623546 1638303 1652641 1667106 1681994 1697241 1712385
57369 1712385 1727108 1742199 1759193 1778354 1797830 1815716 1832181 1848384 1864119 1878278 1891317
57358 1891317 1905322 1921352 1938291 1954854 1971337 1988729 2007275 2026576 2046149 2065191 2082804
57347 2082804 2099280 2116401 2135553 2156036 2175986 2194560 2212484 2230767 2249612 2268481 2286644
57336 2286644 2303748 2320330 2337759 2357130 2378046 2398936 2418925 2439060 2461092 2485031 2508697
57325B508697K1623K0658K2543K5686K7353K7053K6392K6282K6115K5542K5124
57314B783068K4980K4418K3441K3227K4471K6466K8176K9119K8886K7317K5626
57303C069195K5764K7904K9958L0334K9776K9675L0042L0287L0646L1586L2782
57292C397949L3855L5194L7009L8392L8517L7972L7875L8421L9124L9832M0547
57281C814687M0884M0563L9895L9284L8803L8603L8679L8152L6074L3448L2735
57270D231807L4583L6618L6598L5205L4489L5057L6225L7661L9212M0079L9691
57259D637225L8759L8297L8338L8530L8906L9159L8484L7237L7211L8878L9975
57248E060999L8446L5369L3094L1983L1059L0562L1352L2639L2829L2140L2162
$$ plain form
57325 2508697 2530320 2550978 2573521 2599207 2626560 2653613 2680005 2706287 2732402 2757944 2783068
57314 2783068 2808048 2832466 2855907 2879134 2903605 2930071 2958247 2987366 3016252 3043569 3069195
57303 3069195 3094959 3122863 3152821 3183155 3212931 3242606 3272648 3302935 3333581 3365167 3397949
57292 3397949 3431804 3466998 3504007 3542399 3580916 3618888 3656763 3695184 3734308 3774140 3814687
57281 3814687 3855571 3896134 3936029 3975313 4014116 4052719 4091398 4129550 4165624 4199072 4231807
57270 4231807 4266390 4303008 4339606 4374811 4409300 4444357 4480582 4518243 4557455 4597534 4637225
57259 4637225 4675984 4714281 4752619 4791149 4830055 4869214 4907698 4944935 4982146 5021024 5060999
57248 5060999 5099445 5134814 5167908 5199891 5230950 5261512 5292864 5325503 5358332 5390472 5422634
57237E422634L3248L4382L5132L5600L5007L2824L0949L2135L5953L8788L8317
57226E804969L5872L3768L2505L1470L0592L0015K9344K8291K7361K7271K8314
57215F139772L0478L3426L6257L8202L9705M1954M5298M8886N1747N3349N3305
57204F612379N1619M9166M6971M5005M2542L9371L5829L1907K7412K2678J8133
57193G023012J3675R530P108P574J0038J2766J5769K0478K7124L4155M0411M6088
57181G267728N1309N5306N7552N8546N9107N9772O0783O1631O0743N6914N0963
57170G900354M4892L9661L5014L1024K8172K6095K4029K2459K2627K4368K6078
57159H224773K7031K8054K9862L2373L5828M0652M5893M9683N1969N5067O0760
$$ plain form
57237 5422634 5455882 5490264 5525396 5560996 5596003 5628827 5659776 5691911 5727864 5766652 5804969
57226 5804969 5840841 5874609 5907114 5938584 5969176 5999191 6028535 6056826 6084187 6111458 6139772
57215 6139772 6170250 6203676 6239933 6278135 6317840 6359794 6405092 6453978 6505725 6559074 6612379
57204 6612379 6663998 6713164 6760135 6805140 6847682 6887053 6922882 6954789 6982201 7004879 7023012
57193 7023012 7036687 7046217 7053325 7060899 7070937 7083703 7099472 7119950 7147074 7181229 7221640 7267728
57181 7267728 7319037 7374343 7431895 7490441 7549548 7609320 7670103 7731734 7792477 7849391 7900354
57170 7900354 7945246 7984907 8019921 8050945 8079117 8105212 8129241 8151700 8174327 8198695 8224773
57159 8224773 8251804 8279858 8309720 8342093 8377921 8418573 8464466 8514149 8566118 8621185 8681945
57148H681945O8264P5686Q2015Q6931Q9918R0552Q8799Q4571P7727O8766N8716
57137I553890M8405L8659L0614K4440J8376J0838K831l925j0552j9618l0409l9025
57125I624524m3965m8053n3507n8480o0678o1323o2831o4807o5185o3621o0848
57114H981226n6115m8173l7961k7589j7214n578O429J5253J8094J5213Q695M01
57102H852681q654j8112k7663l6023m0979m1184l7209l0015j9570o281P399J8658
57090H613048K6949L3374L8341M1678M4379M7904N1776N3649N1835M6341L7758
57079I087032K6824J4696J885j2886l0976n1168p0558q7620j02367j13899j20629
57068H540334j23301j25255j28971j34497j41669j51147j62258j72340j79873
$$ plain form
57148 8681945 8750209 8825895 8907910 8994841 9084759 9175311 9264110 9348681 9426408 9495174 9553890
57137 9553890 9602295 9640954 9671568 9696008 9714384 9725222 9728053 9724128 9713576 9693958 9663549 9624524
57125 9624524 9580559 9532506 9478999 9420519 9359841 9298518 9235687 9170880 9105695 9042074 8981226
57114 8981226 8925111 8876938 8838977 8811388 8794174 8788596 8795025 8810278 8828372 8843585 8852280 8852681
57102 8852681 8844027 8825915 8798252 8762229 8721250 8680066 8642857 8612842 8593272 8586991 8594390 8613048
57090 8613048 8639997 8673371 8711712 8753390 8797769 8845673 8897449 8951098 9002933 9049274 9087032
57079 9087032 9113856 9128552 9130437 9117551 9086575 9035407 8964849 8877229 8774862 8660963 8540334
57068 8540334 8417033 8291778 8162807 8028310 7886641 7735494 7573236 7400896 7221023
57059G221023j86597j95535k08857k28325k54987k86729l18579l47635l75936
57050D817843m06764m40056m72752n00721n17990n16863m91821m40967l60859
57041F69050k42998q0520J21508L43619N57287P32273Q46935R00200R13784R21320
57031E682458R59744J069368J287447J639906K166708K957398M072316N304188
57023B5139533O022973N456994L359872M45320j986616l012159k731385j988361
57015C0706171j523008j436861j386250j112747p06444m47807n24303r14010j455917
57006B1198824j968780k324014k465489k398403k165374j824369j435131j050284
56998E566980p07626m26737k11625n5897N2102J23840J66829J85780J86417J76174
$$ plain form
57059 7221023 7034426 6838891 6630034 6401709 6146722 5859993 5541414 5193779 4817843
57050 4817843 4411079 3971023 3498271 2997550 2479560 1962697 1470876 1029909 669050
57041 669050 426052 345532 467040 810659 1367946 2100219 2947154 3847354 4761138 5682458
57031 5682458 6642202 7711570 8999017 10638923 12805631 15763029 19835345 25139533
57023 25139533 31162506 36619500 39979372 40424692 38438076 35425917 32694532 30706171
57015 30706171 29183163 27746302 26360052 25247305 24540861 24093054 23568751 22654741 21198824
57006 21198824 19230044 16906030 14440541 12042138 9876764 8052395 6617264 5566980
56998 5566980 4859354 4432617 4220992 4165095 4217197 4341037 4507866 4693646 4880063 5056237
56988E056237J61411J45678J30513J16046J01022Q4282O6755N0684L6811K3676
56978E973115R913m049j6836k7562l5966m1979m5751m7777m8409m6750l9980k5075
56966E602894l461J5694J9154r20m0849q8964j34146j70513j96261k11378k17121
56955D574129k15787k09653k00303j89142j77728j67275j58047j49602j41714
56946B964878j34996j30309j27265j23811j18105j10667j03619r7926r2595q6673
56936A838912q0577p4873o9110o2808n6586n1398m7344m3863m0401l6412l1569
56925A243971k6567k2710k0197j7767j4663j1966j1352j3296j6951k0643k2229
56914A045630k0404j6346j2760j0728q835n957k876l11K501N799P988Q271Q778
$$ plain form
56988 5056237 5217648 5363326 5493839 5609885 5710907 5795189 5861944 5912628 5949439 5973115
56978 5973115 5983028 5978979 5962143 5934581 5898615 5856636 5810885 5763108 5714699 5667949 5627969 5602894
56966 5602894 5599433 5615127 5634281 5633361 5592512 5503548 5369402 5198889 5002628 4791250 4574129
56955 4574129 4358342 4148689 3948386 3759244 3581516 3414241 3256194 3106592 2964878
56946 2964878 2829882 2699573 2572308 2448497 2330392 2219725 2116106 2018180 1925585 1838912
56936 1838912 1758335 1683462 1614352 1551544 1494958 1443560 1396216 1352353 1311952 1275540 1243971
56925 1243971 1217404 1194694 1174497 1156730 1142067 1130101 1118749 1105453 1088502 1067859 1045630
56914 1045630 1025226 1008880 996120 985392 976557 970600 967724 967413 969914 975713 983701 991972 1000750
56901A000750J1774J6220J9586K1838K4767K8006K8649K5029J8426J0766K741
56890A208552n218j2065j6979j9895k0813j9919j8479j8096j8587j7924j4849
56879A025728j0423o511l764j648M05K600N021P741J0835J4127J6475J5664J0018
56866A086268K68j0714k0161k6894l0946l2694l2617l1271k9137k6564k3783k0772
56854H00983j7434j4183j1878j0782j0020q562o361m130k453j475q71J82K323
56841G15339M929O488O482N979O007O435O923P598Q109P559O270N995P156P697
56827H08966O229M521M596M975K615k336o650q602r606j1040j2206j2183j1411
56814G57868j0393q473n046q70K721N193P024R181J2465J6645K0370K2897K5566
$$ plain form
56901 1000750 1012524 1028744 1048330 1070168 1094935 1122941 1151590 1176619 1195045 1205811 1208552
56890 1208552 1203334 1191269 1174290 1154395 1133582 1113663 1095184 1077088 1058501 1040577 1025728
56879 1025728 1015305 1008794 1005030 1003382 1003787 1006387 1011408 1019149 1029984 1044111 1060586 1076250 1086268
56866 1086268 1086536 1075822 1055661 1028767 997821 965127 932510 901239 872102 845538 821755 800983
56854 800983 783549 769366 757488 746706 736686 728124 721763 717633 715180 713705 712834 713016 715339
56841 715339 720268 726756 733238 739217 745224 751659 758582 766180 774289 781848 788118 794113 801269 808966
56827 808966 815195 819716 824312 829287 831902 829566 822916 814314 804708 793668 781462 769279 757868
56814 757868 747475 739002 733956 733086 735807 741000 748024 757205 769670 786315 806685 829582 855148
56801H55148L0457L7632M4744M8957M8128M0896K7559J1075m393j6247k4008k7837
56789A072111k8142k6334k3974k1036j6541j0844n472p05M752J1397J8186K4446
56777I97844L0851L8046M5989N4696O3521O9112O6479N3486L2993R848j2497l1691
56765A418677m5294n2072n3537n2438n0171m6590m1578l5628k9303k3019j7012
56754I72035j1028m570K179Q436J4131K0166K6860L2933L6560L6528L2000K2407
56742A188637Q543o930k0989l1984l9627m3995m5243m3923m0996l7477l3882k9820
56730H22314k4546j8445j3261r988p331l545J003M744P718J1192J4675J5768J3381
56717H13679Q936L743k525r875j6582k1121k3882k5907k7258k7674k7454k6653
$$ plain form
56801 855148 885605 923237 967981 1016938 1065066 1105962 1133521 1144596 1140203 1123956 1099948 1072111
56789 1072111 1043969 1017635 993661 972625 956084 945240 939768 939063 943815 955212 973398 997844
56777 997844 1028695 1066741 1112730 1167426 1230947 1300059 1366538 1420024 1453017 1462865 1450368 1418677
56765 1418677 1373383 1321311 1267774 1215336 1165165 1118575 1076997 1041369 1012066 989047 972035
56754 972035 961007 956437 958616 967052 981183 1001349 1028209 1061142 1097702 1134230 1166230 1188637
56742 1188637 1197180 1190250 1169261 1137277 1097650 1053655 1008412 964489 923493 886016 852134 822314
56730 822314 797768 779323 766062 756074 748743 745198 746201 750945 758663 769855 784530 800298 813679
56717 813679 822615 826358 823833 813958 797376 776255 752373 726466 699208 671534 644080 617427
56705F17427k4723k1803j9035j6770j4048j0674q141p385p329o898o738p493p953
56692D58437o736m559l042k328j594r99j372k543l574m106m230l698k604k044
56678D15008k774l793l617k353j222p62o89q42r81l60J058J751L91k101l675l619
56662C91420k533o61J825L530K930Q14l05N27J707J656Q24L94M54L76J64M58J455
56645D05035K521K812K071Q37k2nP92J951K866K770J422j53l94R61K503K986K660
56628D31613K308J918J084ko97n57N60K325L552K911O32j522k429k730l142l084
56612D32740k018r24j071k196l150l613l972m193m006l711l724l861l957m447
56598C87897n472o284o524p111q619r788r227p775p529q865j0015r378o900l404
$$ plain form
56705 617427 592704 570901 551866 535096 521048 510374 502233 494848 487519 480621 473883 466390 458437
56692 458437 451701 447142 444100 441772 440178 439179 437807 435264 431690 427584 423354 419656 417052 415008
56678 415008 412234 408441 404824 402471 401249 400487 399798 398956 397975 397615 398673 400424 400815 398714 395039 391420
56662 391420 388887 388226 390051 393581 396511 397325 397020 397547 399254 400910 401734 402128 402582 402958 403122 403580 405035
56645 405035 407556 410368 412439 413276 413254 413249 414041 415992 418858 421628 423050 422897 422503 423464 425967 428953 431613
56628 431613 433921 435839 436923 436921 436224 435667 436227 438552 442104 445015 445647 444125 441696 438966 435824 432740
56612 432740 430722 429798 428727 426531 423381 419768 415796 411603 407597 403886 400162 396301 392344 387897
56598 387897 382425 376141 369617 362506 353887 344099 334872 327097 319568 310703 300688 291310 284410 281006
56584B81006J33K644L555L475L570M348N482O454O768O137N089M693N106N178
56570C43638M182K885K202J919J696J993K810K890J561J88K09R09Q11R0k25l43
56554C67415r65j398o77K69q1r30j41K085L153J970L94J91O78M62k40k89M03P30
56536C73029m6j221j131J123M368O288N942M434K851R74j144k103j065O52J617
56521C94568K412L912M970M161K583K323L146L335K908L101L378K170J81k38J020
56506D33930J793J702K879O095R322J1027J1905J2384J1556R696Q874R383Q471
56493E39017M556J61j506p62P7M67J313K203J751K06n52L08J516J409m13l218
56477E46533n988p970q785q264o431l998k361k246k817l066l519n105o927p131
$$ plain form
56584 281006 281139 283783 287338 290813 294383 298731 304213 310667 317435 323572 328661 333354 338460 343638
56570 343638 347820 350705 352907 354826 356522 358515 361325 364215 365776 365964 366173 367082 367893 367983 367758 367415
56554 367415 366450 365052 364375 364644 364563 363633 363492 365577 368730 370700 371094 371285 371963 372425 372185 371896 372299 373029
56536 373029 372983 371762 370631 371754 376122 382410 388352 392786 395637 396611 395467 393364 392299 392951 394568
56521 394568 396980 400892 405862 410023 412606 414929 418075 421410 424318 427419 430797 432967 433148 432910 433930
56506 433930 435723 437425 440304 446399 455721 466748 478653 491037 502593 512289 521163 530546 539017
56493 539017 543573 543734 542228 541466 541543 542010 543323 545526 547277 547483 546931 547239 548755 550164 549751 546533
56477 546533 540545 532575 523790 515526 509095 505097 502736 500490 497673 494607 491088 485983 479056 471925
56463D71925n724m431l781k630q70o9p82j509j247p22k80R64K639K424l06k536
56447D53065j617P39J048q41k056j355n80j369k762k823j151R49K055J842J052
56432D46196M34j39j288k879l940l826k735j023R94K435K341J095K74N57R34L88
56416D39818q25j927k543k392j313p5J57m64n61K79R53R11J062J886K342J653
56400D38961N92N6j54k63K69J360J694P57K8P94K063K063P28n26o63M12K135L242
56382D53548K557O41n91o62j220l007m146l103j448j487k528k048J22J364O4k224
56366D35832k891j211J308K691K248R68K81M89Q05P61O66N70kq64r46K39J913
56349D42857L205L900L692K243L81k71N04J212J100J151K014K825K993L200L559
$$ plain form
56463 471925 466201 461770 457989 455359 454489 454420 453638 452129 450882 450160 449880 450844 453483 455907 455601 453065
56447 453065 451448 452187 453235 452394 450338 448983 448403 447034 444272 441449 440298 441247 443302 445144 446196
56432 446196 446630 446491 445203 442324 438384 434558 431823 430800 431794 434229 436570 437665 437939 438496 439430 439818
56416 439818 438993 437066 434523 432131 430818 430743 430900 430436 429875 430154 431107 432018 433080 434966 437308 438961
56400 438961 439553 439609 439455 439192 439461 440821 442515 443272 443300 444094 446157 448220 448948 448422 447759 448171 450306 453548
56382 453548 456105 456746 456155 455493 454273 451266 447120 444017 442569 441082 438554 436506 436628 437992 438056 435832
56366 435832 432941 431730 433038 435729 437977 438945 439226 439715 440520 441281 441947 442517 442515 441651 440705 440944 442857
56349 442857 446062 449962 453654 455897 456278 456007 456511 457723 458823 459974 461988 464813 467806 471006 474565
56334D74565K838Q36m94J91J570K068K368L607M739M029J960N13M39J100K073
56319E02402L078L111J534n61j564j399j084j073j272j728k005r26J753M293M950
56304E09509L997K712J566P31J001K624M256M489L571K475J482P74R62J825J977
56289E43951J166J129K777M314L856K178J092Q87J195K499M560N241L344J070
56275E79259J123K826L612K920K040J381P04R82L174N923P050O686O537O877O684
56260F37778N959N468M876L490K204K466L911N093N649N916N580M802N229P582
56246G06003R774R884R343J0298J1675J1215R828J0141J1808J2307J1570J1839
56234H35685J3255J3708J3000J3242J4810J5723J5532J6214J8413K0148K0268
$$ plain form
56334 474565 477403 478239 477745 477936 479506 481574 483942 487549 492288 496317 498277 498790 499229 500329 502402
56319 502402 505480 508591 510125 509564 508000 506601 505517 504444 503172 501444 499439 498513 500266 504559 509509
56304 509509 513506 516218 517784 518515 519516 522140 526396 530885 534456 536931 538413 539187 540149 541974 543951
56289 543951 545117 546246 549023 553337 557193 559371 560463 561350 562545 565044 569604 574845 578189 579259
56275 579259 580382 583208 586820 589740 591780 593161 593865 594847 598021 603944 610994 617680 624217 631094 637778
56260 637778 643737 649205 654081 657571 659775 662241 666152 671245 676894 682810 688390 693192 698421 706003
56246 706003 715777 725661 735004 745302 756977 768192 778020 788161 799969 812276 823846 835685
56234 835685 848940 862648 875648 888890 903700 919423 934955 951169 969582 989730 1009998
56223A009998K0185K1179K2725K4270K6143K7896K8331K7850K8456L0680L2809
56212A300522L3790L4629L6312L8517M1023M4333M8336N2149N5716N9878O4766
56201A809971O9779P4980Q0814Q6955R3277J01259J12109J24286J35353J45510
56191B834293J56592J68414J79202J88885J98624K07487K13095K15371K16039
56182D578002K14421K07409J94063J76725J56975J33923J07055P7557M5982J1887
56172E903999k3420n6761q6618j14016j39250j60515j76484j87609j94408j97111
56162D567807j97255j96827j95541j91671j85537j79128j72458j63868j53894
56153B931628j45027j37315j28226j17520j08160j01498r5461q8578q1964p6055
$$ plain form
56223 1009998 1030183 1051362 1074087 1098357 1124500 1152396 1180727 1208577 1237033 1267713 1300522
56212 1300522 1334312 1368941 1405253 1443770 1484793 1529126 1577462 1629611 1685327 1745205 1809971
56201 1809971 1879750 1954730 2035544 2122499 2215776 2317035 2429144 2553430 2688783 2834293
56191 2834293 2990885 3159299 3338501 3527386 3726010 3933497 4146592 4361963 4578002
56182 4578002 4792423 4999832 5193895 5370620 5527595 5661518 5768573 5846130 5892112 5903999
56172 5903999 5880579 5823818 5737200 5623184 5483934 5323419 5146935 4959326 4764918 4567807
56162 4567807 4370552 4173725 3978184 3786513 3600976 3421848 3249390 3085522 2931628
56153 2931628 2786601 2649286 2521060 2403540 2295380 2193882 2098421 2009843 1927879 1851824
56143A851824o9293o1541n5207n1379m8115m3967l9966l6795l3327k9320k6299
56132A356615k4466k2012j8568j5964j4547j2493r810q955j0049r672o382l378
56120A200319l439m949n278m532l565j564J818M788O074O640P133O687N774O752
56106A222658R808J1977J2101J2956J6273J9521K0274K0187K1683K4010K5535
56095A416983K6933K9181L1152L1989L3352L6706M0964M5080N0351N7714O5527
56084A865932P2434P9864Q9333R9801J09833J19636J28601J33552J31855J24092
56074B954933J12018R6620P9937O5717N6001M9341M3807L8866L3321K5039J4374
56063C569974M401l639j1347j8654k3155k5835l2413m6195o3953q1337r7568j11896
$$ plain form
56143 1851824 1782531 1720990 1665783 1614404 1566289 1522322 1482356 1445561 1412234 1382914 1356615
56132 1356615 1332149 1310137 1291569 1275605 1261058 1248565 1238755 1229800 1219751 1210079 1203697 1200319
56120 1200319 1196880 1191931 1186653 1182121 1178556 1176992 1178810 1183598 1189672 1196312 1203445 1210132 1215906 1222658
56106 1222658 1232466 1244443 1256544 1269500 1285773 1305294 1325568 1345755 1367438 1391448 1416983
56095 1416983 1443916 1473097 1504249 1536238 1569590 1606296 1647260 1692340 1742691 1800405 1865932
56084 1865932 1938366 2018230 2107563 2207364 2317197 2436833 2565434 2698986 2830841 2954933
56074 2954933 3066951 3163571 3243508 3309225 3365226 3414567 3458374 3497240 3530561 3555600 3569974
56063 3569974 3574375 3570736 3559389 3540735 3517580 3491745 3459332 3413137 3349184 3267847 3170279 3058383
56051C058383j20572j21295j16693j09918j00832q9670p9840p3202o6668n7392
56041B122301m7452l9628l2676k4879j8281j5057j3096r461m991j761Q38L741
56029A919598N501N427N899Q169R633Q649P937R600J1140J0358R853J2399J6102
56016B040265J8383K0622K4554K8161K9518L0595L3111L4854L4240L3953L5928
56005B364184L7485L6817L7083M0353M2761M0925L7956L7750L8452L7142L5817
55994B786725L6994L8417L7923L8400M2113M5515M5784M6859N2461N8748O0822
55983C290761O1081O4034O8190P0305P2283P6450P9514P8829P9135Q5027R2306
55972D117915R5010R5483R8988J03849J05956J07816J13885J21697J26663J30780
$$ plain form
56051 3058383 2937811 2816516 2699823 2589905 2489073 2399403 2319563 2246361 2179693 2122301
56041 2122301 2074849 2035221 2002545 1977666 1959385 1944328 1931232 1921771 1916780 1915019 1915857 1919598
56029 1919598 1925099 1930526 1936425 1944594 1954227 1962876 1970813 1980413 1991553 2001911 2011764 2024163 2040265
56016 2040265 2058648 2079270 2103824 2131985 2161503 2192098 2225209 2260063 2294303 2328256 2364184
56005 2364184 2401669 2438486 2475569 2515922 2558683 2599608 2637564 2675314 2713766 2750908 2786725
55994 2786725 2823719 2862136 2900059 2938459 2980572 3026087 3071871 3118730 3171191 3229939 3290761
55983 3290761 3351842 3415876 3484066 3554371 3626654 3703104 3782618 3861447 3940582 4025609 4117915
55972 4117915 4212925 4308408 4407396 4511245 4617201 4725017 4838902 4960599 5087262 5218042
55962E218042J37956J45778J50888J56854J67465J78118J83496J87931J98171
55953F724699K12084K24858K39731K61292K84395L01518L15289L32022L49191
55944I245079L61396L72440L88662M06427M19158M30524M47692M67919M85219
55935A3024516N03305N28283N56080N81422O11075O52799O99696P41699P83696
55926A8682571Q35341Q92545R47344J005761J075905J148888J212986J276367
55918B7077708J353191J438468J521490J612659J730019J870088K020188K187890
55910D0811701K387950K612885K850378L117779L443366L826124M252390M737186
55902F8039759N304666N942194O622900P360023Q187659R107461J0117689J1277925
$$ plain form
55962 5218042 5355998 5501776 5652664 5809518 5976983 6155101 6338597 6526528 6724699
55953 6724699 6936783 7161641 7401372 7662664 7947059 8248577 8563866 8895888 9245079
55944 9245079 9606475 9978915 10367577 10774004 11193162 11623686 12071378 12539297 13024516
55935 13024516 13527821 14056104 14612184 15193606 15804681 16457480 17157176 17898875 18682571
55926 18682571 19517912 20410457 21357801 22363562 23439467 24588355 25801341 27077708
55918 27077708 28430899 29869367 31390857 33003516 34733535 36603623 38623811 40811701
55910 40811701 43199651 45812536 48662914 51780693 55224059 59050183 63302573 68039759
55902 68039759 73344425 79286619 85909519 93269542 101457201 110564662 120682351 131960276
55894A31960276J2676899J4360681J6374766J8843607K1900198K5570114K9828794
55887B71515335L4592441L9200316M1766693L9581631L0906104J6669880K48906
55880D74481306j4573389k5529114l2223397l5324748l5778051l4493141l2222135
55873B64337331k9457383k6468234k3449234k0578767j7964552j5632893j3590928
55866A17195340j1845813j0367421r094719p989332p042810o235206n531167m916285
55858E4172587m396125l957916l569302l215677k905470k638049k397611k179300
55850B8913137j991544j830689j680008j535266j406665j294841j188442j086059
55842A6899623r97923r24991q57363p93654p41365o97879o51342o01223n58742
$$ plain form
55894 131960276 144637175 158997856 175372622 194216229 216116427 241686541 271515335
55887 271515335 306107776 345308092 387074785 426656416 457562520 474232400 474481306
55880 474481306 459907917 434378803 402155406 366830658 331052607 296559466 264337331
55873 264337331 234879948 208411714 184962480 164383713 146419161 130786268 117195340
55866 117195340 105349527 94982106 85887387 77898055 70855245 64620039 59088872 54172587
55858 54172587 49776462 45818546 42249244 39033567 36128097 33490048 31092437 28913137
55850 28913137 26921593 25090904 23410896 21875630 20468965 19174124 17985682 16899623
55842 16899623 15901700 14976709 14119346 13325692 12584327 11886448 11235106 10633883 10075141
55833A0075141n26050m93531m58770m29884m08301l85487l58843l34917l14980
55824F364378k92777k68361k49378k36779k23288k07617j96556j91390j85357
55815D312875j76194j68675j63431j55638j45831j39909j37315j31066j20356
55806B974460j11406j05251r6565q5363p7752p4105o8500o1105n8902o2296o3039
55795B110176n7923n3005n1571m9137m3578l9584l9494l9346l7374l7196l9479
55784A622489l9338l5101l1278l0146k8611k5741k5016k6669k6127k2517k0608
55773A311337k1934k2262k0190j9895k2591k3460k0186j6843j6148j5413j3213
55762A099202j2687j4900j5945j3889j2042j2399j2298j0352r236r870r272o690
$$ plain form
55833 10075141 9549091 9055560 8596790 8166906 7758605 7373118 7014275 6679358 6364378
55824 6364378 6071601 5803240 5553862 5317083 5093795 4886178 4689622 4498232 4312875
55815 4312875 4136681 3968006 3804575 3648937 3503106 3363197 3225882 3094816 2974460
55806 2974460 2863054 2757803 2661238 2575875 2498123 2424018 2355518 2294413 2235511 2173215 2110176
55795 2110176 2052253 1999248 1947677 1898540 1854962 1815378 1775884 1736538 1699164 1661968 1622489
55784 1622489 1583151 1548050 1516772 1486626 1458015 1432274 1407258 1380589 1354462 1331945 1311337
55773 1311337 1289403 1267141 1246951 1227056 1204465 1181005 1160819 1143976 1127828 1112415 1099202
55762 1099202 1086515 1071615 1055670 1041781 1029739 1017340 1005042 994690 985454 975584 966312 959622
55750I59622n389n959m653q72P77j166j875J154L538K049M35K589N998O684N372
55735I68304M146J901k368o182p681r021j1909j3925j3067j1775j2533j3324j1504
55722H61062q682p856q573q544p494o299m666k276q0J665M135P299R246R359Q918
55707H47214P515K785m904j1567j5103j7523k0128k0969j9286j7944j8660j8925
55695F92505j6482j3126j1222j0038q433p659q550r091p739o225o314o659n544
55682E75423m013l619l693l225l043l821m436m387n207p373q519o986m595l673
55668E08833l644k844j514r72j563l028n017o136m813k126j273l172n122m799
55654D62810k742j55K664M758M681L278K987L547K047j781m485m412m093n349
$$ plain form
55750 959622 954233 948274 943621 942749 943526 942360 940485 941639 945177 947226 947661 950250 956248 962932 968304
55735 968304 972450 974351 971983 965801 958120 949099 937190 923265 910198 898423 885890 872566 861062
55722 861062 852380 844524 835951 827407 819913 813614 808948 806672 806592 808257 812392 819691 828937 838296 847214
55707 847214 854729 857514 852610 841043 825940 808417 788289 767320 748034 730090 711430 692505
55695 692505 676023 662897 651675 641637 633204 625545 616995 607904 600165 593940 587626 580967 575423
55682 575423 571410 567791 564098 560873 557830 554009 549573 545186 539979 532606 524087 517101 512506 508833
55668 508833 505189 502345 500831 499859 498296 495268 490251 484115 479302 477176 475903 472731 467609 462810
55654 462810 460068 459913 462577 467335 472016 475294 478281 481828 483875 482094 477609 473197 469104 463755
55640D63755o408n887n462o077n731l609k405l623m484k635k71j58r19R5K275
55625D18456L561M183N144N458M147K765K907L404K837K432L517M489L503J893
55611D68696J826K520J912K18j097k145l452l795k051L53J518K051L390M834M833
55596D79611L732K819K075J148R14J787K108L87k425m735o577q128q335p117o674
55581D50590q199r519q539o762o600p430p266o426o354o451n193l115j866j529
55567C65341j364j881l638n305n366m455l841l118j623m30n56r43n84p96k773
55552C28668m785m627l169k608k765k066p40j95l62l37m26j100j368o61o10k384
55536C00465m110l768k691l027l704k530n91n50j802j371J004K594K173J173N10
$$ plain form
55640 463755 457347 451460 445998 439921 434190 430581 428176 424553 420069 417434 417163 417005 416086 416181 418456
55625 418456 422017 426200 431344 436802 440949 443714 446621 450025 452862 455294 458811 463300 466803 468696
55611 468696 470522 473042 474954 475172 474075 471930 468478 464683 462632 462985 464503 466554 469944 474778 479611
55596 479611 483343 486162 488237 489385 490299 492086 494194 494581 492156 487421 480844 472716 464381 457264 450590
55581 450590 442391 432872 424333 417571 410971 403541 396275 389849 383495 377044 371851 368736 366870 365341
55567 365341 363977 362096 358458 353153 347787 343332 339491 336373 334750 334320 333764 332821 332237 331441 328668
55552 328668 323883 319256 316087 313479 310714 308648 307908 307713 307351 307014 306588 305488 304120 303459 302849 300465
55536 300465 296355 292587 289896 286869 283165 280635 280044 279494 277692 276321 277325 279919 282092 283265 283775
55521B83775l51j125o87N42J050J059K224M550O284O850P298P926P934P470P558
55506C42357P933P189N132K971J389K56k87m14j625m878q402r621q626p480o918
55491C18976o266n789o239o557m919j887J15L15N6O1j18j62Q42K245K380J307
55475B94360O03N83J14q27r52j68J25n52j255j637k367l486m206m370m171k939
55459B68855l38J731J003j591k858j787n69j014k534l913m858n249m890m239l853
55444B33896l297k212j729k702l451j953M67P10j247k318j135N27J437K606M469
55429B24068N481M634K826Q29j550l516l287j148J18r68k647k884j940q30L80
55414B19566J351Q46j115k420j746n57p46j902k469k142j602j059m23m6j81n30
$$ plain form
55521 283775 283424 282299 281612 282154 283204 284263 286487 291037 297321 304171 311469 319395 327329 334799 342357
55506 342357 350290 357479 362611 365582 366971 367227 366940 366526 364901 360023 351621 342000 333374 325894 318976
55491 318976 312710 306921 300682 294125 289206 287319 287434 287749 287805 287866 287748 287586 288428 290673 293053 294360
55475 294360 294963 295546 295660 294833 293881 293713 293838 293286 292031 290394 288027 284541 280335 275965 271794 268855
55459 268855 268517 270248 271251 269660 266802 265015 264446 263432 260898 256985 252127 246878 241988 237749 233896
55444 233896 230599 228387 226658 223956 220505 218552 219019 219729 218482 216164 215029 215556 216993 219599 224068
55429 224068 229549 234183 237009 237838 236288 232772 229485 228337 228455 227487 224840 221956 220016 219186 219566
55414 219566 220917 221763 220648 218228 216482 215925 215179 213277 210808 208666 207064 206005 205582 205536 205355 204825
55398B04825r36j529j711m38J777K639R48j566k294p50J359K226J402j47r91p51
55382B04063o95j941l436l114r11J076J515J216J255J534J702J864J769Q68k79
55367B06486k39J063J931J408O44R75K068K853K951K475J522P04J029K521L880
55352B32271M060L250K019P42J22Q59K237K363M66k193m156n294n860n390l509
55337B21987j005P50J009M9j193j829j890k186k694j960P13L349L392J145p20
55322B18917p47J84R42J070p2k614m565l508l11J398Q5j941k337j607j119q49
55306B02926n83j050k159k096J20K836M062L941L335J758j236l950m056j695O31
55291B02784R56n86k554l449k536l55J654K437J944O27p90j293n92p7j154k704
$$ plain form
55398 204825 203889 202360 200649 200211 201988 204627 205575 204009 201715 200965 202324 204550 205952 205805 204814 204063
55382 204063 203368 201427 197991 194877 193966 195042 196557 197773 199028 200562 202264 204128 205897 206765 206486
55367 206486 206247 207310 209241 210649 211293 212268 214336 217189 220140 222615 224137 224841 225870 228391 232271
55352 232271 236331 239581 241600 242342 242464 243323 245560 247923 248389 246196 242040 236746 230886 225496 221987
55337 221987 220982 221732 222741 222790 221597 219768 217878 215692 212998 211038 211751 215100 218492 219637 218917
55322 218917 218170 218354 219296 220366 220294 217680 213115 209607 209296 210694 210779 208838 206501 204894 203775 202926
55306 202926 202343 201293 199134 197038 197158 199994 204056 207997 211332 213090 211854 207904 203848 202153 202784
55291 202784 203740 203154 200600 197151 194615 194260 195914 198351 200295 200922 200132 198839 198247 198170 197016 194312
55275A94312k195M53K400J995Q95R77J485Q95l82j087j344j842j995r31N65R09
55259A95110N2n48N9J447K489K158K30k104l166k844k666l293l348j628R62K795
55243A85705L495L348K091j57j881j690k61M93l15j977l180k723k29K943M459
55228A90121L535J791Q56N18J52L77J811L399L697K897K047J186j63j365j274
55213B09585j03P13L45q24j967k340j454K09J199P18k66l27N61J292J146K93o59
55196B08121j038o97n31j467k682k270j20J598J581J027J108R07m11j444p42M93
55180B03433K99p73q45r0j98j062r34K64N39q12j903j056J026K662L165K678J464
55163B07857J41l90k6L01q1p54r87o64j60J43N6k69l83q4L19O30J089J581J224
$$ plain form
55275 194312 192117 192570 194970 196965 197860 198837 200322 201217 200835 199748 198404 196562 194567 193636 194201 195110
55259 195110 195162 194614 194673 196120 198609 200767 200997 198893 195727 192883 190217 186924 183576 181948 182910 185705
55243 185705 189200 192548 194639 194482 192601 190911 190650 191143 190828 188851 185671 182948 182719 185662 190121
55228 190121 193656 195447 196303 196821 196973 197350 199161 202560 206257 209154 211201 212387 212224 210859 209585
55213 209585 209482 210195 210540 209716 207749 205409 203955 204164 205363 206081 205815 205488 206049 207341 208487 208780 208121
55196 208121 207083 206386 205855 204388 201706 199436 199316 200914 202495 203522 204630 205537 205126 203682 202940 203433
55180 203433 203732 202959 202114 202024 201826 200764 199830 200094 200633 199821 197918 196862 197888 200550 203715 206393 207857
55163 207857 207998 207608 207582 207883 207802 207048 206061 205397 205237 205380 205436 205167 204784 204700 205019 205649 206738 208319 209543
55144B09543l80k125k679k209j756j463p37J66K23o35j172m39J239K955L995L819
55128B08345K311K89r75j105r25j219j670j318J99K037K853K200J069O29P24L94
55112B13838l58n91l12p19j967k426j172K92L23k58M10K163L149K629J519N06
55096B17026n13j198p83M26R95L28n24l38Q47J950J782j41k883m344l304r79L46
55079B08693N3n72o06m97o18k42J230K932L258J673p52k397k563j886j424j409
55063B04873j199m20M44Q89J073J376J794K237K729K944K349J223N92O42L09q36
55047B21019j582r97p8r0m27K62J613K111J530J055J125R29J66l31J2O74R23O68
55029B28582L06L50J064J867J633K73p35l53M73M83K42Q30J375L13j457j301J025
$$ plain form
55144 209543 209163 207038 204359 202150 200394 198931 198194 198360 198583 197948 196776 196337 197576 200531 204526 208345
55128 208345 210656 210945 209970 208865 207940 206721 205051 203733 203932 205969 208822 211022 212091 212720 213444 213838
55112 213838 213480 212889 212577 211858 209891 207465 206293 206585 206908 206650 207060 209223 212372 215001 216520 217026
55096 217026 216513 215315 214532 214958 215953 216281 215757 215419 216266 218216 219998 219857 216974 212630 209326 208347 208693
55079 208693 208746 208174 207568 207071 206453 206211 207441 210373 213631 215304 214552 212155 209592 207706 206282 204873
55063 204873 203674 203254 203698 204587 205660 207036 208830 211067 213796 216740 219089 220312 220904 221546 221855 221019
55047 221019 219437 218440 218362 218272 217845 218107 219720 221831 223361 224416 225541 226470 226636 226305 226317 226991 227914 228582
55029 228582 228888 229238 230302 232169 233802 234075 233340 232987 233460 233943 234185 235015 236390 236703 235246 233945 234970
55012B34970K659J760M4j07R67J267K93p33r67p89p16p10n42j64K60L46k87j349
54994B36202j815j064J87O11p3p89n70Q0q4j085j328K80K493L080J722K02k63
54977B37786l62q25q93J45J228P40j205k997l497k688j100K60J48j438k594j699
54961B21009L33J356J020Q33J614K574K912K735K190J135k6l08N67J768K315J829
54945B43856L95j403k544k462j757j264q57k9R25J422J748K429K936K380J138
54930B46913L71K70K36L44J080J832J472L64O7Q68J315M63r81k078k699k763j948
54913B45126o71j02n16p19L57K275L653L430J583o38j391j06J662K202J884K134
54897B60163K844K657J383J50p12j773k552j775L9O61n23j449o24O51N19o94j424
$$ plain form
55012 234970 237629 239389 239433 239326 240293 241560 241853 241120 240153 239364 238648 237938 237396 237232 237492 237838 237551 236202
54994 236202 234387 233323 233510 234121 234048 233259 232689 232769 232685 231600 230272 230552 233045 236125 237847 238049 237786
54977 237786 237424 236599 235706 235851 237079 237819 236614 233617 230120 227432 226332 226592 226740 225302 222708 221009
54961 221009 221342 222698 223718 224551 226165 228739 231651 234386 236576 237711 237685 237377 237944 239712 242027 243856
54945 243856 244251 242848 240304 237842 236085 234821 233964 233935 234860 236282 238030 240459 243395 245775 246913
54930 246913 247284 247554 247790 248134 249214 251046 252518 252882 252949 253817 255132 255595 254614 252536 249837 247074 245126
54913 245126 244455 244353 243837 243118 243475 245750 249403 252833 254416 253778 252387 252281 253943 256145 258029 260163
54897 260163 263007 265664 267047 267197 266485 264712 262160 260385 260424 261085 260562 259113 258489 259140 259659 258965 257541
54880B57541j127l02N79J083P97K69P85K478L760L619L077L410M179M317M015
54865B88480M188M877N505O059O893P851Q637R482J0338R971O967J613m002p742
54851C59117q836p921o291n010m433m488n131o021o116m629k418j342j948k842
54837B91691k622j473l87K05M49N03N21P14J061J435K040L121M250M717M574M507
54821C15306M842N478O540P914Q598P779O354N867O122N504L442P69k249o041
54807C76225r783j1517j0839r361q053o341m480m233n973p379o488m226k483j622
54793B83447j368k224m159n471m860l382k709k724k427j865j509r68o8J17r08
54778B48922j482n9K056K371P68p15j047j015j279j575j744j857j465j63J347
$$ plain form
54880 257541 256414 256112 256691 257774 258571 258840 259625 262103 265863 269482 272559 275969 280148 284465 288480
54865 288480 292668 297545 303050 309109 316002 323853 332490 341972 352310 362281 369248 370861 366859 359117
54851 359117 350281 342360 336069 331059 326626 322138 317007 310986 304870 300241 297823 296481 294533 291691
54837 291691 289069 287596 287209 287414 287863 288366 288887 289601 290662 292097 294137 297258 301508 306225 310799 315306
54821 315306 320148 325626 332166 340080 348678 356457 362811 368678 374800 380304 383746 384515 382266 376225
54807 376225 366442 354925 344086 334725 326672 320331 315851 311618 305645 298266 291778 287552 285069 283447
54793 283447 282079 279855 275696 270225 265365 261983 259274 256550 254123 252258 250749 249781 249713 249830 248922
54778 248922 247440 247381 249437 251808 252576 251861 250814 249799 248520 246945 245201 243344 241879 241716 243063
54763B43063K035K014J959J732R05J61N05J570K125J883J376N77q26k245k790
54748B54044k613k208j077J226L297L151R85j159k190k471j881K73L151M418L176
54733B60122J048k53p90j178j131k67Q74J562J784J759J440R87R96J746K937M391
54717B76027O089P256O583L925R39m80K71K770O324R813J1765J1521J0025Q773
54703C61601Q332Q194P691O511M600K087o81l268n359o843p905q857r710j0057
54689C46336r632q722p679o363m631l077k519k873l157k675j577k58J161K520
54675B96854L342L235K420J579J193J100Q46O08J417L911P065R004R172Q772Q744
54660C59262Q399O757M250K118O42r55l176n612p471q247q097p790p877p782o619
$$ plain form
54763 243063 245098 247112 249071 250803 251708 251869 252374 253944 256069 257952 259328 259905 259079 256834 254044
54748 254044 251431 249223 248146 249372 252669 255820 256805 255646 253456 250985 249104 249377 252528 256946 260122
54733 260122 261170 260917 260127 258949 257818 257551 258425 259987 261771 263530 264970 265957 266953 268699 271636 276027
54717 276027 282116 289372 295955 299880 300819 300339 300610 303380 309704 319517 331282 342803 352828 361601
54703 361601 369933 378127 385818 392329 396929 399016 398335 395067 389708 382865 374960 366103 356393 346336
54689 346336 336704 327982 320303 313940 309309 306232 303713 300840 297683 295008 293431 293173 294334 296854
54675 296854 300196 303431 305851 307430 308623 309723 310569 311177 312594 316505 323570 332574 341746 350518 359262
54660 359262 367661 374418 378668 380786 381428 380473 377297 371685 364214 355967 347870 340080 332203 324421 317802
54645C17802n060m996o651p515n436j617Q93Q22p44k569m202n117m722l401k274
54630B65213j774j454r97n14r3N5n32j589j784n56M92l34k128k553j199K88R73
54613B51514J362J451N15r08j229n28p62k382l178j763K2P9n64L78K543L427K263
54596B52240R00O85O39n01k048k337j055M66R46L15p74j812k541k582j641j22
54580B40778R17Q40K74M59J674K630J808n91k287j095K355M707L442j61k611k426
54564B50713j321j133j498j310o72r9P36J892K069M47j406j456j75M50K61Q16
54548B48314K232K740J675M82J19l58j568k188q92J533L195L177J728m40k150
54533B57599k181o47R04J495J677J911J442j32j491j305k78o0q23j368j110n23
$$ plain form
54645 317802 312742 307746 301095 293580 288144 286527 287420 288242 287498 284929 280727 275610 270888 267487 265213
54630 265213 263439 261985 260988 260474 260381 260436 259904 258315 256531 255975 256467 256133 254005 251452 250253 250541 251514
54613 251514 252876 254327 254842 253934 252705 252177 251415 249033 245855 244092 244114 244193 243629 244007 246550 249977 252240
54596 252240 253140 253825 254464 253963 251915 249578 248523 248989 249935 250250 249476 247664 245123 242541 240900 240778
54580 240778 241695 242535 242809 243268 244942 247572 249380 248789 246502 245407 247762 252469 255911 255750 253139 250713
54564 250713 249392 248259 246761 245451 244779 244680 245416 247308 249377 249824 248418 246962 246787 247237 247498 248314
54548 248314 250546 253286 254961 255443 255562 255204 253636 251448 250556 252089 255284 258461 260189 259749 257599
54533 257599 255418 254771 255675 257170 258847 260758 262200 262068 260577 259272 258994 258934 258111 256743 255633 255110
54517B55110J15R67J706J588O06l17m93j02M13Q36J006Q00M53M36Q35J260J394
54500B66613J306J246J352J533J350J72k032m090m321k076J506M445N472M676
54486B77152K966J261J97M2M49M86m68j747j929o78O10N39m43p11L30J619J932
54469B81607J212K39l48m14j96p7l21q39j276j236m93O53J228M64j014j666j074
54452B76449n54j126j882j415N4J185J465J280P17k64r04m17O37J211J512K266
54436B80214K752J660l19j057k51K38k39MJ696K779J521n95j136l10m3n55k40
54419B86119J367K590J908j33j686j461L19K202K792K111J393J359J424J105J171
54404C02580K383L919M256L194J890J086M54m30j417k244k847l139l052k851k794
$$ plain form
54517 255110 255225 256192 257898 259486 260092 259775 259282 259180 259593 260429 261435 262235 262688 263124 263959 265219 266613
54500 266613 267919 269165 270517 272050 273400 273572 271540 267450 263129 261053 262559 267004 272476 277152
54486 277152 280118 281379 281576 281618 282067 282553 282085 280338 278409 277731 278341 278880 278437 277726 278056 279675 281607
54469 281607 282819 283058 282710 282296 282100 282023 281702 280863 279587 278351 277858 278511 279739 280203 279189 277523 276449
54452 276449 275895 274769 272887 271472 271526 272711 274176 275456 276173 275909 275005 274588 275225 276436 277948 280214
54436 280214 282966 284626 284307 283250 282999 283237 282998 283002 284698 287477 288998 288403 287267 286957 286914 286359 286119
54419 286119 287486 290076 291984 291851 290165 288704 289023 291225 294017 296128 297521 298880 300304 301409 302580
54404 302580 304963 308882 313138 316332 318222 319308 319762 319332 317915 315671 312824 309685 306633 303782 300988
54389C00988k531j418L03J241K37k152l873l456j645n48r47j315q7J851K274P81
54373B89703p21p78k4M31N93Q25Q89P86J354K803L790L235K075J830K121J325
54357C10237p54k481k690j896j089n58k63k56l14J14J128K092K489K571K867L421
54341C14618L802L644K936J771J19j945l618l487r99K328M044L389J862R34L36
54326C29734o59j487j148p5M08K73Q56K567L930L588K220J647K499L660L812K781
54310C54606J303J15l50K80K064M155N136M402K804J453K80j247k524k251o15
54295C69611M02n07k227k923k567k658l902n312n732n283m982n308n577m807l088
54280C15140j662j359j396n43Q01Q61r03k726k661q80J008K104K773L478L989
$$ plain form
54389 300988 298457 297039 297342 298583 298820 296668 292795 289339 287694 287146 286199 284884 284797 286648 288922 289703
54373 289703 288982 288204 288180 288611 289204 290029 290918 291704 293058 295861 299651 302886 304961 306791 308912 310237
54357 310237 309483 307002 304312 302416 301327 300769 300506 300250 299936 300050 301178 303270 305759 308330 311197 314618
54341 314618 318420 322064 325000 326771 326890 324945 321327 317840 316841 319169 323213 326602 328464 329398 329734
54326 329734 329075 327588 326440 326365 326773 327046 327902 330469 334399 337987 340207 341854 344353 348013 351825 354606
54310 354606 355909 356024 355674 355954 358018 362173 367309 371711 374515 375968 376248 375001 372477 370226 369611
54295 369611 370013 369506 367279 364356 361789 359131 355229 349917 344185 338902 333920 328612 323035 318228 315140
54280 315140 313478 312119 310723 310180 310981 311842 310939 308213 305552 304672 305680 307784 310557 314035 318024
54265C18024L607J791j087l403l400j192J007J252p2j144r27K24J458J956J074
54250C19168j082l347m440m063k679p97Q88J344K28j262j579o60J68pp22r42j36
54233C00080J320K357K017N35p06p18RN04P46J295K071K504K648L025L513L317
54217C24517K196Q33j29o54q01l63N97J441J606J347J433K184K981K931J924P57
54201C42800M3m74j034q98O67K702L199J577o70k137k823k865j657O70K336J891
54185C43327K02q73r19p76q19q69j094j522j278K16J826K073J332R74Q28n13k911
54168C39204m375l801k222q94K9L59o22k477l030j037J641K043j76k461k594j025
54152C18562K50J75o21j131j252j439j585r97M70J931K564K415J785O19q28j454
$$ plain form
54265 318024 321631 323422 322335 318932 315532 314340 315347 316599 316527 315383 314456 314680 316138 318094 319168
54250 319168 318086 314739 310299 306236 303557 302760 303648 304992 305220 303958 302379 301719 301887 301880 301158 300216 300080
54233 300080 301400 303757 305774 306309 305603 304885 304894 305398 306144 307439 309510 312014 314662 317687 321200 324517
54217 324517 326713 327546 327417 326763 325962 325599 326196 327637 329243 330590 332023 334207 337188 340119 342043 342800
54201 342800 342843 342369 341335 340437 341104 343806 347005 348582 347912 345775 342952 340087 338430 339100 341436 343327
54185 343327 343529 342656 341737 340961 340142 339273 338179 336657 335379 335595 337421 339494 340826 341800 342628 342115 339204
54168 339204 334829 331028 328806 327912 327941 328300 327678 325201 322171 321134 322775 324818 324642 322181 319587 318562
54152 318562 318812 318987 318366 317235 315983 314544 312959 311962 312432 314363 316927 319342 321127 321746 320918 319464
54136C19464n40J007J714J352P04O6p36j227p21K32M15L5N87K336L530K798R59
54119C31975m22r45r54k79J257K736K822J408k49j083j232j502k215k761k284
54104C26272q91O4n74k114k607j189Q61J795J329M35j64m91o96o98n06l51l54
54087C20121l07R4Q99J831K528K838K821K518J869R14r4q86j266j034k22N99Q35
54070C34058Q77J796L631M883M465L276K790K862K359J473J665L146M158L393
54056C74832J789R65R66O84j02m25J46N94k25j909k847k204r92q32j962l178l571
54039C61729l438l241k614j201K40N57k43r70p32K40J109J284P85J99O1O3n45
54022C53283j503j343O74L252M633M636M072K983J148k83M02K890M822M730L570
$$ plain form
54136 319464 318924 319931 321645 322997 323701 323767 323031 321804 321083 321315 321730 321765 322352 324688 328218 331016 331975
54119 331975 331553 330608 329654 329375 330632 333368 336190 337598 337349 336266 335034 333532 331317 328556 326272
54104 326272 325381 325445 324871 322757 320150 318961 319822 321617 322946 323381 323217 322726 322030 321332 320826 320475 320121
54087 320121 319814 319908 320807 322638 325166 328004 330825 333343 335212 336126 336032 335146 333880 332846 332624 333223 334058
54070 334058 334935 336731 340362 345245 349710 352986 355776 358638 360997 362470 364135 367281 371439 374832
54056 374832 376621 377586 378552 379236 379134 378709 378855 379449 379224 377315 374468 372264 371272 370440 368478 365300 361729
54039 361729 358291 355050 352436 351235 351475 352032 351789 350819 350087 350327 351436 352720 353505 353704 353765 353828 353283
54022 353283 351780 350437 351111 354363 358996 363632 367704 370687 371835 371552 371954 374844 379666 384396 387966
54007C87966K887K861K840K637K332J695O62r4J53J145J865J665R28O80J575L160
53991D14957M303M479M342M658N222N365N043M771M960N943Q012J0628J2279J2251
53977E07213J1750J2069J2399J1149Q940Q185R670J1425J1431R812P852O375N692
53964F33962N790N920N027L174J534P18J94l89p50j181k648m994o523o295n638
53949F27901o266p910q881q352p084o335o733p972r033r038q069o787n390l734
53935E26317k359k258l392m406m167k720o78J314K446K320J919K735M716O309
53921E28096O737O832P265P358O166L435p92o017j0385j1787j0497r021q553p642
53907E01195n232k910k519l293l214j934n11O35J718K366K070J264O10o1q21o28
$$ plain form
54007 387966 390853 393714 396554 399191 401523 403218 403880 403786 403939 405084 406949 408614 409542 410222 411797 414957
53991 414957 419260 423739 428081 432739 437961 443326 448369 453140 458100 464043 472055 482683 494962 507213
53977 507213 518963 531032 543431 554580 563520 571705 581375 592800 604231 614043 621895 628270 633962
53964 633962 639752 645672 650699 653873 655407 656125 656319 655930 655180 653999 651351 646357 639834 633539 627901
53949 627901 621635 613725 604844 596492 589408 583073 576340 568368 559335 550297 542228 535441 530051 526317
53935 526317 523958 521700 518308 513902 509735 507015 506337 507651 510097 512417 514336 517071 521787 528096
53921 528096 534833 541665 548930 556288 562454 565889 565097 559080 548695 536908 526411 517390 508837 501195
53907 501195 495963 493053 490534 487241 484027 482093 481582 482217 483935 486301 488371 489635 490245 490184 489363 488735
53891D88735J229L478M280L746L451L964M460M475M459M757N387O656Q817J1080
53877E58974J2118J1482R807P922O541O286P061P904Q250Q715R742J0377R766
53864F74945Q950R544J1197J2089J1708J1379J2029J3083J3797J4232J4458J4104
53852H21515J3258J2797J3175J3579J2903J1063Q948P266N794L820J312o88j311
53839I23431j302k350m813p281q675r508j0471j1164j1331j2014j3982j6066j6623
53826G97851j5887j5293j5076j4332j2985j2036j1935j2079j1909j1339j0393
53815F54587r495r594j0781j1444j0305q630q584r915j0365r209q091q179q605
53802E31390q435q035p651o413l959j639q93j403j929k084k321k807l319l777
$$ plain form
53891 488735 489964 493442 497722 501468 504919 508883 513343 517818 522277 527034 532421 539077 547894 558974
53877 558974 571092 582574 592381 600303 606844 613130 620191 628095 636345 645060 654802 665179 674945
53864 674945 683895 693439 704636 716725 728433 739812 751841 764924 778721 792953 807411 821515
53852 821515 834773 847570 860745 874324 887227 898290 907238 914504 920298 924118 925430 924742 923431
53839 923431 922129 919779 914966 907685 899010 889502 879031 867867 856536 844522 830540 814474 797851
53826 797851 781964 766671 751595 737263 724278 712242 700307 688228 676319 664980 654587
53815 654587 645092 635498 624717 613273 602968 594338 585754 575839 565474 556265 548174 539995 531390
53802 531390 522955 514920 507269 500856 496897 495258 494365 492962 491033 488949 486628 483821 480502 476725
53788D76725m164m250l847l002j749k30P97M32j012k002j629p67p21j368j481
53773D51732n41O96J480K131L393N026N796N029L558K513J687J59j613j886k27
53758D78933J542J883J605K187L401M187M757N899O938O529N084M450N268O609
53744E39272Q060J0065J2110J2793J2167J1949J2700J2860J1437R728R131Q994
53732F71266Q143P000O630O658N853M127K415J026n66k420l851m464m635m910
53718F92272n622o999r053j1236j2581j2416j0934r211q497r064r758r194p395
53705E70312n781n505o404p571q301q353p964p661p505o686m696k704k569m258
53691D84354n493m425j691O82J577J439J263J506J634O84j294k647j972k18L81
$$ plain form
53788 476725 472561 468311 464464 461462 459713 459483 460280 460712 459700 457698 456069 455302 454581 453213 451732
53773 451732 451191 451887 453367 455498 458891 463917 469713 474742 478300 480813 482500 482659 481046 479160 478933
53758 478933 480475 482358 483963 486150 489551 493738 498495 504394 511332 517861 522945 527395 532663 539272
53744 539272 547332 557397 569507 582300 594467 606416 619116 631976 643413 653141 662272 671266
53732 671266 679409 686409 693039 699697 705550 709677 712092 713118 712552 710132 706281 701817 697182 692272
53718 692272 686650 679651 670598 659362 646781 634365 623431 614220 605723 596659 586901 577707 570312
53705 570312 564531 559026 552622 545051 536750 528397 520433 512772 505267 498581 493885 491181 488612 484354
53691 484354 478861 474436 472745 473427 475004 476443 477706 479212 480846 481530 480236 477589 475617 475399 475780
53676D75780n33j048o6J038O67o08j164o48O0M57P77J368K328L310L265J431r85
53659D85429j501M09K311K149J113J532L301M488M528M500M682M166L036K721
53645E22864L668M549M528M633N937P703Q468P966O976N970N038M527M684M920
53631F02431M477L669L568M336M722L557J198r80k111k426k507k488k116j257
53617F14073j30Q25J247J196J152J489J909J802J156N94L14k37j185j532n15R11
53601F23069J117O9o82k78M62N95L03N2l99j320k138k106j272j40J093K240K707
53584F23372K191J451J575K725M208N500O416O534N345L136J111M66J526L678
53570F69234N806O940O822N884M459K477J26j576j593p8J775K992L524L839M244
$$ plain form
53676 475780 475247 474199 474133 475171 475838 475230 474066 473418 473478 473935 474712 476080 478408 481718 484983 486414 485429
53659 485429 483928 484337 486648 488797 489910 491442 494743 499231 503759 508259 512941 517107 520143 522864
53645 522864 526532 531081 535609 540242 546179 553882 562350 570316 577292 583262 588300 592827 597511 602431
53631 602431 606908 610577 614145 618481 623203 626760 627958 626978 624867 622441 619934 617446 615330 614073
53617 614073 613943 614768 616015 617211 618363 619852 621761 623563 624719 625313 625627 625390 624205 622673 622158 623069
53601 623069 624186 624255 623573 623295 623757 624352 624655 624707 624308 622988 620850 618744 617472 617332 618425 620665 623372
53584 623372 625563 627014 628589 631314 635522 641022 647438 653972 659317 662453 663564 664030 665556 669234
53570 669234 675040 681980 688802 694686 699145 701622 701748 700172 698579 698501 700276 703268 706792 710631 714875
53555G14875M666M725M184L566L949N626P318P543O623O317P250P829O446L913
53541G94830K567L249M393M270L046K019J730J643J246N47k76r17q60q3L45n34
53525H17215j900j960o96k47j966m414n390m706l712l039k443k238l139m724n561
53510G71080m999l734k481j220J51J319J948J928J314O56R49K324L364K816J505
53495G76920J220K145K931K959K819K727K299J936K572L848M409M167M340M992
53481H20284M769L647L612N613Q040R430J0503J2146J3457J3583J3704J5159J7098
53468I51045J7992J8168J8839J9703J9711J9272J9587K0447K0863K1320K3280
53457A170227K6593K9370L0484L0672L1241L3029L6227L9765M1354L9994L7876
$$ plain form
53555 714875 719541 724266 728450 732016 735965 741591 748909 756452 763075 769392 776642 784471 790917 794830
53541 794830 797397 800646 805039 809309 812355 814374 816104 817747 818993 819540 819264 818347 817487 817404 817749 817215
53525 817215 815315 813355 812659 812412 810446 806032 800642 795936 792224 789185 786742 784504 781365 776641 771080
53510 771080 766081 762347 759866 758646 758797 760116 762064 763992 765306 765962 766911 769235 772599 775415 776920
53495 776920 778140 780285 783216 786175 788994 791721 794020 795956 798528 802376 806785 810952 815292 820284
53481 820284 825053 828700 832312 837925 845965 855395 865898 878044 891501 905084 918788 933947 951045
53468 951045 969037 987205 1006044 1025747 1045458 1064730 1084317 1104764 1125627 1146947 1170227
53457 1170227 1196820 1226190 1256674 1287346 1318587 1351616 1387843 1427608 1468962 1508956 1546832
53446A546832L7970L9951M0774L9205L7335L7039L7301L6288L4327L3231L3729
53435A953982L4865L5514L5419L4879L4085L2878L1143K9456K8797K9209K9375
53424B309602K8401K7298K7532K8657K8901K7836K6655K5773K4050K0873J7424
53413B593002J4967J3104J0658P304L687O00j453k666m322p787j2684j6930j9106
53400B578374j9840k0495k1567k2922k4516k6033k6769k6785k7246k8770l0202
53389B303229l0058k8570k7164k6397k5607k4384k3248k2665k2218k1030j8655
53378B033233j5542j2756j1048r831p487l221J663M983O026O076O654P950R273
53365B015973J0536J2596J6110K0356K3720K5388K6183K7426K9403L1510L3589
$$ plain form
53446 1546832 1584802 1624753 1665527 1704732 1742067 1779106 1816407 1852695 1887022 1920253 1953982
53435 1953982 1988847 2024361 2059780 2094659 2128744 2161622 2192765 2222221 2251018 2280227 2309602
53424 2309602 2338003 2365301 2392833 2421490 2450391 2478227 2504882 2530655 2554705 2575578 2593002
53413 2593002 2607969 2621073 2631731 2639035 2642722 2643322 2641869 2639203 2634881 2627094 2614410 2597480 2578374
53400 2578374 2558534 2538039 2516472 2493550 2469034 2443001 2416232 2389447 2362201 2333431 2303229
53389 2303229 2273171 2244601 2217437 2191040 2165433 2141049 2117801 2095136 2072918 2051888 2033233
53378 2033233 2017691 2004935 1993887 1984056 1976569 1973348 1975011 1979994 1986020 1992096 1998750 2006700 2015973
53365 2015973 2026509 2039105 2055215 2075571 2099291 2124679 2150862 2178288 2207691 2239201 2272790
53354B272790L6134L9084M1589M3347M5332M8388N1816N4264N5564N6711N8323
53343B803342O0131O1960O4095O6493O8528P0059P2049P5435P9769Q3479Q5331
53332C590671Q5249Q4086Q3067Q3129Q4177Q4970Q4284Q2153P9518P6817P3705
53321D491826P0063O6399O2818N8497N2868M6581M0502L4301K7033J8792J0779
53310D980459L770k525q627j4796k1471k9278l8233m7616n6706o4962p1487p5379
53298D553149p7022p8047p9607q1394q2677q3344q3482q2877q1459p9424p6557
53287C667259p2450o7985o5262o5206o6258o6402o5448o4281o2939o0910n8450
53276B951668n6115n3546n0192m6705m4066m1766l8421l4052l0126k7409k5273
$$ plain form
53354 2272790 2308924 2348008 2389597 2432944 2478276 2526664 2578480 2632744 2688308 2745019 2803342
53343 2803342 2863473 2925433 2989528 3056021 3124549 3194608 3266657 3342092 3421861 3505340 3590671
53332 3590671 3675920 3760006 3843073 3926202 4010379 4095349 4179633 4261786 4341304 4418121 4491826
53321 4491826 4561889 4628288 4691106 4749603 4802471 4849052 4889554 4923855 4950888 4969680 4980459
53310 4980459 4984229 4981704 4973077 4958281 4936810 4907532 4869299 4821683 4764977 4700015 4628528 4553149
53298 4553149 4476127 4398080 4318473 4237079 4154402 4071058 3987576 3904699 3823240 3743816 3667259
53287 3667259 3594809 3526824 3461562 3396356 3330098 3263696 3198248 3133967 3071028 3010118 2951668
53276 2951668 2895553 2842007 2791815 2745110 2701044 2659278 2620857 2586805 2556679 2529270 2503997
53265B503997k3305k2124k2252k3292k4532k5297k4783k2660j9960j8111j7053
53254B260628j5576j3557j2223j1859j0875p957l792J23L169N239N914N323N029
53241B209586O748J0487J4841J8839K2509K5848K8204K9082K9080K9607L1475
53230B456306L3830L4752L3348L1037L0128L1201L2496L1973K9320K5776K2592
53219B792759J9995J7271J3706R530N723K617p49n318j0585j5338j9256k2646
53207B787709k5193k6612k8151l1598l6554m0588m2495m3599m5125m6260m5996
53196B375538m5175m5134m5614m5646m5543m6242m7378m7628m6629m5075m3249
53185A872225m0969l8890l8263l9076l9713l8881l7055l5637l5338l5620l5330
$$ plain form
53265 2503997 2480692 2458568 2436316 2413024 2388492 2363195 2338412 2315752 2295792 2277681 2260628
53254 2260628 2245052 2231495 2219272 2207413 2196538 2188581 2184789 2184912 2188081 2193320 2199234 2204557 2209586
53241 2209586 2216334 2226821 2241662 2260501 2283010 2308858 2337062 2366144 2395224 2424831 2456306
53230 2456306 2490136 2524888 2558236 2589273 2619401 2650602 2683098 2715071 2744391 2770167 2792759
53219 2792759 2812754 2830025 2843731 2853261 2858984 2861601 2860852 2855534 2844949 2829611 2810355 2787709
53207 2787709 2762516 2735904 2707753 2676155 2639601 2599013 2556518 2512919 2467794 2421534 2375538
53196 2375538 2330363 2285229 2239615 2193969 2148426 2102184 2054806 2007178 1960549 1915474 1872225
53185 1872225 1831256 1792366 1754103 1715027 1675314 1636433 1599378 1563741 1528403 1492783 1457453
53174A457453l3705l1203k9174k8295k7567k5557k2337j9352j7537j6541j5898
53163A190287j5849j6620j7785j8861j9830k0516k0306j9278j8926k0491k2773
53152I79052k3025k0411j7386j6766j8294j9300j8183j5816j3625j1971j0973
53141G93302j1370j3288j5210j5518j4522j3703j3483j3151j2585j2421j2513
53130F45538j1826j0186q718q114p775p182o772o762o335m929l353k748l175m031
53116E53632m993n830o066n633n142m730l616j567R2J24q41j352j232j411k223
53101E09212l168l926m275l405q78J893K650R63j379k703k941k615j799p51l28
53086D86550r27j749j815j232q10q84j043p41K24J495K220J751M85l83k10N19
$$ plain form
53174 1457453 1423748 1392545 1363371 1335076 1307509 1281952 1259615 1240263 1222726 1206185 1190287
53163 1190287 1174438 1157818 1140033 1121172 1101342 1080826 1060520 1041242 1022316 1001825 979052
53152 979052 956027 935616 918230 901464 883170 863870 845687 829871 816246 804275 793302
53141 793302 781932 768644 753434 737916 723394 709691 696208 683057 670472 658051 645538
53130 645538 633712 623526 614808 606694 598919 591737 584965 578203 571868 566939 563586 560838 557663 553632
53116 553632 548639 542809 536743 531110 525968 521238 517622 516055 516147 516271 515430 514078 512846 511435 509212
53101 509212 506044 502118 497843 494438 493560 495453 498103 499066 497687 494984 492043 489428 487629 486878 486550
53086 486550 485623 483874 482059 480827 480017 479133 478090 477349 477573 479068 481288 483039 483524 483141 482931 483450
53070D83450J150J821K924M041M057K370k55k107j830M65L286N146N802N939N921
53055E22180N520M787M216L763K618N52j212j403m32J31l94j278j915k767m397
53040E29969o291p265o695m961k981j673j569k494l691m458m516l730k106l46
53026D77193K50p84k170k275j149k27j68j77L09N13l96j781k262j477l44J28l70
53009D64813j558k754l139k380j034l2J33m15j119j181k04J094J406N16l33k24
52993D53589K69L81N29J213J638R11j49j26N38J67j211j610j48J537J650N04m37
52976D59245n39j63K49M03J79k6L47J092J391J156J108J387J278O53L94Q34J105
52959D70093P01L87P55J167J043R67J415J552N24r42j509j101o13m45l59k92k18
$$ plain form
53070 483450 484600 486421 489345 493386 497443 499813 499558 497451 495621 496086 499372 504518 510320 516259 522180
53055 522180 527700 532487 536703 540466 543084 543636 542424 541021 540589 540720 540326 539048 537133 534366 529969
53040 529969 523678 516413 509718 504757 501776 500103 498534 496040 492349 487891 483375 479645 477539 477193
53026 477193 477443 476659 474489 472214 471065 470838 470670 470493 470802 471315 470919 469138 466876 465399 465055 465183 464813
53009 464813 463255 460501 457362 454982 453948 453916 454049 453634 452515 451334 451130 452224 453630 454146 453813 453589
52993 453589 453858 454239 454768 455981 457619 458530 458381 458255 458793 458960 457749 456139 455991 457528 459178 459682 459245
52976 459245 458706 458543 458792 459195 459374 459348 459695 460787 462178 463334 464442 465829 467107 467760 468154 468988 470093
52959 470093 470794 471181 471936 473103 474146 475113 476528 478080 478604 477662 476153 475052 474439 473994 473635 473343 473125
52942D73125K28J076J559J246Q88J229J731J629J451K168L455M115L821L137K290
52927E03148J230N28Q52J742K175K142K347K597J893J27j563k333k368k030j340
52912E09147n09L3L69R89J845K292K102J769J774K151K706L020K442R54l30m13
52896E30341J19m5r66j571j645k070l074l552k756j503j043j584k385k685k150
52881E03431j042j90k30p58q98n69l67k67M08J517J751K89k010l581l678k539
52865D91267o82J371L053L792L140J158j103k018j114J29N5j005j488r92m90m60
52849D94613m92o95j602k472j664O51K157J672Q22J185J596K15k162l008j558
52834D89258N41J690J740J127K99L4Q82K160K643K324K194K354J728l0j701k148
$$ plain form
52942 473125 473353 474429 475988 477234 478122 479351 481082 482711 484162 486330 489785 493900 497721 500858 503148
52927 503148 504378 504906 505758 507500 509675 511817 514164 516761 518654 518781 517218 514885 512517 510487 509147
52912 509147 508638 508671 509040 510029 511874 514166 516268 518037 519811 521962 524668 527688 530130 531084 530754 530341
52896 530341 530460 530415 529449 527878 526233 524163 521089 517537 514781 513278 512235 510651 508266 505581 503431
52881 503431 502389 502199 501969 501211 500313 499744 499377 499110 499518 501035 502786 503075 501065 497484 493806 491267
52865 491267 490585 491956 495009 498801 501941 503099 501996 499978 498864 498993 499048 498043 496555 495563 495073 494613
52849 494613 494121 493426 491824 489352 487688 488339 490496 492168 492990 494175 495771 495986 493824 490816 489258
52834 489258 489799 491489 493229 494356 494655 494689 495571 497731 500374 502698 504892 507246 508974 508944 507243 505095
52818E05095j616q15J83J308J778J130M54J377L870N977N931L878J369k90r14
52803E28715j055j181j237r11k77j13j274l629n808o333n085l533l333m720o358
52788D83868o777n803m412l362k456j240j1M27j51j081j667j833j719j130J28
52773D52781J666K792L228L253L230L352L578L439K272J86j551j874j414j707
52759D73231k981l797l023j182N44J632K098J933J367J046J269J558J379P44k40
52744D75578j665l131l610k687j316o30n87m24J58Q63J336J218L44p06j060r81
52728D62700j663k961k895n48K061K577J452N94J46r03j813p58J679K647J239
52713D63554p6O88K128J854r9j940k843l147k803j474J48O70l01j664k058j002
$$ plain form
52818 505095 503479 502664 502847 504155 505933 507063 507517 508894 512764 518741 524672 528550 529919 529629 528715
52803 528715 527660 526479 525242 524331 524054 523941 522667 519038 513230 506897 501812 498279 494946 490226 483868
52788 483868 477091 471288 466876 463514 461058 459818 459807 460234 460083 459002 457335 455502 453783 452653 452781
52773 452781 454447 457239 460467 463720 466950 470302 473880 477319 479591 479777 478226 476352 474938 473231
52759 473231 470250 466453 463430 462248 462792 464424 466522 468455 469822 470868 472137 473695 475074 475818 475578
52744 475578 473913 470782 467172 464485 463169 462539 461952 461528 461686 462549 463885 465103 465447 464741 463681 462700
52728 462700 461037 458076 455181 454633 456694 459271 460723 461317 461463 460560 458747 457989 459668 462315 463554
52713 463554 463478 464166 466294 468148 468049 466109 463266 460119 457316 455842 455990 456660 456359 454695 452637 451635
52697D51635J075L263M655M848M122L039K020J366J284J737K510L392M063M029
52683D93038L106J829Q95M21K70O36J494J946J243J39O8J115K085K352K220J557
52667E14414j81k290l043k137j222j247j006N28K108J988O08k56k37o10k019l462
52651E01936l651k365m23J034J295P02L56P37J015L00q64j077K2J211J125k57
52635E01096j660j869q90J97N34K77j59r86k312l060j953L96J799J311L09K59
52619D93289P29N34l10q92q63m83J70J059J690J674J414J531J943K092J741J025
52603E06343J00p96j353j598j711j321K00K351L554L203K637L191M288M461L401
52588E26950J898M27j008k080k452k576l128l780l469j871J48J549K013J881J563
$$ plain form
52697 451635 452710 455973 460628 465476 469598 472637 474657 476023 477307 479044 481554 484946 489009 493038
52683 493038 496144 497973 498868 499289 499559 500195 501689 503635 504878 505017 505085 506200 508285 510637 512857 514414
52667 514414 514233 511943 508900 506763 505541 504294 503288 503816 505924 507912 508520 508264 508027 507417 505398 501936
52651 501936 498285 495920 495497 496531 497826 498528 498884 499621 500636 500936 500072 498995 499017 500228 501353 501096
52635 501096 499436 497567 496677 496874 497408 497685 497526 496540 494228 491168 489215 489611 491410 492721 493030 493289
52619 493289 494018 494552 494242 493350 492487 492004 492174 493233 494923 496597 498011 499542 501485 503577 505318 506343
52603 506343 506443 505647 504294 502696 500985 499664 499864 502215 505769 508972 511609 514800 519088 523549 526950
52588 526950 528848 529275 528267 526187 523735 521159 518031 514251 510782 508911 509059 510608 512621 514502 516065
52573E16065J014j38j668k121j41L382N653M996K587O63N1J25R5n69k031l612
52557E24351m172l621k971k458j102R95J822L32j532j554m74l46q98k02J763K955
52541E12888K594K088K291K147P81r01j557r92J68J273J670J016j39r27j282j522
52525E19596j205J87J642J518J13m51P78K359K698J831M26j269k709k806j494
52510E21214l35n23j398j673j143l29M86Q84M7j989l602l259j376M21J271J360
52494E10056Q95Ln65J03J774K998K543N49j763l104k918j651k68O52J287J962
52478E12553K456K245J253J29l59j15J61j45n99j08J491K782K394Q40r0M40J594
52461E26922K352K647K796K612J714L21o83m57R64K451K747J971J590K461L608
$$ plain form
52573 516065 517079 516941 515273 513152 513011 516393 522046 527042 529629 530292 530343 530468 530563 529994 527963 524351
52557 524351 520179 516558 513587 511129 510027 511022 512844 513176 511644 510090 509616 509270 508372 508170 509933 512888
52541 512888 515482 517570 519861 522008 522789 521888 520331 519339 519507 520780 522450 523466 523327 522400 521118 519596
52525 519596 518391 518578 520220 521738 521851 521400 522178 524537 527235 529066 529492 528223 525514 522708 521214
52510 521214 520879 520356 518958 517285 516142 515813 516299 517183 517230 515241 511639 508380 507004 507425 508696 510056
52494 510056 510951 510954 510389 510492 512266 515264 517807 518356 516593 513489 510571 508920 508652 509304 510591 512553
52478 512553 515009 517254 518507 518636 518277 518162 518323 518178 517579 517471 518962 521744 524138 524978 524888 525328 526922
52461 526922 529274 531921 534717 537329 539043 539364 538681 538224 539188 541639 544386 546357 547947 550408 554016
52446E54016L725L008K316J345p70l406m941n188n447o036n757m309l077k791
52432E22688k354j105k88p72j109K64K315K940K173J745K096K158J748J942K832
52417E37273L004J782L40j94k23m70n43J69J119J231N61L24J453L670N873P011
52401E62380O688N288L491J566n54k433l052k012m27J42n65j497k026k722m066
52386E60201n136m538k400m88j14p18j024q76j106j958k654k627k243j945j423
52371E30951k19J353K529L009K938K262R15n31j172q96n04l81J50J560K981L251
52355E48196K797L280N218P070P236O035M967M701M898N534P024Q996J0054R313
52341F35319P275M826K222l98k321k960k806k858l439m170m773n199n093m013
$$ plain form
52446 554016 557741 560749 563065 564410 563640 560234 555293 550105 544658 538622 532865 528556 525479 522688
52432 522688 520334 519229 518941 518169 517060 517324 519639 522579 524752 526497 528593 530751 532499 534441 537273
52417 537273 540277 542059 542399 542205 541982 541512 540969 541138 542257 543488 544049 544373 545826 549496 555369 562380
52401 562380 569068 574356 577847 579413 578859 576426 573374 571362 570935 571077 570512 569015 566989 564267 560201
52386 560201 555065 550527 548127 547639 547525 546807 545783 544907 543801 541843 539189 536562 534319 532374 530951
52371 530951 530732 532085 534614 537623 540561 542823 543738 543207 542035 541139 540635 540254 540404 541964 544945 548196
52355 548196 550993 554273 559491 566561 573797 579832 584799 589500 594398 599932 606956 615952 626006 635319
52341 635319 642594 647420 649642 649244 646923 643963 641157 638299 634860 630690 625917 620718 615625 611612
52327F11612k268r27p72j471j962j406J89K138L758M777N151M740L662K738K941
52312F32900M260N678O335O141N341M377M171N397P147P438N573L023J411Q77
52298G00069R70J713K730K701J093n67o11N75J646K560L996N321N272M278M141
52283G35887N406O761P130O811O463O429P073Q447R629R795R804J1226J3892J5997
52269H60750J6655J6692J6883J7161J7810J9712K2880K6099K8270K9000K8088
52258A100000K6039K4760K5761K7741K8143K7039K6939K8604K9949K9777K9498
52247A404250K9893K9295K6879K5005K5831K7776K7993K6496K5146K3948K1356
52236A693868J7542J4520J3194J2440J1066Q882O069L099J028K22p51l391o768
$$ plain form
52327 611612 609344 608417 607645 606174 604212 602806 602995 605133 608891 613668 618819 623559 627221 629959 632900
52312 632900 637160 642838 649173 655314 660655 665032 669203 674600 681747 689185 694758 697781 699192 700069
52298 700069 701039 702752 705482 708183 709276 708709 708098 708673 710319 712879 716875 722196 727468 731746 735887
52283 735887 741293 748054 755184 761995 768458 774887 781960 790407 800036 809831 819635 830861 844753 860750
52269 860750 877405 894097 910980 928141 945951 965663 988543 1014642 1042912 1071912 1100000
52258 1100000 1126039 1150799 1176560 1204301 1232444 1259483 1286422 1315026 1344975 1374752 1404250
52247 1404250 1434143 1463438 1490317 1515322 1541153 1568929 1596922 1623418 1648564 1672512 1693868
52236 1693868 1711410 1725930 1739124 1751564 1762630 1771512 1777581 1780680 1781708 1781930 1781179 1777788 1771020
52223A771020q471p739n978m470l351k681k666k617j315J254L775N412O559P699
52209A756431Q821J0011J1438J2666J3134J3289J4118J5664J7278J9116K1736
52198A913702K4154K4225K1603J8711J7800J8331J8366J7407J6458J5844J4504
52187B121105J1687Q297N856M455K447j463o306r773j1015j1513j2707j3923j3721
52174B073426j2417j1865j2904j4513j5580j6191j6775j7081j6657j5705j4766
52163A908972j3955j2940j1459r580p522n448l410j612n58n98j201j177Q7K053
52149A841652L878N248O051O017N323M830N034N405N460N718O678P598P511O826
52135A923229O755P487Q206Q563Q859Q942Q201O628M739K517l65l285m924n057
$$ plain form
52223 1771020 1762549 1754810 1748832 1744362 1741011 1738330 1735664 1733047 1731732 1732986 1736761 1742173 1748732 1756431
52209 1756431 1765252 1775263 1786701 1799367 1812501 1825790 1839908 1855572 1872850 1891966 1913702
52198 1913702 1937856 1962081 1983684 2002395 2020195 2038526 2056892 2074299 2090757 2106601 2121105
52187 2121105 2132792 2141089 2146945 2151400 2153847 2152384 2146078 2136305 2125290 2113777 2101070 2087147 2073426
52174 2073426 2061009 2049144 2036240 2021727 2006147 1989956 1973181 1956100 1939443 1923738 1908972
52163 1908972 1895017 1882077 1870618 1861038 1853516 1848068 1844658 1843046 1842488 1841890 1840689 1839512 1839599 1841652
52149 1841652 1845530 1850778 1856829 1862846 1868169 1872999 1878033 1883438 1888898 1894616 1901294 1908892 1916403 1923229
52135 1923229 1929984 1937471 1945677 1954240 1963099 1972041 1980242 1986870 1991609 1994126 1993761 1990476 1985552 1980495
52121A980495n001o019q134j0568j2334j2345j0235p395o079o908q057p442m919
52108A875059k009j27L83R3n3N48J726K877L619L783L206K132J522K078L145L412
52092A901394K583J419L63p70j718j639l56J236K332K954L347L511L579L862M260
52077A926357M402M436M882N661O261O938Q555J0992J3029J4365J6442K0331K4781
52064B067432K7524K8071K8213K9788L2647L4985L5381L4402L3971L5085L6609
52053B424108L6806L5475L3677L1821K9399K6586K4626K4027K3520K1538J8076
52042B729659J4556J2361J1788J1839J0907Q268M953K368J53l470r075j4943j9030
52029B760334k0930k1503k1650k2098k3298k4833k5548k4798k2905k0229j6815
$$ plain form
52121 1980495 1975494 1969475 1961341 1950773 1938439 1926094 1915859 1908464 1902385 1895477 1887420 1879978 1875059
52108 1875059 1873050 1872923 1873306 1873399 1873346 1873894 1875620 1878497 1882116 1885899 1889105 1891237 1892759 1894837 1897982 1901394
52092 1901394 1903977 1905396 1905759 1904989 1903271 1901632 1901276 1902512 1904844 1907798 1911145 1914656 1918235 1922097 1926357
52077 1926357 1930759 1935195 1940077 1945738 1951999 1958937 1967492 1978484 1991513 2005878 2022320 2042651 2067432
52064 2067432 2094956 2123027 2151240 2181028 2213675 2248660 2284041 2318443 2352414 2387499 2424108
52053 2424108 2460914 2496389 2530066 2561887 2591286 2617872 2642498 2666525 2690045 2711583 2729659
52042 2729659 2744215 2756576 2768364 2780203 2791110 2799378 2804331 2806699 2806852 2803382 2794307 2779364 2760334
52029 2760334 2739404 2717901 2696251 2674153 2650855 2626022 2600474 2575676 2552771 2532542 2515727
52018B515727j3290j0888r864q977p242n104l181r59K216N810Q779J0913J2588
52005B496528J3916J5022J6407J8144J9365J9445J8954J8614J8220J7538J7240
51994B689393J7653J7418J4974J0824O876L861Q87k701o556j0449j4589j8563
51982B709028k1285k2521k3415k5022k6980k8175k8099k7184k6221k5719k5612
51971B428795k5495k5282k5329k5648k5616k5001k4717k5531k6539k6104k4178
51960B149355k2442k1950k1981k1486k0615k0064j9793j9219j8212j7277j7010
51949A929306j7771j9569k1908k4021k5514k6534k7185k7315k7067k7105k7747
51938A657570k8267k7616k5667k3282k1276j9841j9033j9137k0262k1899k3356
$$ plain form
52018 2515727 2502437 2491549 2481685 2472708 2465466 2460362 2457181 2456222 2458438 2464248 2473027 2483940 2496528
52005 2496528 2510444 2525466 2541873 2560017 2579382 2598827 2617781 2636395 2654615 2672153 2689393
51994 2689393 2707046 2724464 2739438 2750262 2757138 2760999 2761886 2759185 2752629 2742180 2727591 2709028
51982 2709028 2687743 2665222 2641807 2616785 2589805 2561630 2533531 2506347 2480126 2454407 2428795
51971 2428795 2403300 2378018 2352689 2327041 2301425 2276424 2251707 2226176 2199637 2173533 2149355
51960 2149355 2126913 2104963 2082982 2061496 2040881 2020817 2001024 1981805 1963593 1946316 1929306
51949 1929306 1911535 1891966 1870058 1846037 1820523 1793989 1766804 1739489 1712422 1685317 1657570
51938 1657570 1629303 1601687 1576020 1552738 1531462 1511621 1492588 1473451 1453189 1431290 1407934
51927A407934k4437k5268k5545k4664k2838k1415k1367k1933k1616k0349j9554
51916A158948j9876k0014j8520j5799j3379j1735r919p135l626nL377O142P758
51903A056217Q123P871P682P546O974N823M690M432N200N978N447L628K285L227
51889A135123O344R949J2934J5777J9279K3049K5978K7703K8678K8668K6040J9378
51877A378900R673J40o462r946j1907j3567j5136j6781j8816k0719k1239k0236
51865A233904j9497k0731k3417k5637k6553k6744k6431k4890k2026j9205j7713
51854I81060j7120j6080j4243j2485j1426j0583r161p044m746k695r24O56J998
51841H77207K932L348L232K503R16j735n145q356j0405j1185j1443j1625j1069
$$ plain form
51927 1407934 1383497 1358229 1332684 1308020 1285182 1263767 1242400 1220467 1198851 1178502 1158948
51916 1158948 1139072 1119058 1100538 1084739 1071360 1059625 1049706 1042571 1038945 1038940 1042317 1048459 1056217
51903 1056217 1064340 1072211 1079893 1087439 1094413 1100236 1104926 1109358 1114558 1120536 1125983 1129611 1131896 1135123
51889 1135123 1141467 1151416 1164350 1180127 1199406 1222455 1248433 1276136 1304814 1333482 1359522 1378900
51877 1378900 1388573 1388713 1382251 1372305 1360398 1346831 1331695 1314914 1296098 1275379 1254140 1233904
51865 1233904 1214407 1193676 1170259 1144622 1118069 1091325 1064894 1040004 1017978 998773 981060
51854 981060 963940 947860 933617 921132 909706 899123 889962 882918 878172 875477 874553 875209 877207
51841 877207 880139 883487 886719 889222 890138 888403 883258 874902 864497 853312 841869 830244 819175
51828H19175q868n438k461r68j27J349L206M000L333K667L464N321O639O762O674
51813H44728P493Q757Q649O060K196l81m80M24J29j617l216l661l645l963m089
51798H57384l092j177O15J803K697L383L185J324k125n869q127q146p098o873
51784H27884p843q640q362p935q437r080q219n849l696k923k952k775k260j681
51770G47232r62k3O77O27K4l54J46J569L258M074L231J232m07p79n48q37j485
51753G56675j288O7J115L90j467k212o99J707K808K059P59J85L56O63P88P44N06
51736G63156l5r73k303l576l787k324r4J076M79q23j577j630j222j07J537K315
51720G50112J098j030j677N9K716M425M587L566K063J291K490N291P384O918M900
$$ plain form
51828 819175 810307 804869 802408 801440 801313 802662 805868 809868 813201 815868 819332 824653 831292 838054 844728
51813 844728 852221 860978 869627 875687 877883 877502 877022 877446 877575 875958 872742 869081 865436 861473 857384
51798 857384 854292 853115 853730 855533 858230 861613 864798 866122 863997 858128 850001 841855 834757 827884
51784 827884 820041 811401 803039 795104 786667 777587 769368 763519 759823 756900 753948 751173 748913 747232
51770 747232 746270 746247 746924 747551 747575 747221 747367 748936 752194 756268 759499 760731 760324 759545 758997 758160 756675
51753 756675 755387 755454 756569 756959 755492 753280 752581 754288 757096 759155 759914 760099 760455 761118 761906 762650 763156
51736 763156 763121 762148 759845 756269 752482 750158 750064 751140 751619 750796 749219 747589 746367 746260 747797 750112
51720 750112 751210 750180 748503 748562 751278 755703 760290 763856 765919 767210 769700 774991 782375 789293 794193
51705G94193M128N765P988Q289O224L327R24j023l000m858o159p134q517j0533
51691G89614j2440j3127j1948r080n525k657j211o42R3J146J726J504J306J987
51677G40746L247M166M651N612P626R802J0345Q326M893K394K130L260M265M792
51663H16255N241N165L502M56k289l635m117m423m183l121k064j808j873j650
51649H01456j813l251n180n783m502k436o62P05J731K117J599L62j067j875j491
51634G79910n02m64j879l196k869j669j484k414k853k202j576j611j348J0J735
51619G57588K664K584J847O93l70n25K78R55O78L1J97J603L804O086P836Q839
51603G94788R485J0115J0143Q684O024L370J018j828n043o939o462m581k470J95
$$ plain form
51705 794193 798321 804086 812074 820363 826587 829914 830838 829815 826815 821957 815798 808664 800147 789614
51691 789614 777174 764047 752099 743019 737494 734837 733626 732984 733077 734223 735949 737453 738759 740746
51677 740746 743993 748159 752810 758422 766048 775850 786195 794521 799414 801808 803938 807198 811463 816255
51663 816255 821496 826661 830163 830619 828330 824695 820578 816155 811972 808851 806787 804979 803106 801456
51649 801456 799643 796392 791212 785429 780927 778491 777829 778534 780265 782382 783981 784343 783276 781401 779910
51634 779910 779408 778944 777065 773869 771000 769331 767847 765433 762580 760378 758802 757191 755843 755853 757588
51619 757588 760252 762836 764683 765376 765006 764481 764759 765714 766392 766423 766620 768223 772027 778113 785949 794788
51603 794788 804273 814388 824531 833215 839239 842609 843627 841799 836756 829817 823355 818774 816304 816499
51589H16499L750O634O962N239L559K398K92l208o392p899q706j0370j2487j3315
51575G82956j2321j0827j0110r928r199p491n354l590k553k094j884j766j822
51562G04017k172k568k373j173N37J506R12p51k108k221j292k19K17j57q56j105
51546F90194n72K18M53J20J57J432L824O513Q925J1100J3243J5171J6260J5898
51532G82936J3994J1071P817M605J486j408l639m632m112k452n16J070K503M365
51518H13088O646Q745J0454J2216J4012J4882J4225J3053J2908J3916J4834J4790
51506I63769J3998J2912J1748J1053J1675J3851J7045K0858K5235K9563L2566
51495A164273L3649L3505L2804L1003K7162K1435J5038R091M121K54k865o215
$$ plain form
51589 816499 820249 826883 833845 839084 842643 845041 845333 842125 835733 827834 819128 808758 796271 782956
51575 782956 770635 759808 749698 739770 730571 723080 717726 714136 711583 709489 707605 705839 704017
51562 704017 701845 699277 696904 695731 696268 697774 698686 697935 695827 693606 692314 692095 692312 692155 691299 690194
51546 690194 689622 689840 690293 690413 690570 692002 695826 702339 711264 722364 735607 750778 767038 782936
51532 782936 796930 808001 815818 820423 821909 820501 816862 812230 808118 805666 805150 806220 808723 813088
51518 813088 819734 828479 838933 851149 865161 880043 894268 907321 920229 934145 948979 963769
51506 963769 977767 990679 1002427 1013480 1025155 1039006 1056051 1076909 1102144 1131707 1164273
51495 1164273 1197922 1231427 1264231 1295234 1322396 1343831 1358869 1367960 1372081 1372335 1369470 1363255
51483A363255j0779j6570k2640k7957l2058l4855l6271l6220l4941l3108l1547
51472A046309l0588k9727k8075k5150k1250j7202j3977j2247j1979j2438j2753
51461H30923j2458j1438r865q352p607p435o740n104l723l809m692m654l237j564
51447G40245n91l47o68j304j361j51J339J463N84Q72K898M400L461J184j49j52
51431G51723l7l67q20j397k300l046l057k791l133m020m691m865m622l745k379
51416G10453j756k960n260o931p361p122o422n001l292k142j419l98N52L08p91
51401F60458r40M04J430O62p80p05J305L839N730O891P440P208O327N541N639
51386G10449O868Q897J1204J3355J5051J5894J5403J3438J0448P000L391Q8k033
$$ plain form
51483 1363255 1352476 1335906 1313266 1285309 1253251 1218396 1182125 1145905 1110964 1077856 1046309
51472 1046309 1015721 985994 957919 932769 911519 894317 880340 868093 856114 843676 830923
51461 830923 818465 807027 797162 788810 781203 773768 767028 761924 758201 754392 749700 745046 741809 740245
51447 740245 739654 739307 738639 737335 735974 735823 737162 738625 739209 740081 742979 747379 750840 752024 751875 751723
51431 751723 751686 751319 750499 749102 746802 743756 740699 737908 734775 730755 726064 721199 716577 712832 710453
51416 710453 708697 705737 700477 693546 686185 679063 672641 667640 664348 662206 660787 660389 660941 661249 660458
51401 660458 659518 659922 661352 662014 661234 660529 661834 665673 671403 678294 685734 692942 699269 704810 710449
51386 710449 717317 726214 737418 750773 765824 781718 797121 810559 821007 828007 831398 831486 829453
51373H29453k728l306n336q567j1237j2494j3168j3774j3374j1263q614p106o571
51360G11915n312k541N80K295J947L91p83o02M40J115J265K080M047N657N292
51345G27786L661K941L890N381O603P959R471J0084R429Q803R218R697Q919P661
51331H31503P972J0212J2527J3359J3190J3377J4445J6110J8268K1093K4476K7864
51319A024396L0693L2930L5248L8423M2248M5106M5251M2331L7173L0431K2414
51308A426644J4057O652J94o812j5135k3537l0490l6106m1145m5117m6945m6994
51296A155266m6592m5561m2148l6056k9832k6100k4456k2517j9419j6704j5679
51285H30202j5361j3931j1406r766j0258j1633j1632r770p719p014p280p115n995
$$ plain form
51373 829453 826725 823419 818083 809516 798279 785785 772617 758843 745469 734206 725592 718486 711915
51360 711915 706603 704062 704642 706937 708884 709275 708492 707890 708330 709445 710710 712790 716837 722494 727786
51345 727786 731447 734388 738278 743659 750262 758221 767692 777776 787205 796008 805226 814923 823842 831503
51331 831503 839475 849687 862214 875573 888763 902140 916585 932695 950963 972056 996532 1024396
51319 1024396 1055089 1088019 1123267 1161690 1203938 1249044 1294295 1336626 1373799 1404230 1426644
51308 1426644 1440701 1447353 1447547 1440735 1425600 1402063 1371573 1335467 1294322 1249205 1202260 1155266
51296 1155266 1108674 1063113 1020965 984909 955077 928977 904521 882004 862585 845881 830202
51285 830202 814841 800910 789504 779738 769480 757847 746215 736445 728726 721712 714432 707317 701322
51272G01322m673m146m756o009o812o304m897l915l838l637k460j070n71n76m4
51257F47614P50P36J55K80J171J618J594K646N098O778N793L021O87l21m15J00
51241F77305R02J050P4r62q85k68m77j450k040k061k229k247r11J599L342L246
51225F73988K632L137M391M972M771N003O073O693N480K744K60m27O75K122K336
51210G24850J000n91p76P40K541L176K895L070L922L818J486j897l924l897l313
51195G33100l464l971m044l921m154m410l965k891j903j353j126j208j663k205
51181F92822k451k433k427k444k332k148k055j990j749j192k47Q43J222Q2j939
51166F71562k840j395J331L237L492K809K049J485J283J707K581L181K905J902
$$ plain form
51272 701322 696649 692503 687747 681738 674926 668622 663725 659810 655972 652335 649875 648805 648234 647658 647614
51257 647614 648364 649100 649255 649535 650706 652324 653918 656564 661662 668440 674233 677254 677941 677620 677205 677305
51241 677305 678207 679257 679331 678369 677484 677216 676739 675289 673249 671188 668959 666712 665801 667400 670742 673988
51225 673988 676620 679757 684148 689120 693891 698894 704967 711660 717140 719884 720144 719717 720392 722514 724850
51210 724850 725850 725259 724483 725223 727764 730940 733835 736905 740827 744645 746131 744234 740310 736413 733100
51195 733100 729636 725665 721621 717700 713546 709136 705171 702280 700377 699024 697898 696690 695027 692822
51181 692822 690371 687938 685511 683067 680735 678587 676532 674542 672793 671601 671354 672197 673419 673501 671562
51166 671562 668722 667327 668658 671895 675387 678196 680245 681730 683013 684720 687301 690482 693387 695289
51152F95289R41P82J545K680L673M525N249N319M425L395L235L383K451P30J90
51137G37812J364K184R53j139j985j561j229j227p67L3K41k69q39j351k000k227
51121G27993j451n58r55k403l313l091k605k496k540k594k648k069m31J092Q68
51106G02799n48q66O82K391K841K666K923L387L428L179K892K355J734J894K946
51091G34703L576K622N93j074j510p47O08J483J043l30j512k237l118m008l755
51076G26337k188q68j105k343l229l187k249m73J617K997L345L364L447L222K869
51061G31556L363M512M483K548P78J295L094L489J944M37M00J229J921K519L446
51046G67014M509M999M343K668J135J265L166M898M603K845J761K133K683K223
$$ plain form
51152 695289 696230 697012 698557 701237 704910 709435 714684 720003 724428 727823 731058 734441 736892 737622 737812
51137 737812 739176 741360 742313 741174 739189 737628 736399 735172 734405 734438 734679 734410 733571 732220 730220 727993
51121 727993 726542 725984 725029 722626 719313 716222 713617 711121 708581 705987 703339 701270 700839 701931 702799
51106 702799 702251 701385 702067 704458 707299 709965 712888 716275 719703 722882 725774 728129 729863 731757 734703
51091 734703 738279 740901 741494 740420 738910 738163 738771 740254 741297 740967 739455 737218 734100 730092 726337
51076 726337 724149 723281 722176 719833 716604 713417 711168 710695 712312 715309 718654 722018 725465 728687 731556
51061 731556 734919 739431 743914 746462 747240 748535 751629 755118 757062 757499 757899 759128 761049 763568 767014
51046 767014 771523 776522 780865 783533 784668 785933 789099 793997 798600 801445 803206 805339 808022 810245
51032H10245J279J051J699K295K013R73J60O81K657M803N417M173K581K361L455
51017H45843M116L105J329P07J650K718L025L660N739Q185R182R087R940J2242
51003I20528J4442J5790J7455K0057K2270K3054K3251K3461K2238J8233J2797
50992A133576Q455N910M435M051M932N403L217j066m217m331k974k863m934q146
50978A141448j0864j1810j0655q292o017m327l093k554l134m510n920p150q187
50965A054935q254o636m233k574j350J200N136Q079Q499P986Q923J1314J3309
50952A096334J3873J3396J2208J0102P426N420N011N727O173N393L843K895L264
50939A191065M083M106L616M179O318Q516R226Q954R422J1189J3170J4413J5365
$$ plain form
51032 810245 811524 812575 814274 816569 818582 819555 819715 820396 823053 827856 833273 837446 840027 842388 845843
51017 845843 849959 853064 854393 855100 856750 859468 862493 866153 871892 880077 889259 898346 908286 920528
51003 920528 934970 950760 968215 988272 1010542 1033596 1056847 1080308 1102546 1120779 1133576
50992 1133576 1142031 1147941 1152376 1156427 1161359 1166762 1169979 1168913 1164696 1160365 1157391 1154528 1149594 1141448
50978 1141448 1130584 1118774 1108119 1099827 1093810 1089483 1086390 1083836 1080702 1076192 1070272 1063122 1054935
50965 1054935 1046681 1040045 1035812 1033238 1031888 1033088 1038224 1046303 1054802 1062788 1071711 1083025 1096334
50952 1096334 1110207 1123603 1135811 1145913 1153339 1158759 1163770 1169497 1175670 1181063 1184906 1187801 1191065
50939 1191065 1195148 1199254 1202870 1207049 1213367 1221883 1231109 1240063 1249485 1260674 1273844 1288257 1303622
50926A303622J7193K0387K4327K7919L0490L2185L3577L4906L5838L6042L5685
50915A632171L5235L5032L5342L6597L9291M3615M9294N5630O1669O6633P0476
50904B160985P3885P7552Q1624Q5893R0154R3937R6257R6252R4110R0750Q6450
50893C127849Q0405P2053O2314N2829M4259L6267K8890K2815J7912J2824P059
50882C565476K394P82J277Q05k163o356j0391j4797k0317k5824k9571l1692l3936
50869C395687l7293m1315m5528n0186n5510o1169o6714p1732p5590p7752p8503
50858B734395p8636p8448p7555p5628p2715o8944o4528n9958n5525n0895m5917
50847B005646m1483l8591l6723l4377l1233k8515k6828k5060k2082j8497j5628
$$ plain form
50926 1303622 1320815 1341202 1365529 1393448 1423938 1456123 1489700 1524606 1560444 1596486 1632171
50915 1632171 1667406 1702438 1737780 1774377 1813668 1857283 1906577 1962207 2023876 2090509 2160985
50904 2160985 2234870 2312422 2394046 2479939 2570093 2664030 2760287 2856539 2950649 3041399 3127849
50893 3127849 3208254 3280307 3342621 3395450 3439709 3475976 3504866 3527681 3545593 3558417 3565476
50882 3565476 3567870 3568652 3569929 3570734 3568571 3562215 3551824 3537027 3516710 3490886 3461315 3429623 3395687
50869 3395687 3358394 3317079 3271551 3221365 3165855 3104686 3037972 2966240 2890650 2812898 2734395
50858 2734395 2655759 2577311 2499756 2424128 2351413 2282469 2217941 2157983 2102458 2051563 2005646
50847 2005646 1964163 1925572 1888849 1854472 1823239 1794724 1767896 1742836 1720754 1702257 1686629
50836A686629j3556j1310q655o500n358m313k180P51K845L228L144M577P671J0436
50822A667409J1330J1228J2050J4185J6379J7863J9251K1247K3598K5808K8042
50811A868390L0777L4058L7441M0389M2548M4080M5813M8547N2096N5578N8683
50800B358400O2058O6433P2012P8792Q6662R5069J03495J12433J22975J34967
50790C293296J46640J56659J65598J74493J82924J89867J95721K01872K08029
50781D915099K11505K09898K03571J94601J83892J70342J52659J31088J07050
50772F479705Q1993N7284L4553J4977j837j7219l1191m1588m6109m4850m0273
50761F445445l5080l0730k7506k5168k3744k4439k9484m0196n5259p1866q8447
$$ plain form
50836 1686629 1673073 1661763 1653108 1646608 1641250 1636937 1634757 1635508 1638353 1641581 1644725 1649302 1656973 1667409
50822 1667409 1678739 1689967 1702017 1716202 1732581 1750444 1769695 1790942 1814540 1840348 1868390
50811 1868390 1899167 1933225 1970666 2011055 2053603 2097683 2143496 2192043 2244139 2299717 2358400
50800 2358400 2420458 2486891 2558903 2637695 2724357 2819426 2922921 3035354 3158329 3293296
50790 3293296 3439936 3596595 3762193 3936686 4119610 4309477 4505198 4707070 4915099
50781 4915099 5126604 5336502 5540073 5734674 5918566 6088908 6241567 6372655 6479705
50772 6479705 6561698 6618982 6653535 6668512 6666675 6649456 6618265 6576677 6530568 6485718 6445445
50761 6445445 6410365 6379635 6352129 6326961 6303217 6278778 6249294 6209098 6153839 6081973 5993526
50750E993526j05250j22350j38563j52869j65605j77219j86607j91878j92396
50741D560789j89268j83886j76742j67720j56929j45022j32923j21289j10076
50732C176934r8718q6819p4692o3174n3033m4600l7787l2285k7810k4195k1248
50721B612573j8804j6972j6078j6089j6412j6472j6216j5733j4925j4093j4161
50710B436618j5507j7045j7597j7787j9332k2439k5255k6141k5245k3526k1521
50699B205223j9578j8018j6317j3270q799m540j580J310N907J1827J7090K0947
50687B180202K4558K8898L3474L7506M1225M5373N0125N5068N9859O4500O9209
50676B689997P4178P9382Q4573Q9655R4770R9763J03842J06373J07692J08415
$$ plain form
50750 5993526 5888276 5765926 5627363 5474494 5308889 5131670 4945063 4753185 4560789
50741 4560789 4371521 4187635 4010893 3843173 3686244 3541222 3408299 3287010 3176934
50732 3176934 3078216 2991397 2916705 2853531 2800498 2755898 2718111 2685826 2658016 2633821 2612573
50721 2612573 2593769 2576797 2560719 2544630 2528218 2511746 2495530 2479797 2464872 2450779 2436618
50710 2436618 2421111 2404066 2386469 2368682 2349350 2326911 2301656 2275515 2250270 2226744 2205223
50699 2205223 2185645 2167627 2151310 2138040 2129241 2124701 2123121 2124431 2130338 2142165 2159255 2180202
50687 2180202 2204760 2233658 2267132 2304638 2345863 2391236 2441361 2496429 2556288 2620788 2689997
50676 2689997 2764175 2843557 2928130 3017785 3112555 3212318 3316160 3422533 3530225 3638640
50666C638640J08114J05787J01757R7900R5192R1847Q5086P4276O1266M7659L3065
50655D540589J6553j209j8174l2643m3812n0950n3302n1233m6543m1154l5842
50644D182280l0551k5244k0029j5091j1189r686j1390j5728k1829k9958m0805
50633C950780n3561o5958p6445q5282r2949r8433j00055r7620r2886q7762q2581
50622C017248p6313o8276n9087m9935m1282l2781k4290j6257q862j590N918J3147
50610B657640J9397K4634K8989L2024L3363L3648L3909L4256L4102L3387L2636
50599B997985L1994L1284L0914L1674L3499L5327L6240L6098L5187L4212L4358
50588C368772L6350L9503M2636M5635M9008N2346N4791N6808N9825O4010O7987
$$ plain form
50666 3638640 3746754 3852541 3954298 4052198 4147390 4239237 4324323 4398599 4459865 4507524 4540589
50655 4540589 4557142 4555933 4537759 4505116 4461304 4410354 4357052 4305819 4259276 4218122 4182280
50644 4182280 4151729 4126485 4106456 4091365 4080176 4070490 4059100 4043372 4021543 3991585 3950780
50633 3950780 3897219 3831261 3754816 3669534 3576585 3478152 3378097 3280477 3187591 3099829 3017248
50622 3017248 2940935 2872659 2813572 2763637 2722355 2689574 2665284 2649027 2640165 2638575 2644493 2657640
50610 2657640 2677037 2701671 2730660 2762684 2796047 2829695 2863604 2897860 2931962 2965349 2997985
50599 2997985 3029979 3061263 3092177 3123851 3157350 3192677 3228917 3265015 3300202 3334414 3368772
50588 3368772 3405122 3444625 3487261 3532896 3581904 3634250 3689041 3745849 3805674 3869684 3937671
50577C937671P0906P2905P3436P1239O6731O2228N8835N5007M9455M3608L9591
50566D601612L7274L4932L1362K5593J5876J365j5585l0564m0580m5352m5950
50555D569983m3675l9853l5343l0242k4778j9845j5873j2113q329o176p545j2252
50543D313959j8815k6695l6161m6736n7627o9116q1576r3473j02331j07626j10815
50532C562988j12592j12123j09227j05223j00975r5833q9279q2189p5635o9526
50522B610386o3183n6362m9257m2314l6253l1394k6804k1171j4602q389k960K555
50510B260252Q416J3499J6945J9287K1327K3224K5359K8691L3322L7749M0534
50499B528605M1849M2628M3251M3995M5685M8715N2115N4690N6531N8364O0101
$$ plain form
50577 3937671 4008577 4081482 4154918 4226157 4292888 4355116 4413951 4468958 4518413 4562021 4601612
50566 4601612 4638886 4673818 4705180 4730773 4746649 4748014 4732429 4701865 4661285 4615933 4569983
50555 4569983 4526308 4486455 4451112 4420870 4396092 4376247 4360374 4348261 4339932 4333756 4326211 4313959
50543 4313959 4295144 4268449 4232288 4185552 4127925 4058809 3977233 3883760 3781429 3673803 3562988
50532 3562988 3450396 3338273 3229046 3123823 3022848 2927015 2837736 2755547 2679912 2610386
50522 2610386 2547203 2490841 2441584 2399270 2363017 2331623 2304819 2283648 2269046 2260657 2257697 2260252
50510 2260252 2268668 2282167 2299112 2318399 2339726 2362950 2388309 2417000 2450322 2488071 2528605
50499 2528605 2570454 2613082 2656333 2700328 2746013 2794728 2846843 2901533 2958064 3016428 3076529
50488C076529O1198O1897O2799O3489O2872O1052N9774O0749O4246O9502P5731
50477C779838Q2420Q9262R6345J04032J12314J20540J28104J35216J42595J50403
50467D941069J57936J64506J70183J75244J79195J81009J80304J77474J72467
50458F499387J64263J52155J36761J18935R8407P4501M7836K0198p113l3772n9319
50447G212239q2699j03040j20029j33387j42782j48195j49405j45210j34467j18249
50437E934776r9623q0847o1868m2274k3396p258N707J6486K5131K9680K7640J7980
50425E742134J483k0253m5621p2832r9541j23481j43766j60930j75173j85210
50415D716810j89641j88943j85031j79146j71308j61551j50421j38347j25803
$$ plain form
50488 3076529 3137727 3199624 3262423 3325912 3388784 3449836 3509610 3570359 3634605 3704107 3779838
50477 3779838 3862258 3951520 4047865 4151897 4264211 4384751 4512855 4648071 4790666 4941069
50467 4941069 5099005 5263511 5433694 5608938 5788133 5969142 6149446 6326920 6499387
50458 6499387 6663650 6815805 6952566 7071501 7169908 7244409 7292245 7312443 7305330 7271558 7212239
50447 7212239 7129540 7026500 6906471 6773084 6630302 6482107 6332702 6187492 6053025 5934776
50437 5934776 5835153 5754306 5692438 5650164 5626768 5619510 5625217 5641703 5666834 5696514 5724154 5742134
50425 5742134 5743617 5723364 5677743 5604911 5505370 5381889 5238123 5077193 4902020 4716810
50415 4716810 4527169 4338226 4153195 3974049 3802741 3641190 3490769 3352422 3226619
50406C226619j14019j04061r5086q5257p4582o5090n7619n0428m1910l2852k4661
50395B481054j7082r324j966M089R426J4913J9611K2105K3307K5691K9781L3653
50383B635258L6172L8561M1927M4868M4786M0597L3268K4431J5387P104L08m476
50371B958191o947p201n929m018j901M56L138O288J0275J5111J9874K3438K5878
50358C036653K8500L2433L7833M4456N2153O0488O8536P5525Q1303Q5916Q9166
50347C692962R0905R1409R1114Q9958Q7244Q2173P4678O5725N6408M6601L4989
50336D504166K0829N163j0424k5698m1481n7706p2869q5568r5488j02604j06419
50325C931901j06690j04041r9192r2098q2658p1837o1122n0880m0005k7524j4175
$$ plain form
50406 3226619 3112600 3008539 2913453 2828196 2753614 2688524 2630905 2580477 2538567 2505715 2481054
50395 2481054 2463972 2454648 2452682 2456771 2466197 2481110 2500721 2522826 2546133 2571824 2601605 2635258
50383 2635258 2671430 2709991 2751918 2796786 2841572 2882169 2915437 2939868 2955255 2962359 2962667 2958191
50371 2958191 2951244 2944043 2938114 2934096 2932195 2932651 2935789 2942077 2952352 2967463 2987337 3010775 3036653
50358 3036653 3065153 3097586 3135419 3179875 3232028 3292516 3361052 3436577 3517880 3603796 3692962
50347 3692962 3783867 3875276 3966390 4056348 4143592 4225765 4300443 4366168 4422576 4469177 4504166
50336 4504166 4524995 4530158 4519734 4494036 4452555 4394849 4321980 4236412 4140924 4038320 3931901
50325 3931901 3825211 3721170 3621978 3529880 3447222 3375385 3314263 3263383 3223378 3195854 3181679
50314C181679k064P010J2594J5071J4532J0551L056o957j7826k8227l7589m5779
50302C106051n2783n8598o3089o5845o6479o5288o3525o2892o4509o8085p2013
50291B402945p4559p5106p4068p1640o7231o0508n2461m4815l8486l3102k7847
50280A783122k2281j6543j1292p383n007l216q37K087M323M917M178L142K678
50267A737888L259M948P202R125J0338J1369J2803J4326J5119J5076J5012J5382
50255A871847J5335J3732J0936Q805Q423Q649P786O186N907P695R839J0622J0656
50242A996418J1642J3823J6093J8012K0160K2608K4557K5833K7559L0586L3878
50231B241169L4861L1114K1932Q959m640j6265k5213l1628l4819l4006l0387k6699
$$ plain form
50314 3181679 3179615 3186625 3199219 3214290 3228822 3239373 3242429 3235472 3217646 3189419 3151830 3106051
50302 3106051 3053268 2994670 2931581 2865736 2799257 2733969 2670444 2607552 2543043 2474958 2402945
50291 2402945 2328386 2253280 2179212 2107572 2040341 1979833 1927372 1882557 1844071 1810969 1783122
50280 1783122 1760841 1744298 1733006 1725623 1720616 1717400 1716563 1718650 1722973 1727890 1732068 1735210 1737888
50267 1737888 1741147 1746095 1753297 1762422 1772760 1784129 1796932 1811258 1826377 1841453 1856465 1871847
50255 1871847 1887182 1900914 1911850 1920655 1929078 1937727 1945513 1951699 1957606 1965301 1975140 1985762 1996418
50242 1996418 2008060 2021883 2037976 2055988 2076148 2098756 2123313 2149146 2176705 2207291 2241169
50231 2241169 2276030 2307144 2329076 2338035 2333395 2317130 2291917 2260289 2225470 2191464 2161077 2134378
50219B134378k4134k1080j5769q978l074Q19L554O404R793J3274J6075J7750J8678
50206B147690J9658K0740K1181K0785K0483K0892K1172K0177J8202J6581J5954
50195B363515J5778J5203J3634J0738O795K748q38m570r191j4226j8513k1658
50183B359415k3813k4465k2738j8944j4678j1304r429r695j2698j7734k2866k6774
50171B144277k9697l2277l4472l5918l6375l5522l3343l1003k9982k9955k8977
50160A786756k6430k4141k3573k3545k2346k0629k0213k0946k0920j9445j7688
50149A546880j6418j5145j3702j2859j2784j2538j1645j0713r969q693o844n702
50137A409868n977o556o255n555n404n428m767l810l578l925l872l330l023k890
$$ plain form
50219 2134378 2110244 2089164 2073395 2064417 2061343 2062162 2065716 2072120 2081913 2095187 2111262 2129012 2147690
50206 2147690 2167348 2188088 2209269 2230054 2250537 2271429 2292601 2312778 2330980 2347561 2363515
50195 2363515 2379293 2394496 2408130 2418868 2425663 2428411 2427573 2423003 2413812 2399586 2381073 2359415
50183 2359415 2335602 2311137 2288399 2269455 2254777 2243473 2234044 2224349 2211651 2193917 2171051 2144277
50171 2144277 2114580 2082303 2047831 2011913 1975538 1940016 1906673 1875670 1845688 1815733 1786756
50160 1786756 1760326 1736185 1712612 1689067 1666721 1646092 1625879 1604933 1584013 1564568 1546880
50149 1546880 1530462 1515317 1501615 1488756 1475972 1463434 1451789 1441076 1431107 1422414 1415570 1409868
50137 1409868 1403891 1397335 1391080 1385525 1380121 1374693 1369926 1366116 1362538 1358613 1354741 1351411 1348388 1345498
50123A345498k028k18J641K681K645J545o2o89P00K891L525K250J125J550K566
50108A365620L157M308P263J0908J2851J2568J1788J1926J2719J3661J5295J8429
50096A500493K2894K7709L2070L5729L8839M1858M5336M9504N3961N7842O0157
50085A966392O0188N7913N4221N0469M7644M5807M4269M2288L9717L6968L4165
50074B480041L0410K4343J5595N196n515j5989k6149l5675m4008n0734n5449n7734
50062B264332n7806n6725n5219n2725m8342m2577l7265l3770l1923l0652k9049
$$ plain form
50123 1345498 1343470 1343252 1344893 1347574 1350219 1351764 1351702 1351013 1351713 1354604 1358129 1360379 1361504 1363054 1365620
50108 1365620 1368777 1373085 1380348 1391256 1404107 1416675 1428463 1440389 1453108 1466769 1482064 1500493
50096 1500493 1523387 1551096 1583166 1618895 1657734 1699592 1744928 1794432 1848393 1906235 1966392
50085 1966392 2026580 2084493 2138714 2189183 2236827 2282634 2326903 2369191 2408908 2445876 2480041
50074 2480041 2510451 2534794 2550389 2555585 2550070 2534081 2507932 2472257 2428249 2377515 2322066 2264332
50062 2264332 2206526 2149801 2094582 2041857 1993515 1950938 1913673 1879903 1847980 1817328 1788279
$$ [...]
##END NTUPLES=NMR SPECTRUM
##END=
