
##TITLE=UV1017_M2-1005-1001_6269144_WQHJDcZQFw
##JCAMPDX= 6.0         $$ Bruker NMR JCAMP-DX V2.0
##DATA TYPE= NMR SPECTRUM
##DATA CLASS= NTUPLES
##ORIGIN= BRUKER
##OWNER= Administrator
$$ 1.72 TOPSPIN		Version 2.1
$$ 2012-06-01 22:16:29.890 -0500  Administrator@TOPSPIN
$$ Compression mode = diff/dup
##.OBSERVE FREQUENCY= 400.13188235
##.OBSERVE NUCLEUS= ^1H
##.ACQUISITION MODE= SIMULTANEOUS (DQD)
##.ACQUISITION SCHEME= undefined
##.AVERAGES= 8
##.DIGITISER RES= 22
##SPECTROMETER/DATA SYSTEM= spect
##.PULSE SEQUENCE= zg30
##.SOLVENT NAME= COFFEE_calctemp
##.SHIFT REFERENCE= INTERNAL, COFFEE_calctemp, 1, 14.98061
##AUDIT TRAIL= $$ (NUMBER, WHEN, WHO, WHERE, PROCESS, VERSION, WHAT)
$$ ##TITLE= Audit trail, TOPSPIN		Version 2.1
$$ ##JCAMPDX= 5.01
$$ ##ORIGIN= Bruker BioSpin GmbH
$$ ##OWNER= Administrator
$$ $$ C:\Bruker\TOPSPIN/data/COFFEE/nmr/UV1017_M2-1005-1001_6269144_WQHJDcZQFw/10/pdata/1/auditp.txt
$$ ##AUDIT TRAIL=  $$ (NUMBER, WHEN, WHO, WHERE, PROCESS, VERSION, WHAT)
(   1,<2012-06-01 22:16:22.046 -0500>,<Administrator>,<TOPSPIN>,<go>,<TOPSPIN 2.1>,
      <created by zg
	started at 2012-06-01 22:15:15.296 -0500,
	POWCHK enabled, PULCHK disabled,
       configuration hash MD5:
       D5 CA 7A 23 FE 6B EE E2 50 67 74 61 24 F7 5E 3B
       data hash MD5: 64K
       83 06 9F 83 D0 D5 DB 2E 35 51 5C 7B 81 F3 42 6D>)
(   2,<2012-06-01 22:16:25.031 -0500>,<Administrator>,<TOPSPIN>,<proc1d>,<TOPSPIN 2.1>,
      <Start of raw data processing
       efp LB = 0 FT_mod = 6 PKNL = 1 PHC0 = 0 PHC1 = 0 SI = 32K 
       data hash MD5: 32K
       7C 05 A9 77 17 BA 67 70 E6 B4 99 67 45 53 05 55>)
(   3,<2012-06-01 22:16:25.375 -0500>,<Administrator>,<TOPSPIN>,<proc1d>,<TOPSPIN 2.1>,
      <pk PHC0 = 208.6688 PHC1 = 0 
       data hash MD5: 32K
       3A 50 F2 92 8B 25 84 3C 24 17 02 6B 4E 0F 99 E9>)
(   4,<2012-06-01 22:16:25.437 -0500>,<Administrator>,<TOPSPIN>,<proc1d>,<TOPSPIN 2.1>,
      <abs ABSG = 1 
       data hash MD5: 32K
       90 5B 46 4D 51 DC 73 1D 2A CA C3 C7 36 82 75 C2>)
(   5,<2012-06-01 22:16:25.468 -0500>,<Administrator>,<TOPSPIN>,<proc1d>,<TOPSPIN 2.1>,
      <abs ABSG = 2 
       data hash MD5: 32K
       0C EF 95 59 EF BC DB 2F A3 99 1B EB 39 6C AE F6>)
(   6,<2012-06-01 22:16:25.500 -0500>,<Administrator>,<TOPSPIN>,<proc1d>,<TOPSPIN 2.1>,
      <abs ABSG = 3 
       data hash MD5: 32K
       2E 96 73 E1 1E 33 D6 DB A4 26 62 A7 3F 31 9C 79>)
(   7,<2012-06-01 22:16:25.531 -0500>,<Administrator>,<TOPSPIN>,<proc1d>,<TOPSPIN 2.1>,
      <abs ABSG = 4 
       data hash MD5: 32K
       B9 D5 BB BB EB E5 87 04 0D B5 6A 6F 2B E5 55 4B>)
(   8,<2012-06-01 22:16:25.562 -0500>,<Administrator>,<TOPSPIN>,<proc1d>,<TOPSPIN 2.1>,
      <abs ABSG = 5 
       data hash MD5: 32K
       F6 B3 E3 00 2A 06 20 0E EB B3 9A 91 53 74 B1 81>)
$$ ##END=
$$ 
$$ $$ hash MD5
$$ $$ FC 40 13 2A A4 FA 0A EA 49 1E 6E 9A 0E EA 11 7A
##$RELAX= 
##$RELAX= 
##$RELAX= 
##$RELAX= 
##$RELAX= 
##$RELAX= 
##$RELAX= 
$$ Bruker specific parameters
$$ --------------------------
$$ [...]
150 150 150 150 150 150 150 150
##$TP07= 0
##$TPNAME0= <>
##$TPNAME1= <>
##$TPNAME2= <>
##$TPNAME3= <>
##$TPNAME4= <>
##$TPNAME5= <>
##$TPNAME6= <>
##$TPNAME7= <>
##$TPOAL= (0..7)
0.5 0.5 0.5 0.5 0.5 0.5 0.5 0.5
##$TPOFFS= (0..7)
0 0 0 0 0 0 0 0
##$TUNHIN= 0
##$TUNHOUT= 0
##$TUNXOUT= 0
##$USERA1= <user>
##$USERA2= <user>
##$USERA3= <user>
##$USERA4= <user>
##$USERA5= <user>
##$V9= 5
##$VALIST= <valist>
##$VCLIST= <CCCCCCCCCCCCCCC>
##$VD= 0
##$VDLIST= <DDDDDDDDDDDDDDD>
##$VPLIST= <PPPPPPPPPPPPPPP>
##$VTLIST= <TTTTTTTTTTTTTTT>
##$WBST= 2048
##$WBSW= 25
##$XGAIN= (0..3)
0 0 0 0
##$XL= 0
##$YL= 0
##$YMAX_a= 499092
##$YMIN_a= -612781
##$ZGOPTNS= <>
##$ZL1= 120
##$ZL2= 120
##$ZL3= 120
##$ZL4= 120
##$ABSF1= 14.98061
##$ABSF2= -5.57192
##$ABSG= 5
##$ABSL= 3
##$ALPHA= 0
##$AQORDER= 0
##$ASSFAC= 0
##$ASSFACI= 0
##$ASSFACX= 0
##$ASSWID= 0
##$AUNMP= <proc_prof1d_extract_pilot.lims>
##$AXLEFT= 0
##$AXNAME= <>
##$AXNUC= <1H>
##$AXRIGHT= 0
##$AXTYPE= 0
##$AXUNIT= <>
##$AZFE= 0.1
##$AZFW= 0.1
##$BCFW= 0
##$BC_mod= 0
##$BYTORDP= 0
##$COROFFS= 0
##$CY= 15
##$DATMOD= 1
##$DC= 0
##$DFILT= <>
##$DTYPP= 0
##$F1P= 0
##$F2P= 0
##$FCOR= 0.5
##$FTSIZE= 32768
##$FT_mod= 6
##$GAMMA= 0
##$GB= 0
##$INTBC= 1
##$INTSCL= 1
##$ISEN= 128
##$LB= 0
##$LEV0= 0
##$LPBIN= 0
##$MAXI= 10000
##$MC2= 0
##$MEAN= 0
##$ME_mod= 0
##$MI= 0
##$NCOEF= 0
##$NC_proc= -8
##$NLEV= 6
##$NOISF1= 0
##$NOISF2= 0
##$NSP= 0
##$NTH_PI= 0
##$NZP= 0
##$OFFSET= 14.98061
##$PC= 1
##$PHC0= 208.6688
##$PHC1= 0
##$PH_mod= 1
##$PKNL= yes
##$PPARMOD= 0
##$PPDIAG= 0
##$PPIPTYP= 0
##$PPMPNUM= 2147483647
##$PPRESOL= 1
##$PSCAL= 4
##$PSIGN= 0
##$PYNMP= <proc.py>
##$REVERSE= no
##$SF= 400.13
##$SI= 32768
##$SIGF1= 0
##$SIGF2= 0
##$SINO= 400
##$SIOLD= 32768
##$SPECTYP= <>
##$SREGLST= <1H.CDCl3>
##$SSB= 0
##$STSI= 32768
##$STSR= 0
##$SW_p= 8223.68421052632
##$SYMM= 0
##$S_DEV= 0
##$TDeff= 65536
##$TDoff= 0
##$TI= <>
##$TILT= no
##$TM1= 0
##$TM2= 0
##$TOPLEV= 0
##$USERP1= <user>
##$USERP2= <user>
##$USERP3= <user>
##$USERP4= <user>
##$USERP5= <user>
##$WDW= 1
##$XDIM= 32768
##$YMAX_p= 436611674
##$YMIN_p= -675524
##$CURPLOT= <Network HP LaserJet P1505>
##$CURPRIN= <$Network HP LaserJet P1505>
##$DFORMAT= <normdp>
##$LAYOUT= <+/1D_H.xwp>
##$LFORMAT= <normlp>
##$PFORMAT= <normpl>
##$SURQMSG= 1
$$ End of Bruker specific parameters
$$ ---------------------------------
##NTUPLES= NMR SPECTRUM
##VAR_NAME=  FREQUENCY,     SPECTRUM/REAL,   SPECTRUM/IMAG
##SYMBOL=    X,             R,               I
##VAR_TYPE=  INDEPENDENT,   DEPENDENT,       DEPENDENT
##VAR_FORM=  AFFN,          ASDF,            ASDF
##VAR_DIM=   32768,         32768,           32768
##UNITS=     HZ,            ARBITRARY UNITS, ARBITRARY UNITS
##FACTOR=    0.250966925370066, 1,           1
##FIRST=     8223.43324360095, -177721,      -119393
##LAST=      0,             -60146,          -15476
##MIN=       0,             -675524,         0
##MAX=       8223.43324360095, 436611674,    0
$$ Real data points
##PAGE= N=1
##DATA TABLE= (X++(R..R)), XYDATA
$$ [...]
23841 99677 -24398 -122597 -130057 -122764 215429 -6810 73508 237167 -213476 -64390 -41500 79950
23828 -115745 -139336 -73758 -126083 -100696 -45615 26881 -41077 -29690 43004 -21198 -167019
23817 -167019 10322 170804 -5142 91849 129173 -140610 -100550 -248927 10925 125089 26739
23805 43978 -90549 85524 4283 29722 17640 -169746 -91589 -102246 -45232 72170 -210701
23793 -220242 -112555 -71405 -146547 -321541 14563 -63637 841 29526 245704 33887 -413466
23781 -231511 56754 -97599 -49188 -276271 -240845 -161858 -72243 -52381 136836 48754 39681
23770 39681 -20924 -22766 -268249 250546 -46621 72746 -156822 -17972 -170918 -108352 -142826
23759 -142826 -172408 -362491 311511 -173654 79764 8145 156242 -17542 42168 -87063 357282
23747 -150133 -194807 -210279 162433 -223425 20621 116443 -237471 82353 -1881 75048 -6971
23735 152427 106352 -136773 172863 76329 -49749 368538 -250980 200042 -229050 -99453
23724 354671 -17238 232833 -120071 -106601 -54418 -372742 -288428 24317 -218016 17339 28975
23713 28975 -220117 20045 -80391 82080 -35405 -165490 80932 -7152 -104244 130742 -243494
23701 40952 278422 175613 220000 -19273 -78118 10415 29579 161138 130868 406815 59475
23689 116206 -152042 155471 102734 -122792 -164094 129233 78522 267114 155368 138372
23679 138372 -2588 124222 -60545 -27085 -225902 -134197 -30827 -36761 -249851 191579 -172453
23667 -137130 -55282 -229543 7055 96071 -259531 -260783 209082 21545 -84744 39795 -49319
23655 337657 118736 54592 116052 60334 354204 28744 224079 25831 82989 185752 -223186
23643 291349 198665 -80010 -147791 213512 -163048 306349 98308 -190677 -72288 52888 5095
23631 -183552 -155342 -31772 167477 94673 -105999 156223 53021 -246598 16262 -200814
23620 294868 -338052 -136319 167634 61865 77184 34798 -2620 27753 236279 -14783 -407990
23609 -407990 36596 10737 119938 -110226 177180 175571 288818 1166 -114944 -8297 35496
23597 -208046 -108344 162141 68048 -460294 -147679 113417 -201359 -33490 -253404 -5639
23586 -300309 43371 66438 -71342 -108998 -240579 -273045 -46982 48457 -139285 367830 275553
23575 275553 -67136 -13302 91454 88351 -2865 -63659 -275841 -89500 8893 -8596 10243 -169120
23562 -13764 140357 -95639 530400 135626 -113783 270074 55004 138809 153205 -13289 -176778
23551 -176778 -92470 98176 111226 -19657 40886 -20613 -201552 -24138 251095 201860 -13343
23539 -70517 -144740 -1352 -397388 17357 236673 140616 -91757 177908 -372976 15332 157844
23528 157844 -81692 -303219 93478 -40105 -9460 -18762 -31789 -188178 6325 75863 -23761 161818
23515 -121906 -209146 -270092 -147415 -48341 -31001 -224064 -207736 90954 105089 -99041 230303
23503 -56608 -111421 -142758 -160726 -5402 -221061 164526 -81737 54514 -98720 -118325 -155454
23492 -155454 147971 -17999 165966 81040 -29262 182377 145195 -1927 205506 40324 30122
23481 30122 76428 128413 22203 -483728 34594 -118802 52756 -63352 -126935 199690 178319
23470 178319 -78485 178261 66354 -211957 -74507 336444 1206 -80677 57856 -266751 -69404
23458 -264360 25014 -42881 62639 -81845 30680 196419 -175359 -210085 248769 -323818 -80524
23446 -276319 2084 115401 -80481 31935 409668 139981 -82267 188293 20549 54955 58473
23435 58473 -75422 -49538 -82828 -132681 9762 -104803 112683 -58732 -50845 -54888 311536 -100016
23422 71626 219182 65150 -108507 -64891 198586 -99252 -109002 30597 134394 214948 61594
23410 -27675 -192978 -216562 183050 -8201 -126545 115664 162337 -199102 405074 168136
23399 -149484 142367 -69640 -181718 -236897 24532 -85883 -104382 -163065 -14049 272378 -156182
23387 153998 51130 235816 -40324 67161 33160 -120570 144316 -402221 -300118 -287316
23377 -287316 68875 146885 -368181 -96747 -276927 -94028 272938 219167 -281599 -13962 -98650
23366 -98650 -288518 228147 -16004 -77385 25550 121690 99568 -231895 -165470 -113664 -45730
23354 67234 91709 -88881 -43251 -146393 116541 -91885 -218944 91571 65131 -4063 -579 -177232
23342 -177232 43756 -61055 -192683 -31994 -20867 -18175 -301874 -289021 -252636 -42117 50434
23330 42761 -18067 -195387 181773 -174496 -283677 -120388 -26002 -24831 -167818 98079 -140252
23318 227118 80524 264992 -382551 -177356 -58550 -151018 -303821 -38830 -177726 -113181
23308 -113181 -21782 9343 -90025 157551 -2999 42808 -117674 -91062 -320204 107975 59969
23297 59969 146844 -90169 88424 128173 105374 -128511 -8925 57722 -217623 63439 -203090
23285 48589 -145426 -200948 -10855 -244862 204739 -304142 44623 52891 222493 -263999 -306047
23274 -306047 -11244 57049 193721 96808 -204772 61573 -126364 -417271 -131082 -6375 -168312
23263 -168312 104872 76495 -201603 -45663 -160162 -7072 -286823 -235481 154217 -14280 -87428
23252 -87428 -16325 35356 -194861 187087 -41700 131832 80305 -6132 39762 -11442 -191098
23241 -191098 -97996 -94187 109774 -359086 -114194 1655 -292931 -236936 38173 -185710 -192584
23230 -192584 102777 -139566 -43707 103244 154222 -62086 -15494 -55923 -164865 55784 15899
23218 103493 173069 16419 -136807 42968 48172 73208 -50029 -200684 95394 20986 237365
23207 237365 -78867 49302 -62183 59452 48711 -80984 -102797 -130323 50171 -274175 -66421
23195 -385313 19621 21055 -8217 7222 183292 -48150 -136551 -21490 -74212 83161 -37537 90345
23182 70449 88523 108077 -261938 -223479 -20644 -35562 -31883 -213 14818 129049 113347 168265
23170 168265 -165313 -226609 -127340 -87310 -33278 39008 -137488 294135 121924 -26235 -145903
23159 -145903 -129900 -14411 -57915 44742 218992 250370 -232 -148711 -83808 259162 -120752
23147 -102478 -95721 -172551 -192352 133913 -120163 -29504 -161798 -245965 113659 87656 19644
23135 1427 -78981 65388 60889 175580 -99304 316889 24861 -66683 -265286 -62260 -119740
23124 -119740 103898 -326989 166433 -35419 149897 -443925 -154377 -134641 -449297 139856
23113 68471 184186 25694 122671 76466 203417 -19251 -176795 218223 -11542 -50226 -48348
23102 -48348 -442521 179211 151387 -78439 82944 202231 -91257 43591 -178677 61553 -328617
23090 35461 13725 202062 52386 377925 -403725 -180329 -18596 186390 -155698 28714
23079 26824 -135063 166191 -315724 288053 192994 35828 -334353 -67321 170515 -268685
23068 -125312 -248705 -396428 35231 155970 -234850 -191981 -28835 -206179 80862 -179886
23057 -288773 262592 -259990 -417384 87993 -183156 148439 28006 -139538 -32948 1119
23046 45019 229101 205975 -24127 293539 127846 272265 4232 -135074 -121125 -239974 140390
23034 -35636 -63092 160057 132307 -200256 154752 30335 21958 -31912 -481049 186089 78825
23022 72027 41876 23251 428545 436754 1595 177018 -59805 80793 -130938 -193041 87814
23010 -64700 165719 -373076 96374 -155739 5328 225951 -13516 -246830 123555 -14882 213888
22998 325101 198255 52470 -216907 -65068 60141 25343 -136952 252433 34836 -82956 239718
22986 -13702 -230943 -39836 -281846 80973 -317748 -392824 -63338 -217687 -164910 211724 -25740
22974 -244329 82304 -33301 -38783 136924 -52584 -49931 147629 -73535 -221747 68839 -295453
22962 -148969 -375942 -1447 163471 -337916 70940 -206827 -163501 -10635 -30036 26134 -193990
22950 -111712 -47859 -285032 -156016 118900 -46168 -112395 -389742 -158421 92110 -284957
22939 303529 83388 -5211 48508 -240990 -182526 229979 -160271 237518 172827 -86720 -50433
22928 -50433 -73120 178674 176643 -302039 14822 -65250 -120783 286587 -296644 393706 86948
22916 -277699 -227876 -8346 34865 -48437 391051 361443 187802 20710 -115336 83987 164970
22905 164970 -95973 67628 -230439 -74029 -52982 -326429 131038 130567 -149842 6194 -2487
22893 237009 -124635 -88161 -189769 235975 373320 -69880 -30882 -89097 162675 -219122
22882 -34003 -7780 88993 -248160 -219815 -83407 116911 -288787 -19408 -116672 -150192 -199153
22871 -199153 -128667 -148593 37384 -19366 -161010 395931 -71496 5046 219710 138350 23791
22859 177918 77737 -185005 27558 -318595 26125 -41449 -112351 -122142 -131406 -385292 95134
22847 -384495 58310 83257 36807 -125008 50852 270403 -185747 83822 158031 13348 -775
22835 -166883 -461591 -1320 -69753 -10059 -297296 -60721 -55610 -275739 -161311 149509 -175849
22823 -44880 -110166 156862 40674 1104 -187126 69478 -90666 57946 19447 -13096 217168
22811 141205 52699 8912 -213698 -37898 -253815 -14554 296132 56942 30279 -323164 -102710
22799 -46016 -249891 -90942 -225741 163701 183835 -314223 75605 233841 -332204 -75184
22788 -57361 -235021 -53999 -169160 -44405 -104606 42856 -46871 130058 -132328 -91262 -142469
22777 -142469 -106952 -430199 86073 -43639 106715 -7685 -17465 -126980 82542 -196348 5790
22765 108172 46798 201967 185243 -188282 24295 -101644 -55760 -202792 -113231 107624
22754 62347 -149060 5072 367707 -160084 -127717 376767 149425 -28589 -309472 144816
22743 -126398 -290945 11585 -246132 -101698 154427 260272 -112092 -104745 404761 -416102
22732 52769 -1768 48889 80459 240243 -259952 65500 347434 32437 -135510 70145 71592
22721 71592 -33664 69814 -132445 -281773 -242422 25491 -15431 157647 80835 -66617 -30484
22709 190549 81421 139807 -14345 -132151 30430 -4422 -312259 -41678 -1290 -63520 -96520
22698 -96520 71940 -13198 361052 91973 -126616 60671 -2661 82236 -102238 18884 43292
22687 43292 198866 116061 -120627 174698 -200485 -77502 -60203 110426 269556 182799
22677 182799 -229511 401461 -75656 -91135 -141763 264440 -26043 -89591 200108 246113 -187580
22665 392099 -53398 -1625 -57570 -19572 146591 -294841 -23577 235841 1410 41813 -179766
22653 -346783 -131202 179150 -66420 25471 -26189 -279010 -70302 -354247 37199 226777
22643 226777 -85721 153153 -96401 -3190 -172074 -284968 5720 59677 65790 139055 -214103
22631 -174879 140914 -153142 209466 -280647 -134337 1844 59887 2996 270664 31944 -154894
22619 -14473 -111623 -24212 161987 40416 109644 118495 79627 85578 -4570 -160527 88910 -276891
22606 -214945 -75726 190342 173158 180702 -97762 149186 207255 -66932 305345 -121809 210927
22594 64156 -96108 -25154 23767 -438694 -369328 17246 -262622 -106085 14750 -168916 -206086
22583 -206086 -53938 301379 -213814 -168507 -235119 39625 146997 -62322 -212522 -320282
22573 -320282 -129356 -298671 38572 -108974 118083 7205 -80425 37830 41514 -167138 -151051
22562 -151051 318689 -464804 158671 -277240 248507 -138408 -305261 -269177 198758 -167001
22551 -257880 115863 -261494 149286 311681 -122262 -287968 129169 254375 32579 -4928
22540 -96123 40011 -51911 -112183 111002 -264492 -341315 -97168 151469 -175976 93947 109616
22529 109616 20612 -55475 -243196 34953 -107699 -22869 -77859 56446 -102043 -30607 191280
22517 -29038 111297 80338 -52428 194704 -499418 3218 -135827 -242665 -117593 102605
22506 207108 376931 44037 -374625 -339278 -2988 -83855 -164183 -59345 -257075 312451 16213
22494 -335102 -412011 79767 -35320 49916 -147919 143116 -188978 80299 -31426 151748 231914
22483 231914 21790 -234944 -10877 -188421 -78434 61437 -232425 26622 -149958 296185
22472 -124760 46744 -271613 -89311 -310154 119248 -50085 67183 88017 17711 -2169 158154
22460 -68953 -18531 -119398 251765 567 9042 -104426 35914 31658 -12056 -170955 -98963 -89874
22448 -89874 -106905 327790 39848 -102859 -281010 19257 -121330 396614 -15210 -99685 111831
22436 -140820 -43863 -112734 -43195 -209595 -121772 -285850 -160256 65718 -26850 237180 112972
22424 284496 129571 15358 -42228 103107 1799 417699 125349 -27149 -141637 -96447 281906
22412 -118095 20148 -213511 -181816 -29774 -250876 -97101 -15072 -184050 -24067 -262753 234919
22400 -106289 187495 -167880 405305 274271 263030 243749 158529 -154622 23824 -15542
22389 134377 43784 -77502 14434 129000 156928 8011 -10623 362413 -27043 -180937 -297321
22378 -297321 -316378 66229 -314195 40972 -106910 -222932 -8119 250637 163808 -90190 -29566
22366 -75315 106824 -150014 44353 209061 -159421 -487268 68276 -36062 -187205 236995
22355 -207397 -367496 85787 -34307 73096 48588 -278670 289563 30510 181475 -168324
22344 -298443 -200507 225279 -2386 47489 -540448 163927 160352 77468 -199284 -142363 269965
22332 -317687 -179785 -357587 114850 -254182 -34433 -256625 -20674 -9783 87800 81022 66320
22321 66320 -46234 10755 -62568 -172918 -268753 26492 -290328 149714 11728 -65206 -75522
22310 -75522 -241301 112284 -99723 23670 -8833 43096 -101398 235680 -140489 -163627 -90932
22299 -90932 23743 -241498 -646395 88588 -174987 54616 161600 -11573 -49767 174028 400223
22288 400223 167981 1742 -291966 92261 -150715 -36684 -86957 308250 123473 368764
22278 368764 12795 -147639 -19739 -219694 -262782 -213088 -287711 -68349 2672 85261 -6504
22266 -27010 -73288 65309 237256 -303345 169510 -275294 6952 18151 136767 84869 171916
22255 171916 -238634 296368 -85698 1459 -32560 466015 66890 106651 195890 -275620 305868
22243 65105 25339 -162703 -55182 -152027 26380 35288 -128071 -71721 78751 157151 -57357
22231 -96042 -171387 243721 245058 -137440 122110 143184 187142 -62138 57758 57532 39219 -257312
22218 59993 100814 296761 -45060 -139788 -103408 124326 13945 153653 102033 -312640 -129518
22206 -162716 187840 -146358 -99255 196108 139852 -100142 235783 24729 -110776 80440
22195 -424239 -104579 39570 99122 -22392 -57000 -214446 129820 -50327 70306 -219470 149263
22183 -9349 -288244 -123487 -130218 28537 -255212 50142 4207 -39364 0 215263 -47708 -501133
22171 -501133 41306 72291 273450 35174 -42269 43018 59237 140639 -184506 11436 19200
22160 19200 -45281 -301052 205511 29206 -49584 11852 220123 -107098 98276 46030 10859
22148 54775 5341 -217581 -215167 -308935 -338052 -7500 -88072 -368956 130959 -176423 159455
22136 39747 29196 -248290 86164 -337739 -406093 -100433 -107753 -189571 -29483 175500 -310260
22124 -98310 -467735 -106261 130037 -511959 97233 -74304 -363284 -141524 -100925 -192389
22114 -192389 123140 -371499 112716 -263017 163033 -64733 57504 -143321 -198452 -138418
22104 -138418 235 -201685 -282554 156469 170951 -61728 -43740 82436 337367 -4588 216255
22092 -571 27844 -133886 -141585 165539 -141786 75908 8587 -32677 178138 -117335 -215193
22081 -215193 -194903 -44595 -12879 55303 -75403 39634 -21737 -42885 269005 -69298 83719
22069 263421 257287 168631 48975 104419 58926 -162015 -156841 -197026 -139051 -75679 77486 -54985
22056 -101810 -280612 115026 -226404 206807 96936 -118436 -182244 -61869 -314807 -36069
22045 38680 -80846 300980 -162884 141437 291867 -147121 32412 -205855 -107655 -137241
22035 -137241 -350134 -123247 -18938 105282 -30593 -96575 -24015 -182804 37453 10115 -160249
22023 128911 -70261 -222880 245067 -165096 -186097 131426 -148566 -8115 183533 -99170
22012 29447 177927 185798 -99466 70889 135407 48076 -78037 -83666 4784 514865 -164182 71653
21999 100452 -34173 -7235 -140993 141255 -161986 -106806 -257406 110494 137790 -89025 -281821
21988 -281821 -175036 -63195 27764 -168447 47527 430317 197843 22601 -82155 63168 194493
21977 194493 127933 -187009 13085 -216202 -2679 -22044 -320043 -378925 -422223 -229067 -56281
21965 -98631 -159458 241659 81488 -27739 -39120 -66823 -30804 42258 -459162 -6661 -382652
21954 -382652 -45824 -185293 157902 288222 -65684 -89297 -306894 -467071 -2713 -67672 -27909
21942 114291 85943 -131516 145953 126226 254509 -113732 191319 -189951 -77218 60141
21931 110759 47110 -11934 9528 107908 127352 -198955 -261949 -105833 -157483 -200137 7041
21919 -70015 -260059 230858 -184767 89293 29569 36895 9008 -18295 50817 -270345 -367509
21908 -367509 -186630 171645 -445982 -3090 -278243 -73342 -125752 -136667 -116246 -599811 -57837
21896 -147577 -25423 91417 222410 38328 -2213 -165760 -328168 -23906 137452 -284010 57263
21884 242958 -93893 -248904 101230 -85854 -279778 113697 -115495 -39231 118627 273904
21874 273904 -402887 44075 104931 -213200 -310802 -7641 187743 -262080 4200 -144974 -86648
21863 -86648 -175151 137485 -121003 62642 -37937 -127547 269080 -385549 103698 -19237 -166173
21852 -166173 -212959 -440850 264405 172313 -97232 150024 -110550 236684 -109625 185403
21841 -190245 -5174 -118957 -25173 187787 -111591 15305 -281105 -89467 -166110 -317224 -62919
21829 -208124 -75336 124924 295207 194547 85391 -22708 -162453 -349309 8088 18751 -307918
21817 -148090 33757 -16377 -71167 31381 -215318 38760 -90788 182447 33601 126329 49543
21805 -257693 -203796 109703 -32729 -79203 158802 159782 -86748 79399 -144332 -553671 -116230
21793 -66304 74322 -79369 -128795 243278 15747 234649 215136 -368777 -168263 38153 103287
21782 103287 -280619 20493 -190387 61151 -193509 -38189 126661 178458 131155 -32011 201849
21770 49834 -38956 -320796 120241 18322 292483 60260 -154865 -66110 -189109 134749
21759 -364495 56504 266184 -188257 -15597 158157 357655 125102 -432493 -159948 330341
21748 -187918 -289722 -40234 -22620 -137585 -122588 21609 -170482 23499 79867 -153002 79149
21736 108939 206432 -226727 37243 -10296 113597 -46934 -18517 104236 -98069 110876 192777
21725 192777 -200550 -76293 242376 10756 -277073 166396 338404 -113572 97629 -182709
21714 -188655 81721 -98568 183423 -168031 -342928 -43035 -31606 -552389 300664 -210637
21703 -25254 -44547 -210554 24449 -179668 173751 -211429 -159996 -411722 78519 -179514
21692 -38463 -64683 -238756 159339 32177 -136130 28676 -87204 237651 -71119 -215014 41066
21680 -212560 132642 3309 -11640 171824 8517 -616365 -141842 -264507 -183103 -168020 -190524
21669 -190524 116417 -129468 132916 69482 -17122 -193944 -165504 10692 -68303 -22428 -315104
21658 -315104 -61014 -151876 387764 179146 -20937 -38746 -338733 -76568 40199 209857 80770
21646 -4172 -106694 -27495 -193975 -54130 26122 49465 68436 -109205 5478 -203250 182424
21634 33814 63053 1774 -403216 107211 -56350 -233601 -304902 110708 -364037 121186 -279361
21622 -147219 -170103 283424 -256047 -70893 -122661 -139793 57132 -225776 21171 15970 31185
21611 31185 -110081 15183 -42200 114470 -14187 -274991 -140768 -256515 187677 -202630
21600 -6500 86762 123071 -112987 -191042 -77699 -53143 266022 -152391 -280011 201532 -215651
21588 -55514 -2115 82316 95046 7077 179123 40726 -9210 108006 -283409 -62759 -314471
21577 -314471 388936 -95597 -237096 39867 -214206 32414 -56410 -251437 -268598 23398 -204697
21565 -80072 -46496 -152067 145644 9672 -25557 -40255 33233 -18374 -91536 -146579 -18321
21553 -11138 -66242 -247635 -108727 213208 172396 -199378 -200312 -143476 -192719 -9563 146529
21541 126721 93886 -61683 -160847 5535 132303 147441 229131 412847 181626 -48972 -51589
21530 -51589 25748 -156192 -328258 96720 186796 112917 -217040 -38897 216072 -418299 -343108
21519 -343108 112839 -255677 5436 -145175 51977 70823 136357 -175908 -204519 24781 -28557
21507 10985 9719 -60141 -236901 -277318 89039 300539 163870 104267 77474 -75438 -420438
21496 -420438 -32072 129022 244959 -84457 44964 -288710 55347 -58336 239856 289408 42034
21484 -211997 -791 131803 -271710 58036 20720 -62567 58043 27273 -249908 110543 -236690
21472 -231188 283448 51443 -247719 23641 266166 26603 -5378 -243711 175877 177497 18702
21460 -63996 132110 148432 10059 -539527 -194482 -363932 430432 -120698 -109802 -42523
21449 -205972 -230260 -48517 62647 -258621 164475 20632 -64677 -278885 -232473 50836 -38100
21437 -43413 -260789 -21379 -113736 36988 8654 -55470 -262985 38147 399823 213311 251631
21426 251631 399920 551461 151320 -47093 -86875 -370036 170228 9444 -5538 -31623 -19091
21415 -19091 3844 -155401 -51954 20307 127420 -19872 -121960 94409 -146299 17026 163206
21404 163206 162950 -257460 33728 -41573 -79521 -124742 222555 86037 -470083 -184147 -69194
21392 26823 -219935 52754 41593 56550 -207979 -245946 12425 212081 -41032 -213802 46806
21380 -134582 -356975 78210 -74766 145766 118051 -81969 16625 27638 -10729 8365 71461
21369 71461 -76718 -204733 114257 13367 29928 -20841 224356 75749 -150475 100188 207040
21358 207040 125898 -78767 -62056 -120249 -51365 27638 -117445 -14808 91969 -281538 182804
21346 605047 -167713 -123849 -440078 -244162 -157707 -91740 -424432 -88609 -61704 98102 72260
21335 72260 -29232 -63797 -101201 -279575 371390 289304 -30979 -111754 -143379 -121672 113139
21323 -64809 -7484 70653 -294085 -82620 -32443 65777 92271 50627 -128453 -205239 16258
21311 -39955 -36852 142387 -60287 -242710 -321880 -55728 75565 323127 71942 117217 197130
21300 197130 -465940 318428 -27868 140033 3656 -55913 5462 258270 -161123 262922 160506
21289 160506 495205 -179077 56214 156826 175891 19048 -28287 -44807 -408754 -7766 -154578
21278 -154578 37399 -264214 -43669 -824 84773 -29327 198415 200057 685977 -270819 -247053
21267 -247053 -177650 -80559 88009 -128166 224712 -154367 -127280 -481015 -3369 -158247 -56121
21255 -80262 -191789 185471 -136384 -300952 83646 51120 60801 -398866 -49926 -185222 237084
21243 -144432 34682 -65978 -178982 1317 33391 58724 -186595 -138288 48246 195143 5598
21231 -252089 -24679 -77194 111678 -249212 -280051 167313 10494 -318980 96754 57455 -110811
21219 1927 155391 26909 -43174 -334583 -114743 -17437 141365 -366721 14017 11715 -52651
21207 -180361 -236818 -513 -15332 -34581 5926 105865 -87286 28623 -223952 -171421 -174603 -209830
21195 -209830 43774 156172 -357631 -173364 -151469 -112013 -33169 -428338 -335086 -367871 25209
21183 41342 -124704 99813 -219059 -57754 128447 -100364 67788 46198 -178385 -675524
21173 -675524 -289900 -5319 198471 -303293 -286477 4582 -34133 -155905 325084 97994 -6737
21161 -309844 -118017 61843 119020 78057 -73519 -39588 -141556 -169579 -496815 -54784 -151954
21150 -151954 -372550 -109527 30573 32601 -171145 -58433 -114419 159452 -173760 -316773
21140 -316773 91519 65837 -87071 -217253 -212817 -55407 -294653 -191822 -32825 14307 237452
21129 237452 13010 109280 143554 97706 -62279 182999 -97879 60679 -202851 -276478 -68989
21117 100419 -285093 211656 87012 -112786 146749 -497762 -124288 -79299 -19491 156599
21106 -191731 -25206 -71432 193483 -76820 -916 120467 576 -16158 -133829 -43116 -278977
21095 -278977 -223928 -92823 -62321 308555 -184718 23516 125478 4174 -165220 372022 36704
21083 131912 -265858 -188302 -9606 -231549 145251 -154223 -158975 -79481 -46753 82213 -160088
21071 36255 -14582 -88595 -50923 133722 66845 -446736 -127251 -350553 189858 342718
21061 342718 -79347 -431998 -125776 156849 146715 -365606 105852 -51234 -95498 479361
21050 237517 39075 -312433 -225851 -250247 -209988 -49901 -181852 -74 -280136 -31971 -136617
21039 -136617 -129570 202799 -17702 -297706 -61354 -226239 116443 235883 -285802 -396209
21029 -396209 -250247 210326 -83738 33203 -9325 10438 -153294 -237857 258087 322392 94881
21017 30803 284283 -340299 63839 25152 34102 76773 51698 591 -117863 -245651 183737
21005 382576 134394 -77192 142261 61791 237491 63202 187464 -84158 -193634 87717
20994 -16702 -138618 86957 -138263 -182440 -187790 299267 -113765 -260 -109768 -2286 76005
20982 51493 -263779 -82046 -204021 -32280 -242458 -30953 -202636 -46615 -155806 -14705 -260161
20971 -260161 -166177 118402 209925 342630 205408 -178649 -347604 -60216 57066 -183260
20960 -142724 42818 -107678 -303402 118029 -269190 308869 -195806 -72437 -218568 -191142
20950 -191142 61660 85300 107319 -211960 22888 -287960 -322764 -11842 4814 -197965 -137614
20939 -137614 47856 -296837 -42347 -291137 86496 -237928 -357115 350047 -217376 87783
20928 -149982 15615 51717 263114 67970 182663 620 -191742 -190058 50211 209690 -256483
20916 -158854 245797 -57360 57323 -7149 47297 247369 59200 -106677 -533378 37838 99909
20905 99909 205015 -108879 72228 -103504 -312362 196609 -114901 -305065 58920 391527
20895 391527 -251684 -1475 169033 -130736 -7305 -189916 -182437 -12849 -167800 106071 -222528
20883 27610 -110465 -60589 381513 -13778 -359925 -20557 -136985 178043 -184217 -221298
20873 -221298 55850 -121638 -106546 -7699 -48596 195743 260574 96610 -67210 -155229 -8591
20861 -77117 -62034 87593 -171411 23629 10493 -193082 100492 -172495 15247 112540 -85175
20849 -121188 -206055 -113833 -305059 116678 -270421 14391 -178351 -69281 -70141 -54924 -11082
20837 464390 110569 170239 -143057 -151862 122304 -310454 117648 -105823 -54872 334769
20826 70858 -348860 -52877 -222713 316267 -325470 -282820 -102256 218000 -31233 175467
20815 -211815 -175378 -85461 -12351 -22024 57486 -137233 133230 -27288 -138412 -15169 -251636
20804 -251636 -148574 -152026 188992 49895 -13197 -373744 93421 -88409 -281288 45510 -22345
20792 -45483 126974 -125019 42672 -135889 -203730 53784 -161551 154037 -358140 -115619
20781 -131358 -338623 269813 -28870 -263258 -89678 -264292 -308316 280336 -246515 -259479
20771 -259479 146450 -177849 -483905 -126557 -71308 -32130 -35484 -96965 -95903 307 278733
20760 278733 130785 12365 -85178 -150452 -74732 -143516 -304487 -315401 -79179 -186180 244776
20748 99633 -308384 -99371 117853 -207626 5133 -141302 -15932 162601 106900 235687 -99732
20736 -323484 -139835 -9159 15780 -40791 -16189 -236029 78341 -55037 131829 -51821 -427689
20725 -427689 -271486 146720 -147852 -70736 116017 34358 16948 -207623 -80641 -59466
20715 -59466 -42361 225149 -20238 -301742 -125978 -48690 67282 -280152 -162172 115353
20704 -49038 -232256 -300105 92290 -216089 -60372 106922 -158001 -311440 308478 -111063
20693 49056 -131905 114183 -7222 -105604 -132368 14975 21022 -66197 -24307 -26423 -130178 87672
20680 -201098 5681 285609 130966 44905 -141776 -66458 -56328 -322190 -60463 -129288 -109043
20669 -109043 88666 130938 -113261 -41913 -183310 -121858 61347 -213348 -67564 51431 -18015
20657 -227531 88332 25421 -216161 -216202 -290266 65656 86077 -4235 -57899 118309 120904 -186947
20644 84360 13173 88751 -355777 -269874 75467 169401 170109 -293865 -318787 -121032 297137
20632 55446 -9351 -96502 75403 -266774 -272822 264607 -2015 -35465 109075 31827 -105513
20620 -34028 -56131 -421183 54051 -68390 -35197 -149825 1636 -9104 334454 -14393 13389
20608 -158749 249011 -288325 -16294 -72388 59124 -55129 23995 216640 -13980 -164632 -176478
20597 -176478 -156109 174274 -42802 -173368 -499574 -342626 -530235 241057 -370792 99527
20586 377142 -179567 -312788 23681 -34424 190334 -177911 308166 58943 -107391 -93294
20576 -93294 -104226 12954 -77736 136666 25932 59522 137718 -150995 9409 43758 140226
20565 140226 -78734 -210980 192690 -2850 -94127 -108205 11204 253244 75023 230041 306344
20554 306344 -233257 -121917 374747 151588 -21422 -90436 -245504 -161531 66220 -77924
20543 66577 -141773 138462 -354465 -39353 151394 -149578 -184012 -11701 35696 -65796 -78409
20532 -78409 -46509 -41412 115213 -143950 1989 47159 -20578 -384000 375507 -188727 131683
20520 -178786 -184211 -132934 -211104 -239081 151797 75248 -29965 -194049 -304433 -307780 -266073
20509 -266073 -153803 -277955 -110785 133485 -126413 8832 -105957 80314 -346319 84296
20498 -65408 -34944 184267 -1037 -415714 -43408 156831 -210977 -174864 -75428 8523 -78383
20486 76039 -73493 -180126 -346620 123961 -154983 -307611 -131642 23988 -119725 -237450
20476 -237450 169966 223918 22487 69654 -250188 17509 190416 314907 -338420 -74250
20465 -410872 -93636 -115259 -210530 -23255 -63649 125795 -248718 -351297 -336711 -18576 638
20453 -215353 -61687 -310253 15452 -67804 -299520 -37323 -40633 5260 235889 -97757 91000
20441 96408 64965 115164 -93845 -73872 -137703 22610 57381 92201 232747 6080 -180933
20429 71169 176411 87729 160934 68596 214177 -130654 -87579 -63338 -340974 -65088 -1605
20417 -85435 -53053 340392 -96979 -67515 -85696 207416 -32017 -265711 -52384 -76681 -61304
20406 -61304 -43392 73150 231255 -47273 34192 -386306 9255 -207239 -346 -298625 105427
20394 5042 125330 20414 -271458 8452 238668 125267 -354661 -474260 -100293 -275677
20384 -275677 -12619 -266570 -123674 180808 -241252 -193055 32795 -215730 -152178 -63001
20373 -254607 141301 57499 -219303 101753 -33892 19410 82727 22968 140888 85635 -157399
20361 -86860 10184 59456 225001 -197426 -109907 -128962 -165190 223656 -259933 -107582 -83334
20350 -83334 88962 83974 -174586 -110835 -176104 19523 -165894 201127 10502 -93855 -76756
20339 -76756 152577 -363111 38386 199314 90871 267909 -185616 -109171 -190263 -27291 -238344
20328 -238344 -80608 84464 -61973 79749 290515 212167 -22997 -118796 230657 -38151 -8489
20316 63687 236265 -95557 3645 -143380 230442 8525 -105328 297856 -96096 -200666 -100008
20304 -11209 9668 -220722 -223840 -139039 208712 -279440 228073 -512739 -204756 -126394 90365
20292 257495 24181 -65083 -256245 -100359 -112188 -231075 -106224 -199471 -231777 -17075 -404226
20281 -404226 -36666 80925 -45007 -164469 79965 -87663 -39571 -319025 6761 225989 85544
20269 93504 -148422 27485 -303583 51132 42047 -43619 -13188 -180820 106299 -379295 -388987
20258 -388987 202296 -126500 -254031 -194589 33988 116953 -51956 -153796 89430 -79497 -154581
20247 -154581 -298472 161777 305414 204385 82715 62873 -272080 19192 -352722 -28968
20236 275890 -285569 -208035 -185489 85232 -173010 -132933 12034 -48350 -207634 -221367 -417258
20225 -417258 -106466 -117870 -111187 -233619 -161863 12359 -209770 -103690 191017 -49163 45325
20213 297070 -16801 -83234 124547 22250 -170173 121591 127450 -70635 -236253 -124898 4074
20201 -355959 5186 -102937 82264 -21893 -90118 -122173 131212 5980 158768 19526 59137
20190 59137 23594 -167112 242614 155705 345432 32557 10036 140641 23662 28078 33427
20179 33427 -175509 -411172 172477 408054 -178774 312811 -100370 -169633 65311 -170859
20168 70474 180133 22285 -279978 33115 -259465 28310 -212602 -171686 -84463 108250 121579
20157 121579 47101 -185933 17204 -73632 -7510 6919 -138576 17464 -80520 124736 111153
20146 111153 -103395 -150015 4159 -432031 202618 -29842 -344121 -140997 -83136 -40151 -15373
20134 -191047 171653 -9846 -37865 402227 182545 158621 -195721 -12701 -83245 253092 50375
20122 -209607 180131 -282456 130924 15711 -443052 -101981 -28461 -181464 -360203 -19756
20111 -101436 -4867 -66040 46862 -99256 -21878 105400 28119 5970 103972 -348590 113395
20099 69022 55182 -108955 -274897 130033 -279778 206761 -216198 -401039 24156 -276816
20088 -115015 -4219 -273273 -169421 -478959 -259179 99408 8400 -114120 14113 -195822 62820
20076 5524 -124885 -15483 -121304 -404578 102131 57895 -96052 137291 105672 -151366 142726
20064 59050 -24445 -331247 -119621 -441801 -49218 -33187 5216 -61337 157016 -124277 -39267
20052 -186960 150408 176166 -71528 -38512 4455 31958 241326 145932 -313544 59571 -130421
20040 -58244 -19927 -131492 137145 -228600 75223 -53540 98090 214704 -10851 -302350 -230137
20029 -230137 -69400 -357507 35400 -182568 1315 -29853 175192 -208473 196491 -75 -99941
20018 -99941 -34088 173634 58462 -181589 -104148 -81200 69667 -30106 -38361 188233 -270698
20006 174864 176644 -8415 68095 292637 -180941 -75959 -16060 87175 -144065 -70661 -153685
19995 -153685 -262499 -143323 79537 -350774 53654 -86623 -63139 -265657 21937 233588
19985 233588 -400866 118675 -322967 30769 -296981 -121961 -226528 -44809 -251351 -193179
19975 -193179 34427 -58909 119261 -197617 -8441 -155191 -37210 293770 133097 210281 -455424
19963 -3838 100832 -65994 -69554 220853 -82837 316406 174694 -86086 83060 -330518 55444
19951 211785 201250 -52368 60916 -48520 -286832 174528 -258473 227561 -26956 -108909 137211
19939 93910 73467 -252000 75930 94659 -196043 -249750 -175326 117175 -302902 -317797 217868
19927 -303211 -159117 -247241 -180450 155745 -368339 186555 -63793 -221913 -36400 -2315 187209
19915 394992 -83363 -254400 219493 190161 -144772 86978 -53154 -283331 -273811 -39430 -206168
19904 -206168 -302873 9757 18073 -179786 -13200 23615 -173396 -28093 237003 -171766 -70816
19892 -105732 -116868 64994 -24046 107346 -2295 91431 132458 22444 -95095 80021 -166936
19880 -107466 -284175 126886 23753 -216074 67036 -57822 118778 -19206 -55124 -61039 70682
19868 -202527 -105277 -189124 4977 -65405 -90905 -7504 -268182 -38105 -64759 -234239 -8667 -85205
19856 -85205 -182115 151313 56235 -170053 -57981 218153 -207 -130407 -339531 -130382 -116147
19845 -116147 110450 -117805 -184323 -183394 208850 -40231 47577 -200854 300410 -372798 -302996
19834 -302996 -310942 -144413 -174852 53072 -89474 14603 -15793 -256254 -107693 -149072 -132204
19823 -132204 -81752 -147924 -121135 81876 249443 510024 -96855 -44835 -216522 48876 -184400
19811 113826 94564 -14149 278462 -575817 -51048 -204654 155333 46387 -10062 -204829
19801 -204829 194401 -302092 178261 -260485 -40535 -392355 -72131 325856 77693 187659
19791 187659 201430 38029 -176212 -174392 -209794 124241 -508209 -367640 -70343 -167825 -268893
19780 -268893 -137682 36970 375903 -213233 -144974 178070 -176121 169616 -167327 -359265
19770 -359265 3201 -164577 -39055 127288 84152 -283581 -97726 -62986 -25255 -99613 -99693 -48287
19757 -59711 213310 -120878 -168910 -135754 -86625 -150363 60244 -200300 45185 289128 58540
19745 64248 61806 178450 203766 -214499 -110846 -135751 260513 70055 -9725 -100859 59468
19733 -53407 -78864 62132 -162061 11177 553674 -123541 -337769 -243459 42040 79397 249357
19722 249357 -123090 51737 43081 128480 -201245 339448 -34287 -165382 -209293 -95051 105701
19710 -38545 309997 -92025 78880 -52829 -161338 -216610 382876 200961 -114879 70813 -10919
19698 162519 35087 -549457 41763 37049 -76074 81394 77797 52799 -7728 -88663 -294363 93812
19685 -49948 -4190 -41061 -283886 234223 -37279 34033 314658 48714 -269863 24583 8259
19673 -139111 185860 14888 360521 -115783 244478 -119509 -48933 3502 39950 -135380
19662 21811 -25725 -247935 -164100 -162578 -168814 63274 -132766 -187486 -49366 -72095 47282 -371433
19649 185040 -16143 -308830 -212633 -189983 -5854 -59120 -177300 -104203 28702 151228 -98725
19637 142459 -276594 -194701 -105407 -1822 94930 -14611 182448 404749 -11 -295424 60542
19625 -332958 230371 -262321 174929 -10805 -119193 -59193 109424 -113134 -135108 -42968
19614 -135461 3472 47799 -425548 -349872 92753 -244606 -82947 -251988 -126308 133651 -182339
19602 -208770 -139322 5047 -64621 -106093 59142 -239921 171237 50399 120661 203020 -180414
19590 -71439 56276 -132464 -117958 -36605 -140930 218016 158685 128476 -106142 46076 34660
19579 34660 -227712 184705 -50142 98226 -116040 -170573 147854 -2313 203949 -333079 -131867
19567 -31863 -192406 118924 -390827 206454 52583 -62593 -309145 67515 -106503 -147057
19557 -147057 -228228 -87428 44303 -113406 -144414 -249094 32493 -103623 34180 198570 -73165
19545 186051 -38620 -216336 -334218 -235056 -171358 -124474 13354 112320 6165 92127 100923
19534 100923 -34259 118550 -30849 315154 -139444 -189670 151227 -245742 39925 -94430
19523 -129217 -8773 5304 65618 4578 -255740 -166706 234726 20956 -137272 219538 12121
19511 -66147 -261788 -141509 -83820 135427 -292128 -61029 -56415 -18030 87036 218681 -13519
19499 100139 31912 -125609 -5987 31388 -150025 32541 -242123 -85632 56302 -12533 -40065
19488 -40065 -261692 -168345 110450 83899 -86939 96465 139584 -349796 117319 -259957 270473
19476 -61581 -3547 -211797 -254833 -3592 129999 167036 191663 -69356 -315074 -96185 -83613
19465 -83613 116082 -235908 29399 -281760 -178740 -65589 28688 157738 -470322 -347021
19455 -347021 -145157 -29086 -74296 -59615 218346 -94450 402898 71985 -215571 129667
19444 55912 -387362 72827 212254 106207 17506 50272 -93108 60124 82261 7336 -149277
19432 61104 338777 -7074 58546 97528 -199819 100843 60093 -290006 -329225 -131792 -372033
19421 -372033 332175 -185303 163769 -158327 63480 -238298 -6233 -91584 -72938 -12523 -261648
19410 -261648 34101 -362444 334794 -84079 -135219 183030 89316 230852 -138506 -131547 -98672
19399 -98672 -160967 -14970 59268 -409919 63046 -228727 -11702 -194720 52836 -110541 139542
19387 49515 220605 50327 -112661 -167036 96947 92204 241249 -218125 40849 -177267 -61167
19375 -195744 -42709 -20236 119381 -11587 294487 213303 -131644 286363 84569 -147354
19364 -320946 -171291 -106059 -128281 200703 29063 -24091 61825 -10326 143243 -184600 54463
19352 -149111 169694 -157893 -240256 -203867 -162413 -79212 204392 -328318 -58866 -48361 214088
19340 -310891 -71103 -115164 -8642 -324137 94578 -14062 -157056 -338541 -75543 -120464 -198216
19329 -198216 -187934 -269891 -114077 11412 34356 -56851 -102421 274071 40118 -88979 -125766
19318 -125766 -54076 -41246 -1525 -197448 -99107 160446 208067 54537 16490 44498 55445
19307 55445 -33079 132050 -182325 56678 -24724 173109 -320906 -253562 141324 87021 -90090
19295 -53243 -154710 -86687 135451 -333531 26094 -268942 -101372 -171442 19302 67859 226345
19284 226345 74205 -217975 107484 185237 15155 -238612 155895 94846 78328 -104155
19273 -18339 -260215 -122524 -124439 76890 -170020 -32546 -114674 -89229 -321930 -87500 -278384
19262 -278384 -35651 225145 242476 -231701 -152928 -416337 118478 78506 37537 125777 40589
19250 -6634 -32033 -379166 -280309 -129806 -43348 -234533 128810 -45587 -171531 -77054 129692
19238 -253783 -60162 -284553 4933 270688 -80423 156564 37448 -80785 -10736 -177003 -161946
19227 -161946 99228 -122217 -22487 -115428 223376 -218672 -52494 -9118 6559 -224175 10940
19215 -214279 -102424 -203587 210000 20741 -216999 -109411 224767 74262 208880 135967
19205 135967 -303561 -187797 -119011 -112397 -183298 -191858 -149821 -186743 132882 -208121 352086
19193 108500 -39145 -118938 -2382 -239666 -96882 -256310 153795 -101333 -281437 131952
19182 -96727 285414 56430 -331342 -155856 34427 151731 -191165 -214986 -144032 -137944 64941
19170 -1920 -106633 -145226 -277280 60307 -59658 -110116 50881 24972 -159013 -135420 -209237
19159 -209237 -217034 -152953 171329 -224100 -111112 -197182 -138186 -128262 294810 133091 -419059
19147 -27092 109460 -245839 147140 19915 120172 50503 -177939 -121682 27347 -271767
19136 -197737 76410 -112602 37443 446 29392 -26734 -369598 -46562 211443 -381205 171651
19124 116398 37863 30902 94179 -170594 -22533 -7319 9269 -110254 91469 60523 57079 -152581
19111 251526 -195872 -198562 -28805 151353 -258258 -76343 -136018 -209801 66440 -250314 313464
19099 -220392 -19110 -32137 -151807 -21668 224547 -308402 79549 -62030 -25408 -22075 -420827
19088 -420827 -175689 -24695 -145981 -228848 -101327 -91628 -71011 138951 -308118 -274946 -220761
19077 -220761 133293 -67450 -366977 -33881 -42281 -52121 224145 67141 -138769 -21927 -106787
19066 -106787 -47347 267142 -122575 194474 -148953 -60508 16730 -531297 -100513 -11638
19055 -394563 -151134 -193321 -23088 262720 -67315 -149912 8614 -101488 50621 -167845 -193278
19044 -193278 -74955 17716 -239237 -154484 122045 146655 22443 220531 -194941 -30548 -119759
19033 -119759 -213561 -188304 -89998 193400 -436664 -96557 291843 -201225 -45224 -41996 -294783
19022 -294783 227862 301053 2578 59299 -9098 -161089 -55369 100589 33786 38762 276050
19011 276050 -377849 136108 149790 141894 140970 65394 102378 49531 -52008 21920 -406301
18999 275593 -197018 -18694 238275 -187679 -226891 -326972 231428 -335649 -246227 107125
18988 -174686 332625 -124460 -115720 215914 -20802 -73464 74157 195635 -201270 -107369 356703
18976 41326 -62246 335014 24934 50984 -146639 -140695 -63653 53362 168629 -324570 -201340
18965 -201340 -108081 19511 80607 154612 -422289 -19838 -312619 -93884 -27489 201812 -108020
18953 72695 -49862 50648 -139754 -72860 12675 15124 12104 -100070 -237459 249723 -114853
18941 -227314 -26163 228493 98575 61140 173349 -307157 -284488 -75231 -91418 83927 -225117
18929 -136536 231910 140055 31822 72827 -132623 -71629 -257710 -25997 -107987 -121793 -180043
18918 -180043 -73175 -89416 -194345 -293855 27438 -83071 54665 151883 342538 -150290 -157191
18907 -157191 84283 231196 150521 -101695 -46294 -93246 -100719 122455 -392757 -207402 57745
18895 132306 -128478 253141 -339511 -96490 -54021 103885 104956 -8177 102537 -164278 -55902
18883 -373668 -215637 -233226 -280945 -157062 72644 -143950 6022 -279384 -213745 -9354 -201228
18872 -201228 48903 -80430 -92112 381514 -157969 -28289 114755 -9067 -98691 -101782 112338
18860 61629 -5508 -114981 -445880 9973 122710 207104 -375936 246019 -405353 -108541 -323994
18849 -323994 -50884 -119409 -35689 -46276 -458893 12811 2870 -173448 -28954 -164365 -31888
18837 309009 119833 16109 122115 40521 302154 8316 -43227 171527 9812 23280 -115287
18825 430311 94483 -50056 -176576 -294400 67228 76216 9431 -245565 21457 -188864 -400075
18814 -400075 -215115 -64487 -112329 169435 -377092 -158060 -158096 -235516 398784 264761 -12898
18802 987 -64220 -350600 -270500 -73563 21087 199172 95243 242181 231261 -22532 63913
18790 -244600 -3632 -257145 166702 -66371 -151024 -255195 51623 330928 -170723 -249198 -107541
18778 -197856 -133338 -114233 -29746 -206343 320536 -4853 -9256 -154953 37742 -14640 34471
18766 -230896 -187070 -187081 -15749 -114245 -368990 36622 48170 68504 -1048 130226 390113 -102779
18753 -214278 -443017 -10598 316966 235593 7945 65957 -63055 -102004 234471 -346255 -105469
18741 -56124 -77862 -173115 -81988 -386316 -345161 43919 243740 -22764 -386556 -294249 28427
18729 -239924 -85808 -98636 84260 -76773 51195 145081 32559 -186125 179253 -51961 -64291
18718 -64291 -307092 -210623 178012 -239403 -182633 -29697 -135225 168157 -232786 61432
18707 -47205 55432 127325 116196 -144605 251217 -118558 302791 -62803 -191478 147957
18696 -35317 85480 292179 -332936 -205142 60399 -102181 74897 -127162 -188832 -255917 -121940
18684 49151 45379 -32554 -190432 -149752 30887 -427224 24155 -160694 135666 -100729 115035
18672 159174 -43350 -17412 -8553 -167886 254843 15612 153483 103300 -281694 47900 -176015
18660 -61891 -105487 32616 -205512 -103480 -24523 99836 -117584 -114677 102795 35582 -80972
18648 -122233 -145028 -269227 21061 -184795 71430 -222530 -203008 97755 -38333 202705 34854
18636 -2466 -298267 248809 -233610 137400 -168198 183424 142386 -112690 -68473 -143385
18626 -143385 -273791 -189586 -221971 -55506 284152 -77610 37909 174424 -89652 -186062 -85527
18614 150652 213369 -440360 139774 -24978 -25686 -153988 248891 -78449 -367324 18777 -98394
18602 62339 15830 136454 -160171 4185 100266 45310 -132858 247570 -165476 -136908 -244569
18591 -244569 -198377 -24081 -91214 -47695 -192770 115229 -248522 109843 -43267 -142385 -78248
18580 -78248 156314 -66100 -11621 242170 373151 -201611 -118122 25342 181931 208770 -66906
18568 -11629 -242214 217384 126838 -55612 26623 22362 -30764 -174736 -279815 155116 -164535
18556 -106731 25303 192493 -71114 -181912 4052 163598 -271296 -105566 79202 -44193 39712
18544 -218401 -216091 249377 136668 277929 201130 89909 271445 106082 140987 88060 169987
18533 169987 -54212 -292115 43883 -75910 2452 11192 296979 -91813 -198929 -60872 -94291
18522 -94291 -130495 -51699 85207 -93302 12068 -274714 -133856 -25056 28607 121974 -115585
18510 -201788 -224589 157673 -156341 -29041 34350 38970 90341 14154 -67274 -90014 -59273
18499 -59273 -243553 -76317 -152479 -145092 -79422 -188545 -85016 103458 -99818 -175843 52236
18487 408831 -81408 -98414 -264561 -217457 -156799 -384595 32506 79099 -57414 -152091 225217
18475 -291608 47108 -169953 150717 -146765 119055 -82193 -49673 139237 -274740 -25703
18464 -32630 -95985 -297168 141450 -439916 -56390 283159 -125718 251154 126532 -149535
18453 114407 106493 315588 -3251 -164577 -157699 89798 -296406 12842 -118178 133756 -122142
18441 -56866 -34626 -159142 -21947 -254475 -37134 -41827 121364 -191995 -139993 -163006 -129578
18430 -129578 14680 156137 -137346 50246 138446 -143505 30132 214297 -301055 167914
18419 -66926 247392 -61059 62370 93925 141885 92908 -265181 -119768 124260 37098 -161864
18407 228288 99688 55886 250799 85500 -163279 102451 -110770 -242038 -128006 -191966
18397 -191966 -61157 921 -112370 -41237 126426 100849 -249877 -185166 1866 -124432 97604
18385 16192 254758 -242936 127039 127839 -18204 -19858 352979 -289448 -326847 -2622 -172409
18374 -172409 -42374 31792 120067 6614 36451 -24396 5484 -126350 -50452 -233686 175061
18362 -251014 14189 -68004 -143241 -142414 194275 -304701 -557055 -186126 -107098 -41999 361711
18350 327169 159657 -307325 -67980 14865 392492 -31148 -223785 -225172 36844 22582 139838
18339 139838 -111468 -142125 -97804 52741 -87060 -171335 77858 165400 9646 -98787 230523
18327 -206488 77597 -166705 -153269 -303744 -253672 113029 -208778 2876 107997 -104226
18316 55560 61470 -48973 -113417 -127292 195966 -164919 -68053 -172905 42601 -23555 31081
18304 200439 -226651 -72431 -50083 168813 -251367 -272743 117047 -130263 -147503 -118552
18294 -118552 -122552 -163211 296168 133308 -200729 -8683 203542 164512 -135239 -2538 -141927
18283 -141927 -95868 -279073 31408 257345 -133832 -260273 149939 -31784 196487 -355655
18272 -136602 74955 77148 -133850 -115638 177675 -52436 -38335 -112352 -16106 65387 -98393
18260 121997 227016 114897 215322 -109443 -16355 -204269 -228702 -5214 255125 -189685
18249 -63355 63909 149139 213635 -109814 -56643 140305 -343762 -40679 -222675 -89041 29508
18237 -146526 -44811 91769 -162097 -193042 161299 -346288 -126123 76365 -54732 -9199 242008
18225 -319793 68187 -69895 -60250 35183 41782 -62012 5557 -160522 61096 -164634 28116 -137107
18212 -65987 -101335 -33382 -164370 40231 -91897 -339352 -164588 -191521 147052 -336704 -160083
18200 -158693 -127360 -61974 9180 -990 237405 -250482 51422 92622 69896 -152686 108648
18188 152889 -41165 -69218 -272399 113971 105849 142326 162969 -151280 385621 7502 -41612
18176 40362 110651 -91997 78495 229287 10118 -176677 27114 67819 -87734 -134769 -73935
18165 -73935 557494 -226579 -67275 -6834 -93121 -38377 75907 -191275 6050 278240 -265991
18153 -53708 -118349 28167 64436 -239735 -477870 71207 -17724 155651 -360371 -247746 -166140
18142 -166140 44845 10368 -75296 -37154 -24197 270083 100338 170771 334170 60774 158072
18131 158072 5289 99280 -229628 -58992 -216855 -188338 -106643 275416 -219034 -137626 149569
18119 -108739 34908 -13742 -61465 96120 136354 15571 60914 -190819 -450895 28656 -80729
18107 94825 -167258 -174043 -333992 -17585 -49994 -272871 -61438 -219892 -102546 89300 107462
18096 107462 47243 214717 56523 -103848 -194338 -305109 148337 162702 199652 -307461
18085 -280896 -35016 161914 325136 -48521 -118248 357286 20598 117475 122070 84626 -96520
18073 -251850 -142749 -113930 -87489 59431 -32107 37108 96805 -317631 -262710 70557 -117561
18061 145082 -74823 119958 -78325 -256466 -198219 -304608 47216 -16802 8379 15593 129902
18050 129902 73495 -189709 -143943 -153340 422539 11375 239949 66654 -51767 69191 206891
18039 206891 -86040 -184807 -191664 188184 -90716 244690 -168875 89457 211031 -301281 -46896
18027 118062 -80310 276571 39337 14865 194088 451419 -80646 -273975 -364247 81559 -98664
18015 -141193 -174851 133451 -57625 -86413 -122414 -126856 -202322 -43963 118086 -42684 170262
18003 257516 65468 245697 166440 -209937 -143039 -288406 100845 -154605 -53701 194968
17992 265138 -281623 62899 42926 144420 -198893 -24855 -174043 148350 18165 215347
17982 215347 -96281 -221599 -199682 78765 -126194 693 -45064 350028 77907 54647 -131632
17970 95371 -155700 -418835 -296282 -299175 -193752 -204268 68005 -563445 188142 -30554 16793
17958 -65457 -133191 -113015 130195 16750 -475745 54626 -192433 -98589 -26448 -75042 -18394
17946 -115040 -139724 92033 63361 -116561 84381 -79456 194945 -148735 162845 -102336
17935 -62817 -265960 90820 -337430 -111636 63499 -1760 215120 -278125 90028 19233 25697
17924 25697 118167 -119791 -176156 -308517 -216051 -108788 50919 5842 85990 -127896 -7039
17912 -54714 218603 -61786 39468 -120855 -129243 -157571 77089 -7094 205119 176079 54939
17900 -149464 180955 -404214 -13049 -53069 -13852 809 110412 66231 416329 -62880 -73340
17889 -73340 10757 -123854 -21883 -341021 -69330 10312 -25921 -160023 13652 145574 85836
17878 85836 -38392 -81271 106048 151500 -34021 -24294 83360 145085 164270 72507 241613
17867 241613 126393 112186 186801 -57959 -84654 129453 28493 76568 43102 15685 -2086
17855 3724 -266136 -342643 -61358 265492 70570 -33773 -132130 -104013 -173023 243333 75864
17843 -250615 -557 -194162 109530 -47924 113374 -92023 -200679 9453 228774 24617 -184338
17831 18365 -27162 36316 62149 -78134 79741 -112435 -10093 -138589 148226 183607 147260
17820 147260 18485 -237746 -140954 -78521 184908 328051 -222671 -33356 66645 163008 -188028
17808 -198427 99257 224704 198261 -165879 281333 236057 87535 -86404 -260227 192813
17797 237510 49190 -339527 -225651 -4908 -10630 -126870 -104555 -5109 151295 12467 73011
17786 73011 -50965 27507 76970 5672 -24672 161451 -106813 182336 -147964 17181 8307
17774 42626 342500 -56866 20771 -193160 -32957 -76979 -75391 279491 -100061 134778 -166203
17762 -263091 224095 -224987 128508 -276793 -441137 46300 -245358 191674 78743 103334
17752 103334 74311 147716 57933 -19592 26554 84476 11971 -149961 90272 -275480 -170229
17741 -170229 -104394 -80430 -12911 -76897 -36203 10854 -137135 246453 -125300 -111068 35326
17729 52444 -35374 -222917 -41015 -143166 3369 178288 -94597 4156 -158971 -81819 31101
17717 -132069 -183289 -191367 122955 -64826 267857 264868 -120741 -106301 -197641 168907 -140472
17705 -11389 64301 -184771 167051 154140 -252479 253794 153614 23153 22652 122310 158848
17694 158848 274294 -94485 -222399 -2184 243182 -91421 -12370 42416 -184509 348752 -151891
17682 112404 108480 -80773 146793 -90242 213804 -156945 231988 235516 130631 -179286 -52853
17670 -236444 259986 -157195 -225276 286336 -345943 -34364 -127663 356599 -470226 34330
17659 425368 -8351 38111 -81682 106654 -85688 1442 39560 144526 233261 -168138 -185962
17648 -185962 293856 67634 138370 342151 -9481 -131961 231932 226249 38766 -319335 128346
17636 89369 -22593 -230392 242518 -112202 257549 149180 275084 -167987 117732 -31459
17625 -19734 295044 -170408 -290252 -4223 144720 107769 287106 -184356 -37574 -60887 -182474
17614 -182474 152826 20436 200512 138782 135679 -52235 -179438 91522 200740 -152442 28764
17602 65051 163092 25061 -2908 -302938 59141 -62298 222800 235364 53452 131328 210787
17591 210787 -225800 71290 388748 -118535 -58488 -19008 70005 -63119 95965 -26452 -12787
17579 236861 27568 110983 47284 -49184 39623 223232 124760 -103819 308105 297582 -348571
17567 189367 -199142 -224121 -193345 53878 189766 131855 -24933 -2404 45059 94416 -2780
17555 208957 -343641 -146008 174267 197269 -304580 -212512 -154888 -81259 30350 -428461
17544 455108 -23878 94058 -17173 -193943 -53255 -195937 169472 142762 265417 -130699
17533 218590 162751 65508 254965 296857 233331 80597 17971 260665 150955 -157452 -7696
17521 158729 160818 123093 13188 -9699 155056 292856 256105 54893 -141878 -97283 -129180
17510 -129180 346060 104871 -26216 -97650 -109191 192353 118364 -75331 51504 387940 98373
17498 201333 -82210 205324 -156502 94377 -165578 -4939 140489 -45374 332880 51985 39121
17487 39121 94984 551542 22005 -181654 -38245 374031 160265 -126164 -89391 -269730
17477 -269730 131697 -210759 110131 235483 70722 110572 -31320 60801 -439828 169943
17466 332248 265556 221437 224773 195532 129061 393082 282290 367287 -35496 265473 396356
17455 396356 -101661 227041 -40612 -116259 99818 -100893 187644 390983 -128633 -45308
17444 180540 -89260 311715 -19085 301676 212876 203952 304005 354682 225571 397001 446189
17433 446189 261507 286287 248956 472602 -42442 148035 20536 72738 511516 292594
17423 292594 287683 291917 126930 311156 302961 12747 90031 -56108 298530 215475 39337
17411 92008 271149 125163 314152 122218 113362 37642 124268 -73055 -173872 156026 319308
17400 319308 239877 115373 29360 -84673 49091 -7781 109667 267736 221701 440195 -20345
17388 167055 354228 167694 89152 -42920 318266 397047 337590 90567 83378 114637 177094
17377 177094 97910 198388 -3565 -18013 534409 48280 120481 390141 370077 313296 119395
17365 260487 -157667 -144960 178477 111065 -80815 -151565 -141824 -305103 182756 218963 248110
17354 248110 -95908 -113488 -64395 95988 -156731 196450 -91984 232292 -115165 25537 124576
17343 124576 291464 176697 72340 160126 -47573 350880 31921 -3325 -103025 298116 142573
17331 -105223 356787 119671 23105 133539 -161003 234027 193918 366545 110565 -139319
17320 73469 288967 51497 270751 28824 -1901 169489 34650 -38664 -25023 195416 -6488
17308 -24656 480538 166738 217489 -8657 191926 87519 237059 202626 316036 69009 162495
17297 162495 149820 104120 192225 248155 60645 8737 191026 25595 219762 32792 135898
17286 135898 71770 249693 168321 262164 507900 315148 131551 141964 59916 421601
17276 421601 101128 409437 132507 252354 -131622 446508 24253 196506 141370 358984
17266 358984 316243 208411 232540 -15959 -21741 135773 -44260 207216 69495 89277 240190
17255 240190 250332 466813 221738 22939 567511 353290 355722 -51872 117556 33725 314794
17244 314794 161125 171671 132715 70317 280717 264707 15874 181190 387967 163697
17233 219182 263580 276103 256184 365078 423274 259846 391642 259746 435915 204417
17222 338678 367447 265644 -300756 88186 -77714 -86864 380709 144222 239900 13953 156098
17211 156098 -2329 253948 259458 416368 230615 487707 331526 306467 97788 428634 359799
17200 359799 334865 172661 98816 392317 240028 112715 380510 46412 241395 249537
17190 249537 254575 -48458 -47530 87090 155044 137407 475826 333601 613814 259932 109025
17178 -112994 429370 480380 143480 197511 160910 333327 393035 360139 652393 366125
17168 366125 143916 540110 206835 56675 460299 449549 501733 155775 465963 291330
17158 291330 285792 252360 224805 471755 441675 328300 61115 421157 251434 405843 12149
17146 397580 339306 205563 242656 31391 252057 557 382475 126996 114114 407819 225087
17135 225087 248691 59433 525978 419103 35062 762514 409219 67978 303919 160019
17125 160019 336138 464068 147155 593587 101913 393906 359083 196630 343069 610920
17115 610920 455641 303441 444485 232459 240567 326918 290629 276512 512067 518872 257571
17103 436447 336842 452052 464407 607691 228853 418704 402644 511350 330412 309668
17093 309668 444483 181051 51273 513666 510139 73356 635212 423719 496654 447290 552807
17082 552807 759679 613179 172184 513805 227954 190957 819511 260573 287238 441490
17072 441490 585410 549495 164914 280422 121131 313587 576222 311835 456042 444777
17062 444777 327497 758544 698991 420745 398582 534779 314989 456205 412849 836695
17052 836695 618237 477800 680199 505268 368398 403801 373064 594387 432411 507484
17042 507484 485394 550483 492258 429494 752037 593860 679143 694633 459868 765969 316018
17030 748843 510890 611211 932265 464048 663292 406626 718645 701820 950247 291232
17019 471613 407016 402975 613192 703852 1018367 306799 186126 551798 479928 737473
17009 737473 308149 816222 676847 741710 669245 724319 320157 720236 641801 837942
16999 837942 870199 616479 717792 574985 748350 693846 492012 584506 699693 971532
16989 971532 778371 674648 709509 998623 960711 1008161 841591 777367 959604 520639
16979 520639 866269 820306 888357 640148 945369 561398 840860 963272 845925 1045776
16969 1045776 1101112 725450 878345 819445 1077804 1092684 739783 836839 818771 957337
16959 957337 1001206 985378 1027171 1066146 662334 1181113 1044059 828380 1032010 1074295
16949 1074295 956017 780393 790571 1335584 849734 1252260 981228 1115123 1368311 926176
16939 926176 1166726 1339392 1216830 1120750 1327226 987980 1437776 1344750 1312775 897706
16929 897706 1373306 1234255 1239238 1423806 1178194 1199636 1203942 1330614 1659188 1336362
16919 1336362 1258524 1123273 1492861 1250009 1455057 1234240 1365343 1138477 1439927 1613570
16909 1613570 1499595 1810758 1435494 1286574 1592792 1193039 1624151 1709246 1415554 1629643
16899 1629643 1545846 1750316 1581942 1878430 1706624 1524822 1584606 1696800 1805195 1586641
16889 1586641 1800510 1708501 1755799 1865134 1997405 1846156 1633680 2164054 1801374 2010928
16879 2010928 1956839 1918991 2180051 2169689 2216639 2462869 2188019 2113130 2006275 2274514
16869 2274514 2085693 2320691 2125038 2737056 2376877 2366879 2597934 2284280 2394051 2531329
16859 2531329 1993614 2542386 2974314 2463779 2800085 3004654 2848723 2950843 2715811
16850 2715811 2755093 2887638 2959573 2997518 2787581 2759037 3408380 3104522 3215064 3025871
16840 3025871 3448266 3304882 3667720 3676819 3388956 3669973 3709585 3753635 3699652 3895554
16830 3895554 3789897 4118144 3866228 4099676 4091936 4337411 4317233 4240413 4218941 4273741
16820 4273741 4744647 4569062 4702371 4614156 4684379 4980127 4851266 5067126 5356590 5260689
16810 5260689 5192993 5447849 5832129 5433299 6140865 5954990 6018268 6311626 6306362 6519782
16800 6519782 6545952 6607637 6658128 7306511 7198238 7195394 7258178 7508951 7659077 7780360
16790 7780360 8020650 8135122 8653538 8942071 8801435 9092801 9318770 9400322 9910844 10227958
16780 10227958 10342528 10815931 10767366 11142390 11399641 11562228 11858643 12409497 12632445
16771 12632445 13216499 13683834 13874320 14258810 15031479 15239187 15870354 16405442 16607497
16762 16607497 17295082 18040012 18640892 19156288 19869923 20084904 21112129 21983553 22606395
16753 22606395 23647428 24230634 25057930 26153321 27270118 28617633 29619277 30844662
16745 30844662 32264589 33360010 34757729 36300485 38275071 39651538 41966781 43693484
16737 43693484 45621719 47955615 50255562 52875064 55552617 58761760 61384195 64767145
16729 64767145 68427669 71988695 75992454 79957197 83994859 88885064 93704335 98422553
16721 98422553 103944655 109207886 115444942 120708404 126293552 132108998 137763912 143269873
16713 143269873 148583115 153780859 158175006 162132653 165232153 168094469 169815069 170454155
16705 170454155 170567812 169348941 167371124 164632504 160832735 156789591 152098553 146814829
16697 146814829 141197023 135233402 129660566 123221785 117670307 112008826 106384621 100690723
16689 100690723 95723605 90692284 85801756 81432233 77038728 72973184 69095474 65841091
16681 65841091 62365371 59359065 56370819 53358134 50924160 48295023 46335863 43971545
16673 43971545 41869526 40308821 38327679 36706923 34872881 33662598 32236641 30755897
16665 30755897 29656059 28019747 27067384 25865130 25004704 24302615 23235382 21951940
16657 21951940 21687108 20687383 20067991 19054406 18648069 18056767 17185235 16826194 15907962
16648 15907962 15494137 15082637 14346662 14347698 13821660 13220583 12699631 12725285 12132902 11833009
16638 11833009 11492765 10999232 10828237 10346446 10314559 9688607 9522942 9644064 9133211
16629 9133211 8841311 8586096 8494999 8301355 7892896 7681872 7745298 7878922 7310134 7120294
16619 7120294 6783154 6714970 6517325 6306890 6208303 6372992 6152235 6149549 5884972 5759626
16609 5759626 5686185 5056674 5369357 5252760 5526924 5108484 4841622 5131327 4427422 4815916
16599 4815916 4628599 4401816 4297821 4389888 4343756 3891115 4092335 3894534 3620482 4053463
16589 4053463 4047052 3712800 3759554 3584513 3501844 3358197 3169369 3351567 3226757 3514952
16579 3514952 3115714 3246805 2895750 3375339 2643543 3016775 3010431 2835308 2690633 2680745
16569 2680745 2731615 2627859 2639151 2403422 2520419 2602557 2180768 2323726 2173432 2385983
16559 2385983 1940807 2302255 2186398 2279880 2142746 1853786 2185785 2376980 1784133 1748698
16549 1748698 2158562 2010717 1788570 1881006 2058144 2059037 2034366 1575308 1716051 1808070
16539 1808070 1909182 1867051 1457450 1730703 1929942 1397101 1677666 1789692 1421637 1761926
16529 1761926 1370049 1510603 1501893 1527239 1220256 1207037 1449838 1616205 1352415 1464317
16519 1464317 1311450 1230946 1297235 1336158 1384702 1165075 905381 1180754 1179498 1202482 1113122
16508 1113122 1212897 1015234 1145447 1046287 976871 1005560 1170575 1247871 1159083 1002214
16498 1002214 1055659 888777 1072719 969587 1200617 914989 881339 841480 739573 928897
16488 928897 1152887 826779 733951 924758 745965 991364 1079652 767248 821216 800090
16478 800090 762983 1042967 929527 657886 1090817 836496 729297 617704 915788 1089114
16468 1089114 852754 663140 838249 596316 524196 674130 812993 1203747 376083 399574
16458 399574 839009 795666 713101 776886 802952 628739 676533 647110 422972 559418 591263
16447 591263 748011 748578 382561 619159 449708 539880 724531 403396 769160 921773
16437 921773 569074 648544 584566 331601 498642 591445 625147 322194 268320 665593
16427 665593 443775 484130 701782 797468 465890 347516 311430 448618 430816 570480
16417 570480 576320 308160 455708 298829 646896 348558 607082 530812 644350 730806
16407 730806 803740 413418 392284 521373 383602 592364 265667 683688 211679 544840
16397 544840 370043 203467 485449 380036 372899 436861 303695 383244 257559 228196
16387 228196 161912 383358 182893 474827 560610 463902 341070 421825 319380 226702
16377 226702 177925 471768 556547 318194 326687 365962 294996 372899 308328 253042 520086
16366 520086 142172 22111 404871 258445 253397 174929 117525 373365 234276 83119 261346
16355 261346 93898 274345 40532 502822 318700 373189 38727 263198 157232 -50115
16344 363275 370546 424201 358688 234362 25544 222309 214953 -55634 131823 426080 133075
16332 637434 348458 330780 72209 154427 181876 258973 328933 78911 309977 390245 415334
16321 415334 153764 71432 464226 -111033 441257 293080 347390 -234902 26184 119996
16311 119996 -189871 117358 163088 383058 -121043 246274 -141222 -87202 435158 107137
16300 328569 -142958 102282 171487 192914 19459 293336 180294 245492 -296425 -32214
16289 50235 -44488 47204 25548 27021 84759 64875 210688 360284 137127 69693 72178
16278 72178 97826 111371 238829 224238 103795 118086 -158304 176919 269125 408620 -184997
16266 56420 35363 407161 88719 397453 -166471 46344 -126037 9030 158265 -281337 -14020
16254 73992 34325 36179 191055 243923 45105 95801 81221 186615 241264 79197 151582
16243 151582 16145 189114 371126 57219 139663 17498 -214287 -173825 -36277 117595 77888
16232 77888 218290 -52004 -50482 537290 43411 321479 385011 -43557 287211 -8974 198674
16220 -433082 74360 53055 321712 341186 88638 3824 -126560 173447 258277 243806 442303
16209 442303 -75916 31264 136541 18419 -11957 -19229 47581 88971 99895 -66954 37766
16197 -54050 168585 -252455 74157 -119297 89532 77493 -133718 270137 341956 410790 81468
16185 -48151 165016 -58030 42217 129042 -20730 12237 372179 266907 -55310 168788 69936
16173 77866 -135441 275616 108213 330797 155568 165701 -212382 267984 42296 -43090
16162 -171552 450385 201968 50282 175935 183947 -138822 -237257 199159 -175621 53477
16151 -289924 -217972 205997 -141882 167015 -115306 -132044 42244 73276 503691 -14459
16140 86009 -165457 72371 -215006 209858 36018 266001 -61748 -187541 -66094 -157456 143460
16128 414387 212031 -72689 209276 20372 142697 225133 -76977 -54602 -143939 -172408 28711
16116 -130472 -239369 53367 -12282 489592 43520 22068 -78264 88095 12343 83698 -298354
16104 -161273 -240529 141839 -207542 70283 342697 27835 -34817 -138474 204462 83489
16093 -203369 -130394 143712 63977 313543 388326 -113708 146381 -96163 -361299 -36854
16082 99534 83645 12414 194675 66226 102229 -143833 216877 -329736 -13366 -194420 -108791
16071 -108791 212947 -19646 -91761 -234589 -29006 226804 -20551 246275 -148905 79990
16060 -96048 70957 55970 -64891 -344295 -335158 168134 148705 214676 167913 92809 -214343
16048 -15797 37834 33752 -122796 -149720 -60624 -304644 -111575 -54932 -105011 -82921 37446
16036 324464 -266517 42480 26466 134599 -41812 -7591 78374 200672 -23604 -247093 109990
16024 -193121 155748 -137932 195129 187100 -123020 -42477 200591 -446092 70913 197014
16014 197014 117262 83709 128265 -154335 -172984 -201615 146838 43577 -285495 -221930 149362
16002 -347141 -72474 38628 381739 109711 -183356 75220 70641 72522 -56850 -80574 33057
15990 -210527 -25674 49809 -235196 289113 14874 45563 122787 146832 292949 27521 -285929
15978 -131856 -108813 208202 252884 302649 -11324 78401 294028 36798 184145 374509 544332
15967 544332 13542 315302 195080 -1118 -32018 -82617 -21590 55125 105665 265528 -327783
15955 -90993 -76764 -62389 -169695 -96624 -450364 -40105 -106177 323523 211298 -275752 -36017
15943 -14649 -127830 237997 129200 -156980 56187 -180020 -162590 110504 304339 82259
15932 -140922 -26111 -63682 -95270 -296789 -13149 136321 -283818 -42370 -209859 -476314
15922 -476314 -177057 -143266 141580 -156274 130529 -108225 -43238 -104289 -34976 40970
15911 -53817 -111237 46443 -81923 -62792 -212018 41919 79299 -79345 -118271 28577 -77544
15899 -156742 -68885 -239950 8680 -148890 -177898 -134641 -41184 -12760 -69169 -208453 577032
15887 -156097 -48397 -303786 43610 114548 -3248 177173 -115400 -161950 62723 -29359 -56764
15876 -56764 25454 -34926 -46809 26726 115320 144125 -93669 -31585 -188307 5673 -57020 -143039
15864 -143039 -268119 191399 26628 -273577 -212389 145193 60999 140694 9726 66487 82989
15853 82989 98650 -106765 -239630 -87287 -79822 -311463 18624 239452 -21867 41170 105021
15842 105021 346127 -39204 452837 31262 -253717 -153405 112278 -196614 -63591 -218088
15832 -218088 30125 246340 -121231 -142405 -95693 42387 37190 -71037 -47773 -11482 178511
15820 -60696 61853 236700 -44701 -94294 -57046 15467 -150908 187079 -51082 -132589 112461
15808 -118946 -274468 222291 -41194 -101310 92618 86688 499828 -213619 84659 235668 289363
15797 289363 135926 258769 11707 -155116 -19323 -175956 -20666 -74838 -176783 -292049
15787 -292049 -98906 -212752 275547 -120633 -19928 -23884 128580 -19860 -64919 -45608 -2871
15775 13203 -96376 943 328998 -95917 47821 -364350 -136691 -141663 156597 -6863 -193135
15764 -193135 88492 78347 -220279 104320 -271735 -182704 -33026 -322649 53882 65815 45101
15753 45101 -57231 89395 84837 251184 68465 -209640 140456 -18660 90440 232767 199086
15742 199086 -26799 164656 15784 123530 -204595 135013 440651 196992 -94766 -280635
15732 -280635 215370 -614281 -68541 -127171 -65523 -181837 -38541 -114617 309982 -94875 176267
15720 -185642 -119517 -215801 -151072 -43935 -46111 429951 211241 13104 -26529 287300 3831
15708 83209 80262 2040 -99593 89013 130127 -117725 -106110 51549 -12809 251468 339985 -143374
15695 123661 -303681 39532 -121973 45035 30611 191068 -212757 91347 -18623 -29332 101850
15683 39067 209530 -51823 -66160 32701 245043 89015 53276 240837 256033 38541 -116363
15671 283264 -154700 511 180959 237781 -120217 -40508 91826 95686 -533185 -5221 -109901
15660 -109901 -46656 393409 -100395 -253888 -59358 -53876 -316935 12575 -1031 15464 44667
15649 44667 -2420 17530 30278 152721 -47262 -50739 442147 -269941 -350722 97401 236037
15638 236037 -220542 44750 -4529 -60121 -15087 -30355 -370149 -89360 -30846 59943 -230154
15626 -222867 -182389 366228 -122707 -117774 -92030 -31512 40051 -85468 96474 109255 79797
15615 79797 41558 23744 -5773 -60020 -104332 -227255 -12964 43674 -135665 -260460 244026
15603 345724 116497 123707 202065 -77225 -16245 200276 202284 91932 -114837 12381 -137341
15591 -71632 -272749 35316 -168145 -329238 60551 -97260 35225 -14559 183214 -45895 -11330
15579 40404 -55278 -259234 -174187 85514 133167 -31437 -148771 198205 -226895 -186433 -59544
15567 -122747 371497 -3089 -193500 -309005 -83604 -37171 -140881 -142454 -273082 -350966 -91502
15555 -199738 -192660 -239766 49046 -318215 77342 -185454 -28180 -261257 -73173 187768 -430231
15543 -46183 219016 119165 114490 -303220 -13831 -152276 172652 -134474 89801 178410 -164079
15531 -110487 -54420 -124169 -159714 -2890 -169261 214226 -79781 -344529 -84602 -93096 -107818
15520 -107818 92098 -201147 168649 292864 -32669 73217 94783 164901 -382477 25908 -82795
15508 166134 165534 -68421 134210 61837 -155221 116826 -113789 -255327 -68212 -134373 -49983
15496 -47962 180707 -70708 65459 -274411 56848 168455 118941 4880 -193552 126322 -56548
15484 1907 -119638 -60503 102782 -11485 -128992 39497 241631 45328 -216272 68976 294378
15473 294378 144044 61340 20323 -174 248775 80148 -88554 -101779 -349824 -152233 -200696
15462 -200696 193611 -118594 -211924 68899 103268 -3779 -143021 285399 1446 152116 173553
15451 173553 -14787 198865 -51375 206990 -153483 -217441 56040 36537 -62757 28093 419090
15440 419090 -13148 143927 104620 89451 -187267 -37849 209543 386677 -5621 190820 59682
15428 171216 98343 134204 83306 121418 -242303 -2347 72522 -104684 105769 147590 -127375
15416 -214056 233938 -261753 -193846 -77573 126544 106521 47078 312802 283258 -85826 40059
15404 -87038 249660 -2657 175160 -190368 -7329 -115616 -353263 -291153 -30438 25007 -52125
15392 -136664 -85153 418926 -151963 -131571 -160751 -167709 40192 -209778 81628 -38227 252528
15380 29474 355923 -188601 -1295 114824 128182 -14612 -81511 12134 -210336 169525 -206976
15368 372236 129291 -18684 78374 161451 -203799 126465 94137 223244 205037 34722 -19800
15356 -254196 73329 164005 99532 -80326 -312876 -253371 -190510 -65914 -284018 242993 -4524
15344 30073 196787 43083 18728 26244 283907 -41283 229656 -346507 299054 -30824 170784
15332 317855 -50384 -360270 22585 160927 -122350 161738 -66374 197531 160107 179670
15322 179670 98873 49412 111680 -233421 122872 -34742 35700 247804 -75089 326188 58387
15310 -121863 -123921 2102 276199 425661 422702 -129963 118154 179244 -78477 -192116 -47297
15298 112234 -37830 -32350 -68887 85929 124222 110888 214224 -85062 195838 -116808 243263
15286 162352 40763 22955 -25614 190696 -26344 175660 -113380 -13366 320853 161014
15276 161014 -130886 -76295 -95410 -68234 -66949 -44966 -166380 -147992 -19077 -282179 365182
15264 237872 251311 277832 192838 288078 192069 145271 210967 -34410 -11080 -15543 195846
15252 123146 88963 -414382 61089 -71704 -205271 -298431 -37438 -15285 288146 141023 23265
15240 211028 14478 103803 -19242 286281 367109 986825 882594 1254833 852972 1134078
15230 1134078 468185 140655 365725 353143 121326 -140757 -104070 174756 86604 34942
15219 232988 990 116175 90511 -129363 -7855 172354 19786 159674 229119 10601 162998
15208 162998 58209 -16250 -61790 -165518 62217 -187352 95338 39583 79627 269975 -68287
15196 -34554 -167103 308869 102791 -107995 -439068 15038 -30276 27779 44661 -9919 -287063
15185 -287063 142116 112194 -68338 442624 205288 182234 -80501 318620 -23386 113699
15174 263499 143998 146162 72512 292464 91362 -257344 53705 -39308 -73375 29688 246429
15163 246429 179967 234849 -42987 55951 -45189 169114 439155 81631 47622 -331340 -6741
15151 -227900 132295 -65309 -208913 389472 264675 -157402 72377 -34304 -104381 -81176
15141 -81176 -9615 -163323 209599 65896 45479 -197800 62039 131031 87190 47330 184103
15130 184103 299376 -59953 130314 307934 46393 69037 34475 114175 -146046 166276
15119 209194 144188 -48052 -159007 46694 296112 329264 359361 -39037 100165 338824 150662
15107 209593 -98105 98840 155879 225999 -97944 -105565 567151 70898 152013 -15134 -42793
15096 -42793 211321 133639 312153 293750 -201675 -65346 -131932 315704 212904 67363 148472
15085 148472 -93 -1883 7499 -68529 76113 270326 496921 -157902 226615 432901 205035
15073 102440 150904 208075 300390 -23715 29288 155309 519040 39744 195218 225472 242558
15062 242558 -112132 18631 62881 231206 -63513 191618 -322478 122080 49777 -2480 414600
15050 27996 57568 -187743 74137 384856 62397 206882 263246 262073 294934 -4162 265150
15038 25845 61502 122528 378261 52826 9525 212403 -112622 64851 99336 354897 378131
15027 378131 29545 621280 -157595 312320 142009 24788 367076 62410 255219 172057
15017 172057 149512 284628 44779 218962 445753 418655 541573 45795 331968 246408
15007 246408 328093 373737 -202350 253892 212158 274556 13497 611144 282124 -35879 694518
14995 194952 151234 532991 351772 286753 66556 431324 -29266 169683 51061 262606
14985 262606 145951 190062 198056 439616 113773 -126623 234879 240509 494323 475551 -12005
14973 -79599 378782 234151 203274 256111 188234 116798 99833 293704 56307 631493 128345
14961 -19068 513208 39623 -90892 174810 99432 -247423 89325 103520 377307 209330 442826
14950 442826 336557 523342 234968 223398 363456 246121 316057 36992 206894 225108
14940 225108 49360 -51077 617387 73021 270536 269172 236540 141544 103840 143850 356639
14929 356639 439158 140520 142401 144893 73994 309491 233947 164332 246141 438585 568995
14918 568995 119723 231403 597822 498794 252612 395684 223824 319327 44470 242471
14908 242471 237969 258959 361717 208151 148649 655639 325066 341953 177773 282494
14898 282494 165248 651400 245414 257171 13144 366953 142273 324308 277158 334056
14888 334056 312132 255402 537292 274659 337308 -11492 164712 223412 282006 178292 32677
14876 116721 569858 56837 582424 193505 439056 264592 564671 214834 384831 330487
14866 330487 261106 170681 492225 551879 2503 195836 474180 394938 379772 433509 216492
14854 300511 276233 445347 503752 527606 561403 433337 441744 485695 555581 540532 261223
14842 539597 596378 685950 591444 218087 300909 457046 389326 763718 456540 491785 412863
14831 412863 376468 487326 446088 364921 312975 332804 543123 564820 589451 437061 455379
14820 455379 437594 625910 120975 353293 403258 193461 523839 627510 278107 564984
14810 564984 480968 144194 281598 557300 276799 673504 668737 457091 361842 423546
14800 423546 274317 465203 242613 786430 302637 46634 363610 709985 386343 456816
14790 456816 217409 324967 598446 335618 389383 395264 729153 568236 351601 592219
14780 592219 442248 787150 916763 634044 478151 310624 671701 535727 403417 423623
14770 423623 622167 602678 528203 529925 787167 318285 573305 492842 534759 761770 578604
14759 578604 778675 544954 353022 396692 691201 586608 566135 741002 632828 507603
14749 507603 843185 1018362 589102 650970 250827 428676 919619 712875 484004 541626
14739 541626 655650 693700 755585 437033 633718 654808 370737 703167 952053 536677
14729 536677 643295 399355 631047 942498 739829 745802 620537 684623 783153 625609
14719 625609 571727 612178 535814 680368 498644 435406 994265 928164 787303 401609
14709 401609 933618 665497 782093 560974 878250 642046 542011 565848 669547 885092
14699 885092 619504 817776 623205 731806 817824 919461 1040855 844370 1165911 748694
14689 748694 833216 828150 934675 429665 1018406 862143 963174 995473 1010210 648122
14679 648122 1060855 710971 926759 743621 658981 1036425 835149 793742 865967 938697
14669 938697 718769 874574 551950 870837 725609 660447 949976 954842 762528 832567
14659 832567 1281414 642821 1003974 1057001 869242 1073975 959121 1654608 974313 917220
14649 917220 913501 947525 1409969 1237467 776175 671032 1034138 1112761 1234691 1208199
14639 1208199 1221916 1263241 1099454 1141121 924987 1138879 738058 1071130 1054224 887236
14629 887236 918563 1143689 1165501 1325901 1153429 984135 1264581 1079848 1233209 1489721
14619 1489721 1018255 1086701 996711 1326339 1578027 1615857 1342374 1206214 1483878 1106656
14609 1106656 1253784 1271783 1412578 1185438 1193883 1475392 1502197 1498901 1525443 1433206 1457185
14598 1457185 1536890 1821515 1556426 1329406 1558457 1727148 1409514 1588593 1638882 1441630
14588 1441630 1303754 1349683 1302612 1510308 1462711 1688269 1793368 2001812 1901343 1759166
14578 1759166 1756381 1517467 1816632 1828338 1883634 1617443 1642090 1845528 1759773 1747459 1802058
14567 1802058 1926343 1941213 1506942 2005600 1941759 2278281 1737225 1878236 1966704 2247732
14557 2247732 2231696 2206961 2220446 2114807 1887869 2574168 2141512 2393599 2566061 2302373
14547 2302373 2691543 2904663 2863592 2924422 3177373 3219546 3301063 3905616 4206152 4955114
14537 4955114 5315861 6367415 7693660 9018533 12858948 19266607 29758215 32634490
14529 32634490 17515698 9429111 5901834 4198071 3239415 3271497 2655338 2633999 2512803
14520 2512803 2871326 2526785 2256573 2219600 2197308 2544574 2035863 2419033 2420594 2283715
14510 2283715 2312097 2491634 2851341 2498476 2584751 2538501 2649161 2379873 2789458 2651538
14500 2651538 2751318 2489017 2577468 2301012 2523116 2599910 2867006 3075324 2973970 3055933
14490 3055933 3067238 2906908 2961992 2914635 2866644 2920894 3197498 3163247 2922314 3352075
14480 3352075 3188535 3216901 3293404 3332896 3337641 3275579 3511199 3413261 3599045 3523732 3656713
14469 3656713 3434161 3783143 3855350 3711681 3775157 3604116 3524251 3982061 3948999 4027944
14459 4027944 4081808 4074524 4214209 4138133 4267380 4567958 4436899 4468357 4305479 4781475
14449 4781475 4199709 4332094 4637219 4837573 4804822 4683498 4859525 4960750 4653128 4946992
14439 4946992 4969337 4711718 5368732 5473037 5227304 5302828 5092432 5373035 5254095 5444612
14429 5444612 5599751 5540293 5782470 5942374 5654013 5640823 6138073 6376281 6112760 6435237
14419 6435237 6233886 6515371 6586881 6298854 6799818 6949060 6780348 6809859 6898298 7572418
14409 7572418 7327278 7306551 7280156 7810313 7701947 7877576 7930826 8295875 8355612 8451112
14399 8451112 8587870 8683524 8530343 8749662 8826817 8895850 9149759 9516357 9283103 9730503
14389 9730503 9733942 9820585 10354703 10648114 10161250 10501953 11010419 10848180 11149066 11380269
14379 11380269 11467520 11738065 11747546 11981689 12249930 12570649 12784231 12982446 13216343 13261316
14369 13261316 13927528 14125163 14081556 14457449 14352607 14727127 15123667 15174264 15592685 16173533
14359 16173533 16366607 16665166 17048511 17446205 17784754 17963568 18377180 19022609 19186480
14350 19186480 19781114 20123106 20881578 21133556 21587731 21949860 22468972 22773808 23464061
14341 23464061 23937868 24763380 25498480 25782805 26207951 26914471 27730700 28622137 29175004
14332 29175004 29718045 30498685 31533274 32410274 33402756 34143487 35183015 36237399 37042007
14323 37042007 38210954 39247682 40593654 41652222 43125059 44412009 45462278 46954909
14315 46954909 48313998 49723928 51518026 53319981 55076331 57259847 59226050 61133706
14307 61133706 63287486 65879257 68042922 70625916 72875534 75821228 79148532 81898525
14299 81898525 85157743 88188509 92337187 96190311 100294071 104187399 108921003 113559852
14291 113559852 118239606 124036543 129481505 135674518 141715786 148696566 155807971 163266045
14283 163266045 171293404 179529195 188649835 198084853 208222234 218468502 230041236
14276 230041236 241703829 253953931 266629398 279865966 293739910 308139351 322605921
14269 322605921 336827230 350896194 365341952 378177288 388090375 396221489 403855798
14262 403855798 411249373 417722952 423690161 429334774 433696004 436035746 436283608 436611674
14254 436611674 435036348 425743056 416055940 404859689 393728139 380899886 366958311
14247 366958311 352904236 339352570 325234206 311812795 298084516 284706320 272354320
14240 272354320 260614501 248454764 237038045 225612225 215351344 205076893 195668145
14233 195668145 186781966 178212244 170154358 162514778 155779422 148709410 142089588 135985105
14225 135985105 130453520 124692822 119368928 114481698 109935078 105337801 101099684 97065297
14217 97065297 93376118 90069710 86567648 83310362 80202747 77190116 74277178 71415211
14209 71415211 68796775 66277586 64033900 61829429 59710344 57722278 55700991 54071437
14201 54071437 52153013 50713236 49260858 47773609 46021699 44721187 43562576 42225035
14193 42225035 40831639 39945692 38828668 37719482 36575094 35479604 34517539 33632256
14185 33632256 32993292 32247745 30892784 30102511 29416136 28901177 27997292 27356419 26644854
14176 26644854 26034676 25440858 24833424 24305713 23656761 23239275 22621097 21969021 21588849
14167 21588849 21060464 20386923 20106912 19640393 19506299 19074232 18335750 18356256 17754728
14158 17754728 17409434 17071737 16829802 16023984 15942431 15603085 15438472 15262762 14929373
14149 14929373 14502788 14459309 14140178 13949606 13765930 13531448 12795554 12850207 12804571 12308401
14139 12308401 12495380 11819103 11882494 11574488 11527719 11619802 11162440 11368827 10698262 10758955
14129 10758955 10659538 10239756 10029792 10018047 9670526 9604068 9355482 9249415 9399993 8881148
14119 8881148 8707718 8663964 8788245 8560871 8199941 8661974 8224839 8032221 7888367 7790286
14109 7790286 8010790 7513000 7563337 7466647 7603592 7396383 7309379 6898272 7051337 6873273
14099 6873273 6451051 6662668 6590464 6515339 6200247 6498615 6346615 6310676 6317701 6112602
14089 6112602 5781354 6377857 5797651 5839011 6041457 5912063 5694861 5350568 5797914 5625061
14079 5625061 5318925 5354270 5092584 4841158 5109301 5352660 4904444 4890943 5259948 5005072
14069 5005072 4967526 4970859 4584661 4552341 4492372 4157463 4388118 4268103 4629238 4360743
14059 4360743 4206485 4594626 4422662 4338565 3858019 4066312 3895915 3945525 3810218 3900352
14049 3900352 4011040 3962599 3763083 3831606 3828401 4018405 3457304 3845964 3745174 3647412
14039 3647412 3631535 3583508 3463026 3339495 3320381 3344795 3551223 3200250 3349860 3438889
14029 3438889 3250264 3393280 3243963 3180752 3321579 2788425 3012870 3045014 2855424 2816266
14019 2816266 2972039 2715285 2984439 3098760 2855125 2886608 2990795 2732142 2736124 2755037
14009 2755037 2514965 2793592 2695796 2804501 2826513 2792526 2299090 2823318 2513105 2485526
13999 2485526 2657221 2349409 2174038 2216649 2464551 2399462 2198136 2422913 2531401 2458832
13989 2458832 2425179 2077846 2187278 2180276 2136547 2224416 2035233 2038249 2584371 2532919 2882750
13978 2882750 2877178 3125221 4006564 4551518 5985997 8433863 13975736 24702071 32775637
13969 32775637 20076349 11925723 8214013 6450650 5056584 4533342 3990600 3410679
13961 3410679 3353847 3566729 3014972 2725339 2929916 2524314 2412878 2490235 2377735 2335056
13951 2335056 2385166 2708144 2229484 2069687 2298319 2111578 2355586 2170166 2061062 2116013
13941 2116013 1985632 2072213 1976850 1871519 1861525 1991348 1906486 1868797 1746110 1614583
13931 1614583 1675022 1950290 1927083 1930173 1748120 1660232 1395731 1612488 1513707 1481068 1732373
13920 1732373 1782802 1895741 1758504 1604211 1564872 1539116 1542506 1446454 1564148 1443952
13910 1443952 1276341 1404807 1453590 1416374 1456297 1697509 1295942 1665791 1193651 1497623
13900 1497623 1631101 1224363 1546422 1442085 1332341 1750605 1135823 1386190 1629684
13891 1629684 1443946 1275684 1309537 1095976 933201 1364377 1285040 1299626 1221172 822613
13881 822613 1620968 1427962 1350824 1381796 1039620 1366161 1289560 1205304 1370906 1067649
13871 1067649 1070665 1396419 1275464 1072736 875023 922180 1276279 1252954 1085763 1191292
13861 1191292 1278570 834898 927991 1022181 1325105 1113276 1019227 1047016 1129666 1209762 766583
13850 766583 1024224 1032406 1197037 967175 1087370 919710 947288 875683 1129464 754609
13840 754609 1048143 1105937 1067720 1138927 926559 963138 956102 945131 1162986 614323 1036316
13829 1036316 648836 872603 1119464 1104366 914149 943874 573579 631305 1032310 800264
13819 800264 763496 431463 724546 787055 908926 637656 1047429 872829 534356 869810
13809 869810 676336 950706 752776 728376 740019 328195 674104 776535 1240814 823398
13799 823398 997963 957366 647659 900125 1045882 841246 591925 1059867 780404 404871
13789 404871 671100 566980 896899 932908 743919 888867 733852 596282 691534 783290
13779 783290 847498 1104667 988387 700604 567134 666917 668138 817429 706310 831175
13769 831175 628244 530305 647581 657357 850614 672186 546573 650480 535717 616509
13759 616509 681953 650979 664659 481577 751183 594296 427067 690597 695842 544020
13749 544020 758575 789401 664017 783130 666207 772354 548105 979681 547181 550268
13739 550268 1084696 655168 516703 741313 619183 448151 582826 626566 268595 639983
13729 639983 608113 566425 590378 383448 548417 336905 427883 638253 195164 501312
13719 501312 724811 366246 577631 682527 684701 736900 606615 380710 437768 556729
13709 556729 409880 551989 534412 861035 490199 651136 656884 533599 842883 326518
13698 79643 639573 550870 576934 574564 826137 540080 768028 423028 484820 616449 282388
13686 414364 653613 267297 422274 280202 522565 506979 498772 405349 643077 317412
13675 442862 505459 51746 447477 561013 468560 489561 741954 480809 702625 322527
13664 289670 389563 652919 362285 439313 345999 468555 307421 356258 147364 435426
13654 435426 492809 408561 361795 374747 183407 897087 688844 461904 500712 186544
13643 374191 430445 332966 321602 686406 635864 103028 -11762 381454 372928 463472 325622
13632 325622 264988 361530 280020 496611 122112 268515 255033 478347 441069 234530
13622 234530 236460 212953 83083 407159 375034 190612 498679 321246 395619 570785 188667
13610 529570 309123 156736 277612 325416 -166378 496373 268645 518217 221714 271046
13600 271046 607613 234442 486712 445523 386677 277484 367370 571528 467530 464241
13590 464241 425490 599300 633758 82430 355048 384520 122105 324717 715373 70894
13579 316478 504369 333772 409304 373523 632247 546173 465792 289065 42292 339256
13569 339256 221668 269616 127703 362494 318749 463854 362907 166292 230335 445803
13559 445803 448888 259911 398922 278691 466910 15128 146777 180481 203769 423117
13549 423117 396231 504952 89222 427670 246243 206014 173778 -82249 392244 80666 1822
13537 295510 301603 485907 204334 189635 436224 357488 153099 369755 130120 461672
13527 461672 467503 25439 163930 144283 377810 423417 368893 99173 78517 226227 -3506
13515 388763 231095 -44100 161372 328125 240977 293206 359279 -29418 390713 331944 472641
13504 472641 588528 644582 173231 214023 126991 599671 50940 319737 141616 250257
13494 250257 358448 122442 262987 316099 92145 70672 441374 338006 117027 3757
13483 209625 385297 276935 117862 113738 286689 -131336 80808 209479 305619 105785
13472 268660 270585 539282 437869 222630 23782 -46302 282663 -59771 -27630 252812 437487
13461 437487 142843 129055 81847 129466 104731 403028 314418 339980 516639 211258 96406
13449 223007 121623 178029 212154 124299 388406 119719 399873 117325 102313 604282
13439 604282 -41002 -65707 45419 -120513 514335 -74861 148892 459631 265367 147088
13429 147088 33397 -98713 417705 -24945 146213 -139821 363443 -51981 158754 204182
13419 204182 312867 261835 42355 258675 134784 56357 22882 246107 66215 523003
13409 523003 231853 257606 359212 244309 185796 178483 209083 62070 577306 234690 179430
13398 179430 18538 206540 36540 39226 183284 331634 166041 219698 395000 502583
13388 502583 266048 211336 216958 105139 -93851 382659 283361 288798 89667 328792 -19782
13376 -36837 401257 201556 469022 -27193 198351 297323 355330 161881 243260 102820
13365 375462 51425 146629 338611 113871 211572 373576 268786 234718 561559 315997
13355 315997 524091 367690 120747 265120 116532 307675 103704 122377 245324 -71765
13344 172546 190236 97445 12119 -81296 -160559 1057 323736 256665 349851 -27379 53608
13332 280904 255949 -2057 208111 161253 79574 198561 106777 20985 178394 250837 339061
13321 339061 82685 127116 290876 298803 -12929 24604 72411 309429 642479 256836 110259
13309 109063 62427 20229 187526 281388 83091 6053 185654 421637 101070 352791 324285
13298 324285 308692 15475 46279 48998 294215 -69955 6407 249886 100551 418824 244433
13287 244433 257077 200191 181727 -135577 54421 304304 43850 311737 83638 305143 272381
13276 272381 -55266 -126275 16274 120405 119573 218588 105430 119587 297802 245648 210336
13265 210336 68803 -232434 130141 -315057 168287 118819 -140916 180108 150476 -298747
13254 -9763 75928 535395 153477 -18160 -123167 128420 448682 150154 202831 -21884 331477
13242 142004 286394 -185726 -9827 -65571 -19933 344223 64994 134295 -119982 164291 -128095
13230 75569 109760 299759 69817 39957 116141 -1535 49273 153180 130857 411975 -1941
13218 427391 71992 -37305 -40843 9563 -49550 77003 40457 -87111 97321 285574 54213 338210
13206 338210 180121 294160 148647 -44364 109876 186338 150935 94025 181642 197356 261471
13195 261471 121241 162798 26046 135805 300108 -32044 40143 23504 -95502 182370 160508
13184 160508 96884 53744 98611 52768 1510 128656 144357 -81064 31340 204674 55825
13172 149777 92428 207898 179173 -61781 106315 9908 -83301 -349535 -3457 185943 104607
13161 104607 250006 -49774 174064 83792 62986 375789 -91223 -205283 402054 24241
13150 60979 -155018 199839 249916 220766 205243 101620 14799 -63379 66169 136396 312901
13139 312901 109270 -130606 121989 496948 274028 34154 384311 115597 162532 -66724
13128 39092 90216 -35918 -100426 231552 233694 -19186 -102956 42048 116789 -111268 418627
13116 161822 -32607 -142178 3230 186793 27522 -61560 -104352 35058 -1067 191200 200938
13105 200938 -92247 81758 53055 -48758 291041 56605 34868 92655 48808 155008 184689
13094 184689 196183 217772 58172 -92979 435922 -81454 -143520 48049 -59846 144702 44863
13082 296221 137327 199771 -103693 -10481 298522 56461 253886 -39111 443112 -47108
13071 106643 429635 165040 -81821 60034 250129 -183142 103814 -52252 137684 11924
13060 -57893 80225 386699 238071 234205 80491 -63946 -109333 216789 194430 143618 45024
13048 111016 -59468 280515 -170430 371403 108737 204412 -271330 164176 151508 35980
13037 5461 220786 18818 70653 38232 -135883 -64791 300746 -430473 -120990 -116068 174094
13025 -178901 -302623 -1847 20866 239511 -31575 83808 171392 135462 -86317 -395616 156736
13013 -292290 -101494 356031 40773 -139856 32172 53445 213922 -16322 209807 124905
13003 124905 436426 259561 -55266 286674 180818 267515 -33975 -59543 281081 -25062
12992 168745 -152139 14942 -155734 -208937 -232980 177160 -2496 -62882 267328 -224264 -64473
12980 4985 -28125 40820 119854 -53407 93939 -145401 -123139 261661 135062 111759 -207520
12968 151893 -23090 153327 134780 -98410 306944 251207 117823 22752 14540 176293 47528
12956 136428 -140283 56170 93265 220004 20653 -58643 192404 -190069 80810 198437
12946 198437 348406 76857 177058 33688 182942 -95037 198907 196893 -17924 -35372 -123878
12935 -123878 -369955 -155813 -49230 -4251 -48610 104459 344238 194343 174143 18543 45820
12924 45820 -369150 83936 -406521 -194232 -174687 150126 78855 252533 20241 -5103 143056
12912 -74734 18872 76199 -65525 142259 202973 105007 -169314 -268012 167835 109855 115525
12901 115525 136977 -352123 -146416 -67030 203992 265419 82476 37587 148764 73068 153733
12890 153733 237022 -33264 189566 342493 -312262 55024 -43981 -103711 -97936 -111074 403143
12878 335026 278684 296921 -128348 214280 40493 -31073 -172316 -355445 296253 219616
12868 219616 29283 356956 -466192 121859 185131 -309464 141016 72577 -45119 -89451
12858 -89451 404985 234157 17811 -79085 -156568 -189197 -124173 -388870 92796 -121566 79726
12846 -123271 292164 -151846 43554 144926 154549 -25692 254129 -180855 216398 153691
12836 153691 -93224 148229 143045 -136338 25116 -32962 -155111 176175 -113061 168038
12825 397564 -253609 330289 -174223 92292 -93587 135786 -91274 -8674 1091 162392 -233213
12813 -229621 125701 262250 -63593 -22997 434782 -84977 1402 -30406 68701 -127860 397263
12801 -134636 6881 -586320 88249 44057 125434 -67727 -119735 271373 -80773 -271676 -32948
12789 -94176 480665 -175244 171457 144736 -171968 54568 290838 -115237 -128889 259183
12778 -35363 -70453 -50255 -153406 254573 -4862 -30213 126002 69381 370793 -263313 213577
12766 -319149 54989 79527 48355 132024 78703 108003 32890 -35983 -21753 73551 17565
12754 -94310 -7422 28932 -101030 146572 -135479 183834 59308 48854 -28067 169700 12627
12742 5083 152431 -35670 -129467 105085 54706 -34280 3555 -66285 -205 -137461 218225 -188473
12729 247862 -487427 24468 -114992 6740 23193 -128525 -49234 -197069 -188046 -130515 143791
12717 -57961 75369 42867 168423 95668 394600 213302 -124016 166284 180857 280482 -188990
12705 141398 -64928 135573 134976 -48734 44893 34296 75441 -94018 196120 272263 -139970
12693 10812 404301 465241 144256 81892 108193 279496 -103487 -1103 19881 283370 -263787
12681 190723 -71758 -23371 -289382 -23716 -294475 358529 177619 -46870 -8450 185028 -91924
12669 60585 279754 314818 64825 356286 -42194 -129689 -53335 220432 139965 151180 -52913
12657 205164 298851 -59088 305543 424745 -15095 -71697 190286 -3372 -159666 -165974 194533
12645 55505 397505 121048 272872 -47106 15390 59153 295114 135224 147214 -214857
12634 389178 174257 152182 94958 -2522 -106632 -95046 218376 155740 36929 81531 -416299
12622 -21066 104603 -40277 22954 58390 -69435 365428 170374 75237 95583 385419 502682
12611 502682 351243 -126937 -168191 154018 158 -110156 -14588 281833 268353 169748 -112804
12599 -213694 -39627 -404145 -61700 4850 -23898 -59673 25007 -194839 -20942 -113615 71514
12587 135861 -221138 51354 -126063 -142179 383051 -59014 -251474 73684 39316 -283135
12576 86321 -405428 122560 -142553 -69244 -114814 -260405 203733 -19302 -73089 35973 108639
12565 108639 259690 78983 -147460 -185056 -491097 115492 235713 198573 92812 -79508
12554 151460 -35546 426962 -153030 -134506 389356 115530 178536 903 -103847 89679 -252260
12542 20076 137155 36735 25530 -174796 35564 -84496 -100717 -181873 -66154 11271 -8909
12530 -44837 298884 -113712 298716 -111400 -155131 130392 -325199 71328 -228534 -151749
12520 -151749 114741 -225444 60185 124497 159908 -34632 301811 -19858 244532 142694
12510 142694 -59527 24131 149200 112912 228899 -238683 -155541 -46338 48096 134280 -453082
12498 -43621 117737 -112125 120527 59692 157218 -81368 148993 174652 193628 129322 -74143
12486 40473 -17143 136790 236917 -116679 134957 -7153 113982 -313817 225093 -74252
12475 88274 104821 -147415 -150500 213295 -82539 -25245 -113733 41471 28983 -273916 297122
12463 152150 -285172 -408682 146301 134488 -109073 29109 -143680 19971 281914 69817
12452 246782 -159618 -259277 231300 -388644 -171471 76157 -455918 109006 148026 -278675
12441 118727 102382 34451 -19912 -156967 -190101 -129774 -43848 -75436 -47999 -356160 -33287
12429 166986 -56298 6411 -71638 -143340 -300737 100461 83225 209092 -43709 -61904 119330
12417 135082 -231864 97275 259003 61258 63896 201280 235747 -27967 -232866 -97067 -266995
12406 -266995 6589 364762 -108197 -14680 -256377 16323 193778 -94581 -174311 -39400 -163556
12395 -163556 261242 -81850 -48470 -184107 19061 5495 -32 -16894 -79008 33021 -218416 137701
12382 157667 135294 21126 35043 54727 155573 -158171 1592 -127216 2043 136781 234724
12371 234724 -33098 137217 -15999 -339518 144881 138829 -136374 162504 20512 -62229 225593
12359 -159363 180318 -67560 -171613 80242 137939 14110 -102281 -439419 -288804 266199
12348 -66555 -17381 161395 -64679 -132520 383 121898 -16510 -7184 -121208 -215800 351736
12336 122315 -108491 74358 20681 -235444 -182678 170352 -141889 13727 242603 -217053
12325 -71865 19412 -150077 -137166 89729 233341 -223654 -192085 230290 -11352 226002 152031
12314 152031 -214648 -157446 -306785 215302 38811 -290026 -152660 -105762 143803 -72398
12303 162111 -210422 -181422 -201595 72351 177603 113782 110765 247990 265391 -110329 47589
12291 219054 43118 69165 -63221 -222094 -108632 98887 -7875 12213 -275752 218767 117917
12280 117917 74842 -134785 -128231 251716 -129204 116899 73118 237593 71173 136617 -41545
12268 -275779 133735 109088 83701 142798 221406 29661 141906 186391 137342 -54543 294172
12256 4905 38300 99512 -34506 -102912 295198 56342 -62369 315939 65496 106848 65491
12245 65491 283034 37279 -246359 -369493 -30882 -318946 -145692 -2624 -30607 123495 187871
12234 187871 305023 -8714 -4295 286709 226777 150963 252395 86226 181595 -178336 364312
12222 107645 334335 263564 -13822 -14151 310647 65604 240029 74413 141320 -87354 513306
12210 254536 -93239 -1212 474032 205838 222575 -308964 354444 60492 -9193 195357 220430
12199 220430 40005 -25773 438408 145829 -79574 169637 -157641 -57762 104171 127742
12189 127742 305376 317381 269292 299036 208942 -178508 265220 379344 -9024 158149 202903
12178 202903 356941 -21686 128181 -92872 57575 -163690 245789 -56668 237319 -11222
12167 263915 -142148 137973 247785 164429 140767 152119 246518 -153300 144930 -139277
12156 103238 141003 -8846 124228 30339 10000 78753 71062 168771 -79528 93720 133295 369598
12144 369598 218848 142923 209008 212909 -59484 92259 170694 -82194 -131546 217244 40568
12132 -148893 -312366 -96079 366068 -18255 103477 -72317 84067 143063 206932 88143 47540
12121 47540 -127394 -50898 34995 126468 -68361 -293612 116532 100978 54197 -179955 -25176
12109 -72740 -182571 -202532 6658 -34889 -108737 -159271 -94619 -129944 67920 -114367 169191
12097 67 133836 -223365 79510 -115797 296915 -75333 -153748 -30984 -183083 200721 -50072
12085 264773 -35941 -102535 -27683 -125643 150193 -265214 171398 -69741 -17367 221541 393782
12074 393782 12063 177976 93950 44949 102113 260137 -108799 130808 443864 400756
12064 400756 628183 1151014 861503 604322 56735 80542 239155 -111406 -74122 -90653
12054 -90653 -72628 108079 -241739 55256 46845 -70666 379544 92730 312950 102019 184906
12043 184906 -13734 -74928 -115871 430201 -187217 161817 93455 -351069 -222846 -12474
12032 -63999 38002 21716 15753 295037 1979 -99232 -143190 64829 -30350 -178207 -179312 130427
12019 -179618 -102849 150414 170121 158941 63919 246990 152397 -9350 78204 233021 -301899
12007 185429 -20230 -382544 26216 33599 -133961 -154601 218756 236652 -115292 -266483 34320
11995 -114759 165355 -10812 9245 -671 -36959 247853 -74261 122314 64550 -207827 92425
11983 191564 -14674 -151191 9677 88501 6774 10790 -100160 -23953 52806 -146201 178646
11971 64366 -348246 149746 -168921 -295668 -70762 -145984 -11430 -231267 -103642 56571
11960 62996 30686 -42223 100078 -21480 -77457 203581 20279 -79859 1347 -248900 76603
11948 -81694 161057 -147172 21433 -145808 -150344 9049 116737 -305909 -23437 -217720 -150079
11937 -150079 9862 -12452 -135024 347570 213951 129527 21317 377876 46574 82964 -174293
11925 132792 -201926 -8449 -99399 -10512 112722 191784 154129 6443 128209 -146485 211223
11913 161411 190377 -3719 -131503 -279910 17106 -45304 248078 -250606 73056 -95833 -1126
11901 -68994 -68260 -65652 -147098 17177 206935 120547 -170766 -97085 -91583 59691 45551 -44083
11888 -90012 110896 249167 228548 49445 415044 -99456 171849 -130994 -179103 362856
11877 -230105 -244323 282046 -4545 51170 -164294 -167182 205848 -42587 -201066 68844 185815
11866 185815 -213044 -409721 -32006 -131508 -94047 156369 -396724 -205979 194979 132754
11856 132754 -165059 -20441 -89959 192814 80405 -123387 58287 -212453 -10660 153043
11845 -90620 -182374 -20634 -13800 62372 231764 106206 103497 -129024 -316692 327993 -152051
11833 -283392 142174 -345168 176553 -55218 -156096 -103676 -4966 -68245 -21033 -80070 -359731
11822 -359731 96173 3905 -12218 107548 92498 172113 128474 -213256 84117 -43589 -56726
11811 -56726 85067 -103645 -111316 144121 -46337 -55689 -168943 -56847 -425353 -151304 -127672
11800 -127672 186817 -43331 -271056 -64598 223360 -249135 98820 66482 -4464 -322816 -66617
11788 -33057 -24219 76971 -117093 119930 94273 12584 102968 -56246 333492 -148919 -170448
11777 -170448 -140154 -172797 -183086 -207033 121320 -17823 -51985 54391 265417 185738 -82000
11765 94343 52685 -7987 -100427 282492 -238652 100721 164736 257185 81201 132580 -120877
11753 -300629 112805 -262612 -112475 -87621 -106718 -61995 -22759 -29967 53028 -184824 -119996
11742 -119996 -307806 197504 236576 113140 151122 -112666 268063 -126604 18903 329645
11732 329645 -52671 -71353 -311920 -75206 104375 135635 22717 -173736 -220073 5435 -110906
11720 15479 105758 86029 66469 89160 207865 -55170 -298891 -270326 -32362 248948 -60067
11708 335848 73502 -109911 145028 -133006 -169138 90171 -107804 -306718 -391463 115960
11697 43758 153326 -171851 90293 18308 205240 -214320 295801 -102917 -42408 -155548
11687 -155548 -20339 185492 -18051 -97209 94721 8496 16129 487776 365295 285779 112774
11675 191730 -15843 257812 -59906 182750 58564 -104809 59734 -28386 -47415 -82242 66494
11663 183775 -155583 66754 243509 74174 -72782 185497 -269486 -64649 167117 -232466
11652 59589 -14377 -43514 749 106960 -228902 -18291 -109408 26013 -267739 11013 -13254
11640 84150 69782 114489 262760 -156549 -20976 -128411 126854 35781 -66870 167217 -52771
11628 169224 -250123 77825 5412 158534 8152 -346137 -54622 144734 263098 429635 -20591
11616 -360233 126022 -80385 217060 -104970 50950 -222267 -17256 83317 -84313 267870
11605 189494 -101891 128522 -72343 141549 -349498 238409 314397 -274378 470196 -102439
11594 -32958 44611 250238 195723 53302 51300 -166389 -46160 116028 86877 116250 -134106
11582 23044 259164 -23148 214037 32524 -174280 62353 -148710 12750 -59378 27204 62570
11571 62570 -150303 -191275 119044 40032 340385 113967 -378532 93054 237610 -267620
11560 -47566 -25918 -90522 147300 -240245 118500 54021 257368 -189791 -104805 152958
11549 -170349 337450 40517 -195008 127744 154130 68535 -220718 -106902 89276 205474
11539 205474 -192261 97355 33501 -13916 172261 -89828 332150 211621 -192120 -29802
11528 293844 -118008 -171950 55754 11926 7010 484060 478634 252073 116706 979 -144582
11516 342462 -220892 61026 -96988 492185 -125735 139505 -3239 128903 255857 64760
11505 -356523 78507 -277639 -75916 45927 146533 144517 4040 -489451 282685 108144 133967
11494 133967 134214 -45699 42637 351018 115467 137643 -101648 -123392 -86757 -166761 46014
11482 21958 -26540 97463 -18185 342129 148420 254456 93693 150155 31638 -220103 -68956
11470 -48314 183258 26230 164424 21506 317669 242398 235824 266803 293840 451364 406444
11459 406444 26063 29495 75989 -767 204620 -13483 -171504 82905 119731 158559 354990
11448 354990 -67195 295212 543641 145424 133020 -30760 320718 -83208 51725 220528
11438 220528 162123 -17974 300486 -255839 188636 18505 109793 -25264 51746 135874 29238
11426 82750 -182593 67315 -21889 36444 -38839 191501 -156619 9533 124384 -32182 -113539
11415 -113539 158559 -179596 61015 63818 61796 185757 -123877 213270 -257862 221543
11404 -167441 87265 73550 -154363 150623 -395316 190943 4803 74367 82230 45776 306779
11393 306779 49995 41918 -87401 40320 -1594 -37401 273483 -69834 -185765 -197919 -128331
11382 -128331 142729 245739 100018 150034 -236058 27768 97537 -34469 167807 161310 -39262
11370 247565 101102 -100881 -11506 -315617 43852 -239199 -15026 68701 -251339 70751
11359 4805 -14404 -162400 115195 198565 -194392 -55000 -270095 -434761 69188 -25341 -580717
11348 -580717 -111757 -72794 -287275 254077 56831 -165942 -6495 68319 160895 118917 85781
11337 85781 -11675 -159107 137132 5844 155513 -243373 55132 -237515 -37929 -49631 -102072
11326 -102072 73482 -20252 -43251 80792 -22655 -138897 230001 81739 17948 89754 -56414
11314 143554 5793 -120022 54435 -1584 -543864 -124714 -139014 -163652 118851 105644 -10470
11302 -213515 92891 -2624 62532 54448 -279546 -159831 84913 -117199 -66701 -79584 -61634
11291 -61634 93888 -245261 -85590 67127 123322 102132 84220 -15205 36233 -142948 -54262
11279 -289411 314711 -30966 -116879 -100527 -76273 -230258 -142721 -30938 -60446 -164696 -16631
11267 -59190 -147249 -76964 172321 91661 -43617 -38937 -455 -76795 -119219 -123070 -494 -81115 -54233
11254 -54233 2433 343408 -76617 161379 -191912 542355 -229454 -8013 174182 -277941 -88471
11242 100435 1191 32308 -409317 -127069 5602 277124 54499 -285372 -188822 204156 -286734
11230 -11206 260807 -100498 -142955 45664 -43541 -156827 -251660 -160165 -57270 146294 -174706
11218 -95777 -125825 -27307 -361443 138382 207184 -420374 249385 291582 -180334 212943
11207 -42179 -231701 -84487 57566 85285 -301543 -405141 -40039 -321370 -52605 -165282 -169258
11196 -169258 -7734 271521 -154286 -122873 -20324 11811 -237096 189622 95246 132866 -101134
11184 -177093 -146671 -253140 289673 22047 -16039 -130029 -298516 -259567 38756 152515
11174 152515 62601 -25619 40595 117818 48479 122002 -18181 -195229 55207 -204192 2791
11162 93379 -157952 -460019 50599 -122919 109034 336595 -79859 155658 16367 -116203
11151 -198477 -46487 -204087 -153866 86487 -171685 162985 -7096 186322 63862 81508 338004
11140 338004 16659 205779 -28896 79414 179137 -107119 3530 -29636 77426 24315 108802
11129 108802 -50766 -213817 203253 19324 -239030 54932 13617 -278454 -122638 -103048
11119 -103048 -197185 38494 259786 38584 -66119 -91239 105382 -53146 -68793 127716 -65924
11107 51103 -117138 -70610 22259 -152555 -229069 -52961 98473 240223 235197 -48933 93164
11095 -106815 241327 57737 -89678 191072 -83116 46725 91472 162504 41272 -2681 206707
11083 -96779 -105063 -96191 326450 406391 -210333 -15515 -95439 469292 13839 113644 96947
11072 96947 -69032 251952 322619 356220 295556 52766 8335 208690 305464 151100 330701
11061 330701 555658 379165 386359 219739 315619 356980 125575 596155 229544 51367
11050 233958 176443 312666 319812 319888 415621 337799 377340 706161 567795 367504 494269
11039 494269 715387 407049 601633 440007 510863 586701 818124 518047 586479 471254
11029 471254 635072 777163 466688 528131 541736 778868 543673 364114 393650 669862
11019 669862 654224 663632 635973 511416 477560 377349 593527 703286 827741 606224
11009 606224 315651 685354 887902 623862 486704 648393 432398 512547 428356 785671
10999 785671 303938 640402 777407 482095 495085 385658 600120 627055 408207 596452
10989 596452 480580 642418 675010 455979 600379 799177 373024 498014 469611 683940
10979 683940 298347 669383 513445 492377 483568 894210 583447 820974 726552 870975
10969 870975 800497 971346 959187 1054415 985710 1124788 1285762 1565047 1511970 1464272 2129010
10958 2129010 2355871 2111461 2043748 2182879 2053040 2133550 2181168 1768551 1714239 1830672
10948 1830672 1539422 1491568 1401776 1545582 1570561 1449262 1754629 1283412 1154125 1615848
10938 1615848 1271140 1252196 989072 695729 872110 655840 829459 80561 465096 138991
10927 260156 683461 -1660 336972 317926 271302 238177 -12462 313730 228596 24623 -51209
10915 133801 10923 -39719 -13774 2963 -72553 94847 182911 189961 -85231 -174613 -213764 271263
10902 196928 130233 -142505 -280568 78406 13380 -257045 157563 -88512 82154 414182
10892 414182 72965 101741 -112388 -37962 -162851 128691 -56577 -137964 -184636 -20684 -246706
10881 -246706 206490 -229324 156676 284695 236680 -153249 -31655 47472 -21383 109722
10870 105197 -473432 -66737 333524 34248 445719 -99035 117862 327209 -185006 -253406
10860 -253406 -120832 223142 -84135 121807 102792 100534 -254676 182387 105974 -955 -112848
10849 -112848 -78319 -309566 -85795 -364818 -19809 -345586 -124718 19050 -294969 -194763
10839 -194763 41879 81474 120591 21403 -348125 283370 -68854 194429 -188911 94761 22143
10827 68615 407084 -149915 337153 178843 -14677 -289915 -56969 108589 -243236 41498
10816 113043 85622 -167778 -31184 49782 -71068 5921 -68889 309408 -523775 217252 -206855
10804 -533179 -69406 -494725 96325 79262 -10043 -193553 -289379 87673 -147103 80434 -84297
10792 171006 -178859 19320 2122 8137 134574 -131577 -20824 48060 -122329 -185993 -164043
10781 -164043 83539 22759 438173 120794 18599 -53389 -167624 -115654 160 -94800 14951
10769 11756 59378 -37585 193819 -42284 -111419 -171462 1968 -219843 -55724 -25207 -360109
10758 -360109 -129947 -107873 330839 149479 -53906 -171865 109421 78571 191954 -192348
10747 -128334 -103296 -126567 -168977 -161273 -89418 -163105 -49396 -233559 -286173 -51941 5013 -294543
10734 -9739 267346 -102597 -27039 44652 364418 -159583 -300191 -49763 91945 -82569 -27875
10722 -99822 156472 232778 -178743 -94061 35860 -350396 -100333 -143056 -226628 -15751 -231131
10711 -231131 -90554 111228 -26372 -157294 -57114 -505766 26792 -108660 -18139 121349
10700 -295169 -233577 216080 -72449 -89186 -89891 -13449 -6984 -272463 -97154 -71990 -164435 27327
10687 -193742 -1814 34036 -19052 141936 9405 -154870 -59445 -97678 -358008 -58098 -24496
10675 36562 -77341 293826 101430 149742 -18940 46983 -82167 110103 -213399 -122417 126172
10663 160749 155676 -222266 91837 -110587 -53981 -54829 -142358 159745 -502831 18072 20422
10652 20422 33436 50261 35969 98296 -370975 41757 -79680 -171618 -71712 -44926 1243 -69109
10639 -247612 -215623 155459 -31046 191223 -91839 -243571 228211 69172 194458 -137027
10628 96625 28544 -152887 -33387 -229443 -2302 -123028 -26422 -530307 283896 -28567 -308895
10617 -308895 -54340 -102250 -212137 208404 254172 -59622 15078 -303128 -171013 -212997 151225
10605 96789 -55694 -669127 -239337 13209 123129 41108 -8820 287524 -225457 -67962 11334
10593 1278 -75148 -222108 -160346 -48834 -115252 -105630 20824 55869 323796 -191932 -62219
10581 -206419 -97875 11575 -11978 -131064 156499 -38861 -167471 -83074 -90027 -48882 79662
10569 -131083 -149281 -78721 -239526 89402 77558 189271 32100 14286 195154 -46238 -35699
10558 -35699 -50850 -16774 69124 45872 228861 -149540 -263042 229441 -50030 -220419 -87760
10546 -53006 -411019 114314 22263 -326189 -93631 -41353 -492506 211816 -213754 48174
10535 94053 113057 38888 24803 -84878 94838 -266167 -107534 41796 -10144 -35567 -152217
10524 -152217 -154495 -231947 -38479 19743 34608 4701 315312 -126072 -132296 116149 -149919
10512 -86382 58280 -187826 -97103 264823 189326 -146238 -198846 -343571 -302715 52499 -195209
10500 -68300 59579 -236193 23934 48342 -79417 155429 98182 -132624 221993 -70406 -331961
10489 -331961 -36901 169485 7217 249383 93898 230757 104611 -235807 131297 -242374
10478 71127 -42948 -290934 74813 -50830 -120786 402127 116906 -4679 -26486 -266168 -7194
10466 539919 223577 522334 338243 139878 81430 214536 28650 -156823 363474 136322
10455 2082 -14683 138253 -19633 24953 400580 146619 -21769 -534550 331856 168159 6486
10443 37954 88107 -38985 43686 -238494 -168047 -33720 138487 37505 85225 -253134 -146437
10432 -146437 -36233 -55880 99196 -5928 -259834 225493 206221 -15062 -85336 -327460 -199144
10421 -199144 -109999 -38365 -56242 142609 -135153 -26692 -173495 48602 111418 11992 -201327
10409 -22802 4256 312578 -143954 -162964 -189823 -61141 47160 67183 -138696 115545 11178
10397 -114176 -105518 24024 -34715 -201615 100434 37604 3146 -132059 -41499 -90055 3326
10385 -3702 -146280 177286 234366 -203091 424690 -266338 -193581 143193 278189 168406
10375 168406 218893 -282884 299468 125398 -10826 -6980 -60911 61731 59505 361706 -271157
10363 66860 -267840 139830 274890 -88144 397036 -164825 439783 -48418 248929 151355
10353 151355 193100 424530 5636 235649 494296 447293 238458 333558 546854 93790 380361
10342 380361 202379 86683 264166 -182641 346111 400030 240422 57264 419952 93768
10331 319406 364666 290384 -1887 458327 118065 129082 306751 45307 227860 335308 118919
10319 327275 263597 22771 119749 -4050 80707 272279 61853 -54383 134673 -47923 251302
10307 -101246 44010 327126 337763 224317 16760 23421 387187 91550 141202 247432 163509
10296 163509 92772 -150131 343432 -48112 28911 -23617 120630 68475 39748 124041 -299160
10284 -45077 33069 -231219 -59295 -143417 212027 -310641 -13723 -224802 -7143 -79982 -208289
10273 -208289 -56973 47925 -127481 -138413 -110834 -55725 -116111 -110679 -327231 -38780 -150871
10262 -150871 -67738 -123263 -214757 -41445 -82164 -242829 -72436 189151 193494 76738 121772
10251 121772 -81955 395326 246794 96203 -83436 86740 -1009 22636 -43511 30814 313501
10240 313501 -182972 274685 95485 144930 27170 84678 159395 -82697 240036 173387 -184811
10228 38105 237580 -189128 -79186 139508 114182 -136226 -183963 -57615 232119 79743 287381
10217 287381 148793 -29521 -53252 -318529 -63928 -21074 -3767 -11993 -96978 -91419 115861
10205 74649 -159969 -6955 -345503 -111874 145096 -360658 -70453 64999 117283 108044 -357524
10193 -300200 124349 239967 252493 257321 -202649 -199476 -398343 84829 -70666 326877 -26382
10181 -274551 -312876 -109164 -23020 -74887 -72761 200711 -14812 -151512 -200785 -55392 -97798
10170 -97798 99154 -245139 -62574 109773 -403556 -91464 -136102 194886 -72413 -52098 -165790
10159 -165790 178341 -55145 -28848 -347867 -224353 49294 25190 7028 -80169 215557 120901
10148 120901 7921 196499 -64129 -50167 -45059 -44760 176907 -169925 -207707 151957 -74675
10136 -66206 -98655 -202041 65441 -218148 35244 -176739 -400692 304981 69768 -312213
10125 -41843 -25861 -156158 -4948 -356628 -50559 39129 -222709 354423 -121502 -355138 -31461
10113 -444413 -89278 -75641 53356 -275089 -24005 -9602 -196461 95770 223337 65311 -94420
10101 397547 16630 79759 -138667 -155818 272905 -144238 161274 -89540 -161478 -130389 -33320
10089 -388784 -205854 -93264 -203235 243308 -380228 -313089 -236120 197283 -127809 182818
10078 97408 -240258 171145 -14147 -62739 199430 -84408 -72729 -44584 74917 41185 -402355
10066 -325226 -179724 -184083 312701 10735 -25307 -144136 -172376 -83020 -70619 -318936 259748
10054 -22708 -159021 -130910 -324461 -139910 106120 -257681 -91478 -252650 6976 -100767
10043 81152 -400321 -154300 283635 -357330 32271 -383806 121585 -183628 -140302 -237274
10033 -237274 -17 -375494 -23200 -25418 -83382 91426 -139000 72194 -231345 -72210 -56250 146483
10020 -83856 -168168 89360 -210565 -253654 87741 179357 -77171 107091 332917 -77089 -37188
10008 202609 9477 -182016 -29735 -293623 133530 -369814 180045 -266050 35213 -13237
9997 179933 -20484 72875 66299 -250092 -219575 -431413 -110386 -285587 -247488 -138358 146690
9985 -70775 125115 39833 -104299 -218638 72197 -100986 -307255 -80297 -405391 21573 -77187
9973 151563 88351 -56616 110828 127165 -56810 -191700 -228541 5700 -213463 -58318 -81030
9962 -81030 -163251 -95281 74773 94916 -165600 387281 -87455 72258 -278735 8593 -17185
9950 71670 -284249 113865 -96206 -158204 -30739 140901 -6202 -112387 -334080 -206880 -15042
9938 75555 -337311 -181542 -124892 68581 -192977 110896 1559 38173 -38123 106367 -199016
9926 -174500 -124191 -12083 141935 776 222958 -194445 -81830 57886 224828 14390 -322594
9914 33972 -12938 -43652 -138186 -110342 -61207 -57282 52915 -21220 130717 65402 -793 -64564
9902 -64564 -215188 -100557 -65434 190078 212968 92684 -29104 13766 -121756 212791 9520
9890 -240830 85019 -229639 -422172 -151731 -136507 8197 -167321 -136735 -441008 -466577 -57276
9878 -25102 171676 111240 -246115 -60405 -330374 -101152 -200803 -211493 -282397 -30738 -3353
9866 -342917 167393 -50249 141031 201188 -91335 -183112 -245610 -155597 -284488 -19738 -210747
9855 -210747 251035 153172 -45105 -3720 -52771 35691 -68157 -145363 100336 -107734 40687
9843 89180 -276837 289411 -130580 -77091 102301 117950 -751 80192 196142 -39381 -136574
9832 -136574 -90576 -80115 145992 -289924 94418 -124642 -139187 8897 179121 -239538 -115930
9820 -117264 -63717 134217 -106938 -131732 -343034 8122 87420 -301733 85394 -122976 104577
9808 -53093 -51569 -32981 112902 45250 11669 -109465 19018 -120090 -196907 8406 -233579
9796 -98360 -273118 -69802 -115796 -88033 -108440 -29589 204537 -104302 110169 -45925 -145836
9785 -145836 72434 -89444 -63255 -31877 88202 -144266 -144957 -112127 -255422 180430 -186748
9773 147887 44644 42587 -14337 11587 -44399 -9834 -225512 -18836 -77683 -76324 -75489 37614
9760 -229204 113726 -145885 134943 -197343 -103534 -189614 -235012 -16070 -330078 223811
9749 -181878 -263256 53167 193806 294111 116449 111159 361367 82952 -138986 103841 -149784
9737 54357 -293965 -72059 -130731 190335 -195139 1909 -90876 -144522 -185407 -152051 55484
9725 -205454 -180641 74057 -162103 125152 87509 -241443 -112486 168199 21210 -53274 -72826
9714 -72826 -137493 115334 -181753 233150 246739 -224360 185266 -193022 20463 -95337 -256604
9703 -256604 4854 9447 172302 -389101 -147564 -330094 -151576 -47058 -284245 180263 164073
9692 164073 51716 -241293 -6090 25757 255605 -61211 -119425 -140645 -129056 78984 -374464
9680 -205560 -239253 -264788 110646 -205579 -104804 -149493 -58052 -209372 -221865 -38422 27619
9668 -14166 59479 -41624 225682 -109783 -283056 79223 -1119 -21433 46855 19983 113527
9657 113527 -84422 -248816 -110534 -411940 88836 -186278 117418 102420 135220 -17102 77920
9645 -496052 -220821 -295959 60326 -174288 -191218 127513 -175822 -397123 -638256 -238957
9634 86821 52220 151859 128126 -183187 163393 180121 -71937 -103770 -113143 -360233 -326366
9623 -326366 -219764 -251864 -2142 -23489 -218628 -106179 120304 -200717 187164 -36895 -184374
9612 -184374 -35477 26585 269324 82785 -57506 -20900 -221419 -150434 82826 -190181 222200
9600 121358 -153097 -196849 143534 -167927 -53226 -347416 -455458 -144692 -92395 61169
9589 -52682 165243 -72164 196145 80468 -313842 -85245 -85267 100 -278380 -320375 -279836 -10812
9576 174468 -123084 -69488 -311661 76412 -64752 -149233 -107982 101047 317942 106882 -187892
9564 156093 -200689 103162 -177496 18564 17621 -203600 -107158 -112236 218240 -10310 58256
9552 291100 -248746 45981 -50532 117451 312720 28511 -249108 -268150 97585 106887 -182885
9540 -105507 -267792 -150904 185187 -32613 -21641 14192 -163224 95477 113050 -127230 -135494
9529 -135494 -154174 -92263 -88132 14867 27726 -361680 -166424 39502 51336 -65872 -108148
9518 -108148 -352892 -203891 -257397 181084 -15075 -46481 -107378 -102742 -142794 -93594 -117113
9507 -117113 -137509 -171951 -185436 -183615 66674 112343 -194779 233848 -103756 -202769 244053
9495 94015 27543 52133 244289 -116427 22073 80337 -144400 -192511 -26585 -147687 -303518
9484 -303518 51366 36970 130181 -319201 -25262 -328799 11448 54250 56092 -120011 -108146
9473 -108146 -111933 -145491 -226895 -112900 259690 310463 -83925 -87108 -340740 87503 -94877
9461 -41748 300966 165434 250521 70427 -180668 -101945 -204262 37245 144878 77979 41817
9450 41817 65693 16455 -136099 210299 -252972 -211429 -406179 -215892 -168232 -81042 130352
9438 -244517 -492434 263074 -159791 -484706 -56682 21127 -159828 -284085 -39708 42625
9427 -53564 -229627 -115907 -86335 72718 87044 -52079 -34465 -311563 217224 -204182 -372315
9416 -372315 -279041 -239092 141311 -206336 -42271 -329 70496 95220 -67941 -24943 61251 55249
9404 55249 -153309 -93882 305933 12704 -6770 45989 70412 285311 -171059 -128841 -469395
9393 -469395 -205019 11611 32081 99951 -315158 -110559 -279883 73490 140756 32977 -44019
9381 -196973 44390 -309651 186081 12389 -152950 75396 146326 -20604 -381228 -255908 -480038
9370 -480038 -125830 -293013 -75369 -67995 -249308 188100 -441865 -100556 -424177 -81673
9359 22161 355742 371448 -158823 -213684 -168332 -121646 -38885 -256577 83024 -321874 -344265
9348 -344265 1063 -108778 -766 -136589 187559 50536 255281 -239894 180831 132733 -107082
9336 -104701 63720 64559 299829 -68975 -142811 -37432 -112326 -370276 45135 -83260 -84095 2708
9323 -84974 -155650 197689 -311763 -185600 240205 162322 -140647 80066 54258 48990 -20771
9311 45250 43784 -53990 121288 -42115 190615 -207257 -212548 -266696 -119429 -321984 -287112
9300 -287112 -215061 -46818 -345200 105489 -58044 -56180 -299622 64620 173852 -146944 -177826
9289 -177826 -108356 -137027 -106418 52408 166470 -197972 -48696 22663 -301867 47747 -243584
9277 -182198 -134846 -69271 36693 -188991 -229802 -24066 137514 -200139 -145409 258560 -170849
9265 -4664 172979 69043 201223 -41112 128269 -247213 321815 19671 -113406 -104618 63033
9253 291707 12755 -228498 -425349 -19110 -376672 -109626 -20621 -171850 -56822 -204625
9243 -204625 -468367 143020 82516 25201 -119284 -179992 -200831 -82269 158000 83817 66848
9232 66848 -142085 -40768 110483 -208418 122025 175602 -250426 -171064 -10945 15536 -48323
9220 -29907 -348824 -90329 -311841 -73638 41727 -128957 -361047 -45490 -180648 -70622 -355030
9209 -355030 -101813 -121474 -45326 81163 -20054 -146544 -13233 -91085 96257 -42297 -227139
9198 -227139 -467435 -129040 -129395 -50452 53815 89390 -75069 143384 -344251 -136234 -310013
9187 -310013 -130368 49474 967 29566 -188643 -23242 206660 12803 -253637 156577 -105033
9175 137221 54176 17531 116825 160417 -164534 -405931 6445 2796 -246192 59398 27674
9163 -24181 122398 27909 -136691 -126305 -101011 -7211 79759 -51775 -276699 -195313 -43465
9151 70455 -326530 -21868 -259809 -130840 -113402 80027 46060 -335128 104926 218981 63665
9139 109883 -114611 209256 200906 -16559 116063 -74053 -103448 -130932 182257 -258719 225384
9127 -302764 277162 -148397 -152937 -203879 -196761 -309516 -326423 -103400 136108 -74334 -356416
9116 -356416 -130667 -184799 -117812 107823 -382322 101581 -117750 49548 106974 155167 -147207
9104 141514 -239646 -30825 -84505 -139090 117191 202028 -39083 -320604 54459 248275 -314575
9092 -60705 -300580 19036 113583 -13181 12335 56559 -64032 -400486 92827 117139 -3018 217051
9079 -95536 109941 -60323 32915 -171598 80010 -43530 -52764 42119 -191300 183140 -223831
9067 -95893 -174548 -73203 21690 -72227 -178242 -53452 192896 -415065 -62025 -112447 -95082
9056 -95082 93915 -166296 104665 25186 20407 70814 -164 135869 -176934 -67841 -208775
9045 -208775 -203999 -192521 -253446 -96585 1767 -65224 -225436 -49718 136436 -168901 205725
9033 277986 78101 -78710 -186274 -341333 -284324 -396779 39711 143785 -221680 -10098 -5027
9021 99743 -193038 198010 -279123 242000 64770 -144723 -228649 -132014 -104944 135090 -151059
9009 -48919 94970 181725 22250 173682 -156947 -35174 -132722 -100397 -187303 -28900 -167354
8998 -167354 232894 -349759 5512 77102 -266499 -107771 -189124 67066 323226 91961 65205
8987 65205 -237450 -57975 -239661 8374 40631 -90881 -114215 54679 24231 -10768 15584 -124612
8974 205861 215691 104691 -29311 -42420 -299765 123396 134419 -140802 244034 20399 -86186
8962 364574 -302598 -155622 -65382 -144857 -225157 -184011 -124319 -26666 -128657 28458 -155985
8950 -315976 -150410 -60610 -154450 -32404 -129756 -173734 -188678 -275786 -105912 143551 -119567
8938 -32824 -217975 73575 -188295 -345479 42055 -152151 -93409 256691 4512 16766 -176279
8926 -16839 42738 57623 -193339 39288 64575 57458 41478 63644 634659 375899 -41038
8914 195181 168328 229995 221777 488250 834131 898883 1528792 2832330 5861135 11478423
8904 11478423 4677063 2125157 1384946 882383 481911 758902 186612 476585 95876
8894 234600 235785 5530 47213 268871 90420 52429 -303263 16921 71140 -7485 -185661 -19954
8881 96500 -298883 33222 60398 -268902 8333 -398359 -137519 -103928 311060 -277318 -202843
8870 -202843 -248032 123654 34425 -78168 201844 -247980 -160235 -227662 -57795 -52200 203760
8858 46514 -185508 131991 -85982 131402 -111029 -79573 329071 -32841 -78546 -165355 190792
8846 -16200 -45818 -116622 -180137 169054 -229592 45913 184733 258335 58829 -116713 -1585
8834 -35976 83374 -108910 -124163 -23669 -5695 184155 -48541 -19028 210016 -219450 54928
8822 -184195 -97994 15101 -129538 -116873 -48793 -180994 -108447 37343 -18864 44510 45269 -255268
8809 -64843 -100621 91766 -152106 16267 -275306 189318 -127645 242709 -99283 -45861 131567
8797 -271663 154091 -62393 221916 -148136 165255 -285692 335166 -254879 263229 -73063
8786 -85896 -72922 -477 -186502 76660 -57213 -66300 -77148 -281229 -122837 -71370 -208556 -98113
8773 59020 88186 -177681 -181388 161965 -430975 -236001 -202554 6428 59460 -231713 -46244
8761 131588 -210953 -170465 -42972 180905 120447 158795 -242055 27842 -38000 -20901 234435
8749 74531 -33856 -34813 67823 -230577 -320889 180305 -265081 239107 -226351 -192998 -140415
8738 -140415 123362 -191464 -285097 134496 79330 -190799 271594 148845 145272 204632 33811
8726 -41895 175371 15167 -99992 227603 -187688 -219044 61992 -42660 -137901 138016 44685
8714 -90137 -118667 1290 -226299 -15522 -19386 -369868 -90965 -87229 -66248 -256373 -215608 24290
8701 185412 -65528 -192016 401366 -2319 99658 -163940 -137833 -14379 -431399 -12124 -98780
8690 -98780 -69218 -180519 -88565 -239733 14933 -195270 62691 12090 12868 69829 -97747 -73887
8678 -73887 -130181 243167 197003 -279445 -101498 -108695 79065 -72710 208734 52747 52279 -211041
8665 249139 -56550 114066 14049 35703 -98012 -167936 -97560 -292697 -169137 -52625 -115951
8654 -115951 -7811 -64350 138116 -14314 -138463 23116 3601 -124386 -202433 226862 292845
8643 292845 -44407 3294 108056 -79099 -12223 -69824 -118445 -457604 -235461 -114529 -161267
8632 -161267 -43853 -115715 -29393 24576 -39134 -41555 -203092 174073 -130493 -380291 -93106
8620 -237096 -220572 -70497 19983 272439 -89792 -281450 171182 -10152 200470 76530 -313195
8608 78753 -402462 -169426 -100306 118162 58919 42453 -93698 9629 -36165 -210148 -175972
8597 -175972 71555 274880 -173496 -244102 -188764 192742 146408 75074 -404045 204736 -106549
8585 221101 -70112 -329168 -89006 296940 -37992 -125481 -260127 -322117 11132 281143 139312
8573 -360924 -94992 236876 -145123 -8170 98112 454399 45595 94650 -233486 -177026 -79908
8561 -43863 -97933 178049 -490741 -20407 172149 12710 -109972 -168666 -26322 -67536 -362177
8550 -362177 -116100 -117117 80967 349040 -42925 -60574 -42786 74577 171173 86399 -80236
8538 -57285 15316 77587 -142237 116522 -138403 -74259 175618 -71635 173 38693 -21581
8526 17950 94617 -279848 -192507 -43436 -58125 -495621 149278 -111930 73810 -426615 -215962
8515 -215962 -41281 233435 -277142 -42143 -321403 4682 -288016 -92369 -190917 -155661 -103058
8504 -103058 119635 82913 -154584 -221244 62543 -359002 101754 121327 -104427 -50743 -201624
8493 -201624 -129431 -216382 -52853 -240395 -415584 48602 83484 -42655 -379026 -29681 -353694
8482 -353694 -91391 13457 186500 23533 -166969 -15412 -347005 238060 -111367 -346283
8472 -346283 -104991 388170 -234050 -94503 -309340 190336 -399924 -321061 -199675 -189572
8462 -189572 -238522 60177 15457 54733 90496 -12571 -49382 38626 -179052 25647 103936
8451 103936 -53591 -180376 55267 -85969 -86619 72305 5789 -278961 -41460 154615 -99030 -263599
8439 -263599 39138 353750 -95429 -107875 39272 -247714 165662 -15270 164082 -79633 -200058
8428 -200058 -333739 -144041 10598 101626 -203229 -66281 -13278 -54795 213935 -188643 -45669
8416 -136706 -169907 -187991 45887 -225795 -192812 85063 316822 126007 -315669 -348794 -510
8404 -49872 -341795 -605 -250064 365152 74042 -294036 -76886 58448 135069 259408 28805
8392 -109072 -159070 -158697 80192 -20801 -114377 39030 138271 26238 72468 79044 -135940 -411389
8380 -411389 -84533 -11546 -27939 107818 -354574 -212429 -247322 249233 -186094 195944
8369 -347607 47944 -49391 299326 -186071 -187102 -134149 -439 -147041 -118445 -34530 102992
8357 480787 126225 -100449 59812 -296101 -178783 -18939 -106439 -381249 28173 -157820
8346 56411 -234818 24836 14750 66520 231276 -225214 261475 93300 92438 331349 5523
8334 188305 76780 -115214 193377 -266877 25426 96110 272050 -123678 -48133 205440
8323 -32183 214107 66074 39565 124854 -448002 -214235 149934 -299803 228454 -179478
8312 -17182 -108178 -5548 -281211 -320506 11299 -123691 -127780 52810 -43647 270831 -44635 204544
8299 126328 48601 -332892 -252397 -45654 52328 -55543 -77811 31624 30755 31811 -90959 12595
8286 -387888 111517 -176703 -377500 -246707 -134217 -89937 -169174 -209638 -27526 -18541 117249
8274 -114223 9142 -55598 -108771 -199732 -123704 42659 -133357 -36081 80007 -231423 85772
8262 5783 -157234 -295144 26590 62336 -90955 -129906 -140700 -124124 280901 -608095 87080
8250 -200123 52653 -140398 84563 2236 -8464 -291921 -25216 143305 -41376 13158 -20015
8238 74821 13771 -365840 503747 13861 -61986 177056 -147471 -135524 310693 -262346 -30546
8226 -190075 92139 56361 -67024 -179525 -163288 90645 -33555 -218038 306058 -138839 -26313
8214 -96016 -13085 -161093 -69656 -78586 -98784 -122821 -247685 -73666 6955 -117642 -4745 -33758
8202 -33758 -251218 134038 5042 1258 36852 -197001 246674 52636 -111565 -165178 84958
8190 -33320 -54363 20625 -78162 108975 -230008 -168759 -218847 144610 -109485 -66101 -99624
8179 -99624 -346164 -40567 -110225 93422 88006 -166148 74306 -27590 66620 310131 157729
8168 157729 -157066 -263375 -154311 267003 234622 -3137 -11400 125751 228649 -2073 129053
8156 -281508 151949 292559 -25561 -275561 -8846 174244 3756 21816 -91178 35267 -246892
8144 139030 319717 -40546 7025 -217466 -37871 127205 -204272 -43046 28502 -309522 194914
8132 -100648 -185764 -65273 -21408 -219886 -157109 224925 123703 1333 181336 259367 3645
8120 68680 95770 -54978 -175447 -33592 -78739 196186 -301139 -114682 184817 -395199 -118439
8108 199387 -402464 -56609 -119933 474 -45647 -58292 212122 -124141 96671 -110178 -45476
8096 70296 177579 71902 405404 98939 66635 -31871 16602 -349285 -58773 197277 -89971
8084 90720 -23629 -128598 -7890 60844 -215397 125852 -129270 -164871 -105871 55298 -91785
8072 -7052 -50458 138054 105409 107796 71567 -50009 -58353 -546896 106954 57243 29900 -89235
8059 -211696 -101527 -98155 -119573 -98965 -201508 254561 165287 -4385 94213 -357800 139525
8047 52469 -48703 -89082 83765 71745 183198 -90088 -68229 -336341 -108670 21415 -123506
8035 -87002 288800 -278118 -3129 20206 32879 252099 229243 -14363 194588 -296721 -100233
8023 54421 -196476 -66117 -381087 -310110 -275128 -34446 92573 -107671 -46680 -59743 -286570
8012 -286570 111713 -89681 -40341 -227928 -398461 37941 -55476 273604 50507 -340711 -70854
8000 98463 -68712 -34355 -171594 266632 48759 -148678 73260 169404 85877 106814 258460
7989 258460 44827 -123320 116745 143926 -143801 47402 -262704 119999 -65153 -190514
7979 -190514 -165688 -245301 160247 241879 -396500 62464 -8894 318774 -142049 -314940 -13014
7967 -122336 402542 -282813 60657 139483 290741 40893 -130377 -294584 -178389 -56531
7956 -63304 -71754 -106909 -176609 -162089 96148 -87850 73931 -75135 103890 -42743 -177255 129575
7943 -79548 298597 -23738 -98713 60603 -273308 -139975 -65215 -25663 298401 368592 -350771
7931 -3247 -380869 -176087 387273 60744 38909 -65906 145979 327726 -191399 57333 205518
7920 205518 -64171 -136301 -149113 154813 69591 216832 265047 -141857 121082 -135115 -70880
7909 -70880 13793 -164098 -32045 -43288 -47195 -159710 247845 -37980 -238609 -66662 22088
7897 291023 -7175 -154014 8807 -250377 -21796 -138862 -398189 10033 -190187 -302187 -42070
7885 203378 10644 -109150 448453 176831 -151945 -74810 263126 143408 -92474 -48678
7875 -48678 71969 103010 -13861 -40612 -110878 -294562 -131868 118404 -155844 -195851 -24028
7863 -364977 -112087 -184816 152038 -220754 52943 96312 66471 3868 253419 -8440 -28864
7852 -28864 200464 -14366 -81564 306010 -197824 -265281 113069 -375952 -284686 -168 111772
7840 118073 -150565 162432 -27258 -253420 -316781 -161808 -165319 -187401 14947 -86412 39551
7828 -602350 -204006 -467443 -83091 -39713 -164939 -219772 -9307 -92188 -4845 -33092 -137825
7817 -137825 196582 -29019 -133313 -69511 86585 -29540 197858 64482 52577 -214116 -90986
7805 -304751 -3850 -61447 -39967 -50419 208318 194298 102118 69551 -138904 -342959 14744
7793 -127218 93364 -149592 488811 -246121 57833 154973 -311356 -78420 -25500 -427950 21714
7781 -281400 -196810 41022 181688 26198 91752 274431 -185802 -83279 120759 -150142 -14806
7769 -256721 -237055 -28240 -309133 21438 -134779 -43191 -216179 110488 198894 -220260 148449
7757 206918 -48980 117135 270526 -84022 -143834 -257622 39537 278539 -75294 -73391 -154660
7746 -154660 33459 -121999 30113 -214436 -47523 -95040 31036 95700 18029 85672 66630
7735 66630 41367 -66655 -234755 86595 49793 -129889 -89264 28177 199536 -106990 28135
7723 -40100 178193 -80084 -94948 218363 311183 -78437 -68927 -120862 19128 -278643 85844
7711 22182 -254727 218207 -78097 -143173 348361 129402 166382 -111020 69147 107262 74413
7700 74413 233365 -314224 9876 -212036 42698 -286396 -371513 28563 47758 -11243 -26444
7689 -26444 -133245 -319648 -293965 -30977 149668 -204038 178493 30966 -241591 -317456 -29892
7677 177651 74330 -339088 -34864 -170512 47950 10465 44528 -147704 97736 266780 52310
7665 -79988 -239721 -218265 177317 -458995 -384917 37013 -177068 -192931 -200394 -154141 -107532
7654 -107532 -71757 -311366 -233544 190127 41101 176658 -161191 58028 113822 178910 -543568
7642 -394685 30089 -55465 -167710 65285 447583 -19187 129042 68837 171847 -100464 -107789
7631 -107789 245128 -100428 -109729 215088 2154 138542 -55161 -33355 -149994 -250653 124957
7619 16263 114261 -198431 9287 283986 -76508 -189486 -106294 -269602 8487 3234 159218
7608 159218 -169791 78343 -69895 213700 129105 62511 -19393 -121891 -12952 76826 294893
7597 294893 -47385 -571986 -269933 254951 306245 242492 -183969 31851 -335056 120738
7586 160215 141965 111447 -144864 -263969 78737 -179883 -19094 -189818 56083 -297893 135639
7574 -226772 -210855 158312 -120899 -50839 -445230 142744 -177873 158038 -23460 -218375
7564 -218375 123281 252957 -18056 139136 162040 40847 -14033 332220 -5531 141281 9528
7552 -95242 64711 -196455 -68478 -95241 -96813 -106831 206598 39348 172585 -15834 -96109
7541 -96109 -136303 -342474 -23069 -68996 -170481 -18631 -26460 -73662 -78261 -106081 69209 146044
7529 146044 -61103 -443306 -30628 -261688 -265341 -181682 20342 39786 24289 313344 12349
7517 144612 -247735 -203934 84430 -201933 -157009 206747 46221 -18970 -38943 -171534 64226
7505 -28808 -9560 41519 1835 -129408 -274616 64851 49004 325868 20308 172582 -23242
7493 8639 -111575 122387 -208937 -199706 9335 -49365 -235337 150490 162561 174621 229636
7482 229636 61012 -591 -175908 -72604 -216077 -124234 -130110 106339 153090 -6399 -274165 160449
7469 25832 28491 122851 -211625 89427 -235802 10102 -60159 219460 -195483 -78029 62463
7457 219858 27192 191516 -81405 -6087 38000 102709 102344 81862 273782 24674 -294173 -2720
7444 201471 -54195 -223936 14044 50114 -207731 -130459 -95063 -130923 30292 -71454 -186808
7433 -186808 152683 7587 202727 72260 108382 61582 12487 47410 -77916 -262546 -183434
7422 -183434 -127232 100826 108910 40719 116230 185107 334902 -194744 -247074 -125253 122779
7410 -31574 45392 205078 16535 -242775 -288361 -293771 203380 295782 -284996 -228108 137353
7398 106010 63973 16167 -137403 -427962 -43099 72447 -84390 -72271 -292087 -36515 -141062
7387 -141062 -196258 -60155 -189270 -247812 -80905 -94695 30787 -64159 40029 189257 -66706
7375 5634 -227370 -46460 85623 -123065 137442 130937 -20485 -198696 -224347 -102072 53057
7363 -239537 120027 40646 88321 -232675 -155149 84378 -553044 -421808 -160172 -331867
7353 -331867 -319764 21771 119820 -20940 -12095 -152021 266474 -12094 -33029 -162036 332676
7341 165535 191563 54139 -365437 -120054 -3234 -6232 -305862 89437 2274 -45987 -234164
7330 -234164 -10979 -132442 -244407 -95951 -38554 170603 -26705 -199288 327824 146144
7319 27885 38262 25861 165393 256893 -64062 -55089 158290 131170 -17622 55925 -115037
7307 -205132 20465 -39809 62274 138340 -130755 -76755 45115 375195 -259807 -201994 -67516
7295 213863 -180909 30749 -309652 -193716 -158326 -9265 -173653 -185351 107163 -345492 248190
7283 178211 -64750 -115639 -138268 83738 139670 113382 -70904 -4528 -182545 -100024 -366174
7272 -366174 -90408 -78844 -39347 365609 -212184 24065 226666 53736 92484 -63780 187894
7260 -64299 -7204 37400 -137762 227759 94382 172749 -105955 -230129 201143 65165 -217234
7248 -153116 -62721 292994 -137575 -158614 732 -368830 -83210 182052 -129021 -41628 -5482
7236 136336 464115 183912 -85737 -178509 167883 -240129 -202317 -341831 30617 -48915 76949
7224 -87132 23429 -254359 304546 224352 -114802 -85307 222846 -7279 131178 68288 -47923
7212 297220 3657 1258 -226 -425214 72219 -95864 16300 -175766 -49759 -227921 61007 96778
7200 96778 59556 96102 -334559 -232638 -17256 -162717 -7650 -122615 -82381 39072 -180090
7188 58469 55514 91097 -40287 -102550 401184 -152065 62228 22367 -123798 202107 -220846
7176 323558 -318522 -120371 48261 -100052 323148 110530 -15184 323090 182383 -224781
7165 125758 -33299 -453564 -224430 240166 -266400 -83150 -70038 -172004 117203 -239262
7154 -228070 -224357 -243357 -184390 -180165 -58098 93350 66471 69357 -283689 -39681 -135020 232150
7141 175714 52962 -159658 -394808 -26508 -106879 26136 -151747 113371 284471 103244
7130 -211766 230344 -6541 139101 49021 118028 162273 -268223 -20496 -39601 -95978 -241754
7119 -241754 -43456 128146 112066 293238 11652 -163282 40347 205105 -6562 -186387 95409
7107 145507 235215 -48061 -110023 -297819 -158132 92317 35999 -153880 -108337 -13762 342707
7095 -187644 30199 -68139 -12267 -70719 212737 138850 1240 59982 -254279 -46089 33323
7083 -64993 -126098 -216741 85061 -128043 22684 -64458 207120 -216388 -50243 314836 331585
7072 331585 -180301 -218754 -58623 246924 -68718 139580 -320003 -75020 4705 -192212 98981
7060 -29643 -15713 -11489 -96303 85358 131458 -119608 97014 -363464 219248 217282 -39399 -101640
7048 -101640 -118613 -184558 163471 54764 -374238 72225 -177405 -394617 -13407 98904 37390
7036 -76889 23574 8057 -83235 -1087 -98743 -75559 11448 -61095 -130012 198678 278848 17093
7023 -73267 -123932 -23921 145534 -238078 -178736 181024 -173293 -383413 -10648 -50081 127598
7011 41055 87186 27321 -219528 287886 57155 79832 -7051 111299 -360695 129367 -80449
6999 44686 45893 134369 -139633 61528 -57052 -443896 -84681 -218845 -78658 -33241 134925
6987 -66502 291646 -85407 148952 83251 7891 -27768 -253110 35296 11437 -70021 -194342
6976 -194342 -236063 -82682 6915 64833 -238145 145937 -219547 49328 -356582 94803 85547
6965 85547 147527 -106693 297830 -95929 -317138 -54282 297348 -119747 234811 186381 87570
6953 -130989 185972 119328 -21 38881 -200587 -181343 172840 -190356 -373001 -53256 -40291
6942 -40291 -133845 -7619 224357 -208660 -230701 -64781 -118119 7274 123017 -58487 -61768 33590
6929 244910 -226732 -135338 33265 -194052 201398 -406281 53215 -331791 -360725 -63992 45250
6917 103253 -120459 -241195 169910 13840 -46222 31668 373354 192539 -278506 -115844
6906 -212200 -350613 103676 -244064 -29203 50159 -249032 -121051 95119 30534 -1168 73
6894 36549 232123 323498 50123 -54483 -32908 -303788 110541 -68545 -4600 -83656 -71634
6883 -71634 31396 70634 66565 -24507 -309563 -42621 72954 -898 90967 206512 -69211 189563
6870 237921 88886 -90369 137420 28990 8077 17406 25247 -30901 108957 -64013 -251594 40180
6857 -169932 384014 -132778 -161589 -113345 -79888 -110311 -97104 100353 -4492 -30797 -55058
6846 -55058 -154156 -10116 -336463 152683 60668 -251020 -82561 -208009 45161 32456 -281210
6834 -336631 -64877 79720 -57178 78821 -162186 -102865 203932 6705 -51707 295797 -417872
6822 -32120 -21616 24629 107789 -175024 -145526 -162537 -120338 -220031 -212929 -179238 -464068 136276
6809 -243835 119091 -203785 98755 223453 181487 -159292 -61314 -89524 216647 89004 123357
6798 123357 24180 235725 3797 -153187 -49653 -324076 -66027 -298216 -90304 109928 159714
6787 159714 -146828 -215941 -27427 -283604 -24300 -337136 247246 -9650 -280335 -216669 168322
6775 235558 133892 43270 169818 119165 -19972 -118963 -141310 133028 107065 -439 -136822
6764 -136822 -220509 -105784 -113050 -159256 23326 -55519 40724 -170495 -55716 -305790 109188
6752 39399 -103032 240297 -101472 14365 26454 -150347 -17899 -115924 -36505 53524 368692
6741 368692 -192937 178167 -22584 -47191 189345 83198 -420539 83732 78221 -127241 -463956
6730 -463956 75943 -254746 14495 -12939 60452 83951 -360403 109791 140550 -227804 -86968
6718 -217655 -185884 110379 -43222 -70841 -120295 -104929 1211 122965 32945 225200 -52629
6706 -22802 -153397 223508 49707 -18013 264627 -300613 -120737 208262 252619 165539 -168831
6694 -135152 57102 77129 192425 32997 -40059 67007 31239 -34862 15852 97136 47639
6682 -127423 142944 -7780 44701 246415 -102233 -91106 -18168 82891 212870 -329725 -177945
6671 -177945 233287 190275 158261 149787 -187942 -145247 -322557 2314 313356 -10837 44057
6659 -60429 -39614 -181031 -207359 75126 252494 -332 -33778 -270889 -36962 -226202 -17426
6647 199148 221186 -148166 -364228 -214336 117688 -145995 -23493 56511 -913 111288 -171978
6635 55950 -64811 14038 196938 234997 -249953 -240212 58181 -22326 -156531 14019 80266
6624 80266 -92872 -141124 59022 -296534 -70457 -168090 87615 -166056 13930 -136143 50085
6612 168402 -253522 157769 30398 -1519 -34168 3245 346265 60191 -158577 -161613 168645
6600 -8754 41181 115287 -32279 -155864 -141989 8805 266207 143360 1667 -64228 225945 173297
6588 173297 43276 -164520 -167014 153811 -213998 -128056 -261360 -79979 -62590 -90204 -146875
6577 -146875 -146766 -334956 -171690 198782 162223 -249975 -263249 6719 -288594 -201535 -54278
6565 27797 -115553 97000 42159 -244966 149290 -251049 -128085 -59416 -100664 -221904 61616
6553 -255354 5176 -93510 -60122 -133822 162620 95308 -98148 -178213 212081 22323 144144
6542 144144 107347 195288 201340 35522 -95871 125207 -106416 -35448 136853 50233 70538
6531 70538 -157886 574989 250345 -195232 -85541 142565 211087 253739 137923 -12327 -135927
6520 -135927 -390802 -420940 -15408 -152673 -39560 -118414 27232 -17892 -20680 -18276 -52947 -109342
6508 -109342 169568 -111805 5831 -113548 -63759 -19172 -217 -41638 71650 -77595 25780 -114971
6495 -179699 43548 -21781 -98898 365905 -80981 -104102 4747 232423 121747 155084 -48495
6483 84834 57232 222308 37152 -479829 369007 -28994 -26127 432256 30451 75288 -246248
6471 313186 -7876 -29652 -198617 185625 83535 100600 -73505 192890 -25204 164713 -84926
6459 122857 -67436 200043 -202480 -62980 -207192 17694 52040 -172217 93304 45098 38698
6448 38698 -157154 -32653 -62941 18100 -129711 281833 -119664 -68776 -20905 267428 146223
6437 146223 155739 -223268 127485 -195116 -9562 257967 -50646 68635 173570 38268 98140
6426 98140 17363 314561 66915 -236442 -319465 -47086 433 -42467 -249964 -76286 67877 138471
6414 138471 -356971 -170771 -257585 206790 -77430 159726 -430888 -257611 -46855 -13266
6403 -97138 -209495 166857 -92654 6946 45953 -296676 56133 -14286 -97128 75461 -94342
6391 109754 -67334 -130506 131843 235794 10478 78375 -226087 3160 -154867 -28441 240186
6379 116929 -161906 5101 -200527 93510 -47969 220520 -128150 403500 101726 113995 -127509
6367 26359 27048 -136181 50053 -47742 81742 -44085 71174 182106 -21804 74227 -267043 90654
6354 137552 -86871 -160997 313695 166760 -272464 140086 241219 -466019 -68046 -72601 -172183
6343 -172183 -230202 -83252 -184466 513432 172901 -49705 115251 -57285 131544 253509
6333 253509 96728 -13974 -243881 -142331 182708 44395 64139 -62317 -4447 -85162 129363
6321 159162 174888 105614 -151666 296361 109204 -164571 322763 -66720 133796 -93965
6310 -255137 -127280 -53554 -499018 105294 -276398 31300 74214 90356 -30095 -169912 67455
6298 266463 150899 -137442 22503 -153945 21517 -107835 57593 -27418 -61774 -9704 24214
6286 -130648 -13185 42923 52203 140352 -117077 136235 -29977 -165539 -19122 -214003 -27958
6274 208157 -87536 -222976 220582 -151447 145464 74459 -78302 269036 -26930 -317857
6264 -317857 -156511 50512 218953 -26643 132940 -108213 878 -168762 -98661 136258 -406760
6252 35003 -53800 -60313 -183980 56661 -70158 84740 -7672 137359 -45447 280844 -93416 19337
6239 -135025 87356 -184531 -62564 80581 121819 142413 201460 -187261 247842 -200122 -191168
6228 -191168 -139359 -35901 121056 -275188 -35351 -420006 105150 225431 25186 -71655 -191639
6217 -191639 -74183 104482 -326695 -124423 -266956 7036 120210 63568 -107055 48297 77311
6206 77311 283900 173493 -283625 -35098 3265 73062 -137215 10233 -133278 -289226 124445
6194 75287 142713 28463 113606 107897 156472 285971 -43894 -139132 73453 -296923 59290 -458289
6181 -82950 -131746 -77532 42091 26353 -108342 -45291 -60592 -229945 160675 22349 -148253
6169 -242353 -76185 -227090 -29677 -93889 238962 -127679 -161877 113042 59309 -110458 -233886
6158 -233886 -37270 -76230 -60227 -150780 -51813 -232117 -74401 215532 11429 -185885 -251084
6147 -251084 -105812 -234851 230599 7371 115273 -191359 -51100 82536 10898 277769 -312665
6135 498164 -90633 272633 35129 129346 100544 262540 124578 115624 24441 153662 -190086
6123 -25906 -97472 -43858 416312 163223 -8322 20442 51340 -105718 98546 -333875 203260
6111 -117343 -193991 321975 49172 -108059 -17079 -83134 -150976 -32275 146526 -12224 4228
6099 -147147 289076 -191971 -56750 -103818 -238417 -80612 107959 -160755 407409 30105
6088 169872 -36782 -161968 -159530 -343737 -198850 85447 -255801 -216103 -13297 74440 65755
6077 65755 61057 211811 52534 -61602 -27181 -317887 -66853 94880 28052 31982 -302999 236764
6064 -21726 -118007 -51660 65500 -186081 -224970 -80046 -47153 196842 -115465 -193510 269782
6052 -160204 212945 7210 191775 128105 197304 -29126 -123359 -511 186642 -192316 -63742
6040 -11662 261529 -229427 363459 88207 287581 -1759 -355997 114725 -108620 -125549 242533
6028 -86280 -379110 319569 -182667 -231904 49300 11407 113316 123928 9503 -507 -88861 -292431
6016 -292431 -66109 54033 38700 307343 95806 -16276 -236969 -247097 41662 242448 -136069
6004 411197 169673 -57457 -200550 -21565 -93564 -85140 121992 93476 -25274 -273819 -28149
5992 -116146 -28700 -16309 387691 205026 101906 239952 -203474 8689 233700 -122753
5981 172700 310428 193837 47366 114812 199910 387957 34628 -51426 -27738 -234928 -92559
5969 -351384 -96634 -108843 290431 -225022 33620 -226781 37752 -35269 90867 -54189 316410
5957 -190853 -117235 -177458 -149918 -65173 222553 -129607 2120 -14143 -95795 -127654 107272
5945 355446 204082 218382 75467 34835 -84967 -78211 -122020 -75474 4980 -76597 186543 -28819
5932 74307 121148 -27783 -160454 30779 -237169 -230446 -207463 -37469 -112543 -137560 -204167 23033
5919 -17327 -9852 -155386 288980 140422 -110588 -92030 -29943 -103985 -46975 -92672 107418
5907 -74554 261156 490 -94247 104552 131065 -356178 -263370 -35200 -49988 -12543 47028 82140
5895 82140 153529 -293252 -186359 78281 -53725 -49739 -134131 286717 -94233 -130997 30861
5883 40971 -451158 -74090 -49225 -99974 212998 11634 -49666 58623 -171512 89684 -240230
5871 86961 -149404 -39070 91950 47697 -176226 -129439 -13911 112508 -19236 -15394 43943
5859 -49850 126896 -53994 -238038 -84625 52635 301332 50051 -69140 162998 98815 59170
5848 59170 14007 -389419 67011 79252 -31035 -25541 143845 4994 -181263 120737 -291962
5836 -93296 -201688 44807 248503 -114006 -229104 -273474 175597 80756 -424553 102063
5825 -396943 -128673 8968 91761 -7454 -18646 -163561 211970 117515 113839 175961 65605 169161
5813 169161 174057 -230931 35792 43182 -248316 261748 178882 -88546 116502 140803 45952
5801 -100279 269236 61248 68980 69869 206941 -365906 -5439 27678 -2754 -12768 177113 152505
5789 152505 -147761 -159130 81100 79821 -181046 -120306 -57724 54178 -68428 -172694 18402
5777 1006 113937 114165 -173497 -202946 3122 171460 -131681 -72084 174889 -275250 -140290
5766 -140290 124740 143461 57539 259607 -35968 -128309 -5577 -148287 208978 152793 375263
5755 375263 -516024 -69469 -456377 -269082 133584 200282 -57543 20338 -309725 137350
5744 -146949 96509 -9142 -70767 74233 -105909 5401 -45166 78642 20314 79850 87203 -229240
5731 -118216 -193054 -405237 -155732 200337 73662 252748 -172981 259770 -33811 9755 2574
5719 -21497 -112809 -79077 -54140 -24647 -77986 -87934 147045 206174 -468437 45350 -73937 34874
5706 2949 -226903 55633 -271402 -99581 -29344 38934 46787 -297727 -115214 123666 -86456
5694 -149795 144515 -186217 63876 -208447 42577 101544 33916 -101692 -210076 -16341 215075
5682 119029 3178 -105451 -150669 61125 204544 163470 -105721 -103084 -38857 -69826 -62559 -95788
5670 -95788 54251 -114977 -164972 68414 -414576 204062 -96126 101148 -17892 219187 154666
5659 154666 80542 -11014 188040 -482797 -6911 68495 204340 -91540 -30352 -192667 -227637
5648 -227637 146879 -9104 -46511 -139549 305956 -49635 -134006 57859 78050 45884 203121
5637 203121 45532 141590 39399 38985 -51415 -108226 26613 89445 -155828 173457 -58968 358326
5624 -17164 -45120 -49434 -209186 111186 3992 219064 -254409 -214331 -134156 -85768 69852
5612 108886 253001 51342 -30512 125354 -18591 3802 326595 -246653 29071 -527680 -57811
5600 -205601 115918 -87208 -267128 -78187 310822 43491 -114911 -57037 163071 -60627 31980
5588 -182255 -401868 -101980 -144406 -65110 72875 90911 51540 267417 -25937 149619 46357
5576 74436 32457 162281 -38084 96993 65416 -206053 -205926 130098 112150 139262 238786 171954
5564 171954 140427 -63556 20503 -380895 -216558 -65302 65660 106855 52018 -98620 209054
5552 41918 251862 90259 -84354 -75196 -266663 -142420 -165969 125188 87424 -207621 33895
5540 145876 116639 -65443 134985 -246902 -375569 -89155 47655 2908 -86475 -208538 205017
5528 56145 -273141 227572 -434177 86173 147299 -221576 -150326 254179 41080 300734 385327
5517 385327 -384988 -7052 58992 -57567 158150 -83658 141341 7647 292096 59040 -42699
5505 -26047 326653 -7855 94204 4647 -83886 -35013 -179835 -57688 -106520 11064 99757 -83438
5492 -56340 -107983 -102760 548790 67734 -290496 109638 318327 272148 162868 18793 -70633
5480 230218 -205931 -283502 -349902 -77294 -101418 139123 -43167 -224423 -43944 6807 -6737
5468 17573 24917 54524 -98199 1187 148729 -202814 181007 -43742 -12873 21614 -99736 188089
5455 198408 -289352 63731 166391 -226320 -9460 -448003 -293399 -192008 -99180 265129
5444 -401156 -6954 -12095 501433 79084 86300 -161645 57540 -105530 286173 93676 95513 -114329
5431 -93978 484853 209572 -66747 -38150 57544 -120932 -47256 69979 71081 -254275 -102476
5419 -150539 -94691 131766 -145842 -151458 -364526 -31889 -319912 207692 40616 159054 -208896
5407 285899 -195854 -28680 -314304 63307 -1392 160637 -163779 -117940 -43207 433209 -58277
5395 44517 -64869 -228462 -252979 270008 105300 156825 153357 -80280 -146760 -37868 127271
5383 -299768 267220 -163405 -82019 -89956 -213002 -91498 -345765 92700 -9775 -167204 160639
5371 10884 -325488 80843 50394 54428 -82785 279404 -29689 -199206 -102767 118291 -168920
5359 -159531 199704 -154650 -184609 -162623 -36363 -125137 118537 57348 162248 -79382 18232
5347 -167842 -28035 87037 54468 55453 -20509 -36866 -239757 11696 -103050 -294108 -6563 177186
5334 -28510 85474 135504 -19609 154113 209745 121928 172550 211744 162255 88992 -21276 -143124
5322 -143124 -305192 45094 -72679 49051 -28819 119839 -166426 -214365 -132295 153729 233264
5311 233264 -196241 2432 53088 285196 273551 232774 -127143 175224 -54740 60800 81612
5300 81612 517136 -117851 367826 247014 152878 -26225 149590 -111251 112681 7507 127351
5289 127351 -172584 -160044 -46828 -287688 56695 120436 -7790 180893 -59034 94889 -98764
5277 -94442 -294632 165064 -109818 235966 -207361 137044 -79400 435734 -43834 -116985
5267 -116985 24138 136906 246383 194315 37097 -47510 195836 -32183 132779 -166156 15800
5255 97925 169654 23746 -185839 126434 -79290 -173783 -84645 196078 -333801 -150797 14326
5243 199497 -90030 -160420 30091 277599 -81040 10389 215247 172210 -130528 106634 12802
5231 -43326 264261 -247993 149087 -263286 -278532 168760 28415 -172944 25897 -435877
5220 -394676 -123226 177750 64529 -185420 -188508 275231 135117 -117184 264794 91135
5209 -37612 -111367 135305 122426 -213180 -161411 -77239 434195 114704 158930 137541 30491
5197 -35656 218776 414356 -249270 280154 26682 -202925 312234 98310 -156144 146124
5186 125623 -297588 20078 -59607 -62971 -116048 -19930 19702 299465 -197190 160573 107369
5175 107369 -60281 -162840 53576 -176454 81266 79099 -292186 106920 -116156 25274 192868
5164 192868 308493 -117860 -162466 176045 -283545 227113 -200654 -227047 26789 9255 -116345
5152 -360895 -71700 62974 185201 -120512 -116264 -182424 27211 -109365 383284 -44577 26679
5140 -118559 181378 -59540 68102 64248 -62565 114700 -7279 -68305 128565 -92732 177707
5128 236766 -72000 -33070 52016 25760 -97725 -147047 -24734 -3012 -59333 -136285 196108 200793
5116 200793 -137090 -110944 56025 -188413 -249267 -149176 46938 118099 -29761 -189064 -129888
5105 -129888 -295421 -69679 78854 -169781 114894 -220244 -61722 287167 36468 -130490
5094 -324537 -5903 -165317 -72248 -256649 -108699 -153107 -161124 145975 123580 -6602 138810
5082 48319 86156 -339747 103005 -102047 88298 -118748 22398 -161280 -143326 51318 378657
5071 378657 14753 -64324 -108906 42632 227071 40222 258700 -28531 337 85930 67583 36388
5059 36388 -123989 -19988 -6443 -231332 -96090 -361561 -200745 15186 -51783 194395 65925
5047 118171 -118671 -87841 5186 -73492 83592 229773 160489 317768 -138041 267290 -155095
5035 -146111 427506 36987 61823 72898 -78454 232998 -46731 211933 172157 38321 -125556
5023 316579 89427 113300 196725 -58346 438196 36844 -239782 145975 -18635 -71776 70537
5011 229964 37595 161038 -19593 90308 -134745 41536 30860 158674 -291010 -97321 310803
4999 175446 -222447 220026 -96162 -108548 -25522 -38163 -80341 58722 245797 -217779 -36556
4987 -298837 -132261 -139108 84931 -184920 -512481 207095 -174641 124018 -306027 -186634
4977 -186634 -184798 112634 -26532 263043 203786 -160292 -4459 40828 43548 -252133 143696
4965 40848 39492 10824 69529 -205365 -72753 63161 209139 -61038 -276502 324418 172294
4954 172294 -71632 -138829 23131 145753 52228 363020 21614 333559 224174 38388 79034
4943 79034 -104246 -483281 -105794 -127660 71872 -118677 243500 -160990 -23769 -44820 -301682
4932 -301682 -232328 138710 153879 -29512 86407 -220787 -72226 45156 -12750 -165533 -148417
4921 -148417 -53578 291273 -106552 193479 82477 -383685 -403438 -60545 101143 202793
4911 202793 223715 44041 -118655 316438 177932 -42193 269940 79885 -167185 -39925 -18055
4899 115626 278492 152993 207184 -76607 156112 -112751 -227970 345365 105806 40458
4888 -175619 -89998 119426 247940 28021 -407423 249760 61022 -140803 -81803 -186397
4878 -186397 97926 -11895 -147710 -291537 16884 -224328 -225804 -243634 -176999 -79420 162482
4866 181934 -117893 55432 -143528 -119175 -65539 -130606 -285279 305509 99373 -173966 46676
4854 167728 113780 219076 -233698 -132777 -174141 -263296 165316 180611 -99380 -118730 309512
4842 -237896 291190 -23897 35162 -117554 -194772 -59090 53824 -76197 -190527 -47100 -68323
4831 -68323 157253 139627 114056 5807 21466 -242285 162859 -347271 -210132 -4497 58408
4819 72500 -49665 -223557 -148538 -367132 46872 319775 122919 -146163 62355 223272 -3891
4807 92089 -19929 -122169 -188028 255633 251098 113848 -35481 -316501 -12921 -441401 -34876
4795 5644 119998 -17208 195386 101636 -86972 24796 222131 26192 181868 211208 282902
4784 282902 -90686 27925 268302 84408 237676 69076 122795 316980 223590 157844 -323450
4772 -269449 -35732 97600 143844 34624 365258 -206236 -98581 -101912 -93495 148875 -26987
4760 -2725 -362349 -127210 -84031 -57089 51615 -181569 -168911 392187 -62612 24092 -145331
4748 -173544 -56177 225321 -98745 231020 363524 -172570 -112868 -116248 -111661 -246514 -107235
4736 -9890 63520 110952 424867 388885 -293023 360671 -15694 -154916 70312 -15954 269407
4724 102948 512856 100553 -42494 6670 134209 14057 -30078 -353652 -250131 -70921 174483
4712 -210607 -102440 -97118 10508 1481 -184709 149622 -336428 -39687 -164679 97762 -203817
4700 25894 40530 -231875 68171 -297848 341409 -3688 25915 85752 -17952 264545 91050
4688 2948 -46332 27550 291597 242928 -65934 -37259 -199538 -73821 252429 47579 -61485
4676 213704 -296319 -184674 129769 -95534 197520 233348 -240833 26556 118997 -106736
4665 -150831 7585 111245 -75705 66325 292419 54126 98391 67956 -88260 -175656 -207115
4654 -207115 368812 4848 112608 -66755 -289329 144342 -20256 -36850 212497 147672 99960
4643 99960 259966 11871 128825 337529 253379 -119167 37816 -80833 17225 -238321 210414
4631 285501 -235585 -151071 -201582 104090 -201265 -27554 37852 -50453 271301 -30340 -176800
4620 -176800 37790 -71571 -409957 -263049 124773 210411 -141579 -50216 71312 -10539 28881
4608 19266 114458 203477 57335 -69171 -66936 141280 146109 166126 100531 178109 291433 18825
4595 101341 -225261 -19314 71215 35577 43213 -25625 -198590 8513 113585 -395877 -6782
4583 258735 -70534 -178832 -308469 5540 338642 42130 39641 32052 200376 -190607 81730
4571 176604 127296 -278766 131235 122093 -195180 -120089 46341 303143 186000 -144605 -59632
4559 -4860 -90866 208793 66573 -41269 -277271 -290417 104859 125810 -262764 259075 -75276
4547 67240 280816 27547 -142077 162769 -410640 157459 -18064 98969 96301 150267 -182482
4535 127965 45205 -208835 80935 -43175 -149430 -65109 -31909 -80216 -216807 -95874 -303654
4524 -303654 21785 169051 -101800 147928 85315 -13720 -129639 -282548 -94792 -50486 -119810
4513 -119810 -243896 -20440 -67561 -46477 189322 142063 -229878 37157 -110114 -217598 30988
4501 -73601 63605 158372 -335203 -106591 133372 -52759 55515 222409 38931 201710 104734
4490 104734 -61258 57456 111399 20444 -4290 178425 44244 -124589 -24095 11469 176641
4479 176641 -204852 -36824 -143783 52926 -73773 9463 344981 -5716 -83525 -13331 -121634
4468 -121634 8793 78570 -122291 51867 -217457 -168887 372144 80695 223581 -209578 -61754
4456 279726 124988 197750 127385 125055 27118 25489 -137615 18887 -177497 -56760 344889
4444 -178492 509161 -60672 96425 97126 362924 214678 -160926 144679 346806 -386111 312742
4432 -9833 227393 132025 166515 -86740 -81446 -121508 183253 -300554 -99506 -41974 -306038
$$ [...]
##END NTUPLES=NMR SPECTRUM
##END=
