
##TITLE=UV1017_M2-1005-1001_6269144_WQHJDcZQFw
##JCAMPDX= 6.0         $$ Bruker NMR JCAMP-DX V2.0
##DATA TYPE= NMR SPECTRUM
##DATA CLASS= NTUPLES
##ORIGIN= BRUKER
##OWNER= Administrator
$$ 1.72 TOPSPIN		Version 2.1
$$ 2012-06-01 22:29:36.859 -0500  Administrator@TOPSPIN
$$ Compression mode = diff/dup
##.OBSERVE FREQUENCY= 400.13188235
##.OBSERVE NUCLEUS= ^1H
##.ACQUISITION MODE= SIMULTANEOUS (DQD)
##.ACQUISITION SCHEME= undefined
##.AVERAGES= 64
##.DIGITISER RES= 22
##SPECTROMETER/DATA SYSTEM= spect
##.PULSE SEQUENCE= noesygpps1d.comp
##.SOLVENT NAME= COFFEE_calctemp
##.SHIFT REFERENCE= INTERNAL, COFFEE_calctemp, 1, 14.96704
##AUDIT TRAIL= $$ (NUMBER, WHEN, WHO, WHERE, PROCESS, VERSION, WHAT)
$$ ##TITLE= Audit trail, TOPSPIN		Version 2.1
$$ ##JCAMPDX= 5.01
$$ ##ORIGIN= Bruker BioSpin GmbH
$$ ##OWNER= Administrator
$$ $$ C:\Bruker\TOPSPIN/data/COFFEE/nmr/UV1017_M2-1005-1001_6269144_WQHJDcZQFw/12/pdata/1/auditp.txt
$$ ##AUDIT TRAIL=  $$ (NUMBER, WHEN, WHO, WHERE, PROCESS, VERSION, WHAT)
(   1,<2012-06-01 22:29:30.734 -0500>,<Administrator>,<TOPSPIN>,<go>,<TOPSPIN 2.1>,
      <created by zg
	started at 2012-06-01 22:18:00.421 -0500,
	POWCHK enabled, PULCHK disabled,
       configuration hash MD5:
       D5 CA 7A 23 FE 6B EE E2 50 67 74 61 24 F7 5E 3B
       data hash MD5: 64K
       52 5F DC C6 95 14 2D E5 4D 26 D6 1B DE 77 7B FA>)
(   2,<2012-06-01 22:29:33.812 -0500>,<Administrator>,<TOPSPIN>,<proc1d>,<TOPSPIN 2.1>,
      <Start of raw data processing
       efp LB = 0.3 FT_mod = 6 PKNL = 1 PHC0 = 0 PHC1 = 0 SI = 128K 
       data hash MD5: 128K
       4C 91 28 44 2D 63 62 F7 77 F0 E1 EF B3 19 0F F4>)
(   3,<2012-06-01 22:29:35.328 -0500>,<Administrator>,<TOPSPIN>,<proc1d>,<TOPSPIN 2.1>,
      <pk PHC0 = 29.3335 PHC1 = 0 
       data hash MD5: 128K
       6C E0 30 7A 53 EE 93 68 68 40 17 CA CF C2 1F 36>)
(   4,<2012-06-01 22:29:36.078 -0500>,<Administrator>,<TOPSPIN>,<proc1d>,<TOPSPIN 2.1>,
      <abs ABSG = 1 
       data hash MD5: 128K
       DC 38 2E 1B 6B 92 69 48 D8 F3 5C 35 74 B8 3D F1>)
(   5,<2012-06-01 22:29:36.234 -0500>,<Administrator>,<TOPSPIN>,<proc1d>,<TOPSPIN 2.1>,
      <abs ABSG = 2 
       data hash MD5: 128K
       6C 54 10 3F 06 37 DC 39 25 68 7D DF D5 A0 D6 74>)
(   6,<2012-06-01 22:29:36.390 -0500>,<Administrator>,<TOPSPIN>,<proc1d>,<TOPSPIN 2.1>,
      <abs ABSG = 3 
       data hash MD5: 128K
       73 8F 8A FF 4E 00 6E 6D E5 D5 7A 3E 23 40 A5 F3>)
(   7,<2012-06-01 22:29:36.531 -0500>,<Administrator>,<TOPSPIN>,<proc1d>,<TOPSPIN 2.1>,
      <abs ABSG = 4 
       data hash MD5: 128K
       E3 A3 29 C0 AF AD EA C1 97 57 25 82 AF C6 45 8C>)
(   8,<2012-06-01 22:29:36.671 -0500>,<Administrator>,<TOPSPIN>,<proc1d>,<TOPSPIN 2.1>,
      <abs ABSG = 5 
       data hash MD5: 128K
       1C E9 7C 2E DD 12 30 03 49 1D D1 C4 8F 75 40 B3>)
$$ ##END=
$$ 
$$ $$ hash MD5
$$ $$ 8C F3 43 23 EE BC A3 F0 3F 6C FE C7 C7 73 89 55
##$RELAX= 
##$RELAX= 
##$RELAX= 
##$RELAX= 
##$RELAX= 
##$RELAX= 
##$RELAX= 
##$RELAX= 
$$ [...]
##$TP07= 0
##$TPNAME0= <>
##$TPNAME1= <>
##$TPNAME2= <>
##$TPNAME3= <>
##$TPNAME4= <>
##$TPNAME5= <>
##$TPNAME6= <>
##$TPNAME7= <>
##$TPOAL= (0..7)
0.5 0.5 0.5 0.5 0.5 0.5 0.5 0.5
##$TPOFFS= (0..7)
0 0 0 0 0 0 0 0
##$TUNHIN= 0
##$TUNHOUT= 0
##$TUNXOUT= 0
##$USERA1= <user>
##$USERA2= <user>
##$USERA3= <user>
##$USERA4= <user>
##$USERA5= <user>
##$V9= 5
##$VALIST= <valist>
##$VCLIST= <CCCCCCCCCCCCCCC>
##$VD= 0
##$VDLIST= <DDDDDDDDDDDDDDD>
##$VPLIST= <PPPPPPPPPPPPPPP>
##$VTLIST= <TTTTTTTTTTTTTTT>
##$WBST= 2048
##$WBSW= 25
##$XGAIN= (0..3)
0 0 0 0
##$XL= 0
##$YL= 0
##$YMAX_a= 12691848
##$YMIN_a= -6806692
##$ZGOPTNS= <>
##$ZL1= 120
##$ZL2= 120
##$ZL3= 120
##$ZL4= 120
##$ABSF1= 14.96704
##$ABSF2= -5.58549
##$ABSG= 5
##$ABSL= 3
##$ALPHA= 0
##$AQORDER= 0
##$ASSFAC= 0
##$ASSFACI= 0
##$ASSFACX= 0
##$ASSWID= 0
##$AUNMP= <proc_prof1d_extract.lims>
##$AXLEFT= 0
##$AXNAME= <>
##$AXNUC= <1H>
##$AXRIGHT= 0
##$AXTYPE= 0
##$AXUNIT= <>
##$AZFE= 0.1
##$AZFW= 0.1
##$BCFW= 0
##$BC_mod= 0
##$BYTORDP= 0
##$COROFFS= 0
##$CY= 15
##$DATMOD= 1
##$DC= 0
##$DFILT= <>
##$DTYPP= 0
##$F1P= 0
##$F2P= 0
##$FCOR= 0.5
##$FTSIZE= 131072
##$FT_mod= 6
##$GAMMA= 0
##$GB= 0
##$INTBC= 1
##$INTSCL= 1
##$ISEN= 128
##$LB= 0.3
##$LEV0= 0
##$LPBIN= 0
##$MAXI= 10000
##$MC2= 0
##$MEAN= 0
##$ME_mod= 0
##$MI= 0
##$NCOEF= 0
##$NC_proc= -3
##$NLEV= 6
##$NOISF1= 0
##$NOISF2= 0
##$NSP= 0
##$NTH_PI= 0
##$NZP= 0
##$OFFSET= 14.96704
##$PC= 1
##$PHC0= 29.3335
##$PHC1= 0
##$PH_mod= 1
##$PKNL= yes
##$PPARMOD= 0
##$PPDIAG= 0
##$PPIPTYP= 0
##$PPMPNUM= 2147483647
##$PPRESOL= 1
##$PSCAL= 4
##$PSIGN= 0
##$PYNMP= <proc.py>
##$REVERSE= no
##$SF= 400.130005431202
##$SI= 131072
##$SIGF1= 0
##$SIGF2= 0
##$SINO= 400
##$SIOLD= 131072
##$SPECTYP= <>
##$SREGLST= <1H.CDCl3>
##$SSB= 0
##$STSI= 131072
##$STSR= 0
##$SW_p= 8223.68421052632
##$SYMM= 0
##$S_DEV= 0
##$TDeff= 65536
##$TDoff= 0
##$TI= <>
##$TILT= no
##$TM1= 0
##$TM2= 0
##$TOPLEV= 0
##$USERP1= <user>
##$USERP2= <user>
##$USERP3= <user>
##$USERP4= <user>
##$USERP5= <user>
##$WDW= 1
##$XDIM= 131072
##$YMAX_p= 496241195
##$YMIN_p= -10750496
##$CURPLOT= <Network HP LaserJet P1505>
##$CURPRIN= <$Network HP LaserJet P1505>
##$DFORMAT= <normdp>
##$LAYOUT= <+/1D_H.xwp>
##$LFORMAT= <normlp>
##$PFORMAT= <normpl>
##$SURQMSG= 1
$$ End of Bruker specific parameters
$$ ---------------------------------
##NTUPLES= NMR SPECTRUM
##VAR_NAME=  FREQUENCY,     SPECTRUM/REAL,   SPECTRUM/IMAG
##SYMBOL=    X,             R,               I
##VAR_TYPE=  INDEPENDENT,   DEPENDENT,       DEPENDENT
##VAR_FORM=  AFFN,          ASDF,            ASDF
##VAR_DIM=   131072,        131072,          131072
##UNITS=     HZ,            ARBITRARY UNITS, ARBITRARY UNITS
##FACTOR=    0.0627417313425165, 1,          1
##FIRST=     8223.62146879498, 489,          -117407
##LAST=      0,             4964,            -117819
##MIN=       0,             -10750496,       0
##MAX=       8223.62146879498, 496241195,    0
$$ Real data points
##PAGE= N=1
##DATA TABLE= (X++(R..R)), XYDATA
$$ [...]
63528A296605l2071l4161l4373l2989l0408k7163k4072k1769j9855j7208j3525
63517A009011r796o825m097q48K589N423P593R316J0175R989R889J1124J3219
63504A066762J4740J5652J7205J9641K1684K2649K3416K4910K7011K9558L2965
63493A316193L7065M0539M2451M3454M4604M5614M4938M1069L3306K2095R325
63482A720653k351j1231j7306k1113k2651k1946j9899j7840j6718j7061j9022
63471A533515k1990k5020k8179l2570l8261m3183m5165m4444m2971m1835m0643
63460A129254l9054l7446l5912l3776l0546k6548k2445j8800j6217j5048j4737
63449H38725j4157j2898j1611j0856j0334r594q815q272p657o532n120l957k920
$$ plain form
63528 1296605 1264534 1230373 1196000 1163011 1132603 1105440 1081368 1059599 1039744 1022536 1009011
63517 1009011 999215 992390 988293 987445 990034 995457 1003050 1012366 1022541 1032530 1042419 1053543 1066762
63504 1066762 1081502 1097154 1114359 1134000 1155684 1178333 1201749 1226659 1253670 1283228 1316193
63493 1316193 1353258 1393797 1436248 1479702 1524306 1569920 1614858 1655927 1689233 1711328 1720653
63482 1720653 1718302 1707071 1689765 1668652 1646001 1624055 1604156 1586316 1569598 1552537 1533515
63471 1533515 1511525 1486505 1458326 1425756 1387495 1344312 1299147 1254703 1211732 1169897 1129254
63460 1129254 1090200 1052754 1016842 983066 952520 925972 903527 884727 868510 853462 838725
63449 838725 824568 811670 800059 789203 778869 769275 760460 752188 744531 737999 732879 728922 726002
63436G26002j408M65J527P58j408l346l762k818j780j651k153k030m58J964L800
63421G13702M286L938L566L186K368J256N30L04n4p62j092o01k14j098k818l672
63405G22825k821j145J96J058J785K347K732L410M659N879O443O803P861R466
63391G71498J0617J1164J2202J4391J6903J8648J9790K1213K3057K4796K6540
63380I70819K9180L2984L6885L9518M0422L9787L7698L4312L0398K7018K4624
63369A343645K3097K2555K3437K5735K8778L2078L5780L9931M3829M6598M7977
63358A713440M8019M6353M2442L6280K8245J8462P321l422j1288j5427j7501j9499
63346A873425k1310k1509k0165j9488k1397k5580l0474l5233l9765m3600m6014
$$ plain form
63436 726002 724594 725059 726586 727344 725936 722590 718828 716010 714230 712579 710426 708396 707938 709902 713702
63421 713702 717988 721926 725492 728678 731046 732302 732832 733136 733082 732320 731228 730627 730413 729315 726497 722825
63405 722825 720004 718859 719055 720113 721898 724245 726977 730387 735046 740925 747368 754171 762032 771498
63391 771498 782115 793279 805481 819872 836775 855423 875213 896426 919483 944279 970819
63380 970819 999999 1032983 1069868 1109386 1149808 1189595 1227293 1261605 1292003 1319021 1343645
63369 1343645 1366742 1389297 1412734 1438469 1467247 1499325 1535105 1575036 1618865 1665463 1713440
63358 1713440 1761459 1807812 1850254 1886534 1914779 1933241 1940562 1937140 1925852 1910425 1892924 1873425
63346 1873425 1852115 1830606 1810441 1790953 1769556 1743976 1713502 1678269 1638504 1594904 1548890
63335A548890m7152m7704m7350m4782l9887l4702l1166k8786k5625k1023j6085
63324A164628j1867q550o231m945l601m95M434R137J2110J4263J7133K0319K2150
63311A228485K2252K2014K2719K4508K7041K9953L2580L4292L5345L6659L8658
63300A554506M0988M3229M5001M5310M2826L7131K9119K0074J0952K533m557j0170
63288A856942j4421j7202j8583j9481k0976k3077k5117k7249l0308l4204l7825
63277A588499m0751m3534m5954m6731m5623m4067m2726m0186l5603l0876k8085
63266A144363k5961k1511j4748r258p819r691j2696j5963j9486k2554k4125k4056
63254I36495k3028k1720k0554j9537j7883j4674j0475p317o319o277n534m308
$$ plain form
63335 1548890 1501738 1454034 1406684 1361902 1322015 1287313 1256147 1227361 1201736 1180713 1164628
63324 1164628 1152761 1144211 1137980 1133035 1129434 1128939 1133373 1142510 1154620 1168883 1186016 1206335 1228485
63311 1228485 1250737 1272751 1295470 1319978 1347019 1376972 1409552 1443844 1479189 1515848 1554506
63300 1554506 1595494 1638723 1683724 1729034 1771860 1808991 1838110 1858184 1869136 1871669 1867112 1856942
63288 1856942 1842521 1825319 1806736 1787255 1766279 1743202 1718085 1690836 1660528 1626324 1588499
63277 1588499 1547748 1504214 1458260 1411529 1365906 1321839 1279113 1238927 1203324 1172448 1144363
63266 1144363 1118402 1096891 1082143 1072885 1065066 1055375 1042679 1026716 1007230 984676 960551 936495
63254 936495 913467 891747 871193 851656 833773 819099 808624 801307 794988 788711 783177 778869
63242G78869l893m208l911k787k377l731n830p031p123p128p564p884p421o254
63228G01727n035m355m351m665m806m585m092l256j826j5J287J384O27j11o07
63213F67321j324k321k795j996j13J972L515M300M559M810N391N961N787M857
63199F99924M358N467P838R801J0184R570R567J1029J3200J4592J4650J4332J4871
63186H39383J6246J7396J7856J8449K0049K2360K4536K6375K8139K9618L0347
63175A090754L0630L1347L2686L3889L4594L5413L6751L7659L6712L3905L1006
63164A465346K9925L0899L2498L3292L3259L3316L3667L3373L1691K9015K5848
63153A812129K1688J5920R301L232k092p499j3034j7928k2318k7154l1818l3910
$$ plain form
63242 778869 774976 770768 766857 764070 761693 757962 752132 745101 737978 730850 723286 715402 707981 701727
63228 701727 696692 692337 687986 683321 678515 673930 669838 666582 664756 664741 666028 667412 668039 667928 667321
63213 667321 665997 663676 660881 658885 658772 660744 664259 668559 673118 677928 683319 689280 695067 699924
63199 699924 704282 709749 717587 727388 737572 747142 756709 767738 780938 795530 810180 824512 839383
63186 839383 855629 873025 890881 909330 929379 951739 976275 1002650 1030789 1060407 1090754
63175 1090754 1121384 1152731 1185417 1219306 1253900 1289313 1326064 1363723 1400435 1434340 1465346
63164 1465346 1495271 1526170 1558668 1591960 1625219 1658535 1692202 1725575 1757266 1786281 1812129
63153 1812129 1833817 1849737 1859038 1862270 1860178 1852679 1839645 1821717 1799399 1772245 1740427 1706517
63141A706517l2557l0168k9268k9024k6871k2558j8289j5259j2390q720m949j972
63129A474492M30K683M699O909J0622J6090K1303K3983K4162K3547K2993K2033
63117A653946K0725K0342K1748K4104K5733K5645K3789K0475J6246J1859P757
63106A872369L594j297p052j3207j9272k4979l0088l4447l8196m1364m3362m3506
63094A579193m2201m0739l9595l7790l4572l0918k8280k6523k4473k2174k0960
63083A230968k1050k0710j8591j5549j3114j1245q848n763k881o69J178K794M041
63070A120561N252O961Q722R249Q067O286N426O033P552Q886Q958P362M824K592
63056A216731J264N88L20O14J439K229K310J344n00k337k870j658R8R30R50J235
$$ plain form
63141 1706517 1673960 1643792 1614524 1585500 1558629 1536071 1517782 1502523 1490133 1481413 1476464 1474492
63129 1474492 1474922 1477605 1482304 1489213 1499835 1515925 1537228 1561211 1585373 1608920 1631913 1653946
63117 1653946 1674671 1695013 1716761 1740865 1766598 1792243 1816032 1836507 1852753 1864612 1872369
63106 1872369 1875963 1874666 1867614 1854407 1835135 1810156 1780068 1745621 1707425 1666061 1622699 1579193
63094 1579193 1536992 1496253 1456658 1418868 1384296 1353378 1325098 1298575 1274102 1251928 1230968
63083 1230968 1209918 1189208 1170617 1155068 1141954 1130709 1121861 1116098 1113217 1112548 1113726 1116520 1120561
63070 1120561 1125813 1132774 1141496 1150745 1158812 1165098 1170524 1176557 1184109 1192995 1201953 1209315 1214139 1216731
63056 1216731 1217995 1218583 1218903 1219517 1220956 1223185 1225495 1226839 1226339 1224002 1221132 1219474 1219572 1220502 1221452 1222687
63040A222687J669J051m49q99N08J799Q60j503k637j282J727N233Q479J0446J0284
63025A257973Q630P169O659O562O751Q120J0982J4044J5777J6038J5762J5786
63013A390253J6562J8263K0493K2359K3496K4567K6223K8069K9381L0484L2560
63002A662710L6232M0917M5626M9722N2968N5341N7169N9151O1984O5921P0548
62991B258289P4941P8209Q0130Q1156Q1674Q1558Q0675P9432P8356P7284P5548
62980C127252P2903O9852O7074O4894O3228O1539N8855N4391M8296M1198L2945
62969C762427K2513R518m866j9098l2699m5743n7459o6561p2958p7910q2093q4457
62957C250614q3750q0383p5815p0502o3661n5122m6324l8848l2549k5820j7497
$$ plain form
63040 1222687 1224356 1225407 1224958 1224059 1224567 1226366 1227226 1225723 1223086 1221804 1223531 1228764 1237243 1247689 1257973
63025 1257973 1266603 1273772 1280431 1286993 1293744 1301864 1312846 1326890 1342667 1358705 1374467 1390253
63013 1390253 1406815 1425078 1445571 1467930 1491426 1515993 1542216 1570285 1599666 1630150 1662710
63002 1662710 1698942 1739859 1785485 1835207 1888175 1943516 2000685 2059836 2121820 2187741 2258289
62991 2258289 2333230 2411439 2491569 2572725 2654399 2735957 2816632 2896064 2974420 3051704 3127252
62980 3127252 3200155 3270007 3337081 3401975 3465203 3526742 3585597 3639988 3688284 3729482 3762427
62969 3762427 3784940 3794458 3789592 3770494 3737795 3692052 3634593 3568032 3495074 3417164 3335071 3250614
62957 3250614 3166864 3086481 3010666 2940164 2876503 2821381 2775057 2736209 2703660 2677840 2660343
62946B660343p973J375R451J6102K1978K7853L3737L8618M1312M1682M0814L9929
62934B965221L9451L9195L9034L8906L8391L6754L3540K8896K3250J6867R687
62923C309192J397q268j8994k9787l9796m9243n8935o8682p6973q2699q6445q9323
62911B701444r1084r0617q8045q4837q1542p6969p0485o3888n9447n6898n4078
62900A883554n0289m7190m5930m5252m3463m1007l9521l9002l7638l4442l0698
62889A429122k8204k7132k6296k4973k3539k2509k1723k0713j9390j8051j6865
62878A179727j5689j4414j3222j2263j1314j0036q590p543p063o582n556m235
62866A063220l285k921k825k813l014l452l921m380m983n608n823n496n088n140
$$ plain form
62946 2660343 2652370 2653745 2663196 2679298 2701276 2729129 2762866 2801484 2842796 2884478 2925292 2965221
62934 2965221 3004672 3043867 3082901 3121807 3160198 3196952 3230492 3259388 3282638 3299505 3309192
62923 3309192 3310589 3302321 3283327 3253540 3213744 3164501 3105566 3036884 2959911 2877212 2790767 2701444
62911 2701444 2610360 2519743 2431698 2346861 2265319 2188350 2117865 2053977 1994530 1937632 1883554
62900 1883554 1833265 1786075 1740145 1694893 1651430 1610423 1570902 1531900 1494262 1459820 1429122
62889 1429122 1400918 1373786 1347490 1322517 1298978 1276469 1254746 1234033 1214643 1196592 1179727
62878 1179727 1164038 1149624 1136402 1124139 1112825 1102789 1094199 1086656 1079593 1073011 1067455 1063220
62866 1063220 1059935 1057014 1054189 1051376 1048362 1044910 1040989 1036609 1031626 1026018 1020195 1014699 1009611 1004471
62852A004471n743o688p672q209p736o221m375k878j728p07j73p16k081l004k478
62837I44062q86L85M26k91n68L3O77M77j99k78K83K63q75j873j326J57P38k9o58
62818I40518lJ233J755J377N20j008l561o171o932n189k502q71n26j35J117K382
62802I22004K236L94j953l196k406K24L425N366M884K580L91k95J51M28m9p01
62786I33483p76k69L7o48k146l048k015M40K160J822N09M0O28J220J454J797K166
62769I36854K087K114L308N044N371M155L894O249R434J0632R632Q382P924P827
62755A022907P996Q985J0472J1214J0880J0600J1323J2781J4332J5735J6799J7274
62743A171298J7502J8320J9929K1565K2616K3387K4499K6164K8354L1070L4171
$$ plain form
62852 1004471 998728 992040 984368 976159 968423 962202 957827 954949 953221 952514 952341 951625 949544 946540 944062
62837 944062 943176 943561 943987 943696 943128 943161 943838 944315 944116 943838 944121 944384 943509 941636 940310 940467 941205 941176 940518
62818 940518 940515 941748 943503 944880 945400 944392 940831 934660 927728 922539 920037 919166 918640 918505 919622 922004
62802 922004 924240 924634 922681 919485 917079 917303 920728 926094 930978 933558 933949 933654 933805 934233 934184 933483
62786 933483 932707 932438 932475 931827 929681 926633 924618 925058 927218 929040 929549 929589 930217 931437 932891 934688 936854
62769 936854 938941 941055 944363 949407 954778 958933 962827 969076 978510 989142 998774 1007156 1015080 1022907
62755 1022907 1030903 1039888 1050360 1061574 1072454 1083054 1094377 1107158 1121490 1137225 1154024 1171298
62743 1171298 1188800 1207120 1227049 1248614 1271230 1294617 1319116 1345280 1373634 1404704 1438875
62732A438875L7417M0920M5100N0092N5531O0915O5797O9916P3799P8793Q5569
62721B102724R2808R8490J02402J06085J10188J13228J13392J10368J04810R7136
62711C151631Q7512P5998O2041M4847K5119N477j1992k7904m4197o1040p6284
62700C231208q7845r5676j01238j05807j09511j11642j11660j09865j07012j03389
62690B187563r8755r3076q6681p9718p2321o5478o0554n7399n3966m8726m2590
62679A428299l7401l3323k9008k3965j9304j6094j4104j2537j1134j0053r136
62668A212240p793n565k652J40K077L195M175N665P904J0872J4186J7094J9304
62655A280842K1679K5032K8286K9431K8768K9515L3977M0594M6229N0225N4346
$$ plain form
62732 1438875 1476292 1517212 1562312 1612404 1667935 1728850 1794647 1864563 1938362 2017155 2102724
62721 2102724 2195532 2294022 2396424 2502509 2612697 2725925 2839317 2949685 3054495 3151631
62711 3151631 3239143 3315141 3377182 3422029 3447148 3452625 3440633 3412729 3368532 3307492 3231208
62700 3231208 3143363 3047687 2946449 2840642 2731131 2619489 2507829 2397964 2290952 2187563
62690 2187563 2088808 1995732 1909051 1829333 1757012 1691534 1630980 1573581 1519615 1470889 1428299
62679 1428299 1390898 1357575 1328567 1304602 1285298 1269204 1255100 1242563 1231429 1221376 1212240
62668 1212240 1204447 1198882 1196230 1196370 1198447 1201642 1205817 1211482 1219386 1230258 1244444 1261538 1280842
62655 1280842 1302521 1327553 1355839 1385270 1414038 1443553 1477530 1518124 1564353 1614578 1668924
62644A668924N9509O4745O9246P3419P7581Q1288Q4511Q8102R2297R5732R6605
62633B551959R4201Q8941Q1576P2776O2776N1055L6823K0187K409j5089l1589
62622C016025m6903o0883p3218q3333r0622r5176r8038j00173j01375j00800r8252
62611B067252r4181q8884q2653p6476p1294o6723o1618n5941n0856m6886m3354
62600A328386l9865l7031l5118l3250l0633k7562k4650k2002j9796j8657j8624
62589A021198j8527j7161j4493j1239q074n827n371o375p011n853l464j279J97
62576I16721J020O30j419l931m930m040k673j832j074K5Q11P67P04J788L914N994
62560I12475P479Q639R419R121P648O384O959R330J1718J2523J1854J1070J1453
$$ plain form
62644 1668924 1728433 1793178 1862424 1935843 2013424 2094712 2179223 2267325 2359622 2455354 2551959
62633 2551959 2646160 2735101 2816677 2889453 2952229 3003284 3040107 3060294 3062703 3047614 3016025
62622 3016025 2969122 2908239 2835021 2751688 2661066 2565890 2467852 2367679 2266304 2165504 2067252
62611 2067252 1973071 1884187 1801534 1725058 1653764 1587041 1525423 1469482 1418626 1371740 1328386
62600 1328386 1288521 1251490 1216372 1183122 1152489 1124927 1100277 1078275 1058479 1039822 1021198
62589 1021198 1002671 985510 971017 959778 951704 945877 940506 934131 927120 921267 917803 916524 916721
62576 916721 917741 918371 916952 913021 908091 904051 901378 899546 898472 898497 899308 900075 900779 902567 906481 912475
62560 912475 919954 928593 938012 947133 954781 961165 968124 977454 989172 1001695 1013549 1024619 1036072
62547A036072J3450J6567J9519K1190K2064K4106K8348L3257L6577L8338M0528
62536A330016M3980M7354M9480N0957N2516N3373N2467N0162M7281M3244L6737
62525A857567K7836J8057Q481q85r950j8127k5277l1944l8235m3434m7065m9531
62513A647493n1282n2060n1482m9776m7428m4556m1186l7810l5096l3041l0977
62502A172799k8412k5547k2820k0202j7315j4230j1741j0547j0220r501p718n418
62490I89128l409j628N02K903M640M953M059K844K080K068K738L884N292O658
62476A026712P499P467P015P341R172J1584J2692J1837J0809J2333J7246K3474
62464A165181K7996K9677L0023L1380L4846L9892M5276M9895N3263N5881N9022
$$ plain form
62547 1036072 1049522 1066089 1085608 1106798 1128862 1152968 1181316 1214573 1251150 1289488 1330016
62536 1330016 1373996 1421350 1470830 1521787 1574303 1627676 1680143 1730305 1777586 1820830 1857567
62525 1857567 1885403 1903460 1911941 1911056 1901106 1882979 1857702 1825758 1787523 1744089 1697024 1647493
62513 1647493 1596211 1544151 1492669 1442893 1395465 1350909 1309723 1271913 1236817 1203776 1172799
62502 1172799 1144387 1118840 1096020 1075818 1058503 1044273 1032532 1021985 1011765 1002264 994546 989128
62490 989128 985719 984091 984593 987496 992136 997089 1001148 1003992 1006072 1008140 1010878 1014762 1020054 1026712
62476 1026712 1034211 1041678 1048693 1056034 1065206 1076790 1089482 1101319 1112128 1124461 1141707 1165181
62464 1165181 1193177 1222854 1252877 1284257 1319103 1358995 1404271 1454166 1507429 1563310 1622332
62453A622332O3468O8443P2219P3719P3020P0482O6302O0959N5219M9298M2665
62442B318126L5106K7373K0420J4557R705N991L678L113M959R769J6813K4155
62430B493765L0593L6822M3894N1208N7203O1615O5760P0348P3984P4122O8970
62419C128284N8404M3781K7195J0525n289k0295l5188n0980o8157q5453r9954
62408B902873j09429j14427j17189j18629j17618j13420j07464j01717r6158q9080
62398A817742p9721o9548o0619n3446m7078m0815l5034l0234k6050k1819j7694
62387A335684j4346j1653q695n225k250m43J152L752O721P895O167K728m42k539
62373A318506m146o147q896j1963j4255j4795j3775j2683j3003j4812j6815j7630
$$ plain form
62453 1622332 1685800 1754243 1826462 1900181 1973201 2043683 2109985 2170944 2226163 2275461 2318126
62442 2318126 2353232 2380605 2401025 2415582 2425287 2431278 2434956 2438069 2443028 2452797 2469610 2493765
62430 2493765 2524358 2561180 2605074 2656282 2713485 2775100 2840860 2911208 2985192 3059314 3128284
62419 3128284 3186688 3230469 3257664 3268189 3262900 3242605 3207417 3156437 3088280 3002827 2902873
62408 2902873 2793444 2679017 2561828 2443199 2325581 2212161 2104697 2002980 1906822 1817742
62398 1817742 1738021 1668473 1607854 1554408 1507330 1466515 1431481 1401247 1375197 1353378 1335684
62387 1335684 1321338 1309685 1300990 1295765 1293515 1293072 1294224 1297976 1304697 1312592 1318759 1321487 1321045 1318506
62373 1318506 1314360 1308213 1299317 1287354 1273099 1258304 1244529 1231846 1218843 1204031 1187216 1169586
62361A169586j6869j5191j3636j2830j2538j1905j0370q450p378p742q552q147
62349A035978o065l696k768l511m614m690l239n53K544M751N019L648K301K459
62335A027564M199O496Q331R232R224Q692Q122P808P974Q974J0890J2962J4229
62322A144697J4709J5283J6258J6983J7101J7203J7751J8388J8875J9814K1615
62311A338677K3540K4673K5195K6067K8081L1842L7657M4572N0574N4843N8860
62300A744581O3979O8936P1511P1981P2800P4958P6503P4880O9218O0129M8799
62289B498275L6763K5144J3781K168q670j6855k2463k7907l4701m1485m6268m9141
62277B328641n1311n2629n1978m9566m7143m5691m4138m0864l5806l0661k7300
$$ plain form
62361 1169586 1152717 1137526 1123890 1111060 1098522 1086617 1076247 1067797 1060419 1052677 1044125 1035978
62349 1035978 1029913 1026217 1023449 1019938 1015324 1010634 1007395 1006842 1009386 1014137 1019156 1022804 1025105 1027564
62335 1027564 1031763 1038259 1046590 1055822 1065046 1073738 1081860 1089668 1097642 1106616 1117506 1130468 1144697
62322 1144697 1159406 1174689 1190947 1207930 1225031 1242234 1259985 1278373 1297248 1317062 1338677
62311 1338677 1362217 1386890 1412085 1438152 1466233 1498075 1535732 1580304 1630878 1685721 1744581
62300 1744581 1808560 1877496 1949007 2020988 2093788 2168746 2245249 2320129 2389347 2449476 2498275
62289 2498275 2535038 2560182 2573963 2576131 2567461 2550606 2528143 2500236 2465535 2424050 2377782 2328641
62277 2328641 2277330 2224701 2172723 2123157 2076014 2030323 1986185 1945321 1909515 1878854 1851554
62266A851554k6245k6534k6924k7032k7245k7865k8854l0333l2559l5098l6592
62255A526273l5883l3197l0006k7840k7130k6900k5619k2674j8985j5861j3612
62244A248566j1832j0580j0251j0367r647p490m531j576R51K472K458J712K171
62231A192056M523P021P686O928O806Q196R911J0559J0216R925J0232J0732J1021
62218A305812J1675J3823J7428K0591K1449K0575K0308K1636K3097K3382K3627
62207A523403K5928L0509L5742M0454M4823M9249N3716N8412O3813O9701P4932
62196B070682P8593Q0734Q1480Q0121P5651O8022N8267M7467L6063K4254J2535
62185B713869J428r187j9875l0767m1324n1221o0683o9394p5588p7509p5760p3203
$$ plain form
62266 1851554 1825309 1798775 1771851 1744819 1717574 1689709 1660855 1630522 1597963 1562865 1526273
62255 1526273 1490390 1457193 1427187 1399347 1372217 1345317 1319698 1297024 1278039 1262178 1248566
62244 1248566 1236734 1226154 1215903 1205536 1195889 1188399 1183868 1182292 1183243 1185715 1188173 1189885 1192056
62231 1192056 1196579 1203600 1211286 1218214 1225020 1233216 1243127 1253686 1263902 1273827 1284059 1294791 1305812
62218 1305812 1317487 1331310 1348738 1369329 1390778 1411353 1431661 1453297 1476394 1499776 1523403
62207 1523403 1549331 1579840 1615582 1656036 1700859 1750108 1803824 1862236 1926049 1995750 2070682
62196 2070682 2149275 2230009 2311489 2391610 2467261 2535283 2593550 2641017 2677080 2701334 2713869
62185 2713869 2715297 2706110 2686235 2655468 2614144 2562923 2502240 2432846 2357258 2279749 2203989 2130786
62173B130786p1944p1213o8759o3790n7834n2864m9246m5776m1448l6747l2859
62162A538306k9853k6477k2047j7566j4185j1412q202n247m343n377n896m316
62150A383385j998r96j061j83K575O158R011J0478J0747J0342R743R205Q970R542
62136A465918J1208J3148J3940J3291J2440J2428J2829J2825J2553J2646J3147
62125A606373J3825J4753J5758J5897J4605J2828J2070J2544J3220J3400J3543
62114A758816J4621J7270K1363K5964L0072L3717L7750M2215M5891M8011M9408
62103B125098N1013N2042N0726M6133L8419K8174J6737O294j803q410j5122k2068
62091B367233k8358l3955l9468m4502m7988m9956n1398n2320n1521m8470m4026
$$ plain form
62173 2130786 2058842 1987629 1918870 1855080 1797246 1744382 1695136 1649360 1607912 1571165 1538306
62162 1538306 1508453 1481976 1459929 1442363 1428178 1416766 1408564 1403317 1398974 1393597 1387701 1383385
62150 1383385 1381387 1380391 1379330 1379147 1381722 1387880 1396891 1407369 1418116 1428458 1438201 1447406 1456376 1465918
62136 1465918 1477126 1490274 1504214 1517505 1529945 1542373 1555202 1568027 1580580 1593226 1606373
62125 1606373 1620198 1634951 1650709 1666606 1681211 1694039 1706109 1718653 1731873 1745273 1758816
62114 1758816 1773437 1790707 1812070 1838034 1868106 1901823 1939573 1981788 2027679 2075690 2125098
62103 2125098 2176111 2228153 2278879 2325012 2363431 2391605 2408342 2414636 2412833 2404423 2389301 2367233
62091 2367233 2338875 2304920 2265452 2220950 2172962 2123006 2071608 2019288 1967767 1919297 1875271
62080A875271l9263l4758l1030k8271k5666k2337j8950j6928j6171j5270j4036
62069A612591j3777j4643j4775j3065j0893r869r338p526m098j39L420O028O864
62056A530780N379K222j387m862p994j0048j0254r130q241q578r784j0996j1831
62043A445276j2471j3203j4064j4687j4527j3264j0998q088n022k276j8J982L858
62030A342498N287O096O824P952R023R452R912J1635J4451J6923J8617K0709K3911
62017A503290K7213K9421L0652L1528L2212L3024L4736L7091L8370L7804L7352
62006A872693L9407M3376M6204M5922M3021L8609L2912K5886J7917R327J08r285
61994B206097j7629k3845k8033l1360l5237m0373m6227n1550n5662n8814o0925
$$ plain form
62080 1875271 1836008 1801250 1770220 1741949 1716283 1693946 1674996 1658068 1641897 1626627 1612591
62069 1612591 1598814 1584171 1569396 1556331 1545438 1535569 1526231 1518705 1514607 1514468 1517888 1523916 1530780
62056 1530780 1536159 1538381 1536994 1532132 1524138 1514090 1503836 1494706 1486465 1477887 1468103 1457107 1445276
62043 1445276 1432805 1419602 1405538 1390851 1376324 1363060 1352062 1343974 1338952 1336676 1336658 1338640 1342498
62030 1342498 1347785 1353881 1360705 1368657 1377680 1387132 1397044 1408679 1423130 1440053 1458670 1479379 1503290
62017 1503290 1530503 1559924 1590576 1622104 1654316 1687340 1722076 1759167 1797537 1835341 1872693
62006 1872693 1912100 1955476 2001680 2047602 2090623 2129232 2162144 2188030 2205947 2215274 2215382 2206097
61994 2206097 2188468 2164623 2136590 2105230 2069993 2029620 1983393 1931843 1876181 1817367 1756442
61983A756442o0940n8306n4447n1389m9264m6595m2983l9959l8722l8278l6655
61972A238904l3179k8842k4984k2280k0608j9459j8517j8011j8088j7976j6490
61961A000470j3630j0864r421r036q890r027r869j0793j0405q343n940m635m324
61948H85293l863k724j398k59J067K783M003L718K483K127L389M755M301K148
61934I07823J64l97kL12O2r14k726m830o013n770n212n706o949p419o641n888
61918H49894o220o856o248m225k063p98m47q87k301m262n369m678k970j695j109
61903G99766m11O50J487J895K305K548J736rq53P08L904O722Q220Q862R186R412
61887H56128J0096J1842J4267J6293J7608J8857K0275K1240K1585K2282K4022
$$ plain form
61983 1756442 1695502 1637196 1582749 1531360 1482096 1435501 1392518 1352559 1313837 1275559 1238904
61972 1238904 1205725 1176883 1151899 1129619 1109011 1089552 1071035 1053024 1034936 1016960 1000470
61961 1000470 986840 975976 966555 957519 948629 939602 929733 918940 908535 900192 894252 889617 885293
61948 885293 881430 878706 877308 877049 878116 880899 884902 888620 891103 893230 896619 901374 905675 907823
61934 907823 907987 907590 907588 907900 907962 907048 904322 899492 893479 887709 882497 876791 869842 862423 855782 849894
61918 849894 843674 836818 830570 826345 824282 823484 823037 822150 819849 815587 810218 805540 802570 800875 799766
61903 799766 799355 800005 801492 803387 805692 808240 809976 809967 809114 809822 813726 820448 828668 837530 846716 856128
61887 856128 866224 878066 892333 908626 926234 945091 965366 986606 1008191 1030473 1054495
61876A054495K5819K5941K3948K1143J9086J8125J7315J5394J1933P807M567L061
61864A248634K705K192Q22r43k145k335j925j603j446q14P63K939N120P430J0411
61849A269805J3794J6306J7066J6574J5862J5002J3095R676N616K420P12m02k340
61836A393186n322p922q663p870p315q045r337j0052j0105r913r224p680o225
61823A285513o705r660j3437j5923j6523j6032j5326j4818j4637j4377j2945r714
61811A125416n921l877m239m892l358K71L806O089Q184J1186J4242J5870J6349
61798A179126J7414J9825K2650K5045K7335K9863L2037L3429L4815L6881L8581
61787A497001L8070L5096L1163K7359K3325J8666J4047J0121O318J713l375p568
$$ plain form
61876 1054495 1080314 1106255 1130203 1151346 1170432 1188557 1205872 1221266 1233199 1241006 1245573 1248634
61864 1248634 1251339 1253531 1254353 1253410 1251265 1248930 1247005 1245402 1243956 1243142 1243905 1246844 1251964 1259394 1269805
61849 1269805 1283599 1299905 1316971 1333545 1349407 1364409 1377504 1387180 1392796 1395216 1395928 1395526 1393186
61836 1393186 1387864 1379942 1371279 1363409 1356094 1348049 1338712 1328660 1318555 1308642 1299418 1291738 1285513
61823 1285513 1278808 1269148 1255711 1239788 1223265 1207233 1191907 1177089 1162452 1148075 1135130 1125416
61811 1125416 1119495 1115618 1111379 1106487 1103129 1103400 1107206 1113295 1121479 1132665 1146907 1162777 1179126
61798 1179126 1196540 1216365 1239015 1264060 1291395 1321258 1353295 1386724 1421539 1458420 1497001
61787 1497001 1535071 1570167 1601330 1628689 1652014 1670680 1684727 1694848 1701166 1702879 1699504 1691936
61775A691936r918j0487r632p508m373p56K789N797P908R187J0265J1604J2575
61762A709387J1820Q699L921j235n888r778j3131j6543k0354k3941k6198k6997
61750A589762k7508k8641k9786k9801k8765k7847k7600k7266k5925k3675k1380
61739A291568j9725j8751j7982j6809j4956j2732j0707r160q050p327o873o349
61727A142147n690n628o898q679q802o127k099P95J622J249N49l67j084m57J939
61712A102470M697N847N044L779L581M668O391Q258J0171J1970J3275J3783J3584
61699A207518J3081J2544J1765J0327Q256O051L796P01l855r015j2943j4778j5332
61686A218116j5744j6267j6752j7293j7634j6780j4367j1821j0797j0777r658
$$ plain form
61775 1691936 1682018 1671531 1661899 1654391 1650018 1649262 1652051 1657848 1665756 1674943 1685208 1696812 1709387
61762 1709387 1721207 1729906 1733827 1732592 1726704 1716926 1703795 1687252 1666898 1642957 1616759 1589762
61750 1589762 1562254 1533613 1503827 1474026 1445261 1417414 1389814 1362548 1336623 1312948 1291568
61739 1291568 1271843 1253092 1235110 1218301 1203345 1190613 1179906 1170746 1162696 1155369 1148496 1142147
61727 1142147 1136457 1130829 1123931 1115252 1106450 1100323 1098224 1099019 1100641 1101890 1102439 1102072 1100988 1100531 1102470
61712 1102470 1107167 1113014 1118058 1121837 1125418 1130086 1136477 1144735 1154906 1166876 1180151 1193934 1207518
61699 1207518 1220599 1233143 1244908 1255235 1263491 1269542 1273338 1274039 1270184 1261169 1248226 1233448 1218116
61686 1218116 1202372 1186105 1169353 1152060 1134426 1117646 1103279 1091458 1080661 1069884 1060226
61675A060226o849m228l538m178m440l837l176l062l345l605l344k124l36O94
61661A014858J78r96j524j510j921k649k637j912j914l373n158n967o022o248
61647I73205o655o534n808n115m776m558m469n017o444q161r231r215q427p433
61633H81362o502n571m677m178m295m562m250l422l112m078n615o148n031l337
61619H16584k618l078l479k871j780j208r72j66Q53M81j462k447j91L919O133
61604H07698M974K803K494M188O027O715O198M909L493K748K819K860K207J406
61590H61539J316J742J858J581J532J974K664L484M268M314L140J630J299K349
61576H94690L478L699L231K333N37k247m858o093o225o501p437q402q611p907
$$ plain form
61675 1060226 1053377 1049149 1045611 1041433 1036993 1033156 1029980 1026918 1023573 1019968 1016624 1014500 1014164 1014858
61661 1014858 1015036 1014040 1012516 1011006 1009085 1006436 1003799 1001887 999973 996600 991442 985475 979453 973205
61647 973205 966550 960016 954208 949093 944317 939759 935290 930273 923829 915668 906437 897222 888795 881362
61633 881362 874860 869289 864612 860434 856139 851577 847327 843905 840793 836715 831100 824952 819921 816584
61619 816584 813966 810888 807409 804538 802758 801550 800578 800412 801265 801746 800284 797837 797646 801565 807698
61604 807698 812672 815475 817969 822157 828184 834899 841097 846006 849499 852247 855066 857926 860133 861539
61590 861539 862855 864597 866455 868036 869568 871542 874206 877690 881958 886272 889412 891042 892341 894690
61576 894690 898168 901867 905098 907431 907968 905721 900863 894770 888545 882044 874607 866205 857594 849687
61562H49687o759n999o369p620q357p457n550m298m216m178l274k244k382l768
61548G77216n325o300o876p434p923p962p197n691m325m375n891o925n532k554
61534F92906r96k197m042l857j912o31j112k084k130j397p41m47l72n34r25j235
61518F68294j158o11M39J860K998L046K110J230J058J006J41j425k400j464J371
61503F76495M407N443L931J721J078K107K964K480J469J220J777K211J874R51
61489G10128K53O06J792K246Q36j143j111J374L930M564L822K957J879M16j58
61474G32391J075K486J833k74j106J55J414Q84p02j644j354j62J434K499J900
61459G40829k30k158k454j500n10O4M69P03N67K97M12J143K427M123N882P081
$$ plain form
61562 849687 842928 836929 830560 822940 814583 807126 801576 797278 793062 788884 785610 783366 780984 777216
61548 777216 771891 765591 758715 751281 743358 735396 728199 722508 718183 713808 707917 700992 695460 692906
61534 692906 691910 689713 685671 681814 679902 679271 678159 676075 673945 672548 671807 671360 670988 670454 669529 668294
61518 668294 667136 666525 666964 668824 671822 674868 676978 678208 679266 680272 680413 678988 676588 675124 676495
61503 676495 680902 686345 690276 691997 693075 695182 698146 700626 702095 703315 705092 707303 709177 710128
61489 710128 710381 710987 712779 715025 715861 714718 713607 714981 718911 723475 727297 730254 732133 732549 732391
61474 732391 733466 735952 737785 737511 736405 736560 737974 738858 738156 736512 735158 734996 736430 738929 740829
61459 740829 740599 738441 735987 734487 733977 734041 734510 735213 735780 736077 736489 737632 740059 744182 750064 757145
61443G57145P339O844O035N190M541M328M490M728N025N669O504O669N517L532
61429H33556J929J478J957K632L063L401L870M044L080R95q82j400j161j643k995
61414H51924l815l298k327j909j699r28O5K42n53j440j825k122l018m473n536
61399H19288n056k780N2J555R67o00j432q75N31K055L281L933L927L640L682M214
61383H36382M814N009M726M284M115M457N049N267M826M221M211M900N617N596
61369I03474M581K859J069n8j30O77J973L643N615P262P623O423M397K381N91
61354I52380q83j552j305j129j976l053k569l60J646K201K388L338L859K308q5
61339I55208m04J530K463L02k906l900k253Q5J694K279J411j039l729m893m462
$$ plain form
61443 757145 764484 771328 777363 782553 787094 791422 795912 800640 805665 811334 817838 824507 830024 833556
61429 833556 835485 836963 838920 841552 844615 848016 851886 855930 859010 860005 859123 857723 856562 854919 851924
61414 851924 848109 844811 842484 840575 838876 837948 838013 838255 837702 836262 834437 832315 829297 824824 819288
61399 819288 814232 811452 811504 813059 814026 813426 811994 811119 811650 813705 816986 820919 824846 828486 832168 836382
61383 836382 841196 846205 850931 855215 859330 863787 868836 874103 878929 883150 887361 892261 897878 903474
61369 903474 908055 910914 911983 911925 911795 912472 914445 918088 923703 930965 938588 945011 949408 951789 952380
61354 952380 951497 949945 948640 947511 945535 942482 939913 939553 941199 943400 945788 949126 952985 955293 955208
61339 955208 954804 956334 958797 959099 956193 952293 950040 950125 951819 954098 955509 954470 950741 945848 941386
61324I41386l655k865j556KP10M92N09J321K242K744L092L342L188L002L610M636
61308I62200M604L161J671J069P08Ql96j37j80j073j480J29L241O075P831Q891
61292I96322R599J0008J0250J0081Q787O539M932M922N240M381L213L638N274
61279A083186N727M084K025J123J063J150J645K572K653Q97j663l060k705j568
61265A097129m79P39K409M083M792M106K876K780M696P617R673J0250J0401J1131
61251A172203J2136J2789J3481J5174J7904K0481K1552K0599J8041J4809J1636
61240A350805Q442M584J4m160o776p948q758r799j0783j1466j2114j2765j2856
61227A266420j2110j1267j1235j1832j2023j1231r785q097o200m272k883k193
$$ plain form
61324 941386 937731 934866 933310 933312 934022 934514 935023 936344 938586 941330 944422 947764 950952 953954 957564 962200
61308 962200 966804 969965 971636 972705 973413 973421 973025 972888 972708 971635 970155 970284 973525 979600 987431 996322
61292 996322 1005921 1015929 1026179 1036260 1045047 1051586 1056518 1061440 1066680 1071061 1074274 1077912 1083186
61279 1083186 1088913 1092997 1095022 1096145 1097208 1098358 1100003 1102575 1105228 1106125 1104462 1101402 1098697 1097129
61265 1097129 1096650 1097389 1099798 1103881 1108673 1112779 1115655 1118435 1123131 1130748 1140421 1150671 1161072 1172203
61251 1172203 1184339 1197128 1210609 1225783 1243687 1264168 1285720 1306319 1324360 1339169 1350805
61240 1350805 1359247 1363831 1363845 1359685 1352909 1344961 1336203 1326404 1315621 1304155 1292041 1279276 1266420
61227 1266420 1254310 1243043 1231808 1219976 1207953 1196722 1186937 1178840 1172640 1168368 1165485 1163292
61215A163292j474p6J471K068J659J496K521M137N023M899M976O554R464J2136
61201A218146J3191J2716J1754J0879R833Q473P108N627L343M82j165l38J574
61188A301623K085R09j0J54q2j714l235k859j211j39Q9N30J205J140N75J087L047
61171A303194M718M712M050M701P022R560J0952J1023J0364R654R419R893J0804
61158A410066J1468J1230J0000Q516P754P717P117M894J913K07M86J493K120K932
61144A487913M828P199Q784R729J1339J3943J6346J7674J8406J9056J9052J7716
61132A651985J5496J3181J0558O938K697r19l359n094o386p017p413q764j1278
61119A650625j3421j3828j3142j2930j3452j3711j3320j2939j2962j2987j2812
$$ plain form
61215 1163292 1161818 1161742 1163213 1165281 1166940 1168436 1170957 1175094 1180117 1185016 1189992 1196546 1206010 1218146
61201 1218146 1231337 1244053 1255807 1266686 1276519 1284992 1292100 1297727 1301070 1301552 1300387 1300049 1301623
61188 1301623 1303708 1304617 1304607 1304761 1304679 1302965 1299730 1296871 1295660 1295521 1295610 1296140 1297345 1298485 1299060 1300147 1303194
61171 1303194 1307912 1312624 1316674 1321375 1328397 1337957 1348909 1359932 1370296 1379950 1389369 1399262 1410066
61158 1410066 1421534 1432764 1442764 1451280 1459034 1466751 1473868 1478762 1480675 1480882 1481368 1482861 1484981 1487913
61144 1487913 1492741 1499940 1508724 1518453 1529792 1543735 1560081 1577755 1596161 1615217 1634269 1651985
61132 1651985 1667481 1680662 1691220 1698158 1700855 1699936 1696577 1691483 1685097 1678080 1670667 1661903 1650625
61119 1650625 1637204 1623376 1610234 1597304 1583852 1570141 1556821 1543882 1530920 1517933 1505121
61108A505121j2862j3265j3517j3411j3388j3546j3138j1721j0004q863q038o527
61096A366841l882n19K822N455O990P787Q726R990J0583R670P812O038M313K116
61082A444742J82J85K446N223O926P940R523J1805J3974J5910J8327K1251K3530
61069A581964K4376K4676K6056K9023L2648L5834L8214L9906M1271M3053M5984
61058A963005M9656N2436N3190N2718N2711N3557N4045N3178N1372M9678M8538
61047B534084M7551M5907M2787L7960L2161K6348K0448J3670O228k87m997r265
61035B792595j5080k2333k8810l2783l4756l6387l8472m0353m0992m0332l9490
61024B422807l9561m0250m0048l8029l5158l3344l3344l3988l3417l0849k7046
$$ plain form
61108 1505121 1492259 1478994 1465477 1452066 1438678 1425132 1411994 1400273 1390269 1381406 1373368 1366841
61096 1366841 1362959 1362440 1365262 1370717 1377707 1385494 1394220 1404210 1414793 1424463 1432275 1438313 1442626 1444742
61082 1444742 1444924 1445109 1447555 1452778 1459704 1467644 1477167 1488972 1502946 1518856 1537183 1558434 1581964
61069 1581964 1606340 1631016 1657072 1686095 1718743 1754577 1792791 1832697 1873968 1917021 1963005
61058 1963005 2012661 2065097 2118287 2171005 2223716 2277273 2331318 2384496 2435868 2485546 2534084
61047 2534084 2581635 2627542 2670329 2708289 2740450 2766798 2787246 2800916 2807144 2806857 2801860 2792595
61035 2792595 2777515 2755182 2726372 2693589 2658833 2622446 2583974 2543621 2502629 2462297 2422807
61024 2422807 2383246 2342996 2302948 2264919 2229761 2196417 2163073 2129085 2095668 2064819 2037773
61013B037773k3327k0201j7112j3669j0745r692j0395j0963r904p799o058m601
61001A893307j966K271O484Q992J0219J1956J4855J7683J9310K0441K2722K6675
60989B052949L1445L6275M1077M5388M8326N0326N3758O0364O8813P6262Q1942
60978B646925Q7549R4167J00756J06243J11430J17787J25410J33431J41661J50686
60968C816045J60474J69832J77568J83861J90346J98703K09253K21414K35549
60959E563045K53170K74542K97322L19250L41417L67202L98874M37488M85220
60950H737530N44734O16463O99774P97038R12928J049334J205265J382227J584110
60941A7529403J810506K057323K323851K599370K822163K862354K586845J976301
$$ plain form
61013 2037773 2014446 1994245 1977133 1963464 1952719 1943027 1932632 1921669 1911765 1903966 1897908 1893307
61001 1893307 1891341 1893612 1900096 1909088 1919307 1931263 1946118 1963801 1983111 2003552 2026274 2052949
60989 2052949 2084394 2120669 2161746 2207134 2255460 2305786 2359544 2419908 2488721 2564983 2646925
60978 2646925 2734474 2828641 2929397 3035640 3147070 3264857 3390267 3523698 3665359 3816045
60968 3816045 3976519 4146351 4323919 4507780 4698126 4896829 5106082 5327496 5563045
60959 5563045 5816215 6090757 6388079 6707329 7048746 7415948 7814822 8252310 8737530
60950 8737530 9282264 9898727 10598501 11395539 12308467 13357801 14563066 15945293 17529403
60941 17529403 19339909 21397232 23721083 26320453 29142616 32004970 34591815 36568116
60933C6568116J179319M32628q3559l19508l16303j40958J14011K96402K24198
60924C7954346k02271r10258j689092k323250k702479k831237k770496k587020
60916B1938243k337776k068263j808196j571003j361245j180595j027217q95498
60908I688450p80384o80324n95041n23105m62857m13208l72031l35948l02920
60899E222632k73240k47132k23413k01321j81441j63796j47199j31681j19363
60890C534046j11500j06439j01908r7644r4308r1468q8224q4463q0290p5471p0695
60879B531636o7683o6701o5442o2063n7927n5626n5311n4823n2652m9155m5375
60868A898878m2148l9932l8365l6306l3211k9878k7186k4956k2922k1698k1756
$$ plain form
60933 36568116 37747435 38180063 38096504 37776996 37460693 37319735 37433746 37730148 37954346
60924 37954346 37752075 36841817 35152725 32829475 30126996 27295759 24525263 21938243
60916 21938243 19600467 17532204 15724008 14153005 12791760 11611165 10583948 9688450
60908 9688450 8908066 8227742 7632701 7109596 6646739 6233531 5861500 5525552 5222632
60899 5222632 4949392 4702260 4478847 4277526 4096085 3932289 3785090 3653409 3534046
60890 3534046 3422546 3316107 3214199 3116555 3022247 2930779 2842555 2758092 2677802 2602331 2531636
60879 2531636 2463953 2397252 2331810 2269747 2211820 2156194 2100883 2046060 1993408 1944253 1898878
60868 1898878 1856730 1816798 1778433 1742127 1708916 1679038 1651852 1626896 1603974 1582276 1560520
60857A560520k2407k2742k2668k2093k0276j7176j4299j2884j2209j1044r781
60846A372941r693j0900j2448j3594j3755j2216r342p229p576r553j1146j1732
60834A243757j1785j1169r688q609r399j1336j2301j1754j0986j0615r847q409
60822A117859p313p206p539p721p800p729p204o462o020n573m377k630j159R7
60808A039223J698K902K291M41r9J715L850M181L289K867K785J630o48k429k742
60793A060954k412k648l486m074l924l446l422m105m891m927m132l542m515p476
60779A003954j1326j4106j4584j3394j2302j2213j2345j1626j0161q777p727o774
60767H68619o057n896n941n531m840m663n148n634n834o070o220n549l995k635
$$ plain form
60857 1560520 1538113 1515371 1492703 1470610 1450334 1433158 1418859 1405975 1393766 1382722 1372941
60846 1372941 1363248 1352348 1339900 1326306 1312551 1300335 1290993 1283764 1276188 1266635 1255489 1243757
60834 1243757 1231972 1220803 1211115 1202506 1193107 1181771 1169470 1157716 1146730 1136115 1126268 1117859
60822 1117859 1110546 1103340 1095801 1088080 1080280 1072551 1065347 1058885 1052865 1047292 1042915 1040285 1039126 1039223
60808 1039223 1040921 1043823 1046114 1046555 1046456 1048171 1052021 1056202 1059491 1062358 1065143 1066773 1066125 1063696 1060954
60793 1060954 1058542 1055894 1052408 1048334 1044410 1040964 1037542 1033437 1028546 1023619 1019487 1015945 1011430 1003954
60779 1003954 992628 978522 963938 950544 938242 926029 913684 902058 891897 883120 875393 868619
60767 868619 862562 856666 850725 845194 840354 835691 830543 824909 819075 813005 806785 801236 797241 794606
60753G94606k269k288j671n54J4l98j004q56p5K55n81j981k629k087j228q58m88
60736G75908P92K673L800L601L013L069L463L083J462q25k988m618n418m971l336
60721G78708j609j171k061k828k419j653j888k935l542l572m080n036m873k955
60707G38086q64j95m52l78LK7k4M79J263J895K779L856L439M61k957l516j058
60690G42844J397J981J956L024M895O376P073O937N502K607j012m421o925p595
60676G64639n760k421J04O16M8l45m63n19k35K71J52o25o32R87K992L771L559
60659G66139L519L456K206n4j509j025M36J083K22j394k529k514j752j411k281
60644G62592l797m455l443j666r22j966l597l943k611j149j233k836m450m698
$$ plain form
60753 794606 792337 790049 788378 787824 787838 787440 786436 785580 785505 785760 785179 783198 780569 778482 777254 776396 775908
60736 775908 776700 779373 783173 786774 789787 792856 796319 799402 800864 800039 797051 792433 787015 782044 778708
60721 778708 777099 775928 773867 771039 768620 766967 765079 762144 758602 755030 750950 745914 741041 738086
60707 738086 737222 737027 736575 736197 736200 736227 736203 736682 737945 739840 742619 746475 749914 750375 747418 743902 742844
60690 742844 744241 746222 748178 751202 756097 762473 769546 776483 781985 784592 783580 779159 772234 764639
60676 764639 758879 756458 756562 757178 757226 756881 756418 755899 755664 755935 756087 755462 754830 755817 758809 762580 766139
60659 766139 769658 773114 775320 775266 773757 772732 773168 774251 774473 773079 770550 768036 766284 764873 762592
60644 762592 758795 754340 750897 749231 748309 746343 742746 738803 736192 735043 733810 730974 726524 721826
60630G21826l305j039Q49J561J654K530M403N635M851K962J949K290L034L729
60616G52929M680N558N519M600L448J781j000l737m254k580j305j941k997k682
60602G58019j498q12o05l37n73j881l136k688o26J536K823L152K545J438J150
60587G58507K522M428M984L923K478J248l65k603m556n227m563l345k573k793
60573G52065l410l035j228O29R51Q0k48P22K034K566K302J904J707J469P86k72
60557G59022r28m61P33J510J579J748K249K060P23m43j37J026J675J779K078K393
60541G76606K226K236L159L890K866J069J182L591N598N312M052L877M676N027
60527H25367M492L645K960K823L596M591M113J826%R03L774O025O760P376Q827
$$ plain form
60630 721826 718521 717482 718331 719892 721546 724076 728479 734114 738965 741927 743876 746166 749200 752929
60616 752929 757609 763167 768686 773286 776734 778515 777515 773778 769524 766944 765639 763698 760701 758019
60602 758019 756521 755709 755104 754767 754194 752313 749177 746489 745863 747399 750222 753374 755919 757357 758507
60587 758507 761029 765457 770441 774364 776842 778090 777725 775122 770566 765339 760776 757431 754858 752065
60573 752065 748655 745620 744392 745021 745972 746052 745804 746526 748560 751126 753428 755332 757039 758508 759294 759022
60557 759022 758094 757633 758366 759876 761455 763203 765452 767512 768235 767792 767655 768681 770356 772135 774213 776606
60541 776606 778832 781068 784227 788117 790983 792052 793234 796825 802423 807735 811787 815664 820340 825367
60527 825367 829859 833504 836464 839287 842883 847474 851587 853413 853413 854316 858090 864115 870875 878251 887078
60512H87078J0267J0805J0984J1649J2481J2655J2458J3174J5315J7506J7530
60501A031902J4462R618N267K454N12j295k522k494j768j505j557m36K500N888
60487A061026Q051R037J0150J1989J3969J5578J7212J9480K2388K5485K8506L1549
60475A274420L4848L8328M1116M1583L8517L2399K5045J7775J0492K796m682j0791
60463A541846j5205j8451k0648k1062j9176j5783j2609j0878j0207q949n765j027
60451A382086L549O679Q568J0119J1919J4388J8149K3313K8867L3707L8069M3011
60439A622424M8769N4503N9501O3520O6075O6617O5435O3301N9997N4507M7029
60428B271678L9461L3312K8145K2643J6115Q239j533j3307k6256l9617n3360o6974
$$ plain form
60512 887078 897345 908150 919134 930783 943264 955919 968377 981551 996866 1014372 1031902
60501 1031902 1046364 1055982 1061249 1063703 1064215 1062920 1060398 1057904 1056136 1054631 1053074 1052638 1055138 1061026
60487 1061026 1069077 1078114 1088264 1100253 1114222 1129800 1147012 1166492 1188880 1214365 1242871 1274420
60475 1274420 1309268 1347596 1388712 1430295 1468812 1501211 1526256 1544031 1554523 1557319 1552637 1541846
60463 1541846 1526641 1508190 1487542 1466480 1447304 1431521 1418912 1408034 1397827 1388878 1383113 1382086
60451 1382086 1385635 1392314 1400882 1411001 1422920 1437308 1455457 1478770 1507637 1541344 1579413 1622424
60439 1622424 1671193 1725696 1785197 1848717 1914792 1981409 2046844 2110145 2170142 2224649 2271678
60428 2271678 2311139 2344451 2372596 2395239 2411354 2419593 2418060 2404753 2378497 2338880 2285520 2218546
60416B218546p8518q6022q9347q9662q7647q3306p7104p0129o3204n6666n0825
60405A386116m5825m1323l7071l3463l0803k8470k5707k2803k0529j8827j7111
60394A064184j5480j4346j3144j0906q129o572o829p539p495p173p269p019n254
60381I47029k520q08j266l090m739n360m892l613k169j602k525m098m475k747
60367I03125k07R49J64r60q40K47J058J373J942K753K608R10j031j289M02K318
60351I13522K686J520L79O13K138L757M377L839K867K472L114M275M978M978M976
60336I60491N355N381M369L208L506N364P096P317O292N078M443M830O163P297
60322A036190O909N425M743N519O223N719N020N248N452M291K600K190K962L348
$$ plain form
60416 2218546 2140028 2054006 1964659 1874997 1787350 1704044 1626940 1556811 1493607 1436941 1386116
60405 1386116 1340291 1298968 1261897 1228434 1197631 1169161 1143454 1120651 1100122 1081295 1064184
60394 1064184 1048704 1034358 1021214 1010308 1002179 995607 988778 981239 973744 966571 959302 952283 947029
60381 947029 944509 943701 942435 939345 934606 929246 924354 920741 918572 916970 914445 910347 905872 903125
60367 903125 902918 903867 904031 903071 902231 902478 903536 904909 906851 909604 912212 913122 912091 910802 911204 913522
60351 913522 916208 917728 918107 918720 920858 924615 928992 932831 935698 938170 941284 945559 950537 955515 960491
60336 960491 965846 971227 975596 978804 982310 987674 994770 1002087 1008379 1013457 1017900 1022730 1028893 1036190
60322 1036190 1043099 1048524 1053267 1058786 1065009 1070728 1075748 1080996 1086448 1090739 1093339 1095529 1098491 1101839
60308A101839L090L357M268M601M085L922M501M577L583L084M786Q186J1177J2366
60294A177422J2040J1430J1527J2192J2197J0534P659M755K071r94m372p154r096
60281A240211j0848j2385j2612j1080q966p631p199p143p193p034o088m493l408
60268A134131l587m326m581m391m348m328l662k172l37J390K922M512O680R747
60254A127650J3199J6015J7806J8880J9129J7877J5276J2752J1326J0526R665
60243A290101R117R199Q774O393K393j484m425p406j1715j7376k2946k6326k6097
60230A208202k2802j8640j5340j2760j0232q336q057q742q613p310o355o700p293
60217A067022o836n718n168n328n369n016m894n365n936n887m938l234j299p6
$$ plain form
60308 1101839 1104929 1108286 1112554 1117155 1121240 1125162 1129663 1134240 1137823 1140907 1145693 1153879 1165056 1177422
60294 1177422 1189462 1200892 1212419 1224611 1236808 1247342 1255001 1259756 1261827 1260833 1256461 1249307 1240211
60281 1240211 1229363 1216978 1204366 1193286 1184320 1176689 1169490 1162347 1155154 1148120 1142032 1137539 1134131
60268 1134131 1130544 1126218 1121637 1117246 1112898 1108570 1104908 1102736 1102399 1103789 1106711 1111223 1117903 1127650
60254 1127650 1140849 1156864 1174670 1193550 1212679 1230556 1245832 1258584 1269910 1280436 1290101
60243 1290101 1299218 1308417 1317191 1323584 1325977 1324493 1320068 1312662 1300947 1283571 1260625 1234299 1208202
60230 1208202 1185400 1166760 1151420 1138660 1128428 1120092 1112035 1103293 1094680 1087370 1081015 1074315 1067022
60217 1067022 1060186 1054468 1049300 1043972 1038603 1033587 1028693 1023328 1017392 1011505 1006567 1003333 1002034 1001958
60203A001958k89j462k168j725j070j241j536k94K496M654M479K870J898K104
60189A010674K427K324K433L056L421K897J864Q42j93r84n69J337L320L768K926
60174A039543K352K625K865K550K538L808N988P804Q499Q276P690P128O857P203
60160A115726Q401J0331J2374J3763J4245J4425J5119J6344J7147J6604J4737
60149A269216J2379J0334R021Q702R389J0441J0776J0046R235R455J0331J0292
60137A389617Q589O158M185K652Q98j112k900m363n617o250n803m851m605n369
60123A371229o268o640o706o591n724l792j670p43j558l417m949n031l688k293
60109A312159k345l865n475o063n669m746l599k715k587k729j978l11P08J10q90
$$ plain form
60203 1001958 1001669 1000207 998039 996314 995244 994003 992467 992173 994669 999323 1003802 1006672 1008570 1010674
60189 1010674 1013101 1015425 1017858 1020914 1024335 1027232 1029096 1029938 1029745 1028761 1028192 1029529 1032849 1036617 1039543
60174 1039543 1041895 1044520 1047385 1049935 1052473 1056281 1062269 1070073 1078572 1086848 1094538 1101666 1108523 1115726
60160 1115726 1124127 1134458 1146832 1160595 1174840 1189265 1204384 1220728 1237875 1254479 1269216
60149 1269216 1281595 1291929 1300950 1309652 1319041 1329482 1340258 1350304 1359539 1368994 1379325 1389617
60137 1389617 1398206 1404364 1408549 1411201 1412099 1410987 1408087 1403724 1398107 1391857 1386054 1381203 1376598 1371229
60123 1371229 1364961 1358321 1351615 1345024 1339300 1335508 1333838 1333095 1331537 1328120 1323171 1318140 1314452 1312159
60109 1312159 1309814 1305949 1300474 1294411 1288742 1283996 1280397 1277682 1275095 1272366 1270388 1270077 1270785 1270895 1270005
60094A270005n80P79J449O84n49j041m81P83K140K968L188L393L884M083L682
60079A294387L658M843O092N609L902L542N541P735P729N975M651M610M924M833
60065A368031M654M752M829M567M248M497N732P839R939J0749R831Q335P772Q140
60051A463915Q063O857N449M802M404L145J133l92p31m09j45R6O95J599K275K232
60035A502988J455N55L47Q39P53j306n068q725j0996j2208j3042j3309j2904j3026
60021A416353j4900j7612j8618j6719j3381j0815r781r822j0538j1609j2147j1245
60009A259166r260p674p412p849p799p087o638p118q006q334p975p602p445o747
59995A152220m886k592j324j504j896r98J254L372L891K963K290L338N783Q011
$$ plain form
60094 1270005 1269425 1270204 1271653 1272337 1271788 1270747 1270266 1271049 1273189 1276157 1279345 1282738 1286622 1290705 1294387
60079 1294387 1298045 1302888 1308980 1314589 1318491 1322033 1327574 1335309 1343038 1349013 1353664 1358274 1363198 1368031
60065 1368031 1372685 1377437 1382266 1386833 1391081 1395578 1401310 1409149 1419088 1429837 1439668 1448003 1455775 1463915
60051 1463915 1471978 1478835 1484284 1489086 1493490 1496635 1497768 1497376 1496645 1496236 1496091 1496187 1496882 1498481 1500756 1502988
60035 1502988 1504443 1504998 1505345 1506184 1506937 1505631 1500563 1491838 1480842 1468634 1455592 1442283 1429379 1416353
60021 1416353 1401453 1383841 1365223 1348504 1335123 1324308 1314527 1304705 1294167 1282558 1270411 1259166
60009 1259166 1249906 1242232 1234820 1226971 1219172 1212085 1205447 1198329 1190323 1181989 1174014 1166412 1158967 1152220
59995 1152220 1147334 1144742 1143418 1141914 1140018 1139020 1140274 1143646 1147537 1150500 1152790 1156128 1161911 1169922
59981A169922Q916Q579P192M474P45k355l284k409j466j482k048k449k587k781
59967A178967l388m655o426q079r182r970j0661j0801j0151r609j0091j0807r946
59954A065201p151m084k398k255k928l792m342m326m160m458m926m623l317j659
59940A010782o1J471K337J607l87k043k456k121j421J16K420M243M835N004N589
59925A029915O017N345L840K538J967K018K303K054O52j222k015j431q10r11q52
59910A049408j18Q4j177k781l269k940k608j688N37K833L398K588K145K300J854
59895A050566P56L55R45J128J20j052j199l96O95J797K838L680M296M540L862
59880A072931K047Q2o73O1J638L546N326O178O107O761R364J2292J2704J0339
$$ plain form
59981 1169922 1178838 1187417 1194609 1199083 1199828 1197473 1194189 1191780 1190314 1188832 1186784 1184335 1181748 1178967
59967 1178967 1175579 1170924 1164498 1156419 1147237 1137267 1126606 1115805 1105654 1096045 1085954 1075147 1065201
59954 1065201 1058050 1053966 1051568 1049313 1046385 1042593 1038251 1033925 1029765 1025307 1020381 1015758 1012441 1010782
59940 1010782 1010721 1012192 1014529 1016136 1015749 1013706 1011250 1009129 1007708 1007824 1010244 1014487 1019322 1024326 1029915
59925 1029915 1035932 1041277 1045117 1047655 1049622 1051640 1053943 1055997 1056649 1055427 1053412 1051981 1051171 1050260 1049408
59910 1049408 1049290 1049374 1048197 1045416 1042147 1039207 1036599 1034911 1035448 1038281 1041679 1044267 1046412 1048712 1050566
59895 1050566 1051322 1051677 1052622 1053750 1053870 1052818 1051619 1051223 1051918 1053715 1056553 1060233 1064529 1069069 1072931
59880 1072931 1074978 1075060 1074387 1074448 1076086 1079632 1084958 1091136 1097243 1104004 1113368 1125660 1138364 1148703
59866A148703P588N872M184J681p02j966k413k319j090J107K659K699K572L747
59852A172322N620O791P288P907Q232P086M496J718m60k134l285l601l312l097
59838A205571l125l026k819k933l207k669o91K156M643O015O375O242N965N580
59824A224077N153N014N430O167O721O956P114P280P361P557Q114Q588Q111O552
59810A320195M713L111J497j06r11n55J12L32O68J836K988K597Q89r8Q24K585
59794A340677L692M367N876Q403J0743J1956J2313J2365J1919J0468Q160N728
59782A446667L689K133J176J071J693K337K275J325k79k369m954p861j0371j1441
59768A425091j0586q656p259p093p415p483p780q774r393q218n869m359l973k847
$$ plain form
59866 1148703 1156291 1162163 1166347 1168028 1167326 1165360 1162947 1160628 1159538 1160645 1163304 1166003 1168575 1172322
59852 1172322 1177942 1184733 1192021 1199928 1208160 1215246 1219742 1221460 1221000 1218866 1215581 1211980 1208668 1205571
59838 1205571 1202446 1199420 1196601 1193668 1190461 1187792 1187101 1189257 1193900 1199915 1206290 1212532 1218497 1224077
59824 1224077 1229230 1234244 1239674 1245841 1252562 1259518 1266632 1273912 1281273 1288830 1296944 1305532 1313643 1320195
59810 1320195 1324908 1328019 1329516 1329410 1328499 1327944 1328056 1328388 1329056 1330892 1333880 1336477 1337366 1337268 1338092 1340677
59794 1340677 1344369 1348736 1354612 1363015 1373758 1385714 1398027 1410392 1422311 1432779 1440939 1446667
59782 1446667 1450356 1452489 1453665 1454736 1456429 1458766 1461041 1462366 1462087 1459718 1454764 1446903 1436532 1425091
59768 1425091 1414505 1405849 1398590 1391497 1384082 1376599 1368819 1360045 1350652 1342434 1336565 1332206 1328233 1325386
59754A325386k24J924J717L5j068j153j016q53o50j134k421k779r73J108O58j784
59738A316773l066k228j596k648l789l410k560k885l819l713k422j148p11j317
59724A281461l109n493o810o071m428l724m106m236l300j618K99K005K623J475
59710A244968o32j648k66K860N924P595P807P450P501Q312R570J0785J1648J2108
59696A333982J2409J3025J4095J5045J5186J4527J3466J1989R996Q219P771Q642
59684A478352R638R902R570Q822P447N586L835K295O16o97m60J155K091R35j122
59669A537965j849o46J264K521K513J315l16j357j613j837k250j873j45J813K592
59654A538097K378K386L083M122N334O599P241O889O563P699J0280J3052J5263
$$ plain form
59754 1325386 1325162 1327086 1328803 1328838 1327770 1326617 1325601 1324748 1324098 1322964 1320543 1317764 1316791 1317899 1318557 1316773
59738 1316773 1313707 1311479 1309883 1307235 1303446 1300036 1297476 1294591 1290772 1287059 1284637 1283489 1282778 1281461
59724 1281461 1278352 1272859 1266049 1259978 1255550 1251826 1247720 1243484 1240184 1238566 1238865 1240870 1243493 1244968
59710 1244968 1244336 1242688 1242422 1245282 1251206 1258801 1266608 1274058 1281559 1289871 1299441 1310226 1321874 1333982
59696 1333982 1346391 1359416 1373511 1388556 1403742 1418269 1431735 1443724 1453720 1461939 1469710 1478352
59684 1478352 1487990 1497892 1507462 1516284 1523731 1529317 1533152 1535447 1536063 1535366 1534906 1536061 1538152 1539087 1537965
59669 1537965 1536116 1535470 1536734 1539255 1541768 1543083 1542767 1541410 1539797 1537960 1535710 1533837 1533692 1535505 1538097
59654 1538097 1540475 1542861 1545944 1550066 1555400 1561999 1569240 1576129 1582692 1590391 1600671 1613723 1628986
59641A628986J7047J8344J8703J8218J7472J6510J4874J2733J0831R244P306N084
59629A795352L686L508L179J292j482l041k595j784k725n683r188j2035j4132
59616A754352j5363j4918j2745j0764j1044j2948j3642j1802r172p796p204n632
59604A621322k852j16K002M023N955O963O958P202Q621J0271J0263P951M720K602
59590A695885K265K379R36k855p977j2684j5857j7494j8494k0004k2332k4372
59578A559396k4692k3274k1454k0093j8781j7121j5669j5015j4784j4323j3629
59567A360561j3051j2824j3305j4787j6486j6853j5577j4199j3859j3691j2514
59556A203415j0913j0122r913r251q233p645p096n417k709l27J018J711J917J409
$$ plain form
59641 1628986 1646033 1664377 1683080 1701298 1718770 1735280 1750154 1762887 1773718 1782962 1790268 1795352
59629 1795352 1799038 1802546 1805725 1807017 1805535 1802494 1799899 1798115 1795390 1789707 1780519 1768484 1754352
59616 1754352 1738989 1724071 1711326 1700562 1689518 1676570 1662928 1651126 1641954 1634158 1626954 1621322
59604 1621322 1618470 1618354 1620356 1624379 1630334 1637297 1644255 1651457 1660078 1670349 1680612 1688563 1693283 1695885
59590 1695885 1698150 1700529 1701465 1698610 1690633 1677949 1662092 1644598 1626104 1606100 1583768 1559396
59578 1559396 1534704 1511430 1489976 1469883 1451102 1433981 1418312 1403297 1388513 1374190 1360561
59567 1360561 1347510 1334686 1321381 1306594 1290108 1273255 1257678 1243479 1229620 1215929 1203415
59556 1203415 1192502 1182380 1172467 1163216 1154983 1147338 1140242 1134825 1132116 1131789 1132807 1134518 1136435 1137844
59542A137844O48N63J071J213Q30P85J448K221K744L166L241K469J259N82L08
59527A160392n71j901k328j747j902l647n341n178l834l296m099n151n680n851
59513A109866n712m828l115j257o1K02q2j81L50J042R30q1p34J84K294M013M280
59496A107110L447K527K065J955K081K715L931N018N212N146O524R762J3043J4734
59482A185270J5687J7613K0162K1745K2743K4973K7451K5694J7057M827n011r607
59470A368604j0105q353n455k937k424l593m314l387j709m48K46J99j402m495
59456A320427p272q069p427p258q514j0558j2332j3163j2682j1004r044p941p950
59443A197213q266p934o650m842l307k521j996o94J490L224L448L028L576M968
$$ plain form
59542 1137844 1138492 1139055 1140126 1141339 1142169 1142954 1144402 1146623 1149367 1152533 1155774 1158243 1159502 1160084 1160392
59527 1160392 1159821 1157920 1155592 1153845 1151943 1148296 1142955 1137777 1133943 1130647 1126548 1121397 1115717 1109866
59513 1109866 1104154 1099326 1096211 1094954 1094893 1095095 1095013 1094832 1095182 1096224 1097154 1097073 1096339 1096523 1098817 1102830 1107110
59496 1107110 1110557 1113084 1115149 1117104 1119185 1121900 1125831 1130849 1136061 1141207 1147731 1157493 1170536 1185270
59482 1185270 1200957 1218570 1238732 1260477 1283220 1308193 1335644 1361338 1378395 1383222 1378211 1368604
59470 1368604 1358499 1350146 1344691 1341754 1339330 1335737 1331423 1328036 1326327 1325879 1326125 1326324 1324922 1320427
59456 1320427 1313155 1305086 1297659 1290401 1281887 1271329 1258997 1245834 1233152 1222148 1213104 1205163 1197213
59443 1197213 1188947 1181013 1174363 1169521 1166214 1163693 1161697 1161003 1162493 1165717 1169165 1172193 1175769 1180737
59429A180737N524M716M067M675N465N075M189M339N205N088L829L357M806O707
59415A247779O797M679J862j5l08O25J824K436K442K390K292J591M31OJ062K779
59399A278672L911M334M820N794P151Q809J0614J1909J1960J0683Q526O028L903
59386A377114K910K890K505P75j543l005l454l805m197l704k041k51P68J421K401
59371A368784L368L474K882K904M580P504J0311J2060J3082J4468J6875J9934
59359A480226K2775K4976K6838K8900L1417L4293L7210L9383L9127L4328K4335
59348A823808J1534J83o916j0053j0774r607o487k145K492P221J0965J0203J916
59335A822340j1738k4367l1593l4082l4000l1735k7642k3803k1457j8824j4227
$$ plain form
59429 1180737 1186261 1190977 1195044 1199719 1205184 1210259 1214448 1218787 1223992 1229080 1232909 1236266 1241072 1247779
59415 1247779 1254576 1259255 1261117 1261102 1260794 1261419 1263243 1265679 1268121 1270511 1272803 1274394 1274825 1274831 1275893 1278672
59399 1278672 1282583 1286917 1291737 1297531 1304682 1313491 1324105 1336014 1347974 1358657 1367183 1373211 1377114
59386 1377114 1380024 1382914 1385419 1386194 1384651 1381646 1378192 1374387 1370190 1366486 1364445 1364194 1364962 1366383 1368784
59371 1368784 1372152 1375626 1378508 1381412 1385992 1393496 1403807 1415867 1428949 1443417 1460292 1480226
59359 1480226 1503001 1527977 1554815 1583715 1615132 1649425 1686635 1726018 1765145 1799473 1823808
59348 1823808 1835342 1835525 1828609 1818556 1807782 1798175 1791688 1789543 1792035 1799256 1810221 1820424 1822340
59335 1822340 1810602 1786235 1754642 1720560 1686560 1654825 1627183 1603380 1581923 1563099 1548872
59324A548872r550p694q054p581n392l137j423P73L157L845K631J740K508L682
59310A524377L934L830M361N337O340P649R191J0036R740R066Q746Q737R176J0672
59296A631192J3133J5566J7408J8815J9554J9253J8882J9989K1984K2393K0535
59285A838704J8681J8455J8324J6270J2918J0014P428L901k66l541n685p962j1047
59272A916194j4326j7180j9602k1589k2967k3905k4708k5275k5319k4793k3645
59261A672885k1741j9702j8940j9942k1203k0900j9025j6898j5156j3480j1888
59250A474010j0934j0685j0424r456p466m315k89L573O314Q193J0369J3318J5982
59237A478190J6409J3015N787l190j0716j4721j5526j4716j3284j1398r324p563
$$ plain form
59324 1548872 1539322 1531628 1523574 1515993 1510601 1507464 1506041 1506814 1509971 1513816 1516447 1518187 1520695 1524377
59310 1524377 1528311 1532141 1536502 1541839 1548179 1555828 1565019 1575055 1584795 1593861 1602607 1611344 1620520 1631192
59296 1631192 1644325 1659891 1677299 1696114 1715668 1734921 1753803 1773792 1795776 1818169 1838704
59285 1838704 1857385 1875840 1894164 1910434 1923352 1933366 1940794 1944695 1944429 1940888 1935203 1927241 1916194
59272 1916194 1901868 1884688 1865086 1843497 1820530 1796625 1771917 1746642 1721323 1696530 1672885
59261 1672885 1651144 1631442 1612502 1592560 1571357 1550457 1531432 1514534 1499378 1485898 1474010
59250 1474010 1463076 1452391 1441967 1432511 1425045 1420730 1420441 1424014 1430328 1438521 1448890 1462208 1478190
59237 1478190 1494599 1507614 1513401 1510211 1499495 1484774 1469248 1454532 1441248 1429850 1420526 1412963
59225A412963o153m580k468M9K584M870O911Q989J1298J3576J5412J7008J8925
59212A499384K0973K2046K1430J9718J8046J6993J6468J6074J5263J3814J2285
59201A692494J1245J0003P216L062n34k457l703n361o742o846o457p103q648r640
59187A666529r651r708j0472j1390j1795j1719j1441j0960j0137q903p474o621
59175A546258p142q593r392q864q283q869r792r609q780q877r850j0133r404r121
59161A419549r853j0097q722o871o228o549o326n040l403j809L8J975K983K435
59147A362082J046J23J64O27R28J173J768K596L027K710K040J688J937K484K706
59132A387099K101R08K69J117K737L197J649l91p88O40K005J536p80l564n389
$$ plain form
59225 1412963 1406810 1402230 1399762 1399811 1402395 1407265 1414176 1423165 1434463 1448039 1463451 1480459 1499384
59212 1499384 1520357 1542403 1563833 1583551 1601597 1618590 1635058 1651132 1666395 1680209 1692494
59201 1692494 1703739 1713742 1720958 1724020 1723486 1721029 1717326 1711965 1705223 1698377 1691920 1684817 1676169 1666529
59187 1666529 1656878 1647170 1636698 1625308 1613513 1601794 1590353 1579393 1569256 1560353 1552879 1546258
59175 1546258 1539116 1530523 1521131 1512267 1503984 1495115 1485323 1475714 1466934 1458057 1448207 1438074 1428670 1419549
59161 1419549 1409696 1399599 1390877 1384006 1377778 1371229 1364903 1359863 1356460 1354651 1354689 1356664 1359647 1362082
59147 1362082 1363128 1363251 1363415 1364042 1364970 1366143 1367911 1370507 1373534 1376244 1378284 1379972 1381909 1384393 1387099
59132 1387099 1389200 1390108 1390377 1391494 1394231 1397428 1399077 1398686 1397898 1398538 1400543 1402079 1401299 1397735 1392346
59117A392346n783n444n517o384p316p579p467p704q080p458n242k259m4N45k02
59102A316412j403k423l176l692l736l121k280k020k632l738n041o608q265r347
59088A258930r514r226r092r165r197r037q517p534o536o258o613o592n642m325
59074A151682l089j465P02K278K327J897K796M983O634O837O750P628R021R850
59060A208831J0420J2104J5032J7225J6723J4195J2444J3198J5275J6520J6495
59049A368462J6073J5132J2586Q785N834M800M257K642N18q54j784l246m664m657
59035A423884l517l035l834m629m411l860m010m724n158m907m136l208k718l371
59021A368366n355p931r967j0712j0166q987q061p748p548o754n434m487m648
$$ plain form
59117 1392346 1386563 1381119 1375602 1369218 1361902 1354323 1346856 1339152 1331072 1323614 1318372 1316113 1316069 1316614 1316412
59102 1316412 1315009 1312586 1309410 1305718 1301982 1298861 1296581 1294561 1291929 1288191 1283150 1276542 1268277 1258930
59088 1258930 1249416 1240190 1231098 1221933 1212736 1203699 1195182 1187648 1181112 1174854 1168241 1161649 1156007 1151682
59074 1151682 1148593 1147128 1147830 1150108 1152435 1154332 1157128 1162111 1168745 1175582 1182332 1189960 1198981 1208831
59060 1208831 1219251 1231355 1246387 1263612 1280335 1294530 1306974 1320172 1335447 1351967 1368462
59049 1368462 1384535 1399667 1412253 1421038 1426872 1431672 1435929 1438571 1439089 1438235 1436451 1433205 1428541 1423884
59035 1423884 1420367 1417332 1413498 1408869 1404458 1400598 1396588 1391864 1386706 1381799 1377663 1374455 1371737 1368366
59021 1368366 1363011 1355080 1345113 1334401 1324235 1315248 1307187 1299439 1291891 1285137 1279703 1275216 1270568
59008A270568n597o161n424l690k224j916k437l051l727m767n758o044o067o843
58994A206862p972p633n081j864K83J406K340K934K496J170j37p48m58M40Q54
58979A194892k29j832j424J598M340L874J149l71R00L472N392O174O409P159R593
58964A241096J3710J7607J9286J8957J8199J7380J5502J2372R124O516M159J518
58952A395426j519m842p615q021n288j634l01j532k493j280J132L311N425P723
58938A378492R038Q315O349M604L327K150J584K337L592L496J514o36p77J512
58924A424897M529O185N975N315N877P837J0072J1766J3142J4616J6030J7017
58912A543258J7665J8409J9412K0160J9650J7215J3464J0115Q542Q509Q562P408
$$ plain form
59008 1270568 1264971 1258810 1253386 1249696 1247472 1245556 1243119 1240068 1236341 1231574 1225816 1219772 1213705 1206862
58994 1206862 1198890 1191257 1186176 1184312 1184595 1186001 1188341 1191275 1193771 1194941 1194804 1194056 1193598 1194038 1194892
58979 1194892 1194663 1192831 1191407 1193005 1197345 1201219 1202368 1201997 1202897 1206369 1211761 1217935 1224344 1231503 1241096
58964 1241096 1254806 1272413 1291699 1310656 1328855 1346235 1361737 1374109 1383233 1389749 1393908 1395426
58952 1395426 1393907 1389065 1381450 1373429 1368141 1366507 1366206 1364674 1362181 1360901 1362033 1365344 1370769 1378492
58938 1378492 1387530 1395845 1402194 1406798 1410125 1412275 1413859 1416196 1419788 1423284 1424798 1424162 1423385 1424897
58924 1424897 1429426 1435611 1441586 1446901 1452778 1460615 1470687 1482453 1495595 1510211 1526241 1543258
58912 1543258 1560923 1579332 1598744 1618904 1638554 1655769 1669233 1679348 1687890 1696399 1704961 1712369
58900A712369M736J238j813l439l958m841p302j1352j6112k0293k2390k1713j9678
58887A585452j8823j9836k0879k0450j9237j8035j5815j1742p543n563n384m604
58875A417541k354J34J855K736K526J236L72J447L356L516J593k68r34j476k408
58860A428872k495j231j84n43j174n15J122K473L302M217N416O719Q224J0092
58846A464295J2193J4356J6462J8104J8955J9452K0173K0680K0142J8994J8476
58835A662282J8605J8183J7002J6342J6915J7921J8730J9822K1427K2735K3189
58824A873153K3141K2557K0470J6595J2262Q916O723N226M225L253J399j467m153
58811A992300n431n207m104k898k638m158p068j0119j2758j5144j6818j6967j6254
$$ plain form
58900 1712369 1717105 1718343 1716530 1713091 1709133 1704292 1696990 1685638 1669526 1649233 1626843 1605130 1585452
58887 1585452 1566629 1546793 1525914 1505464 1486227 1468192 1452377 1440635 1433092 1427529 1422145 1417541
58875 1417541 1415187 1415321 1417176 1419912 1422438 1423674 1424046 1425493 1428849 1432365 1433958 1433690 1432756 1431280 1428872
58860 1428872 1426377 1425146 1424962 1424419 1423245 1422730 1423852 1426325 1429627 1433844 1439260 1445979 1454203 1464295
58846 1464295 1476488 1490844 1507306 1525410 1544365 1563817 1583990 1604670 1624812 1643806 1662282
58835 1662282 1680887 1699070 1716072 1732414 1749329 1767250 1785980 1805802 1827229 1849964 1873153
58824 1873153 1896294 1918851 1939321 1955916 1968178 1977094 1983817 1989043 1993268 1996521 1997920 1996453 1992300
58811 1992300 1986869 1981662 1977558 1974660 1972022 1967864 1960796 1950677 1937919 1922775 1905957 1888990 1872736
58798A872736j6577j8410k0166k0824k1373k2681k3676k3026k1313k0115j9814
58787A644761j9655j9347j9395k0127k1054k1208j9955j7864j6460j6392j6401
58776A436903j5164j3512j3024j2987j1129p408m505l819l560k000k49o5p06M7
58762A348822K709N640P146O809N229L346J785M94o37j088o69o65k341m511m707
58747A367362k839j525k322l970m990n626o247o184n466n477o616p272o545n875
58733A296408o495p226o478m610k731q96R37K003K347L538O135Q281Q671Q831
58719A308715J0426J2212J2070J0365Q803P383N081K352L56j310l686o047o946
58706A359774o975q034j0359j2520j3878j4726j4494j2221q769o288n358m590
$$ plain form
58798 1872736 1856159 1837749 1817583 1796759 1775386 1752705 1729029 1706003 1684690 1664575 1644761
58787 1644761 1625106 1605759 1586364 1566237 1545183 1523975 1504020 1486156 1469696 1453304 1436903
58776 1436903 1421739 1408227 1395203 1382216 1371087 1363679 1359174 1355355 1351795 1349795 1349546 1349481 1348775 1348822
58762 1348822 1351531 1357171 1364317 1371126 1376355 1379701 1381486 1381980 1381343 1380255 1379586 1378921 1376580 1372069 1367362
58747 1367362 1364523 1362998 1360676 1356706 1351716 1346090 1339843 1333659 1328193 1322716 1316100 1308828 1302283 1296408
58733 1296408 1289913 1282687 1276209 1271599 1268868 1267972 1268909 1270912 1273259 1276797 1282932 1291213 1299884 1308715
58719 1308715 1319141 1331353 1343423 1353788 1362591 1369974 1375055 1377407 1377763 1376453 1372767 1366720 1359774
58706 1359774 1352799 1344765 1334406 1321886 1308008 1293282 1278788 1266567 1257798 1251510 1246152 1241562
58694A241562l186j982j684j824j905k133k561k489j194J330M289O347O495N262
58680A246327M449N016O084O636P008P785Q501Q726R127J0022J0195Q747O978
58667A345601O545O833O162M750M306N109N716N496N509O612Q228R364R686R445
58653A439362R012Q496P343M798J243j855l949o257r755j3624j6810j9706k2902
58640A375396k5518k6521k6578k6929k7222k6250k4124k2029k0386j8715j6816
58629A114308j4736j2212r415p501p177p460p021n955n026m166k933j551l69O55
58615A029441J079N0j733j947J13K176K493K544M247O549P446P601Q989J1183
58601A080231J1820R993O660K513k109n947p903q771r837j0685j0313r323q785
$$ plain form
58694 1241562 1238376 1236394 1234710 1232886 1230981 1228848 1226287 1223798 1222604 1223934 1228223 1234570 1241065 1246327
58680 1246327 1250776 1255792 1261876 1268512 1275520 1283305 1291806 1300532 1309659 1319681 1329876 1338623 1345601
58667 1345601 1352146 1358979 1365141 1369891 1374197 1379306 1385022 1390518 1396027 1402639 1410867 1420231 1429917 1439362
58653 1439362 1448374 1456870 1464213 1469011 1470254 1468399 1464450 1458193 1448438 1434814 1418004 1398298 1375396
58640 1375396 1349878 1323357 1296779 1269850 1242628 1216378 1192254 1170225 1149839 1131124 1114308
58629 1114308 1099572 1087360 1077945 1070444 1063267 1055807 1048786 1042831 1037805 1033639 1030706 1029155 1028786 1029441
58615 1029441 1030520 1030570 1028837 1026890 1027003 1029179 1031672 1034216 1038463 1045012 1052458 1060059 1069048 1080231
58601 1080231 1092051 1102044 1108704 1111217 1109108 1103161 1095258 1086487 1076650 1065965 1055652 1046329 1037544
58588A037544q228p048o449p384q045o355l631k641l134k703j159m79r62r80l44
58573I78002m94j345j190R8P69L31J48P44J056N58k22j104j947j507Q51L092L071
58556I80911K176L239N685O553N719N935P701Q376O907N444N368N534N302N702
58542A060552O503N702L126J233J143J130K62J46J638L121L668M859P658J0365
58528A111106J1507J2101J3366J4634J5337J6565J8858K0621K0523J9422J8408
58517A292448J7031J5061J3841J4185J4738J4085J2886J2541J3317J5044J7975
58506A453152K1811K5385K8339L1459L4647L6411L6260L5503L4738L2538K7748
58495A797991K1183J4093O841L8m981p938r998j1592j1860j1032j1098j2977j5239
$$ plain form
58588 1037544 1029316 1022268 1015819 1008435 1000390 994035 990404 987763 984629 981926 980767 980288 979326 978346 978002
58573 978002 977508 976163 974973 975071 975840 976171 976319 977063 978119 978677 978455 977351 975404 973897 974748 977840 980911
58556 980911 983087 986326 992011 998564 1004283 1010218 1017919 1026295 1033202 1038646 1044014 1049548 1054850 1060552
58542 1060552 1067055 1072757 1075883 1077116 1078259 1079389 1079651 1079797 1081435 1084556 1088224 1093083 1100741 1111106
58528 1111106 1122613 1134714 1148080 1162714 1178051 1194616 1213474 1234095 1254618 1274040 1292448
58517 1292448 1309479 1324540 1338381 1352566 1367304 1381389 1394275 1406816 1420133 1435177 1453152
58506 1453152 1474963 1500348 1528687 1560146 1594793 1631204 1667464 1702967 1737705 1770243 1797991
58495 1797991 1819174 1833267 1840108 1840146 1835165 1827227 1817229 1805637 1793777 1782745 1771647 1758670 1743431
58482A743431j6777j8675k2173k6612l0608l3381l4113l2136k8900k7511k8888
58471A443657l0226k8668k4731k0837j8132j6207j4433j2248r270o172m478m821
58459A253434o331p854q513p518n110l328l609m169k348Q83K012L71j145j085
58445A205690j239k546l057j563K52R59J523K580K709J293K41R42K177K885M209
58430A217055O837Q908Q809P875Q338J0532J3650J7138J9917K0591J9837K0233
58418A379720K2373K3663K2293J9658J7398J4882J1297P384L466j477p072j0823
58406A502762j1912j2704j4529j5043j1991o751j844K250N654P426P729Q796J1330
58393A471173J2672J1067Q783Q305Q190N714J059l991r024j3748j6227j5551j4159
$$ plain form
58482 1743431 1726654 1707979 1685806 1659194 1628586 1595205 1561092 1528956 1500056 1472545 1443657
58471 1443657 1413431 1384763 1360032 1339195 1321063 1304856 1290423 1278175 1268905 1262733 1258255 1253434
58459 1253434 1247103 1239249 1230736 1223218 1218108 1214780 1211171 1207002 1204654 1205537 1207549 1207920 1206775 1205690
58445 1205690 1204451 1201905 1198848 1197285 1197537 1198496 1200019 1202599 1205308 1206601 1206842 1207784 1209961 1212846 1217055
58430 1217055 1223892 1232800 1241609 1249484 1257822 1268354 1282004 1299142 1319059 1339650 1359487 1379720
58418 1379720 1402093 1425756 1448049 1467707 1485105 1499987 1511284 1518668 1522134 1520657 1513585 1502762
58406 1502762 1490850 1478146 1463617 1448574 1436583 1429832 1427988 1430238 1435892 1443318 1451047 1459843 1471173
58393 1471173 1483845 1494912 1503695 1512000 1520190 1525904 1526963 1522972 1513948 1500200 1483973 1468422 1454263
58380A454263j4471j5180j3669j0065o151k389J011K328Q04q30M21L599N650N992
58366A411313O269P021P474P594P776P385N763L592J574q53l906o362p640q945
58352A438055j0741j1405j0151q750q419p708n611l837l611l100o92J927K864
58339A368821L381N231P240P787Q117R819J1307J0366Q162P302P545O889N535
58326A467502N523P441J0081J2319J3445J3029J2229J3276J6103J7752J6711J5026
58314A620437J4448J3704J1775J0464J1092J1882J1288J0800J1800J2912J3062
58303A753664J3831J6035J7599J7514J8070K0249K1070J8651J5648J4240J2297
58292A938868Q332N538O439Q170P726P386R885J2709J2811J2663J5600J9080J8897
$$ plain form
58380 1454263 1439792 1424612 1410943 1400878 1394727 1392338 1393349 1395677 1396481 1395651 1396072 1399671 1405321 1411313
58366 1411313 1417582 1424603 1432077 1439671 1447447 1454832 1460595 1464187 1465761 1464908 1461002 1454640 1447000 1438055
58352 1438055 1427314 1415909 1405758 1397008 1388589 1380881 1375270 1371433 1367822 1364722 1364030 1365957 1368821
58339 1368821 1372202 1377433 1384673 1392460 1400577 1410396 1421703 1432069 1440231 1447533 1455078 1461967 1467502
58326 1467502 1473025 1480466 1490547 1502866 1516311 1529340 1541569 1554845 1570948 1588700 1605411 1620437
58314 1620437 1634885 1648589 1660364 1670828 1681920 1693802 1705090 1715890 1727690 1740602 1753664
58303 1753664 1767495 1783530 1801129 1818643 1836713 1856962 1878032 1896683 1912331 1926571 1938868
58292 1938868 1947200 1952738 1959177 1967347 1975073 1982459 1992344 2005053 2017864 2030527 2046127 2065207 2084104
58279B084104J6675J6809J9017K0260K1145K3944K6749K6216K3987K4011K5436
58268B328353K4394K1177J9485J9934K0010J9176J8779J8388J7251J7495K0877
58257B545319K4399K4211K1686K0810K1989K3287K4932K7513K8811K7559K7102
58246B817618L0020L2952L2463L1670L4630L8444L8319L6455L8108M2204M3917
58235C216800M3556M4827M6986M6840M6048M8479N2554N3993N3805N5882N9253
58224C769023O0459O0861O3654O6612O6048O4910O8322P4125P6797P7754Q2533
58213D531098R0514R6873J02066J09775J18003J21899J22988J26134J30248J31721
58203E681319J33779J41958J53249J60477J64473J71049J79104J83308J85561
$$ plain form
58279 2084104 2100779 2117588 2136605 2156865 2178010 2201954 2228703 2254919 2278906 2302917 2328353
58268 2328353 2352747 2373924 2393409 2413343 2433353 2452529 2471308 2489696 2506947 2524442 2545319
58257 2545319 2569718 2593929 2615615 2636425 2658414 2681701 2706633 2734146 2762957 2790516 2817618
58246 2817618 2847638 2880590 2913053 2944723 2979353 3017797 3056116 3092571 3130679 3172883 3216800
58235 3216800 3260356 3305183 3352169 3399009 3445057 3493536 3546090 3600083 3653888 3709770 3769023
58224 3769023 3829482 3890343 3953997 4020609 4086657 4151567 4219889 4294014 4370811 4448565 4531098
58213 4531098 4621612 4718485 4820551 4930326 5048329 5170228 5293216 5419350 5549598 5681319
58203 5681319 5815098 5957056 6110305 6270782 6435255 6606304 6785408 6968716 7154277
58194G154277J91895K00690K06052K10224K20560K36819K53425K71021K93269
58185I238232L16021L33022L48561L70777L96659M18222M38829M67542N02081
58176A2829946N34490N69417O18576O80843P46400Q16498Q99030R88160J069868
58167A9753228J145183J226049J310455J384423J446988J509985J574868J634217
58159C0985396J694824J773572J870927J974098K085039K218010K371140K529896
58151D7502902K697472K890827L107891L331601L565131L829030M126572M450612
58143G5502038M821780N278270N831993O481401P261484Q226154R386931J0732833
58135A33522884J2307158J4191299J6412036J8939547K1762526K4869044K8186323
$$ plain form
58194 7154277 7346172 7546862 7752914 7963138 8183698 8420517 8673942 8944963 9238232
58185 9238232 9554253 9887275 10235836 10606613 11003272 11421494 11860323 12327865 12829946
58176 12829946 13364436 13933853 14552429 15233272 15979672 16796170 17695200 18683360 19753228
58167 19753228 20898411 22124460 23434915 24819338 26266326 27776311 29351179 30985396
58159 30985396 32680220 34453792 36324719 38298817 40383856 42601866 44973006 47502902
58151 47502902 50200374 53091201 56199092 59530693 63095824 66924854 71051426 75502038
58143 75502038 80323818 85602088 91434081 97915482 105176966 113403120 122790051 133522884
58135 133522884 145830042 160021341 176433377 195372924 217135450 242004494 270190817
58128B70190817L1671017L5333790L8738979M0284384L7445631K8467034J4109543
58121D96241195k438292j7509004k8843540l5917856l9149824l9250784l7098310
58114B96033585l3658114k9738880k5853755k2305122j9267779j6763578j4681625
58107A33764732j2901295j1364593j0032767q852258p792836o863718o065971
58100F9891294n369920m754057m223954l777419l388769l042035k745784k502142
58092D0087214k291999k102318j939320j803804j680062j559212j448945j351498
58084B5910056j255526j157766j070165r97731r30596q64946q10674p71079p35104
58075A7316469o97001o64566o40816o16017n85257n56396n33588n09580m81325
$$ plain form
58128 270190817 301861834 337195624 375934603 416218987 453664618 482131652 496241195
58121 496241195 493802903 476293899 447450359 411532503 372382679 333131895 296033585
58114 296033585 262375471 232636591 206782836 184477714 165209935 148446357 133764732
58107 133764732 120863437 109498844 99466077 90613819 82820983 75957265 69891294
58100 69891294 64521374 59767317 55543363 51765944 48377175 45335140 42589356 40087214
58092 40087214 37795215 35692897 33753577 31949773 30269711 28710499 27261554 25910056
58084 25910056 24654530 23496764 22426599 21428868 20498272 19633326 18822652 18051573 17316469
58075 17316469 16619468 15954902 15314086 14698069 14112812 13556416 13022828 12513248 12031923
58066A2031923m56901m39728m21338l96944l73665l56313l38988l17715k98198
58057H632133k84095k70045k52969k38462k29605k20725k08232j96664j88389
58048F542947j78267j64281j52949j48307j45491j40600j37030j36577j34050
58039E205395j26662j19651j16796j13846j07052j00106r7027r5513r2658r0366
58029D145718r0229q9472q6366q3580q2606q0868p7447p5274p4989p3128o8888
58018C262871o6000o5650o4488o1624o0270o0482n8042n2820n0245n1869n2555
58007B618826m9770m7513m7919m7257m3792m1468m1918m0764l5980l2229l2609
57996B157607l3586l2510l2611l5669l7096l3656k9461k8867k9545k7991k6055
$$ plain form
58066 12031923 11575022 11135294 10713956 10317012 9943347 9587034 9248046 8930331 8632133
58057 8632133 8348038 8077993 7825024 7586562 7356957 7136232 6928000 6731336 6542947
58048 6542947 6364680 6200399 6047450 5899143 5753652 5613052 5476022 5339445 5205395
58039 5205395 5078733 4959082 4842286 4728440 4621388 4521282 4424255 4328742 4236084 4145718
58029 4145718 4055489 3966017 3879651 3796071 3713465 3632597 3555150 3479876 3404887 3331759 3262871
58018 3262871 3196871 3131221 3066733 3005109 2944839 2884357 2826315 2773495 2723250 2671381 2618826
58007 2618826 2569056 2521543 2473624 2426367 2382575 2341107 2299189 2258425 2222445 2190216 2157607
57996 2157607 2124021 2091511 2058900 2023231 1986135 1952479 1923018 1894151 1864606 1836615 1810560
57985A810560k6469k7132k5227k2448k1294k0553j8886j8361k0181k1418k0113
57974A568478j9036k0389k1434j9595j7338j7645j9061j9427k0195k2600k3790
57963A347968k1211j7227j5064j3821j1578r882j0783j2553j2555j1594j1767
57952A199933j2575j2469j1651j0604q606o203n895p980r159p698o173o645p116
57939A087159n692m176m458n209n175n772p322o836l039L34j22k473l263k667
57925A031289k264j350O13J287q82l311l301k418l207m498l796j743n09p7N43
57910A006376P98L34Q28L058M610L305L82k155m429o478o529m395l238m899o743
57895I80825o212n030n574o648o516o629q310r069o565l251k643l515k355N69
$$ plain form
57985 1810560 1784091 1756959 1731732 1709284 1687990 1667437 1648551 1630190 1610009 1588591 1568478
57974 1568478 1549442 1529053 1507619 1488024 1470686 1453041 1433980 1414553 1394358 1371758 1347968
57963 1347968 1326757 1309530 1294466 1280645 1269067 1259185 1248402 1235849 1223294 1211700 1199933
57952 1199933 1187358 1174889 1163238 1152634 1144028 1137825 1131930 1123950 1114791 1107093 1100920 1094275 1087159
57939 1087159 1081467 1077291 1072833 1067624 1062449 1056677 1049355 1042519 1039480 1039814 1039692 1037219 1033956 1031289
57925 1031289 1029025 1027675 1028288 1029575 1028693 1025382 1022081 1019663 1016456 1011958 1008162 1006419 1005910 1005833 1006376
57910 1006376 1007174 1007508 1008336 1011394 1016004 1019309 1019691 1017536 1013107 1006629 1000100 995705 992467 987568 980825
57895 980825 974613 969583 964009 957361 950845 944216 935906 926837 920272 917021 914378 910863 908508 909077
57881I09077K124J657J263K030L558N823Q314Q947O856M569M490N331M774L303
57867I72116K204L77l367p076q266p728p494p299o389o339q391j0276r469p356
57853H85247o452n839l442n69J10p83q92n14j157j558K55K335J011l205o220o107
57837H52220m309k030L52J102j219m255m047o25K229K610K141K233K285J886J682
57822H52255J741J590J687K484K696J040j105j404m1J155J854K613K537Q62k44
57807H69720J986O542R865J0729J0629J0218Q907P385O962O852N422L644L848
57794I62709N469N665L901K408K097J518J23p84p97j108k063k605k448k426k654
57779I69005k606k716l607m213l134j166JO63J892K633J402j88P00L308M276L114
$$ plain form
57881 909077 911201 912858 914121 916151 919709 925532 933846 942793 949649 954218 958708 964039 968813 972116
57867 972116 974320 974697 971330 964254 955988 948260 940766 933467 927078 920739 912348 902072 892603 885247
57853 885247 878795 872956 869514 868945 869055 868272 867380 866866 865709 864151 864406 866741 867752 864547 858327 852220
57837 852220 847911 845881 846233 847335 846116 841861 837814 837189 839418 842028 844169 846402 848687 850573 852255
57822 852255 853996 855586 857273 859757 862453 863493 862388 860984 860943 862098 863952 866565 869102 869964 869720
57807 869720 871706 878248 888113 898842 909471 919689 928596 935981 942943 949795 955217 958861 962709
57794 962709 968178 973843 977744 980152 982249 983767 983890 983106 982309 981201 979138 976533 974085 971659 969005
57779 969005 966399 963683 960076 955863 952729 951563 951564 952227 954119 956752 958154 957966 958666 961974 966250 969364
57763I69364K631L793M318L075J981K358K852K276J689K117K661K023J47k447
57749I98838n183p066p582p877r081r996q748o168m723m636m135l248l928o216
57735I10251p642p024n723m613k867n16Q16O69O03J503K448K977L969N528O340
57720I06719N827M800L699K336J457J965K613J335j000j237J148K959J883p84
57706I33720k864l836l716k428j347k618n606o694m042l5K307K878L043L057K749
57691I14568K851L925N361O623Q015R428R912R293Q578Q157P293N921N035M881
57677A009841M726M701N664O926O638M959M165M972N518M931M868O232P107N845
57663A087093L779L033L535L916L673K843J138j201k991l638l738l569k666j473
$$ plain form
57763 969364 971995 975788 980106 983181 985162 987520 990372 992648 994337 996454 999115 1001138 1001285 998838
57749 998838 993655 986589 979007 971130 962049 952053 943305 937137 932414 927778 923643 920395 916467 910251
57735 910251 902609 895585 889862 885249 882382 881866 882682 883351 883954 885457 887905 890882 894851 900379 906719
57720 906719 912546 917346 921045 923381 924838 926803 929416 930751 929751 928514 929662 932621 934504 933720
57706 933720 930856 927020 923304 920876 919529 916911 911305 904611 900569 900534 902841 905719 908762 911819 914568
57691 914568 917419 921344 926705 933328 941343 950771 960683 969976 978554 986711 994004 999925 1004960 1009841
57677 1009841 1014567 1019268 1024932 1031858 1038496 1043455 1047620 1052592 1058110 1063041 1067909 1074141 1081248 1087093
57663 1087093 1090872 1093905 1097440 1101356 1105029 1107872 1109010 1107809 1104818 1101180 1097442 1093873 1091207 1089734
57649A089734j299j954j654j20O72j60q68j90N39J37P6K161N528P877Q253P105
57633A115837N144L556L742N274N809M307K667K785L901M524N065O611Q612R840
57619A187674J0481J1488J2927J4522J6754J9955K3506K7220L2236L9066M6112
57608A441941N1684N6056N9676O0347N4224L9396J7447p638l0888m7848n6600
57597A637797n8474n6196n1724m6081m0007l3926k8086k3158j9769j7269j4397
57586A248710j1275r044p468n089k172p90j209r56J098K536J241j133j854j102
57572A211493p47q99m05N02O22L7l45o40j349j654m43J638K985L239K915J727
57556A218676p07l137l680k295n83N58J549K762M036N288O330O459N398M107L527
$$ plain form
57649 1089734 1088435 1086481 1084827 1084707 1085379 1085219 1084351 1084161 1084700 1084837 1084913 1087074 1092602 1100479 1108732 1115837
57633 1115837 1120981 1124537 1128279 1133553 1139362 1143669 1146336 1149121 1153022 1157546 1162611 1169222 1177834 1187674
57619 1187674 1198155 1209643 1222570 1237092 1253846 1273801 1297307 1324527 1356763 1395829 1441941
57608 1441941 1493625 1549681 1609357 1669704 1723928 1763324 1780771 1773133 1742245 1694397 1637797
57597 1637797 1579323 1523127 1471403 1425322 1385315 1351389 1323303 1300145 1280376 1263107 1248710
57586 1248710 1237435 1228391 1220923 1215834 1213662 1212872 1211663 1210707 1211805 1214341 1215582 1214449 1212595 1211493
57572 1211493 1210746 1209847 1209442 1209944 1210566 1210603 1210258 1209618 1208269 1206615 1206172 1207810 1210795 1214034 1216949 1218676
57556 1218676 1217969 1214832 1211152 1208857 1208274 1208832 1210381 1213143 1217179 1222467 1228797 1235256 1240654 1244761 1248288
57541A248288L161K084N77m45r73j484j688j109l46k41k89O56K332L156K344R02
57525A256925M01J516L620N305N447M211K709J678J141J235K190L307L449K875
57511A296009L084M302M889L895K504J967J968K112L071M907N994N366M577N486
57497A350131P425Q346P673O412N396M937N358O491P431P759P990Q218P835P379
57483A448781Q584J1359J2971J1855J0024R765J0256R827R271R977J0635R128
57471A572433O487N560O535O977O062N610O856Q946J0840J2378J3174J2648J1462
57458A685968J1108J1827J2499J2489J2103J1477J0629J0295J1088J2160J2215
57447A813858J1319J0337R330Q260Q246J0034J1996J1981J0502R724R906R504
$$ plain form
57541 1248288 1251449 1253533 1254110 1253665 1252692 1251208 1249520 1248411 1248065 1247824 1247535 1248191 1250523 1253679 1256023 1256925
57525 1256925 1257326 1258842 1262462 1267767 1273214 1277425 1280134 1281812 1282953 1284188 1286378 1289685 1293134 1296009
57511 1296009 1299093 1303395 1308284 1312179 1314683 1316650 1318618 1320730 1323801 1328708 1334702 1340068 1344645 1350131
57497 1350131 1357556 1365902 1373575 1379987 1385383 1390320 1395678 1402169 1409600 1417359 1425349 1433567 1441402 1448781
57483 1448781 1457365 1468724 1481695 1493550 1503574 1513339 1523595 1533422 1542693 1552670 1563305 1572433
57471 1572433 1578920 1584480 1591015 1597992 1604054 1609664 1616520 1625466 1636306 1648684 1661858 1674506 1685968
57458 1685968 1697076 1708903 1721402 1733891 1745994 1757471 1768100 1778395 1789483 1801643 1813858
57447 1813858 1825177 1835514 1844844 1853104 1861350 1871384 1883380 1895361 1905863 1915587 1925493 1934997
57435A934997Q522Q784J0567J1683J0772R302R185J0120J0410R335P883P688R458
57422B058706J2103J3706J3780J3611J3881J3471J1926J1185J2809J5082J5376
57411B205636J4146J3741J4305J4058J3044J3245J4921J6015J5538J4682J4176
57400B363507J3357J2486J3101J5213J6734J6608J6195J6583J6955J6699J6825
57389B534263J7972J8929J8547J7484J6878J6719J6735J7418J9110K1080K2512
57378B737647K3338K3604K3096K2179K1745K1883K1779K1281K1224K1803K2057
57367B981636K1446K0593K0023J9522J9163J9650K1180K3105K4905K6265K6306
57356C223794K4353K1643K0629K2241K5180K7884K9605K9735K8098K6073K5464
$$ plain form
57435 1934997 1943519 1952303 1962870 1974553 1985325 1994627 2003812 2013932 2024342 2033677 2041560 2049248 2058706
57422 2058706 2070809 2084515 2098295 2111906 2125787 2139258 2151184 2162369 2175178 2190260 2205636
57411 2205636 2219782 2233523 2247828 2261886 2274930 2288175 2303096 2319111 2334649 2349331 2363507
57400 2363507 2376864 2389350 2402451 2417664 2434398 2451006 2467201 2483784 2500739 2517438 2534263
57389 2534263 2552235 2571164 2589711 2607195 2624073 2640792 2657527 2674945 2694055 2715135 2737647
57378 2737647 2760985 2784589 2807685 2829864 2851609 2873492 2895271 2916552 2937776 2959579 2981636
57367 2981636 3003082 3023675 3043698 3063220 3082383 3102033 3123213 3146318 3171223 3197488 3223794
57356 3223794 3248147 3269790 3290419 3312660 3337840 3365724 3395329 3425064 3453162 3479235 3504699
57345C504699K6036K6167K5793K6302K7419K7052K4985K3828K5160K7407K8839
57334C793687L0102L1952L3003L1942L0143K9822L0976L2137L2931L3929L4939
57323D145563L5303L5233L5247L5003L4025L2929L2685L3295L4276L5522L6686
57312D525767L6729L5346L3908L3725L4193L3993L3254L3196L4142L5231L5742
57301D905226L5637L5166L4821L5214L6227L6891L6781L6778L7525L8110L7408
57290E305784L6040L5643L6501L7250L6912L6109L5964L6578L7093L7064L7282
57279E708220L8727M0832M1667M0478L9101L9655M1557M2535M2059M1650M1793
57268F158274M1114L9320L8508M0025M2032M1902L9780L7877L7327L7541L8016
$$ plain form
57345 3504699 3530735 3556902 3582695 3608997 3636416 3663468 3688453 3712281 3737441 3764848 3793687
57334 3793687 3823789 3855741 3888744 3920686 3950829 3980651 4011627 4043764 4076695 4110624 4145563
57323 4145563 4180866 4216099 4251346 4286349 4320374 4353303 4385988 4419283 4453559 4489081 4525767
57312 4525767 4562496 4597842 4631750 4665475 4699668 4733661 4766915 4800111 4834253 4869484 4905226
57301 4905226 4940863 4976029 5010850 5046064 5082291 5119182 5155963 5192741 5230266 5268376 5305784
57290 5305784 5341824 5377467 5413968 5451218 5488130 5524239 5560203 5596781 5633874 5670938 5708220
57279 5708220 5746947 5787779 5829446 5869924 5909025 5948680 5990237 6032772 6074831 6116481 6158274
57268 6158274 6199388 6238708 6277216 6317241 6359273 6401175 6440955 6478832 6516159 6553700 6591716
57257F591716L8931M0043M0474L9823L8609L7490L6639L5887L5078L4317L3936
57246G002943L3950L3757L3007L2556L3415L4715L4189L1222K8060K7144K8326
57235G353284K9649L0023L0035L0636L1947L3329L4179L4816L6425L9618M3362
57224G727303M6080M7550M8548M8929M7685M4949M2148L9721L6425L1636K6691
57213H187665K3019K0291J7572J5187J4266J5212J7536K0720K4529K8891L3757
57202H418645L8676M2631M5156M7250M9963N2286N2117M9289M5851M3132M0366
57191H925362L6545L1765K6164J9562J2816P737M749K365k26j647k15M106J0072
57178I079155J5882J9395J9876J9983K3596L1136L9479M7061N5684O6111P5579
$$ plain form
57257 6591716 6630647 6670690 6711164 6750987 6789596 6827086 6863725 6899612 6934690 6969007 7002943
57246 7002943 7036893 7070650 7103657 7136213 7169628 7204343 7238532 7269754 7297814 7324958 7353284
57235 7353284 7382933 7412956 7442991 7473627 7505574 7538903 7573082 7607898 7644323 7683941 7727303
57224 7727303 7773383 7820933 7869481 7918410 7966095 8011044 8053192 8092913 8129338 8160974 8187665
57213 8187665 8210684 8230975 8248547 8263734 8278000 8293212 8310748 8331468 8355997 8384888 8418645
57202 8418645 8457321 8499952 8545108 8592358 8642321 8694607 8746724 8796013 8841864 8884996 8925362
57191 8925362 8961907 8993672 9019836 9039398 9052214 9059951 9064700 9067065 9066839 9065192 9064977 9069083 9079155
57178 9079155 9095037 9114432 9134308 9154291 9177887 9209023 9248502 9295563 9351247 9417358 9492937
57167I492937Q2067Q7823R5692J04524J11449J16571J21935J27276J30488J31606
57157A0602368J33060J36042J39090J40222J38300J32630J23427J12832J03694
57148A1761665R7228R2834Q9524Q6172Q1359P4706O7683O1505N5040M6492L6202
57137A2550410K5856J5717M776o814j7702k7749l8554n1531o6870q4370j03772
57126A2199397j24084j43897j62668j80981j99427k17720k34599k48235k57354
57117A0430432k62205k63660k61181k53023k38741k19802j97188j70328j39438
57108H424866j06956p5234m4722j5841R041K7311L8392M3027M2163L8044L4274
57097H414365L2604L1186K7959K4005K1400J9598J6504J1846O956K330k124n352
$$ plain form
57167 9492937 9575004 9662827 9758519 9863043 9974492 10091063 10212998 10340274 10470762 10602368
57157 10602368 10735428 10871470 11010560 11150782 11289082 11421712 11545139 11657971 11761665
57148 11761665 11858893 11951727 12041251 12127423 12208782 12283488 12351171 12412676 12467716 12514208 12550410
57137 12550410 12576266 12591983 12596759 12589945 12572243 12544494 12505940 12454409 12387539 12303169 12199397
57126 12199397 12075313 11931416 11768748 11587767 11388340 11170620 10936021 10687786 10430432
57117 10430432 10168227 9904567 9643386 9390363 9151622 8931820 8734632 8564304 8424866
57108 8424866 8317910 8242676 8197954 8182113 8191154 8218465 8256857 8299884 8342047 8380091 8414365
57097 8414365 8446969 8478155 8506114 8530119 8551519 8571117 8587621 8599467 8606423 8608753 8606629 8601277
57085H601277o109n026l799k981k273k038k761l936n024o458q444j0176j1471
57072H530781j3352j5595j5829j2697p858l338M08J838l580k0135m8938q9854
57060H301851j43159k06884k76056l47494m22458n02008n83599o65342p49513
57051D405338q37843r27484j015995E17766f83375j296064j379858j438269j451552
57042f249118j394629j247159j001088o54474k04028L50898J005343J758504K619561
57033e016190a421068C258167N865024P153811Q538669R990637J1471386J2920593
57025E9198287J4172539J4892156J4676490J3289760J0804083P509434L738417
57018A38281166j73497l807957o674647q399472q924666q524018p635043o663511
$$ plain form
57085 8601277 8595168 8590142 8586343 8583362 8581089 8579051 8576290 8572354 8567330 8560872 8552428 8542252 8530781
57072 8530781 8517429 8501834 8486005 8473308 8465450 8462112 8462520 8464358 8460778 8440643 8391705 8301851
57060 8301851 8158692 7951808 7675752 7328258 6905800 6403792 5820193 5154851 4405338
57051 4405338 3567495 2640011 1624016 517766 -683375 -1979439 -3359297 -4797566 -6249118
57042 -6249118 -7643747 -8890906 -9891994 -10546468 -10750496 -10399598 -9394255 -7635751 -5016190
57033 -5016190 -1421068 3258167 9123191 16277002 24815671 34806308 46277694 59198287
57025 59198287 73370826 88262982 102939472 116229232 127033315 134542749 138281166
57018 138281166 138107669 134299712 127625065 119225593 110300927 101776909 94141866 87478355
57010H7478355n878409n401645n244097n348748n621062n944981o198404o277931
57002D1563078o123566n728954n135542m416456l653877k916788k250472j679749
56994I657674j214785q52287n78023l74638k27623j24267n1755N6L6098N8788
56984F329238P1529P8149Q1281Q3037Q5303Q8072Q9801R0886R4464J02334J12351
56973G306445J21405J28932J36018J43049J49989J57524J66558J77214J87797
56964H674931J92551J81300J46037R0323K9692j9288m8977o0152n6372m2061k3052
56953I064932m672J0794K3229L2550L9023M4104M8767N2132N3400N3813N4877
56942I472949N6007N5996N5568N6232N7498N7613N6585N6185N7086N8052N8113
$$ plain form
57010 87478355 81599946 76198301 70954204 65605456 59984394 54039413 47841009 41563078
57002 41563078 35439512 29710558 24575016 20158560 16504683 13587895 11337423 9657674
56994 9657674 8442889 7590602 7012579 6637941 6410318 6286051 6234296 6234352 6270450 6329238
56984 6329238 6400767 6478916 6560197 6643234 6728537 6816609 6906410 6997296 7091760 7194094 7306445
56973 7306445 7427850 7556782 7692800 7835849 7985838 8143362 8309920 8487134 8674931
56964 8674931 8867482 9048782 9194819 9285142 9314834 9295546 9246569 9186417 9130045 9087984 9064932
56953 9064932 9060260 9071054 9094283 9126833 9165856 9209960 9258727 9310859 9364259 9418072 9472949
56942 9472949 9528956 9584952 9640520 9696752 9754250 9811863 9868448 9924633 9981719 10039771 10097884
56931A0097884N7678N7109N5888N3807N1732N0387M9169M6939M3417L9272L5153
56920A0638435L1102K6942K2998K0331K0251K3375K9050L5660M1723M6818N1384
56909A0988069N5449N7901N7693N5568N3509N2170N0020M5778M0462L5863L2047
56898A1524529K7945K3618J9877J5817Q676l168j8245l3336m5809n4577o0090
56887A1405237o3925o7661p1768p5926p9895q3194q4570q3188q0070p6882p3526
56876A0564632o8610o2177n6188n1930m8882m6735m7042n1986o2577p8461r8176
56865I891868j19021j37888j52944j63826j70264j71924j69729j65643j60639
56856H479990j54456j47714j42319j38851j35574j31378j27961j27357j28677
$$ plain form
56931 10097884 10155562 10212671 10268559 10322366 10374098 10424485 10473654 10520593 10564010 10603282 10638435
56920 10638435 10669537 10696479 10719477 10739808 10760059 10783434 10812484 10848144 10889867 10936685 10988069
56909 10988069 11043518 11101419 11159112 11214680 11268189 11320359 11370379 11416157 11456619 11492482 11524529
56898 11524529 11552474 11576092 11595969 11611786 11620462 11617294 11599049 11565713 11519904 11465327 11405237
56887 11405237 11341312 11273651 11201883 11125957 11046062 10962868 10878298 10795110 10715040 10638158 10564632
56876 10564632 10496022 10433845 10377657 10325727 10276845 10230110 10183068 10131082 10068505 9990044 9891868
56865 9891868 9772847 9634959 9482015 9318189 9147925 8976001 8806272 8640629 8479990
56856 8479990 8325534 8177820 8035501 7896650 7761076 7629698 7501737 7374380 7245703
56847G245703j29151j27517j24557j20952j16453j11013j05077r8771r2028q5527
56837F134657q0215p5858p1177o5777o0909n8039n7365n8110n9453o0609o0590
56826E426555n8788n5932n3931n4364n7109o0687o3787o6165o8127o9774p0957
56815D746934p1467p0816o8531o5215o2627o1804o1649o0388n7888n5243n2604
56804D058702m9061m4720m0975l8182l4796k9820k4960k3309k6701l5083m7264
56793C663831o0981p2867p9940q1449p8841p4143o8701o2931n6565m9468m2628
56782B935317l7825l5624l4227l1153k5719j8994j1599k787P847J8510K5611K5718
56770B815075J7039j44k3353m8140o9522q4306r2288r5010r3608q8448q0539p2107
$$ plain form
56847 7245703 7116552 6989035 6864478 6743526 6627073 6516060 6410983 6312212 6220184 6134657
56837 6134657 6054442 5978584 5907407 5841630 5780721 5722682 5665317 5607207 5547754 5487145 5426555
56826 5426555 5367767 5311835 5257904 5203540 5146431 5085744 5021957 4955792 4887665 4817891 4746934
56815 4746934 4675467 4604651 4536120 4470905 4408278 4346474 4284825 4224437 4166549 4111306 4058702
56804 4058702 4009641 3964921 3923946 3885764 3850968 3821148 3796188 3772879 3746178 3711095 3663831
56793 3663831 3602850 3529983 3450043 3368594 3289753 3215610 3146909 3083978 3027413 2977945 2935317
56782 2935317 2897492 2861868 2827641 2796488 2770769 2751775 2740176 2737389 2745236 2763746 2789357 2815075
56770 2815075 2832114 2831970 2808617 2760477 2690955 2606649 2514361 2419351 2325743 2237295 2156756 2084649
56758B084649o4978n9026n2944m6207l9502l3316k6997j9559j1118l112L090P628
56746A738608J1552J4292J2465K656j4457l3986n1008o3453p0837p2670o9749
56735A403413o5127o1347n7748n2432m6017m0963l7720l4175k9073k3557j8800
56724I36454j4241r109l883O59M278O141M277k490j2756k3535l2485l8719m2280
56711G72311m3704m3698m2783m1237l9239l6566l2735k8129k4481k2990k2481
56700C94268k0959j8602j7370j7756j8037j7094j5888j5399j4964j3765j2282
56689B12152j1115r785p958o775p550r830j1785j1961j0198p584o044o900r115
56676I5552r990q316n800m625m760m686l843l082l186l975m711m834m501m511
$$ plain form
56758 2084649 2019671 1960645 1907701 1861494 1821992 1788676 1761679 1742120 1731002 1727890 1730980 1738608
56746 1738608 1750160 1764452 1776917 1779573 1765116 1731130 1680122 1616669 1545832 1473162 1403413
56735 1403413 1338286 1276939 1219191 1166759 1120742 1079779 1042059 1007884 978811 955254 936454
56724 936454 922213 913104 909221 909880 914158 920299 924576 922086 909330 885795 853310 814591 772311
56711 772311 728607 684909 642126 600889 561650 525084 492349 464220 439739 416749 394268
56700 394268 373309 354707 337337 319581 301544 284450 268562 253163 238199 224434 212152
56689 212152 201037 191252 183294 176519 168969 159139 147354 135393 125195 117611 111567 104667 95552
56676 95552 85562 77246 71446 66821 62061 57375 53532 50450 47264 43289 38578 33744 29243 24732
56662B4732n218n619m437k054j85M40O00P49K93p59j266q76p45j429j812A141
56645a4k508l951l613k024j088j140j003l46m3l51m42J74J054J707K053K075J833
56628g627J519Q98o84k885l770j982J076K635J857M26m8K05R3p53j778k131j243
56611a4192O86K569L120J885m48k475k957j924r39j601l513m711m306l496l410
56596c5712l344k195n25K23j67o81p09m80j98J63M41N47Q83J681K271J809M42
56579c5551q96j479j057K76J793K356J677P58M19J88n43j182p79M66J594K148
56563b9812K120J401L37P0R89J596L17j974k850j523L16R53O46Q72K415M563N676
56546a3888M625K027k17r34p16n76n67m41o00j324j801j250k87K2o4N55K004L371
$$ plain form
56662 24732 19514 13895 9458 7404 7219 7659 8259 9008 9301 8542 7276 6400 5655 4226 2414 1141
56645 -14 -2522 -6473 -10086 -12110 -13198 -14338 -15341 -15687 -15730 -16081 -16523 -16349 -15295 -13588 -11535 -9460 -7627
56628 -7627 -6108 -5210 -5894 -8779 -12549 -14531 -13455 -10820 -8963 -8537 -8585 -8380 -8287 -9040 -10818 -12949 -14192
56611 -14192 -13506 -10937 -7817 -5932 -6380 -8855 -11812 -13736 -14675 -16276 -19789 -24500 -28806 -32302 -35712
56596 -35712 -39056 -41251 -41776 -41553 -41720 -42401 -43110 -43590 -43788 -43625 -43184 -42637 -41754 -40073 -37802 -35993 -35551
56579 -35551 -36447 -37926 -38983 -38707 -36914 -34558 -32881 -32123 -31704 -31516 -32059 -33241 -34020 -33554 -31960 -29812
56563 -29812 -27692 -26291 -25954 -25884 -24895 -23299 -22982 -24956 -27806 -29329 -29013 -28060 -27414 -26542 -24127 -19564 -13888
56546 -13888 -9263 -7236 -7453 -8387 -9103 -9679 -10246 -10687 -11287 -12611 -14412 -15662 -15949 -15927 -15991 -15436 -13432 -10061
56528a0061M145a447B845L353J821J55j310j888o47J908L334K035l06q63N64J868
56512A2869K166K579L671M479M517M607N147N406N226N643P144Q959J0713J2955
56498I6081J5140J5060J1723P284M466L258J870n8j345j783k521l685l694j843
56484A39953N4j30j948l158k882k358k534k623j793q99j270k621l655m156m906
56469A05074n710n341l802k827l398m231l709k145j023r08j247j433j084N4J563
56454F9833K355K058J635J831J959J223K56M1P5r22k911m442m443l110j320LL27
56437F4448J16M64J450J744N96q61j359j329j691j891q99P33J598J611J665J719
56421F8114J150N31J060K427L174L102L308L772L057Q07j370k214k269k276j744
$$ plain form
56528 -10061 -5916 -1447 2845 6198 8019 8174 6864 4976 4329 6237 9571 11606 11300 10437 11001 12869
56512 12869 15035 17614 21285 25764 30281 34888 40035 45441 50667 56310 63454 72413 83126 96081
56498 96081 111221 126281 138004 145288 149754 153012 154882 154824 153479 151696 149175 145490 141796 139953
56484 139953 140007 139877 137929 134771 131889 129531 126997 124374 122581 121682 120412 117791 114136 109980 105074
56469 105074 99364 94023 90221 87394 83996 79765 76056 73911 72888 71980 70733 69300 68216 68270 69833
56454 69833 72188 74246 75881 77712 79671 80894 81150 81191 81266 80344 77433 72991 68548 65438 64118 64121 64448
56437 64448 64564 65028 66478 68222 68818 67957 66598 65269 63578 61687 60788 61521 63119 64730 66395 68114
56421 68114 69264 69795 70855 73282 76456 79558 82866 86638 89695 90502 89132 86918 84649 82373 80629
56406H0629j81J419J662O85o9K27Q77P76k0k26J045K880L490K345O09o42j387
56389I4119j647j026J00N43L94J384L898N487M155J365l63j126k331l245k107
56374I9600J69Q39k91p08M41J064l2j174r02l52r90k166k488k000j384m23J321
56357I0524L253M397M575M165L482K889K697K521J688N70M39J559K640K603J844
56342A29846J210Q56N39K79K11M26J121K226K997K848K369K602L442L893L538
56327A58403K600J041j033k400j832J4J399J969K662L458L173J774Q49J323K281
56312A75681K568K195J748J672K327L617M556M282L288K482J688M67m22k99l26
56297B05524j650k668r83K446M184L297K192K361K611K116J894K202J694M75Q65
$$ plain form
56406 80629 80448 81867 83529 84214 84145 84372 85249 86025 86005 85779 86824 89704 93194 95539 96148 95506 94119
56389 94119 92472 91446 91546 92089 92483 93867 97765 103252 107407 108772 108409 107283 104952 101707 99600
56374 99600 99769 100608 100317 99609 100050 101114 101082 99908 99006 98654 97664 95498 93010 91010 89626 89203 90524
56357 90524 93777 98174 102749 106914 110396 113285 115982 118503 120191 120761 121200 122759 125399 128002 129846
56342 129846 131056 131912 132451 132730 132941 133367 134488 136714 139711 142559 144928 147530 150972 154865 158403
56327 158403 161003 162044 161011 158611 156779 156793 158192 160161 162823 166281 169454 171228 172077 173400 175681
56312 175681 178249 180444 182192 183864 186191 189808 194364 198646 201934 204416 206104 206571 206149 205850 205524
56297 205524 203874 201206 200223 202669 206853 210150 212342 214703 217314 219430 221324 223526 225220 225695 226560
56282B26560L524N678N032K993K073K450L003L613M407M577L915L806M900N499
56268B82030M197K462K505L991N004N113N325N779N531M370L180K720K991L632
56254C38830M141M067L511K922K346J708J743L239N386O515O606P205Q637R529
56240D06385R625J0571J2897J4628J4256J3086J2971J3599J3685J3336J3502J4207
56228E62748J4792J5144J5667J6844J9248K2792K5744K6228K5084K5199K7492
56217G96982K9746L0209K9938L0460L1485L2495L4358L7657M1146M3511M5243
56206A183230M7394M9935N2556N5641N9371O3295O7619P3261Q0020Q6628R3291
56195A912241J01882J12767J23795J33507J42925J53110J63404J73241J83125
$$ plain form
56282 226560 230084 235762 240794 243787 245860 248310 251313 254926 259333 263910 267825 271631 276531 282030
56268 282030 286227 288689 291194 295185 300189 305302 310627 316406 321937 326307 329487 332207 335198 338830
56254 338830 342971 347038 350549 353471 355817 357525 359268 362507 367893 374408 381014 388219 396856 406385
56240 406385 416010 426581 439478 454106 468362 481448 494419 508018 521703 535039 548541 562748
56228 562748 577540 592684 608351 625195 644443 667235 692979 719207 744291 769490 796982
56217 796982 826728 856937 886875 917335 948820 981315 1015673 1053330 1094476 1137987 1183230
56206 1183230 1230624 1280559 1333115 1388756 1448127 1511422 1579041 1652302 1732322 1818950 1912241
56195 1912241 2014123 2126890 2250685 2384192 2527117 2680227 2843631 3016872 3199997
56186C199997J92463J98961K01606K01654J99417J92838J80731J64547J45302
56177D877516J21793R3757O3698L3499K268l0177o0891q7499j11261j33655j52714
56166D616334j65944j74257j79947j83045j82789j80376j77145j72162j64639
56157C036030j56649j50181j43641j34563j23976j14789j07543j00845r4406q8566
56147A820871q2509p5829p0157o6358o2120n5351m7941m2916l9950l6975l4140
56136A206625l2456l0440k6074k0682j7243j6011j5203j4447j4214j3437j1285
56125I95133r609j0064j0558q416n257m471n542n288l404k164j612K45L107M705
56111I36805N083O310Q264Q930Q538R354J1526J3132J4098J6067J8623J9674J9507
$$ plain form
56186 3199997 3392460 3591421 3793027 3994681 4194098 4386936 4567667 4732214 4877516
56177 4877516 4999309 5093066 5156764 5190263 5192531 5162354 5101463 5013964 4902703 4769048 4616334
56166 4616334 4450390 4276133 4096186 3913141 3730352 3549976 3372831 3200669 3036030
56157 3036030 2879381 2729200 2585559 2450996 2327020 2212231 2104688 2003843 1909437 1820871
56147 1820871 1738362 1662533 1592376 1526018 1463898 1408547 1360606 1317690 1277740 1240765 1206625
56136 1206625 1174169 1143729 1117655 1096973 1079730 1063719 1048516 1034069 1019855 1006418 995133
56125 995133 985524 975460 964902 956486 951229 946758 941216 935928 932524 930360 928748 928993 932100 936805
56111 936805 941888 948198 956462 965392 973930 983284 994810 1007942 1022040 1038107 1056730 1076404 1095911
56098A095911K0516K3009K5207K7250L1014L5801L8345L7768L6888L8052M1131
56087A450892M5984N3366O2604P1598P9815Q8701R8750J08651J17252J23839J26721
56076B428173J24082J15957J03461Q7469P0544N7938N2745N1483M8288M2032L5242
56065C217414K7863J7372M337p356j5818k2368k7994l3299m1243n4735p1367q5627
56053B907179r6280j06365j15693j19243j14414j04725r4508q4405p3819o3658
56043A934069n4614m5988l7903l1760k7541k3412j8582j3891r498n052j781j133
56031A662914j590l25K478M557N922Q266J0897J1825J2098J4324J7399J7850J6068
56018A782683J6014J8723K1280K2310K3283K4319K4006K3659K6224L0499L1920
$$ plain form
56098 1095911 1116427 1139436 1164643 1191893 1222907 1258708 1297053 1334821 1371709 1409761 1450892
56087 1450892 1496876 1550242 1612846 1684444 1764259 1852960 1951710 2060361 2177613 2301452 2428173
56076 2428173 2552255 2668212 2771673 2859142 2929686 2987624 3040369 3091852 3140140 3182172 3217414
56065 3217414 3245277 3262649 3266986 3259630 3243812 3221444 3193450 3160151 3118908 3064173 2992806 2907179
56053 2907179 2810899 2704534 2588841 2469598 2355184 2250459 2155951 2071546 1997727 1934069
56043 1934069 1879455 1833467 1795564 1763804 1736263 1712851 1694269 1680378 1670880 1665828 1664047 1662914
56031 1662914 1661324 1660999 1663477 1668034 1673956 1682222 1693119 1704944 1717042 1731366 1748765 1766615 1782683
56018 1782683 1798697 1817420 1838700 1861010 1884293 1908612 1932618 1956277 1982501 2013000 2044920
56007B044920K9742K8057K9019L0440L0894L1779L3311L3657L2987L3553L5108
55996B393467L5129L3865L4056L5596L5958L5785L8126M2096M3700M3204M4996
55985B815978M9537N2378N2187N2792N5819N8197N8670O0150O3717O6590O8006
55974C454021P1044P6838Q2719Q7421R2404R7126R9219J00070J03752J09714J13267
55963D487595J13877J16073J21554J27636J33867J42525J52093J58171J61371
55954E714762J66484J73775J79644J85670J97478K14474K30476K44633K61369
55945G568765K79620K93637L05115L22253L45553L67030L85234M08012M38139
55936A0713358M69591N01037N39551N87695O40231O96728P63261Q38179R10681
$$ plain form
56007 2044920 2074662 2102719 2131738 2162178 2193072 2224851 2258162 2291819 2324806 2358359 2393467
55996 2393467 2428596 2462461 2496517 2532113 2568071 2603856 2641982 2684078 2727778 2770982 2815978
55985 2815978 2865515 2917893 2970080 3022872 3078691 3136888 3195558 3255708 3319425 3386015 3454021
55974 3454021 3525065 3601903 3684622 3772043 3864447 3961573 4060792 4160862 4264614 4374328 4487595
55963 4487595 4601472 4717545 4839099 4966735 5100602 5243127 5395220 5553391 5714762
55954 5714762 5881246 6055021 6234665 6420335 6617813 6832287 7062763 7307396 7568765
55945 7568765 7848385 8142022 8447137 8769390 9114943 9481973 9867207 10275219 10713358
55936 10713358 11182949 11683986 12223537 12811232 13451463 14148191 14911452 15749631 16660312
55927A6660312R77364J045485J116337J181028J236518J289746J342416J389516
55919B6238722J436834J500522J583840J673750J765607J870037J989921K114345
55911D0173578K243228K393813K573740K772175K986614L232493L517253L833688
55903F3726582M189261M611577N114951N696380O375741P200809Q200705R380588
55895A14496594J0776952J2462777J4474993J6790918J9387367K2241463K5255917
55888B35886981K8290530L1248563L3825472L4920461L2557309K5025768J2514802
55881D34269886k444112j6355619k6694195l2736336l5045133l4604523l2374287
55874B54015681k9185987k5674390k2238829j9108799j6416236j4189999j2356715
$$ plain form
55927 16660312 17637676 18683161 19799498 20980526 22217044 23506790 24849206 26238722
55919 26238722 27675556 29176078 30759918 32433668 34199275 36069312 38059233 40173578
55911 40173578 42416806 44810619 47384359 50156534 53143148 56375641 59892894 63726582
55903 63726582 67915843 72527420 77642371 83338751 89714492 96915301 105116006 114496594
55895 114496594 125273546 137736323 152211316 169002234 188389601 210631064 235886981
55888 235886981 264177511 295426074 329251546 364172007 396729316 421755084 434269886
55881 434269886 431825774 415470155 388775960 356039624 320994491 286389968 254015681
55874 254015681 224829694 199155304 176916475 157807676 141391440 127201441 114844726
55867A14844726j0815522r503453q381099p403575o538935n785061n140879m582648
55859E6693554m086489l649824l272610k939722k639037k376925k159561j975963
55851C3593423j812986j670671j550461j443793j343963j254954j178376j105534
55843B2232685j031453r63180r05475q51636p96684p46479p05651o68971o32322
55834A4930834o00126n74583n49454n21466m96281m76275m54282m26397l99448
55825A0432522l78563l58464l34502l11513k94172k78796k62304k49692k44718
55816G719798k42028k35899k28607k23335k16944k06786j96850j90368j83618
55807E795363j73433j63507j57103j50784j41702j34072j31878j31614j28441
$$ plain form
55867 114844726 104029204 94525751 86144652 78741077 72202142 66417081 61276202 56693554
55859 56693554 52607065 48957241 45684631 42744909 40105872 37728947 35569386 33593423
55851 33593423 31780437 30109766 28559305 27115512 25771549 24516595 23338219 22232685
55843 22232685 21201232 20238052 19332577 18480941 17684257 16937778 16232127 15563156 14930834
55834 14930834 14330708 13756125 13206671 12685205 12188924 11712649 11258367 10831970 10432522
55825 10432522 10053959 9695495 9360993 9049480 8755308 8476512 8214208 7964516 7719798
55816 7719798 7477770 7241871 7013264 6789929 6572985 6366199 6169349 5978981 5795363
55807 5795363 5621930 5458423 5301320 5150536 5008834 4874762 4742884 4611270 4482829
55798D482829j23626j19954j15687j08778j01678r6743r2202q7177q4927q6631
55788C465426q7974q6344q5207q6809q7035q2704p7571p5700p4771p1405o7394
55777B582512o5191o2671n7941n4174n4214n5149n3475n0750m9250m7095m2871
55766A989731m0028m1061m2140l9195l4936l4076l5683l5929l4743l4082l2962
55755A584896k9644k5891k4181k3501k2182k1582k2684k2533j8686j3789j1335
55744A348888j0159p660m994m398m522l126j616k488n095p933j1954j7612k1972
55731A245359k3002k3333k5439k6758k4334k0584j9339j9494j7983j6046j6710
55720A012337j8577j7983j5445j4383j4931j4374j2438j1019r539n679k44K960
$$ plain form
55798 4482829 4359203 4239249 4123562 4014784 3913106 3816363 3724161 3636984 3552057 3465426
55788 3465426 3377452 3291108 3205901 3119092 3032057 2949353 2871782 2796082 2721311 2649906 2582512
55777 2582512 2517321 2454650 2396709 2342535 2288321 2233172 2179697 2128947 2079697 2032602 1989731
55766 1989731 1949703 1908642 1866502 1827307 1792371 1758295 1722612 1686683 1651940 1617858 1584896
55755 1584896 1555252 1529361 1505180 1481679 1459497 1437915 1415231 1392698 1374012 1360223 1348888
55744 1348888 1338729 1331069 1326075 1321677 1317155 1314029 1312413 1309925 1304830 1296897 1284943 1267331 1245359
55731 1245359 1222357 1199024 1173585 1146827 1122493 1101909 1082570 1063076 1045093 1029047 1012337
55720 1012337 993760 975777 960332 945949 931018 916644 904206 893187 883648 877969 877725 880685
55708H80685J900k473q725j5261j9536k0527k0688k2212k3270k1458j8663j8157
55696F91615j8900j7502j4380j2998j3815j3772j1570r002p160n330l694l370
55684E60122l732l153k330l471o134p331o061m632m959o243o907o578n664m689
55670D88238m277m505m553m073m001m863n635n646n940p068p380n596l210k153
55656D19338j824p73M70Q08J036K256L386K942J775J393R96j091m396p159q848
55641D10309r499q368n779m416n873p754p162n207m851o043o495n744m868l403
55627C24847k86L098M286L463K688K380J674J341K842N216O155N580N124M789
55613C73197L264R25o44j550l026m618m815l873l151k415o71J252J935K116L115
$$ plain form
55708 880685 882585 880112 871387 856126 836590 816063 795375 773163 749893 728435 709772 691615
55696 691615 672715 655213 640833 627835 614020 600248 588678 579676 572516 567186 563492 560122
55684 560122 556390 553237 550907 547436 541302 533971 527910 523278 518319 512076 505169 498591 492927 488238
55670 488238 483961 479456 474903 470830 466829 461966 456331 450685 444745 437677 430297 424701 421491 419338
55656 419338 417514 416741 417211 418019 419055 421311 424697 427639 429414 430807 431803 430712 426316 419157 410309
55641 410309 400810 392442 386663 382247 376374 368620 361458 356251 351400 345357 338862 333118 328250 324847
55627 324847 324561 327659 331945 335408 338096 340476 342150 343491 346333 351549 357704 363284 368408 373197
55613 373197 376461 377386 376742 375192 372166 367548 362733 358860 355709 353294 352623 353875 355810 357926 361041
55598C61041L761K290K11L33J874J587o91j830p07L28k39j138j297j441k021k529
55582C59532l409n760q812j0411j0233r838r651q768p548p259p217n627l324l037
55568B58638m668m969k720o01p92k000k270j908k043k603l075l420l375k557j733
55553B19904k099l242l715l466l368k916j206K92n90k460j631J956M123K691L50
55538B04623j27K82j64p39m46n70k296m029l609j454O75K319L659L730J668j273
55522B02249k818k255n78J093K100K043J211O87J251K652M203N417O027O246O843
55507B36371P859P837N798L256K207J788l67l842n714n246m965o235p174o346
55493B25227n459o352p951q234p141n643l838j871r32j436j770n73J285K539L536
$$ plain form
55598 361041 364802 367092 367303 367636 369510 371097 370406 368576 367869 368197 367958 366820 365523 364082 362061 359532
55582 359532 356123 350363 341551 331140 320907 311069 301418 292650 285102 277843 270626 264999 261675 258638
55568 258638 253970 249001 246281 245680 244888 242888 240618 238710 236667 234064 230989 227569 224194 221637 219904
55553 219904 217805 214563 210848 207382 204014 201098 199892 200184 199594 197134 195503 197459 201582 204273 204623
55538 204623 204496 204778 204614 203875 203429 202859 200563 196534 192925 191471 192146 194465 198124 201854 203522 202249
55522 202249 199431 197176 196598 197691 199791 201834 203045 203732 204983 207635 211838 217255 223282 229528 236371
55507 236371 244230 252067 257865 261121 263328 265116 264749 260907 255193 249947 244982 238747 231573 225227
55493 225227 219768 213416 205465 197231 190090 184447 180609 178738 177806 176370 174600 174027 175312 177851 181387
55478A81387M640M471K094n06o20J360K517J282j311l664m985m898l701k971m191
55463A70904o543p426n501k231o0Oj271k636l310l092k202j255j044j863l010
55448A29466l545l577l943m410l438n61K285L147K634K472K583J690J37m12J73
55433A24701L24m31q75n87o37j239j010N39J829J548L39o87j478k152k150j254
55417A16780j76N48R61P09o90k302k401j188q11j979k800j893m18L08R84K438
55401A08070L526K914J493J045J522J430J43j660l215m085l896k809j731j248
55387A01499r56l69M27J391K625L449K837J433J284K726L386J661o74j056J36
55372A19799N88k22n72N41J937J985N17j325k418k571k456k603k615j797l94P32
$$ plain form
55478 181387 186027 190498 192592 192086 191466 192826 195343 196625 195314 191650 186665 181767 178066 175095 170904
55463 170904 164361 156935 151434 149203 149143 149149 147878 145242 141932 138840 136638 135383 134339 132476 129466
55448 129466 125921 122344 118401 113991 110553 109992 112277 115424 118058 120530 123113 124803 124940 124528 124701
55433 124701 125025 124594 123719 123132 122495 121256 120246 120785 122614 124162 124501 123814 122336 120184 118034 116780
55417 116780 116604 117152 118113 118822 118132 115830 113429 112241 111430 109451 106651 104758 104340 104648 105632 108070
55401 108070 111596 114510 116003 117048 118570 120000 120143 118483 115268 111183 107287 104478 102747 101499
55387 101499 100543 100174 100601 101992 104617 108066 110903 112336 113620 116346 119732 121393 120719 119663 119799
55372 119799 120387 120165 119593 120134 122071 124056 124573 123248 120830 118259 115803 113200 110585 108788 108394 109126
55356A09126J523K596L707L800K918K454K974L339K629J420L83q43k438l551l622
55341A26415l254k924k230j190p69j121r00M87J532Q73n32r56l98pnK62R10J452
55323A17645J606J234J88j086j613j233q60r10p64l83q59k446l712l644k943k186
55307I8034n60K127L941L165Q05q83j209r32o14n23r50j314l71J369J312j493
55291A01904m235m010j781k98R1P39J297L29j400j519J86J484J345J197K143L289
55275A00761L465K751J681N12l90p19r50j670k233j487L07J665J860J357N52m53
55259A07009j085p99j68j06l28q6R8q74k537l316k890k217j383M44K776L703K589
55242A00830J073O78J048J172R35O70L98J96L65P54Q08O06Q30J553K123K303K468
$$ plain form
55356 109126 110649 113245 116952 120752 123670 126124 129098 132437 135066 136486 136869 136026 133588 130037 126415
55341 126415 123161 120237 118007 116817 116048 114927 114027 114514 116046 116919 116387 115431 115033 115026 115021 115283 116193 117645
55323 117645 119251 120485 120673 119587 117974 116741 115881 114971 114207 113824 112965 110519 106807 103163 100220 98034
55307 98034 97474 99601 103542 106707 107512 106629 105420 104488 103874 103351 102401 101087 100716 102085 103397 101904
55291 101904 97669 93659 91878 91580 91671 92410 93707 94036 92636 91117 91303 92787 94132 95329 97472 100761
55275 100761 104226 106977 108658 109170 108780 108061 107111 105441 103208 101721 102028 103693 105553 106910 107462 107009
55259 107009 105924 105125 104957 104851 104523 104437 104535 103661 101124 97808 94918 92701 91318 91762 94538 98241 100830
55242 100830 101903 102581 103629 104801 105736 106406 106804 107000 107365 108119 108927 109533 110363 111916 114039 116342 118810
55225A18810K501J776M67l79m90q75k216l755m294l525k107j133j492k835l315
55210I7138j561J145K087O86p03K7K211L774L722K375K94j879l167k909j436L30
55194A02134J574J733P69k93K3J856L582L700K445R42k90j130j051J60J269O72
55178A18095j348k748k486j894k480l469k955r12N19Mj276j557q29k32j19q2j87
55161I6044o87r72k90P49R47O00J066K317K788J880O67k26j376k518k111OJ663
55144A00547J473Q12J159J508M93q23o95K11R2p63p23Mj75r30r0K601M422L221
55126A12344J61k023k075p85L88N50p9m41J50J220J923K009J373l15k460l086
55110A08854j103J710K664J430l30j713k794k752m42L028M736L601J594O78M24
$$ plain form
55225 118810 121311 123087 123554 123175 122685 121810 119594 115839 111545 108020 105913 104780 103288 100453 97138
55210 97138 95577 96722 98809 99495 98792 98819 101030 104804 108526 110901 111195 109316 106149 103240 101804 102134
55194 102134 103708 105441 106210 105917 105940 107796 111378 115078 117523 118465 118175 117045 115994 116154 117423 118095
55178 118095 116747 113999 111513 109619 107139 103670 100715 99803 100322 100326 99050 97493 96664 96432 96313 96231 96044
55161 96044 95357 94385 94095 94844 95791 96391 97457 99774 102562 104442 105109 104883 103507 100989 98878 98884 100547
55144 100547 102020 102832 103991 105499 105992 105169 104474 104685 104777 104014 103291 103295 103120 102190 102100 104701 109123 112344
55126 112344 112505 110482 108407 107622 108010 108560 108481 108040 108190 109410 111333 113342 114715 114400 111940 108854
55110 108854 107751 109461 112125 113555 113225 111512 108718 105966 105524 108552 113288 116889 118483 119161 119585
55095A19585m17j612j893o94J362L094L382J981pj068q33p7N63R91J069O88K62
55078A26376J23j85j036j609j024o6k06j255j607o82N20J174J343J007m3j233
55062A21597j599j164o92l73n7k56j242j762o24J023J194L46N93J953K290J142
55046A22369M93J126J255r5j162m39Q91J103M96J21j73q28j225p50K4M50P69J042
55028A25467O82O6P62K926M324L420J693J215J655J576J162J432J844J021o10
55013A48635j030N32K609L382K425N22j291k371k711k540j775m75L64l52j986
54998A43938k603j636o29p19j016m17N80R14N72N9n20r01n50N5m32j820j842O09
54980A33642L436M110K845J322j48j982l139k166J84J505Q49m79r80m30N28R41
$$ plain form
55095 119585 119168 117556 115663 114969 116331 119425 122807 124788 124781 123713 122880 122803 123366 124357 125426 126114 126376
55078 126376 126499 126314 125278 123669 122645 122579 122373 121118 119511 118829 119349 120523 121866 122873 122830 121597
55062 121597 119998 118834 118142 117769 117712 117456 116214 114452 113828 114851 116045 116391 116984 118937 121227 122369
55046 122369 122862 123988 125243 125148 123986 123547 124438 125541 126037 126158 125985 125157 123932 123182 123206 123656 124425 125467
55028 125467 126149 126215 126977 129903 134227 137647 139340 140555 142210 143786 144948 146380 148224 149245 148635
55013 148635 147605 148137 150746 154128 156553 157075 155784 153413 150702 148162 146387 145912 146276 145924 143938
54998 143938 141335 139699 139070 138351 137335 136918 137498 138412 138984 139043 138523 137622 137072 137127 136695 134875 133033 133642
54980 133642 137078 141188 144033 145355 145207 143225 140086 137920 138104 139609 140458 139979 138999 138569 139097 140038
54964A40038R0j478k074j033J24j32j100j321j046j434k147j845n19N99J077J434
54948A29233J592J019K01K14R90J579J842K247K332J264k54n40N93J742K204K607
54932A48865L072K817J813J075Q26J03j371k514k612k115j248M51K544L362K253
54917A57321O76O2m9n59r29j93J058J393P49M42J088J798J622P59pl89o03p10
54899A63529m86J60R91J779K579L305L239J672p97k208j218J152K372J031j739
54884A75361l476k770n62Q36J42j405j473M73K499K746J693J155J825K892L538
54869A83474L761L913M326N272O490O985O176N014N118O743Q349Q305O486M156
54855B64568K638K013J024j373m328n793n220m435n138o673p351o825n791m356
$$ plain form
54964 140038 140128 138650 136576 135543 135667 135535 134435 133114 132068 130634 128487 126642 126123 126722 127799 129233
54948 129233 130825 131844 132045 132259 133249 134828 136670 138917 141249 142513 142259 141719 142312 144054 146258 148865
54932 148865 151937 154754 156567 157642 158468 158571 157200 154686 152074 149959 148711 149162 151706 155068 157321
54917 157321 157997 158059 158010 157451 156522 156329 157387 158780 159529 159971 161059 162857 164479 165238 165231 164842 164239 163529
54899 163529 163043 163203 164194 165973 168552 171857 175096 176768 175971 173763 172545 173697 176069 177100 175361
54884 175361 171885 169115 168553 169389 169531 168126 166653 167126 169625 172371 174064 175219 177044 179936 183474
54869 183474 187235 191148 195474 200746 207236 214221 220397 225411 230529 237272 245621 253926 260412 264568
54855 264568 267206 269219 270243 268870 264542 258749 253529 249094 243956 237283 229932 223107 217316 212960
54841B12960k428j023j256k363k612j923j654j849r49J324K970K573J388J355
54827B06513K414L103K857K430K591L505M918O173O375N365M260M340N566O724
54813B67134O797N796M345K780P61k270o079r296j0488r510p381n142l371k620
54799B31456l236m616n464n211m578m478m934n326n237m629l701k786k122j630
54785A73508j091n08O7P14J140M21j832m210m597k686l88N11K09j2M38J181J667
54768A64532J527N81r19k244k743k308j333m63k91o68n23Q37K348K193L73r57
54752A59942k86J267J715J000P76J808L005L067K099J051L32l80j183j498q89
54737A71826M9J61p77j496o45J511L317L505K257N97p06j432j642j375m84J255
$$ plain form
54841 212960 210532 209509 208253 205890 203278 201355 199701 197852 196903 198227 201197 203770 205158 206513
54827 206513 208927 212030 214887 217317 219908 223413 228331 234504 240879 246244 250504 254844 260410 267134
54813 267134 273931 279727 284072 286852 287613 285343 279264 269968 259480 249970 242589 237447 234076 231456
54799 231456 228220 223604 218140 212929 208351 203873 198939 193613 188376 183747 180046 177260 175138 173508
54785 173508 172417 171909 171976 172690 173830 174251 172419 168209 163612 160926 160538 161049 161258 161246 161684 162865 164532
54768 164532 166059 166640 165721 163477 160734 158426 157093 156630 156339 155671 155148 155985 158333 160526 160899 159942
54752 159942 159656 160923 162638 163638 164414 166222 169227 172294 174393 175444 175776 175396 174213 172715 171826
54737 171826 171875 172036 171259 169763 169118 170629 173946 177451 179708 180305 179599 178167 176525 175150 174666 175921
54721A75921L567N410N732M587L056K066J718J771K261L383N073O889Q201Q593
54707B38228Q280P992Q138Q334Q040P258O154M508K211p2j592k619l923n405o367
54692B79165o926p890r094r216p763n949m928m195k683o28P71J103J124J496K002
54677B26389K092J666J057N97K40l37j215j792j170Q63L414N232N811N794O360
54662B55001Q071J0026J0442Q475N181K175l23l204o460q609q600p313o538o979
54648B51345p854q001o900m854k789j724k011k944l369k691j333k40O2q6p6k5
54632B06510o12j812k482j867p89n71j248j933k425l136l623k759p13P41M61p40
54616A83002j521j637j485j096o64r80k274l268k613q54K30j8n31k38O06J150
$$ plain form
54721 175921 179488 184898 190630 195217 198273 200339 202057 203828 206089 209472 214545 221434 229635 238228
54707 238228 246508 254500 262638 270972 279012 286270 292424 296932 299143 299071 297479 294860 290937 285532 279165
54692 279165 272239 264349 255255 246039 238276 232327 227399 223204 220521 219893 220664 221767 222891 224387 226389
54677 226389 228481 230147 231204 231801 232041 231704 230489 228697 227527 228390 231804 237036 242847 248641 255001
54662 255001 263072 273098 283540 292015 297196 299371 299048 295844 289384 280775 272175 264862 258324 251345
54648 251345 243491 235490 228590 223736 220947 219223 217212 214268 210899 208208 206875 206635 206697 206611 206535 206510
54632 206510 205898 204086 201604 199737 198948 198377 197129 195196 192771 189635 186012 183253 182540 183281 183742 183002
54616 183002 181481 179844 178359 177263 176599 175619 173345 170077 167464 166610 166840 166822 166291 166053 166659 167809
54600A67809J107Q13O09O32R57J575K209K378J739L76j214k384k540j343Q35K644
54584A76202K612P31j278j881j416j140j246r26r8L94L32M73R79Q68k94j341j131
54567A71840j58L88L94N21P31L89l98o24K63J575K054R84j236l218l522j911M35
54550A68507K136K740K380J097p66k032j535M52K328K670J305q86k554k560q38
54535A72444J321K477K463K136J876J230J14o22l72K48K39m47j039j154j039p81
54519A79094o9J047J844J714P82m92j705k240j339P25K314K239J378J255J540
54504A88087P75n57l1K836M972L687M40j374j069p39j418j938j517r25n09O69
54488A91389K843M536M584L647K745J767N06k01K32P93K22j008j364l99Q83J431
$$ plain form
54600 167809 168916 169729 170338 170970 171927 173502 175711 178089 179828 180204 178990 176606 174066 172723 173558 176202
54584 176202 178814 179545 178267 176386 174970 173830 172584 171658 171560 171954 172286 172759 173738 174606 174312 172971 171840
54567 171840 171682 172070 172464 172985 173716 174105 173707 173083 173346 174921 176975 177959 176723 173505 169983 168072 168507
54550 168507 170643 173383 175763 176860 176094 174062 172527 172979 175307 177977 179282 178396 175842 173282 172444
54535 172444 173765 176242 178705 180841 182717 183947 184061 183439 183067 183315 183554 183107 182068 180914 179875 179094
54519 179094 179025 180072 181916 183630 184412 183920 182215 179975 178636 179361 181675 183914 185292 186547 188087
54504 188087 188862 188305 188274 191110 196082 199769 200209 198835 197766 197027 195609 193671 192154 191229 190720 191389
54488 191389 194232 198768 203352 206999 209744 211511 212017 211816 212048 212841 213063 212055 210691 210292 211175 212606
54472B12606R44l65j865k602k209j496j502k119k341j550m7J458K239J768K22
54457B03141j190j070P37K632K474l09l659m547k302L93P52n80q13P74K058J676
54441B00167Q50P74N74n35j081M50K704L082J453l2l19l66p95q75k23L77M83Q37
54423B07525J934K856K373M96j566k507j712M47K695L762L485K771K519K820L131
54408B31029K864J912R01O13R07Q10po10k85K08j54j017j429j525j974k246j190
54391B28807P26J507M29q14m25J143J981J063r56k637k895j689p6O22P1q62j126
54374B24869l99Q74J837J703M05j146j951j934j631j214n76j37n65j625k141j328
54358B15041M61K326L502L512K478J335R82J119P08m31j358j330m90Q18K343L323
$$ plain form
54472 212606 213550 213185 211320 208718 206509 205013 203511 201392 199051 197501 197454 198912 201151 202919 203141
54457 203141 201951 200881 201618 204250 206724 206415 202756 198209 195907 196300 197052 196472 195659 196433 198491 200167
54441 200167 201017 201791 202365 201830 200749 201199 203903 206985 208438 208406 208087 207721 206926 206051 205828 206205 206688 207525
54423 207525 209459 212315 214688 215184 213618 211111 209399 209846 212541 216303 219788 222559 225078 227898 231029
54408 231029 233893 235805 236706 237319 238226 239036 239029 238419 238134 238342 238188 237171 235742 234217 232243 229997 228807
54391 228807 229533 231040 231469 230655 230230 231373 233354 234417 233461 230824 227929 226240 226164 226786 226857 225995 224869
54374 224869 224470 225344 227181 228884 229289 228143 226192 224258 222627 221413 220837 220700 220135 218510 216369 215041
54358 215041 215502 217828 221330 224842 227320 228655 229637 230756 231464 231033 229675 228345 227855 228673 231016 234339
54342B34339K810J095k17j40N61P63O21R66J743J959R19j060k975l707k785j001
54326B33891J44N3l48L5J027J712J796J700J682J695J937K708L715M218L946L297
54310B63208K569J634O51N05J926M351O093N767L462N92j235j282o0J158J329
54295B90668M43o32j140j212j576k626l980m898m852l821k317j134p20p74p55
54280B60674o31p26r67q86m45j69m07j044j994l158l868l341j991j238j557j823
54264B36429j140j17M87J096K179K942K518J529R40K83j307l050l481k971l130
54249B33207l825l136n51J909K502J840J218O55k15p31j21J018J365N45o04r82
54233B34094J7J996L367K634L38j247r27J9qo70o66M6M99M71N74Q69P46J49k75
$$ plain form
54342 234339 237149 238244 238027 237887 238448 239211 239832 240798 242541 244500 245419 244359 241384 237677 234892 233891
54326 233891 234035 234088 233740 233775 234802 236514 238310 240010 241692 243387 245324 248032 251747 255965 259911 263208
54310 263208 265777 267411 268062 268567 270493 274844 280937 286704 290166 290758 289523 288241 288181 289339 290668
54295 290668 291111 290479 289339 288127 286551 283925 279945 275047 270195 266374 264057 262923 262203 261429 260674
54280 260674 260043 259317 258350 257464 257019 256850 256443 255399 253405 250247 246379 243038 241047 239809 238252 236429
54264 236429 235289 235172 235659 236755 238934 241876 244394 245923 246863 247146 245839 242789 239308 236337 233207
54249 233207 229382 226246 225695 227604 230106 231946 233164 233819 233604 232873 232752 233770 235135 235680 235076 234094
54233 234094 234111 236107 239474 242108 242446 241199 240272 240291 240283 239613 238947 238993 239492 239963 240537 241406 242152 242301 242026
54214B42026k70l38p87j126o41Q59K842M316M485L552K642K517K659K128R57J17
54198B65938K98J296K347K563J382p79k454k403r54M52Q68N05jl28l94k30o1q0
54180B67965j31N0K61j0q25j622k027k319k821l107k374n83J181J734R99j23j037
54163B55211j988l139l764l060j441k17m4m20o80o39j66Q24J706J393j88j734
54147B41654k185j884j479p41N43J402Q36l81n47M32Q52j41j210q67L60Q57M23
54130B37924N17J982L675L920K729J690J764K091J478L39J18J104K025K053J943
54115B65352K405K531J107j209k528k346j987k279k378j547q00j496l055l428
54101B48342j789M02J255N68l85n54j5O01R03Q10K67o39j403j344l72P89J347
$$ plain form
54214 242026 241756 241418 240631 239505 238864 239723 242565 246881 251366 254918 257560 260077 262736 264864 265821 265938
54198 265938 266236 267532 269879 272442 273824 273045 270591 268188 267234 267686 268554 269059 269058 268730 268336 268106 268045 267965
54180 267965 267834 267884 268145 268135 267310 265688 263661 261342 258521 255414 253040 252457 253638 255372 256371 256248 255211
54163 255211 253223 250084 246320 243260 241819 241602 241558 241138 240458 239819 239653 240477 242183 243576 243388 241654
54147 241654 239469 237585 236106 235365 235908 237310 238146 237765 237218 237650 238502 238361 237151 236284 236644 237501 237924
54130 237924 238441 240423 244098 248018 250747 252437 254201 256292 257770 258109 258227 259331 261356 263409 265352
54115 265352 267757 270288 271395 270186 267658 265312 263325 261046 258668 257121 256321 254825 251770 248342
54101 248342 246553 246955 248210 248778 248393 247839 247824 248425 249328 250138 250405 249766 248363 247019 246647 247436 248783
54084B48783J261J051R84Q80O73O24Q50J066J080J049J019O47m8j87R12K421K808
54067B65873K000J506K010K183R13m15N31L614O124O228M923M114M271M812N440
54052C14127N756M565J170l005n457n333m060l260l107k949k563k316k606l450
54038B87512m310m280k846n40J492K523K544J858Q76L8o09j482k466k359k91K569
54022B80229L954L218J918J499J611J301P44Q79J909L031L443L066K411K017J944
54007C13174J733J123O20Q63J606K069K112K224K359J913J008O50J136J501J210
53992C35301J254K570M310M920M387M168N034O161O570O487O848P904Q893Q968
53978D13775Q179P397P425Q475J0442J3057J5347J5738J3620J0572Q923R149R587
$$ plain form
54084 248783 250044 251095 252079 252959 253632 254256 255106 256172 257252 258301 259320 259967 259919 259732 260644 263065 265873
54067 265873 267873 269379 271389 273572 274485 274070 274601 278215 284339 290567 295490 299604 303875 308687 314127
54052 314127 319883 324448 325618 322613 317156 311823 307763 304503 301396 298447 295884 293568 290962 287512
54038 287512 283202 278922 276076 275536 277028 279551 282095 283953 284829 284867 284258 282776 280310 277951 277660 280229
54022 280229 284183 287401 289319 290818 292429 293730 294474 295353 297262 300293 303736 306802 309213 311230 313174
54007 313174 314907 316030 316650 317513 319119 321188 323300 325524 327883 329796 330804 331454 332590 334091 335301
53992 335301 336555 339125 343435 348355 352742 356910 361944 368105 374675 381162 388010 395914 404807 413775
53978 413775 421954 429351 436776 445251 455693 468750 484097 499835 513455 524027 532950 542099 551686
53965E51686Q739O693M224J817K2m66K21R99J238J352J469O61j634m406o257p025
53949E59333p400p683p874q292r078r543q975p623o284n407n257o111p464p839
53935D54503o511m706m055m448m560l825k655j258L31J460J592J691L405O745
53921D37709R834J1086J0519Q777O044K429j511n049p593q654q201p168o775p127
53907D34320p052n552l023q78k03p05r35L2J082K19k290l325p79L159M451K401
53891D20922K10M51K179L227L413M179O197Q649J0309J0520R446P919O802O287
53877E00710O137O486P673R305J0346J0307R416P768N356L138K721M405O664Q144
53863E98576R134J0388J1666J2304J2335J2076J1440J0602J0544J1783J3191J3369
$$ plain form
53965 551686 560425 567118 571342 573159 573181 572715 572936 573935 575173 576525 577994 578655 577021 572615 566358 559333
53949 559333 551933 544250 536376 528084 519006 509463 500488 492865 486581 481174 475917 469806 462342 454503
53935 454503 447992 443286 439231 434783 430223 426398 423743 422485 422816 424276 425868 427559 430964 437709
53921 437709 447543 458629 469148 477925 483969 486398 484887 479838 472245 463591 455390 448222 441447 434320
53907 434320 427268 421716 418693 417815 417612 416907 415972 416004 417086 417305 415015 411690 410911 414070 418521 420922
53891 420922 421132 421583 423762 426989 430402 434581 440778 449427 459736 470256 479702 487621 494423 500710
53877 500710 506847 513333 521006 530311 540657 550964 560380 568148 573504 576642 579363 583768 590432 598576
53863 598576 607710 618098 629764 642068 654403 666479 677919 688521 699065 710848 724039 737408
53851G37408J2730J2844J3935J4413J3093J0620Q242O293M500K905J588O4k100
53838H36535m365n784o415p252q647r709r848r999j1400j3649j5177j5518j5818
53825G02954j6746j7226j6063j3906j2406j2041j1966j1733j1895j2693j3194
53814E53085j2344j0296q302p441p723q253q222p718p436p610p592o776n368l984
53800D44020l024k874l918n623o349m990k409l29N57M07r46l432n474n237l220
53785C97159j861k252k900k307j064m60n57o98q17r87o15N94J619J363M60M90
53769C87167J600K251J503L92M76J773K811K539J581J369K316L272K966J643Q29
53754D14488J634L708N755O698O362N532N323O114P227P996Q731J0002J1337J1715
$$ plain form
53851 737408 750138 762982 776917 791330 804423 815043 823285 829578 834078 836983 838571 838635 836535
53838 836535 832170 826386 819971 812719 804072 794363 784515 774516 763116 749467 734290 718772 702954
53825 702954 686208 668982 652919 639013 626607 614566 602600 590867 578972 566279 553085
53814 553085 540741 530445 522143 514702 506979 498726 490504 482786 475350 467740 460148 453372 448004 444020
53800 444020 440996 438122 434204 428581 422232 417242 414833 414504 415061 415468 414522 411090 405616 400379 397159
53785 397159 395298 393046 390146 387839 386775 386315 385758 385060 384243 383256 382641 383235 384854 386217 386677 387167
53769 387167 388767 391018 392521 392913 393389 395162 397973 400512 402093 403462 405778 409050 412016 413659 414488
53754 414488 416122 419830 425585 432283 438645 444177 449500 455614 462841 470837 479568 489570 500907 512622
53740E12622J1155J0644J0474R847Q505P509P760Q597Q503O683L630P33m36O95
53726F06921K894M111L514J775n60l719p328r887j0456r865r424r326r176r082
53712E40392r294r457r154q599p973o842n092l639l349l927m748n815o915o822
53698D48766m863k548j980l049l759l198k536k928l976m635m522l824k836j942
53684D02170j292l76J244K668K279J3k030j942k76Q74M70o23j150r25n32k39J93
53667D00526P53R24N53L87J084J970J866J084J325L124M710M371K894K329L078
53652D30978L690L240K425K155K417K868L475M135M436M205L840L868M502N649
53638D81883O817P149O225M814M138M425M802M560L786K891K250K279K965L268
$$ plain form
53740 512622 523777 534421 544895 554742 563247 570756 578516 587113 595616 602299 605929 606662 606226 606921
53726 606921 609815 613926 617440 619215 618655 614936 607608 597721 587265 577400 567976 558650 549474 540392
53712 540392 531098 521641 512487 503888 495915 489073 483981 480342 476993 473066 468318 462503 455588 448766
53698 448766 443903 441355 439375 436326 432567 429369 426833 423905 419929 415294 410772 406948 404112 402170
53684 402170 400878 400502 401746 404414 406693 406706 404676 402734 402458 403332 403802 403179 402029 401104 400572 400333 400526
53667 400526 401279 402203 402756 403143 404227 406197 408063 409147 410472 413596 418306 422677 425571 427900 430978
53652 430978 434668 437908 440333 442488 444905 447773 451248 455383 459819 464024 467864 471732 476234 481883
53638 481883 488700 495849 502074 506888 511026 515451 520253 524813 528599 531490 533740 536019 538984 542252
53624E42252K034k89j819j523m86m69j837l414l884k830q88P97J435J192P52M97
53608E31520M36O40J025R71l6j400k022j795j474j168k46J135J832J515J265J804
53592E34002K489K731K972L322K823J386R65K880N140M612J301j613j850LK533
53577E63696N170P171P097M638J675L72J070K800M705O041N924M381K882K695
53563F20317L270L295K683K249K055J546J049J575L114M461M974N224N667N937
53549F67416N881O070O636O704N713M417L792L760L862M262N043N176L531O58
53535G32921j592k147j500n40L14P31K78j016k470l400l483k615j076J40O8j064
53519G13549j984j838q60L92J527J904Q37j319l158l856l998m264m150k869q56
$$ plain form
53624 542252 544286 543997 542178 540655 540169 539700 537863 534449 530565 527735 526847 527644 529079 530271 531023 531520
53608 531520 531956 532596 533621 534592 534556 533156 531134 529339 527865 526697 526451 527586 529418 530933 532198 534002
53592 534002 536491 539222 542194 545516 548339 549725 550690 553570 558710 563322 564623 563010 561160 561163 563696
53577 563696 568866 576037 583134 587772 589447 589819 590889 593689 598394 604435 610359 614740 617622 620317
53563 620317 623587 626882 629565 631814 633869 635415 636464 638039 641153 645614 650588 655812 661479 667416
53549 667416 673297 679367 686003 692707 698420 702837 706629 710389 714251 718513 723556 728732 732263 732921
53535 732921 731329 729182 727682 727142 727456 728187 728465 727449 724979 721579 718096 715481 714405 714545 714613 713549
53519 713549 711565 709727 708867 709259 710786 712690 713527 712208 709050 705194 701196 696932 692782 689913 689057
53504F89057O41J113J041R17Q56J043J611K048J507Q3q02J95K728M855M891L210
53488G14994J973K798M828N731M651L319L740N605O936O846O525P441R531J1614
53474G96532J2878J3455J3782J4002J4051J4064J4516J5830J7880K0002K1589
53463I68581K2529K3082K3492K3912K4488K5371K6648K8255K9887L1126L1917
53452A259288L2762L4107L5674L6835L7517L8130L8756L9139L9474M0291M1372
53441A673345M1700M0790L9196L7446L5428L3355L2155L2175L2379L1742L0551
53430B060262K9516K8598K7688K7483K8350K9152K8704K7630K7217K7101K6017
53419B367718K4375K3808K4099K2925J9390J5645J3780J2916J0854P216L243n68
$$ plain form
53504 689057 689698 690811 691852 692769 693625 694668 696279 698327 699834 699917 699115 699310 702038 706893 711784 714994
53488 714994 716967 719765 724593 730324 734975 738294 742034 747639 754575 761421 767946 775387 784918 796532
53474 796532 809410 822865 836647 850649 864700 878764 893280 909110 926990 946992 968581
53463 968581 991110 1014192 1037684 1061596 1086084 1111455 1138103 1166358 1196245 1227371 1259288
53452 1259288 1292050 1326157 1361831 1398666 1436183 1474313 1513069 1552208 1591682 1631973 1673345
53441 1673345 1715045 1755835 1795031 1832477 1867905 1901260 1933415 1965590 1997969 2029711 2060262
53430 2060262 2089778 2118376 2146064 2173547 2201897 2231049 2259753 2287383 2314600 2341701 2367718
53419 2367718 2392093 2415901 2440000 2462925 2482315 2497960 2511740 2524656 2535510 2542726 2545969 2545401
53407B545401m679q757j1569j2859j3920j5772j7906j9434k0656k2525k4929k6529
53395B345866k6507k5680k5434k6072k6932k7672k8408k8599k7234k4688k3021
53384B055619k3339k3922k2385j8918j5691j3533j1334q643o628n726m430j613
53372A899457J532L374M318N849Q012R740J1082J3296J6689K0004K2333K4291
53360B039977K6769K9531L1734L3128L4142L5257L6757L8863M1575M4487M6980
53349B439200M8648M9576N0335N1678N3996N7096O0527O3982O7231O9956P2078
53338C084303P4002P6201P8606Q0677Q1948Q2252Q1792Q1324Q1775Q2973Q3235
53327C969088Q1319P8500P7243P7597P6522P1768O4974N9461N5846N1786M5822
$$ plain form
53407 2545401 2540722 2531965 2520396 2507537 2493617 2477845 2459939 2440505 2419849 2397324 2372395 2345866
53395 2345866 2319359 2293679 2268245 2242173 2215241 2187569 2159161 2130562 2103328 2078640 2055619
53384 2055619 2032280 2008358 1985973 1967055 1951364 1937831 1926497 1917854 1911226 1905500 1901070 1899457
53372 1899457 1900989 1904363 1908681 1914530 1922542 1932282 1943364 1956660 1973349 1993353 2015686 2039977
53360 2039977 2066746 2096277 2128011 2161139 2195281 2230538 2267295 2306158 2347733 2392220 2439200
53349 2439200 2487848 2537424 2587759 2639437 2693433 2750529 2811056 2875038 2942269 3012225 3084303
53338 3084303 3158305 3234506 3313112 3393789 3475737 3557989 3639781 3721105 3802880 3885853 3969088
53327 3969088 4050407 4128907 4206150 4283747 4360269 4432037 4497011 4556472 4612318 4664104 4709926
53316D709926L9376L4285L0066K4875J8185J1151M778j149p424j4746k3568l3706
53304D792049m4042n3234o0871o7297p2465p5740p7022p7276p7631p8575q0064
53293D027832q1602q1988p9906p5574p1227o9211o9700p0725p0231o7853o4999
53282C224816o3480o3720o4162o2754n9140n4837n1229m8294m5600m3279m1253
53271B627068l8443l4082k9283k5982k4578k3760k2631k1848k2373k3938k5147
53260B335003k4698k2343j9104j6511j5237j4561j3482j2023j0802r675p720m623
53248B164224j299J139K515L506M794O519Q436J0531J3270J6812K0132K1833K2114
53235B294526K2901K5319K8087K9405K9520L0090L1627L3074L3544L3097L1935
$$ plain form
53316 4709926 4749302 4783587 4813653 4838528 4856713 4867864 4872642 4871493 4864069 4849323 4825755 4792049
53304 4792049 4748007 4694773 4633902 4566605 4494140 4418400 4341378 4264102 4186471 4107896 4027832
53293 4027832 3946230 3864242 3784336 3708762 3637535 3568324 3498624 3427899 3357668 3289815 3224816
53282 3224816 3161336 3097616 3033454 2970700 2911560 2856723 2805494 2757200 2711600 2668321 2627068
53271 2627068 2588625 2554543 2525260 2499278 2474700 2450940 2428309 2406461 2384088 2360150 2335003
53260 2335003 2310305 2287962 2268858 2252347 2237110 2222549 2209067 2197044 2186242 2176567 2168847 2164224
53248 2164224 2162925 2164064 2166579 2170085 2174879 2181398 2189834 2200365 2213635 2230447 2250579 2272412 2294526
53235 2294526 2317427 2342746 2370833 2400238 2429758 2459848 2491475 2524549 2558093 2591190 2623125
53224B623125L0174K8282K6510K4075K0221J5946J3130J1883J0239O709J702l742
53212B808254r063j3644j6792j8961k1711k5684k9745l2744l5018l7465m0182
53201B527245m2678m4612m5733m5931m5759m5991m6415m6182m5472m5368m5776
53190B027328m5252m3489m2128m2075m1874m0230l8445l8482l9829m0253l8842
53179A576429l6510l4112l2002l0995l1770l3212l3048l0495k7022k4255k2257
53168A240751k0210j7949j6318j6322j8015j9977k0400j9080j7785j8033j9283
53157A037379k0141k0486k1105k1832k1667k0607j9831j9797j9492j8066j6109
53146H18246j4725j4024j3335j2467j2106j2858j4245j4969j4355j3207j2834
$$ plain form
53224 2623125 2653299 2681581 2708091 2732166 2752387 2768333 2781463 2793346 2803585 2810294 2811996 2808254
53212 2808254 2799191 2785547 2768755 2749794 2728083 2702399 2672654 2639910 2604892 2567427 2527245
53201 2527245 2484567 2439955 2394222 2348291 2302532 2256541 2210126 2163944 2118472 2073104 2027328
53190 2027328 1982076 1938587 1896459 1854384 1812510 1772280 1733835 1695353 1655524 1615271 1576429
53179 1576429 1539919 1505807 1473805 1442810 1411040 1377828 1344780 1314285 1287263 1263008 1240751
53168 1240751 1220541 1202592 1186274 1169952 1151937 1131960 1111560 1092480 1074695 1056662 1037379
53157 1037379 1017238 996752 975647 953815 932148 911541 891710 871913 852421 834355 818246
53146 818246 803521 789497 776162 763695 751589 738731 724486 709517 695162 681955 669121
53135F69121j3364j3742j3370j2828j2645j2337j1294r822q657q070p963q163
53123E36866q149p324o045n404n510n201m082l366l628l471j931o78j702l963
53109D76412m749l620k593k713k978k728k728l277l378k521j631j465j553j475
53095D39003j669k204j994k66K084L441L119J614j15j134r70p1N97M78l74j577
53079D39962k339j673P7P63r20k852j783J866L992K224j097k466j521j67P79J901
53063D36746L152L658L365L321M198N528O293N685L586Q93q73r48O4J076J416
53048D77160O09j619m405n842m996l205k435k875l164k563j812j875k639l038
53034D37301k241p33j46j539l781m463k621J34J572J094l51j620k121j907j627
$$ plain form
53135 669121 655757 642015 628645 615817 603172 590835 579541 569719 561062 552992 545029 536866
53123 536866 528717 521393 515348 509944 504434 499233 495151 491785 488157 484686 482755 482077 480375 476412
53109 476412 471663 468043 465450 462737 459759 457031 454303 451026 447648 445127 443496 442031 440478 439003
53095 439003 437334 435130 433136 432870 434954 438395 441514 443128 443013 441879 440909 440838 441435 441913 441539 439962
53079 439962 437623 435950 436027 436790 435870 433018 431235 433101 437093 439317 438220 435754 434233 434066 434845 436746
53063 436746 439898 443556 446921 450242 454440 459968 466261 471946 475532 476425 475552 474604 474668 475744 477160
53048 477160 477769 476150 471745 465903 460907 457702 455267 452392 449228 446665 444853 442978 440339 437301
53034 437301 435060 434327 434181 432642 428861 424398 421777 421911 423483 424577 424226 422606 420485 418578 416951
53019D16951j849k180j805r33n61o54j58Q44P82o45j391j90J073J07k057k553
53003D04781r57M56L31l98q88j702l026l606k426j85J720K568K237R12m79o98
52987C98640L31J401J787K041K487K275Q40p66j144m33K12L75M72M86r3j076j474
52970D06361q53J00P12J198J893K353J930Q63j00q75j895k718k087R5J909J687
52954D10573L22j7J005J749J507J531K564L244K222M49k47J27J14p00j328j253
52938D21862j008q98n80o3J19M3M72J588K704L388L793L783L017K116K299L330
52922D45965L342J527l90m76Q26J598J046k51j804l313l802k393N5J607J809K071
52906D47417L181M003L464K366J942J731N16j156j369J98J399N06j590l009l566
$$ plain form
53019 416951 415102 412922 411117 410184 409623 408969 408811 409655 410437 409792 408401 408211 409284 409391 407334 404781
53003 404781 403824 404280 404611 404213 403325 401623 398597 394991 392565 392380 394100 396668 398905 399817 399338 398640
52987 398640 398971 400372 402159 404200 406687 408962 409802 409036 407892 407459 407671 408046 408518 409004 408911 407835 406361
52970 406361 405508 405608 406320 407518 409411 411764 413694 414557 414457 413582 411687 408969 406882 406977 408886 410573
52954 410573 410895 410878 411883 413632 415139 416670 419234 422478 424700 425149 424902 425029 425143 424443 423115 421862
52938 421862 420854 419956 419376 419313 419432 419475 419947 421535 424239 427627 431420 435203 438220 440336 442635 445965
52922 445965 449307 450834 450444 449968 450794 452392 453438 453187 451383 448070 444268 441875 441930 443537 445346 447417
52906 447417 450598 454601 458065 460431 462373 464104 464620 463464 462095 462293 463692 464198 462608 459599 456033
52891D56033m252m868m030j557P37J212J47j246k458l537m198l927k630o23J462
52876D26265K554J879L92K52J935L063J545j253k313j170j02l63o70P5R13P23
52860D33725Q9l9q4p08j199o37K07q6j255j757j275j049j668k171j740q22K2J146
52842D20699K715L611K645L79j287j291k18Q78J590J876J583Q10K15K28L74Qm90
52825D34325j46J001J744J430Q44Q21R80Q22J173K948M922M617J730j001j186
52810D55024L44J147N23j60Q7O96Q02M71J40l55j590l637n565o103m978l466l101
52793D30279l760l855k649j311r63r74m33k56j857m256m722k676p87j316l142
52778C97322l686k429r92n75r20j354j394m86J517L575M211L277K009J233N14
$$ plain form
52891 456033 451781 446913 442883 441326 442063 443275 443422 442176 439718 436181 431983 428056 425426 424803 426265
52876 426265 428819 430698 431090 431342 433277 436340 437885 436632 434319 433149 433047 432684 432014 432089 433002 433725
52860 433725 433814 433775 433691 432983 431784 431147 431354 431268 430013 428256 426981 425932 424264 422093 420353 419531 419553 420699
52842 420699 423414 427025 429670 430049 428762 427471 427253 428131 429721 431597 433180 433990 434205 434433 434807 434815 434325
52825 434325 434179 435180 436924 438354 439198 440019 440999 441821 442994 445942 450864 455481 457211 456210 455024
52810 455024 455368 456515 457038 456878 456965 457661 458463 458934 459074 458719 457129 453492 447927 441824 436846 433380 430279
52793 430279 426519 422664 420015 418704 417741 416767 416334 416078 414221 409965 405243 402567 401780 400464 397322
52778 397322 393636 391207 390215 389640 388720 387366 385972 385486 387003 390578 394789 398066 400075 401308 401822
52763D01822o00j533j430l81P16J123P05k50j223j695j454n99P85K549M045M319
52747D06899L052J007q01k014k776l139l035k620k170j755j231n23K80R20J077
52732C93171O71J50M6K19P3m38o90n63p58j451j609o29K72l06j485j022J403L507
52714C90561L429J866N19j95q24j439j658j492j083k05J046J695J167M76R32K051
52698C96846K259J406R74J589K063J483P14Q41J384J273P24P47J304J351N79p5
52682D15462K19J397L117N101O530O135L678O62j104j257o81l2O58J214J106K15
52666D42420q89j614j871j702j052k34J6m68p26J42J496J790O05q10j334j334
52650D34435j614j845j085M88J533J333P21P09J033P13l74j273j172k36P38J033
$$ plain form
52763 401822 401222 399689 398259 397878 398594 399717 400422 400172 398949 397254 395800 395201 395986 398535 402580 406899
52747 406899 409951 410958 410157 408143 405367 402228 399193 396573 394403 392648 391417 390894 391174 392094 393171
52732 393171 393842 393992 394038 394257 394330 393892 393202 392639 391881 390430 388821 388192 388464 388158 386673 385651 387054 390561
52714 390561 393990 395856 396375 396180 395356 393917 392259 390767 389684 389479 390525 392220 393387 393863 394795 396846
52698 396846 399105 400511 401485 403074 405137 406620 407334 408175 409559 410832 411556 412303 413607 414958 415537 415462
52682 415462 415681 417078 420195 425296 431826 437961 441639 442301 441197 439940 439259 439227 439885 441099 442205 442420
52666 442420 441531 439917 438046 436344 435292 435058 435074 434606 433880 434022 435518 437308 437913 437103 435769 434435
52650 434435 432821 430976 429891 430379 431912 433245 433966 434675 435708 436421 436047 434774 433602 433366 434104 435137
52634D35137L62r17j825j555m70J45l75j306j600j246r10q32q59j240k203k859
52618D17447j813O31K189J348n62j206l01N37N46O15J276J602Q21k46l41N59J651
52601D24753K611L418L478K218L93m24K00J066J190J286K621M865N951M365J049
52586D59040j493j897j159r36j401j550j155j089j683k056j648j217j439j548
52572D38769n11J267K703L810N276O598O310M024Q42k252m929o315n311k780j598
52557D45903l114m999m186j039J221P68r01j439m27Q96J621K070L004M425N182
52542D48985L911O95k469l473k254n70K77P04J628K891L480K914J769Q82M37j9
52526D59788q03j515j422m81L91L95j09k35R4J66j57j45L92M15p76k043j647K18
$$ plain form
52634 435137 435499 434582 432757 431202 430732 430877 430502 429196 427596 426350 425440 424608 423749 422509 420306 417447
52618 417447 415634 416265 418454 419802 419240 418034 417733 418270 418816 419431 420707 422309 423130 422884 422543 423102 424753
52601 424753 427364 430782 434260 436478 436871 436447 436647 437713 438903 440189 442810 447675 453626 457991 459040
52586 459040 457547 455650 454491 453555 452154 450604 449449 448360 446677 444621 442973 441756 440317 438769
52572 438769 438258 439525 442228 446038 451314 457912 464222 468246 469088 466836 461907 455592 450281 447501 445903
52557 445903 442789 437790 433604 432565 433786 434554 433653 432214 431787 432683 434304 436374 439378 443803 448985
52542 448985 452896 453591 451122 447649 445395 444825 445102 445806 447434 450325 453805 456719 458488 459370 459807 459788
52526 459788 458985 457470 456048 455567 455958 456353 456244 456009 456103 456269 456112 455967 456359 456774 455998 453955 452308 452526
52508D52526J445P50p66j357r42p55j286j801j748j456j241q44k91l22j134j521
52492D39257l42J507J956N80p34m35O27O39n79j605j587j007l45P16K195L056
52476D43899K455J200Q58J628K115J441N21N69J096N95j049k144j566l52k5l13
52460D50928J11J093J033l90j177L20K942M194L432K195J813K148K662L276L800
$$ plain form
52508 452526 453971 454721 453955 452598 451656 450901 449615 447814 446066 444610 443369 442525 442234 441912 440778 439257
52492 439257 438915 440422 442378 442958 442224 441789 442416 443055 442476 440871 439284 438277 437932 438648 440843 443899
52476 443899 446354 447554 448412 450040 452155 453596 454117 454686 455782 456377 455328 453184 451618 451266 451241 450928
52460 450928 451039 452132 453165 452775 451598 451918 454860 459054 462486 464681 466494 468642 471304 474580 478380
$$ [...]
##END NTUPLES=NMR SPECTRUM
##END=
