
##TITLE=UV1018_M2-1005-1001_6269188_MQDBDqhm9u
##JCAMPDX= 6.0         $$ Bruker NMR JCAMP-DX V2.0
##DATA TYPE= NMR SPECTRUM
##DATA CLASS= NTUPLES
##ORIGIN= BRUKER
##OWNER= Administrator
$$ 1.72 TOPSPIN		Version 2.1
$$ 2012-06-02 07:04:13.671 -0500  Administrator@TOPSPIN
$$ Compression mode = diff/dup
##.OBSERVE FREQUENCY= 400.13188235
##.OBSERVE NUCLEUS= ^1H
##.ACQUISITION MODE= SIMULTANEOUS (DQD)
##.ACQUISITION SCHEME= undefined
##.AVERAGES= 8
##.DIGITISER RES= 22
##SPECTROMETER/DATA SYSTEM= spect
##.PULSE SEQUENCE= zg30
##.SOLVENT NAME= COFFEE_calctemp
##.SHIFT REFERENCE= INTERNAL, COFFEE_calctemp, 1, 14.98061
##AUDIT TRAIL= $$ (NUMBER, WHEN, WHO, WHERE, PROCESS, VERSION, WHAT)
$$ ##TITLE= Audit trail, TOPSPIN		Version 2.1
$$ ##JCAMPDX= 5.01
$$ ##ORIGIN= Bruker BioSpin GmbH
$$ ##OWNER= Administrator
$$ $$ C:\Bruker\TOPSPIN/data/COFFEE/nmr/UV1018_M2-1005-1001_6269188_MQDBDqhm9u/10/pdata/1/auditp.txt
$$ ##AUDIT TRAIL=  $$ (NUMBER, WHEN, WHO, WHERE, PROCESS, VERSION, WHAT)
(   1,<2012-06-02 07:04:05.640 -0500>,<Administrator>,<TOPSPIN>,<go>,<TOPSPIN 2.1>,
      <created by zg
	started at 2012-06-02 07:02:58.656 -0500,
	POWCHK enabled, PULCHK disabled,
       configuration hash MD5:
       D5 CA 7A 23 FE 6B EE E2 50 67 74 61 24 F7 5E 3B
       data hash MD5: 64K
       FC D2 5D BD 6B AC 32 CA CF 31 5A 4C 05 79 AB 27>)
(   2,<2012-06-02 07:04:09.406 -0500>,<Administrator>,<TOPSPIN>,<proc1d>,<TOPSPIN 2.1>,
      <Start of raw data processing
       efp LB = 0 FT_mod = 6 PKNL = 1 PHC0 = 0 PHC1 = 0 SI = 32K 
       data hash MD5: 32K
       F3 01 9F 05 C9 DE 3D A5 A9 DD E6 36 8E 2E 72 B9>)
(   3,<2012-06-02 07:04:09.953 -0500>,<Administrator>,<TOPSPIN>,<proc1d>,<TOPSPIN 2.1>,
      <pk PHC0 = 205.6805 PHC1 = 0 
       data hash MD5: 32K
       35 7B 89 4D F9 ED F1 34 FA CC 07 42 18 B6 F6 07>)
(   4,<2012-06-02 07:04:10.046 -0500>,<Administrator>,<TOPSPIN>,<proc1d>,<TOPSPIN 2.1>,
      <abs ABSG = 1 
       data hash MD5: 32K
       0C 72 93 A9 AF BF E4 CA E5 15 DE FE 97 C6 33 F3>)
(   5,<2012-06-02 07:04:10.078 -0500>,<Administrator>,<TOPSPIN>,<proc1d>,<TOPSPIN 2.1>,
      <abs ABSG = 2 
       data hash MD5: 32K
       19 36 DB A5 B6 E4 79 AB 36 05 F4 5D 2F 09 15 E9>)
(   6,<2012-06-02 07:04:10.125 -0500>,<Administrator>,<TOPSPIN>,<proc1d>,<TOPSPIN 2.1>,
      <abs ABSG = 3 
       data hash MD5: 32K
       48 AA EA 3B D5 DC 56 02 D4 B9 89 3A 47 C9 E5 68>)
(   7,<2012-06-02 07:04:10.171 -0500>,<Administrator>,<TOPSPIN>,<proc1d>,<TOPSPIN 2.1>,
      <abs ABSG = 4 
       data hash MD5: 32K
       9E 8D 59 2B 49 31 3B 53 18 BA 84 85 77 65 22 8F>)
(   8,<2012-06-02 07:04:10.203 -0500>,<Administrator>,<TOPSPIN>,<proc1d>,<TOPSPIN 2.1>,
      <abs ABSG = 5 
       data hash MD5: 32K
       EB 55 5F 8B 32 65 01 29 0B EA 1B 7F 6E 93 17 70>)
$$ ##END=
$$ 
$$ $$ hash MD5
$$ $$ 66 9A 4D 1A F2 C9 32 01 40 BD AF F5 E2 9E 23 F7
##$RELAX= 
##$RELAX= 
##$RELAX= 
##$RELAX= 
##$RELAX= 
##$RELAX= 
##$RELAX= 
$$ Bruker specific parameters
$$ --------------------------
$$ [...]
150 150 150 150 150 150 150 150
##$TP07= 0
##$TPNAME0= <>
##$TPNAME1= <>
##$TPNAME2= <>
##$TPNAME3= <>
##$TPNAME4= <>
##$TPNAME5= <>
##$TPNAME6= <>
##$TPNAME7= <>
##$TPOAL= (0..7)
0.5 0.5 0.5 0.5 0.5 0.5 0.5 0.5
##$TPOFFS= (0..7)
0 0 0 0 0 0 0 0
##$TUNHIN= 0
##$TUNHOUT= 0
##$TUNXOUT= 0
##$USERA1= <user>
##$USERA2= <user>
##$USERA3= <user>
##$USERA4= <user>
##$USERA5= <user>
##$V9= 5
##$VALIST= <valist>
##$VCLIST= <CCCCCCCCCCCCCCC>
##$VD= 0
##$VDLIST= <DDDDDDDDDDDDDDD>
##$VPLIST= <PPPPPPPPPPPPPPP>
##$VTLIST= <TTTTTTTTTTTTTTT>
##$WBST= 2048
##$WBSW= 25
##$XGAIN= (0..3)
0 0 0 0
##$XL= 0
##$YL= 0
##$YMAX_a= 524563
##$YMIN_a= -655637
##$ZGOPTNS= <>
##$ZL1= 120
##$ZL2= 120
##$ZL3= 120
##$ZL4= 120
##$ABSF1= 14.98061
##$ABSF2= -5.57192
##$ABSG= 5
##$ABSL= 3
##$ALPHA= 0
##$AQORDER= 0
##$ASSFAC= 0
##$ASSFACI= 0
##$ASSFACX= 0
##$ASSWID= 0
##$AUNMP= <proc_prof1d_extract_pilot.lims>
##$AXLEFT= 0
##$AXNAME= <>
##$AXNUC= <1H>
##$AXRIGHT= 0
##$AXTYPE= 0
##$AXUNIT= <>
##$AZFE= 0.1
##$AZFW= 0.1
##$BCFW= 0
##$BC_mod= 0
##$BYTORDP= 0
##$COROFFS= 0
##$CY= 15
##$DATMOD= 1
##$DC= 0
##$DFILT= <>
##$DTYPP= 0
##$F1P= 0
##$F2P= 0
##$FCOR= 0.5
##$FTSIZE= 32768
##$FT_mod= 6
##$GAMMA= 0
##$GB= 0
##$INTBC= 1
##$INTSCL= 1
##$ISEN= 128
##$LB= 0
##$LEV0= 0
##$LPBIN= 0
##$MAXI= 10000
##$MC2= 0
##$MEAN= 0
##$ME_mod= 0
##$MI= 0
##$NCOEF= 0
##$NC_proc= -8
##$NLEV= 6
##$NOISF1= 0
##$NOISF2= 0
##$NSP= 0
##$NTH_PI= 0
##$NZP= 0
##$OFFSET= 14.98061
##$PC= 1
##$PHC0= 205.6805
##$PHC1= 0
##$PH_mod= 1
##$PKNL= yes
##$PPARMOD= 0
##$PPDIAG= 0
##$PPIPTYP= 0
##$PPMPNUM= 2147483647
##$PPRESOL= 1
##$PSCAL= 4
##$PSIGN= 0
##$PYNMP= <proc.py>
##$REVERSE= no
##$SF= 400.13
##$SI= 32768
##$SIGF1= 0
##$SIGF2= 0
##$SINO= 400
##$SIOLD= 32768
##$SPECTYP= <>
##$SREGLST= <1H.CDCl3>
##$SSB= 0
##$STSI= 32768
##$STSR= 0
##$SW_p= 8223.68421052632
##$SYMM= 0
##$S_DEV= 0
##$TDeff= 65536
##$TDoff= 0
##$TI= <>
##$TILT= no
##$TM1= 0
##$TM2= 0
##$TOPLEV= 0
##$USERP1= <user>
##$USERP2= <user>
##$USERP3= <user>
##$USERP4= <user>
##$USERP5= <user>
##$WDW= 1
##$XDIM= 32768
##$YMAX_p= 463012905
##$YMIN_p= -672406
##$CURPLOT= <Network HP LaserJet P1505>
##$CURPRIN= <$Network HP LaserJet P1505>
##$DFORMAT= <normdp>
##$LAYOUT= <+/1D_H.xwp>
##$LFORMAT= <normlp>
##$PFORMAT= <normpl>
##$SURQMSG= 1
$$ End of Bruker specific parameters
$$ ---------------------------------
##NTUPLES= NMR SPECTRUM
##VAR_NAME=  FREQUENCY,     SPECTRUM/REAL,   SPECTRUM/IMAG
##SYMBOL=    X,             R,               I
##VAR_TYPE=  INDEPENDENT,   DEPENDENT,       DEPENDENT
##VAR_FORM=  AFFN,          ASDF,            ASDF
##VAR_DIM=   32768,         32768,           32768
##UNITS=     HZ,            ARBITRARY UNITS, ARBITRARY UNITS
##FACTOR=    0.250966925370066, 1,           1
##FIRST=     8223.43324360095, -157028,      -234203
##LAST=      0,             -2509,           -377262
##MIN=       0,             -672406,         0
##MAX=       8223.43324360095, 463012905,    0
$$ Real data points
##PAGE= N=1
##DATA TABLE= (X++(R..R)), XYDATA
$$ [...]
19530A70926G9342a6700j25465n3926c4554G4643L57071b61489d6166A84491p4718
19519A09773c00239a24667I1897K97713D5056L20549F0941e9174D238b0290j82654
19508b02944O1614J2056G4636i4542B01698n7041Q8423b3164j59265J6073c216
19496c00903R2284R4507H0709J31193n026e225j07599H9063m3430b36224A48470
19484b8691j1251k39331j38649d6551a3713r0448n9165m0864M031A51871A8955
19472i2143A51064h7154D4664a40140J999e7347j5054J6244j44310c6842A25897
19460A36640a24323E8804O6487c7808j73850k8351J02161n3051k2491c9574n66569
19449f06143A61091a2043o3682A44658a14136c8752A78270d35263a04787A87919
$$ plain form
19530 170926 79342 -16700 -142165 -196091 -34554 74643 431714 -261489 -46166 184491 109773
19519 109773 -300239 -124667 91897 389610 45056 365605 60941 -59174 4238 -20290 -202944
19508 -202944 -141330 -129274 74636 -94542 201698 144657 233080 -23164 -182429 -166356 -3216
19496 -300903 -208619 -114112 80709 211902 206876 -5225 -112824 89063 45633 -236224 148470
19484 -28691 -39942 -279273 -417922 -46551 -13713 -104161 -163326 -204190 -200159 151871 18955
19472 -92143 151064 -87154 44664 -140140 -138141 -57347 -72401 -56157 -200467 -36842 125897
19460 136640 -124323 58804 125291 -37808 -211658 -240009 -137848 -190899 -213390 -39574 -606143
19449 -606143 161091 -12043 -75725 144658 -114136 -38752 178270 -435263 -104787 187919
19438g664m4505F6038e49770b04802B52658a54439c9652A44806i23j81781e7648
19426A36557h5704b6643j45866A51577C1420A0779J4038L01702A29595c34935
19415a80026j76758c3377E06413c12853A74535n9045b33915a2224k65888F1495
19404a4901l51085B33585i5603I4651C3935O070M2336a78712E478a37181G0664
19392d82782K38897A07056b30079h0138A03247c7791B67648K2463a93325O6321
19382a27004L5523j7787B69153b13723b233B11890e1999E6722d3369J7236j8294
19371d4427j31830A66584h5134j92157J32887p2995N9273G2595c20694a36410
19360d2231k62699N2727B6989d0860o9717K6236k22111a4984j76581m5387H219
$$ plain form
19438 -7664 -52169 66038 -549770 -204802 252658 -154439 -39652 144806 -923 -182704 -57648
19426 136557 -85704 -26643 -172509 151577 31420 10779 24817 326519 129595 -334935
19415 -180026 -356784 -33377 506413 -312853 174535 115490 -233915 -12224 -278112 61495
19404 -14901 -365986 233585 -95603 94651 33935 40005 82341 -178712 5478 -137181 70664
19392 -482782 -243885 107056 -230079 -80138 103247 -37791 267648 290111 -193325 -127004
19382 -127004 -91481 -109268 269153 -213723 -2233 211890 -51999 56722 -43369 -26133 -44427
19371 -44427 -176257 166584 -85134 -277291 -144404 -217399 -158126 72595 -320694 -136410
19360 -42231 -304930 -252203 26989 -40860 -110577 -84341 -306452 -14984 -191565 -236952 8219
19348A31596F0180J48557b28369i3397k1648H4527J14851d3256I6504e98A8003
19336b58178O4676E6012a57679o909O6524j19429P7834A3393J60559J07334g3552
19324b70797N24A90590h7894k05107H5886L4171a40905j01134i2589A38877e5562
19312A8968K9299c87271J12013C1562i9923j07760d2327J7210p4138L8854l6358
19301i6759K3261L1688B39258b52801a02388A5718c89270i0920K8672j67413A54724
19289b93143J36191e5211A5132a85764A5109d5623H1542r669a82262f9120H7037
19277a34143m2471d2117j4484m9989r0269q2839a25960e0778A31933c07877g6676
19265a13102A9963a76264A90356a00177m8715f000H3033Q1954a07695B31632a39847
$$ plain form
19348 131596 60180 208737 -228369 -93397 -115045 84527 199378 -43256 96504 -598 18003
19336 -258178 -193502 56012 -157679 -164588 -98064 -217493 -139659 13393 173952 281286 -73552
19324 -270797 -270273 190590 -87894 -293001 85886 120057 -140905 -242039 -92589 138877 -55562
19312 18968 48267 -387271 -275258 31562 -99923 -207683 -42327 -25117 -99255 -60401 -96759
19301 -96759 -73498 -41810 239258 -252801 -102388 15718 -389270 -90920 -62248 -229661 154724
19289 -293143 -156952 -55211 15132 -185764 15109 -45623 81542 71873 -182262 -69120 87037
19277 -134143 -176614 -42117 -56601 -106590 -196859 -279698 -125960 -50778 131933 -307877 -76676
19265 -113102 19963 -176264 190356 -100177 -148892 -6000 83033 164987 -107695 231632 -139847
19253a43357A02694b20612A84212k6406b65943j3333e6070K3576o6322k66392
19243c65208a80838e3539o1263c9793a5783G6421N7801n9358a08676b8913E3683
19231b6699q4952A02567a77433o4641N4119o2850K080G6645a38608f6778A76826
19219A36179J5040j4199D7057J08483A8177L30261a51656C82947a73534j05659
19209b79193L6863a08764r5883D7570a1674B15241j05767i0638A5611a14148l363
19198a17511A54694l9249M8314b7346k54024a09734B1819a59787o3159b166l48470
19187c50636A14332E6329e5435k01651J05632k21698J32395D6120a32245D9194
19176d8935j67072g9227k44960e5941I529e6477j5695j13952k7403j160E9056
$$ plain form
19253 -143357 102694 -220612 184212 157806 -265943 -279276 -56070 -32494 -98816 -365208
19243 -365208 -180838 -53539 -114802 -39793 -15783 76421 134222 74864 -108676 -28913 53683
19231 -26699 -111651 102567 -177433 -242074 -187955 -250805 -248725 76645 -138608 -66778 176826
19219 136179 151219 137020 47057 155540 18177 348438 -151656 382947 -173534 -279193
19209 -279193 -242330 -108764 -204647 47570 -11674 215241 109474 -90638 15611 -114148 -117511
19198 -117511 154694 115445 163759 -27346 -281370 -109734 21819 -159787 -222946 -2166 -350636
19187 -350636 114332 56329 -55435 -257086 -151454 -373152 -240757 46120 -132245 49194
19176 -48935 -216007 -79227 -324187 -55941 9529 -56477 -72172 -186124 -213527 -214687 59056
19164c48626a38593r9408q1513J24014e4879n6405n0219A50543F735c84113D4630
19152A33288a59047f4330o7139r7267e6485j45027R3931r5314a9596m9176l3233
19141a02005A34035h5459I0840b00782f4331n5826p0084n2292m1210A95188b08412
19129h0710k12836C0056a39005M1795A67798j6722D8023b49943E3819L8995b17443
19117b1922k5734B34198D0966b98912A55788a67226l2476A42754a17253j57186
19107b74439A2717b26765A84711a44530k44175J43747j19942B0191a35494f3446
19096A1023a13458N5911B5418b03346A41574O3158q1830e17079i8057n7787c6997
19084B2179J38097a09132j57919D3322a10004B8480J70675J8395l2969a31013
$$ plain form
19164 -348626 -138593 -238001 -319514 -195500 -54879 -111284 -161503 150543 6735 -384113 44630
19152 133288 -159047 -64330 -131469 -228736 -56485 -201512 -107581 -202895 -19596 -68772 -102005
19141 -102005 134035 -85459 90840 -200782 -64331 -120157 -190241 -242533 -283743 195188 -208412
19129 -80710 -293546 30056 -139005 -97210 167798 151076 48023 -249943 53819 92814 -217443
19117 -21922 -47656 234198 40966 -298912 155788 -167226 -199702 142754 -117253 -274439
19107 -274439 12717 -226765 184711 -144530 -388705 -244958 -364900 20191 -135494 -63446
19096 11023 -113458 -57547 25418 -203346 141574 204732 122902 -517079 -98057 -155844 -36997
19084 22179 160276 -109132 -267051 43322 -110004 28480 199155 217550 184581 -131013
19073i7947A25285a18F4180b48853A45677o8872a06867m8929B34938j6155b15831
19061g0609C15769a87077A49013a24046N3470k114C17739a10525N3344l9461B60443
19049B0604K77773d62294h2212L9156G1532b24828O5578A81936Q3393A10369a99507
19037a43012N3953n3361R248A33752a2197k35863j19540f8932j16144B31806r5167
19026A36639a05823J9926c1029j03866J6285p3405G8463P1128g5558H5290J2548
19015I7838a56937I0489l5258a02361l03322b8157B01443F3692K9801a10427A32291
19003A55431d5613B37430E8232N9234B6658f8362j70070B74405J84763C8515i7189
18991A81253n7454b22279f3047B4408a92187J7232C6093e8968r3128L613B4021
$$ plain form
19073 -97947 125285 -118 64180 -248853 145677 76805 -106867 -155796 234938 218783 -215831
19061 -70609 315769 -187077 149013 -124046 -70576 -72690 317739 -110525 -57181 -96642 260443
19049 20604 298377 -462294 -82212 -43056 71532 -224828 -159250 181936 265329 110369 -199507
19037 -143012 -89059 -142420 -133172 133752 -12197 -248060 -367600 -68932 -185076 231806 136639
19026 136639 -105823 -85897 -31029 -134895 -118610 -192015 78463 149591 -75558 85290 97838
19015 97838 -156937 90489 55231 -102361 -405683 -28157 201443 63692 93493 -110427 132291
19003 155431 -45613 237430 58232 117466 26658 -68362 -238432 274405 459168 38515 -97189
18991 181253 123799 -222279 -63047 24408 -192187 -174955 36093 -58968 -152096 -148483 24021
18979b25471j4690j70263b7166l10453K1762A2020K16611b52714a18825k46033
18969c64858a54840B82563a42087B77454A3472J23031A5554b33508B3205R1871
18959A15076b5214A0485a77615I2290b37066g7297J8057B19708f2640j86209c0376
18947a7342l3367r0053N9165A0141a50787N6669C98046a29030d7928j09477I5339
18935c56813B3587P2871i639l19857J18992f9725a5663j47346B4278b33334Q1829
18924a51505F8342c40654A24903k4492b11788h7005D1447a99627c0292j34040
18914a64332f2016K1184j87516E453a40477k1119A99271f6968B2084a8635A49358
18902a5025F954b81495i23j72299H8342a41823n366k6331N5478k5703l3946A05752
$$ plain form
18979 -225471 -240161 -410424 -27166 -337619 -315857 12020 228631 -252714 -118825 -364858
18969 -364858 -154840 282563 -142087 277454 13472 136503 15554 -233508 23205 115076
18959 115076 -25214 10485 -177615 92290 -237066 -77297 -59240 219708 -62640 -248849 -30376
18947 -17342 -50709 -140762 -81597 10141 -150787 -94118 398046 -129030 -47928 -157405 95339
18935 -356813 23587 96458 -9639 -329496 -210504 -69725 -15663 -163009 24278 -233334 -151505
18924 -151505 68342 -340654 124903 100411 -211788 -87005 41447 -199627 -30292 -164332
18914 -164332 -62016 -40832 -228348 5453 -140477 -161596 199271 -66968 22084 -18635 149358
18902 -15025 6954 -281495 -923 -173222 88342 -141823 -147189 -173520 -118042 -143745 -177691 105752
18889b30067B94054A46219A4073K7655h9281I9457l1359a07518j10015A54472
18878b05097F8981a36709A01193J12180G4386a65661f4421G6895e3914j55531
18868b09445B3181b97652c5828m0183E9986b58101J7811g2585j07705A08387k9565
18857G8822O6385h0358J091l9478c1250a777r2272C31383c01839o7527B00932
18845F6883J10988d6521p1510A52113a20741j65654B17355c33728H9042J00974
18835A90016b74083d6344A42119c6558k9764A72948B756a08518A00227d9801K3840
18824b5961F8697h0471j19305b8566D6188g3387J7895A13649a46662k79675i9243
18812c20810B42524b45398a4811G0309c24213o6214I7223h9542E8891j1676b32360
$$ plain form
18889 -230067 294054 146219 14073 41728 -89281 99457 68098 -107518 -217533 154472
18878 -205097 68981 -136709 101193 213373 74386 -165661 -64421 76895 -53914 -209445
18868 -209445 23181 -297652 -35828 -76011 59986 -258101 -240290 -72585 -180290 108387 78822
18857 78822 145207 -80358 -79267 -118745 -31250 -1777 -94049 331383 -301839 -369366 200932
18845 66883 177871 -46521 -118031 152113 -120741 -286395 217355 -333728 89042 190016
18835 190016 -274083 -46344 142119 -36558 -66322 172948 2756 -108518 100227 -49801 -25961
18824 -25961 68697 -80471 -199776 -28566 46188 -73387 -55492 113649 -146662 -426337 -99243
18812 -320810 242524 -245398 -14811 70309 -324213 -390427 97223 -89542 58891 47215 -232360
18800c6065A05498b62637d0459k53436c460j49312B0785b07647l203A27607b9007
18788i7819c7783l39785a86251a7832E876J41914a30460N4553B13065A7595K59097
18777B76692e0653B06255b43599D7822a75768G3575g2872l5040d8503b0951k77303
18766b98254a45413K355j05217J09195c7433F4819a34547D8172d60193E083L31854
18755C36937b64744C8518K25062n6957j6546a9257j20954h777k74065M7148A92891
18743g1984a9729A69306b0760k36904c5956j45833O1709A00703g6805j46973B36440
18731a33713N7420F4725K00841C4612h2054B8134b34228D3109b67928A17732g2893
18719g0198K0182A28021j2359b93819D2055A5632J17556a14779o9848B35897a74619
$$ plain form
18800 -36065 105498 -262637 -40459 -293895 -3460 -152772 20785 -207647 -210850 127607 -29007
18788 -97819 -37783 -377568 -186251 -17832 5876 147790 -130460 -75907 213065 17595 276692
18777 276692 -50653 206255 -243599 47822 -175768 73575 -72872 -107912 -48503 -20951 -298254
18766 -298254 -145413 -143058 -248275 -139080 -37433 64819 -134547 48172 -460193 5083 336937
18755 336937 -264744 38518 263580 206623 190077 -19257 -140211 -8777 -282842 -235694 192891
18743 -71984 -19729 169306 -20760 -257664 -35956 -181789 -120080 100703 -76805 -223778 236440
18731 -133713 -76293 64725 265566 34612 -82054 28134 -234228 43109 -267928 117732 -72893
18719 -70198 -50016 128021 115662 -293819 42055 15632 133188 -114779 -184627 235897 -174619
18707b66705J31963a2177p002k4835a3198B58724a96837j10745B03930a88710
18696b08775h7370A44719J22162n8498k4531d62807b22690b5885q765C1737Q6358
18685A18095g9598j5210r2877P1776E223K84055d01163d8848l5032j01508N2424
18674a32964D4081a16447p0837D04382A95385N3110a76878O2987j5025l7734A01452
18662a04433l1259A53936B4209b25822G4934K56578D1604K48980a54210B25287
18651a53117n9837b8620B68952g8620A2167J4615J39500b95328e8616J8467n9376
18640i9525j85982A11447a99049B3429a12017B72659j3364e8094b0230B22480
18629a17154k4169k97492C63672F5737a45297k63544A3991b06785d9974A71661
$$ plain form
18707 -266705 -134742 -12177 -19179 -44014 -13198 258724 -196837 -307582 203930 -188710
18696 -208775 -87370 144719 266881 208383 183852 -462807 -222690 -25885 -34650 31737 118095
18685 118095 -79598 -94808 -187685 -115909 5223 289278 -401163 -48848 -83880 -185388 -132964
18674 -132964 44081 -116447 -187284 404382 195385 248495 -176878 -113891 -128916 -166650 101452
18662 -104433 -135692 153936 24209 -225822 74934 331512 41604 290584 -154210 225287
18651 -153117 -212954 -28620 268952 -78620 12167 26782 166282 -295328 -58616 -40149 -99525
18640 -99525 -285507 111447 -199049 23429 -112017 272659 259295 -58094 -20230 222480
18629 -117154 -141323 -438815 363672 65737 -145297 -408841 13991 -206785 -49974 171661
18618e26478B08619E4573a63243C8187a08547j26979e1063n7928k69226J50069
18608b28148c5633a3315j43878C0157O5629J19557c76460e497j9294C13661a2123
18596a88205H8253J02101i7366H774d36959H3395i4134A26789m4291R8508M1270
18585B22276N637M0551b29345a03660j70239J7168a26677k6718k7852f3907q6339
18574a50246L6743j49911J09354r750h305A2470g0035C57533a15415h003j67019
18563a75022r1846J15553d166r3347C14418a47349e7149j05949j54552f7052D9966
18551b83943G1776e7308j05811Q054m5684C59186c31323J41704A34444C8579c3735
18539D8394Q0588a77635g1637b7913A91038D7284b28640k0218K0750c7409A49984
$$ plain form
18618 -526478 208619 54573 -163243 38187 -108547 -235526 -51063 -108991 -378217 -228148
18608 -228148 -35633 -13315 -157193 30157 95786 215343 -376460 -5497 -24791 313661 -12123
18596 -188205 88253 190354 -97366 8774 -436959 83395 -94134 126789 82498 181006 222276
18585 222276 227913 268464 -229345 -103660 -273899 -256731 -126677 -153395 -181247 -63907 -150246
18574 -150246 -113503 -263414 -154060 -163810 -8305 12470 -70035 357533 -115415 -8003 -175022
18563 -175022 -266868 -151315 -4166 -97513 314418 -147349 -57149 -163098 -317650 -67052 49966
18551 -283943 71776 -57308 -163119 -155065 -200749 359186 -331323 -189619 134444 38579 -33735
18539 48394 128982 -177635 -71637 -27913 191038 47284 -228640 -248858 -228108 -37409 149984
18527h5683m6870c2149k72496a40145j19718A93299a16414j50765f2467o329m1874
18516a10670K6514k51102J38945K1812D07147i6919A92259g2284A5724b26585
18505A4337J96036g3016B13364G0069c11453p846k1120G4459b872n3002A57032
18493f1906p2592a4657H8803g4184K1978G9390a39410I7681C2521c1266F3937
18481A76230b97981a3354A94624b0469j5060k36999K2985C5941a26250k8741j02961
18470b57952f3780F3448i3189B00643a44507H1812b94206J45906j91884B27040
18459a46536D8607O4540g4453k40977N3205B33037E568a5383A45931b15535c8415
18447G4650b92540g5365R056B0925e2801B04694c725A20321c38174j2637L3635
$$ plain form
18527 -85683 -132553 -32149 -304645 -140145 -259863 193299 -116414 -267179 -62467 -68796 -110670
18516 -110670 -84156 -335258 -196313 -174501 407147 -96919 192259 -72284 15724 -226585
18505 14337 210373 -73016 213364 70069 -311453 -319299 -340419 74459 -2872 -55874 157032
18493 -61906 -134498 -14657 88803 -74184 -52206 79390 -139410 97681 32521 -31266 63937
18481 176230 -297981 -13354 194624 -20469 -35529 -272528 -249543 35941 -126250 -154991 -257952
18470 -257952 -63780 63448 -93189 200643 -144507 81812 -294206 -148300 -340184 227040
18459 -146536 48607 113147 -74453 -315430 -262225 233037 5568 -15383 145931 -215535 -38415
18447 74650 -292540 -75365 -66309 20925 -52801 204694 -3725 120321 -338174 -350811 -317176
18436c17176B20599g8682j85249A10706b13163e0141C11770p0356a39035E2324
18425a21616c7148p670A75747i6367A59609a27579j0651L787l12150B32679N7446
18414B90125a57474p7449H4825b29156Q1735r2983J02882k879A7806J53493f4913
18402I8453e6358A5208c63981B66153A01738c65836b4130k88648Q5234A55433
18391I455c2274j74228A27112g0230k52809d5398A31177a13700B39182D9426i0459
18379a70510A13872D4307K66b78185G4688R1889c5675B59760a66301M2773a0978
18367h2567A317c02209j44597a50693M5888A47304a26249K4865A1348d8832A71319
18355d8411L957j29523B45278c28862a32795B13365c17019f0818C2082b42006
$$ plain form
18436 -317176 220599 -78682 -263931 110706 -213163 -50141 311770 241414 -139035 52324
18425 -121616 -37148 -44818 175747 -96367 159609 -127579 -138230 -134443 -446593 232679 290125
18414 290125 -157474 -234923 84825 -229156 -147421 -240404 -137522 -140401 17806 171299 -64913
18402 98453 -56358 15208 -363981 266153 101738 -365836 -24130 -312778 -227544 155433
18391 9455 -32274 -206502 127112 -70230 -323039 -45398 131177 -113700 239182 49426 -90459
18379 -170510 113872 44307 44573 -278185 74688 166577 -35675 259760 -166301 -123528 -10978
18367 -82567 1317 -302209 -446806 -150693 -104805 147304 -126249 -101384 11348 -48832 171319
18355 -48411 -44454 -173977 245278 -328862 -132795 213365 -317019 -60818 32082 -242006
18344a22635k1994O0257j35635O783A15887e7357l94191F0028i6043B2884M6908
18333F9792d3899B3853e76212b31211A57453J56206j50682j0596d3916A78788
18322D6244a79300F990L67547c78601h5101A72290Q5998C2393a91454j27770A37670
18310a61971c381o3636k08385f6935H3502c0455j61624H3976b5771k83599e7979
18298B30320b5987H3973e47427c7406j33019B3940J20932f2505B8763a27848B59346
18286A17222j3305K88050h6590j52523a9370k50457H7661A0301c53113A8913b4946
18274b5636l10054c4421F2050J09087O1583a53580O9831G3279h608m48012c1936
18262A7855f9470G1261i2538A06471K10297h3568p7687r5697D3331h3965l1528
$$ plain form
18344 -122635 -144629 -84372 -220007 -213224 115887 -57357 -451548 60028 -96043 22884 69792
18333 69792 -43899 23853 -576212 -231211 157453 313659 162977 152381 -43916 178788
18322 46244 -179300 6990 374537 -378601 -85101 172290 258288 32393 -191454 -319224 137670
18310 -161971 -3381 -67017 -275402 -66935 83502 -30455 -192079 83976 -25771 -309370 -57979
18298 230320 -25987 83973 -547427 -37406 -170425 23940 144872 -62505 28763 -127848 259346
18286 117222 103917 391967 -86590 -239113 -19370 -269827 87661 10301 -353113 18913 -24946
18274 -25636 -335690 -34421 62050 171137 232720 -153580 -83749 73279 -8608 -456620 -31936
18262 17855 -69470 71261 -92538 106471 316768 -83568 -161255 -256952 43331 -83965 -115493
18251a15493L6100j099G2113B2437a19089E4739c6595l3148A81177a2648o5797
18240g8445C25165j28436a9763k80835e9732B80338O9446d593B69150A27185a83544
18228a98937a0562j93093A73141c63722a12002k17408A86031a87822j5427j6027
18218b19276A91550q9847g0963C2510b3150k46401c5358H4392b36337A62649D5275
18206b29206A21626d44311K02001g0332j30203i0930k21326A3218g4625G263a87653
18194e3875j06180A54504D9544b26224e4684l94296a0835B12976N2863j16831
18184A49008b46454a02901C19848i9903p7093B15411J90614b0825q4137E2356
18173b20688c2428r4426N5927B08776o3262e3027B134J56901n3640b598j6847
$$ plain form
18251 -115493 -79393 -80492 72113 22437 -119089 54739 -36595 -69743 181177 -12648 -78445
18240 -78445 325165 196729 -19763 -300598 -59732 280338 349784 -4593 269150 127185 -183544
18228 -198937 -10562 -203655 173141 -363722 -112002 -329410 186031 -187822 -203249 -219276
18218 -219276 191550 101703 -70963 32510 -23150 -269551 -35358 84392 -236337 162649 45275
18206 -229206 121626 -444311 -242310 -70332 -200535 -90930 -312256 13218 -74625 7263 -187653
18194 -53875 -160055 154504 49544 -226224 -54684 -448980 -10835 212976 265839 149008
18184 149008 -246454 -102901 319848 -99903 -176996 215411 406025 -20825 -104962 52356
18173 -220688 -32428 -126854 -70927 208776 145514 -53027 2134 159035 105395 -2598 -19445
18162a9445q1982E8128h8387k5524Q772C01894d5905A5176c51864h2261j47184
18151b29445i0383E2451J52413a02170j55864A17939B8598J3678J98620a21972
18140a88822a0035k13399k5454J02282F609b71512C7284f4306j49107e7861j7222
18129g5083G9602K00245G1720a89627J2408j47684A19661p927c80326H5847a84146
18117E3058a38211I3085L0825c2217B46243N9990b44180f2103k70950A20719c2521
18105B56809e0304G1369J73696P4069b78653F7699P1861c8627j00201h549k72385
18094b80934H9452I598i9769k64451B50401b52678E2000n847J06583b03564d1014
18082a16692L3493B19601k044F6367a99867A22467c00826e1400j2588A11409M5463
$$ plain form
18162 -19445 -101427 58128 -88387 -113911 -105139 301894 -45905 15176 -351864 -82261 -229445
18151 -229445 -90383 52451 204864 -102170 -258034 117939 28598 42276 240896 -121972
18140 -188822 -10035 -223434 -248888 -146606 6609 -271512 37284 -64306 -213413 -57861 -75083
18129 -75083 79602 279847 71720 -189627 -177219 -324903 119661 111734 -380326 85847 -184146
18117 53058 -138211 93085 123910 -32217 246243 306233 -244180 -62103 -333053 120719 -32521
18105 256809 -50304 71369 245065 319134 -278653 67699 139560 -38627 -138828 -8549 -280934
18094 -280934 89452 9598 -99769 -364220 250401 -252678 52000 46153 152736 -203564 -41014
18082 -116692 -83199 219601 217557 66367 -199867 122467 -300826 -51400 -63988 111409 156872
18071A56872d2485j52791L883P4316B01361a34508I6856d5424B23571q3225e42401
18059a05665r5637R2917n5078L9171A3898b98223E4598g5304C85053I5901a28575
18047e3797j4170b5052j18539A88323a12937C15470A41406b85574A51903C0448
18036F4203b3170E4443h773q9737E5030a40478K2026n8571B68758E2754h9363
18024G7027a09704D4806d38167J88866c6002j06146F3489b03373A55202e3943
18013C2971c85978D7548M6398b17203b985B11243j04166b12916i4774j11002C08010
18001e8916C16537A9779d0400j5148K5944o0221H4268H097d82496A79578a6417
17989a07883D3492K01476H0988c43693f1602F8821c51945J51655C52398j62578
$$ plain form
18071 156872 -42485 -195276 -191393 -117077 201361 -134508 96856 -45424 223571 140346 -542401
18059 -105665 -201302 -108385 -163463 -124292 13898 -298223 54598 -75304 385053 95901 -128575
18047 -53797 -67967 -25052 -143591 188323 -112937 315470 141406 -285574 151903 30448
18036 64203 -23170 54443 -8773 -98510 55030 -140478 -118452 -177023 268758 52754 -89363
18024 77027 -109704 44806 -438167 -249301 -36002 -142148 63489 -203373 155202 -53943
18013 32971 -385978 47548 93946 -217203 -2985 211243 107077 -212916 -94774 -205776 308010
18001 -58916 316537 19779 -40400 -55548 -29604 -89825 84268 8097 -482496 179578 -16417
17989 -107883 43492 244968 80988 -343693 -61602 68821 -351945 -200290 352398 189820
17979A89820a59416l8262h5954A44548K58092a73312F4191a67813P5499j82001
17969b74315B38942a2513j43765p9470N8513A28680m3644d86972B6567a28996
17958b5905l7369k15452D7190e684E7125b30867i4859j11503n1609q0038J44343
17947a93666m35822A06022h1324G4367c6412j45883j23231P5442b5044E7463b61635
17935i1142L6416j61444A01476F28Q1824M654a2365E1140O9042h7825p3831p0141
17923b31797A44120o878L3819b273D5780c163k53153B8711a43604I9606a03147
17911a60482I7654D5478K4472J1286e7631A90502a95880A242h1861k41854C48215
17899b66531A4186d4036B86589K49354a24733I7217j2105J3902a49855H9446d5027
$$ plain form
17979 189820 -159416 -197678 -85954 144548 402640 -173312 64191 -167813 -92314 -274315
17969 -274315 238942 -12513 -156278 -235748 -177235 128680 85036 -486972 26567 -128996
17958 -25905 -63274 -278726 47190 -5684 57125 -230867 -94859 -206362 -257971 -338009 -193666
17947 -193666 -629488 106022 -81324 74367 -36412 -182295 -305526 -230084 -25044 57463 -261635
17935 -91142 -54726 -216170 101476 628 82452 87106 -12365 51140 120182 -87825 -161656 -231797
17923 -231797 144120 137242 171061 -2273 45780 -3163 -256316 28711 -143604 99606 -103147
17911 -160482 97654 45478 69950 81236 -57631 190502 -195880 1242 -81861 -323715 348215
17899 -266531 14186 -44036 286589 535943 -124733 97217 85112 99014 -149855 89446 -45027
17887A14618k969b09441A80062b70638O1268d0607I2522g7088F2456a66351g3660
17875A76429A8126a04325L3446p3809a3485A80965D1840d82388B4262K35730b24435
17863g2130m3426E3294L38871C7023M5948l3799d4760k12953F4825a02804K3821
17852g8983B0134L405g7489k72362G1936g4747A84411g3340j08099j19100F2776
17840g912A02783m9313J53127b79088D6258c55200f9070k02146F7866k624O4852
17829A30094f1473p5654C4191g8792B06944g3874H4379P283d2779K0557H6070
17817G1509a83347j918a5816l45496J30526g7787B79867A20979J58463A15172
17806A31443a6497j17192B48750G5625d9674k2700A13123a55326A26804b16679
$$ plain form
17887 114618 111649 -209441 180062 -270638 -209370 -40607 92522 -77088 62456 -166351 -73660
17875 176429 18126 -104325 -70879 -144688 -13485 180965 41840 -482388 24262 259992 -224435
17863 -72130 -115556 53294 392165 37023 82971 49172 -44760 -257713 64825 -102804 -78983
17852 -78983 20134 23539 -77489 -349851 71936 -74747 184411 -73340 -181439 -300539 62776
17840 -7912 102783 53470 206597 -279088 46258 -355200 -69070 -271216 67866 65242 130094
17829 130094 -61473 -137127 34191 -78792 206944 -73874 84379 91662 -42779 -22222 86070
17817 71509 -183347 -185265 -15816 -361312 -230786 -77787 279867 120979 279442 115172
17806 131443 -16497 -133689 248750 75625 -49674 -72374 113123 -155326 126804 -216679
17795a86776k88346a60468A83099J09425d2576A08185c18239A2035a945j64047
17785a65992J4166J6775l13414c614j71438q6295e1657r0145A90346b96760D3556
17773E5703O7359a44603A06403K64589H2900Q5966e0357o0609G3866b06649G9448
17761D2523a27480C6971R4235a15420O891A12661b57289j0991H0589d8587l37622
17750c86209C59570j18694c1308j52822A90688m3259i442j3505m30251A76228
17739c1739A05211J50218m6847b40846i3600l7033G0924g7934A11724M1192c81812
17727d15937a10195C31858I038K72753I3294e1290b1419p4500j38456A9690P924
17716B7614J49873b07762A40895j592J14763D5682i5272D6321J37102i5346D5655
$$ plain form
17795 -186776 -475122 -160468 183099 292524 -42576 108185 -318239 12035 -1945 -165992
17785 -165992 -151826 -135051 -448465 -3614 -175052 -261347 -51657 -141802 190346 -296760 43556
17773 55703 123062 -144603 106403 370992 82900 168866 -50357 -110966 73866 -206649 79448
17761 42523 -127480 36971 131206 -115420 -108529 112661 -257289 -268280 80589 -48587 -386209
17750 -386209 359570 240876 -31308 -184130 190688 147429 -9442 -22947 -453198 176228
17739 -31739 105211 255429 208582 -240846 -93600 -130633 70924 -77934 111724 152916 -381812
17727 -415937 -110195 331858 9038 281791 93294 -51290 -21419 -95919 -234375 19690 27614
17716 27614 177487 -207762 140895 139303 254066 45682 -95272 46321 183423 -95346 45655
17704a97325I8265H55J06407l3621J28134k974b19299d6800A52803a74532G9016
17692A37950B2128i4173f184A56269P1124a75167B08994b72532f485k05189A0981
17680b49343N5981R1102B09684j00533B7129a9542H1331C6677B427J9699K34555
17669B56681k1937D8219K2357a6049B19028d28632b04248A4773a9689j67944i3485
17657C765N6931b28057C16771e7662b3814E072a90180A81962B8398K17539l0180
17646B15757a23000j49135O2732g8155B97622E3010J04538o2750B3025A1253N0743
17635F1996a88530O1481L3416B15027C8416b98352B35265a7707H3422f5010D3003
17623E7147J15508a58606J1398M9557I0257k0874N0248d8740l0395p3266c745
$$ plain form
17704 -197325 98265 855 107262 73641 201775 198801 -219299 -46800 152803 -174532 79016
17692 137950 22128 -94173 -6184 156269 227393 -175167 208994 -272532 -6485 -211674 10981
17680 -249343 -193362 -102260 209684 109151 27129 -19542 81331 36677 2427 22126 256681
17669 256681 234744 48219 70576 -16049 219028 -428632 -204248 14773 -19689 -187633 -93485
17657 3765 60696 -228057 316771 -57662 -23814 5072 -190180 181962 28398 245937 215757
17646 215757 -123000 -272135 -209403 -78155 297622 53010 157548 94798 23025 11253 61996
17635 61996 -188530 -127049 -93633 215027 38416 -298352 235265 -17707 83422 -65010 43003
17623 57147 172655 -158606 -147208 -97651 90257 69383 119631 -48740 -79135 -152401 -3745
17611C1767e2949o2169E1551c57243D3361J81331J47072b0131m0942B3007a55329
17599B94859m1543E6279l371J46434H925K65007a29719o461K2458F0792A7222
17587a21394A39094J0990l4789p908c4010j12739H0550e5676j5162F5563K17295
17576B82858B7520F686K99478F7316J66281n6927a73492H6442P638h3265E8682
17564a94813h1902E7442a48156C6688P7811K7921l0667E5364A9667K6229i2204
17552a08995D253Q322d14499C05142c46847a70380F6460K02806J93765b2508p0211
17541i2719H6725a82618A81231J20550c8019D17910A5835a03791b8097D06154
17530C1015E546K75544A11514D3704a3039k3697p4096b6097p7301D30799H8582
$$ plain form
17611 31767 -52949 -115118 51551 -357243 43361 224692 371764 -20131 -61073 23007 -155329
17599 294859 253316 56279 52908 199342 8925 273932 -129719 -136180 -113722 60792 17222
17587 -121394 139094 150084 115295 107387 -34010 -146749 80550 -55676 -70838 65563 282858
17576 282858 27520 6686 306164 67316 233597 176670 -173492 86442 94080 -83265 58682
17564 -194813 -81902 57442 -148156 36688 114499 142420 111753 55364 19667 45896 -92204
17552 -108995 4253 12575 -414499 305142 -346847 -170380 66460 269266 463031 -22508 -92719
17541 -92719 86725 -182618 181231 301781 -38019 417910 15835 -103791 -28097 406154
17530 31015 5546 281090 111514 43704 -13039 -36736 -110832 -26097 -103398 430799 88582
17518a2420k7779F8591Q9832M4770C8004O2406r203K03395H3703J51478j16884
17507A18297B7459M40739c7148j94245A07145J71889A02027O2149J34311g5294
17496B40911a8066o2900A64242j9172o1241k0564M898A42L01018D4111B656i3057
17483B07698e971A99326r4852J56034c9700D90368A57158j7439Q8067Q3954A55159
17471B58153a0520A0367O0352A1423a55490B29482q5588F4714J78269J24183j58561
17460B08605a85588A90065R8978o2047n5701j0137K58383B3051J04152a68690
17449A97556m4708a14334D92720B31887K14686h6901B58499B7920a37681B88354
17438C23138j56287E2064J27374J51727K1121j66890o0326K2323g3649D86835
$$ plain form
17518 -12420 -40199 68591 158423 203193 38004 100410 91207 294602 83703 235181 118297
17507 118297 27459 468198 -37148 -231393 107145 279034 102027 164176 298487 -75294
17496 240911 -18066 -80966 164242 145070 83829 63265 68163 142 301160 44111 2656 -93057
17483 207698 -5971 199326 104474 260508 -39700 490368 157158 139719 227786 311740 155159
17471 258153 -10520 10367 70719 11423 -155490 229482 143894 64714 242983 367166 208605
17460 208605 -185588 190065 289043 226996 171295 161158 419541 23051 127203 -168690
17449 197556 152848 -114334 492720 231887 446573 -86901 258499 27920 -137681 288354
17438 323138 166851 52064 179438 331165 352286 185396 125070 147393 -73649 486835
17427a37428C17287J23384k11132q7528F5334J91729j00382L89984E2129K74526
17417C26655Q158O3473A6612K26216M9926A40488N8548J64911d5352A25262o2542
17406F2720K43941E459L52844A51191J41278K24373B55152n7532r286O356N1940
17395B46630E6255k4860R6399c515A74505j3112R7882M6653A23993J6420j4950
17384A25463c8927B4204G155M55886D3312K70047G2441L74713j56010O633m6440
17373B51337J06578j41474r6523C4057O2185B0163J11398b0962A80562J18116
17363B98678j26682n4732J4668P0368k9187q2078F653K90551O5904A71535e519
17351A43879d9122B13874H5398R1193F1592K33913e2599B623K77511k1510b58824
$$ plain form
17427 -137428 317287 440671 229539 142011 65334 257063 156681 546665 52129 326655
17417 326655 334813 398286 16612 242828 292754 140488 199036 363947 -45352 125262 62720
17406 62720 306661 5459 358303 151191 292469 516842 255152 197620 188334 194690 246630
17395 246630 56255 31395 127794 -3515 174505 161393 259275 305928 123993 140413 125463
17384 125463 -38927 24204 7155 463041 43312 313359 72441 447154 291144 297777 251337
17373 251337 357915 216441 119918 34057 96242 20163 131561 -20962 180562 298678
17363 298678 171996 117264 131932 202300 173113 91035 6653 297204 363108 171535 -5519
17351 143879 -49122 213874 85398 176591 61592 295505 -52599 2623 280134 258624 -258824
17339E6393R2698D1566K15682e7280D01250A70862K32531n1074d1746A41352o6741
17328G4611N8842h6233C90726A14649J63221A16684Q4003C7463N0532d0010D0874
17316B23978N2012F5360R61j5644Q8062o4493e1756C12471j01070Q9950a2475
17304E39992a76958c0868B38370L60759e7415A95026J08302O6150j48848g653
17293g5037B26533p6075P4395B8018f7802C50259K2611A30532D6190J33406a70091
17281B02781D9028l884K33812a59453g9294C0836h2684C63611J50582G5714j5151
17270F0563J54719J99421B8072J06772b3128A7855K33599j25091L06046k00678
17260B31731H3602O0288J24422L11467p6209A89450J12735B5039d6756D37675
$$ plain form
17339 56393 149091 41566 257248 -57280 401250 170862 403393 352319 -41746 141352 74611
17328 74611 133453 -86233 390726 114649 277870 116684 200687 37463 87995 -40010 40874
17316 223978 275990 65360 66321 50677 138739 74246 -51756 312471 211401 301351 -12475
17304 539992 -176958 -30868 238370 599129 -57415 195026 303328 369478 220630 -7653
17293 -75037 226533 150458 224853 28018 -67802 350259 372870 130532 46190 179596 -170091
17281 202781 49028 45144 278956 -159453 -79294 30836 -82684 363611 514193 75714 60563
17270 60563 215282 414703 28072 134844 -23128 17855 251454 126363 432409 231731
17260 231731 83602 143890 268312 579779 503570 189450 302185 25039 -46756 437675
17249G4141K75913E0862J38242A4207a11037H1689g6567L0680B00505J75814G0536
17237B42296o316I6101b5988D19402a19244E73022A39109J10262L95842A23606
17226B43234J66857n6577j74736L07898A69743m0960J53840f7351C24328m8939
17216B75389G9546L06769A59530D6533K31051E7887L04661j6749h573B30255m7418
17205A82837J05238R0338Q2362p3089o5775j13632G8417f2710A80284K62687j67026
17194B75945L4687M754r0348g9904B54280a0659B83778l1414j8818J31660H2751
17182A05321L03017j15264J44804B00866D8554K84534H8313e9808A91962J39078
17172C31040K4866A53549J48666J3685A09549J56707L2323J27887A20249Q1717
$$ plain form
17249 74141 350054 50862 189104 14207 -111037 81689 -76567 -45887 200505 376319 70536
17237 242296 235980 96101 -25988 419402 -119244 573022 139109 249371 645213 123606
17226 243234 410091 353514 178778 486676 169743 128783 282623 -67351 324328 275389
17216 275389 79546 386315 159530 46533 277584 57887 362548 345799 -8573 230255 182837
17205 182837 288075 378413 460775 387686 321911 208279 78417 -62710 180284 442971 275945
17194 275945 310632 315386 225038 -79904 254280 -10659 283778 252364 233546 365206 82751
17182 105321 408338 293074 437878 200866 48554 333088 88313 -59808 191962 331040
17172 331040 355906 153549 302215 315900 109549 266256 298579 426466 120249 201966
17162B01966I5753J91392j31867M040l0912K44977R5986q4077C7689K48688K08081
17151D94458I4445L81199B31508L29145F3371K64311J32848e1042E35617A82091
17140c1600E30600A23252K05223J46061p2247J7338F6189K32606Q3091R9926r2117
17129C89695O8115j72662R0264N0041m8600J0879B7295J78839r103K23159j3273
17118D06917J47852j10858j02825r9844R3984j53774J63697J68482Q0558k56313
17108C37876P4751j83221J48042A24418L49660k10330N8384A59170L57687j53887
17098C62970K40599r1752j10303A78951q8036K01987N36836C55794j31142J60470
17088C85122m8265K06464A40320N91313k16624b1478B25245K28214j55235K87801
$$ plain form
17162 201966 95753 287145 155278 159318 128406 373383 469369 385292 37689 286377 494458
17151 494458 94445 475644 231508 560653 63371 327682 460530 -51042 535617 182091
17140 -31600 530600 123252 328475 474536 402289 419627 66189 298795 381886 481812 389695
17129 389695 457810 285148 375412 425453 376853 387732 27295 206134 197031 420190 406917
17118 406917 554769 443911 341086 241242 335226 181452 345149 513631 594189 337876
17108 337876 412627 229406 377448 124418 474078 263748 322132 159170 516857 362970
17098 362970 603569 511817 401514 178951 90915 292902 829738 355794 224652 385122
17088 385122 336857 543321 140320 731633 515009 -21478 225245 453459 298224 586025
17078E86025k37274Q677K33760A23960K29311L627J47288j98610K53749k79044
17068B80281k2095L37490j93773l1008j16571K50869j56090K22768j69386R7852
17058E00337J17901k84240L93722j46207j9782K04796C58095O8287P8203J7812
17048E22397q656P7405p9424K02810j32515k64436L72994j49159J27036j9771
17038F48681q5961Q2181B84719M12584j49905J54833k58382n023J75111P6520
17028F90457j53245p3599L14774N1270k42398J6562K2535J4698j0636k68352K67693
17017F29759R9421J7747K0866o8087n9092M8606k85399K42669j00850K82610N5125
17006H83375l18979Q5302P773j62199J47737K22912k25714K42375m24340L59682
$$ plain form
17078 586025 348751 357428 591188 123960 353271 356898 504186 305576 559325 280281
17068 280281 258186 595676 401903 370895 254324 505193 349103 571871 402485 500337
17058 500337 618238 333998 727720 581513 561731 766527 358095 426382 504585 522397
17048 522397 513741 591146 511722 714532 582017 317581 690575 541416 668452 648681
17038 648681 562720 644901 284719 697303 547398 702231 443849 438826 613937 690457
17028 690457 537212 463613 778387 829657 587259 603821 626356 641054 630418 362066 629759
17017 629759 729180 746927 767793 699706 640614 689220 403821 646490 545640 828250 883375
17006 883375 564396 649698 657471 495272 643009 865921 640207 882582 458242 817924
16996H17924J17044C54552K00772L28348j62563k41971L67246j28626p7634k88880
16986C51244O00846k44811J54555j96720K97879q4735j75944J04155J8879o8637
16976G56711o0127L55076j50743j75371o9585M16474k13244J59808k14130n2906
16966G51963p6187M11598k46734j99719J71475M29631k71328j75113J69096r4370
16956H70312K0490j55020M13062m38295J49397L59863k14053K02433l5118l31674
16946H41397K44344J81066l04615J11008J35444k27468o2840K72327k74106n3898
16936H62659K34143J9974j46310L45705p2274J56770M7449k58151L2087N5723
16926A277775J74093k84894R095K75382k39613R787L3322J69883j41144q4362
$$ plain form
16996 817924 934968 354552 555324 883672 721109 479138 846384 717758 640124 351244
16986 351244 952090 707279 861834 665114 962993 878258 702314 806469 825348 756711
16976 756711 696584 1051660 900917 725546 655961 1072435 859191 1018999 804869 751963
16966 751963 675776 1087374 840640 640921 812396 1242027 970699 795586 964682 870312
16956 870312 890802 735782 1148844 710549 859946 1219809 1005756 1208189 1173071 841397
16946 841397 1085741 1266807 962192 1073200 1208644 981176 918336 1190663 916557 862659
16936 862659 1096802 1116776 970466 1316171 1243897 1400667 1448116 1189965 1222052 1277775
16926 1277775 1451868 1166974 1176069 1451451 1211838 1221625 1254947 1424830 1283686 1199324
16916A199324K19620r878r2176j0465M79702m30351L31085k89404M6382L6055
16906A479894K37654j06849k10964N4747N9024l8823n9462M09529m1193l09845
16896A473712L65309n5300J4958j76423p8329L5184M10454n78881M54980l57828
16886A507836L14238n1458k27271N58224k83804K4343K71707l27556K28989K10047
16876B225295q3733K9348J70582n99052M08708k7417J46112j77775J60875j32802
16866B120141L01237q1171j22914m8759J98561m9232K41234K62367l47868L24914
16856B798510p2764l39693L09192r0090L83719j5945j13457J00478R4697k28597
16846B826050J36549M49181m39228K51794m2216K67552m6405n9060J63474p0022
$$ plain form
16916 1199324 1418944 1409066 1316890 1306425 1786127 1355776 1686861 1397457 1443839 1479894
16906 1479894 1717548 1610699 1399735 1454482 1513506 1474683 1415221 1824750 1783557 1473712
16896 1473712 1839021 1783721 1798679 1622256 1543927 1579111 1989565 1410684 1865664 1507836
16886 1507836 1822074 1770616 1543345 2101569 1817765 1842108 2113815 1786259 2015248 2225295
16876 2225295 2141562 2170910 2341492 1742440 2151148 2123731 2269843 2092068 2252943 2120141
16866 2120141 2421378 2340207 2217293 2168534 2367095 2317863 2559097 2821464 2473596 2798510
16856 2798510 2725746 2386053 2695245 2605155 2988874 2972929 2859472 2959950 3054647 2826050
16846 2826050 2962599 3411780 2972552 3224346 3182130 3449682 3403277 3344217 3507691 3437669
16836C437669M4105K51555j68289R0188m9593K07001K61495L1563l2432L0555
16826D103817K07077k36652K32857J84214l37780M52910l7980r3411K36527n5252
16816D656327K64048K8794j07146J80656N32444N8401L9121Q8698q6921K85660
16806E940082j54261L46035o4885K81007o549M13294l3163L77534j55113K85981
16796G229962L08751K15647j67889K39795K45654R9882j70933L42898M95982K45328
16786I085077K87534j85249O89395j4123L15553K915N24781N13441j85118O11579
16776A1645785M92628L7789N68564o6052P57037N27430K83281L56207L09341J86567
16766A5098577Q74520N64538J68714Q68853J80220R27195P71115M57316L90128
$$ plain form
16836 3437669 3481774 3733329 3565040 3655228 3605635 3812636 4074131 4105694 4073262 4103817
16826 4103817 4310894 4074242 4307099 4491313 4153533 4606443 4568463 4475052 4711579 4656327
16816 4656327 4920375 4949169 4842023 5022679 5555123 5613524 5652645 5741343 5654422 5940082
16806 5940082 5785821 6131856 6066971 6347978 6341429 6754723 6721560 7099094 6943981 7229962
16796 7229962 7538713 7754360 7586471 7826266 8071920 8171802 8000869 8343767 8839749 9085077
16786 9085077 9372611 9187362 9876757 9862634 10178187 10181102 10705883 11219324 11034206 11645785
16776 11645785 12138413 12176202 12744766 12678714 13435751 13963181 14246462 14602669 14912010 15098577
16766 15098577 15973097 16537635 16706349 17575202 17755422 18682617 19453732 19911048 20301176
16757B0301176P47337R13997O74648J003494Q33324Q28336J081500O91188J699579
16748B8774579N54935J363137J723307J355344J461739J273893J657076J700347
16740C9864357K284394J554546K113131K281308K510295K384944L043011L010689
16732E9046675K934353L480876L526488L704860L884304M674162M092987M899879
16724I0244584M985130M989254N774918N800281N824183O229692O222555N804258
16716A35874855O684810N915660N894477N708806N459686M680033L826354L629911
16708A77674592K608189J748915L79632k56739j126042k249463l145666m197352
16700A71436066m672648m879400n442477o014557o534190o222434o462683o156795
$$ plain form
16757 20301176 21048513 21962510 22637158 23640652 24473976 25302312 26383812 27075000 28774579
16748 28774579 29329514 30692651 32415958 33771302 35233041 36506934 38164010 39864357
16740 39864357 42148751 43703297 45816428 48097736 50608031 52992975 56035986 59046675
16732 59046675 61981028 65461904 68988392 72693252 76577556 81251718 85344705 90244584
16724 90244584 95229714 100218968 105993886 111794167 117618350 123848042 130070597 135874855
16716 135874855 142559665 148475325 154369802 160078608 165538294 170218327 174044681 177674592
16708 177674592 180282781 182031696 182411328 182154589 181028547 178779084 175633418 171436066
16700 171436066 166763418 161884018 156441541 150426984 143892794 137670360 131207677 125050882
16692A25050882n926531o043920o109145n258656n480954m951215n012967m350235
16684H1917259m569812m374735l514607l769983l557442k968726l179796k464574
16676E3517584k886082k331728k393023k334070k026656k007127j837001j771319
16668C5930578j808874q32500j736811j170191j689247j091066p12208j622712
16660B5266969q95151o97862r24433j247671l14700r37845p87484m62632r95363
16651A8003828n73721m88844p37950k86616o96446m26397r7050q17504m92885
16642A3386415k99409m46467J38504q58013n7713m65873m53954o2452r52554j14010
16632I814474r375l07553k25137q9741j89141o25615J84637m94071K24839l76309
$$ plain form
16692 125050882 119124351 113080431 106971286 101712630 96231676 91280461 86267494 81917259
16684 81917259 77347447 72972712 69458105 65688122 62130680 59161954 55982158 53517584
16676 53517584 50631502 48299774 45906751 43572681 41546025 39538898 37701897 35930578
16668 35930578 34121704 33289204 31552393 30382202 28692955 27601889 26889681 25266969
16660 25266969 24371818 23673956 22749523 21501852 21187152 20249307 19461823 18999191 18003828
16651 18003828 17430107 16941263 16203313 15916697 15220251 14793854 14696804 13879300 13386415
16642 13386415 13087006 12640539 12779043 11921030 11863317 11397444 10943490 10881038 9928484 9814474
16632 9814474 9805099 9497546 9272409 9182668 8993527 8367912 8552549 8058478 8283317 7907008
16622G907008j97313p6072m83614j3900k07504k98557q4006n4524l63981o5806
16612F061731O0131p3933r8196k84710l20754K51429k94880K71685l36070m25788
16602D810645K46801k82139K15506j69190k51284L5681K73725j86349m94590p625
16592D191181k7632j92460J84634N9902l15176q0842k42769K4550q8852M4820
16582C557356K67826j29067m08177m3907K24350J86836o28928K45305q6349L4258
16572C219503k86339N257j00588j28890K71671k56144J34084j45036j77902M330
16562B539946J941o4973l35981L843L24423j78992P7214n4776p2252J45039J59527
16551B544959m3219l24262J12260o2525k85701K35110N4592j93748j99953J40009
$$ plain form
16622 7907008 7709695 7633623 7150009 7136109 6928605 6630048 6546042 6491518 6127537 6061731
16612 6061731 6121862 6047929 5949733 5665023 5344269 5595698 5300818 5572503 5236433 4810645
16602 4810645 5057446 4775307 4990813 4821623 4570339 4606020 4879745 4693396 4198806 4191181
16592 4191181 4163549 3971089 4155723 4215625 3900449 3819607 3576838 3601388 3512536 3557356
16582 3557356 3825182 3696115 3287938 3244031 3468381 3655217 3026289 3271594 3185245 3219503
16572 3219503 2933164 2938421 2837833 2708943 2980614 2724470 2858554 2713518 2535616 2539946
16562 2539946 2541887 2476914 2140933 2144776 2469199 2290207 2367421 2312645 2240393 2385432 2544959
16551 2544959 2501740 2177478 2289738 2227213 1941512 2176622 2231214 2037466 1837513 1977522
16541A977522k00667j25330K96981l86883K23515j15739k9864O0586j35735J70063
16531A734449l7097P4467m50641M14805Q0063k16082j43955J52242k41619q0527
16521A286105Q5835k57387K04037m3530J06912N846J53425K4941n6749k62244
16511A247191K83797Q3489l66434M20282j94118k74479L8321l6399J92699l56385
16501A037964k178L00450j69574J57293l37082J82672k47331K78117j4406o7661
16491A118264O9752j84003J30520k08701Q2287J18953n427k29177J55732K09960
16481A258160j22060l56231j66930J63830J56311r7073K14051k73359n2912K32297
16471I56084l21238L63253k31785J55043k19475L89606l84601K10536j14288j67322
$$ plain form
16541 1977522 1776855 1651525 1948506 1561623 1785138 1669399 1639535 1700121 1564386 1734449
16531 1734449 1697352 1771819 1321178 1735983 1816046 1599964 1456009 1608251 1366632 1286105
16521 1286105 1371940 1114553 1318590 1275060 1381972 1387818 1541243 1566184 1509435 1247191
16511 1247191 1530988 1614477 1248043 1668325 1474207 1199728 1238049 1201650 1394349 1037964
16501 1037964 1035786 1336236 1166662 1323955 986873 1169545 922214 1200331 1185925 1118264
16491 1118264 1188016 1004013 1134533 925832 1008119 1127072 1121645 892468 1048200 1258160
16481 1258160 1136100 779869 612939 776769 933080 836007 1050058 776699 723787 956084
16471 956084 634846 998099 766314 921357 701882 1091488 706887 917423 803135 635813
16461F35813k9526M35691k01377K59165l81174o7929j5206R1192l13519M14009
16451H27139k40284K10560k02256K07867q9025n3239K31048k12746L17860k37994
16441G58930N8439o3780k05783O7476K5972O9668J6314q3633j92518J10262J55315
16430G16662j20752J86534l15181j56670K40641M1356l426K60225j17243j1731
16420G20415O4805A92934N40285q4573P1201j57683J81766m8149j61041k43749
16410B90991K13803O4334B78923j32527L74878L9797j10126q5505j27711J32077
16400C69806E9880M11321O817K33202k61196j3219k2473n052j8851P7767J14041
16389E82237j2321k76393K75658k62689j09914J39930N0688j74138k9753m5906
$$ plain form
16461 635813 606287 1041978 840601 1099766 718592 650663 635457 726649 413130 827139
16451 827139 586855 797415 595159 803026 714001 660762 891810 679064 996924 758930
16441 758930 817369 753589 547806 615282 641254 710922 727236 643603 451085 561347 716662
16430 716662 595910 782444 467263 310593 551234 592590 589164 849389 732146 720415
16420 720415 785220 192934 733219 648646 719847 562164 743930 695781 534740 290991
16410 290991 504794 569128 278923 146396 521274 561071 450945 365440 237729 369806
16400 369806 59880 471201 478018 711220 450024 436805 414332 409280 390429 468196 582237
16389 582237 569916 293523 569181 306492 196578 336508 387196 213058 183305 137399
16379A37399K50242j3887k8579R5181k0501A74919j7648J54162j13534N1922r1658
16368A58163M10055m0219o0428j67737N1338m6010G103K61465M8789K00568I3689
16356B46253A11559M58930j4685B26347K82560j08526B3973J87483o545K97093
16346E02004k27642A14325K46987J17970B20662m7947E1928L79907B06252L41407
16336E47659k40505L3551J0377F1217O20573r3677B91838n5025a85437G4976K72829
16325C47805A01265J06630q7356M7317O2995A00562j0633A3268K39524d4501C48453
16313a99525E29385A46073J39404r1350C6538K09429j972j0202a11437A53529
16302A22043O3734K02127m0072j49579j3897L20913k50639j15780L81438k38122
$$ plain form
16379 137399 387641 373754 345175 440356 419855 174919 157271 311433 197899 249821 158163
16368 158163 568218 527999 467571 299834 351172 305162 7103 268568 317357 517925 93689
16356 246253 111559 570489 555804 226347 508907 400381 23973 211456 204911 502004
16346 502004 274362 114325 361312 479282 220662 172715 51928 431835 206252 547659
16336 547659 307154 340705 351082 61217 681790 588113 291838 236813 -185437 74976 347805
16325 347805 101265 207895 120539 167856 230851 100562 89929 13268 252792 -44501 348453
16313 -199525 529385 146073 285477 194127 36538 245967 243995 233793 -111437 153529
16302 122043 185777 387904 347832 198253 184356 505269 254630 138850 520288 282166
16292B82166L2291r1869J40361A63740K14058p660A16916b9644A04225D2535J48910
16281A91445E8819J22351J69783d15387A36691j2653a5394D09139r5177k3646
16271B90316G8173b5908R522A7844p345J45916M8476G3465b6119B36366A00373
16259D69674B0875J4192J29703A9019Q9692D892J64401a43569I7547h835B7304
16247B49871O1399J61713A42118l5167j5446g3138D43964a44976c1364B73699
16236D2079J40109q9018J26762e7885G7089a44913C24147A57449o4488K4706e5711
16224A43092c421C5332g5576B27921r0993M0664p201p520d7815C94945b43716
16212F7611J20250K2668a5783C39951A01710M9509n9108R6240B8561P7043l6449
$$ plain form
16292 282166 314457 222588 362949 163740 377798 370138 116916 -29644 104225 42535 191445
16281 191445 58819 181170 350953 -415387 136691 124038 -15394 409139 313962 290316
16271 290316 78173 -25908 -16386 17844 10499 156415 204891 73465 -26119 236366 100373
16259 469674 20875 35067 164770 19019 108711 4892 169293 -143569 97547 -8835 27304
16247 249871 311270 472983 142118 106951 91505 -73138 443964 -144976 -31364 273699
16236 42079 182188 93170 219932 -57885 77089 -144913 324147 157449 92961 117667 -55711
16224 143092 -3421 35332 -75576 227921 136928 177592 170391 162871 -47815 394945 -243716
16212 67611 187861 210529 -15783 339951 101710 151219 92111 188351 28561 105604 69155
16201F9155J53959j3443p0657G786J76398n897l9015b78168H463r13L39290A28466
16188B62952a45472F8878b2149F4279a40018B58171a1071m7010o706q8861c9124
16176a40305r1475E4266K31148j10361g8226L1661F0382J9846I295b0650A37342
16164B9226e26579h0669C88528C3287f9194A25083O4761r3797Q777k535G333J00108
16152A07441J43738B6145J68547b25442A58145b3610B97079j25347K0012a03590
16141a8682A33279J26196j5225a11916B28389j11580j7749c8153r4127F204f02
16129A76038b31410A60962J4521n294C7440J78005f7320k49884F5371P0691d016
16117C40346b78485D6202b6107m91878E2898J2976N7850J33129d3467k5889k564
$$ plain form
16201 69155 223114 209671 139014 7786 184184 178287 139272 -278168 8463 7550 346840 128466
16188 262952 -145472 68878 -22149 64279 -140018 258171 -11071 -58081 -64787 -153648 -39124
16176 -140305 -231780 54266 285414 175053 -78226 -46565 60382 80228 9295 -20650 137342
16164 29226 -526579 -80669 388528 33287 -69194 125083 189844 96047 104824 102289 7333 107441
16152 107441 251179 26145 194692 -225442 158145 -23610 297079 171732 191744 -103590
16141 -18682 133279 259475 244250 -111916 228389 116809 99060 -38153 -132280 6204 -602
16129 176038 -231410 160962 175483 170189 37440 215445 -67320 -317204 65371 136062 -4016
16117 340346 -278485 46202 -26107 -517985 52898 65874 123724 256853 -43467 -69356 -71920
16106g1920E1414e14759A52980C7752a83973G603J5489J04874k2301C2195O466
16095C8661J01213m7335a89802A21592b6091G2567a37416C32958j59478J21213
16085B94693A20710K32895j60339G8454a28290d9674j70777P4795J780K3909B382
16073A34571i6413C1149J009a92032O836N091L8633K4290j26785C388b22559A58953
16060G7088f3421j31767l9661e0419k6589k14891A24656C8313b01646A47924a42245
16048B32625e6335B19406g9017C7046a95870M1643K8195l00783J19595a26309
16037A52235O616a65328A15982R463a00778k4806B26733A4523b03136A34760d9729
16025B87286a13966C597b48543a20802M2486L935A16193b21250K7848j97586A28292
$$ plain form
16106 -71920 51414 -514759 152980 37752 -183973 7603 23092 127966 105665 32195 38661
16095 38661 139874 92539 -189802 121592 -26091 72567 -137416 332958 173480 294693
16085 294693 120710 353605 193266 78454 -128290 -49674 -220451 -145656 -143876 -119967 2382
16073 134571 -96413 31149 32158 -192032 -185196 -180105 -141472 -117182 -243967 3388 -222559 158953
16060 77088 -63421 -195188 -234849 -50419 -77008 -291899 124656 38313 -201646 147924 -142245
16048 232625 -56335 219406 -79017 37046 -195870 -154227 -126032 -426815 -307220 -126309
16037 152235 158851 -165328 115982 125445 -100778 -125584 226733 14523 -203136 134760 -49729
16025 287286 -113966 3597 -248543 -120802 -78316 -74381 116193 -221250 -193402 -390988 128292
16013B16386c55186f8837I0607e4950j52446B81267b03865P2893B5024M5867B9345
16001a35195q9226A92706E0564M2175d15191G1552L70451g089B28158C296b0391
15989G8814b70334J17912D1372b53006D1683P3745e3534l2803E9266c9018k33631
15978b72649f0238j52737R4418j59013b5366A06234m419k136J14088K10890M7687
15967D72344j46316j48821k4977F222J43140M1150a79993C93620d4138o9252L2347
15956h1043e276j45624A70590D4493c05091A06483a45657I131J52919i306A28153
15944g1168B4734j1610g8813H1785K5960m9918B4218K40464p1153n2910a67842
15932c70285A90165r877a07159j5332a8903D1686a5763r0185k04016b0587k8469
$$ plain form
16013 216386 -355186 -68837 90607 -54950 -207396 281267 -203865 -130972 25024 70891 29345
16001 -135195 -224421 192706 50564 92739 -415191 71552 442003 -7089 228158 3296 -20391
15989 78814 -270334 -152422 41372 -253006 41683 115428 -53534 -86337 59266 -39018 -272649
15978 -272649 -60238 -212975 -118557 -277570 -25366 106234 101815 99679 213767 424657 472344
15967 472344 326028 177207 152230 6222 149362 190512 -179993 393620 -44138 -113390 -81043
15956 -81043 -5276 -150900 170590 44493 -305091 106483 -145657 9131 162050 -9306 128153
15944 -71168 24734 13124 -78813 81785 107745 57827 24218 264682 193529 140619 -167842
15932 -370285 190165 180288 -107159 -122491 -18903 41686 -15763 -105948 -309964 -20587 -49056
15921d9056j94708g368K934E9111M8855A1186f8796A29587a1169p703l7033N554
15909e0351G5491J02193J2778k0224K02094j40597H2171J1703A9637M4618e5658
15897b38619L8259A35462n0920k0934B7552b82347A37323J5545d04213a03354
15886b42278B5889i5584B04414i0786H7850O5707R5867A24461a20256B08721a73739
15874C3828a79445C28920G5871a18031L4862D45849g7322k71436A09006c50177
15863a47683b5311q9552M5648r4753j76078D5514b86734a03702d6010j45382g6321
15851a1791j16190A31653a86218k17020J67789b939B94898F0110J20716d9753
15840A63125d7989k29426a26037H2334J60532H3728b41125a7534k13411F1550
$$ plain form
15921 -49056 -243764 -7368 -4434 59111 107966 11186 -68796 129587 -11169 -18872 -55905 -50351
15909 -50351 75491 177684 190462 170238 372332 231735 82171 93874 19637 64255 -55658
15897 -238619 -200360 135462 84542 63608 27552 -282347 137323 152868 -404213 -103354
15886 -242278 25889 -95584 204414 -90786 87850 153557 249424 124461 -120256 208721 -173739
15874 33828 -179445 328920 75871 -118031 -83169 445849 -77322 -348758 109006 -350177
15863 -147683 -25311 -114863 -69215 -163968 -340046 45514 -286734 -103702 -46010 -191392 -76321
15851 -11791 -127981 131653 -186218 -403238 -235449 -2939 294898 60110 180826 -49753
15840 163125 -47989 -277415 -126037 82334 242866 83728 -241125 -17534 -230945 61550
15829E0255K04692d4471m9300d2644r2538A35236e6542b119q8775j87960F9601
15817g382j12847n6960O6999d5119I9377a13642k8024k9748O8787q1991E867a15795
15804d17602C7338F608b2564F5117J64662A14809c02347a49205I3428K50437a81407
15792g8664k08149B927e0227l8644j5621F9549a0899j53865A14904E3517J34861
15781A88378a15766M3464B29152A08268E0926b2139q9680B96408l0174d8718j14776
15770a63494C2417c82761B22610F2454c56646a68153A16812c20385B29575m9427
15760A80148F1483C308a34307D00495B8050K51573e8487o8408J3325F3055a84189
15748A86189f8838j68650I0306a15173B9514a53347e9359k0991j45245E4778k713
$$ plain form
15829 50255 254947 -44471 -93771 -42644 -135182 135236 -56542 -2119 -90894 -278854 69601
15817 -7382 -120229 -177189 -110190 -45119 99377 -113642 -141666 -171414 -102627 -184618 5867 -115795
15804 -417602 37338 6608 -22564 65117 229779 114809 -302347 -149205 93428 343865 -181407
15792 -78664 -286813 2927 -50227 -88871 -104492 69549 -10899 -164764 114904 53517 188378
15781 188378 -115766 -72302 229152 108268 50926 -22139 -111819 296408 266234 -48718 -163494
15770 -163494 32417 -382761 222610 62454 -356646 -168153 116812 -320385 229575 180148
15760 180148 61483 3308 -134307 400495 28050 279623 -58487 -126895 -113570 63055 -184189
15748 186189 -68838 -237488 90306 -115173 29514 -153347 -59359 -80350 -225595 54778 52065
15737E2065K2303f004o9428F5209M125B6847Q2677a77739P2394a3359A5055O4349
15725G9404A1565a04656j70613e0972j20509j60466J27674f0702A96201M2500
15715B38701a8585j65151B85311D728M52233A54577c27747E7022c34309H4471
15704a9601m199D243J21045k5475a34894C4913c07881a45764q8406B28200A2667
15692a4117o1395m681j55142A57799j8280A9266b55308c7536a7717o8287K3685
15681f2319C1478N2239E600a4733j81968L7586M9606J3297I4094d3608A13823
15669B85018a69559B87012b6349C2871f6205A7725a86507H3932m1844J26769a96470
15657A7757b75459D3299L1692M7435k4383g9535A86943a60913K3720c3524p5526
$$ plain form
15737 52065 74368 -6004 -75432 65209 69334 26847 109524 -177739 -105345 -13359 15055 79404
15725 79404 11565 -104656 -275269 -50972 -171481 -331947 -204273 -60702 196201 238701
15715 238701 -18585 -183736 285311 4728 456961 154577 -327747 57022 -334309 84471
15704 -19601 -23800 4243 125288 99813 -134894 34913 -307881 -145764 -234170 228200 12667
15692 -14117 -75512 -80193 -235335 157799 139519 19266 -255308 -37536 -17717 -86004 -62319
15681 -62319 31478 83717 5600 -14733 -196701 -159115 -109509 -96212 94094 -43608 113823
15669 285018 -169559 287012 -26349 32871 -66205 17725 -186507 83932 42088 168857 -196470
15657 17757 -275459 43299 74991 122426 98043 -79535 186943 -160913 -137193 -33524 -109050
15646a09050k71607a02758C04184g9381E5643K9411J7048m4891b13896G1587g6066
15634d15448D9772J17452b57836K9205A73659d939m3310A82354f6436B43148Q7488
15623C30636b54871A21968K623g0228c0623D9100k2835b77610C2661i6458C65898
15611A81987M6341G912f1837D3911e9517i062j98685D1639N5475f7799I8081d05057
15598b19941E0235e9388k7636c6456A26309d8464j57764p4099k3077M818D3068
15586C32242A56963a30225l4780F3364b9972j26829j57507F4907a11167A89621
15575d3864k09809B6125K43514c4472B12703e6751R906C43122b81322a7252q8680
15564a05932M543G3621L67570j10775A22611c2436G9819c41046a58740N4095A01626
$$ plain form
15646 -109050 -380657 -102758 304184 -79381 55643 85054 102102 57211 -213896 71587 -76066
15634 -415448 49772 167224 -257836 -228631 173659 -4939 -48249 182354 -66436 243148 330636
15623 330636 -254871 121968 124591 -70228 -30623 49100 26265 -277610 32661 -96458 365898
15611 181987 228328 7912 -61837 43911 -59517 -9062 -207747 41639 97114 -67799 98081 -405057
15598 -219941 50235 -59388 -87024 -36456 126309 -48464 -206228 -280327 -303404 -298586 43068
15586 332242 156963 -130225 -165005 63364 -29972 -156801 -314308 64907 -111167 189621
15575 -43864 -253673 26125 269639 -34472 212703 -56751 -46845 343122 -281322 -17252 -105932
15564 -105932 -101389 73621 441191 330416 122611 -32436 79819 -341046 -158740 -104645 101626
15552A17578l8350g6008n38A14966D2599M12853e802j00492A07626D6909a5576
15540b08946A13236M63165a83880D3197J42206P1786q310b50015C03970a60125
15529a3253C84189b2736o9663B3924b50736c3356k9332r6310j2871A14634a68542
15517a0701B49912b94644e1698J5986H6015L5803D1912K06611a03903m878K320
15506a06461o8624A03772K5523P4634a47801A29841e5429B67419a78823b3325
15495b3019G7325i1552b7291j6693k50662a16143j51790a09809H7753K92647c57134
15483a7161j26596e0050k11199E1535k0925d9101p5735j87535a16742d6223j8721
15472f4944A72544e4314l3523j11335C67353a66160e4449l22823e2174I3862C2704
$$ plain form
15552 117578 79228 -76008 -76546 114966 42599 455452 -5802 -106294 107626 46909 -15576
15540 -208946 113236 576401 -183880 43197 185403 257189 248879 -250015 303970 -160125
15529 -13253 384189 -22736 -92399 23924 -250736 -33356 -62688 -158998 -171869 114634 -168542
15517 -10701 249912 -294644 -51698 -35712 86015 121818 41912 248523 -103903 -108781 -106461
15506 -106461 -175085 103772 129295 203929 -147801 129841 -55429 267419 -178823 -23325
15495 -23019 77325 -91552 -27291 -43984 -294646 -116143 -267933 -109809 87753 380400 -357134
15483 -17161 -143757 -50050 -261249 51535 30610 -49101 -124836 -312371 -116742 -46223 -64944
15472 -64944 172544 -54314 -87837 -199172 367353 -166160 -54449 -377272 -52174 93862 32704
15460B98172b09452G2453b30302j85374J99246N3396A99186H5268J76650a68460
15449h8873C3321O4396c540p2627B01197Q0028o9517c34389a11460A83684q0502
15438A03182A612Q0975j1304J41474a51904j51146k56804H9201J30454I0565a43212
15426g1314q9219j36090b4739E3954e7961E8214a50851n1464f9065k76379A48959
15414c41623b1565k22643A29650a85554c8913j04994C31962i846j1355m0799A35451
15402I4829e4037A36020c69172D616Q6236J28244i5652G0747K16185d9570j12627
15391a62197o0690G0982K17931b69687A20272d2839H9187c6050j04504m9960c822
15379G4091g6444a0379j59947L3538k6932K6121D1400R1875J1902b91949J02737
$$ plain form
15460 298172 -209452 72453 -230302 -415676 -216430 -163034 199186 85268 261918 -168460
15449 -88873 33321 97717 -3540 -76167 201197 281225 211708 -334389 -111460 183684 103182
15438 103182 1612 82587 71283 212757 -151904 -303050 -559854 89201 219655 90565 -143212
15426 -71314 -160533 -296623 -24739 53954 -57961 58214 -150851 -202315 -69065 -345444 148959
15414 -341623 -21565 -244208 129650 -185554 -38913 -143907 331962 -9846 -21201 -62000 135451
15402 94829 -54037 136020 -369172 4616 90852 219096 -95652 70747 286932 -49570 -162197
15391 -162197 -222887 70982 288913 -269687 120272 -42839 89187 -36050 -140554 -190514 -3822
15379 74091 -76444 -10379 -170326 -136788 -163720 -137599 41400 133275 145177 -291949 -189212
15368a89212A21605a7407B42144M5564p1537a56101q1395B053c65686a55233j07880
15357b63113J03702i712B42001B7278L7043a02694A26683l3486k1234b30893B92256
15345a24094C9802a10522G0655M5798a59768o912a8488A30946a69196b4369D1869
15333C66353a7475k84969i2445A26822m0919a39286d6821E3338A132J21410j9269
15322A03273L5670j3662b57326h2233c0601A26201Q4667a62138A54765e0277m658
15311e4935I1284j6357J74252q7823e7748D6846Q928a73228M8060B1107J51875
15300A72982e1247C4702K39724a04037j22112c4548j326k42701a28608A49505
15289B34891r9987F6590O4280O353D0849K26707A29382b34467B33601a12132F5847
$$ plain form
15368 -189212 121605 -17407 242144 287708 216171 -156101 -237496 2053 -365686 -155233 -263113
15357 -263113 -159411 -9712 242001 27278 64321 -102694 126683 93197 71963 -230893 292256
15345 -124094 39802 -110522 70655 116453 -159768 -166680 -18488 130946 -169196 -24369 41869
15333 366353 -17475 -302444 -92445 126822 85903 -139286 -46821 53338 1132 122542 103273
15322 103273 138943 125281 -257326 -82233 -30601 126201 210868 -162138 154765 -50277 -54935
15311 -54935 91284 74927 249179 161356 -57748 46846 55774 -173228 -125168 21107 172982
15300 172982 -51247 34702 274426 -104037 -226149 -34548 -35874 -278575 -128608 149505
15289 234891 134904 66590 130870 137223 40849 267556 129382 -234467 233601 -112132 65847
15277e3567A84681a3670m942o8652B7165J99284E9707f4566B54838J9417J76020
15266D50275A38506K88677A19772K90491A16731J73119o1440a13784D1019a37515
15255b21198A62326k3641b32893H2594j1595C0740b33013E3437o457K2162J14637
15244A83779a59831H0989J60062o2131C4913K7378Q7670B6934J88532L61493L99534
15233I76493N32101l00702m4728m7951m61804r6903j47032f4716B03306p3418
15223A29888E1215N0042d7810A60446Q0381e1428C29344a70030A00177J90010
15213B90187j09427b09576A89673G0423c3172B66388h3422A40100D1633N5867
15203I7500B2193J00758n6730P3126a74644c1959F1655A2392a14496p5956H5414
$$ plain form
15277 -53567 184681 -13670 -18612 -87264 27165 226449 59707 -64566 254838 274255 450275
15266 450275 138506 427183 119772 410263 116731 289850 228410 -113784 41019 -137515
15255 -221198 162326 138685 -232893 82594 70999 30740 -233013 53437 46980 69142 183779
15244 183779 -159831 80989 241051 178920 34913 62291 149961 26934 215466 576959 976493
15233 976493 1508594 1207892 1163164 1115213 653409 556506 409474 -64716 203306 129888
15223 129888 51215 101257 -47810 160446 240827 -51428 329344 -170030 100177 290187
15213 290187 180760 -209576 189673 70423 -33172 266388 -83422 140100 41633 97500
15203 97500 22193 122951 66221 139347 -174644 -31959 61655 12392 -114496 -190452 85414
15191A58908J867n4934J138L17518g9467A62952a48197b3685B70637J4552i0291
15179a40044D9658A8358d3931A4276J70055N9943b7528j85758a06008a9935j4555
15168c4490C8346L09630a63547E677J81330o6147n2027c30897C06794a32278B43040
15156a20681e2552A70590f0567p7393N7085K0883B24082J91019f1922B68237j26983
15145A41254a69041j70306A56134L10957A78255j0092F2578Q6752D4498a3237
15134h7011A04331e0684F4248J30677o3442a54328I6429M2090m6750K13426F3952
15122G0332J62560p7398l2093D2049a12674o8431G5168J66284F2106J22759J33176
15111C18041A04447b05263B44612j4361A04733D3637J44177h0833A78841q3978
$$ plain form
15191 158908 160775 105841 106979 424497 -79467 162952 -148197 -23685 270637 285189 -90291
15179 -140044 49658 18358 -43931 14276 184331 244274 -27528 -213286 -106008 -19935 -34490
15168 -34490 38346 347976 -163547 5677 187007 120860 68833 -330897 306794 -132278 243040
15156 -120681 -52552 170590 -60567 -137960 -80875 -59992 224082 415101 -61922 268237 141254
15145 141254 -169041 -339347 156134 467091 178255 168163 62578 149330 44498 -13237
15134 -87011 104331 -50684 64248 194925 131483 -154328 96429 138519 91769 305195 63952
15122 70332 232892 155494 123401 42049 -112674 -181105 75168 241452 62106 184865 318041
15111 318041 104447 -205263 244612 230251 104733 43637 187814 -80833 178841 94863
15101I4863L51972E7594B1535c26719C53116a26925B94191p2378J48625A16674
15090g6440J3927H3740a85845A05095b5592A2787K27885l7721c8319I6201e2693
15078B187J13699M809L2581J56715k4581H3447K10589A41247a96319C893g2508
15066E9673r802J47511f7258A43910J46293A29936J12300d8941H5118L47372A86055
15054B61751c02958A24200J8798L67031a91009D4121J16155J16971I8124K7210
15044A25334J28243J61424j45152J28479A72602B1009M83730A70835F2935L5421
15034I8356K14327A4936M49937a22796B44710j20940D5519K88288a20551B75150
15023C31576j06816n3481J83526A75052G6347K93398H7352J55539A07799K23538
$$ plain form
15101 94863 446835 57594 21535 -326719 353116 -126925 294191 221813 370438 116674
15090 -76440 -62513 83740 -185845 105095 -25592 12787 240672 202951 -38319 96201 -52693
15078 2187 115886 120695 153276 309991 285410 83447 294036 141247 -196319 3893 -72508
15066 59673 49871 197382 -67258 143910 290203 129936 242236 -48941 85118 432490 186055
15054 261751 -302958 124200 142998 510029 -191009 44121 160276 277247 98124 125334
15044 125334 253577 415001 269849 398328 172602 21009 504739 170835 62935 98356
15034 98356 312683 14936 464873 -122796 244710 123770 45519 333807 -120551 275150
15023 331576 224760 171279 354805 175052 76347 369745 87352 242891 107799 331337
15013C31337j13789h6520C873K7647K74290k8103A2713K76147F5303K05957n30
15002B70730A2629L11059j45917K34909A40157N04303j85426A92816K28408I0549
14991D70596q2697j04113D1363J47526J956K25893A25774i8099A15237K57348
14981C72585A19398b3151A43078o1409J30085b62222A00991K2512K7089K90789
14971D41381G5350J92963N0722m8311A25897f9532A41499E2444K61743O323a2611
14959B86141j33001M22067F0681K51639j20174A9895M58305B18725F4675b31067
14948A50753K59954j89989I1807L2090L30989A02511J10029M9431P5780I3336
14937G5258K27299M3522M5762N8229A45874J21323A5848a44194A02586K85154
$$ plain form
15013 331337 217548 -86520 3873 31520 305810 277707 12713 288860 65303 271260 270730
15002 270730 12629 323688 177771 412680 140157 644460 459034 192816 421224 90549
14991 470596 387899 283786 41363 188889 190845 416738 125774 -98099 115237 372585
14981 372585 119398 -23151 143078 81669 211754 -262222 100991 123503 150592 441381
14971 441381 75350 268313 319035 270724 125897 -69532 141499 52444 314187 320510 -12611
14959 286141 153140 575207 60681 312320 192146 19895 478200 218725 64675 -231067
14948 150753 410707 220718 91807 123897 454886 102511 212540 261971 337751 93336
14937 75258 302557 346079 391841 450070 145874 267197 15848 -144194 102586 387740
14927C87740p3157I2356L78679A20333L5745J59955J3063n0660M6006A37231J13179
14916B50410A23954J93115a6185A46124c2818C30919A29408P9577l4386J38503
14906C13102K03565b37708D87206j62799r503P9475o6789j62454J57736J7795
14896C40667E1027K81185J29136A3566K71877O1561j56658B0991M44407h469C18665
14884E49708A82436p7246K30117E9372O9899J56125n7016L80375k91052K07287
14874E24990B06301K4372A10899K0535J30901m9577K32091p7737J02469j83509
14864B86072L40391j35878A65646K15778J98344o4261G2194E516J47342K46614
14854C99472K18626B06958K77219j62503R664q1119J50637J82110j48839n8278
$$ plain form
14927 387740 314583 92356 471035 120333 156078 316033 329096 278436 324442 137231 250410
14916 250410 123954 317069 -16185 146124 -32818 330919 129408 208985 174599 313102
14906 313102 516667 -237708 487206 324407 314904 394379 327590 165136 322872 340667
14896 340667 51027 332212 461348 13566 285443 347004 190346 20991 465398 -8469 318665
14884 549708 182436 105190 335307 59372 129271 285396 228380 608755 317703 524990
14874 524990 206301 230673 110899 131434 262335 212758 444849 367112 469581 286072
14864 286072 626463 490585 165646 381424 579768 515507 72194 5516 152858 399472
14854 399472 618098 206958 484177 321674 331338 250219 400856 582966 434127 375849
14844C75849J06283o3080j64252r012o3942J12829J12174A99061K92818J45005
14834F36884j58422A970M02447j11556K77426m3257A98424K14614J5223N114N2658
14823D86033r4873J5255K89722B74338L88660j54020B24624M18898q3950k74991
14813B84581J95023J14700l7271P362k29309j05788P5973K66065N0557j53383
14803D68510k855J58979J04896k10515L51231k77373j78175p0267M42542C53549
14792A77560R7514K78904P0927j31224J22310k18696J06771j92944K98841A40268
14781C54094O1160J56853n6177q4338J73403k70836j08155K47796K59296j80670
14771E52426J23096l20771o3266k218j36084M71176K01780C14231L30411P9863
$$ plain form
14844 375849 482132 419052 254800 245788 181846 294675 406849 199061 491879 636884
14834 636884 478462 1970 404417 292861 570287 527030 198424 413038 428261 433375 486033
14823 486033 391160 406415 696137 274338 662998 508978 224624 643522 559572 284581
14813 284581 479604 594304 557033 564395 335086 229298 305271 571336 621893 468510
14803 468510 465655 624634 729530 519015 870246 592873 414698 344431 786973 353549
14792 177560 275074 553978 624905 493681 615991 397295 504066 311122 609963 140268
14781 354094 415254 572107 515930 431592 604995 334159 226004 473800 733096 552426
14771 552426 675522 354751 291485 289267 153183 624359 826139 314231 644642 724505
14761G24505J14527l33774p5623K49332k99292P0030N3616K0044J84871j7068
14751F91168k82654L61746A14575J60484N17224l09997m9461K42592B06551M49205
14741F55756k01262L08379p1423L3132C59586n9989L44681Q1920k35880J1676
14731E01994L09261K13588l64795j56396L6710j96603K82482j97075J37226P6443
14721F42835j36802J68095J20797J00297J7310l30053J55860j39599O269K17142
14711H22151l2140q1995J71785j49948K63120k10508L6931p8528J17724r7626
14701G60966p3794M7841j24553P192L94917l04109P8611J6516k07667J25241K2913
14690G44074J62970j9746j60383N00588l81421J22169r7093K26112n0175k74220
$$ plain form
14761 724505 839032 505258 429635 678967 379675 449705 503321 523365 708236 691168
14751 691168 408514 770260 114575 275059 792283 482286 432825 675417 206551 655756
14741 655756 454494 762873 691450 724582 359586 299597 644278 726198 490318 501994
14731 501994 811255 1024843 660048 503652 540362 343759 626241 429166 566392 642835
14721 642835 506033 674128 794925 895222 912532 582479 738339 598740 605009 822151
14711 822151 790011 708016 879801 729853 992973 782465 819396 740868 858592 760966
14701 760966 687172 735013 610460 617652 1012569 708460 787071 803587 595920 721161 744074
14690 744074 907044 887298 726915 1227503 846082 968251 871158 1097270 1047095 772875
14680G72875j09819J01193k3064L58967E31435N15709K81240n55288q8051K32520
14670I17565j62341K44253J1294R7922K7756l50928j16502M31222K7530k52123
14660H75648L93184m72829K20638M7097m18179N64910l51972L15210M7561j56905
14650A064363j52186K74102m57865M58245k33019K52436j36705k43652o7655N20604
14640A278668l88564L8659J57750J69089j17095m2434M5888l49442O78778n18182
14630I53115M92155j79390j6475j37393J60136m9132m5191J84884n2997j6109
14620A293603j8762l0842L17025m50708J62925J23772j58984j65446K27350l19364
14610I80569M69070k51518J18177K5012K67104k59586p4210K84012k78669K59674
$$ plain form
14680 772875 663056 764249 741185 1100152 531435 1047144 1328384 773096 685045 917565
14670 917565 755224 999477 1010771 1108693 1136449 785521 669019 1100241 1127771 875648
14660 875648 1268832 796003 1016641 1063738 645559 1210469 858497 1173707 1221268 1064363
14650 1064363 912177 1186279 728414 1186659 953640 1206076 1069371 825719 758064 1278668
14640 1278668 890104 928763 1086513 1255602 1138507 1096073 1141961 792519 1471297 953115
14630 953115 1445270 1265880 1249405 1112012 1272148 1223016 1177825 1362709 1309712 1293603
14620 1293603 1274841 1243999 1561024 1110316 1273241 1397013 1238029 1072583 1299933 980569
14610 980569 1449639 1198121 1316298 1341310 1608414 1348828 1274618 1558630 1279961 1539635
14600A539635P3816l91419J90282k9860K61738M5274k96745L05450L3058j49681
14590A581548j17460K70466l52528L24333j71550K54157J97515k63072J34237
14581A857646k35506K3359j15436j65431L32595J15547l34448J10321j32139L80683
14571A837191l4753l5789m9919J58771q529j40410J20189K52172k57880j16584
14561A724459L69235j9935l24055K07789M86908k53238N0754q9789k12243M50006
14551B389891n9083J2216J8111K20141K8744O6506L15909l5298K22306K93571
14541C473014M5096N66811l7672O29561M74285J322153R63183K488482L904866
14532A3829779O868599R849845O050705j7107198r397467l356706j938901j114425
$$ plain form
14600 1539635 1613451 1222032 1412314 1382454 1644192 1689466 1392721 1698171 1731229 1581548
14590 1581548 1464088 1734554 1382026 1706359 1534809 1788966 1986481 1723409 1857646
14581 1857646 1622140 1645499 1530063 1364632 1697227 1812774 1478326 1588647 1456508 1837191
14571 1837191 1802438 1766649 1716730 1875501 1866972 1726562 1846751 2098923 1841043 1724459
14561 1724459 2093694 2073759 1749704 1957493 2444401 2191163 2241917 2152128 1939885 2389891
14551 2389891 2330808 2343024 2361135 2581276 2610020 2676526 2992435 2957137 3179443 3473014
14541 3473014 3518110 4084921 4047249 4676810 5151095 6473248 7436431 9924913 13829779
14532 13829779 20698378 30548223 36598928 19491730 10094263 6737557 4798656 3684231
14524C684231o66513k66522j30092n8801N4487M0713l20931K27255l00083O4086
14514B327830J98539q9417r5061O9642j21844J60320r4596j992N02496m90692
14504B365225K16868r2275P1307n0251k3840Q5835K04346j30271J29947q9623
14494B687268J02874J39869k46337K4L30405j6787p6032q743k58629Q9792O7777
14483B811481L74263j01887J80487j61097j06309L1688J72145L4019N2635n8308
14473C229117L30501m6373p4106K24582J3568m33412O27987j28369j41612j1218
14463C590665K3318K39183J14288j9676J27309M712m34786N89905k16869J69839
14453D187888K38528k79920q3148M52756j1019J00508P9705j4558J65648l14765
$$ plain form
14524 3684231 3017718 2751196 2621104 2562303 2616790 2657503 2336572 2563827 2263744 2327830
14514 2327830 2526369 2436952 2341891 2411533 2289689 2450009 2355413 2353421 2855917 2365225
14504 2365225 2582093 2489818 2561125 2510874 2487034 2572869 2777215 2646944 2776891 2687268
14494 2687268 2790142 2930011 2683674 2683698 3014103 2997316 2921284 2912541 2653912 2743704 2811481
14483 2811481 3185744 3083857 3264344 3103247 2996938 3028626 3200771 3234790 3287425 3229117
14473 3229117 3559618 3513245 3439139 3663721 3677289 3243877 3871864 3743495 3601883 3590665
14463 3590665 3613983 3853166 3967454 3947778 4075087 4079799 3645013 4234918 4018049 4187888
14453 4187888 4426416 4146496 4063348 4516104 4505085 4605593 4685298 4670740 4836388 4521623
14443D521623N08110r2203K54167l98976K20278J4483l1074L58163j96154Q1705
14433E240122L28117J09985n11931M19752R2485m9856N42903l40743l5801K29551
14423F024584p7751M20959k45042M38046k46046M66003j72953J21052J92910j42588
14413F779174J55946K49899M0328M9245M67198l02712N83024k83461L07682j12915
14403G933408J30082J800J58942P0081K97038k99235P17948j69490M13846o5221
14393I189199j58164L22099k9066O13156R5506k06808L91338M56050l24523K98823
14383A0647610M12836N5868n0821O93031k04569R1075R2485J91334O39832K23346
14373A2792027M00485l26550M57147K07840K98535L85403K99547M95576L24642
$$ plain form
14443 4521623 5029733 4937530 5191697 4792721 5012999 5027482 4996408 5354571 5158417 5240122
14433 5240122 5568239 5678224 5166293 5586045 5678530 5628674 6171577 5830834 5795033 6024584
14423 6024584 5946833 6367792 6122750 6560796 6314750 6780753 6607800 6728852 6921762 6779174
14413 6779174 6935120 7185019 7225347 7274592 7741790 7439078 8022102 7738641 8046323 7933408
14403 7933408 8063490 8065290 8224232 8294313 8591351 8292116 9010064 8840574 9254420 9189199
14393 9189199 9031035 9353134 9324068 9937224 10032730 9825922 10217260 10673310 10348787 10647610
14383 10647610 11060446 11116314 11065493 11758524 11553955 11645030 11737515 11928849 12568681 12792027
14373 12792027 13192512 12865962 13323109 13530949 13829484 14214887 14514434 15010010 15334652
14364A5334652J12372J57694N0339N30072M66342M09420J33465M38449M31257
14355A8064062L00978L35152M41986K38133L92789M36292R10469J15834O36810
14346B1872505j01392R96276P12129N97338j90619R85639K44125Q95681M29300
14337B6440982R12805M66381P72437P54453P55663R15903P67350O89587J033347
14328C3508908Q71016O75119J006209J027432J376161Q39505J326783R39975J131882
14319D2702990J575966R90897J548388J665879J589166J610178J613358J868371
14311E5165193J824591J837727J899438J989502K761610K275971K442139K266263
14303G2462434L136005K719944L733059L073385L434737L349517M043006L799529
$$ plain form
14364 15334652 15447024 15604718 15655057 16185129 16651471 17060891 17194356 17632805 18064062
14355 18064062 18365040 18700192 19142178 19380311 19773100 20209392 21119861 21235695 21872505
14346 21872505 21771113 22767389 23479518 24076856 23886237 24871876 25116001 26011682 26440982
14337 26440982 27353787 27820168 28592605 29347058 30102721 31018624 31785974 32475561 33508908
14328 33508908 34379924 35055043 36061252 37088684 38464845 39304350 40631133 41571108 42702990
14319 42702990 44278956 45269853 46818241 48484120 50073286 51683464 53296822 55165193
14311 55165193 56989784 58827511 60726949 62716451 65478061 67754032 70196171 72462434
14303 72462434 75598439 78318383 82051442 85124827 88559564 91909081 95952087 99751616
14295I9751616M669753M362196N024717M976068N516617N622931N888274P171182
14287A42983354O328099P623369P782003Q654010Q609181R284821J0266710J0154226
14279B11685773J1546953J1995165J2249929J2856460J3602984J4465523J5301556
14272C03704343J5456977J6157031J5558581J4805703J3981110J2552086J0982939
14265D03198770J0238629R041691Q485408P764953O560907N814704N586251M536174
14257D61227487J785418q73866q00414j933444q699947j0831683j1520331j0544867
14249D17808353j3177092j4484802j3364944j4185917j3663961j4566194j4216444
14242C20148999j3260694j3372956j2789724j2380665j2218377j1670773j1389330
$$ plain form
14295 99751616 104421369 108783565 113808282 118784350 124300967 129923898 135812172 142983354
14287 142983354 149311453 156934822 164716825 173370835 181980016 191264837 201531547 211685773
14279 211685773 223232726 235227891 247477820 260334280 273937264 288402787 303704343
14272 303704343 319161320 335318351 350876932 365682635 379663745 392215831 403198770
14265 403198770 413437399 422479090 430964498 438729451 445290358 451105062 456691313 461227487
14257 461227487 463012905 462139039 461338625 459405181 450705234 439873551 428353220 417808353
14249 417808353 404631261 390146459 376781515 362595598 348931637 334365443 320148999
14242 320148999 306888305 293515349 280725625 268344960 256126583 244455810 233066480
14235B33066480j0683806j0638081r330114r593688r347426q737618q388435q262745
14227A58084567p417873p447762o678511o081249n935921o172692m984943m803777
14219A08561839m900856m120005m108284l673966l587901l538192l635252l120343
14211G7877040k823703k872400k424106k840538k205995k242915j663160k333447
14203E8470776j982782j832273j479313j709253j573089j327063j801886j362045
14195D5403072r83065j321068j306326j033184q84891j471192j241355j257557
14187C5904434p08385o86335m26568j119235j275094o47388q99665p09210n32549
14178B8900005n41858r28980q20211m95695o78376n42408m48013p66369l36738
$$ plain form
14235 233066480 222382674 211744593 202414479 192820791 183473365 174735747 166347312 158084567
14227 158084567 150666694 143218932 136540421 130459172 124523251 118350559 113365616 108561839
14219 108561839 103660983 99540978 95432694 91758728 88170827 84632635 80997383 77877040
14211 77877040 75053337 72180937 69756831 66916293 64710298 62467383 60804223 58470776
14203 58470776 56487994 54655721 53176408 51467155 49894066 48567003 46765117 45403072
14195 45403072 44420007 43098939 41792613 40759429 39874538 38403346 37161991 35904434
14187 35904434 35196049 34509714 34083146 32963911 31688817 31041429 30141764 29432554 28900005
14178 28900005 28358147 27429167 26608956 26113261 25434885 24892477 24444464 23678095 23341357
14169B3341357n80895o02118l49883n71903m80661m11297l36622l94354q2211
14160A9531413m62178m00440m08907l17965m05301k22188m09724k98748m31872
14151A6174090j54064l89849k27654m15886j02426R432m34063k31930k5372j80364
14141A4021914l41163l40075l41390k89836M4784k12181m01567j03333o4503j93596
14131A1779054k88739j97999k39781m11296J56337m940l26842k08969k09325R3503
14121A0141003l47333j1924j05292o8019p9131j95543m73772j25712L60595k45653
14111H849219n44537K19445j65861J61415l07389j34773m39925K07375M0053l66997
14101G518025J06289J49062k50689n02016L52168k03828k3134J8842n3479j88771
$$ plain form
14169 23341357 22760462 22158344 21808461 21236558 20755897 20344600 20007978 19613624 19531413
14160 19531413 19069235 18668795 18259888 17941923 17536622 17314434 16904710 16605962 16174090
14151 16174090 16020026 15630177 15402523 14986637 14884211 14893643 14459580 14227650 14202278 14021914
14141 14021914 13680751 13340676 12999286 12709450 12754234 12542053 12140486 12037153 11972650 11779054
14131 11779054 11490315 11292316 11052535 10641239 10797576 10792636 10465794 10256825 10047500 10141003
14121 10141003 9793670 9781746 9676454 9608435 9529304 9333761 8859989 8734277 9094872 8849219
14111 8849219 8304682 8524127 8358266 8519681 8212292 8077519 7637594 7844969 7885022 7518025
14101 7518025 7624314 7773376 7522687 7020671 7372839 7169011 7145877 7164719 7111240 6922469
14091F922469l64155J42794j02977k71197J942J0598n9236L19032m22102J35337
14081F312505n13622J3976J68978l12373q2397n598j54915K22480o0937l66231
14071E221866K04393l14655J70001k49460j556N1178N3144j54041J4864k54583
14061D741151j61446R5575j65307M33866r3391k57194j0570j9719l26295J12151
14051D348821L08042m07598K70221j63743O410p5445j09252r2073J18843R9973
14041D304199l52876n1912m1169J27678j03584J99931n09613m3830K83304k82830
14031C529298L43373l13312K77731m79659J10916J53660K0144k2374m20072N93689
14021C793394l21026l16949L80311k07987n7971k87386K95588Q4010j22269o8919
$$ plain form
14091 6922469 6558314 6701108 6598131 6326934 6328876 6339474 6280238 6599270 6177168 6312505
14081 6312505 5798883 5812859 5981837 5669464 5587067 5581469 5426554 5649034 5588097 5221866
14071 5221866 5426259 5111604 5281605 5032145 5030589 5081767 5134911 4980870 4995734 4741151
14061 4741151 4579705 4675280 4509973 4943839 4850448 4593254 4582684 4562965 4236670 4348821
14051 4348821 4656863 4249265 4519486 4355743 4362153 4286708 4177456 4085383 4204226 4304199
14041 4304199 3951323 3899411 3858242 3985920 3882336 4082267 3572654 3528824 3812128 3529298
14031 3529298 3872671 3559359 3837090 3357431 3468347 3622007 3642151 3619777 3199705 3793394
14021 3793394 3472368 3155419 3535730 3327743 3269772 2982386 3277974 3361984 3239715 3170796
14011C170796k82938j68036P2153j11855M7414R4217k31053J40879j0271j71817
14001B549489j81169J90609O3753J06439K41864j8524k48953l98931L9505j68182
13991B175900L36282n806K63450l49327J14469k44646q1354N844K680R5002K79075
13980B591569m8764M79601M61373r0488O27048O71405J479509L000511O142646
13971A5314410J0230945J0023757j3973602q386153l554538k410142j754758n61355
13963D928564o46607k20703j48704l82069l25852j23241o2806k70661O0632n1360
13953B757193k50240r3485m85K7584j49928L97936l38240k39924k68512N49577
13943B391476n06398J30395J00140R8029r2248K5138J84818l74322J7416J04712
$$ plain form
14011 3170796 2887858 2719822 2791975 2680120 2727534 2821751 2590698 2731577 2721306 2549489
14001 2549489 2368320 2558929 2622682 2729121 2970985 2952461 2703508 2304577 2344082 2175900
13991 2175900 2512182 2506376 2769826 2420499 2534968 2290322 2208968 2214812 2217492 2312494 2591569
13980 2591569 2542805 3022406 3483779 3393291 4020339 4691744 6171253 9171764 15314410
13971 15314410 25545355 35569112 21595510 13209357 9654819 7244677 5489919 4928564
13963 4928564 4281957 4061254 3912550 3530481 3204629 3081388 3018582 2747921 2808553 2757193
13953 2757193 2506953 2413468 2412983 2440567 2290639 2688575 2350335 2110411 1841899 2391476
13943 2391476 1885078 2015473 2115613 2213642 2121394 2146532 2331350 1957028 1974444 2079156
13933B079156p3699j05538Q9227k58449J92838l19446M38247J0421j37286q9340
13923A826131k68980L48254n7211j19787J10518k93503J32389j03211K41814j3899
13913A802515k51807J30858J275n0594L4183L7369l4985P9506l71422J35899J29904
13902A642701j76691j29259K68432k6632k03074J07968K61098n65209N23339m83197
13892A219476o4147L92397J46513j86700O9676K34k88898K60985q5172L9051j61934
13881A341481R3357l05502K96686k70214L81009k97711K89000j05799m33311N05004
13871A494000k19670N2893J2430j32387L0887O0226J09258l72815J89318J52545
13861A376685j31755k0082K05364j71067n2649L8363l13304O0367Q4309K28951
$$ plain form
13933 2079156 2005457 1899919 1989146 1730697 1923535 1604089 2042336 2052757 1915471 1826131
13923 1826131 1557151 1905405 1848194 1728407 1838925 1545422 1677811 1574600 1816414 1802515
13913 1802515 1550708 1681566 1682841 1632247 1666430 1703799 1668814 1748320 1376898 1512797 1642701
13902 1642701 1466010 1336751 1605183 1578551 1375477 1483445 1744543 1179334 1702673 1219476
13892 1219476 1155329 1547726 1694239 1507539 1577215 1577449 1288551 1549536 1464364 1503415 1341481
13881 1341481 1434838 1129336 1426022 1155808 1536817 1239106 1528106 1422307 988996 1494000
13871 1494000 1274330 1327223 1339653 1207266 1238153 1298379 1407637 1034822 1224140 1376685
13861 1376685 1244930 1224848 1430212 1259145 1206496 1244859 931555 991922 1076231 1305182
13851A305182L2941k88452k7115J4445L98695k89345l3737N9701j83480J36692
13841A125527j24858L05072j00814L0121m05160J11795M1217j40919M70400k04011
13831A108370j83033L50648j36823k76481L09899l20395N63265l97775J32219
13822A149894n8525o0428K1430o1105p951L1512j50554K4748L13928l24996K01027
13811A078980k04742N7305K31122m4648K8039j93429j84037K12127q0324J71794
13801A072187K4141j24438k42222K43355M0700o1240m1116k5865J59469k44210
13791H00761J71624k31146L5717J86560J86429m75748J62786j42003L10768l8216
13781I67532k82188M3534P2040j40633K1459J52919m7466K31591M9305j07759
$$ plain form
13851 1305182 1338123 1049671 1022556 1037001 1435696 1146351 1112614 1172315 988835 1125527
13841 1125527 1000669 1305741 1204927 1235048 829888 941683 982900 841981 1312381 1108370
13831 1108370 925337 1275985 1139162 862681 1172580 852185 1415450 1017675 1149894
13822 1149894 1091369 1030941 1052371 991266 983315 1014827 864273 889021 1202949 877953 1078980
13811 1078980 874238 931543 1162665 1118017 1146056 952627 768590 980717 900393 1072187
13801 1072187 1096328 971890 729668 973023 1013723 952483 911367 885502 1044971 800761
13791 800761 972385 741239 776956 963516 1149945 674197 836983 694980 1005748 967532
13781 967532 685344 728878 800918 660285 681744 834663 787197 1018788 1068093 960334
13771I60334j32122r1236J28282k06968K55533O9219k34375k65534N24563k31228
13761G76468j49775J60372P6517J00596l20901J66900R8563C52289O20063j24550
13751H47802k23928M33033r1387l25517J31415l0611q3873j089j39351N45916
13741A062410k30480p0661L68208E47364Q2322j74538P0964O22458E11650M678
13731E16328J69692R1380L3843j14279j51727M7627j7682P9694p9400q8871K09785
13720F96390j1315k43334J41374K90890j7888m5021l12564k5614J24565M8592
13710F46075K6909L676j5067L173r532k41745K8518J56604l0993j93250L2938
13699D07306K39813J81862k23228L10064D05994Q0701l3292J87539p3087Q0431
$$ plain form
13771 960334 828212 736976 865258 658290 913823 983042 748667 483133 1007696 776468
13761 776468 626693 787065 863582 964178 643277 810177 908740 352289 972352 847802
13751 847802 623874 1056907 965520 640003 771418 740807 656934 655845 516494 1062410
13741 1062410 831930 761269 1129477 547364 629686 455148 526112 1148570 511650 516328
13731 516328 686020 777400 811243 696964 545237 592864 575182 654876 575476 486605 696390
13720 696390 685075 441741 583115 874005 856117 811096 498532 472918 597483 646075
13710 646075 672984 676660 661593 664766 655234 413489 442007 598611 567618 374368 407306
13699 407306 647119 828981 605753 915817 405994 486695 453403 640942 567855 648286
13689F48286j45905P834N7098K33587k50184R2907k10795K63119k45521L29260
13679G79686k36733K84351l58278K4292q9462N2061J47114p5415m4293L16130
13669G99453j50418n1635j24540J98059k19300j09082m1878J09790K35271o6395
13659E79325B66116J98857K1763L14172j88470N4967k85219J22885o7255M6532
13649D84348J2918M6233j89559j17936l3687K40680j25198L06218A83075J51260
13639C34335R7544j3330k1142K51302M590j42312j72772J63972o4506j60459O0372
13628C37594J19919o8816m894p0260K30760A51885J72319Q8069A48845L62213
13618E11058j05534J39104j22932K93714B44734L84561j44470j51532j49692m8544
$$ plain form
13689 648286 502381 510215 567313 800900 550716 643623 432828 695947 450426 779686
13679 779686 542953 827304 469026 493318 403856 455917 603031 527616 483323 799453
13669 799453 649035 597400 472860 670919 451619 342537 300659 410449 645720 579325
13659 579325 266116 464973 486736 800908 612438 667405 382186 505071 437816 484348
13649 484348 497266 543499 353940 236004 202317 442997 317799 624017 183075 334335
13639 334335 431879 418549 397407 648709 653299 510987 338215 502187 437681 277222 337594
13628 337594 457513 388697 383803 313543 544303 151885 324204 412273 148845 511058
13618 511058 405524 544628 421696 715410 244734 629295 484825 333293 183601 135057
13608A35057J8584J19402p3937L2246J2033J08321A15271M71104k07243J60129
13598E39261j71242J67859A85568Q2960J29839k7099P0402o3221J46610k25185
13588B99874L4954J37949k15242L21549n4550L9056j40333J15503K9425a16730
13577B11130K94395B32124M08913C14488A28669E6317M61471j7323j36385n8311
13567C05769p0950H0919L57108j6561L0024O6420P6113B27765K58863O1369j86359
13556C61638A67890K1677O56L5727K75168c6189B29485a6955D02699M5760A90221
13544D63071B13421R0334n8679L6489n6799L13857k8468a72823B29068B3939K58961
13533B82900j7973k4681a4515C53698C6678K61335P1150J74024j66852R265r1806
$$ plain form
13608 135057 153641 273043 199106 231352 243385 351706 115271 586375 379132 539261
13598 539261 368019 535878 185568 268528 398367 371268 441670 378449 525059 299874
13588 299874 334828 472777 257535 579084 524534 563590 423257 538760 568185 -116730
13577 211130 505525 232124 641037 314488 128669 56317 517788 500465 364080 305769
13567 305769 234819 80919 438027 421466 451490 517910 594023 227765 486628 547997 361638
13556 361638 167890 189567 190223 225950 501118 -36189 229485 -16955 402699 448459 190221
13544 463071 213421 303755 245076 281565 224766 538623 510155 -172823 229068 23939 282900
13533 282900 264927 240246 -14515 353698 36678 298013 369163 543187 376335 385600 293794
13522B93794J98422A73766K73737E6561j2211J46589M07859k19788j5774J48589
13512E11825j54591j78440L35647k43046R24J40125A32580K59003o5417o7284
13502B58882K36161j43241p2594K41155p2429j51566K75505j54956l9719o5618
13492C11580g3620C25565J67450k43871J5232d1596A5471N29160j39142J28031
13482E33520A26852L06815A63934K17884p4341Q3410A12276M15971A79599j9650
13472A59949F7713N24580H3689L25385b4821D20921B06799K01406n0192A28398
13461A10648J03532r8103K51584A69287J35129H9164J79751n3417L8876J53467
13451D07841k1410j20704g8359D88300B02054K7422G7165M62876H3512J25200
$$ plain form
13522 293794 492216 173766 447503 56561 44350 190939 598798 379010 363236 511825
13512 511825 357234 178794 514441 271395 272319 412444 132580 391583 326166 258882
13502 258882 495043 351802 279208 520363 447934 296368 571873 416917 377198 311580
13492 311580 -73620 325565 493015 249144 264376 -41596 15471 544631 405489 533520
13482 533520 126852 433667 163934 381818 307477 390887 112276 528247 179599 159949
13472 159949 67713 592293 83689 409074 -24821 420921 206799 408205 358013 128398
13461 110648 214180 116077 367661 169287 304416 89164 268915 215498 254374 407841
13451 407841 386431 265727 -78359 488300 202054 229476 77165 540041 83512 208712
13441B08712d691C20876J6560A56537K10708n6203P9894A72619K8639r0119L18065
13430D29204a16078B60016L42218A46571J56185j06488J54733p2239J2313j27480
13420A63595K50777G0428A514L79969m6391l2788K03524Q800A15939C0009C912
13408E28504j38758m3722Q8747G2900J09271J38896j04050j00005J49473G2824
13397B09501G1552L42116A74445P3990a28716l4785A79857c18855E05852B05197
13386F76260k28387a0825D68436A23659K30791R4206A73284o7072R7021q9656
13376A13577e6206A85048J73127n5117j41154J26075m3525K09425o3002j06023
13366B84854F1190J97465q2222E1529K42776o59L9949J38536A49748K00191p7033
$$ plain form
13441 208712 -4691 320876 337436 156537 367245 311042 390936 172619 201258 111139 429204
13430 429204 -116078 260016 602234 146571 302756 196268 351001 278762 291075 163595
13420 163595 414372 70428 1514 381483 335092 302304 505828 514628 115939 30009 3912
13408 528504 389746 346024 434771 72900 182171 321067 217017 117012 266485 72824
13397 209501 71552 413668 174445 248435 -128716 -163501 179857 -318855 505852 205197
13386 676260 447873 -10825 468436 123659 354450 448656 173284 106212 203233 113577
13376 113577 -56206 185048 358175 303058 161904 287979 244454 453879 390877 284854
13366 284854 61190 258655 176433 51529 294305 293646 333595 472131 149748 349939 272906
13355B72906m4528J00569A19733L17121r0086j61726M5547r8485d0132j0541A83367
13343D17200J57648N1433B58845n0541q0468L19081r7262P0303H1069L85475b14848
13331A03993M4071L0515J93970P9188N1448a43160D6449L04477j68982M70736
13321F52680B08614m9468c58A72498K41705j98244F4275K83575H4746K87257D6721
13309B13551B0402K69316j02369M0024L52547B60409H4302N14112j07838j03385
13299C87191b0H3258K92080l1371f0043B77714J19811j06317L3001a50336B78980
13287D81464G7212J1611K15374C3704a72930B5785K21219j21947K73925b3850
13276e4792b6870E69896A87123Q215Q9942e1498C75637m5565H5407L75866k17526
$$ plain form
13355 272906 228378 328947 119733 436854 346768 185042 230589 132104 -40132 -50673 183367
13343 417200 574848 626281 258845 208304 127836 446917 349655 419958 81069 466544 -214848
13331 103993 148064 178579 372549 451737 503185 -143160 46449 350926 181944 652680
13321 652680 208614 159146 -358 172498 414203 215959 64275 347850 84746 372003 46721
13309 213551 20402 289718 187349 227373 579920 260409 84302 598414 490576 387191
13299 387191 -20 83258 375338 343967 -60043 277714 397525 291208 324209 -150336 278980
13287 481464 77212 88823 304197 33704 -172930 25785 247004 125057 398982 -23850
13276 -54792 -26870 569896 187123 195338 285280 -51498 375637 330072 85407 461273 243747
13265B43747j06192n9689h5105E3884a9886k61432B56182b3664m8761A51424K99964
13254D51388A97013M0455G3446J41810a11915A79980C4812L15712A74493j1318
13244A63175p6049L53444a57702I9808J68653n7247B2393K8698J73074j9247d5889
13232B93979E2945J69365K17168A0876L4430a84326D1270j5073R9524J08002O3829
13221B97552A7879K9800a20464B70J14730J36686O69h5774I9099D9063O5441J26181
13209B40685P4452i7406p2476D23660A44126J22729A17085P1720r0327J16700
13199B15178J03133J1609C2439b34242h4726C21569h0625A88640K09479b50128
13188I0492K06950j04051J698H6269a21794C57486c51638e4709l1917j4254L8710
$$ plain form
13265 243747 137555 77866 -85105 53884 -19886 -281318 256182 -23664 -72425 151424 451388
13254 451388 197013 237468 73446 215256 -111915 179980 34812 350524 174493 163175
13244 163175 87126 440570 -157702 99808 268461 211214 22393 51091 224165 204918 -45889
13232 293979 52945 222310 439478 10876 45306 -184326 41270 26197 125721 233723 297552
13221 297552 17879 47679 -120464 270 115000 251686 252355 -85774 99099 49063 114504 240685
13209 240685 315137 -97406 -169882 423660 144126 266855 117085 188805 98478 215178
13199 215178 318311 329920 32439 -234242 -84726 321569 -80625 188640 398119 -250128
13188 90492 297442 193391 195089 86269 -121794 357486 -351638 -54709 -86626 -100880 -62170
13177f2170C53568f0193B81927J19534A05278Q8912F0109H529b09592C75947D9215
13165B43315A7354R6220f6583C69389F207J87961F8393J35680C0717j674M76047
13154E05090a9822D0144J46750k3813E3845a08280B25366p6619a20866C9790a34693
13142D3230a84618A01747a35425d5684A90671F6156A5817J3157K62358J1332K0884
13131C23548H7484K6024L8782a58455A31565L4103C0882d7301K0573I3963P6464
13120A70427a3997H1302h5374A61398M0608q0275a14394d5750F6461L0227L3528
13109A30216C46J53518C7188a31666A82806a84067A04264K0395M2942J79546A2323
13097G7269J99267p0176l7370a5713A94049F6456K8485j1970J16040c15400B03676
$$ plain form
13177 -62170 353568 -60193 281927 401461 105278 194190 60109 8529 -209592 375947 49215
13165 243315 17354 113574 -66583 369389 6207 194168 68393 204073 30717 29043 505090
13154 505090 -19822 40144 186894 163081 53845 -108280 225366 148747 -120866 39790 -134693
13142 43230 -184618 101747 -135425 -45684 190671 66156 15817 28974 291332 302664 323548
13131 323548 87484 113508 152290 -158455 131565 165668 30882 -47301 -26728 93963 170427
13120 170427 -13997 81302 -85374 161398 202006 121731 -114394 -45750 66461 96688 130216
13109 130216 346 153864 37188 -131666 182806 -184067 104264 124659 167601 347147 12323
13097 77269 276536 206360 168990 -15713 194049 66456 94941 82971 199011 -315400 203676
13085B40247k2955I4693J4565c3578B96456A47198A2998e1606a3123A4433K30986
13074B45419F1812A8800J47011A5270L33093C1454e471A47796J39961J40912c30506
13062F3020O9867l3350a67864C4525a00173B25922a5965j2890A27524l9798c37659
13050G5499B4766K14693E3062J03921j4803k2415a82970C80734H6815P4464h1982
13038a80516D8494d4630B46891I4368K5754J18011m2298K54557A15305a83223
13027A11734m0064L28721a07503C14403b22316f0119a8359k46039B5587J33583
13017A59170i6380C20045J77886j53939I8198L6797m8523K02461b2691H7095K25046
13006C12141h1806A89655h1737A797J69278m9470n7581i6238B09208A02561J55024
$$ plain form
13085 240247 217292 94693 109258 -33578 296456 147198 12998 -51606 -13123 14433 245419
13074 245419 61812 18800 165811 15270 348363 31454 -5471 147796 287757 428669 -330506
13062 63020 132887 99537 -167864 34525 -100173 225922 -15965 -28855 127524 87726 -337659
13050 75499 24766 239459 53062 156983 142180 119765 -182970 380734 86815 161279 -81982
13038 -180516 48494 -44630 246891 94368 120122 238133 195835 450392 115305 -183223
13027 111734 71670 400391 -107503 314403 -222316 -60119 -18359 -264398 25587 159170
13017 159170 -96380 320045 497931 343992 98198 134995 86472 288933 -22691 87095 312141
13006 312141 -81806 189655 -81737 1797 171075 121605 64024 -96238 209208 102561 257585
12995B57585k10J47436d2085A87701F4814a07693B84616F1284J34333d1292a2715
12983A71874L33169D4780J30077E5938K44762H5586a5344C14568q1295H3245J9615
12972A02860J62716H0099K1587J03435j4128L8513a5886l2660H8615b48305a13621
12960C76748A78853i5045G3151L50487F9049b37834K2034A64498c612D6340j440
12949D4900g0860A30333K32586j49069a67575B64872J39b07738N3329N2537D22791
12937A65102P2562G3668c2792I1606J3602e6004B35891A02001J0575i8374C7993
12925h2904A04032f9566r1955H5162O820J96206m8009k5124a19547c4603D07915
12913A89086F0011a69696G5954J71817a60217B51786a27190H5154K92879A07304
$$ plain form
12995 257585 257375 404811 -42085 187701 64814 -107693 284616 61284 195617 -41292 -12715
12983 171874 505043 44780 174857 55938 300700 85586 -15344 314568 233273 83245 102860
12972 102860 265576 80099 101686 205121 190993 229506 -15886 -48546 88615 -248305 -113621
12960 376748 178853 -95045 73151 423638 69049 -237834 -215800 164498 -3612 46340 44900
12949 44900 -70860 130333 362919 213850 -167575 264872 265011 -207738 -154409 -101872 422791
12937 165102 237664 73668 -32792 91606 105208 -56004 235891 102001 112576 -98374 37993
12925 -82904 104032 -69566 -161521 85162 91982 288188 240179 215055 -119547 -34603 407915
12913 189086 60011 -169696 75954 247771 -160217 251786 -127190 85154 378033 107304
12902E19515a41329b6758k0089a2414H8206L41580B01236c3384J5230B16928l9436
12891A77492b168B47742i5924B29582J50449A43784g1632A1674K22647a21796
12880A32706j523a4591A87713p5293I173J24880b44404A51461J44096C5479K04217
12869B39696d6886B61934E4665c31604f6366q3127k15296b4841j52742c1159C69093
12857A96994a96622B29001Q9822A56611J35881i0742p5418E0437H131J583K13016
12846B22730c40912a30150A75416N7875h582B9346b07704B38033f0779o3829B00107
12834A50484G5163P4085H886a78115B06573d4065H9090e2001A03443a49883A1886
12822b38027a03167o0709M7505A2918b97586c7973B5395d8509B07910i5272L1825
$$ plain form
12902 519515 -141329 -26758 -46847 -12414 88206 429786 201236 -33384 -18154 216928 177492
12891 177492 -2168 247742 -95924 229582 380031 143784 -71632 11674 234321 -121796
12880 132706 131183 -14591 187713 112420 9173 134053 -244404 151461 295557 35479 239696
12869 239696 -46886 261934 54665 -331604 -66366 -149493 -364789 -24841 -177583 -31159 369093
12857 196994 -196622 229001 318823 156611 292492 -90742 -166160 50437 8131 9714 222730
12846 222730 -340912 -130150 175416 233291 -8582 29346 -207704 238033 -60779 -124608 200107
12834 150484 75163 149248 8886 -178115 206573 -44065 89090 -52001 103443 -149883 11886
12822 -238027 -103167 -163876 -116371 12918 -297586 -37973 25395 -48509 207910 -95272 -63447
12811f3447J4024B03569g7159C1115J35713O3195E3191b15374a7766m8450E5426
12799g0585E3021K02611o6130C02J00456k7852e6812B53714f6650A12091m5909
12788F6182a23470N8608A26290B1031b31996A79125A943N320K68887d2956j05295
12777a48251c7301n4C26607a29430B7731J08836E6945J11319J25514a96194f9946
12765B78227i7611r5226l4838D10277H5112a44318A82362a34093d6018q6729B55831
12753c3996E8618i6531r5721j30951d6041D79729j40839b32075A68909I749a19322
12741A63251N8913c2679k30576d3288B17079k6098a26189m2854B11087g6687F9672
12729g0296G0242l3800N9394R566b0481G3665J42478o6888G0328K87207e4409
$$ plain form
12811 -63447 -49423 203569 -77159 31115 166828 230023 53191 -215374 -17766 -66216 55426
12799 -70585 53021 255632 189502 302 100758 72906 -56812 253714 -66650 112091 66182
12788 66182 -123470 -64862 126290 21031 -231996 179125 1943 7263 276150 -42956 -148251
12777 -148251 -37301 -37355 326607 -129430 27731 136567 56945 168264 293778 -196194 -69946
12765 278227 -97611 -192837 -227675 410277 85112 -144318 182362 -134093 -46018 -132747 255831
12753 -33996 58618 -96531 -192252 -323203 -46041 479729 338890 -232075 168909 9749 -119322
12741 163251 222164 -32679 -263255 -43288 217079 190981 -126189 -169043 211087 -76687 69672
12729 -70296 70242 36442 95836 105402 -20481 73665 216143 149255 70328 357535 -54409
12717e3084A42197a58483F9098J16739B3807L37716A12300d9227I162b1279G1061
12705E5083b06982b7886A00836Q840Q8868h7416L534a4403B86059a26437B96905
12693A71392m503m4482k2320J40611A4834Q5540O8357J58969F3444J74888b07062
12681g5418J8412q1800C59722A19016l3681a31016B52370B5613J03971N0595p8802
12670A01377M09103A25061b85561A83818M1175b30721A03367J08319J84317C4301
12659i1582E15075A05486J849E95J31718J17237c12188C01643I7423a53905E5837
12647a539q6484C91349j18074J16451B7663c6339B04966a21605B25105a13354
12636B36701a02285A6730K78053e8153G8334k0562a57936A10L12549h8289H8203
$$ plain form
12717 -53084 142197 -158483 69098 185837 23807 361523 112300 -49227 9162 -21279 71061
12705 55083 -206982 -27886 100836 109676 198544 -87416 -83882 -14403 286059 -126437 296905
12693 171392 166889 122407 100087 240698 14834 100374 168731 327700 63444 238332 -207062
12681 -75418 -57006 -138806 359722 119016 85335 -131016 252370 25613 129584 180179 101377
12670 101377 510480 125061 -285561 183818 224993 -230721 103367 211686 396003 34301
12659 -91582 515075 105486 107335 595 132313 249550 -312188 301643 97423 -153905 55837
12647 -1539 -88023 391349 273275 389726 27663 -36339 204966 -121605 225105 -113354
12636 236701 -102285 16730 294783 -58153 78334 57772 -157936 110 312659 -88289 88203
12624B31051g8680q5377B03355p3190a30193H6702C6061A2288J77870a57956A78295
12612B96195p5216M8592n4956K4188a84934A13218L11774H3607J84698N9314q635
12601C18984j11316a56975M9468b8092B26754m1160b3651A5621J35335C6610J20674
12590A57284B5702J8068J44305f4516J8409C33104H2317O5649a50514A1011K37544
12579B48555J73017B7498G693e5625B44563j08584j4231m0739b21204N7649d7043
12567c60751H595N2114a41502b0484B22968j02337E9916a36503b7818D3861B89
12555A12248b42559D157b85246A96726A2630c06517G1809f6621A04738n1467a53031
12543C4213b0893A523N2596M1854a4377j35968A96590r6290b5407n8374q0895
$$ plain form
12624 231051 -78680 -164057 203355 130165 -130193 86702 36061 12288 190158 -157956 178295
12612 296195 220979 269571 214615 238803 -184934 113218 424992 83607 268305 327619 318984
12601 318984 207668 -156975 -107507 -28092 226754 185594 -23651 15621 150956 36610 157284
12590 157284 25702 43770 188075 -64516 -46107 333104 82317 147966 -150514 11011 248555
12579 248555 421572 27498 7693 -55625 244563 135979 121748 81009 -221204 -163555 -47043
12567 -360751 8595 60709 -141502 -20484 222968 120631 59916 -136503 -27818 43861 289
12555 112248 -242559 4157 -285246 196726 12630 -306517 71809 -66621 104738 53271 -153031
12543 34213 -20893 1523 54119 95973 -14377 -150345 196590 100300 -25407 -83781 -164676
12532a64676C2264K0174Q6470a34678j83972A33167m5902f9444C0829a20183A3276
12520a13003I0491J17847a66130b9258E2374K03360a91494A62466l4715n4718
12510G3033M8025M31100A36431A3255J20142A3085a2984D0140J05019L9067h8329
12498G425J74070q6201a48709f9507a5465l7056A82315a05589B5962a74479N5279
12487a19200B11493D2789a44992N4625B58450f1835B70320J85559j60572A13308
12476A23522E7031L15928h3737j17235A60904a36307e7695F2051l671a40333C12355
12464a1377G3567a56645K6783k10058N342h7201L6769k05616L9512E3227a1416
12452b17764f0668C6371h660A36636a80117e7007j60316g3616j07796A71002p516
$$ plain form
12532 -164676 32264 52438 138908 -134678 -318650 133167 87265 -69444 30829 -120183 13276
12520 -113003 90491 208338 -166130 -29258 52374 255734 -191494 162466 127751 73033
12510 73033 121058 552158 136431 13255 133397 13085 -12984 40140 145159 184226 -88329
12498 7425 181495 95294 -148709 -69507 -15465 -52521 182315 -105589 25962 -174479 -119200
12487 -119200 211493 42789 -144992 -90367 258450 -61835 270320 455879 295307 113308
12476 123522 57031 372959 -83737 -200972 160904 -136307 -57695 62051 58380 -140333 312355
12464 -11377 73567 -156645 -129862 -339920 -334578 -87201 -50432 -256048 -216536 53227 -11416
12452 -217764 -60668 36371 -8660 136636 -180117 -57007 -217323 -73616 -181412 171002 163486
12441A63486b07680A99017A6312f645j5669B55877c54379j24240a70374d1578
12430B94924F7215l0270J18738F1113i4794j2016A28554j7852J93582g696D3802
12418A87126P5410d6303a485D6324J92276j953a05829A16691b08053l493e2521
12406b54980m9156d2093J4713H5971a48386J2781k87573a19252C7304b1119m6485
12395f7604k45262H9421J09182j6116m5299b54064N2219j13095a36805d589I5660
12383f5196k2649l54062K0336H6941N4825b9541r3261B2802c7543l6147A78851
12371h5019F8035e4532a8223k1578C61578H1093O8394a30047D1764a18153N7400
12360f0753l3766l1410j28211A09994K3674e34970I6106b69874B78732d6423E9151
$$ plain form
12441 163486 -207680 199017 16312 -6645 -22314 255877 -354379 -478619 -170374 -41578
12430 294924 67215 36945 155683 61113 -94794 -106810 128554 110702 304284 -7696 43802
12418 187126 262536 -46303 -1485 46324 238600 236647 -105829 116691 -208053 -211546 -52521
12406 -254980 -304136 -42093 -27380 85971 -148386 -135605 -423178 -119252 37304 -21119 -67604
12395 -67604 -312866 89421 198603 182487 137188 -254064 -201845 -314940 -136805 -4589 95660
12383 -65196 -87845 -441907 -421571 86941 141766 -29541 -122802 22802 -37543 -73690 178851
12371 -85019 68035 -54532 -18223 -39801 361578 81093 149487 -130047 41764 -118153 -60753
12360 -60753 -94519 -125929 -254140 109994 133668 -534970 96106 -269874 278732 -46423 59151
12348B5168h3567n1336j50717r8322B7134J38494a1149n2075l0906A40067d1121
12336f4080I7224g2902n1480C5564h1527o1540A90862e5152A92495p9572b56709
12324h9091H0178e8447H7712K107i9562j09222e3579E7691a41649C44641A1675
12312a99887O5403d9470m3283j5495A33637h4742A42729D160J18861n2644G737
12300a9537O172F0250a28597K3397j72723c5575I9949O2600i2040G3596M6052
12289A19648k1572g0163B98226a33007A93841e2137A8252N82228D410K91119C0939
12277a546k41040B00435a81671h6992d2527E3218g9709F9158Q6720L5103a36512
12265H7647O3694K01890j11883l1924m4256J2570M4258a0474l3121C74530I9571
$$ plain form
12348 25168 -83567 -134903 -285620 -383942 27134 165628 -11149 -63224 -94130 140067 -41121
12336 -64080 97224 -72902 -124382 35564 -81527 -143067 190862 -55152 192495 112923 -256709
12324 -89091 80178 -58447 87712 89819 -99562 -208784 -53579 57691 -141649 344641 11675
12312 -199887 -134484 -49470 -92753 -108248 133637 -84742 142729 4160 123021 70377 7737
12300 -19537 -13365 60250 -128597 -105200 -277923 -35575 99949 162549 -92040 73596 119648
12289 119648 98076 -70163 298226 -133007 193841 -52137 18252 600480 4410 295529 30939
12277 -1546 -242586 200435 -181671 -86992 -42527 53218 -79709 69158 155878 190981 -136512
12265 87647 151341 353231 241348 209424 165168 177738 221996 -10474 -43595 374530 99571
12253g8070B72277m4891L20069A04232K59285j51918f0910B18540o6871b51228
12242c16899B70446D2234J7456L1225A3873J79542E6919K27166k4708m6093p0169
12231A43115J31546E5250f3968m0545C80822a39315A89663c2513G1968b7876B50784
12219c2077B8715f0198m6401K1148C61430I4734E552M70590A00309J09084K43774
12208D53167B211J85244c1825C07751o7560p9629O5562r5155J1445O0916O4662
12197B67992m9080g468A74329J32400j17344e0389B08784a75207E4691J22113
12187A76804J53171A04382J95905n6115E0319J71346q8271L4078N4516l8818j3118
12176A70052J55936A48789N0719c2255B55054m1641I8618A5765J98432H0343R1984
$$ plain form
12253 -78070 272277 227386 547455 104232 363517 211599 -60910 218540 151669 -251228
12242 -316899 270446 42234 59690 90915 13873 193415 56919 284085 259377 213284 143115
12231 143115 274661 55250 -63968 -104513 380822 -139315 189663 -32513 71968 -27876 250784
12219 -32077 28715 -60198 -106599 -85451 361430 94734 5552 476142 100309 209393 453167
12208 453167 2211 187455 -31825 307751 240191 160562 226124 130969 142414 203330 267992
12197 267992 218912 -7468 174329 306729 189385 -50389 208784 -175207 54691 176804
12187 176804 329975 104382 300287 244172 50319 221665 133394 167472 221988 183170 170052
12176 170052 325988 148789 199508 -32255 255054 213413 98618 15765 214197 80343 172327
12165A72327a39700C35083J19740B22237b05939A83920J42839G2841g1157B33473
12154g675A14029J29055D2509J20213R2757l6733j08623d23599J05517C6974N2298
12143H9272J41763J20097b6346G1016k9106A6326O5238a84499B11763B757K66056
12132B68813a29959k7176m2026N3767b3728j95628A92598h5644A70670C7305R706
12121D7011J06056b67401J12664J0475B29011D1879K3657c24359a18331B5416
12110b1766p322A07379F278e6180j527D67484a5117E8798f5984L749A6880J00120
12098A17000c18429A50168g2522A13257D1255A2800a96232f6842D3683a29862
12087G8547P9968e12j6762o7221j32301b7517H3561L34015I1318P7861a06849
$$ plain form
12165 172327 -139700 335083 454823 222237 -205939 183920 326759 72841 -71157 233473
12154 -7675 114029 243084 42509 162722 255479 218746 110123 -423599 -318082 36974 89272
12143 89272 231035 351132 -26346 71016 41910 16326 81564 -184499 211763 2757 268813
12132 268813 -129959 -157135 -199161 -145394 -23728 -219356 192598 -85644 170670 37305 47011
12121 47011 153067 -267401 -154737 -144262 229011 41879 65536 -324359 -118331 25416
12110 -21766 -29088 107379 6278 -56180 -57707 467484 -15117 58798 -65984 -62235 16880 117000
12098 117000 -318429 150168 -72522 113257 41255 12800 -196232 -66842 43683 -129862
12087 78547 158515 -512 -17274 -84495 -216796 -27517 83561 417576 91318 169179 -106849
12075a40149n7936A0104K8356g8236B54233o8776b2740D2076K55858h0490C57431
12063D63591P46017K07087E22895B31591f912B64829P3301C0724h2760q2399E962
12051A25869a89507A24339O1238D2607A8735c7456j50510D2576J78403N668o4437
12040A62210E9266h5518q5412C57422A8271c0480r0060G1056a55324L7095j80392
12029b98621A9156K42559k173A08266b51712E8903g4724j20168A70153D269L37277
12018C41546e2280j30658k13540d4110F4057J20088c95321L1735B09001C2320
12007f2251k8309H789d3207F2551r615K5126a10382B5660c044p1277A37879E3175
11994H6384B750K78601a50472A33571b04614R8106o4491A22865F0484A3820N3121
$$ plain form
12075 -140149 -198085 10104 38460 -78236 254233 185457 -22740 42076 297934 -80490 357431
12063 463591 1209608 1416695 522895 231591 -6912 264829 338130 30724 -82760 -165159 5962
12051 125869 -189507 124339 185577 42607 18735 -37456 -187966 42576 220979 226647 162210
12040 162210 59266 -85518 -170930 357422 18271 -30480 -120540 71056 -155324 -118229 -298621
12029 -298621 19156 261715 259542 108266 -251712 58903 -74724 -194892 170153 4269 341546
12018 341546 -52280 -182938 -396478 -44110 64057 184145 -395321 -363586 209001 32320
12007 -62251 -90560 8789 -43207 62551 52936 78062 -110382 25660 -3044 -74321 137879 53175
11994 86384 2750 281351 -150472 133571 -204614 -106508 -170999 122865 60484 13820 66941
11983F6941O0540b85136F8731b6072k74830j31572E9589e9217l8272m2771j78565
11972c18825D57692d5347j71891A11482R6256d65557A21095E940O079J20843b24700
11960C19392a03923G8625b31108J10857b49k3968d05j65953A39778e45571A6779
11948b15592B09149k3389a06451l6131q3251Q3122j31950A92245K14114A46989
11937c3083k4072B35176c86335i3508k18900A59579l6186O5917a64531a7082B37499
11925h1255k16558e9095k31574f8954I2656K9862a58855B4507P6408J96371a83528
11913f9607B24472F3282N9744g1780C17349A44988b58678j285B27066h8558j55934
11902b44492a19390K4962G7669a10657C3838c5521B7184I293i5894k01637a28378
$$ plain form
11983 66941 127481 -285136 68731 -26072 -300902 -432474 59589 -59217 -97489 -140260 -318825
11972 -318825 457692 -45347 -217238 111482 207738 -465557 121095 5940 12019 132862 -224700
11960 319392 -103923 78625 -231108 -120251 -249 -24217 -405 -166358 139778 -545571 16779
11948 -215592 209149 185760 -106451 -142582 -225833 -142711 -274661 192245 406359 146989
11937 -33083 -57155 235176 -386335 -93508 -312408 159579 123393 189310 -164531 -17082 237499
11925 -81255 -297813 -59095 -290669 -68954 92656 122518 -158855 24507 100915 297286 -183528
11913 -69607 224472 63282 123026 -71780 317349 144988 -258678 -259963 227066 -88558 -244492
11902 -244492 -119390 -94428 77669 -110657 33838 -35521 27184 9293 -95894 -297531 -128378
11890E1343M2316A6519K2907O4424J20869a56224d5006m0699k10224a03415I4131
11878b22271B1113c5076r4290j36631M0429A47887f3513F3120f1865A59390D0774
11866b57322E8816A7794d7922j02651N3019p0652j44142I7432J15989J34825A3682
11854A24212b64590B60684a54594F2495a56710G1779r805O4484a21742m5803C6536
11842a56946F5925a60026k1890e3055c884A66377G9635K0891k8589M5292n4882
11831F2347a70254Q1516K0698I9184a05913B10936N3251a3997A10018J0175c3697
11819i5377B50296a3558j75488A14620P186d5332p7017d3896A13416i8586A95578
11807g0530k55955b663H1399a94317A30751K1020a9773k21749i7235o5808J6812
$$ plain form
11890 51343 93659 16519 39426 103850 224719 -156224 -45006 -85705 -295929 -103415 94131
11878 -222271 21113 -35076 -129366 -265997 -225568 147887 -63513 63120 -61865 159390 40774
11866 -257322 58816 17794 -47922 -150573 -97554 -168206 -312348 97432 213421 348246 13682
11854 124212 -264590 260684 -154594 62495 -156710 71779 61974 126458 -121742 -167545 36536
11842 -156946 65925 -160026 -181916 -53055 -3884 166377 79635 100526 71937 117229 62347
11831 62347 -170254 -88738 -68040 99184 -105913 210936 264187 -13997 110018 120193 -33697
11819 -95377 250296 -13558 -189046 114620 121806 -45332 -122349 -43896 113416 -98586 195578
11807 -70530 -326485 -2663 81399 -194317 130751 151771 -19773 -241522 -97235 -163043 -146231
11796a46231A53450F3488a6214l19752r0517A68451p0153b05791A22253c01228
11785b03151i3112n4943I5233a06058K5233L0189g584A58863H38K38955j7900
11774B21893c17953A32491K8487b40795D24549b3749l26156J37166E4391a41327
11763h4748L4563I3928J7364d02174e3247B17414b76134I5122j7879J5269C5536
11751a94798h2748j498E7646L35589f3506l8004A11381b7646k23622B30259c37128
11739b29975B55085j12178a5438I396b7897B06308d9186C2058a45363k64202A82696
11727a81681j5758f9712a8255B30250a80122A96638A0484b14450M0521B57093
11716A90622h5380k18561E2644a2616k21873C71823E5794a36688A09301a25707
$$ plain form
11796 -146231 153450 63488 -16214 -335966 -426483 168451 98298 -205791 122253 -301228
11785 -203151 -93112 -148055 95233 -106058 -80825 -50636 -7584 158863 838 239793 221893
11774 221893 -317953 132491 160978 -240795 424549 -23749 -349905 -212739 54391 -141327
11763 -84748 -50185 93928 111292 -402174 -53247 217414 -276134 95122 77243 92512 35536
11751 -194798 -82748 -84246 57646 393235 -63506 -101510 111381 -27646 -251268 230259 -337128
11739 -229975 255085 142907 -15438 9396 -27897 206308 -49186 32058 -145363 -409565 182696
11727 -181681 -197439 -69712 -18255 230250 -180122 196638 10484 -214450 -173929 257093
11716 190622 -85380 -303941 52644 -12616 -234489 371823 55794 -136688 109301 -125707
11705i5739A28476J42503c1520B22355j08169f3896C1693M81J02476p171A1586
11693D29K13635D2921Q3338J52873B1987c97514B3657a43655c1642B29b30914
11681a88484b1182A83205d5639k2567k47468a1819m9895J0278B02182G4847k1761
11670E3086b4229C73332b0125A82024a57149j66986A9070b48616J4797C451a69800
11658f877q4348J7860K7824m04780H3557a8948A14437E0546O2001k3900E002e3203
11645c5224H3339R7632n8122C2584J24490P1944b5366j02760G00P3702J7704J7611
11633A09717a97209b1016B8574K52181d3233l1093B45132h1732j52380g8777r3878
11622a72655B33J88792q5703R8378p338M7688A06080h9598D2960K04136B7328
$$ plain form
11705 -95739 128476 270979 -31520 222355 114186 -63896 31693 32174 134650 127479 11586
11693 429 214064 42921 126259 279132 21987 -397514 23657 -143655 -31642 229 -230914
11681 -188484 -21182 183205 -45639 -68206 -315674 -11819 -61714 -51436 202182 74847 53086
11670 53086 -24229 373332 -20125 182024 -157149 -324135 19070 -248616 -233819 3451 -169800
11658 -6877 -91225 -73365 -45541 -450321 83557 -18948 114437 50546 112547 88647 5002 -53203
11645 -35224 83339 180971 122849 32584 157074 229018 -25366 -128126 700 74402 92106 109717
11633 109717 -197209 -21016 28574 280755 -43233 -74326 245132 -81732 -234112 -78777 -172655
11622 -172655 233 189025 103322 201700 194362 242050 106080 -89598 42960 247096 27328
11610g0356B28249L48805b46103A01516K38868f6950A42557A6049J50506b31454
11599B99495g4581F8763b6333k55208b546k11491E8578f4035A22141K34553r7545
11588B59149c0510I3117b42013h5939A332K05690a62134A99380i0812B2541b43289
11576g2710L4171B12278m8857C5606J43340a18743d3067A98999k8177i0020l2715
11565a22735C776a06933n5040b539A13699L9365a31450e1978A29363a20611A99944
11553A16214b46701B15771a0352o2194A35213C5420a13584A5464b71967d465o6897
11542g1362B7216J06392K60614G3085N3856a46570d5252A3313b30156a03547q1000
11531a84547j29634B0772L49795c1758j80809A47619Q1894n4546l1025N9976J20113
$$ plain form
11610 -70356 228249 577054 -246103 101516 340384 -66950 142557 16049 166555 -231454
11599 299495 -74581 68763 -26333 -281541 -2546 -214037 58578 -64035 122141 356694 259149
11588 259149 -30510 93117 -242013 -85939 1332 207022 -162134 199380 -90812 22541 -243289
11576 -72710 -38539 212278 163421 35606 178946 -118743 -43067 198999 170822 -90020 -122735
11565 -122735 3776 -106933 -161973 -2539 113699 153064 -131450 -51978 129363 -120611 199944
11553 116214 -246701 215771 -10352 -72546 135213 35420 -113584 15464 -271967 -4465 -71362
11542 -71362 27216 133608 394222 73085 126941 -146570 -45252 13313 -230156 -103547 -184547
11531 -184547 -314181 20772 370567 -31758 -212567 147619 229513 174967 143942 203918 324031
11520C24031d16241J95144i0546A81836R6993A07307P2156D3466K61341A5016
11509G4032K6353K40329B4508b58B37617b558A28629C4391c6334D10774b6123
11497b30902I098J28065J10132A10121n0425a82813e0124A91922n8719j7089a36496
11485g8006C45875g9926A84104L51198B62045m2507r3363a90841F5630b25091
11474A6049L19561j65436J84007C9389M4280m1658L24756j69486M9972c4779A92955
11462A16334J06937a29667b6921A09499N5376d0758C30681A55967K07777A43137
11451D00592a08437A49568b9129E11957a33526B22923J54939e4745j97976b3378
11440c17956B94184Q604n6543C8190O3282J11091b4941B59518a46092j12476a15233
$$ plain form
11520 324031 -416241 -221097 -90546 181836 278829 107307 179463 43466 304807 15016
11509 74032 100385 340714 24508 -258 237617 -2558 128629 34391 -36334 410774 -26123
11497 -230902 9098 137163 247295 110121 59696 -182813 -50124 191922 133203 116114 -136496
11485 -78006 345875 -79926 184104 535302 262045 219538 126175 -190841 65630 -225091
11474 16049 335610 170174 354181 39389 83669 42011 366767 197281 247253 -34779 192955
11462 116334 223271 -129667 -26921 109499 164875 -40758 330681 155967 363744 143137
11451 400592 -108437 149568 -29129 511957 -133526 222923 377862 -54745 -252721 -23378
11440 -317956 294184 302788 246245 38190 101472 212563 -24941 259518 -146092 -258568 -115233
11428A93323o1929B0592b59277A04290Q9076K8496n2003g1766B6122c94260G011
11416a36826L1331C3O49950B10725p6740B9791b1854k91865G0037H301a91550
11404A07491e7925k09529B02756b50042d0984B4860f4678B2229M81043c68224
11393A09186Q9364M4861D4582D051d9502l7322b9101a994A31236b531H55J4677
11381A5532b97241I2104i4994B72817a13071d768F0302M5868A4904c9410k00908
11370b40318k46543f8487q0292j35904J20518C7152b34344A65790a28540B0263
11359A2613Q8078J55612J7743e0014A84937o0499h9805B7585b03067f1655C02279
11347g8256j02601k7408B09202H0678b2171F2611a45173A45724c37446D7254b39702
$$ plain form
11428 193323 131394 20592 -259277 104290 193366 221862 169859 -71766 26122 -394260 7011
11416 -136826 -105495 33 649983 210725 133985 29791 -21854 -313719 70037 8301 -191550
11404 107491 -57925 -267454 202756 -250042 -40984 24860 -64678 22229 503272 -368224
11393 109186 198550 243411 44582 4051 -49502 -86824 -29101 -1994 131236 -2531 855 15532
11381 15532 -297241 92104 -94994 272817 -113071 -4768 60302 106170 14904 -39410 -240318
11370 -240318 -486861 -68487 -148779 -284683 -164165 37152 -234344 165790 -128540 20263
11359 12613 100691 256303 274046 -50014 184937 124438 -89805 27585 -203067 -61655 302279
11347 -78256 -180857 -208265 209202 80678 -22171 62611 -145173 145724 -337446 47254 -239702
11335b7905L794B68465B2164b53719I388c66571G1558a43942J1152B20283b89444
11323b3830j39463N8137A65072a39764r6119f4641K0443H7397c1350B52716A5590
11311a60786F2448b58807a9190j3383B85409a93239L2973B54738h1158I1292J26657
11300B17949K13833j43999h1117j74738A39351f5139g753j07707l4429c6953E4497
11288B48962g5645B08189a84112B49504b57605P6596N362D307K2147P466i7585
11276b92060A90432a44161g354j15543A403J25592j4260D5929b93768b2883A80357
11264A5953Q175e3441k3383C3817b47423b2914C65517g9573J70k8032E1633a07307
11251a94988O7446A72031b75682a2242F2249j3005K0223J65909h737A26570a58664
$$ plain form
11335 -27905 -24111 268465 22164 -253719 9388 -366571 71558 -143942 -132790 220283 -289444
11323 -23830 -163293 -105156 165072 -139764 -235883 -64641 -44198 87397 -31350 252716 15590
11311 -160786 62448 -258807 -19190 -32573 285409 -193239 -160266 254738 -81158 91292 217949
11300 217949 431782 287783 -81117 -255855 139351 -65139 -7753 -115460 -149889 -36953 54497
11288 248962 -75645 208189 -184112 249504 -257605 -181009 -175647 4307 26454 33920 -97585
11276 -292060 190432 -144161 -7354 -122897 1403 126995 112735 45929 -293768 -22883 180357
11264 15953 24128 -53441 -76824 33817 -247423 -22914 365517 -79573 -79403 -107435 51633 -107307
11251 -194988 -127542 172031 -275682 -12242 62249 49244 69467 235376 -8737 126570 -158664
11239b1955J713c758r1732j51358a5711j19649A40063R0034B3096J0500a48061
11227E4662B6580b79143B41881E8201d6737k62296P8357H8347j6970a11676j17281
11216b28957F74J98727h8241B415d0701K0055l2314l49009H0652a37006N7010
11205g9996n533B61194A9265K32683k0607A12123d28481f9484q8826O3749a0483
11193b70723c8303J382k8438q144b6289A2899J62333o1284a60436C8826N8112
11182I6938d226r1032C11104j53838c557k16836F0993J7911a232j44503e3311
11170H4699a05276o5347O8599r8719e1764D3393M7523a04945j17900o665A49285
11158E6739J06267b6656B25031J25239g4355A48626a94446r8501R6635j16828
$$ plain form
11239 -21955 -20242 -3758 -95490 -246848 -15711 -135360 140063 230097 23096 33596 -148061
11227 54662 26580 -279143 241881 58201 -46737 -309033 -230676 88347 71377 -111676 -228957
11216 -228957 674 199401 -88241 2415 -40701 -20646 -52960 -401969 80652 -137006 -79996
11205 -79996 -85529 261194 19265 251948 231341 112123 -428481 -69484 -158310 -94561 -10483
11193 -270723 -38303 -36921 -65359 -73503 -26289 12899 175232 113948 -160436 38826 96938
11182 96938 -4226 -95258 311104 157266 -3557 -220393 60993 78904 -1232 -145735 -53311
11170 84699 -105276 -170623 -102024 -200743 -51764 43393 90916 -104945 -222845 -229510 149285
11158 56739 163006 -26656 225031 350270 -74355 148626 -194446 -292947 -196312 -313140
11148c13140B40388d28891J3057b7532A01293l5077f3902J6660j44272m0134B52767
11136H2069J05254a04830k2677E6264a02430F7886m188e6731j15220h5314A61997
11124c1348A82013a57303K2755D2554P9460C8027h9016j30730B8467J62931a35402
11112G0050r821O9688a11675H9064J14709h7234k2964A51912o4861c19076a35655
11100A26011a65796p617b1142I7277g2157A12868J85515q7406J97116G3266k7163
11089D6103L1475P6147J6995P6908A07483J06039c3598I9620P7893K58011d3884
11077A62905c3016A02132L81632B05014C5246K25906M0655H1993J42079a93703
11066A04020R090O7412J2876K37004j09005A58447O8020J39326J20452q8031j9838
$$ plain form
11148 -313140 240388 -428891 -415834 -27532 101293 66216 -63902 -47242 -191514 -231648 252767
11136 82069 187323 -104830 -127507 56264 -102430 67886 63698 -56731 -171951 -85314 161997
11124 -31348 182013 -157303 -134548 42554 122014 38027 -89016 -219746 28467 191398 -135402
11112 70050 60229 129917 -111675 89064 203773 -87234 -110198 151912 87051 -319076 -135655
11100 126011 -165796 -173413 -21142 97277 -72157 112868 298383 210977 408093 73266 46103
11089 46103 77578 153725 170720 247628 107483 213522 -33598 99620 177513 435524 -43884
11077 162905 -33016 102132 483764 205014 35246 261152 301807 81993 224072 -193703
11066 104020 113110 180522 193398 430402 321397 158447 226467 365793 486245 398214 378376
11055C78376j72078K1631C0370O46204k81685j6855K5076A43787N06849j88890
11045D61746L63720j74351j99827j39467K49021J18489k34038J89329J4969n8169
11035E91422L74006D62968J25908j6077K3882K61902r3162k26297J09656K54039
11025I02819O5284l95163L72805j99154j8120J5213K31894l20091k68983L22895
11015G09399j15036J09820j70900L73642D50059L72989q9806r8477N3741N3398
11005G41904k39571r1943k913M29957j37534L0296j88282K24033B13317N20042
10995G33359l7493l4148j63258M7572K65747k10794j2834j57346k07362K09482
10985D32925M10141J8972j96043N9499l00356K17553K35528J94749l63304L2114
$$ plain form
11055 378376 206298 227929 30370 676574 394889 378034 403110 143787 650636 461746
11045 461746 825466 651115 451288 311821 560842 679331 445293 634622 649591 591422
11035 591422 965428 462968 588876 572799 596681 858583 765421 539124 648780 902819
11025 902819 968103 572940 945745 746591 728471 743684 975578 655487 386504 709399
11015 709399 594363 704183 533283 906925 450059 823048 733242 634765 688506 741904
11005 741904 502333 410390 407477 837434 699900 730196 541914 765947 213317 733359
10995 733359 695866 661718 498460 546032 811779 600985 588151 430805 223443 432925
10985 432925 843066 862038 665995 725494 425138 642691 878219 1072968 709664 741778
10975G41778k13858K4896L45254L81263F20461M47532p995L6817n8592k54029
10965G84194N6983N40084j15529L8205J54312L51159j31009L89316K44584N1726
10955B364025j78401L73858p9439j62969k0731k91702j40068k59897J82610k17603
10945A569683j298K29783j35611m2098J86091J1026k56748j09165j41674o3481
10935A246508J2215m53674K18258E01328K08906l51520M1103n5374A10825O5469
10925A76294J93677A71956j9872m8773J64830j04724l9806L3222c20928a23763
10914A38440b19805G6639a69258n1254b7937k2590A7443K47232q4701a06865B4821
10902a24154B64829d8989I7680a77186f0605C0709f1194k46035C08176A22868
$$ plain form
10975 741778 527920 552816 898070 1279333 620461 1067993 1059998 1096815 1038223 784194
10965 784194 841177 1381261 1265732 1303937 1458249 1809408 1678399 2067715 2312299 2364025
10955 2364025 2185624 2559482 2480043 2317074 2296343 2004641 1864573 1604676 1787286 1569683
10945 1569683 1568385 1798168 1662557 1620459 1806550 1817576 1560828 1451663 1309989 1246508
10935 1246508 1258723 805049 1023307 501328 710234 358714 399817 344443 110825 176294
10925 176294 369971 171956 152084 103311 268141 163417 123611 156833 -320928 -123763
10914 138440 -219805 76639 -169258 -220512 -27937 -50527 17443 264675 179974 -106865 24821
10902 -124154 264829 -48989 97680 -177186 -60605 30709 -61194 -307229 308176 122868
10891e4436A33493B2523a3599k46740A7813J01331e252A51467j0729a30667e1481
10879B65071a27459j29575g3058K1335B93841d963E9487d45746a68899A42150
10868b55090A13002a74075f5918l27767I3308a38407A72074D0046a70333A42299
10857G825P4497P925a95273B37703K86033B35108b0554j08350C6973p195R5874
10846A25652R7142r1164C7964K35551b6835G6763k9711L01461A4003a35752A21931
10834i9619k47872a7939H8266k4891J36811b51378c437c90B31619L8714I7596
10822f1177F0269J55762a2286n1511B2093K32680r4300c19011a9018D61780c26363
10810b12946h6060G382N880R5647k9637c9477j02384m9310A12535c1254A26712
$$ plain form
10891 -54436 133493 22523 -13599 -260339 17813 119144 -5252 151467 140738 -130667 -51481
10879 265071 -127459 -257034 -73058 -51723 293841 -4963 59487 -445746 -168899 142150
10868 -255090 113002 -174075 -65918 -393685 93308 -138407 172074 40046 -170333 142299
10857 7825 82322 90247 -195273 237703 523736 235108 -20554 -128904 36973 29778 125652
10846 125652 222794 131630 37964 273515 -26835 76763 47052 348513 14003 -135752 121931
10834 -99619 -347491 -17939 88266 63375 200186 -251378 -3437 -390 231619 270333 97596
10822 -61177 60269 216031 -12286 -63797 22093 254773 160473 -319011 -19018 461780 -326363
10810 -212946 -86060 7382 13262 108909 79272 -39477 -141861 -191171 112535 -31254 126712
10798A91278a15991j16088B7608O072c99540A51561a47826A16021l0365g4860
10787B06171B8372Q1633L0278j6328a44995M7793j04772B6010E384g4352q0646
10776a54998B68761b30696D8545b30701N8864A11821c331j7429j44815D191i4575
10764a44133j76202J39123i170D3255N3992a1801D6984a60968A27490f5535F19421
10752i4096K6559j98542e4190B43931A12280J5527i2507I4711J07515I1425c9719
10740f8677I4514a32995L7485l33749B47185c21564J38954Q5280d0028j20176
10730a60204f3693q877H3918a4712B63455C7344b7672A75048g8265r9655h8238
10718E3856a85112C39372b10688d7048E9784o93k4500b66575a17109a1706k6224
$$ plain form
10798 191278 -115991 -232079 27608 33680 -399540 151561 -147826 116021 85656 -74860
10787 206171 28372 110005 140283 123955 -144995 -97202 -201974 26010 5384 -74352 -154998
10776 -154998 268761 -230696 48545 -230701 -171837 111821 -3331 -20760 -165575 4191 -94575
10764 -144133 -320335 -181212 -9170 43255 97247 -11801 46984 -160968 127490 -65535 619421
10752 -94096 -67537 -266079 -54190 243931 112280 127807 -92507 94711 202226 91425 -39719
10740 -68677 94514 -132995 -95510 -429259 247185 -321564 -182610 -97330 -40028 -160204
10730 -160204 -63693 -72570 83918 -14712 263455 37344 -27672 175048 -78265 -177920 -88238
10718 53856 -185112 339372 -210688 -47048 59784 59091 34591 -266575 -117109 -11706 -37930
10707c7930A22047f6041A87414a74872A85081E0492k1404O9274b08233e3323A48366
10695A64529a14444d9873A82070a876k8460l4445k48637J49183c9327p7748B3404
10683a28247h455l19391a15843k714p1170Q0938j42043d7899G2729J36854A02368
10671a92538j35894g4124c6788C6429K6973A2274a09733F2517f1240p8427A32682
10659A11154O0326l5886b37754j28816a25991n1983A67335J8612b10378d5586
10648b46025b9821j8513k5035C27528b10402j5395C64647h3662I219J20864b72172
10636b33596J04573G0521b67742h9436f909j82842j37193H9398R3015i7165j21423
10625b18588j91630J67163L8524j24558J63303k07775C05223a34063A46330b36239
$$ plain form
10707 -37930 122047 -66041 187414 -174872 185081 50492 29088 98362 -208233 -53323 148366
10695 164529 -114444 -49873 182070 -1876 -30336 -64781 -313418 -164235 -39327 -117075 23404
10683 -128247 -8455 -327846 -115843 -118557 -189727 -108789 -250832 -47899 72729 209583 102368
10671 -192538 -328432 -74124 -36788 36429 63402 12274 -109733 62517 -61240 -139667 132682
10659 111154 171480 135594 -237754 -366570 -125991 -177974 167335 185947 -210378 -45586
10648 -246025 -29821 -48334 -73369 327528 -210402 -225797 364647 -83662 9219 130083 -272172
10636 -233596 -129023 70521 -267742 -89436 -6909 -189751 -326944 89398 182413 -97165 -218588
10625 -218588 -410218 -243055 -204531 -329089 -165786 -373561 305223 -134063 146330 -236239
10614b04591D5079J5881c81091f7235j7534B79419i1849k96381a78894B67121
10603a19619B30076f9631G1080e0170l49486A84355E7376k7596M6667A6330f2409
10591A50219o6553e6098E8395K4611M7807m0234b65297A31018a48797L9885n2154
10580a61066F6372a84293D84603a77099N0366q7482a03683A82930m180O543d4660
10568a28328c3764F4340d648j55465d4836A09688a8203C20619b0455j16410H7898
10556a37303J6972M6779o4593n2743a6799j85957D0404J13103D6924b3271k02409
10545b25680j76387e4924p7652j1136A84609k3882d34655J85548b8516j89409
10535b17925G5010e6996k64679B8488J14150B5752b27497A01134b17709c4298
$$ plain form
10614 -204591 45079 60960 -381091 -67235 -84769 279419 -91849 -388230 -178894 267121
10603 -119619 230076 -69631 71080 -50170 -399656 184355 57376 29780 76447 16330 -62409
10591 150219 83666 -56098 58395 83006 130813 90579 -265297 131018 -148797 -108912 -161066
10580 -161066 66372 -184293 484603 -177099 -126733 -214215 -103683 182930 178750 185293 -44660
10568 -128328 -33764 64340 -4648 -160113 -44836 109688 -18203 320619 -20455 -136865 87898
10556 -137303 -120331 -73552 -138145 -190888 -16799 -202756 40404 153507 46924 -23271 -225680
10545 -225680 -402067 -54924 -132576 -143712 184609 160727 -434655 -249107 -28516 -217925
10535 -217925 75010 -56996 -321675 28488 142638 25752 -227497 101134 -217709 -34298
10524c04920i6941k888A7410a75348c873C46446j70529b13876j04923B8060i4840
10512C8892b00518C8385a25985o6705C16129j28746E8894j5289K27765l8246A9867
10500a24526j97251F003d946j82648g4401D6771c32567D1702K58555j08415E4093
10488c6774A44638a81781G517Q2921a46036M6549j72350A35962a12238L943A63746
10476b36767b1576j16227a3711n8220b2943r0473B65204l9786q9191k5629K61861
10465C72459j24031m2029J28084A31979O4043o1611a04975L2986A27393J10740
10455B38133r7432Q3086G5590a29013N781A05929l9764a57651O4720F4357a49482
10443A73272b70810B35093g1339D3120M9067m0278K17966n2341a31508N0393j02635
$$ plain form
10524 -304920 -96941 -99829 17410 -175348 -3873 346446 175917 -213876 -318799 28060 -94840
10512 38892 -200518 38385 -125985 -192690 316129 187383 58894 43605 271370 233124 19867
10500 -124526 -321777 6003 -4946 -187594 -74401 46771 -332567 41702 300257 191842 54093
10488 -36774 144638 -181781 7517 90438 -146036 -99487 -271837 135962 -112238 -108295 163746
10476 -236767 -21576 -137803 -13711 -71931 -22943 -113416 265204 225418 136227 110598 372459
10465 372459 248428 206399 334483 131979 196022 134411 -104975 -71989 127393 238133
10455 238133 140701 223787 75590 -129013 -123232 105929 66165 -157651 -92931 64357 -149482
10443 173272 -270810 235093 -71339 43120 92187 51909 269875 217534 -131508 -81115 -183750
10432a83750H5253i8806A19548b92531H623K72271d25269A14404c14371A85573
10421H843O1152i1277C76299d08888A24917J0944c19075A2552b72330L228D3993
10409A78497e4380J5701E2134J69082H5245b09550C43443I3517i4084F4749a70755
10397D2010J20569h8612A55923P8250b64084A9429a00768B1955a79487H1178b4736
10385g7012A6347c04439a02775j62217C09228a87320A10854a92571B92532p7490
10375B15042j4453M0541b70222H3628l682b14644A62527d8088F6375J98083I1329
10363G3413A6964a68024A43482J1854J5200k1858L42448k23444k3115o7808K34873
10352D11632j66902O1254K4600j26775J20848J61060A06433B006M95302A62458
$$ plain form
10432 -183750 85253 -98806 119548 -292531 8623 280894 -425269 114404 -314371 185573
10421 8843 69995 -91277 376299 -408888 124917 135861 -319075 12552 -272330 -269102 43993
10409 178497 -54380 -38679 52134 221216 85245 -209550 343443 93517 -94084 64749 -170755
10397 42010 162579 -88612 155923 234173 -264084 19429 -100768 21955 -179487 81178 -24736
10385 -77012 16347 -304439 -102775 -264992 309228 -187320 110854 -192571 292532 215042
10375 215042 200589 241130 -270222 83628 79946 -214644 162527 -48088 66375 264458 91329
10363 73413 16964 -168024 143482 155336 170536 148678 491126 267682 244567 176759 411632
10352 411632 244730 305984 330584 203809 324657 485717 106433 2006 497308 162458
10341C91455A43738h1731B30950K42099j88120Q7373P6399k06340R0122L0018
10331C62501A04256K84243l3374j08358J31375l5331M7532o7540J36763F4686
10320a32568A46243L9604a06236j35912C60302b9908J0911C2992P2796O3320n1259
10309A17849R1691r7360J81742A16584j7101K69284j43534C334a27739C2199a42967
10297b997k84832J34704d5829D02161g1896k19651B82444G0808b0983A78307f3034
10285A17518N6979F9490c26520h8379A10303a40778A79134B0437m792L26008c24215
10273c9347G3511j1616R247J28318J54585C1791a0259A9986K55248a19602K2284
10262i7318p2316I1945I361J23906E7792a92641d7503o8316C2459L40671d4033
$$ plain form
10341 391455 143738 -81731 230950 473049 284929 372302 448701 242361 332483 362501
10331 362501 104256 388499 355125 246767 378142 342811 390343 322803 459566 64686
10320 -132568 146243 185847 -106236 -242148 360302 -29908 -18997 32992 105788 169108 117849
10309 117849 209540 112180 293922 116584 99483 368767 225233 3334 -127739 32199 -142967
10297 -2997 -287829 -153125 -45829 402161 -71896 -291547 282444 70808 -20983 178307 -63034
10285 117518 174497 69490 -326520 -88379 110303 -140778 179134 20437 15645 341653 -324215
10273 -39347 73511 61895 71142 199460 354045 31791 -10259 19986 275234 -119602 -97318
10262 -97318 -169634 91945 9361 133267 57792 -192641 -47503 -115819 32459 373130 -44033
10250A29516a60569M0741B60273E42f8405b2467A22708L5557J96276k1981j02812
10239B29748p7173a92400D3582P538h3089j7808K3252j85378e5964H3027a55254
10227d41384B4151K20213h8410A99636b80444J25780A06063Q6145r1850d5498
10216A3191b33148C16423h3149j1658o7762o3209B6386a19331j9534A19210R982
10205A29192a22228C9430K5868a95774D7178a96746Q3733o8725J2010A06571J05856
10194B12427a95365G9706g2089B44036a92423I5486A9141a47842C25596a4384
10183b8951p1297j58787m973K5231A32170a35666j85289e2898l38116D49938c71002
10171A14438d59642a3574m6239m2066j81824A9817h6192k27058F4924h2398a0277
$$ plain form
10250 129516 -160569 -119828 260273 542 -68405 -22467 122708 158265 354541 332560 229748
10239 229748 152575 -192400 43582 51120 -83089 -100897 -77645 -263023 -55964 83027 -155254
10227 -441384 24151 244364 -88410 199636 -280444 -154664 106063 192208 100358 -45498
10216 13191 -233148 316423 -83149 -94807 -162569 -225778 26386 -119331 -138865 119210 129192
10205 129192 -122228 39430 65298 -195774 47178 -196746 -113013 -181738 -169728 106571 212427
10194 212427 -195365 79706 -72089 244036 -192423 95486 19141 -147842 325596 -14384
10183 -28951 -100248 -259035 -264008 -238777 132170 -135666 -320955 -52898 -391014 449938 -371002
10171 114438 -459642 -13574 -59813 -101879 -283703 19817 -86192 -313250 64924 -82398 -10277
10159c72387b098j22274a8861k1030o4531e1955F746R8124a09554L8496a210k00401
10147b01611Q7804H8439j8196C0664a43666I6045c24502K4944A12890b19971B35935
10135C48677d01237r1908b8408p3747B96L8816c58692i0651C06644H893h2131
10123c41080A33047a96137N4283I4047a30132A75555a8279k7974E0173j5778b56229
10111B1052a26709a1530l09101J24451A76708C213d08673H6637b0930j58607C8996
10099a37748A68563b62149m9774a25352j60498A87201o1045D7689a20389D6113
10088A38659I258J35485a80176I2333l2649L3817b02090O1034A36617d2469A2430
10076B30762c0384A89395b17378I4183a26349K8278k49458F6601a96676N3447
$$ plain form
10159 -372387 -2098 -124372 -18861 -39891 -104422 -51955 6746 104870 -109554 -71058 -1210 -201611
10147 -201611 -113807 88439 70243 30664 -143666 96045 -324502 -299558 112890 -219971 235935
10135 348677 -401237 -493145 -28408 -102155 296 39112 -358692 -90651 306644 8893 -82131
10123 -341080 133047 -196137 -141854 94047 -130132 175555 -18279 -46253 50173 34395 -256229
10111 21052 -126709 -11530 -320631 -196180 176708 3213 -408673 86637 -20930 -179537 38996
10099 -137748 168563 -262149 -311923 -125352 -285850 187201 126156 47689 -120389 46113
10088 138659 9258 144743 -180176 92333 59684 93501 -202090 -141056 136617 -42469 12430
10076 230762 -30384 189395 -217378 94183 -126349 -98071 -347529 66601 -196676 -143229
10066a43229A24346i5519k0913H3116b76891N5648M8611q5747a28900K5469A17669
10054F3510b7935B49482f9488k9323A80169e8392j93534J06088I8428a40149k1013
10043a61162c4524j64740D2864M0109d87478b8066j39840r9674J31087D908a14581
10031f1038G4353f2239A16445g3863A10611a99857B67250A24617d8406j60720
10021b09126h9780a6519r2522n5152a2738k27628C1345p487c87179J46322g5640
10009a16153A17324n5948b58980I5613a41427N3913J259n5642F9362L988a81985
9997b613o3559K8768j24565l07940C11432a68041M545C7011c73728A42463b45293
9985D8468b40025l2042D7397a98952A18905a83880A69115c9081q2465C12447c3957
$$ plain form
10066 -143229 124346 -95519 -116432 83116 -276891 -221243 -172632 -258379 -128900 -103431 117669
10054 63510 -27935 249482 -69488 -98811 180169 -58392 -251926 -145838 98428 -140149 -161162
10043 -161162 -34524 -199264 42864 82973 -487478 -28066 -167906 -267580 -136493 4908 -114581
10031 -61038 74353 -62239 116445 -73863 110611 -199857 267250 124617 -48406 -209126
10021 -209126 -89780 -16519 -109041 -164193 -12738 -240366 31345 23858 -387179 -240857 -75640
10009 -116153 117324 61376 -258980 95613 -141427 -87514 -86255 -141897 69362 73350 -181985
9997 -2613 -66172 -37404 -161969 -469909 311432 -168041 -163496 37011 -373728 142463 -245293
9985 48468 -240025 -272067 47397 -198952 118905 -183880 169115 -39081 -121546 312447 -33957
9973E6040c35972J00437A78171a00203c2109l12211a16729q8388a02107A17226
9962c36659K5527C63658F207a3975A3265J47495o6023c38796E2751b25569C2551
9950H3263a22704J9825B9179b3971A12704b2328c422G3564R371E019O387P5460
9938H6866a47055J1501q8627A9959l609J47479J9464f4398k05558f4680k56922
9927c21602a5104B9440d7953k77687e410j28286b755A93075q4907b67072A36658
9915A02228P7066c77895F4072d95991a68908a5306o884C09669j02300b84961a17836
9903G8182a47753g3640j27534B82748b07481A1954d5930p7754e6055m4706j31960
9892b32721L9233c905B3131L79K28964a42497C18774c5983O246R952B65935C1972
$$ plain form
9973 56040 -335972 -235535 178171 -100203 -32109 -344320 -116729 -205117 -102107 117226
9962 -336659 -311132 363658 6207 -13975 13265 160760 94737 -338796 52751 -225569 32551
9950 83263 -122704 -102879 29179 -23971 112704 -22328 -3422 73564 82935 5019 11406 86866
9938 86866 -147055 -135554 -224181 19959 16350 163829 183293 -64398 -269956 -64680 -321602
9927 -321602 -15104 29440 -47953 -325640 -5410 -133696 -2755 193075 108168 -267072 136658
9915 102228 179294 -377895 64072 -495991 -168908 -15306 -22190 309669 207369 -284961 -117836
9903 78182 -147753 -73640 -201174 282748 -207481 11954 -45930 -123684 -56055 -100761 -232721
9892 -232721 -193488 -3905 23131 23510 252474 -142497 318774 -35983 -29737 -19785 265935 31972
9879A31808K7265J85078g1235j72809j30149a37374C022h7532b9854q7593q7154
9868b04601F1843k3955L097P3024e0418p3601M5227D2820c71929B65313f3606
9856A38243c7601r3284B24828d8335C8439g8713B59686j19607d31432C2521a70625
9844A57728a21754k55852J74756j51278J56101L8683E8658e8480n6955C6610A2698
9832D243a15423d6079p8111q9672G4686b24117h8639j64993P8019P9810A29080
9820g8748F6252c39629C2715b25143J04696N0450j90785C9162h1143A75502f5548
9808f2876l56627a29807j71010c3904G8500g777k73884F8176e5442A36644o4867
9797G1777a91255d8043r2297j60777k77964D43789A57327b18144B46027o6179
$$ plain form
9879 131808 159073 344151 -71235 -244044 -374193 -137374 3022 -87532 -29854 -117447 -204601
9868 -204601 61843 37888 40985 114009 -50418 -124019 -78792 42820 -371929 265313 -63606
9856 138243 -37601 -130885 224828 -48335 38439 -78713 259686 140079 -431432 32521 -170625
9844 157728 -121754 -377606 -202850 -354128 -198027 -159344 58658 -58480 -115435 36610 12698
9832 4243 -115423 -46079 -124190 -213862 74686 -224117 -88639 -253632 -175613 -95803 129080
9820 -78748 66252 -339629 32715 -225143 -120447 -69997 -260782 39162 -81143 175502 -65548
9808 -62876 -419503 -129807 -300817 -33904 78500 -7777 -281661 68176 -55442 136644 71777
9797 71777 -191255 -48043 -140340 -301117 -579081 443789 157327 -218144 246027 179848
9787A79848b19795g5293j09634Q5570A67590d4949A71323j5114Q4839c8934m09232
9776d48166a24324g713H2160a2164k5886j94799D9562f4928j93631H3792b38348
9764a6033g488m4670I2391a5585n8667p4982c0102r9930A11943Q2399a18359l3777
9752a52136O5698A43108K41951b50206a1424A16983O3660a49750K9387j15132
9742b35495g8819A1125L0966e37799A58654a07494A10126b41484C2554a08413
9731a86690R390p7405A114P6586b7841k20927C14763j32958C5145h7381J0384
9720g6997G8492C0654h658E8075J6364b99970N9670j95237a80180B50678b13711
9708A05065b39649J511H2080f3447j34543j24388J14941Q4739H8118f0317F1190
$$ plain form
9787 179848 -219795 -75293 -184927 -99357 167590 -44949 171323 156209 241048 -38934 -448166
9776 -448166 -124324 -7713 82160 -12164 -38050 -232849 49562 -64928 -258559 83792 -238348
9764 -16033 -7488 -52158 92391 -15585 -74252 -149234 -30102 -130032 111943 194342 -118359 -152136
9752 -152136 -86438 143108 385059 -250206 -11424 116983 180643 -149750 -120363 -235495
9742 -235495 -78819 11125 42091 -537799 158654 -107494 110126 -241484 32554 -108413
9731 -186690 -177300 -254705 1114 77700 -27841 -248768 314763 181805 35145 -87381 -76997
9720 -76997 78492 30654 -8658 58075 74439 -299970 -240300 -435537 -180180 250678 -213711
9708 105065 -239649 -238138 82080 -63447 -197990 -322378 -207437 -122698 88118 -60317 61190
9696a15134I8878i6526j75218R8316J174j74996g1292k8372h777p302B0067b00533
9683A43312c26196J04270a00404B69157h7495n005B43958A7322d3202B21602c20799
9671d16784J98330I7547b11150P9013j03616B73848c02322a35225F517a47284
9660a88557L882C10019a72406p9266a3047A11630m9322e8301o0099j41283B02319
9648c13823q474i8212m4943A27623a45321j56242d0852o38A82053b53715Q9003
9637a64712A18540g0922k01369R0170C2273N0641J23748a49505F902d9745B73727
9625c24883P2132A6242J33632i1377I092Q1299a77960A90867a30789A25768b2869
9613a17606j40936i734l98812J06306A37910J31719b4798A54538H692a80836B36244
$$ plain form
9696 -115134 98878 -96526 -271744 -173428 -172254 -347250 -71292 -99664 -8777 -16079 20067 -200533
9683 143312 -326196 -221926 -100404 269157 -87495 -92500 243958 17322 -43202 221602 -320799
9671 -416784 -218454 97547 -211150 -132137 -235753 273848 -302322 -135225 6517 -147284
9660 -188557 -184675 310019 -172406 -251672 -13047 111630 62308 -58301 -118400 -259683 202319
9648 -313823 -322297 -98212 -143155 127623 -145321 -301563 -40852 -41490 182053 -253715 -164712
9637 -164712 118540 -70922 -272291 -182121 32273 82914 206662 -149505 6902 -49745 273727
9625 -324883 -252751 16242 149874 -91377 9092 90391 -177960 190867 -130789 125768 -22869
9613 -117606 -258542 -9734 -408546 -302240 137910 269629 -24798 154538 8692 -180836 236244
9601b71404P3351R3190q8756D1932a48275A33737a08897j6226C37996f6961B64180
9589D6438K76025b9807j28115p869J7661k07258J22302C2910h9014l26942B01014
9577b19023F5333b3784j72361A2994N8009L4815c6238C24239o6190d08514c9138
9565B85047A31314m4773a99867M6422H0583f5408l57970A33375d07364g815r7189
9554a05004j61118i6858j33981a0645j45520C06728I6090k8267b32767R2046k77547
9543d18268g8416j23815J6884e0856j50661Q9651M8103a8758k06708Q1268R769
9532a34429G3399K14985f1187o1088M1071C1979J1589J62386d1872k56999J41438
9521a57433C1110Q5987c1676j82555l9924C5704a80534h2962j99281i795j45080
$$ plain form
9601 -271404 -198053 -104863 -193619 41932 -148275 133737 -108897 -125123 337996 -66961 264180
9589 46438 322463 -29807 -157922 -165791 -148130 -355388 -233086 32910 -89014 -415956 201014
9577 -219023 65333 -23784 -196145 12994 71003 105818 -36238 324239 258049 -408514 -39138
9565 285047 131314 86541 -199867 -153445 80583 -65408 -423378 133375 -407364 -7815 -105004
9554 -105004 -266122 -96858 -230839 -10645 -156165 306728 96090 67823 -232767 -140721 -418268
9543 -418268 -78416 -202231 -185347 -50856 -201517 -111866 -63763 -18758 -225466 -144198 -134429
9532 -134429 73399 288384 -61187 -122275 -81204 31979 43568 205954 -41872 -298871 -157433
9521 -157433 31110 117097 -31676 -214231 -254155 35704 -180534 -82962 -282243 -9795 -154875
9510a54875l3526G437c0443m0196I0208g1361A87799b69709g9937q4340H3117
9498c4426B71933c1378F1732b3885B22043a33224b0535j33684A15775i8811k3884
9487a22695C35185c14715J15886g2544j41357e3179p2977n9056B5566K61131b52607
9475b2071j74739c7292j40547C8689b23883A44057b22600A8323i0353B63853B1331
9463c04600A89656C7927d888B57975c38282a25467E1507K14283a20195J0933K7451
9452h1811B33216i8966r2155j1118B13203a38849L6669c3902A5561J31092D3052
9440b96487b4835k2618J7316k9655l4360B80726F1263g9093L3964m815J1931j34300
9428a72313A31745A3566e3284k7841q2752A53022a10252e0652k58810B38430g9184
$$ plain form
9510 -154875 -188401 7437 -30443 -70639 90208 -71361 187799 -269709 -79937 -164277 83117
9498 -34426 271933 -31378 61732 -23885 222043 -133224 -20535 -154219 115775 -98811 -122695
9487 -122695 335185 -314715 -198829 -72544 -213901 -53179 -126156 -185212 25566 286697 -252607
9475 -22071 -196810 -37292 -177839 38689 -223883 144057 -222600 18323 -90353 263853 21331
9463 -304600 189656 37927 -4888 257975 -338282 -125467 51507 265790 -120195 -109262 -81811
9452 -81811 233216 -98966 -191121 -202239 213203 -138849 -102180 -33902 15561 146653 43052
9440 -296487 -24835 -47453 -30137 -59792 -94152 280726 61263 -79093 -45129 -49944 -38013 -172313
9428 -172313 131745 13566 -53284 -81125 -163877 153022 -110252 -50652 -309462 238430 -79184
9416a60169B3108b36902B4665J68099c583E8501c59356D10628I1084c645C6625
9404g7507j59749A45041a41862F024a0412A34367c31334B23631i8804A05924P7082
9393A83006a6068k34A33489b3860j95025p194g2509b134A45975b99011A59456
9381c01291D1180a14393A05701b19504q7170J23473B30653b07850A4496K4357
9371C8853j0182f8548k27495C88635b14531H7420A108R547O4448a919j59595j7673
9359a79187k61818H6335b04354M877B7713c01262c1753A52060b12885j375j0583
9348b24843q8533A19265C8507j3938e72358a82639K9655B00533b82855A79716
9337b88945a25048j18990l6720A0674J32447k5339E3408b54178A42055R6952a49149
$$ plain form
9416 -160169 23108 -236902 24665 192764 -3583 58501 -359356 410628 91084 -3645 36625
9404 -77507 -237256 145041 -141862 6024 -10412 134367 -331334 223631 -98804 105924 183006
9393 183006 -16068 -16302 133489 -23860 -218885 -226079 -72509 -2134 145975 -299011 159456
9381 -301291 41180 -114393 105701 -219504 -306674 -183201 230653 -207850 14496 38853
9371 38853 28671 -68548 -296043 388635 -214531 87420 1108 10655 75103 -1919 -161514 -179187
9359 -179187 -441005 86335 -204354 -199477 27713 -301262 -31753 152060 -212885 -214260 -224843
9348 -224843 -313376 119265 38507 24569 -572358 -182639 -152984 200533 -282855 179716
9337 -288945 -125048 -244038 -280758 10674 143121 117782 53408 -254178 142055 239007 -149149
9325E8800J04864b14027I8870Q6531g2142G6911a62612E1818G603b89216J11456
9314a77760A13195b11363o2544a926l00958D5871c699j29989m5600C1657c22486
9302a24165A97651a05122A76955F99L44774c01160j09063I6300N6645c18041a22535
9290b97214J26095q9711e6472o371j80722g3830B1492K55624F3748b456j06835
9279a09291c7159j52820A86201m5111c99053C4814a74187B70528a59581O0332
9269i9249j6519K0889L1690A7790c87179A99177r7125a38299I6332a64094c8180
9257b74501h8865C76081e08994a92548D0857b87263b8695k52093J13587e4705
9246c7540D6842b49478b3667o108A51454p2030b85159C6925a53211A5994P4652
$$ plain form
9325 58800 163664 -214027 98870 185401 -72142 76911 -162612 51818 7603 -289216 -177760
9314 -177760 113195 -211363 -273907 -1926 -302884 45871 -3699 -133688 -179288 31657 -322486
9302 -124165 197651 -105122 176955 699 345473 -301160 -410223 96300 152945 -318041 -122535
9290 -297214 -171119 -260830 -56472 -62843 -243565 -73830 21492 277116 63748 -2456 -109291
9279 -109291 -37159 -189979 186201 141090 -399053 34814 -174187 270528 -159581 -99249
9269 -99249 -115768 -94879 -63189 17790 -387179 199177 102052 -138299 96332 -164094 -38180
9257 -274501 -88865 376081 -508994 -192548 40857 -287263 -28695 -280788 -167201 -54705
9246 -37540 46842 -249478 -23667 -29775 151454 79424 -285159 36925 -153211 15994 90646
9235I0646b61332a01663a8611m8882F1974a13849A8713K6478k1423K0602K05496
9224B49866p7984B6149K65849e6897j30608A46755c43821a54277j26862f1089
9213A2919L04490j24542d84400i578I088a4090o8357A82028N3403a25494A05680
9201a43961m50457C23210b84214i3667B89409A1764L4028c393E872c38264d0000
9189a72433G9540N2847e7046F9367K6317C6057d3230J9072F0484e10132i0257
9177A09152b72394D8946N7608a26636j44624r2578C1213J24963M4646c33495A16715
9165B22820i6434K3611r4442k51267g0589A5065g2418o3826f556j54295C854b7756
9152d2137j83947a7650E2211a11259A18413O2715b74824A84955l4286a34964b5296
$$ plain form
9235 90646 -261332 -101663 -18611 -67493 61974 -113849 18713 45191 23768 44370 249866
9224 249866 171882 26149 291998 -56897 -187505 146755 -343821 -154277 -281139 -61089
9213 12919 317409 192867 -484400 -9578 9088 -14090 -82447 182028 235431 -125494 105680
9201 -143961 -594418 323210 -284214 -93667 289409 11764 45792 -3393 5872 -338264 -40000
9189 -172433 79540 132387 -57046 69367 95684 36057 -43230 -24158 60484 -510132 -90257
9177 109152 -272394 48946 106554 -126636 -271260 -363838 31213 156176 200822 -333495 116715
9165 222820 -96434 -72823 -167265 -418532 -70589 15065 -72418 -136244 -6556 -160851 3854 -27756
9152 -42137 -226084 -17650 52211 -111259 118413 181128 -274824 184955 150669 -134964 -25296
9140a75254B25772H9759a10519j01438j36620a21614B7781N111F293J20152b56366
9128F6058K57855q8267i205A13344a19970I4948c17944a45254K2022o7894F3467
9116D888b95365H3725a64615J192m9878H4776f8960B13389B0493J72391m3557
9105A49327h1541c6799j47954j9195b9611F569e8810r2880A2063b2448K565j59599
9093a79482A69273a5158A59560a38592J5690k832k9478P6056j64509d5351k57883
9082c03234I729d26624f2321j66161A27729b39938c1239q0644k07515A14250E6032
9070a32978E8783L0052j1827k9219a54604C2347a2585A31908R9860D4577b20356
9058g9234A0242L54758g3551L0244E9522i2901k23686k1622J66075l4477A97531
$$ plain form
9140 -175254 225772 89759 -110519 -211957 -348577 -121614 27781 32892 6293 126445 -256366
9128 66058 323913 235646 -9205 113344 -119970 94948 -317944 -145254 -123232 -191126 63467
9116 4888 -295365 83725 -164615 -163423 -213301 84776 -68960 213389 20493 192884 149327
9105 149327 -81541 -36799 -184753 -203948 -29611 6569 -58810 -151690 12063 -22448 -19883 -179482
9093 -179482 169273 -15158 159560 -138592 -122902 -125734 -155212 -79156 -243665 -45351 -303234
9082 -303234 9729 -426624 -62321 -228482 127729 -239938 -31239 -111883 -319398 114250 56032
9070 -132978 58783 88835 77008 47789 -154604 32347 -12585 131908 231768 44577 -220356
9058 -79234 10242 365000 -73551 -43307 59522 -92901 -316587 -338209 -172134 -206611 197531
9046I0761b84135F6250R9382a34454l1866c9060j44820o2723o8337m9204r3004
9035d57148e0693j33317A85505e1268a8501C29556g3015A25388m9450f5690l48306
9024d13996a51215A33543a23668A65226j1117b37479C6299A2035a79870a4023
9013a11890p3944B8335j0470Q6521c20992J05385B62717a81960F4162b72919l5758
9002c08677A19241b47706e3368n8824j46236R1873M4896A29702h8814H5906a51170
8990i6401m7224J9442j11659Q6834E059M3128a85373e842j42572A91337B0409
8978b99348R0046B05249c9413j00310j0025B634a36837l228j37933h5930q4109
8967a70039J1672j40461O9095g3419j46803I2605k717J53469H4832a62443D249
$$ plain form
9046 90761 -284135 66250 165632 -134454 -166320 -39060 -183880 -246603 -314940 -364144 -457148
9035 -457148 -50693 -184010 185505 -51268 -18501 329556 -73015 125388 75938 -65690 -413996
9024 -413996 -151215 133543 -123668 165226 154109 -237479 36299 12035 -179870 -14023
9013 -111890 -185834 28335 17865 104386 -320992 -215607 262717 -181960 64162 -272919 -308677
9002 -308677 119241 -247706 -53368 -112192 -258428 -166555 -121659 129702 -88814 85906 -151170
8990 -96401 -143625 -124183 -235842 -149008 5059 48187 -185373 -5842 -148414 191337 20409
8978 -299348 -209302 205249 -39413 -139723 -149748 2634 -136837 -140065 -277998 -85930 -170039
8967 -170039 -158367 -298828 -229733 -73419 -220222 92605 89888 243357 84832 -162443 4249
8955b27474d5732k28044A4877c8850A00509a33679f5747K0666A94584G1561c91255
8943b18599B9391a81474d6146a1974l32612C9665J26584b86041a21806D9802b82392
8931a27649A51035a19235I3334b7296j06332a7493G9388b6132j44730B30312d0153
8919A36564K04758O9268A04470D7623N8198J3251M29675q3192J83014q9487R85060
8908A544142L15697J541765L286008M858527D880098B352804A096770L4795D93269
8898B43632I7620Q0179L48657a5932A65523k7262K29184J27763A47612a36065
8887f6311C5816O7891Q495n0499a22624l6739C981L35893D1045b23793E0855d7203
8874A62830e1166B92058l1020a52001A88285c08707D9504a22254B87135G4426
$$ plain form
8955 -227474 -45732 -273776 14877 -38850 100509 -133679 -65747 -45081 194584 71561 -391255
8943 -218599 29391 -181474 -46146 -11974 -344586 39665 166249 -286041 -121806 49802 -282392
8931 -127649 151035 -119235 93334 -27296 -133628 -17493 79388 -26132 -170862 230312 -40153
8919 136564 341322 410590 104470 47623 105821 119072 548747 465555 648569 559082 1544142
8908 1544142 1859839 3401604 6687612 11546139 4880098 2352804 1096770 1131565 493269
8898 243632 97620 177799 526456 -15932 165523 138261 367445 495208 147612 -136065
8887 -66311 35816 103707 112202 61703 -122624 -159363 3981 339874 41045 -223793 50855 -47203
8874 162830 -51166 292058 261038 -152001 188285 -308707 49504 -122254 287135 74426
8863a74785B89223c63627J77965A9954b37201R4640C7403K26864d77103B81964
8852b13629A02067a27783A76842a36011D0767M7507a25310E8788a46932j18115
8842b65047A94382a06743E9930a04556j0033M857M1877m9660H299a84633A88342
8830A44162a96605E6800k2113d05942J70865a10622B08901a09991M751F9164c24284
$$ plain form
8863 -174785 289223 -363627 -185662 19954 -237201 -142561 37403 264267 -477103 281964
8852 -213629 102067 -127783 176842 -136011 40767 88274 -125310 58788 -146932 -265047
8842 -265047 194382 -106743 59930 -104556 -114589 -109732 -67855 -117515 8299 -184633 188342
8830 144162 -196605 56800 34687 -405942 -235077 -110622 208901 -109991 -105240 69164 -324284
$$ [...]
##END NTUPLES=NMR SPECTRUM
##END=
