
##TITLE=UV1018_M2-1005-1001_6269188_MQDBDqhm9u
##JCAMPDX= 6.0         $$ Bruker NMR JCAMP-DX V2.0
##DATA TYPE= NMR SPECTRUM
##DATA CLASS= NTUPLES
##ORIGIN= BRUKER
##OWNER= Administrator
$$ 1.72 TOPSPIN		Version 2.1
$$ 2012-06-02 07:17:17.546 -0500  Administrator@TOPSPIN
$$ Compression mode = diff/dup
##.OBSERVE FREQUENCY= 400.13188235
##.OBSERVE NUCLEUS= ^1H
##.ACQUISITION MODE= SIMULTANEOUS (DQD)
##.ACQUISITION SCHEME= undefined
##.AVERAGES= 64
##.DIGITISER RES= 22
##SPECTROMETER/DATA SYSTEM= spect
##.PULSE SEQUENCE= noesygpps1d.comp
##.SOLVENT NAME= COFFEE_calctemp
##.SHIFT REFERENCE= INTERNAL, COFFEE_calctemp, 1, 14.96715
##AUDIT TRAIL= $$ (NUMBER, WHEN, WHO, WHERE, PROCESS, VERSION, WHAT)
$$ ##TITLE= Audit trail, TOPSPIN		Version 2.1
$$ ##JCAMPDX= 5.01
$$ ##ORIGIN= Bruker BioSpin GmbH
$$ ##OWNER= Administrator
$$ $$ C:\Bruker\TOPSPIN/data/COFFEE/nmr/UV1018_M2-1005-1001_6269188_MQDBDqhm9u/12/pdata/1/auditp.txt
$$ ##AUDIT TRAIL=  $$ (NUMBER, WHEN, WHO, WHERE, PROCESS, VERSION, WHAT)
(   1,<2012-06-02 07:17:12.437 -0500>,<Administrator>,<TOPSPIN>,<go>,<TOPSPIN 2.1>,
      <created by zg
	started at 2012-06-02 07:05:42.250 -0500,
	POWCHK enabled, PULCHK disabled,
       configuration hash MD5:
       D5 CA 7A 23 FE 6B EE E2 50 67 74 61 24 F7 5E 3B
       data hash MD5: 64K
       18 26 60 E2 45 1E 35 D1 47 36 5B F3 B8 2F B7 11>)
(   2,<2012-06-02 07:17:15.250 -0500>,<Administrator>,<TOPSPIN>,<proc1d>,<TOPSPIN 2.1>,
      <Start of raw data processing
       efp LB = 0.3 FT_mod = 6 PKNL = 1 PHC0 = 0 PHC1 = 0 SI = 128K 
       data hash MD5: 128K
       F5 2E 5F 88 A3 83 F4 DA F2 2B 0F A4 97 E3 F2 74>)
(   3,<2012-06-02 07:17:16.531 -0500>,<Administrator>,<TOPSPIN>,<proc1d>,<TOPSPIN 2.1>,
      <pk PHC0 = 28.08655 PHC1 = 0 
       data hash MD5: 128K
       7B 30 9C 90 A3 72 94 87 BD 57 C9 E3 0C 26 98 EE>)
(   4,<2012-06-02 07:17:17.187 -0500>,<Administrator>,<TOPSPIN>,<proc1d>,<TOPSPIN 2.1>,
      <abs ABSG = 1 
       data hash MD5: 128K
       6F 0C 88 1B D5 FC 08 84 BE 57 09 98 69 98 75 FB>)
(   5,<2012-06-02 07:17:17.265 -0500>,<Administrator>,<TOPSPIN>,<proc1d>,<TOPSPIN 2.1>,
      <abs ABSG = 2 
       data hash MD5: 128K
       3F 5C CA 04 4F BB A7 25 1A C5 9D 0D FD F3 64 36>)
(   6,<2012-06-02 07:17:17.328 -0500>,<Administrator>,<TOPSPIN>,<proc1d>,<TOPSPIN 2.1>,
      <abs ABSG = 3 
       data hash MD5: 128K
       98 50 C4 E8 DF D7 A0 53 F7 18 53 33 39 02 3C BF>)
(   7,<2012-06-02 07:17:17.390 -0500>,<Administrator>,<TOPSPIN>,<proc1d>,<TOPSPIN 2.1>,
      <abs ABSG = 4 
       data hash MD5: 128K
       A5 DA 07 81 20 7F F4 ED 9A BC 18 5A CD 7C 74 4B>)
(   8,<2012-06-02 07:17:17.453 -0500>,<Administrator>,<TOPSPIN>,<proc1d>,<TOPSPIN 2.1>,
      <abs ABSG = 5 
       data hash MD5: 128K
       DB DC AE DE 75 84 3A 66 C4 BF BB C2 40 77 34 11>)
$$ ##END=
$$ 
$$ $$ hash MD5
$$ $$ 39 9F 2D 07 33 4E BF FE A5 2C 76 9B AD DD F3 8E
##$RELAX= 
##$RELAX= 
##$RELAX= 
##$RELAX= 
##$RELAX= 
##$RELAX= 
##$RELAX= 
##$RELAX= 
$$ [...]
##$TP07= 0
##$TPNAME0= <>
##$TPNAME1= <>
##$TPNAME2= <>
##$TPNAME3= <>
##$TPNAME4= <>
##$TPNAME5= <>
##$TPNAME6= <>
##$TPNAME7= <>
##$TPOAL= (0..7)
0.5 0.5 0.5 0.5 0.5 0.5 0.5 0.5
##$TPOFFS= (0..7)
0 0 0 0 0 0 0 0
##$TUNHIN= 0
##$TUNHOUT= 0
##$TUNXOUT= 0
##$USERA1= <user>
##$USERA2= <user>
##$USERA3= <user>
##$USERA4= <user>
##$USERA5= <user>
##$V9= 5
##$VALIST= <valist>
##$VCLIST= <CCCCCCCCCCCCCCC>
##$VD= 0
##$VDLIST= <DDDDDDDDDDDDDDD>
##$VPLIST= <PPPPPPPPPPPPPPP>
##$VTLIST= <TTTTTTTTTTTTTTT>
##$WBST= 2048
##$WBSW= 25
##$XGAIN= (0..3)
0 0 0 0
##$XL= 0
##$YL= 0
##$YMAX_a= 11442569
##$YMIN_a= -6572806
##$ZGOPTNS= <>
##$ZL1= 120
##$ZL2= 120
##$ZL3= 120
##$ZL4= 120
##$ABSF1= 14.96715
##$ABSF2= -5.585381
##$ABSG= 5
##$ABSL= 3
##$ALPHA= 0
##$AQORDER= 0
##$ASSFAC= 0
##$ASSFACI= 0
##$ASSFACX= 0
##$ASSWID= 0
##$AUNMP= <proc_prof1d_extract.lims>
##$AXLEFT= 0
##$AXNAME= <>
##$AXNUC= <1H>
##$AXRIGHT= 0
##$AXTYPE= 0
##$AXUNIT= <>
##$AZFE= 0.1
##$AZFW= 0.1
##$BCFW= 0
##$BC_mod= 0
##$BYTORDP= 0
##$COROFFS= 0
##$CY= 15
##$DATMOD= 1
##$DC= 0
##$DFILT= <>
##$DTYPP= 0
##$F1P= 0
##$F2P= 0
##$FCOR= 0.5
##$FTSIZE= 131072
##$FT_mod= 6
##$GAMMA= 0
##$GB= 0
##$INTBC= 1
##$INTSCL= 1
##$ISEN= 128
##$LB= 0.3
##$LEV0= 0
##$LPBIN= 0
##$MAXI= 10000
##$MC2= 0
##$MEAN= 0
##$ME_mod= 0
##$MI= 0
##$NCOEF= 0
##$NC_proc= -3
##$NLEV= 6
##$NOISF1= 0
##$NOISF2= 0
##$NSP= 0
##$NTH_PI= 0
##$NZP= 0
##$OFFSET= 14.96715
##$PC= 1
##$PHC0= 28.08655
##$PHC1= 0
##$PH_mod= 1
##$PKNL= yes
##$PPARMOD= 0
##$PPDIAG= 0
##$PPIPTYP= 0
##$PPMPNUM= 2147483647
##$PPRESOL= 1
##$PSCAL= 4
##$PSIGN= 0
##$PYNMP= <proc.py>
##$REVERSE= no
##$SF= 400.130005385616
##$SI= 131072
##$SIGF1= 0
##$SIGF2= 0
##$SINO= 400
##$SIOLD= 131072
##$SPECTYP= <>
##$SREGLST= <1H.CDCl3>
##$SSB= 0
##$STSI= 131072
##$STSR= 0
##$SW_p= 8223.68421052632
##$SYMM= 0
##$S_DEV= 0
##$TDeff= 65536
##$TDoff= 0
##$TI= <>
##$TILT= no
##$TM1= 0
##$TM2= 0
##$TOPLEV= 0
##$USERP1= <user>
##$USERP2= <user>
##$USERP3= <user>
##$USERP4= <user>
##$USERP5= <user>
##$WDW= 1
##$XDIM= 131072
##$YMAX_p= 502490773
##$YMIN_p= -132099132
##$CURPLOT= <Network HP LaserJet P1505>
##$CURPRIN= <$Network HP LaserJet P1505>
##$DFORMAT= <normdp>
##$LAYOUT= <+/1D_H.xwp>
##$LFORMAT= <normlp>
##$PFORMAT= <normpl>
##$SURQMSG= 1
$$ End of Bruker specific parameters
$$ ---------------------------------
##NTUPLES= NMR SPECTRUM
##VAR_NAME=  FREQUENCY,     SPECTRUM/REAL,   SPECTRUM/IMAG
##SYMBOL=    X,             R,               I
##VAR_TYPE=  INDEPENDENT,   DEPENDENT,       DEPENDENT
##VAR_FORM=  AFFN,          ASDF,            ASDF
##VAR_DIM=   131072,        131072,          131072
##UNITS=     HZ,            ARBITRARY UNITS, ARBITRARY UNITS
##FACTOR=    0.0627417313425165, 1,          1
##FIRST=     8223.62146879498, -788,         -109399
##LAST=      0,             1088,            -109929
##MIN=       0,             -132099132,      0
##MAX=       8223.62146879498, 502490773,    0
$$ Real data points
##PAGE= N=1
##DATA TABLE= (X++(R..R)), XYDATA
$$ [...]
63539A454710r765j0837j1789j3363j4924j5574j5422j5670j7570k1470k6598
63528A281728l1286l3729l3331l1486l0207k9714k8133k4052j8624j4256j1761
63517I95149r781o912l290J7K321L611M337N426P973J2004J5829J7438J6680J5385
63503A076187J5221J6133J7143J7903J8739J9880K1558K4464K8935L3811L7371
63492A327345L9588M2122M5567M8000M7280M3610L8582L2414K3840J2619P71r046
63480A692692j5501j8773j9745j9404j8501j7410j6512j6621j8486k1901k5884
63469A483954k9770l3595l7443m0926m3463m4709m4742m4007m2887m1112l8136
63458A043164l4410l1389k9578k7523k3972k0224j8583j8950j8914j7236j5220
$$ plain form
63539 1454710 1444945 1434108 1422319 1408956 1394032 1378458 1363036 1347366 1329796 1308326 1281728
63528 1281728 1250442 1216713 1183382 1151896 1121689 1091975 1063842 1039790 1021166 1006910 995149
63517 995149 985368 978456 975166 975183 977504 981115 985452 990878 998851 1010855 1026684 1044122 1060802 1076187
63503 1076187 1091408 1107541 1124684 1142587 1161326 1181206 1202764 1227228 1256163 1289974 1327345
63492 1327345 1366933 1409055 1454622 1502622 1549902 1593512 1632094 1664508 1688348 1700967 1701738 1692692
63480 1692692 1677191 1658418 1638673 1619269 1600768 1583358 1566846 1550225 1531739 1509838 1483954
63469 1483954 1454184 1420589 1383146 1342220 1298757 1254048 1209306 1165299 1122412 1081300 1043164
63458 1043164 1008754 977365 947787 920264 896292 876068 857485 838535 819621 802385 787165
63447G87165j4089j3056j0979q364o377n135m268m115m964n816n471m348l887
63434F96296m347m538l677k315j221m00M34J171J529J569J625J935K431K692K266
63419F95450J384J093K161L838M335K793K69j488j930j874j992j833p35O97Q97
63404G03065o38k321k081J74K438K922J914J194K150M717P756J0043J1060J1229
63390G53622J1479J2580J4736J7574K0302K2149K2966K3370K4178K5798K8154
63379I76908L0877L3409L5392L7086L8778L9534L7547L2403K6328K2247K1171
63368A331680K2245K4505K7462L0619L3771L7420M1612M5048M6746M7823M9631
63357A738562N0607M7378L9218K9059J9585J0684J647o465j2245j6042j8983k1143
$$ plain form
63447 787165 773076 760020 749041 740677 734300 729165 724897 720782 715818 710002 704531 700183 696296
63434 696296 691949 687411 683734 681419 680198 679798 680232 681403 682932 684501 686126 688061 690492 693184 695450
63419 695450 696834 697927 700088 703926 708261 711054 711323 709835 707905 706031 704039 702206 701471 702168 703065
63404 703065 702427 700106 698025 698199 700637 703559 705473 706667 708817 713534 721290 731333 742393 753622
63390 753622 765101 777681 792417 809991 830293 852442 875408 898778 922956 948754 976908
63379 976908 1007785 1041194 1076586 1113672 1152450 1191984 1229531 1261934 1288262 1310509 1331680
63368 1331680 1353925 1378430 1405892 1436511 1470282 1507702 1549314 1594362 1641108 1688931 1738562
63357 1738562 1789169 1836547 1875765 1904824 1924409 1935093 1936740 1930275 1918030 1901988 1883005 1861862
63345A861862k2140k2476k3016k4134k6430l1051l7809m4058m7079m6981m5941
63334A490747m5232m4388m2672l9938l6302l2209k8506k5581k2766j9373j5645
63323A138135j1947p940l650l23J223K285M814Q899J3117J6721J9825K2035K2816
63310A226010K3041K4322K6727K8800K9969L1300L3541L5963L7636L8678L9686
63299A575673M0827M1915M2501M1726L8850L3990K7653J9801J0440P88p525j4313
63287A852326k0374k5170k6813k4987k2314k1814k4124k8019l2503l7235m1605
63276A547368m4771m6480m7218m7487m7252m5872m2518l7105l0913k5708k2101
63265A109943j9279j6359j3338j0692r020r370j2712j8369k3731k6368k6060k4249
$$ plain form
63345 1861862 1839722 1817246 1794230 1770096 1743666 1712615 1674806 1630748 1583669 1536688 1490747
63334 1490747 1445515 1401127 1358455 1318517 1282215 1250006 1221500 1195919 1173153 1153780 1138135
63323 1138135 1126188 1118248 1114598 1114275 1115498 1117783 1122597 1131496 1144613 1161334 1181159 1203194 1226010
63310 1226010 1249051 1273373 1300100 1328900 1358869 1390169 1423710 1459673 1497309 1535987 1575673
63299 1575673 1616500 1658415 1700916 1742642 1781492 1815482 1843135 1862936 1873376 1874164 1866639 1852326
63287 1852326 1831952 1806782 1779969 1754982 1732668 1710854 1686730 1658711 1626208 1588973 1547368
63276 1547368 1502597 1456117 1408899 1361412 1314160 1268288 1225770 1188665 1157752 1132044 1109943
63265 1109943 1090664 1074305 1060967 1050275 1041255 1031885 1019173 1000804 977073 950705 924645 900396
63253I00396k2130j9952j7709j5455j3086j0591q647q166q946r282p503l875n32
63240G54522N67o34k771m709o178p152p562p801q615r920j0520r556p650o046
63226F65975n250n190n840o725o566m667k261j157j373j388n11M80J074J740K615
63211F30956K879K107J116P84R61J198J720K819M013M541M389M269M815O100P584
63196F80251Q416Q251P845Q309R728J1274J2636J4353J6401J7566J7025J5845
63184H27900J6015J8230K1203K3091K3330K3126K4250K7180L0499L2519L3195
63173A100538L3766L4840L5782L5925L5253L3790L1577K9546K9120L0314L1361
63162A461812L0943K9751K9030K8787K8501K8433K8755K8160K5078J9994J4974
$$ plain form
63253 900396 878266 858314 840605 825150 812064 801473 792826 784660 775714 766432 758929 755054 754522
63240 754522 755089 754455 751684 746975 740797 733645 726083 718282 709667 699747 689227 679671 672021 665975
63226 665975 660725 655535 649695 642970 636404 631737 629476 628319 626946 625558 625047 625527 626601 628341 630956
63211 630956 633835 635942 637058 637842 638803 640001 641721 644540 648553 653094 657483 661752 666567 672667 680251
63196 680251 688667 696918 704763 713072 722800 734074 746710 761063 777464 795030 812055 827900
63184 827900 843915 862145 883348 906439 929769 952895 977145 1004325 1034824 1067343 1100538
63173 1100538 1134304 1169144 1204926 1240851 1276104 1309894 1341471 1371017 1400137 1430451 1461812
63162 1461812 1492755 1522506 1551536 1580323 1608824 1637257 1666012 1694172 1719250 1739244 1754218
63151A754218J0865O500R63m921j0023j4578j9316k3758k6667k7889k8557k9341
63139A587496k9484k7952k4904k1377j7990j4551j0758o684k696O05K565L292
63127A437562M203O806J0811J4432J6788J8847K1401K3425K3589K2417K1481K1176
63115A642938K0843K0627K1332K2445K2045J9208J5068J1023P164L052j205n446
63103A799094j0003j5031k0050k4818k9797l5096l9737m2710m4047m4166m2848
63092A450791l9787l5680l1875k9133k7229k5545k3578k1228j8973j7451j6622
63081A163690j5712j4197j2309j0381q367o377m893m103l582k938k057m25K648
63068A080997O656R711J0683J0536J0730J1094J0415Q428O077M160K862K281K416
$$ plain form
63151 1754218 1765083 1771583 1772546 1767625 1757602 1743024 1723708 1699950 1673283 1645394 1616837 1587496
63139 1587496 1558012 1530060 1505156 1483779 1465789 1451238 1440480 1433796 1431100 1431705 1434270 1437562
63127 1437562 1441765 1448571 1459382 1473814 1490602 1509449 1530850 1554275 1577864 1600281 1621762 1642938
63115 1642938 1663781 1684408 1705740 1728185 1750230 1769438 1784506 1795529 1802693 1805745 1804540 1799094
63103 1799094 1789091 1774060 1754010 1729192 1699395 1664299 1624562 1581852 1537805 1493639 1450791
63092 1450791 1411004 1375324 1343449 1314316 1287087 1261542 1237964 1216736 1197763 1180312 1163690
63081 1163690 1147978 1133781 1121472 1111091 1102724 1096347 1091454 1087351 1083769 1080831 1078774 1078349 1080997
63068 1080997 1087653 1097364 1108047 1118583 1129313 1140407 1150822 1159250 1165327 1169487 1172349 1174630 1177046
63055A177046K744K667K202J656R57Q4m27k97k41p46p02J161L667L867P79l022
63039A191395m315k617J47K279L479L999L965L618L451L729M259M698M944N199
63025A228230N794O866Q065Q751Q764Q792R629J1088J2077J1940J1348J1542J2937
63012A355823J4903J6813J8710K0864K3199K5408K7365K9108L0842L3060L6204
63001A632299L9842M2930M5302M8123N2015N5708N7862N9501O2871O7961P2191
62990B236605P3992P4824P6628P8890P9766P8977P7920P7317P6314P3975P0520
62979C075728O6962O4204O2549O1464N9776N6661N2307M7212M1046L2926K2679
62968C643514J1155p61j3004k5947l9471n2497o3454p1398p6670q0102q1636q0412
$$ plain form
63055 1177046 1179790 1182457 1184659 1186315 1187272 1187356 1186929 1186632 1186391 1185645 1184943 1186104 1189771 1193638 1194417 1191395
63039 1191395 1187080 1184463 1184610 1186889 1190368 1194367 1198332 1201950 1205401 1209130 1213389 1218087 1223031 1228230
63025 1228230 1234024 1240890 1248955 1257706 1266470 1275262 1284891 1295979 1308056 1319996 1331344 1342886 1355823
63012 1355823 1370726 1387539 1406249 1427113 1450312 1475720 1503085 1532193 1563035 1596095 1632299
63001 1632299 1672141 1715071 1760373 1808496 1860511 1916219 1974081 2033582 2096453 2164414 2236605
62990 2236605 2310597 2385421 2462049 2540939 2620705 2699682 2777602 2854919 2931233 3005208 3075728
62979 3075728 3142690 3206894 3269443 3330907 3390683 3447344 3499651 3546863 3587909 3620835 3643514
62968 3643514 3654669 3653908 3640904 3614957 3575486 3522989 3459535 3388137 3311467 3231365 3149729 3069317
62956C069317p6394p1006o5539n9716n2697m4911l7717l1444k4930j7153q407
62945B579403L96Q727J6266K2319K6266K8467L0226L2582L5370L7618L8760L9125
62933B895525L9224L9034L8268L6945L5158L2539K8631K3601J7939J1564L989
62922C202417m736j4129k4219l5305m6671n6742o4909p2020p8541q3496q5964
62911B635685q6423q5682q3536p9699p5156p1280o8105o4741o1055n7722n4881
62900A847405n1977m8863m6036m3726m1621l9464l7209l4778l2401l0906l0781
62889A409643l1155l0523k8526k6138k4321k3185k2410k1574k0156j7990j5785
62878A147880j4431j3829j3011j1449r588q124p367p176o923n769l695k024k091
$$ plain form
62956 3069317 2992923 2921917 2856378 2796662 2743965 2699054 2661337 2629893 2604963 2587810 2579403
62945 2579403 2579799 2588526 2604792 2627111 2653377 2681844 2712070 2744652 2780022 2817640 2856400 2895525
62933 2895525 2934749 2973783 3012051 3048996 3084154 3116693 3145324 3168925 3186864 3198428 3202417
62922 3202417 3197681 3183552 3159333 3124028 3077357 3020615 2955706 2883686 2805145 2721649 2635685
62911 2635685 2549262 2463580 2380044 2300345 2225189 2153909 2085804 2021063 1960008 1902286 1847405
62900 1847405 1795428 1746565 1700529 1656803 1615182 1575718 1538509 1503731 1471330 1440424 1409643
62889 1409643 1378488 1347965 1319439 1293301 1268980 1245795 1223385 1201811 1181655 1163665 1147880
62878 1147880 1133449 1119620 1106609 1095160 1085572 1077448 1070081 1062905 1055982 1050213 1046518 1044494 1042403
62865A042403l625n161n887o136o231n983n407m980m922m983n096n495o081o402
62851I66014o403o417o319n505l905k273j231p71q95j811l053l284j738N31J577
62836I24517O21j191k105j506l26K26M7n4K44K74l77j047j073r83j527k154j738
62819I11848n32N1l54n40J47O80M2j122j619j532j794k429k470j552n08j41j75
62802H98000J49R21J460J238M59k42m33o2P17J659K405K683K471J824O85p84j931
62785I11219k255k117k112j936q98N18R41K93J28J106J681N72r21p41Q69J996
62769I08343K092K259K886L106K752K840L711M502M964O094Q192R911J0134R524
62755I81310R227R281R407J0175J1997J3728J3765J2267J1133J1757J3666J5418
$$ plain form
62865 1042403 1038778 1033617 1027730 1021594 1015363 1009380 1003973 998993 994071 989088 983992 978497 972416 966014
62851 966014 959611 953194 946875 941370 937465 935192 933961 933190 932295 930484 927431 924147 922409 922940 924517
62836 924517 925138 923947 921842 920336 920010 920236 920283 920229 920473 920747 920370 919323 918250 917267 915740 913586 911848
62819 911848 911316 911367 911013 910473 910620 911300 911342 910220 908601 907069 905275 902846 900376 898824 898316 898175 898000
62802 898000 898149 899070 900530 901768 902227 901985 901552 901490 902207 903866 906271 908954 911425 913249 913934 913150 911219
62785 911219 908964 906847 904735 902799 901901 902419 903360 903653 903781 904887 906568 907140 906219 905478 906347 908343
62769 908343 910435 912694 915580 918686 921438 924278 927989 932491 937455 943549 951741 961652 971786 981310
62755 981310 990537 999818 1009225 1019400 1031397 1045125 1058890 1071157 1082290 1094047 1107713 1123131
62743A123131J6179J6277J6656J7914J9782K1594K3280K5492K8637L2143L4994
62732A376079L6817L8287M0625M4623M9952N5562O0859O6182P1777P7001Q1336
62721A999100Q5599R0941R6938J01886J04897J06347J06253J03849R9120R3135
62711B988065Q5988P5890O1520M4286K6966J0630n826k3481m1676n8547p2467
62700C091348q3018r0927r7081j01592j04087j04823j04606j03609j01167r7186
62690B103252r2729q8606q4317p9073p2994o6529n9606n2343m5921m1505l8678
62679A380951l5960l2607k8977k5477k2150j9154j6723j4708j2823j1113r461
62668A151798p006l145J051L574L793L275M079O857J0634J3706J4775J4104J3727
$$ plain form
62743 1123131 1139310 1155587 1172243 1190157 1209939 1231533 1254813 1280305 1308942 1341085 1376079
62732 1376079 1412896 1451183 1491808 1536431 1586383 1641945 1702804 1768986 1840763 1917764 1999100
62721 1999100 2084699 2175640 2272578 2374464 2479361 2585708 2691961 2795810 2894930 2988065
62711 2988065 3074053 3149943 3211463 3255749 3282715 3293345 3287519 3264038 3222362 3163815 3091348
62700 3091348 3008330 2917403 2820322 2718730 2614643 2509820 2405214 2301605 2200438 2103252
62690 2103252 2010523 1921917 1837600 1758527 1685533 1619004 1559398 1507055 1461134 1419629 1380951
62679 1380951 1344991 1312384 1283407 1257930 1235780 1216626 1199903 1185195 1172372 1161259 1151798
62668 1151798 1144792 1141647 1142698 1146272 1150065 1153340 1157419 1164276 1174910 1188616 1203391 1217495 1231222
62655A231222J5715J9943K4325K7488L0246L3978L8452M2190M4522M6417M9452
62644A603950N4426O0794O6981P1578P4691P7807Q1794Q5549Q7489Q7855Q8245
62633B441159Q8837Q7588Q2714P4633O4575N2563L8105K2035O010r525k5230m0887
62621B882577n5148o7430p8354q7818r4275r6943r7260r7059r6386r4365r1108
62610A926431q7335q2788p6655o9332o2428n7068n3232n0489m8246m5439m1167
62599A252252l5867l1045k7815k6171k5362k4335k2214j9233j6784j5799j5565
62588I92062j4952j3986j3142j1959r897p836o960o669n454l452k152j711q86
62575H93006K28k20k746n191n429l761j693m4P81L06r16j061P97L314M721N077
$$ plain form
62655 1231222 1246937 1266880 1291205 1318693 1348939 1382917 1421369 1463559 1508081 1554498 1603950
62644 1603950 1658376 1719170 1786151 1857729 1932420 2010227 2092021 2177570 2265059 2352914 2441159
62633 2441159 2529996 2617584 2700298 2774931 2839506 2892069 2930174 2952209 2958219 2948694 2923464 2882577
62621 2882577 2827429 2759999 2681645 2593827 2499552 2402609 2305349 2208290 2111904 2017539 1926431
62610 1926431 1839096 1756308 1679653 1610321 1547893 1490825 1437593 1387104 1338858 1293419 1252252
62599 1252252 1216385 1185340 1157525 1131354 1105992 1081657 1059443 1040210 1023426 1007627 992062
62588 992062 977110 963124 949982 938023 928126 920290 913330 906661 901207 897755 895603 893892 893006
62575 893006 893234 893014 890268 885077 879648 875887 874194 874150 874931 875237 874321 873260 874057 877371 882092 887169
62559H87169N602O713P828Q492Q788R112R958J1284J1988J1169J0032J0956J4221
62546A013312J7457J9055K0185K2314K4744K6351K8047L1384L5818L9437M1794
62535A319898M3985M6375M8079M8614M8568M8476M7993M6181M1985L4965K6120
62524A801239J7262Q929lr869j8889k5606l1096l6892m2007m4331m4270m4409
62512A530058m5827m6948m6319m4346m1930l9227l6432l4223l2732l1196k9124
62501A101754k6739k3979k0322j6038j2534j0826j0346r724q062n350k405n56
62489I54873n26j419j551m11R79J770K311L228M324M941M864M443M222M639N794
62474I92481P345Q841J0197J1661J3495J5742J8025J9514J9725J9619K1016K4402
$$ plain form
62559 887169 892771 899484 907312 915804 924592 933704 943662 954946 966934 978103 988135 999091 1013312
62546 1013312 1030769 1049824 1070009 1092323 1117067 1143418 1171465 1202849 1238667 1278104 1319898
62535 1319898 1363883 1410258 1458337 1506951 1555519 1603995 1651988 1698169 1740154 1775119 1801239
62524 1801239 1818501 1827430 1827427 1817558 1798669 1773063 1741967 1705075 1663068 1618737 1574467 1530058
62512 1530058 1484231 1437283 1390964 1346618 1304688 1265461 1229029 1194806 1162074 1130878 1101754
62501 1101754 1075015 1051036 1030714 1014676 1002142 991316 980970 971246 963184 957834 955429 954873
62489 954873 954347 952928 951377 950966 951945 953715 956026 959254 963578 968519 973383 977826 982048 986687 992481
62474 992481 999826 1008667 1018864 1030525 1044020 1059762 1077787 1097301 1117026 1136645 1157661 1182063
62462A182063K8236L1209L4083L8264M3483M8347N2492N6588O0568O3493O5120
62451A703946O6197O7029O6931O5334O2381N8332N3220M7217M0730L4189K8211
62440B293717K3290J8857J3635P978M584N377Q853J2488J6533K2818L0707L7535
62428B496372M3069M9899N8526O5455O7970O7912O8379O8828O6005N8194M6015
62417C156624L0330J2177n742k0512l2509m5299o1241p8619r3740j04570j11464
62406B645435j15392j16713j15522j12224j07481j01742r5069q7404p8962p0252
62396A644674o1748n3781m6698m0771l5823l1264k6692k2269j8376j5129j2360
62385A279763r867p523n336l388j587L63K450L991M181K941Q56j549l994o112
$$ plain form
62462 1182063 1210299 1241508 1275591 1313855 1357338 1405685 1458177 1514765 1575333 1638826 1703946
62451 1703946 1770143 1837172 1904103 1969437 2031818 2090150 2143370 2190587 2231317 2265506 2293717
62440 2293717 2317007 2335864 2349499 2357477 2362061 2367438 2376291 2388779 2405312 2428130 2458837 2496372
62428 2496372 2539441 2589340 2647866 2713321 2781291 2849203 2917582 2986410 3052415 3110609 3156624
62417 3156624 3186954 3199131 3193389 3172877 3140368 3095069 3033828 2955209 2861469 2756899 2645435
62406 2645435 2530043 2413330 2297808 2185584 2078103 1976361 1881292 1793888 1714926 1644674
62396 1644674 1582926 1529145 1482447 1441676 1405853 1374589 1347897 1325628 1307252 1292123 1279763
62385 1279763 1269896 1262373 1257037 1253649 1252062 1252425 1254875 1258866 1263047 1265988 1266844 1265295 1261301 1255189
62371A255189p621q780j0125j1669j2916j3636j4069j4344j4263j3825j3440j3500
62359A107001j3998j4470j4121j2371r795q096q353r615j0012q954p377o165n450
62346I78224n244n470n249l460l05K677M405N104N304N219N298O088P128P272
62332A006991O533O292P041P492O892O746Q704J1791J3585J3631J3845J5528J7638
62319A142709J8625J8680J9170K0562K1967K2638K2993K3725K4513K4459K3779
62308A383820K4192K7129L2104L7420M2007M5958M9791N4054N9339O5554P1268
62297A892636P4780P5940P5959P5464P3736O9887O3665N4937M3622L0651J7889
62286B549166O526l670j3118k1503k8616l5073m1351m6899n0930n3488n4915n5001
$$ plain form
62371 1255189 1247568 1238788 1228663 1216994 1204078 1190442 1176373 1162029 1147766 1133941 1120501 1107001
62359 1107001 1093003 1078533 1064412 1052041 1042246 1034150 1025797 1016182 1006170 997216 989839 983674 978224
62346 978224 972980 967510 962261 958801 958496 961173 965578 970682 975986 981205 986503 992591 999719 1006991
62332 1006991 1013524 1019816 1026857 1034349 1041241 1047987 1056691 1068482 1082067 1095698 1109543 1125071 1142709
62319 1142709 1161334 1180014 1199184 1219746 1241713 1264351 1287344 1311069 1335582 1360041 1383820
62308 1383820 1408012 1435141 1467245 1504665 1546672 1592630 1642421 1696475 1755814 1821368 1892636
62297 1892636 1967416 2043356 2119315 2194779 2268515 2338402 2402067 2457004 2500626 2531277 2549166
62286 2549166 2555692 2552022 2538904 2517401 2488785 2453712 2412361 2365462 2314532 2261044 2206129 2151128
62274B151128n3382n0362m6629m2658l8966l6368l5083l4022l1805k8474k5484
62263A727895k4115k4425k5712k7408k9207l0585l0693k9177k7045k5996k6423
62252A427109k6763k5599k3708k2811k2710k1446j8343j5170j3593j2978j1763
62241A212225r795q166p382o829n666l615j140P71J469J640K553M252N475N766
62227A191558O308P847R272R389Q910R186R914R870R344J0005J2425J5307J7456
62214A326791J9052K0644K2057K3017K3975K5532K7526K9375L1087L3446L7124
62203A619626M1834M6600N0885N5366O1177O8318P5150P9801Q1782Q1953Q1023
62192B343515P8483P3037O3928N1792L8188K4429J1130j107j1425j9742k7517
$$ plain form
62274 2151128 2097746 2047384 2000755 1958097 1919131 1882763 1847680 1813658 1781853 1753379 1727895
62263 1727895 1703780 1679355 1653643 1626235 1597028 1566443 1535750 1506573 1479528 1453532 1427109
62252 1427109 1400346 1374747 1351039 1328228 1305518 1284072 1265729 1250559 1236966 1223988 1212225
62241 1212225 1202430 1194264 1186882 1180053 1174387 1170772 1169632 1170403 1171872 1173512 1176065 1180317 1185792 1191558
62227 1191558 1197866 1205713 1214985 1224374 1233284 1242470 1252384 1262254 1271598 1281603 1294028 1309335 1326791
62214 1326791 1345843 1366487 1388544 1411561 1435536 1461068 1488594 1517969 1549056 1582502 1619626
62203 1619626 1661460 1708060 1758945 1814311 1875488 1943806 2018956 2098757 2180539 2262492 2343515
62192 2343515 2421998 2495035 2558963 2610755 2648943 2673372 2684502 2683395 2671970 2652228 2624711
62181B624711l6479m6712n6810o5537p2306p6398p7320p6101p4641p3268p0384
62170A898755o5124n8958n3721m9388m4940m0286l6039l2128k7990k3670j9731
62159A446780j6542j4439j3822j4097j3304j0251o504m741n295n685l775k08K641
62146A340758L358K689K623M535P926J0931J2247J2322J2393J2791J2868J2255
62134A447696J1445J1069J1199J1576J2160J3149J4437J5314J5112J4316J4513
62123A591986J6544J9125K0125J9005J7069J5546J4591J4165J4497J5432J6633
62112A774718J8643K2424K7539L2396L6657M1531M7009N0906N1886N1496N1430
62101B206635N0486M6256L8586K9357J9781J0060R23o744j3469k0388k7143l2407
$$ plain form
62181 2624711 2588232 2541520 2484710 2419173 2346867 2270469 2193149 2117048 2042407 1969139 1898755
62170 1898755 1833631 1774673 1720952 1671564 1626624 1586338 1550299 1518171 1490181 1466511 1446780
62159 1446780 1430238 1415799 1401977 1387880 1374576 1364325 1357821 1353080 1347785 1342100 1338325 1338117 1340758
62146 1340758 1344116 1346805 1349428 1353963 1361889 1372820 1385067 1397389 1409782 1422573 1435441 1447696
62134 1447696 1459141 1470210 1481409 1492985 1505145 1518294 1532731 1548045 1563157 1577473 1591986
62123 1591986 1608530 1627655 1647780 1666785 1683854 1699400 1713991 1728156 1742653 1758085 1774718
62112 1774718 1793361 1815785 1843324 1875720 1912377 1953908 2000917 2051823 2103709 2155205 2206635
62101 2206635 2257121 2303377 2341963 2371320 2391101 2401161 2402084 2395340 2381871 2361483 2334340 2301933
62089B301933l6296m0326m4941m8845n1006n1696n1294m9578m6551m2783l8658
62078A799959l4335l0417k7483k4978k1893j8535j6325j5664j5382j4510j3356
62067A567081j2513j1946j1374j0533q898o183l182j038M03K261M558N843N218
62054A519697L283P30k558o236q753r080q204p844q280q620q798j0017j2965j6422
62040A415933j8241j7571j5599j3854j2231r408n127j009J411K535L663M967N654
62027A341123N693O144P780J0427J3483J6327J8278J9153J9758K1082K3202K5580
62015A528030K8041L0551L2613L3928L5144L6783L8025L7902L7244L7838L9901
62004A916000M1979M3063M3058M1345L6850K9868K1990J3909N015m457j2802j9111
$$ plain form
62089 2301933 2265637 2225311 2180370 2131525 2080519 2028823 1977529 1927951 1881400 1838617 1799959
62078 1799959 1765624 1735207 1707724 1682746 1660853 1642318 1625993 1610329 1594947 1580437 1567081
62067 1567081 1554568 1542622 1531248 1520715 1511817 1505634 1502452 1501414 1501817 1504078 1508636 1514479 1519697
62054 1519697 1522980 1523710 1521152 1514916 1506163 1497083 1488879 1481035 1472755 1464135 1455337 1445320 1432355 1415933
62040 1415933 1397692 1380121 1364522 1350668 1338437 1329029 1323902 1322893 1324304 1326839 1330502 1335469 1341123
62027 1341123 1346816 1352960 1360740 1371167 1384650 1400977 1419255 1438408 1458166 1479248 1502450 1528030
62015 1528030 1556071 1586622 1619235 1653163 1688307 1725090 1763115 1801017 1838261 1876099 1916000
62004 1916000 1957979 2001042 2044100 2085445 2122295 2152163 2174153 2188062 2193077 2188620 2175818 2156707
61992B156707k4444k9922l5227l9931m4638m9654n3810n5990n6765n7360n7850
61981A651116n7566n6478n4963n2778m9332m4697l9606l4794l0865k8195k6383
61970A175459k4408k1932j9787j8498j7253j5121j2725j1630j2375j3977j5210
61959I92543j5653j5522j5053j4182j2700j0688q689p115n773m352l125k382j597
61946H75712j50J328J672J145J287K589L866M255M233M004K695K12j722j862j493
61931H97771k594m851o276o208n942o537p526p952p565o708n840n303m965m201
61917H15303k727j271p56j116j579j890k401l086l350k949k421k336k548k427
61903G84446j596k91Q95J629K087K561K875K605J899J575K312M120O617R323J1652
$$ plain form
61992 2156707 2132263 2102341 2067114 2027183 1982545 1932891 1879081 1823091 1766326 1708966 1651116
61981 1651116 1593550 1537072 1482109 1429331 1379999 1335302 1295696 1260902 1230037 1201842 1175459
61970 1175459 1151051 1129119 1109332 1090834 1073581 1058460 1045735 1034105 1021730 1007753 992543
61959 992543 976890 961368 946315 932133 919433 908745 900056 892941 887168 882816 879691 877309 875712
61946 875712 875562 876890 878562 879707 880994 883583 887449 891704 895937 899941 902636 902848 901126 899264 897771
61931 897771 895177 890326 884050 877842 871900 865363 857837 849885 842320 835612 829772 824469 819504 815303
61917 815303 812576 811305 810549 809433 807854 805964 803563 800477 797127 794178 791757 789421 786873 784446
61903 784446 782850 782559 783454 785083 787170 789731 792606 795211 797110 798685 800997 805117 811734 821057 832709
61888H32709J3239J4496J6123J7967J9087J9270J9635K1236K3693K5763K6706
61877A049924K6510K5345K3470K1463K0039J9573J9793J9752J8331J5381J2168
61866A271749R895Q019N103J264j678k768l169m146n205n105l617j279J552M477
61852A275092O777Q455J0704J4218J7780J9668J9741J8954J7389J4227R422M272
61840A436699K73j937k828l802o169r490j1539j0849q646p282p433q103q702r494
61826A340698j0260j0196r352q902r661j1284j3123j4909j6479j7640j8466j8985
61814A181441j8570j6474j2980r217n903l032o31J163K734M677O848Q705J0510
61801A149271J2983J5716J7349J7742J8594K1207K4842K8158L1083L4131L6734
$$ plain form
61888 832709 845948 860444 876567 894534 913621 932891 952526 973762 997455 1023218 1049924
61877 1049924 1076434 1101779 1125249 1146712 1166751 1186324 1206117 1225869 1244200 1259581 1271749
61866 1271749 1281644 1289663 1294766 1296030 1294352 1291584 1288415 1284269 1279064 1273959 1270342 1269063 1270615 1275092
61852 1275092 1281869 1290324 1301028 1315246 1333026 1352694 1372435 1391389 1408778 1423005 1432427 1436699
61840 1436699 1436972 1435035 1432207 1428405 1422236 1412746 1401207 1390358 1381712 1374430 1366997 1358894 1350192 1340698
61826 1340698 1330438 1320242 1310890 1301988 1292327 1281043 1267920 1253011 1236532 1218892 1200426 1181441
61814 1181441 1162871 1146397 1133417 1124200 1118297 1115265 1114634 1115797 1118531 1123208 1130056 1138761 1149271
61801 1149271 1162254 1177970 1195319 1213061 1231655 1252862 1277704 1305862 1336945 1371076 1407810
61790A407810L7832L7758L8115L9487M0412L9042L5151K9882K4099J7729J0736
61779A758053M056r10l626m897n867o912p667p812p281n845l111P56M830Q215
61765A721982J0759J2521J3009J1588Q574N052J356l468j0012j6968k2182k5115
61753A707096k7196k9609l1824l2739l2353l1502l0650k9900k9617k9947k9939
61742A371820k8332k5313k2604k1564k1886k2244k1536j9423j6326j3222j0970
61731A148400r709r076q776q448p511n860m374l843l787l258k386j933j798j336
61717A076305p81p42o04P12K461K761J799K050M710Q056J0235J1391J1946J1209
61703A141508R389Q819J0981J3923J4790J3560J2093J0756Q436N106J963o88l580
$$ plain form
61790 1407810 1445642 1483400 1521515 1561002 1601414 1640456 1675607 1705489 1729588 1747317 1758053
61779 1758053 1762109 1761199 1757573 1752676 1746809 1739897 1732230 1724418 1717137 1711292 1708181 1708937 1713767 1721982
61765 1721982 1732741 1745262 1758271 1769859 1778433 1783485 1784841 1781373 1771361 1754393 1732211 1707096
61753 1707096 1679900 1650291 1618467 1585728 1553375 1521873 1491223 1461323 1431706 1401759 1371820
61742 1371820 1343488 1318175 1295571 1274007 1252121 1229877 1208341 1188918 1172592 1159370 1148400
61731 1148400 1138691 1129615 1120839 1112391 1104880 1099020 1094646 1090803 1087016 1083758 1081372 1079439 1077641 1076305
61717 1076305 1075524 1074782 1074178 1074890 1077351 1080112 1081911 1083961 1088671 1096727 1106962 1118353 1130299 1141508
61703 1141508 1150897 1159716 1170697 1184620 1199410 1212970 1225063 1235819 1244255 1249361 1251324 1250636 1247056
61690A247056o836r921j2852j5667j7212j6456j4647j4120j5149j5911j5428j4525
61678A078332j3952j3529j3209j3037j1915q477l511L74J814J691R19n71k244
61665A002685k622j506n61p49r92m66k92j577l310l829l176k528k267k011j810
61650I74989j978k387k996m360o540q244q244p062o214o344p036p849q415q118
61636H89202o858n739n898o899p336o787o098n975o204o245n728m505k967k155
61622H09808k728l942m450l905l033k326j606q02j25M82J156J409O03o82r28L11
61606G89242J679J811R48J85K8N02J803L784N362N590N061N023N353M745L004
61591H34120J711K006K981L190K619K098J644Q88N47J789M101N487N106M282M250
$$ plain form
61690 1247056 1240220 1230299 1217447 1201780 1184568 1168112 1153465 1139345 1124196 1108285 1092857 1078332
61678 1078332 1064380 1050851 1037642 1024605 1012690 1004213 1000702 1001076 1002890 1004581 1005500 1004929 1002685
61665 1002685 1000063 998557 997996 997247 996255 995789 995497 993920 990610 986781 983605 981077 978810 976799 974989
61650 974989 973011 970624 967628 963268 956728 948484 940240 933178 926964 920620 913584 905735 897320 889202
61636 889202 882344 876605 870707 863808 856472 849685 843587 837612 831408 825163 819435 814930 811963 809808
61622 809808 807080 803138 798688 794783 791750 789424 787818 787016 786891 787373 788529 789938 790541 789859 788931 789242
61606 789242 790921 792732 793680 793865 793893 794395 796198 799982 805344 810934 815995 821018 826371 831116 834120
61591 834120 835831 837837 840818 844008 846627 848725 850369 851257 851804 853593 857694 863181 868287 872569 876819
61576H76819M258K919M56j645k642l128l905n226o926q503r168q548p303o485
61562H20973o359o400o217n910n597n254m975m961n236n721o438p196p369o465
61548G36875m831l412k925l559n053o596p085o193m904m384m611m737m453m210
61534F69922m279m379m213l686k662j171J45M34m73j918l043l196k183o77N0m46
61518F38225j067o50L38O21J85J89R95J658J513R87N95L24M07J472L321M651M676
61501F58440M195M220M443M001L109K836L359L487K206J22j084n15R25J527O89
61486F91960m78n59N44J802K450K618K637K449J923J294J084J569K410K713J674
61471G16090o47l290n119n399l940j375P73J393J218J812K842K099r68l556l029
$$ plain form
61576 876819 881077 883996 884452 882807 880165 877037 873132 867906 860980 852477 843309 834761 827458 820973
61562 820973 814614 808214 801997 796087 790490 785236 780261 775300 770064 764343 757905 750709 743340 736875
61548 736875 732044 728632 725707 722148 717095 710499 703414 697221 692317 687933 683322 678585 674132 669922
61534 669922 665643 661264 657051 653365 650703 649532 649677 650111 649638 647720 644677 641481 639298 638621 638671 638225
61518 638225 637158 636508 636846 637467 637652 637841 638836 640494 642007 642994 643589 643913 644320 645792 649113 653764 658440
61501 658440 662635 666855 671298 675299 678408 681244 684603 688090 690296 690418 689334 688819 689744 691271 691960
61486 691960 691482 690923 691467 693269 695719 698337 700974 703423 705346 706640 707724 709293 711703 714416 716090
61471 716090 715443 712153 707034 701635 697695 696320 697093 698486 699704 701516 704358 706457 705489 701933 698904
61456F98904m88J137J385K033L394L815K944K683M058N546N595M836M534M491
61442G44867L855K867K527L258M760O428P324O753N485N250O409P227O303M402
61428H17715L017K297J603J021R69R93L65n51p36j24K52l79j658k558k365j428
61412H18433j053k075l472l346j467K15K18p09j201j430k372l846m565l789j924
61397G87617QP98k52k138k569o23J804K499J938K213L666M600M283M183N610P722
61381H21359Q684P847O028M461M020M827N987O225N261M087L581L381K720J793
61367H90261J512K027K414K054J627K118L269L829L408L094L745M480L867K134
61353I29839R39R25Q09o33k641l388k180o4J433J622R73N58J014J878K209J772
$$ plain form
61456 698904 698416 699553 700938 702971 706365 710180 713124 715807 719865 725411 731006 735842 740376 744867
61442 744867 748722 751589 754116 757374 762134 768562 775886 782639 788124 793374 799783 807010 813313 817715
61428 817715 820732 823029 824632 825653 826622 827615 827980 827429 826693 826569 826821 826442 824784 822226 819861 818433
61412 818433 817380 815305 811833 808487 807020 807235 807453 806744 805543 804113 801741 797895 793330 789541 787617
61397 787617 787625 788423 788171 786033 783464 782841 784645 787144 789082 791295 794961 799561 803844 808027 813637 821359
61381 821359 830043 837890 843918 848379 852399 857226 863213 869438 874699 878786 882367 885748 888468 890261
61367 890261 891773 893800 896214 898268 899895 902013 905282 909111 912519 915613 919358 923838 927705 929839
61353 929839 930778 931703 932512 931879 929238 925850 923670 923606 925039 926661 927634 928192 929206 931084 933293 935065
61337I35065J174P50K58k12L6J080J730Q44j218l055l767l462k719k081j748j301
61321I21374j43J460K337J953J377K033L897N560N798M631L068K209K282K301
61307I60137J146q27j964j446m26l23q15m63J197L101M050L882L358L433M549
61292I78589O311Q018R506J0942J1782J0961Q500N926M507M003L872M438N831
61279A073186O777N964M030K698K372J959Q92j99q16j251j681j644p96O03K047
61264A094141K992K822J550M88J191L552N875O960P255P760Q789J0192J1810J3249
61250A178626J3932J3967J4277J5366J6525J6871J6581J6297J5691J3583R494
61239A341210M445m6l302n678p775r736j1122j1317j0352r363r769j1577j3036
$$ plain form
61337 935065 936239 936989 937247 937035 937071 938151 939881 940725 939507 936452 932685 929223 926504 924423 922675 921374
61321 921374 921231 922691 925028 926981 928358 930391 934288 939848 945646 950277 953345 955554 957836 960137
61307 960137 961283 960456 958492 957046 956620 956297 955482 955019 956216 959317 963367 967249 970607 974040 978589
61292 978589 984900 992918 1002424 1013366 1025148 1036109 1044609 1050535 1055042 1059045 1062917 1067355 1073186
61279 1073186 1079963 1085927 1089957 1092655 1095027 1096986 1097878 1097679 1096863 1095612 1093931 1092287 1091491 1092094 1094141
61264 1094141 1097133 1099955 1101505 1101993 1103184 1106736 1112611 1119571 1126826 1134586 1143375 1153567 1165377 1178626
61250 1178626 1192558 1206525 1220802 1236168 1252693 1269564 1286145 1302442 1318133 1331716 1341210
61239 1341210 1345655 1345609 1342307 1336629 1328854 1319118 1307996 1296679 1286327 1276964 1267195 1255618 1242582
61226A242582j2673j1236j0580j0787r942p253m715m440n558n486l483j099N12
61213A155842J682K619K761K304K483L602M371M079L912N047O867Q297R634J1614
61199A225114J3622J4288J3285J1282Q670N575K697R24K55qk18k69j83j66l69
61184A294499r98k090k927k603j570j409k355k579r71Q27P51n55q36N00K126L300
61168A283110M575O167P426Q043Q327Q403Q391R079J0879J2355J1612R123P413
61155A394903P666Q389P825O093M356L334L314M382N866O555O213N970O744Q081
61141A479691R142J0014J1434J3703J6367J8447J8900J7520J5474J4188J3549
61130A638429J1997Q633M298L61k676m913o368p154p823q912j0456j2245j4070
$$ plain form
61226 1242582 1229909 1218673 1208093 1197306 1187364 1180111 1175396 1170956 1165398 1159912 1156429 1155330 1155842
61213 1155842 1157524 1160143 1162904 1165208 1167691 1171293 1175664 1179743 1183655 1188702 1195569 1203866 1213500 1225114
61199 1225114 1238736 1253024 1266309 1277591 1286261 1291836 1294533 1295457 1295712 1295704 1295486 1295217 1295034 1294868 1294499
61184 1294499 1293501 1291411 1288484 1285881 1284311 1282902 1280547 1277968 1276997 1277824 1278575 1278020 1277184 1277684 1279810 1283110
61168 1283110 1287685 1293852 1301278 1309321 1317648 1326051 1334442 1343521 1354400 1366755 1378367 1387490 1394903
61155 1394903 1402569 1410958 1418783 1424876 1429232 1432566 1435880 1440262 1446128 1452683 1458896 1464866 1471610 1479691
61141 1479691 1488833 1498847 1510281 1523984 1540351 1558798 1577698 1595218 1610692 1624880 1638429
61130 1638429 1650426 1659059 1663357 1663718 1661042 1656129 1649761 1642607 1634784 1625872 1615416 1603171 1589101
61117A589101j5581j6373j6466j6282j6038j5567j4822j4061j3485j3152j3200
61106A424074j3613j3853j3416j2725j2701j3386j3727j2807j0592p347l275Q96
61094A297528L769M445L558K776L306N008O765P554P208O076M203J425j646l568
61080A348407l598k521j252N49L486O867R545J1799J4794J8331K0836K1767K2458
61067A471468K4021K5845K6970K7852K9695L2716L5929L8303L9539M0075M0867
61056A833280M2891M6266M9881N2164N2312N0873M9250M8497M8279M7181M4339
61045B365213M0547L7324L5140L3087L0125K6058K1429J6914J2836Q893M533j77
61033B631922m368p498j0116j2920j5650j7654j9200k1283k4239k7288k9385k9994
$$ plain form
61117 1589101 1573520 1557147 1540681 1524399 1508361 1492794 1477972 1463911 1450426 1437274 1424074
61106 1424074 1410461 1396608 1383192 1370467 1357766 1344380 1330653 1317846 1307254 1299907 1296632 1297528
61094 1297528 1301297 1305742 1309300 1312076 1315382 1320390 1327155 1334709 1341917 1347993 1352196 1353621 1351975 1348407
61080 1348407 1344809 1342288 1341036 1341585 1345071 1351938 1361483 1373282 1388076 1406407 1427243 1449010 1471468
61067 1471468 1495489 1521334 1548304 1576156 1605851 1638567 1674496 1712799 1752338 1792413 1833280
61056 1833280 1876171 1922437 1972318 2024482 2076794 2127667 2176917 2225414 2273693 2320874 2365213
61045 2365213 2405760 2443084 2478224 2511311 2541436 2567494 2588923 2605837 2618673 2627566 2632099 2631922
61033 2631922 2627554 2620056 2609940 2597020 2581370 2563716 2544516 2523233 2498994 2471706 2442321 2412327
61021B412327k9271k8046k7416k7794k8688k9514l0115l0087k8760k6482k4832
61010B101322k4442k3710k0994j7189j4568j3642j2910j1224q833o244l664j507
60998A942395K3J844N152R715J4248J8322K2454K6546K9850L2642L6380M1794
60986B181365M7985N3714N8549O2589O6169P0070P5136Q1385Q8054R4307R9466
60975B978789J03228J06553J11551J19211J27919J35566J42367J50018J58773
60966D133975J67302J75092J83210J92778K04198K17745K33596K51592K72079
60957F031567K96162L23812L52937L82152M13398M50159M94682N49131O17404
60948I911404P02713Q04959R23382J059398J213380J382366J566567J773318K004460
$$ plain form
61021 2412327 2383056 2355010 2327594 2299800 2271112 2241598 2211483 2181396 2152636 2126154 2101322
61010 2101322 2076880 2053170 2032176 2014987 2000419 1986777 1973867 1962643 1953810 1947566 1943902 1942395
60998 1942395 1942418 1944262 1949414 1959129 1973377 1991699 2014153 2040699 2070549 2103191 2139571 2181365
60986 2181365 2229350 2283064 2341613 2404202 2470371 2540441 2615577 2696962 2785016 2879323 2978789
60975 2978789 3082017 3188570 3300121 3419332 3547251 3682817 3825184 3975202 4133975
60966 4133975 4301277 4476369 4659579 4852357 5056555 5274300 5507896 5759488 6031567
60957 6031567 6327729 6651541 7004478 7386630 7800028 8250187 8744869 9294000 9911404
60948 9911404 10614117 11419076 12342458 13401856 14615236 15997602 17564169 19337487 21341947
60939B1341947K241765K456527K630086K740766K719946K452423J870078J062754
60931C9516292K70124k68943m69425m10406k24551j5730J17897M1625l62335j075235
60921C7119313j902065k582688k953543l011614k853515k584488k278293j980539
60913A6972568j715044j486107j288782j120548r80551q63047p59722o67250n87112
60904G504405n19436m61854m12818l71337l34763l00936k71153k47003k25953
60895D359152k04192j82312j63784j49148j36217j24983j17592j13735j10334
60886C056855j05755j00706r5304q9049q3253p9689p7175p3258o8727o6340o5508
60875B152091o2866n8161n4766n3694n1866m7641m3500m1370l9494l6141l2808
$$ plain form
60939 21341947 23583712 26040239 28670325 31411091 34131037 36583460 38453538 39516292
60931 39516292 39786416 39517473 39048048 38637642 38413091 38397361 38515258 38556883 38194548 37119313
60921 37119313 35217248 32634560 29681017 26669403 23815888 21231400 18953107 16972568
60913 16972568 15257524 13771417 12482635 11362087 10381536 9518489 8758767 8091517 7504405
60904 7504405 6984969 6523115 6110297 5738960 5404197 5103261 4832108 4585105 4359152
60895 4359152 4154960 3972648 3808864 3659716 3523499 3398516 3280924 3167189 3056855
60886 3056855 2951100 2850394 2755090 2666041 2582788 2503099 2425924 2352666 2283939 2217599 2152091
60875 2152091 2089225 2031064 1976298 1922604 1870738 1823097 1779597 1738227 1698733 1662592 1629784
60864A629784l1230l0334k8559k6587k5385k3964k1507j9543j9632k0604k0300
60853A362139j8603j6837j5507j4475j4023j4057j3440j1684j0149j0123j0891
60842A212350j1080j0793j0952j1656j2550j3753j5065j5282j3773j1846j1155
60831A074445j1505j1521j0735r672q445o795n207m783n964q027r828j0509r852
60818I61602q406p060o167n355m170k532o55Q94J313N91K7P08J847K059J818K752
60802I39266M634N336M139K821K601K290P95o24l42R21J285N44k3P9J57k07q24
60785I62848j800l511n726p695r014r705r826r578r540j0070j0788j1106j0980
60772H53509j0671j0237r639r038q591q330q281q236p592o156m957n113n973n795
$$ plain form
60864 1629784 1598554 1568220 1539661 1513074 1487689 1463725 1442218 1422675 1403043 1382439 1362139
60853 1362139 1343536 1326699 1311192 1296717 1282694 1268637 1255197 1243513 1233364 1223241 1212350
60842 1212350 1201270 1190477 1179525 1167869 1155319 1141566 1126501 1111219 1097446 1085600 1074445
60831 1074445 1062940 1051419 1040684 1031012 1022567 1015772 1010565 1005782 999818 991791 981963 971454 961602
60818 961602 953196 946136 939969 934614 930444 927912 927257 928151 929464 930055 930082 930790 932637 934696 936514 939266
60802 939266 943900 949236 953375 956196 958797 961087 961882 961258 960916 961837 963122 963666 963643 963722 963879 963672 962848
60785 962848 961048 957537 951811 944116 935102 925397 915571 905993 896453 886383 875595 864489 853509
60772 853509 842838 832601 822962 813924 805333 797003 788722 780486 772894 766738 761781 756668 750695 744900
60758G44900m352l205k988k392p48K50j040l471m537l653k317j654j379r25k62
60743G12227M97J290J946K377K729K926K627K111K272L105L114J279j228k425
60729G34847j936r01j57J28l48j734l123l331k566k061k138j970j333j195k132
60714G10050l303l642l229k789k455j767o02M96R67Q70O44L21p10k736m656m724
60698F82735k649k27P97P67J143K067K319J543J067J949L457M262M314M388M426
60683G12358L576J854M48j4m53j879l723m580m152l334k673j885j008p01j044
60668F92790j101l67N64J390K927N396P075O320M084K660K356J503l80j659j321
60653G22237n93q00j342j118o42j144k344k748j970j396k323m286n589n104l353
$$ plain form
60758 744900 740548 737343 734355 731963 731215 731465 730425 726954 722417 718764 716447 714793 713414 712489 712227
60743 712227 712724 714014 715960 718337 721066 723992 726619 728730 731002 734107 737221 738500 737272 734847
60729 734847 732911 732010 731853 731981 731633 729899 726776 723445 720879 718818 716680 714710 713377 712182 710050
60714 710050 706747 703105 699876 697087 694632 692865 692263 692759 693726 694596 695240 695561 694851 692115 687459 682735
60698 682735 680086 679859 680656 681423 682566 684633 686952 688495 689562 691511 694968 699230 703544 707932 712358
60683 712358 715934 717788 718236 718222 717769 715890 712167 707587 703435 700101 697428 695543 694535 693834 692790
60668 692790 691689 691322 691886 693276 696203 701599 708674 714994 719078 721738 724094 725597 725217 723558 722237
60653 722237 721644 720844 719502 718384 717742 716598 714254 711506 709536 708140 705817 701531 695942 690838 687485
60638F87485j912j764k325k314j399m80m10j080j848k264k184j705j153o63J95
60623F66179J790L624M898N736O801P768P471N794M078L296L025K744K702K711
60609G28617J605j028l737n094n613o356o669n129k135K51R71Q17O38L56J25P71
60593F98390K316L340K829J687J439K087K370J733Q74M07M7o63j637k693l900
60578G08626m998n161m030k495j599j052J42J790K502J751O46K68L89N13R00J726
60562F99918K271K046J763J996J884O07p46n60P22J267P80O08J105J072K84L19
60546G15336J981L767L993L018K198J890J623J215O47k49j000k38K523N678P156
60531G49538O767N915N552N537N574N712N836N545M697L644K940K972L633M097
$$ plain form
60638 687485 685573 683809 681484 679170 677771 677291 676881 675801 673953 671689 669505 667800 666647 665984 666179
60623 666179 667969 671593 676491 682227 689028 696796 704267 710061 714139 717435 720460 723204 725906 728617
60609 728617 730222 729194 725457 720363 714750 708394 701725 696596 694461 694712 695683 696500 697138 697494 697619 698390
60593 698390 700706 704046 706875 708562 710001 712088 714458 716191 717065 717472 717519 716856 715219 712526 708626
60578 708626 703628 698467 694437 691942 690343 689291 689433 691223 693725 695476 696122 696390 696779 697292 698192 699918
60562 699918 702189 704235 705998 707994 709878 710485 709739 709179 709901 711168 711948 712556 713661 714733 715017 715336
60546 715336 717317 721084 725077 728095 730293 732183 733806 735021 735668 735419 734419 734181 736704 742382 749538
60531 749538 756305 762220 767772 773309 778883 784595 790431 795976 800673 804317 807257 810229 813862 817959
60517H17959L445J866Q66J871M813Q348J1135J2658J3263J3670J4258J4737J4726
60504I33615J4526J4745J5246J4978J3064R600N516K068J49n53j371k882l726
60491A014975k238J165M497O776Q640J0577J2168J3315J4710J6624J8531K0296
60479A140036K2545K5628K9285L3352L7473M0234M0271L8229L5806L2870K7610
60468A503339J9832J1690M529k537r948j5988j9172k0235k0355j9457j7615j6037
60456A398046j4899j2256p111j696J419K759M379O582Q670J1455J6121K1549K5489
60443A460507K7951L1043L5938M2228M9624N7816O4939O8761O9551O9519O9360
60432B047237O7416O2532N5754M8790M2478L7047L2259K7015K0211J2118L549
$$ plain form
60517 817959 821404 823270 824136 826007 830820 839168 850303 862961 876224 889894 904152 918889 933615
60504 933615 948141 962886 978132 993110 1006174 1015774 1021290 1023358 1023507 1022954 1021583 1018701 1014975
60491 1014975 1012737 1013902 1018399 1025175 1033815 1044392 1056560 1069875 1084585 1101209 1119740 1140036
60479 1140036 1162581 1188209 1217494 1250846 1288319 1328553 1368824 1407053 1442859 1475729 1503339
60468 1503339 1523171 1534861 1539390 1536853 1526905 1510917 1491745 1471510 1451155 1431698 1414083 1398046
60456 1398046 1383147 1370891 1363780 1362084 1363503 1366262 1370641 1377223 1385893 1397348 1413469 1435018 1460507
60443 1460507 1488458 1519501 1555439 1597667 1647291 1705107 1770046 1838807 1908358 1977877 2047237
60432 2047237 2114653 2177185 2232939 2281729 2324207 2361254 2393513 2420528 2440739 2452857 2456406
60421B456406o096j8213l2487m6874o0273p3196q5218r3729r6421r3864q8745
60410A761290q3272p7995p2306o5531n8019n1271m6427m2822l8853l4165k9879
60399A160750k6719k4134k1506j9175j7730j7035j6306j4829j2586j0479r567
60388I70684r641r190p489n860n824o725o581m812k792j895k325l601m962n500
60374H93487n024m513m694m844m179l543l962m417l138o46Q27Q06R42J834K033
60359H60969Q40l26l41l6k58k12R41K317K641K103J670J532J458J715K452L008
60343H80473K893K774L476M709N609N961N900N153L658K467K988N300P926R211
60329I48498Q592O834N373N177N838O056N211M058L677M204M918N087M463L289
$$ plain form
60421 2456406 2450310 2432097 2399610 2352736 2292463 2219267 2134049 2040320 1943899 1850035 1761290
60410 1761290 1678018 1600023 1527717 1462186 1404167 1352896 1306469 1263647 1224794 1190629 1160750
60399 1160750 1134031 1109897 1088391 1069216 1051486 1034451 1018145 1003316 990730 980251 970684
60388 970684 961043 951853 944364 938504 932680 925955 919374 914562 911770 909875 907550 903949 898987 893487
60374 893487 888463 883950 879256 874412 870233 866690 862728 858311 855173 854527 855354 856160 857102 858936 860969
60359 860969 861809 861483 861142 861106 860848 860636 861577 863894 866535 868638 870308 871840 873298 875013 877465 880473
60343 880473 883366 886140 889616 894325 899934 905895 911795 916948 920606 923073 926061 931361 939287 948498
60329 948498 957090 963924 969297 974474 980312 986368 991579 995637 999314 1003518 1008436 1013523 1017986 1021275
60315A021275K198J827K357L469M735N713N940N398M850N021N458M968L261J594
60301A078064J567L627O810R558J0881J1108J1380J2119J2479J1783J0848J0950
60289A191174J1816J1683R170M455j143n978q848r887j0344j0942j1017j0050
60277A160089q984q757q569p286n640n026m904l778k411l315o678r563r847q576
60263A066755p250n265j796J763L419L591M527P179J0193J1939J2369J2720J3991
60250A134135J5854J6931J6292J4391J2132R696P324O579Q898J2847J4708J2381
60238A282168P169J316m417j0111j5462k0240k4436k7000k6053k1612j6608j3817
60226A110897j3015j2415j1503j0877j0441r721r207r649j0454j0319r143p899
$$ plain form
60315 1021275 1023473 1025300 1027657 1031126 1035861 1041574 1047514 1052912 1057762 1062783 1068241 1073209 1076470 1078064
60301 1078064 1079631 1083258 1090068 1099626 1110507 1121615 1132995 1145114 1157593 1169376 1180224 1191174
60289 1191174 1202990 1214673 1223843 1228298 1227155 1221177 1212329 1202442 1192098 1181156 1170139 1160089
60277 1160089 1151105 1142348 1133779 1126493 1120853 1115827 1110923 1107145 1104734 1101419 1094741 1085178 1075331 1066755
60263 1066755 1059505 1054240 1052444 1054207 1057626 1061217 1065744 1072923 1083116 1095055 1107424 1120144 1134135
60250 1134135 1149989 1166920 1183212 1197603 1209735 1219431 1226755 1233334 1242232 1255079 1269787 1282168
60238 1282168 1289337 1290653 1286236 1276125 1260663 1240423 1215987 1188987 1162934 1141322 1124714 1110897
60226 1110897 1097882 1085467 1073964 1063087 1052646 1042925 1033718 1024069 1013615 1003296 994153 986254
60214I86254o878n500l705k306j918k469l591m606m473k812q03j40j033k105k042
60199I41873o39J548L584M385L516J875P94N01J78m01k66J375L763N154M628K992
60183I74860J891K145L100L555L047J968Q79L11Q76K730M904O068O006N527N023
60168A022890M302L896N058P695R686R411P974P720R222J0986J1721J1645J1681
60155A133887J2316J3412J4359J4434J3522J2459J2190J2654J2931J2380J1167
60144A275711R862Q852Q209P829P642P668P668O918M841J948l69j137o05K43M11
60129A345691p56l204n908p634q180q259q218p701o688n824n375m795l843l079
60115A266227k740k115p85M02M87j63n86q54j837l521m539l804j984r98k045m272
$$ plain form
60214 986254 979376 973876 970171 967865 965947 963478 959887 955281 950808 947996 947193 947053 946020 943915 941873
60199 941873 941234 942782 946366 950751 954267 956142 956936 957437 957615 957214 956948 958323 962086 967240 971868 974860
60183 974860 976751 978896 981996 985551 988598 990566 991445 991756 992632 995362 1000266 1006334 1012340 1017867 1022890
60168 1022890 1027192 1031088 1036146 1043841 1053527 1062938 1070912 1078632 1087854 1098840 1110561 1122206 1133887
60155 1133887 1146203 1159615 1173974 1188408 1201930 1214389 1226579 1239233 1252164 1264544 1275711
60144 1275711 1285573 1294425 1302634 1310463 1318105 1325773 1333441 1340359 1345200 1347148 1346779 1345642 1345037 1345280 1345691
60129 1345691 1344935 1341731 1335823 1328189 1320009 1311750 1303532 1295831 1289143 1283319 1277944 1273149 1269306 1266227
60115 1266227 1263487 1261372 1260587 1260989 1261476 1261313 1260727 1259873 1258036 1254515 1249976 1246172 1244188 1243190 1241145 1236873
60099A236873n627n038l408k166j479n64P43J802K249K157J302m79k184k290p09
60084A221182J117K238L019L712L805L361L551N035P029Q630R796J0297R191O497
60070A298460M214M255O094P556P355N990M773M755O027P395P472O583O667Q642
60056A386238J1003J1777J0777R084P426O186N834O155N885M316K516J843K168
60043A471208K581K907L279L131K078R86P16N12q32k722l348k298j119j376l373
60028A472330o515r666j1372j1105j0336j1195j3947j6761j7946j7415j5994j4409
60016A315669j3097j2262j1864j2030j3124j4779j5372j3627j0600q919r812j1862
60004A168321j2853j2065j0256q210o011l656j783j239j900k437j835p58n60j128
$$ plain form
60099 1236873 1231246 1226208 1222800 1220634 1219155 1218591 1219334 1221136 1223385 1225542 1226844 1226365 1224181 1221891 1221182
60084 1221182 1222299 1224537 1227556 1231268 1235073 1238434 1241985 1247020 1254049 1262679 1272475 1282772 1291963 1298460
60070 1298460 1302674 1306929 1313023 1320579 1327934 1333924 1338697 1343452 1349479 1356874 1364346 1370929 1377596 1386238
60056 1386238 1397241 1409018 1419795 1428879 1436305 1442491 1448325 1454480 1460365 1464681 1467197 1469040 1471208
60043 1471208 1473789 1476696 1479975 1483106 1485184 1486170 1486886 1487398 1486566 1483844 1480496 1478198 1477079 1475703 1472330
60028 1472330 1465815 1456149 1444777 1433672 1423336 1412141 1398194 1381433 1363487 1346072 1330078 1315669
60016 1315669 1302572 1290310 1278446 1266416 1253292 1238513 1223141 1209514 1198914 1189995 1180183 1168321
60004 1168321 1155468 1143403 1133147 1124937 1118926 1115270 1113487 1112248 1110348 1107911 1106076 1105318 1104758 1103630
59990A103630r93L42J558J580J201J744L128M261M597M370L967L813M198M498
59976A141894L472J075r96j484j237j647k480k714k678l629n596p276q116r022
59962A099566j0659j2103j1839r677p212o298p044p712o974n721n583o202n655
59949I96887l599j974k046k691k630k451l025l671l406k697k376k132j533j243
59935I61413j685j806p53N49J084J582K827L712L124K302K930M229M528M486N658
59920I94180O886N515J940n22n37k98j478k773k651j895j930k597l004l050k823
59905I84963j852j07J302J421O74J60M72J508K646K963K150J190J129J424P94
59890A000837m92p80M94K122L047L383L306K603J682J551K211K503J969J470J591
$$ plain form
59990 1103630 1102637 1102979 1104537 1106117 1107318 1109062 1112190 1116451 1121048 1125418 1129385 1133198 1137396 1141894
59976 1141894 1145366 1146441 1145445 1143961 1142724 1141077 1138597 1135883 1133205 1129576 1123980 1116704 1108588 1099566
59962 1099566 1088907 1076804 1064965 1055288 1048076 1041778 1034734 1027022 1020048 1014327 1008744 1002542 996887
59949 996887 993288 991314 989268 986577 983947 981496 978471 974800 971394 968697 966321 964189 962656 961413
59935 961413 959728 957922 957169 957718 958802 960384 963211 966923 970047 972349 975279 979508 984036 988522 994180
59920 994180 1001066 1006581 1008521 1007999 1007462 1007164 1005686 1002913 1000262 998367 996437 993840 990836 987786 984963
59905 984963 983111 983004 984306 985727 986401 986561 987033 988541 991187 994150 996300 997490 998619 1000043 1000837
59890 1000837 1000345 999565 1000059 1002181 1005228 1008611 1011917 1014520 1016202 1017753 1019964 1022467 1024436 1025906 1027497
59875A027497J902K279L501N763P954R094R441R517R175Q258P285O744O427N783
59861A120620M335J823j150k774j680J112L223L962M743O324P523P306O365N607
59847A167339M590K730R21M86J151J264j43k408m174m665m069l129k436k048j680
59832A153729r47N93L043N587O970P053O889O925O314N030N008P552J0811J1901
59818A236458J0761R719R791R701Q390O350M339K719K064K586L055K144O46K88
59804A309011P07R6j294j156R68K711K668K400L442M785M999M851N992Q479J1077
59789A359736J2883J3577J3156J2258J1586J0484P543L067o61k213k355k008r59
59776A436094M72O61j100l378m900o309q321r897r904r124q939r198q947q231
$$ plain form
59875 1027497 1029399 1031678 1035179 1040942 1048896 1057990 1067431 1076948 1086123 1094381 1101666 1108410 1114837 1120620
59861 1120620 1124955 1126778 1125628 1122854 1121174 1122286 1125509 1129471 1134214 1140538 1148061 1155367 1161732 1167339
59847 1167339 1171929 1174659 1175580 1176066 1177217 1178481 1178338 1175930 1171756 1167091 1163022 1159893 1157457 1155409 1153729
59832 1153729 1152782 1153375 1156418 1162005 1168975 1176028 1182917 1189842 1196156 1201186 1206194 1213746 1224557 1236458
59818 1236458 1247219 1256938 1266729 1276430 1284820 1291170 1295509 1298228 1300292 1302878 1305933 1308077 1308723 1309011
59804 1309011 1309718 1309814 1308520 1307364 1308332 1311043 1313711 1316111 1319553 1324338 1329337 1334188 1340180 1348659 1359736
59789 1359736 1372619 1386196 1399352 1411610 1423196 1433680 1441223 1444290 1443629 1441416 1439061 1437053 1436094
59776 1436094 1436566 1437227 1436127 1432749 1427849 1421540 1413219 1403322 1393418 1384294 1375355 1366157 1357210 1348979
59762A348979p750p590p455p335o955n572l282j422q51q53n44j13Pq4m78j465
59746A297237k331j862o54q25k634l760l034k208k519k316m19Q14j221m961o752
59731A262555n996n106n252n353m830m458m474m395m715o397q559q899o818m250
59717A183053l113l478m342m551k903R32N294P764P819P096O983P261P183O595
59703A221593N759N188N714P765J0544J2841J4484J5963J7015J6822J5569J4445
59691A363702J4051J3808J3095J2069J1232J0897J1004J0908R714P461N495M857
59679A488293M893M284K863J379J39r06j347r48n40r53j469q01O98J325M10j030
59663A496290j990k491k742k605k160j738j242l08Q12J549K098L211M895O344
$$ plain form
59762 1348979 1341229 1333639 1326184 1318849 1311894 1306322 1303040 1301618 1300767 1299914 1299370 1299257 1299264 1299180 1298702 1297237
59746 1297237 1294906 1293044 1292390 1291565 1288931 1285171 1282137 1279929 1277410 1275094 1274675 1275489 1274268 1269307 1262555
59731 1262555 1256559 1251453 1246201 1240848 1236018 1231560 1227086 1222691 1217976 1211579 1203020 1194121 1187303 1183053
59717 1183053 1179940 1176462 1172120 1167569 1164666 1165598 1170892 1178656 1186475 1193571 1200554 1207815 1214998 1221593
59703 1221593 1227352 1232540 1238254 1246019 1256563 1269404 1283888 1299851 1316866 1333688 1349257 1363702
59691 1363702 1377753 1391561 1404656 1416725 1427957 1438854 1449858 1460766 1470480 1477941 1483436 1488293
59679 1488293 1493186 1497470 1500333 1501712 1501851 1500945 1499598 1498650 1498110 1497157 1495688 1494887 1495585 1496910 1497320 1496290
59663 1496290 1494300 1491809 1489067 1486462 1484302 1482564 1481322 1481014 1481826 1483375 1485473 1488684 1493579 1499923
59649A499923P333Q622J0795J3482J5862J7281J7361J6369J5485J5845J7190J8121
59637A673669J7714J6311J4827J3946J3797J3607J1833P572J959k570m535m408
59625A773722l541k880k809l465m779o520q475j0476j2333j3929j5187j5895j5841
59612A657592j5234j4464j3414j1631r282p152n392l305p75J180J901K134K857
59599A585015M065N427P096Q901R832R350Q375P786O900M618J257k087n223q612
59585A642700j2046j4950j7405j9639k1142k1588k1961k3226k4375k3457k0295
59574A422616j6756j4420j3390j3235j3675j4205j4292j4197j4717j6028j7489
59563A260212j8522j8970j8797j8113j7181j5912j3869j1286r187p859o279m024
$$ plain form
59649 1499923 1507256 1515878 1526673 1540155 1556017 1573298 1590659 1607028 1622513 1638358 1655548 1673669
59637 1673669 1691383 1707694 1722521 1736467 1750264 1763871 1775704 1783276 1785235 1782665 1778130 1773722
59625 1773722 1770181 1767301 1764492 1761027 1756248 1749728 1741253 1730777 1718444 1704515 1689328 1673433 1657592
59612 1657592 1642358 1627894 1614480 1602849 1593567 1586415 1581023 1577718 1576943 1578123 1580024 1582158 1585015
59599 1585015 1589080 1594507 1601603 1610504 1620336 1629686 1638061 1645847 1652747 1657365 1658622 1656535 1651312 1642700
59585 1642700 1630654 1615704 1598299 1578660 1557518 1535930 1513969 1490743 1466368 1442911 1422616
59574 1422616 1405860 1391440 1378050 1364815 1351140 1336935 1322643 1308446 1293729 1277701 1260212
59563 1260212 1241690 1222720 1203923 1185810 1168629 1152717 1138848 1127562 1118375 1110516 1104237 1100213
59551A100213k477k772l734l492k147j116p01k82j10p47j309l78J538K582K437
59536A087505K483L127L157K046P83k7r67k162k687k242j853k164k562k570k675
59521A079192l080l031k218j604k118l444m736n520n394l958j681O0M22j08o91
59506A042091j015r81m58K11L73P7L8M36O79O17Q95J729K477K874L546M733N544
59489A063866N361N145O272Q600J0559J1156J1190J2432J5676J9773K2675K3567
59477A216272K3503K3557K2880J9463J2596L900l940q852j0131q541n775l215
59465A281717j101Q00K248K721K119N70j845m566o368o716o620p272q530r820
59451A237337j1491j3777j5252j4231j1352q953q094p851p444p167p016o175m302
$$ plain form
59551 1100213 1097736 1094964 1091230 1087738 1085591 1084475 1083774 1083492 1083382 1082635 1081326 1080948 1082486 1085068 1087505
59536 1087505 1089988 1093115 1096272 1098318 1099101 1099074 1098107 1095945 1093258 1091016 1089163 1086999 1084437 1081867 1079192
59521 1079192 1076112 1073081 1070863 1069259 1067141 1063697 1058961 1053441 1048047 1044089 1042408 1042468 1042890 1042782 1042091
59506 1042091 1041076 1040095 1039637 1039848 1040221 1040298 1040336 1040772 1041451 1042068 1042963 1044692 1047169 1050043 1053589 1058322 1063866
59489 1063866 1069227 1074372 1080644 1089244 1099803 1110959 1122149 1134581 1150257 1170030 1192705 1216272
59477 1216272 1239775 1263332 1286212 1305675 1318271 1322171 1318231 1309379 1299248 1290707 1284932 1281717
59465 1281717 1280616 1281416 1283664 1286385 1288504 1289074 1287229 1282663 1276295 1269579 1262959 1255687 1247157 1237337
59451 1237337 1225846 1212069 1196817 1182586 1171234 1162281 1154187 1146336 1138892 1131725 1124709 1118534 1114232
59438A114232k051o4J427K057J687J227J652K429K388J932K483L934M800N014
59424A143147O249Q885J0907J0878R919R596R498Q397O411M619L533L084L208
59411A238331L408K705R51o63j275j507j992j918l41J789K545J704J160K557N437
59396A252891Q046R354R783J0179J0569J0291R321Q713R199R877R063O254K547
59383A366087o46k644l566m153n199o414o317m171j469k97p35j093l33J202K964
59368A333216M545N185M766N056P999J2735J6415J8112J9728K2486K5004K5952
59356A501199K6432K8092L0552L2604L4574L7233L8805L5312K4655R472m563j2878
59344A781489j4477j1200n550N14N550Q820J0626J1170Q668L37j3381k7128l5191
$$ plain form
59438 1114232 1112181 1112117 1113544 1115601 1117288 1118515 1120167 1122596 1124984 1126916 1129399 1133333 1138133 1143147
59424 1143147 1149396 1158281 1169188 1180066 1189985 1199581 1209079 1217476 1223887 1228506 1232039 1235123 1238331
59411 1238331 1241739 1244444 1245395 1244732 1243457 1241950 1239958 1238040 1237699 1239488 1242033 1243737 1244897 1247454 1252891
59396 1252891 1260937 1270291 1280074 1290253 1300822 1311113 1320434 1329147 1338346 1348223 1357286 1363540 1366087
59383 1366087 1365441 1362797 1359231 1355078 1349879 1343465 1337148 1332977 1331508 1331211 1330476 1329383 1329050 1330252 1333216
59368 1333216 1337761 1342946 1347712 1352768 1360767 1373502 1389917 1408029 1427757 1450243 1475247 1501199
59356 1501199 1527631 1555723 1586275 1618879 1653453 1690686 1729491 1764803 1789458 1798930 1794367 1781489
59344 1781489 1767012 1755812 1750262 1750776 1756326 1765146 1775772 1786942 1795610 1795947 1782566 1755438 1720247
59331A720247l6893l5562l3314k9583k4368j9632j6593j4114j1001p927o058n291
59319A479911m916m632m043k460q4J743K190J871J645J641J930K969M776O630
59305A489171P934Q525Q180P043O431P694J0261J2341J3525J4941J6863J8185
59293A621094J8603J9202K0421K1424K1977K2989K4478K5024K3904K2009K0040
59282A861165J7753J5434J3885J2279Q494K541k820n987q622j2477j6623j9534
59270A865488k1590k3581k4740k4391k3835k4462k5442k5306k4460k4235k4568
59259A598878k4463k3700k2511k0666j8443j7225j7542j7707j5903j2515r048
59248A399155o256m648n015o547o228k307L015O566Q389J0639J3628J5661J5739
$$ plain form
59331 1720247 1683354 1647792 1614478 1584895 1560527 1540895 1524302 1510188 1499187 1491260 1485202 1479911
59319 1479911 1474995 1470363 1466320 1463860 1463776 1465519 1467709 1469580 1471225 1472866 1474796 1477765 1482541 1489171
59305 1489171 1497105 1505630 1513810 1520853 1527284 1534978 1545239 1557580 1571105 1586046 1602909 1621094
59293 1621094 1639697 1658899 1679320 1700744 1722721 1745710 1770188 1795212 1819116 1841125 1861165
59282 1861165 1878918 1894352 1908237 1920516 1929010 1931551 1928731 1922744 1914122 1901645 1885022 1865488
59270 1865488 1843898 1820317 1795577 1771186 1747351 1722889 1697447 1672141 1647681 1623446 1598878
59259 1598878 1574415 1550715 1528204 1507538 1489095 1471870 1454328 1436621 1420718 1408203 1399155
59248 1399155 1392899 1388251 1383236 1376689 1370461 1368154 1371169 1377735 1386124 1396763 1410391 1426052 1441791
59235A441791J3726Q643j27j0066j6830j8703j7756j6348j4666j2009q568n097
59223A343990k087K68K181M360P124R671J1157J2006J3036J3968J4240J4647J6514
59210A461075J9438K1480K1566K0282J8471J6433J4532J3158J1847R705O844M482
59198A639313L354K841J807k31k788m831n811o402p714r564j0528j0106r519r734
59184A570087j0123r994r878r999r237p400o860r434j2800j2776q906n076m467
59171A453137o270p946q496q612r076j0147j1503j2275j1866j0963j0745j1004
59159A334234j0226p914n608m900n305n055l471j631o61k10P71K122K384J051
59145A295581l8J228M310O638P025O808P294P873P422O035M367K513O56l61j38
$$ plain form
59235 1441791 1455517 1464160 1464033 1453967 1437137 1418434 1400678 1384330 1369664 1357655 1349087 1343990
59223 1343990 1341903 1342171 1344352 1348712 1355836 1365507 1376664 1388670 1401706 1415674 1429914 1444561 1461075
59210 1461075 1480513 1501993 1523559 1543841 1562312 1578745 1593277 1606435 1618282 1627987 1634831 1639313
59198 1639313 1642667 1645508 1647315 1647084 1644296 1639465 1633654 1627252 1619538 1609974 1599446 1589340 1579821 1570087
59184 1570087 1559964 1549970 1540092 1530093 1520856 1513456 1506596 1497162 1484362 1471586 1462680 1457604 1453137
59171 1453137 1446867 1438921 1430425 1421813 1412737 1402590 1391087 1378812 1366946 1355983 1345238 1334234
59159 1334234 1324008 1316094 1310486 1305586 1300281 1295226 1291755 1290124 1289463 1289253 1290024 1292146 1294530 1295581
59145 1295581 1295543 1296771 1301081 1307719 1314744 1321552 1328846 1336719 1344141 1350176 1354543 1357056 1357712 1357351 1357213
59130A357213M75O29N53O82P29M35J26j60r16j899k137j857k662m768o142n724
59114A334577n466p280r773j0274q670o940o031n455n081n054m584k929j098o25
59100A255317j247j599j653k434l795m524m424m580n571o936q154q865q451o785
59086A186299m948m113m274n030o541q497r449q810q212r044r931q713n738k877
59072A090122m34K329M505M376K706K318M240O646P878Q290Q778R550J0779J2724
59058A174807J4876J6416J7472J8562J9159J8407J6860J5712J4692J2712J0167
59047A349842Q497P794O966O060O014O216M826J777r47k429l818n586o326n373
59033A373513m488n407p159p425n603l279k205k736m006n031n553n993o648p372
$$ plain form
59130 1357213 1357688 1358317 1358870 1359552 1360281 1360716 1360842 1360682 1359766 1357867 1355730 1353873 1351211 1346443 1340301 1334577
59114 1334577 1329111 1321831 1312058 1301784 1293114 1286174 1280143 1274688 1269607 1264553 1259969 1257040 1255942 1255317
59100 1255317 1254070 1252471 1250818 1248384 1244589 1240065 1235641 1231061 1225490 1218554 1210400 1201535 1193084 1186299
59086 1186299 1181351 1177238 1172964 1167934 1161393 1152896 1143447 1134637 1126425 1117381 1107450 1098737 1092999 1090122
59072 1090122 1089688 1092017 1096522 1100898 1103604 1105922 1110162 1116808 1124686 1132976 1141754 1151304 1162083 1174807
59058 1174807 1189683 1206099 1223571 1242133 1261292 1279699 1296559 1312271 1326963 1339675 1349842
59047 1349842 1358339 1366133 1373099 1379159 1385173 1391389 1396215 1397992 1397045 1394616 1390798 1385212 1378886 1373513
59033 1373513 1369025 1363618 1356459 1349034 1343431 1340152 1337947 1335211 1331205 1326174 1320621 1314628 1307980 1300608
59019A300608q128r088r870r604q334p255o923o517n670n390o070o316n289m433
59005A201721m976n617m861l965m810o379o320m895m275m677m420l389l196l999
58991A135942m151l150k199j675o25R82J970K106K291K585K327J978K484L079
58977A143944K310R29J010K359K787J965J887L289M732N677P342R817J1361J1471
58963A210880J1898J3656J5562J6601J7189J7218J5504J2160R180P537N925L282
58951A356592M18j633k816l051k216j612k909n058m908j608K133M068M914N822
58937A348136O131N059L359J868L10j277j908j342n63P0J179K420K559J949K406
58922A370356M026M928M786N631Q201J0664J2076J4006J7162J9539J9687J9020
$$ plain form
59019 1300608 1292480 1283392 1273522 1263918 1255584 1248329 1241406 1234889 1229219 1223829 1217759 1211443 1206154 1201721
59005 1201721 1196745 1191128 1186267 1182302 1177492 1171113 1164793 1159898 1155623 1150946 1146526 1143137 1139941 1135942
58991 1135942 1131791 1128641 1126442 1124767 1124142 1125124 1127094 1129200 1131491 1134076 1136403 1138381 1140865 1143944
58977 1143944 1146254 1147183 1148193 1150552 1153339 1155304 1157191 1160480 1165212 1170889 1178231 1188048 1199409 1210880
58963 1210880 1222778 1236434 1251996 1268597 1285786 1303004 1318508 1330668 1339848 1347385 1353310 1356592
58951 1356592 1357010 1355377 1352561 1349510 1347294 1345682 1342773 1337715 1332807 1331199 1333332 1337400 1342314 1348136
58937 1348136 1354267 1359326 1362685 1364553 1364863 1363586 1361678 1360336 1359773 1359843 1361022 1363442 1366001 1367950 1370356
58922 1370356 1374382 1379310 1384096 1389727 1397928 1408592 1420668 1434674 1451836 1471375 1491062 1510082
58910A510082J8994J8693J7197J5733J5389J4951J3094J0486Q021N169J894k66
58898A649437r34k388o168j0590j3607j5794j8192j9665j9007j7621j7492j8277
58886A489702j8754j9193j9728j8457j4220r650q260r678j0580r387p114m583
58874A340098j773M59R72N47J136K830L758K995J617P66L37k39j174k397l421
58859A346511l437k361j327j225j334l95J651L935O006P903R536J0913J2341J3811
58845A402528J4836J5489J6621J8520K0325K1250K1319K0548J8842J7070J6591
58834A603939J7209J7347J6796J7245J9387K1621K2655K3234K4033K4038K2516
58823A830020K0509J8766J6224J2383R211Q540R134Q413N809K561n88l509n510
$$ plain form
58910 1510082 1529076 1547769 1564966 1580699 1596088 1611039 1624133 1634619 1642640 1647809 1649703 1649437
58898 1649437 1648503 1646115 1639947 1629357 1615750 1599956 1581764 1562099 1543092 1525471 1507979 1489702
58886 1489702 1470948 1451755 1432027 1413570 1399350 1389700 1381440 1371762 1361182 1351795 1344681 1340098
58874 1340098 1338325 1338784 1339756 1340303 1341439 1344269 1348027 1351022 1352639 1353405 1353742 1353503 1352329 1349932 1346511
58859 1346511 1343074 1340713 1339386 1338161 1336827 1336432 1338083 1342018 1348024 1355927 1365463 1376376 1388717 1402528
58845 1402528 1417364 1432853 1449474 1467994 1488319 1509569 1530888 1551436 1570278 1587348 1603939
58834 1603939 1621148 1638495 1655291 1672536 1691923 1713544 1736199 1759433 1783466 1807504 1830020
58823 1830020 1850529 1869295 1885519 1897902 1907113 1915653 1924787 1933200 1939009 1941570 1940982 1937473 1931963
58810A931963n929n311m692m470m818o103p944r251j0073j1843j4959j7896j9746
58797A808928k1486k3537k4365k3143k1689k1877k2952k3289k2919k2444k1328
58786A559899j9377j8091j8433j8819j7644j6222j6873j9240k0873k0486j8705
58775A355136j6387j3974j1841r857p520n291m363m239k706N35K653J816P8O0
58761A284100J106J243P83J141J848J615R46J054J502J405J548K688L196J212
58747A305387k066m003m436n159o498p185p046p110p426p128o312n832n610n018
58733A224558m343m182m163l813l689m005l387q43K301M317N688P809J0293J1742
58719A238283J2041J1981J1554J0487R353Q505P136M846K582N66k614p094j0213
$$ plain form
58810 1931963 1926034 1920723 1916031 1911561 1906743 1900640 1892696 1883445 1873372 1861529 1846570 1828674 1808928
58797 1808928 1787442 1763905 1739540 1716397 1694708 1672831 1649879 1626590 1603671 1581227 1559899
58786 1559899 1540522 1522431 1503998 1485179 1467535 1451313 1434440 1415200 1394327 1373841 1355136
58775 1355136 1338749 1324775 1312934 1303077 1295557 1290266 1285903 1281664 1278958 1279493 1282146 1283962 1284040 1284100
58761 1284100 1285206 1286449 1287232 1288373 1290221 1291836 1292782 1293836 1295338 1296743 1298291 1300979 1304175 1305387
58747 1305387 1303321 1299318 1294882 1289723 1283225 1276040 1268994 1261884 1254458 1247330 1241018 1235186 1229576 1224558
58733 1224558 1220215 1216033 1211870 1208057 1204368 1200363 1196976 1196133 1198434 1202751 1208439 1216248 1226541 1238283
58719 1238283 1250324 1262305 1273859 1284346 1293699 1302204 1309340 1314186 1316768 1317334 1314720 1307626 1297413
58706A297413j0117q731q762r980j0944j1982j3497j3597j0805p274n930o148
58694A179646n489m099l725l956k971r49O42J918L509M189K931J828L253N653
58680A182380O073N326O383Q824R580Q535Q593J0289J0971R652Q423Q409Q316
58667A291754P735Q160R817J0679R576P585N849M601M438N755O986O241M602M627
58653A388405N951N776L681K141J842L01l821q445j1478j3613j6417j9908k3268
58640A311147k6042k7806k8241k7988k7924k7672k6363k4252k1825j8324j3568
58629A041142j0013r992j1753j1594r278p804q173q217o842n598n300m544k573
58616I39461o67L77J531L358M804M970M199L003J767J632L661P063R929J1438
$$ plain form
58706 1297413 1287296 1278565 1269803 1259823 1248879 1236897 1223400 1209803 1198998 1191724 1185794 1179646
58694 1179646 1174157 1170058 1166333 1162377 1159406 1158457 1159099 1161017 1164526 1168715 1171646 1173474 1176727 1182380
58680 1182380 1188453 1193779 1200162 1208986 1218566 1227101 1235694 1245983 1256954 1266606 1275029 1283438 1291754
58667 1291754 1299489 1307649 1317466 1328145 1337721 1345306 1351155 1355756 1360194 1365949 1372935 1379176 1383778 1388405
58653 1388405 1394356 1400132 1403813 1405954 1407796 1408097 1404276 1395831 1384353 1370740 1354323 1334415 1311147
58640 1311147 1285105 1257299 1229058 1201070 1173146 1145474 1119111 1094859 1073034 1054710 1041142
58629 1041142 1031129 1021137 1009384 997790 988512 980708 972535 964318 957476 951878 946578 942034 939461
58616 939461 938794 939171 940702 944060 948864 953834 958033 961036 962803 964435 968096 975159 985088 996526
58602I96526J1704J0463P947N810M742K550k386p407q848p714q031j0372j1479
58589I83505r983q082p251o465n328n146o021o205n016l522k170p28l26k146m325
58574I10791l834j248K04J09J042L163L422J063o10N48K502K793J788P35k18o76
58558I21574L93K452L454K902K232J978J444J253K781M888M959L421L480N787
58544I62998P507P252O792O921N851L140J284J784L110L965N086O495O531N139
58530A033855M831O841R264J0330J0670J1313J2289J3919J6509J8363J7393J5149
58518A180726J5460J8646K0898K0079J8157J7122J6620J6585J8017K0152K0930
58507A383392K1173K3972K8906L1664L0825L0135L2129L4221L3592L1536L0123
$$ plain form
58602 996526 1008230 1018693 1026640 1032450 1037192 1039742 1037356 1029949 1021101 1013387 1005356 994984 983505
58589 983505 973522 965440 958189 951724 946396 941250 935229 929024 924008 920486 918316 917588 917262 915116 910791
58574 910791 906957 905709 905913 906022 907064 910227 913649 914712 914102 914650 917152 919945 921733 922468 922250 921574
58558 921574 921967 924419 927873 930775 933007 934985 936429 937682 940463 945351 950310 953731 957211 962998
58544 962998 970505 977757 984549 991470 997321 1000461 1001745 1003529 1006639 1010604 1015690 1022185 1028716 1033855
58530 1033855 1038686 1045527 1054791 1065121 1075791 1087104 1099393 1113312 1129821 1148184 1165577 1180726
58518 1180726 1196186 1214832 1235730 1255809 1273966 1291088 1307708 1324293 1342310 1362462 1383392
58507 1383392 1404565 1428537 1457443 1489107 1519932 1550067 1582196 1616417 1650009 1681545 1711668
58496A711668K8327K4285J8314J1359L478m200r123j0771j1592j3062j3964j3737
58484A720982j4019j5608j7332j9118k2454k6808k9463l0044l1082l3030l3193
58473A448831l0884k8881k8211k6317k2272j8960j7856j6508j3509j1353j1716
58462A222364j2404j1580j0717j0858j0177p880o219o212n605l530k646m116n005
58449A125415l409j637j523j200N95J640O46O2J350K061P41O7J822L428K971K932
58433A135961N210P092O156M762N641P295P792Q881J2097J4956J5345J5828J9146
58420A266162K3165K4597K4217K4098K3224K0096J6380J3791J0577N123l03l284
58408A447843n408q685j1318j1081r708r747j0092q445n310k113J559N581P656
$$ plain form
58496 1711668 1739995 1764280 1782594 1793953 1797431 1793231 1784108 1773337 1761745 1748683 1734719 1720982
58484 1720982 1706963 1691355 1674023 1654905 1632451 1605643 1576180 1546136 1515054 1482024 1448831
58473 1448831 1417947 1389066 1360855 1334538 1312266 1293306 1275450 1258942 1245433 1234080 1222364
58462 1222364 1209960 1198380 1187663 1176805 1166628 1158748 1152529 1146317 1140712 1137182 1134536 1130420 1125415
58449 1125415 1122006 1120369 1118846 1117646 1118241 1119881 1120527 1120589 1121939 1124000 1124741 1124808 1126630 1130058 1133029 1135961
58433 1135961 1141171 1148263 1154419 1159181 1164822 1172117 1179909 1188790 1200887 1215843 1231188 1247016 1266162
58420 1266162 1289327 1313924 1338141 1362239 1385463 1405559 1421939 1435730 1446307 1451430 1451127 1447843
58408 1447843 1442435 1433750 1422432 1411351 1401643 1391896 1381804 1373359 1368049 1365936 1367495 1373076 1380732
58395A380732P283P670J0463J2612J1720J0071R673P997K853k899n996p850j0683
58382A433646j2869j2723j2640j4716j6233j4268j0823q820p088l919j400j259
58370A316888p05K594N611N171L788M959O807O029M283M885O649O458M588K517
58356A380522q89n995r290q710p846r740j1256r121o491p188q273n297n90Q77
58342A290713q4K72J091l47j779O21M771N879M599N055P093P297N591M502L946
58327A339220K598K002L820N803N869O636J0376J3475J2064R126R459J1670J1921
58314A444039J1382J2841J3985J1639Q838J0010J2750J2112R553R695J1654J1554
58302A580052J0455J1774J3903J3302J1810J3072J4852J2771Q561O722O411M526
$$ plain form
58395 1380732 1388015 1395685 1406148 1418760 1430480 1440551 1450224 1458221 1461074 1458175 1452179 1444329 1433646
58382 1433646 1420777 1408054 1395414 1380698 1364465 1350197 1339374 1330554 1323466 1319547 1318147 1316888
58370 1316888 1316183 1318777 1324388 1329559 1333347 1338306 1345113 1351142 1355425 1360310 1366959 1373417 1378005 1380522
58356 1380522 1379633 1373638 1364348 1355638 1347792 1338052 1326796 1317675 1311184 1303996 1295723 1290426 1289836 1290713
58342 1290713 1290629 1290901 1291992 1291645 1289866 1290487 1295258 1301137 1305736 1310791 1317884 1325181 1330772 1335274 1339220
58327 1339220 1341818 1343820 1347640 1353443 1359312 1365948 1376324 1389799 1401863 1410989 1420448 1432118 1444039
58314 1444039 1455421 1468262 1482247 1493886 1502724 1512734 1525484 1537596 1547149 1556844 1568498 1580052
58302 1580052 1590507 1602281 1616184 1629486 1641296 1654368 1669220 1681991 1690552 1697274 1703685 1708211
58290A708211L206N872R408Q911O788Q453J2377J3345J2207J3394J5900J5806
58278A833878J4737J6817K0328K1222K1456K4916K8740K7970K4916K4456K4271
58267B083707J9716J4024J3142J4524J2009P626P387R404Q075O020R515J5659
58255B220808J6783J4344J5547J9187J8304J4341J5099K0465K3451K3620K6255
58244B428204L0034K9078K5624K7125L2226L3099L0125L0446L3639L2980K9554
58233B762134L0663L5331L5997L3475L5490M1259M2682M0116M1740M7652M9991
58222C196530M8570N0942N7085N9610N8962O2738P0106P2913P2054P6330Q5233
58211C911073Q9591Q9347R3553J02508J07350J07804J12722J22353J27858J29099
$$ plain form
58290 1708211 1711417 1717289 1726697 1735608 1742396 1750849 1763226 1776571 1788778 1802172 1818072 1833878
58278 1833878 1848615 1865432 1885760 1906982 1928438 1953354 1982094 2010064 2034980 2059436 2083707
58267 2083707 2103423 2117447 2130589 2145113 2157122 2164748 2172135 2181539 2189614 2195634 2205149 2220808
58255 2220808 2237591 2251935 2267482 2286669 2304973 2319314 2334413 2354878 2378329 2401949 2428204
58244 2428204 2458238 2487316 2512940 2540065 2572291 2605390 2635515 2665961 2699600 2732580 2762134
58233 2762134 2792797 2828128 2864125 2897600 2933090 2974349 3017031 3057147 3098887 3146539 3196530
58222 3196530 3245100 3296042 3353127 3412737 3471699 3534437 3604543 3677456 3749510 3825840 3911073
58211 3911073 4000664 4090011 4183564 4286072 4393422 4501226 4613948 4736301 4864159 4993258
58201D993258J34926J45248J50973J52190J57960J67961J73529J76712J88317
58192F441074K07035K21226K31463K49813K76724L00958L22557L52538L89204
58183H992592M19053M42372M73156N12448N47481N78527O19703O71200P18136
58174A3974668P59138Q07595Q62520R08158R45286R91909J049792J102285J148437
58165B2549788J205413J273465J334343J389130J460471J551972J643914J734931
58157C4143427J847179J983622K122874K263468K428408K618120K806447K991714
58149E3205259L201703L440070L682698L936532M242882M611874N018188N474149
58141H6813355O037349O732815P545583Q505994R695617J1148690J2839443J4780268
$$ plain form
58201 4993258 5128184 5273432 5424405 5576595 5734555 5902516 6076045 6252757 6441074
58192 6441074 6648109 6869335 7100798 7350611 7627335 7928293 8250850 8603388 8992592
58183 8992592 9411645 9854017 10327173 10839621 11387102 11965629 12585332 13256532 13974668
58174 13974668 14733806 15541401 16403921 17312079 18257365 19249274 20299066 21401351 22549788
58165 22549788 23755201 25028666 26363009 27752139 29212610 30764582 32408496 34143427
58157 34143427 35990606 37974228 40097102 42360570 44788978 47407098 50213545 53205259
58149 53205259 56406962 59847032 63529730 67466262 71709144 76321018 81339206 86813355
58141 86813355 92850704 99583519 107129102 115635096 125330713 136479403 149318846 164099114
58133A64099114J7018741J9520463K2190453K5022648K8040415L1053126L3705246
58126C40650206L5779068L6968008L6024490L0668971J9298700L101330j3980551
58119D88510222k7761458l6268413l9929115m0101569l7960435l4434545l0380028
58112B41674659k6433660k2881485j9809773j7260141j5191204j3457309j1933844
58105A14707243j0592942r421901q363790p383232o507246n755909n098513m510922
58097E7072788m011545l607922l265062k956278k693615k482476k295657k116772
58089C3643461j963008j841398j725613j598337j476322j372581j272191j166043
58081B1227968j071905j001263r38288q70891q11508p69123p30346o85508o45588
$$ plain form
58133 164099114 181117855 200638318 222828771 247851419 275891834 306944960 340650206
58126 340650206 376429274 413397282 449421772 480090743 499389443 502490773 488510222
58119 488510222 460748764 424480351 384551236 344449667 306489232 272054687 241674659
58112 241674659 215240999 192359514 172549741 155289600 140098396 126641087 114707243
58105 114707243 104114301 94692400 86328610 78945378 72438132 66682223 61583710 57072788
58097 57072788 53061243 49453321 46188259 43231981 40538366 38055890 35760233 33643461
58089 33643461 31680453 29839055 28113442 26515105 25038783 23666202 22394011 21227968
58081 21227968 20156063 19154800 18216512 17345621 16534113 15764990 15034644 14349136 13703548
58072A3703548o17223n87782n50416n17740m96070m71712m37196m06358l88920
58063I230131l73738l51447l30929l19329l07540k89224k73597k66186k56937
58054F461204k39870k24967k18456k10762j95968j84019j81397j78441j68129
58045D659195j59251j58441j56900j47685j39290j38943j38470j29801j19609
58036C370805j15795j13531j07028j01742j02794j03871r8993r3361r1982q9519
58026B352189q1575p4100p1793o9143o2413n8299o1001o2982n8455n3930n5330
58015A643168n6515n1230m4927m3988m3867l8838l3425l3405l4754l1889k8091
58004A202239k7977k8198k5085k2899k5390k7534k4718k1652k3320k5475k2986
$$ plain form
58072 13703548 13086325 12498543 11948127 11430387 10934317 10462605 10025409 9619051 9230131
58063 9230131 8856393 8504946 8174017 7854688 7547148 7257924 6984327 6718141 6461204
58054 6461204 6221334 5996367 5777911 5567149 5371181 5187162 5005765 4827324 4659195
58045 4659195 4499944 4341503 4184603 4036918 3897628 3758685 3620215 3490414 3370805
58036 3370805 3255010 3141479 3034451 2932709 2829915 2726044 2627051 2533690 2441708 2352189
58026 2352189 2270614 2196514 2124721 2055578 1993165 1934866 1873865 1810883 1752428 1698498 1643168
58015 1643168 1586653 1535423 1490496 1446508 1402641 1363803 1330378 1296973 1262219 1230330 1202239
58004 1202239 1174262 1146064 1120979 1098080 1072690 1045156 1020438 998786 975466 949991 927005
57993I27005j9285j8677j7509j2109p431q688j1925j1808j1181j4030j6353j3382
57981G64627r008r003j1213j1146j0863j3574j5600j2481p548o081o390m570k630
57968F44520m024o345o084n532p744r991r165q179r970j0932p451l324l296m791
57954E47692l405j183k034m124m143l946n882o750l627l99j263l056j475N09j632
57939E05282m919l863J6J702J679L386N494M598K335K251K785N60k541k728j658
57924E14379l379o745p571n700l783j901O25J382j272l791k747q42j783l354j982
57909D71536N1j100l270k195N37P34m95M84K205O68k852l816k147j178j203o19
57893D57340j098m801q688q341n347m305m814l269m43j01j700j376J079K706L452
$$ plain form
57993 927005 907720 889043 871534 859425 851994 843306 831381 819573 808392 794362 778009 764627
57981 764627 755619 746616 735403 724257 713394 699820 684220 671739 664191 658110 651720 647150 644520
57968 644520 640496 634151 628067 622535 614791 604800 595635 587456 577486 566554 559103 555779 552483 547692
57954 547692 544287 543104 541070 536946 532803 528857 522975 516225 512598 512199 510936 507880 506405 506914 505282
57939 505282 500363 496500 496516 498218 499897 503283 508777 513375 515710 517961 520746 521306 518765 516037 514379
57924 514379 511000 504255 496684 490984 487201 485300 485925 487307 486035 482244 479497 478655 476872 473518 471536
57909 471536 471587 470487 467217 465022 465559 466293 465798 466282 468487 469155 466303 462487 460340 459162 457959 457340
57893 457340 456242 451441 442753 434412 429065 424760 419946 416677 416234 416133 414433 413057 414136 416842 420294
57878D20294N370P245O439M643N434P551P005M458L919N216M388Q58k224m091
57864D76505o604r052q859p119p416r476r722p700o266n855m384k479k908m941
57850C83724m895k399o09k60J041L393L988K375J231J302M59j550k083k72J363
57835C86808Q62r92k771l642k744l24J206L45n99R98L479L600J931J295J535N53
57819C91540j021j039l66j251k406p74K752M465L756L047K854K067K144N388R581
57804D20737R932O252L044K505K667K431L122M647M989M084L864M251L364J566
57790D77455R61J141q9k179k654j997k851m713m509k229j015j621j905j644k653
57775D49498m099l133l87N45m95J5K597L534J493k37M62J671J920K572L961L897
$$ plain form
57878 420294 425664 432909 439348 443991 449425 456976 463981 468439 472358 477574 481962 482820 480596 476505
57864 476505 469901 460849 451990 444871 437455 427979 418257 410557 404291 398436 394052 391573 388665 383724
57850 383724 378829 376430 375821 375561 376602 379995 383983 386358 387589 388891 389350 387800 385717 385445 386808
57835 386808 387670 386678 383907 380265 377521 377197 378403 378748 378149 379147 382626 386226 388157 389452 390987 391540
57819 391540 390519 389480 389114 387863 385457 384683 387435 391900 395656 398703 401557 403624 405768 411156 420737
57804 420737 430669 436921 439965 442470 445137 447568 450690 455337 460326 464410 468274 472525 475889 477455
57790 477455 478416 479557 479468 477289 474635 472638 469787 465074 460565 458336 457321 455700 453795 452151 449498
57775 449498 445399 442266 441879 442424 441929 441944 444541 448075 449568 449331 449793 451464 453384 455956 459917 463814
57759D63814J832L03N67Q42K59M40J715J869K1k056l606n901q556r059p252o203
57743D29029p350q728r068r510j0183r287o810n012m161k197L86J58l155n079
57729C49033k980K91J518J542K102K461J802J452K144K254R81R5N35O95j18pJ738
57712C65538K716J472J6oj64j806l174k551j423j861l345m510n505o438n983l735
57696C29241j535o40LJ065J294M71Q13L338N696N878N304N827O403N420L975M076
57680C76629N295N790N220M547M243M386N204O141N789L936K233J862K229K533
57666D36037K687K172K48k095k773j758j038j135n33R04J243n5j255j747k889
57651D28013m576m695l125k375k864j749J693L777K081n22m05J698L102L527L899
$$ plain form
57759 463814 465646 465949 466516 467358 467617 468057 469772 471641 471662 469606 466000 460099 451543 442484 435232 429029
57743 429029 421679 412951 403883 394373 384190 374903 368093 363081 358920 356723 357109 357267 354112 349033
57729 349033 346053 346344 347862 349404 351506 353967 355769 357221 359365 361619 362600 362695 363230 363925 363807 363800 365538
57712 365538 368254 369726 369742 369736 369572 367766 364592 362041 360618 358757 355412 350902 345397 338959 332976 329241
57696 329241 327706 327066 327069 328134 329428 329899 330712 334050 339746 345624 350928 356755 363158 368578 372553 376629
57680 376629 381924 387714 392934 397481 401724 406110 411314 417455 423244 427180 429413 431275 433504 436037
57666 436037 438724 440896 441144 439049 436276 434518 433480 432345 431812 432716 433959 433904 432649 430902 428013
57651 428013 423437 418742 415617 413242 410378 408629 410322 414099 416180 415658 415253 416951 420053 423580 427479
57636D27479L561J869L66N69J515J796J846K061J217r93k330j241O72J649K567
57621D42603M470O155O778Q104J1325J4389J5542J6888K1035K6503L0076L1972
57609F35840L5085M0348M5955N0118N1605M8431L8778K2988L069j8558l8418n2119
57597H63122n7538n6761n3253m8610m3363l8619l4752l0515k5490k1430j9270
57586D33521j7180j3668j0240q562p510n604l999m162m861m432l890m760n698
57573C38955m615k417j462j743j811k046l759o087o867n830m343k954j646j340
57559B92035k676m348m946n182o018o259m469j778j66M22Q28L53j439k505j144
57544B52708M86q69m543o959o667n202l912l055l277m899o448o543o324p278p983
$$ plain form
57636 427479 431040 432909 433275 433844 435359 437155 439001 441062 442279 441286 438956 437715 438387 440036 442603
57621 442603 447073 453228 460006 468110 479435 493824 509366 526254 547289 573792 603868 635840
57609 635840 670925 711273 757228 807346 858951 907382 946160 969148 972217 953659 915241 863122
57597 863122 805584 748823 695570 646960 603597 564978 530226 499711 474221 452791 433521
57586 433521 416341 402673 392433 383871 376361 370757 366758 362596 357735 353303 349413 344653 338955
57573 338955 334340 331923 330461 328718 326907 324861 321102 315015 308148 302318 297975 295021 293375 292035
57559 292035 289359 285011 280065 274883 268865 262606 258137 256359 256193 256615 257443 257796 256357 253852 252708
57544 252708 253194 252325 247782 240823 234156 228954 225042 221987 218710 213811 207363 200820 194496 187218 179235
57529A79235o220l141j916k972l942l787l662m077m363m738n890o818n903l854
57515A17952k844l069k918k077j701j919j947k204l480m529l427j050j65j349
57501H5273k702l347m180n201n139l918k848k268j492r25j534k388j488Q92K455
57486E1190K375J910J637Q76l6K72J686K657K931L575M242L225O94q72j59J337
57470G7540J756Q08j009l037m010k918o55Q88J182Q84j6j597k346p72J715K423
57454G0836J410J008J626J351r9n28R20K226J824O79K7m92j344j971k147k606
57438G2720l495l939l702l532l520k997k201k211l003l446l221k859k097m25J026
57423C3098O49q27j225m94n69j760k287j651j313j585r71N80Q83r67l025l584
$$ plain form
57529 179235 173015 169874 167958 164986 161044 157257 153595 149518 145155 140417 134527 127709 121806 117952
57515 117952 115108 112039 109121 107044 105343 103424 101477 99273 95793 91264 87837 86787 86622 85273
57501 85273 82571 79224 75044 69843 64704 60786 57938 55670 54178 53253 51719 49331 47843 48735 51190
57486 51190 53565 55475 57112 57988 57952 58224 59910 62567 65498 69073 73315 76540 77234 76362 76203 77540
57470 77540 79296 80104 79095 76058 72048 69130 68475 69363 70545 71429 71413 69816 67470 66698 68413 70836
57454 70836 72246 73254 74880 76231 76132 75604 76524 78750 80574 81253 81280 80788 79444 77473 75326 72720
57438 72720 69225 65286 61584 58052 54532 51535 49334 47123 44120 40674 37453 34594 32497 32072 33098
57423 33098 33747 32920 31695 31201 30632 28872 26585 24934 23621 22036 21065 21645 22528 21561 18536 14952
57407A4952l234k777j653K75J620J427L78q33k399C808e44l679l283l396k763
57392a3665j221l12p38j491k051k906l512k504o40m41j934j854J302M435M084
57377b3448J132r31n63J028K200K218J246K81K86Q32P18J08L33J371J680Q98M22
57360a0189P25N47n14j062n35l21j138j676j018k16k05k38L14N85j59j350k545
57343a8995m099n586n629m124k591j636m01P37j80l173n210m149j426O27J748
57328e4087K442K148N85j009j615j824k216k197j589j336j547r17Q98K423K819
57313e7022K897K802J457o69j079R66K985L009K069J512Q51q6O0J351J513j92
57297c7576j116M45K154J402o90j674j489r74N67L311M871L520J307R41J593Q87
$$ plain form
57407 14952 11718 8941 7288 7563 9183 10610 10988 10155 7756 3808 -544 -4223 -7506 -10902 -13665
57392 -13665 -14886 -15198 -15936 -17427 -19478 -22384 -25896 -28400 -29040 -29481 -31415 -33269 -31967 -27532 -23448
57377 -23448 -22316 -23247 -23810 -22782 -20582 -18364 -17118 -16837 -16551 -15719 -15001 -14893 -14560 -13189 -11509 -10611 -10189
57360 -10189 -9464 -8917 -9431 -10493 -11028 -11349 -12487 -14163 -15181 -15397 -15602 -15840 -15526 -14941 -15100 -16450 -18995
57343 -18995 -23094 -28680 -34309 -38433 -41024 -42660 -43061 -42324 -42504 -45677 -50887 -55036 -56462 -55835 -54087
57328 -54087 -51645 -49497 -48912 -49921 -51536 -53360 -55576 -57773 -59362 -60698 -62245 -63162 -62264 -59841 -57022
57313 -57022 -54125 -51323 -49866 -50535 -51614 -50648 -47663 -44654 -42585 -41073 -40222 -40308 -40248 -38897 -37384 -37576
57297 -37576 -38692 -38247 -36093 -34691 -35381 -37055 -38544 -39518 -38951 -35640 -30769 -27249 -25942 -25001 -23408 -22521
57281b2521r46k028k137k029j182P90K221J813J183K047K802J273j023j008R79
57266a9766K052J496R82Q68n8j558k021j422j315k060k635k889l461l837k950
57251c8574j412q36j253j298m72O03J635K511K525J530R57J944L542M376M646
57236a9576M816M092K294J397K891A251O830P807R039R045O736M504N320Q368
57222E8900J0949J2858J5285J7037J6129J3986J4007J6486J8744J9707K0599K1604
57210B56291K1604K0994K1243K1796K0832J8825J8018J8526J8271J6643J5015
57199D68058J3729J1878J0033R981J1644J3045J3318J3105J2316J0316P923O475
57187F01821N473L859K743L734N574N847N168O042Q296R513R503J0280J1865J2113
$$ plain form
57281 -22521 -23467 -25495 -27632 -29661 -30843 -30053 -27832 -26019 -24836 -22789 -19987 -18714 -19737 -20745 -19766
57266 -19766 -17714 -16218 -15236 -14368 -14426 -15984 -18005 -19427 -20742 -22802 -25437 -28326 -31787 -35624 -38574
57251 -38574 -39986 -40822 -42075 -43373 -43845 -43242 -41607 -39096 -36571 -35041 -34084 -32140 -28598 -24222 -19576
57236 -19576 -14760 -10668 -8374 -6977 -4086 1251 8081 15888 24927 33972 40708 45212 50532 58900
57222 58900 69849 82707 97992 115029 131158 145144 159151 175637 194381 214088 234687 256291
57210 256291 277895 298889 320132 341928 362760 381585 399603 418129 436400 453043 468058
57199 468058 481787 493665 503698 513679 525323 538368 551686 564791 577107 587423 595346 601821
57187 601821 607294 611153 613896 617630 623204 629051 634219 640261 648557 658070 667573 677853 689718 701831
57173G01831J0846J0269J1016J1427J1047J1353J2783J4237J5657J7921K0308
57162H48695K1347K1776K3414K5566K6093K5414K5602K6243K5359K3853K4589
57151A117951K7396K9486L0485L2360L4570L4372L2156L1347L2487L2301K9338
57140A464249K5634K2288J8366J4816J4336J6430J7693J7856K0263K5378K9495
57129A686804L1294L3990L8930M2555M2145L9606L7266L4601L1445K9909L0800
57118B079345L2214L3474L6155L9807M1407M0504M0077M0960M0759L9435M0038
57107B504175M2301M1905L8164L5786L6486L5703L1028K6938K7118K8440K7040
57096B875084K4296K2361J9519J4744J1274J0979J0482P593O170R864J6348K2527
$$ plain form
57173 701831 712677 722946 733962 745389 756436 767789 780572 794809 810466 828387 848695
57162 848695 870042 891818 915232 940798 966891 992305 1017907 1044150 1069509 1093362 1117951
57151 1117951 1145347 1174833 1205318 1237678 1272248 1306620 1338776 1370123 1402610 1434911 1464249
57140 1464249 1489883 1512171 1530537 1545353 1559689 1576119 1593812 1611668 1631931 1657309 1686804
57129 1686804 1718098 1752088 1791018 1833573 1875718 1915324 1952590 1987191 2018636 2048545 2079345
57118 2079345 2111559 2145033 2181188 2220995 2262402 2302906 2342983 2383943 2424702 2464137 2504175
57107 2504175 2546476 2588381 2626545 2662331 2698817 2734520 2765548 2792486 2819604 2848044 2875084
57096 2875084 2899380 2921741 2941260 2956004 2967278 2978257 2988739 2996332 3002502 3012366 3028714 3051241
57084C051241K9950M0011M9286N4924N9407O4585O6446O1424N2540M3579L2628
57073C606021J7517K082r662k0759l6343n6227p8560j05659j39457j76131k11784
57062B791038k48693k89685l31898l72774m16319m66245A46662d23010o22690
57053a045700o83191p50382q23228r06886j004214j108165j212053j320167j438851
57044a0292837j565398j696175j836520j991006k154190k324716k518164k750042
57036b7129048l015512l301230l604516l921485m229746m506427m750340m960010
57028e9418314n106254n163626n159072n152248n185891n310309n630975o213111
57020a02339800o875986p162267o626023n173825l099583q21648J357709L281408
$$ plain form
57084 3051241 3081191 3121202 3170488 3225412 3284819 3349404 3415850 3477274 3529814 3573393 3606021
57073 3606021 3623538 3625620 3615958 3595199 3558856 3502629 3424069 3318410 3178953 3002822 2791038
57062 2791038 2542345 2252660 1920762 1547988 1131669 665424 146662 -423010 -1045700
57053 -1045700 -1728891 -2479273 -3302501 -4209387 -5213601 -6321766 -7533819 -8853986 -10292837
57044 -10292837 -11858235 -13554410 -15390930 -17381936 -19536126 -21860842 -24379006 -27129048
57036 -27129048 -30144560 -33445790 -37050306 -40971791 -45201537 -49707964 -54458304 -59418314
57028 -59418314 -64524568 -69688194 -74847266 -79999514 -85185405 -90495714 -96126689 -102339800
57020 -102339800 -109215786 -116378053 -123004076 -128177901 -131277484 -132099132 -130741423 -127460015
57012a27460015M862884O055844O858516P294241P393245P212022O850561O422695
57004g4510007O011736N661436N390653N196866N054960M931184M798391M634098
56996c2830683M416957M138656L813055L463590L106891K754952K422925K122963
56988f590694J855521J616100J405722d86681E87043R39077Q21967P25201O45649
56979C718937N76538N16302M67383M28388L94501L64039L38389L17048K98265
56970G419790K82838K71996K63287K53472K43481K35332K25903K08782J81013
56961I585894J44072J00616N5195J6033r929k3540l1078l6658m0983m5593n2709
56950I661320o1126o7101o9669p1316p3497p5266p6196p7066p7685p7474p8137
$$ plain form
57012 -127460015 -122597131 -116541287 -109682771 -102388530 -94995285 -87783263 -80932702 -74510007
57004 -74510007 -68498271 -62836835 -57446182 -52249316 -47194356 -42263172 -37464781 -32830683
56996 -32830683 -28413726 -24275070 -20462015 -16998425 -13891534 -11136582 -8713657 -6590694
56988 -6590694 -4735173 -3119073 -1713351 -486681 587043 1526120 2348087 3073288 3718937
56979 3718937 4295475 4811777 5279160 5707548 6102049 6466088 6804477 7121525 7419790
56970 7419790 7702628 7974624 8237911 8491383 8734864 8970196 9196099 9404881 9585894
56961 9585894 9729966 9830582 9885777 9901810 9891881 9868341 9837263 9800605 9759622 9714029 9661320
56950 9661320 9600194 9533093 9463424 9392108 9318611 9243345 9167149 9090083 9012398 8934924 8856787
56939H856787q2383q9750r6869j02119j07212j13982j22320j31533j41228j50662
56929G718729j59452j68844j80092j91648k00157k04084k04324k01812j97070
56920F011246j91833j88406j87187j86784j86299j85392j82757j77289j70491
56911D354808j64975j60614j54957j47490j40412j34758j28865j21632j14503
56902C086602j08859j03710r7534r0465q3455p6852p1065o7163o5716o6208o8299
56891B187276p2082p6395p8601p7235p3500o9106o4130n8100n1804m6348m1451
56880A478524l6185l0763k6294k3232k1119j9378j7310j3925q927l581M00K525
56868A280735L129J600l692j3264k5000l5207m1048m2089l9897l6416l2694k9004
$$ plain form
56939 8856787 8774404 8684654 8587785 8485666 8378454 8264472 8142152 8010619 7869391 7718729
56929 7718729 7559277 7390433 7210341 7018693 6818536 6614452 6410128 6208316 6011246
56920 6011246 5819413 5631007 5443820 5257036 5070737 4885345 4702588 4525299 4354808
56911 4354808 4189833 4029219 3874262 3726772 3586360 3451602 3322737 3201105 3086602
56902 3086602 2977743 2874033 2776499 2686034 2602579 2525727 2454662 2387499 2321783 2255575 2187276
56891 2187276 2115194 2038799 1960198 1882963 1809463 1740357 1676227 1618127 1566323 1519975 1478524
56880 1478524 1442339 1411576 1385282 1362050 1340931 1321553 1304243 1290318 1281391 1277810 1278210 1280735
56868 1280735 1283864 1285464 1281772 1268508 1243508 1208301 1167253 1125164 1085267 1048851 1016157 987153
56856I87153k5720k3403k1882k0010j6902j3116j0097q611q126p651o722n493
56844H19420m166k590n17J844L751M643M723M663M794M886M674M185L693L607
56830H57610M330N764O975O927N667M214L067J326k261p641j3278j7548j9999
56817H35153k1220k1775k1512j9877j6660j2234p288k538J515M962Q521J2530
56805G39577J6072J8077J9446K2748K8913L5469L9317M0309M0233L8766L2727
56794A071654K0075L020j3698k6345l3345l4532l1008k5182j9372j4174q875l232
56782H84986K087O764J1587J7550K4651L1826L7975M3001M7844N3169N7789N8664
56770A277893N2706L8623J7560o937k9478m4947n1576n1662m8547m3539l6694
$$ plain form
56856 987153 961433 938030 916148 896138 879236 866120 856023 847412 839286 831635 824913 819420
56844 819420 815254 812664 812147 813991 817742 822385 827108 831771 836565 841451 846125 850310 854003 857610
56830 857610 861940 867704 874679 881606 887273 891487 894554 895880 893619 885978 872700 855152 835153
56817 835153 813933 792158 770646 750769 734109 721875 714587 712049 713564 718526 727047 739577
56805 739577 755649 773726 793172 815920 844833 880302 919619 959928 1000161 1038927 1071654
56794 1071654 1091729 1094749 1081051 1054706 1021361 986829 955821 930639 911267 897093 888218 884986
56782 884986 887073 893837 905424 922974 947625 979451 1017426 1060427 1108271 1161440 1219229 1277893
56770 1277893 1330599 1369222 1386782 1379845 1350367 1305420 1253844 1202182 1153635 1110096 1073402
56759A073402k9390k3957k0769j7580j2485o152l59M448R169J4463K0250K6139
56747A037179L1302L4240L3480K8416J9088N773j0270k6093l8273m5067m7017
56736A022758m5645m2298l8009l3416k8454k2745j6638j1369p913n998m412k139
56724G63722R68M310P270R876J2532J4904J5442J2541O023k913j2759k1909k8351
56711G81656l0618k9441k7329k5994k4939k3090k0710j8755j7163j5126j2694
56700E35797j0882j0113r634q812q034p766p529o485m810l645l682m303m330l382
56686D42390k299k211l357m797n339m675l525k726k379k005j374q79j042j874
56672D03908k793l085k494j515j085j585k108j231J151L315L614K454J552J518
$$ plain form
56759 1073402 1044012 1020055 999286 981706 969221 963069 962710 967158 976327 990790 1011040 1037179
56747 1037179 1068481 1102721 1136201 1164617 1183705 1189478 1179208 1153115 1114842 1069775 1022758
56736 1022758 977113 934815 896806 863390 834936 812191 795553 784184 776271 770273 765861 763722
56724 763722 764690 769000 776270 786146 798678 813582 829024 841565 847588 844675 831916 810007 781656
56711 781656 751038 721597 694268 668274 643335 620245 599535 580780 563617 548491 535797
56700 535797 524915 514802 505168 496356 488322 480556 473027 466542 461732 458087 454405 450102 445772 442390
56686 442390 440091 437880 434523 429726 424387 419712 416187 413461 411082 409077 407703 406824 405782 403908
56672 403908 401115 398030 395536 394021 392936 391351 389243 388012 389163 392478 396092 398546 400098 401616
56658D01616J358L79o77r39p18o15k59Q85J995J551m71k135j700M10K115J830
56642D04625j4j483j119N71J949K420K964M150M854L817J756O16J164K371K914
56627D31555K171J63k263l430k343j57J066R15P10J163J531J158K99q56k424l776
56611D25482l778k610j735j602j043K90Q08m48j817j265N71J326J38j700k743
56596D09874k626j611k88L44k96j473j806p81R21K247K414J298j58n53L46J243
56580D09095J243J219K274L742M003K726R75m85j665k368k026p50M50P19k4j426
56564D17702l041m324m851m583l663k272q82j86l55r13j602k613l680l931l243
56549C77563k560k191j122R43K287J541J46N69K748M287L864K526J598J119O42
$$ plain form
56658 401616 402974 403353 402676 401737 401019 400404 400145 401030 403025 404576 404105 401970 400270 400680 402795 404625
56642 404625 404611 403128 402009 402580 404529 406949 409913 414063 418917 422734 424490 425106 426270 428641 431555
56627 431555 433726 433889 431626 428196 425853 425696 426762 427677 428387 429550 431081 432239 432538 431682 429258 425482
56611 425482 421704 419094 417359 415757 414714 415004 415812 415364 413547 412282 412853 414179 414317 412617 409874
56596 409874 407248 405637 405349 405693 405397 403924 402118 401337 402258 404505 406919 408217 408059 407506 407852 409095
56580 409095 410338 411557 413831 417573 421576 424302 425277 424792 423127 420759 418733 417983 418433 419152 419128 417702
56564 417702 414661 410337 405486 400903 397240 394968 394086 393900 393545 392632 391030 388417 384737 380806 377563
56549 377563 375003 372812 371690 372633 374920 376461 376607 377176 379924 384211 388075 390601 392199 393318 393960
56534C93960J61k39n73n95o4O08Q42P96Q14M32p99j795q53J814L900L728K034
56517D04171P11Q33K187L776M419L610K046Q38L67N35J634L816O004O823O634
56502D48404P275R456J1736J2512J1845J0829J0034R271Q194O523M208J780K11
56489E52278J04J107K121J970L18j799k769k316k034l352n571o778o215m776l604
56474E18684l185l449l840l627k902k728l453l811k894k006k826m512m680k967
56460D71804j460j514k102j859r77l83l54n97q01o51k01j91j105k014j604k59
56444D55732K48p73k142k747k851l147l647l954l725k715j175j16k22p50n33K35
56428D27718M99K24K69P16Q92Q75J303J802J363L28J07Q72J215M46n71j054j190
$$ plain form
56534 393960 394121 393882 393309 392714 392650 393258 394100 394896 395710 396142 395343 393548 392695 394509 398409 402137 404171
56517 404171 404882 405715 407902 411678 416097 419707 421753 422591 422958 423493 425127 428943 434947 441770 448404
56502 448404 455679 465135 476871 489383 501228 512057 522091 531362 539556 546079 550287 552067 552278
56489 552278 552382 553489 555610 557580 557898 556099 553330 551014 548980 545628 540057 533279 527064 522288 518684
56474 518684 515499 512050 508210 504583 501681 498953 495500 491689 488795 486789 483963 479451 474771 471804
56460 471804 470344 468830 466728 464869 463892 463509 463155 462558 461757 461106 460905 460714 459609 457595 455991 455732
56444 455732 455980 455207 453065 450318 447467 444320 440673 436719 432994 430279 429104 428988 428766 428016 427483 427718
56428 427718 428217 428441 428710 429426 430318 431193 432496 434298 435661 435989 436096 436968 438183 438629 438058 437004 435814
56411D35814j131q21q81j998l184k640o07O25q6j507k408k992l281k308mJ971
56395D14562K384J905J509J070M05J46O00J140J506K267L252L222J874O02M29
56380D36873P28Q65J363K435L052K485J362K57j189k878l676l201k494j932m54
56365D33596J984L280K152M38M99J903K578K039J340Q81L07j1P19K150L029K784
56349D59668J757K88j257j957j085P81K173K209J148j23p45m06L92J026J702L038
56333D68609M777N866N830M970L409J239m26k49J301K205J489P1j048j659j383
56318D95001J51J886K130J064M33M54l77j993k127j6K046K140J245R19R90J132
56302E05078K137L766L767J209j337j156Q69K094J948J602J334P10K56P64J651
$$ plain form
56411 435814 434683 433862 432981 430983 427799 425159 424552 425177 425091 423584 421176 418184 414903 412595 412591 414562
56395 414562 416946 418851 420360 421430 421835 421981 422581 423721 425227 427494 430746 433968 435842 436444 436873
56380 436873 437601 438466 439829 442264 445316 447801 449163 449420 448231 445353 441677 438476 435982 434050 433596
56365 433596 435580 438860 441012 441450 441949 443852 446430 448469 449809 450690 450997 450986 451705 453855 456884 459668
56349 459668 461425 461713 460456 458499 457414 458195 460368 462577 463725 463602 462857 462451 462843 463869 465571 468609
56333 468609 473386 479252 485082 490052 493461 494700 494274 494025 495326 497531 499020 499091 498043 496384 495001
56318 495001 495152 497038 499168 500232 500665 501119 500742 498749 496622 496606 498652 500792 502037 502956 503946 505078
56302 505078 507215 510981 514748 515957 514620 513464 514333 516427 518375 519977 521311 522021 522277 523041 524692
56287E24692J838J471J284J265J319K104L676M544L665K212J878K502K890K905
56273E58245L276M112M834M926M111K718K164L516N349N126L073K238L961O080
56259F13729O650O410O179M977K720J783L464N545N707M889M817M808L697K639
56245F78014L081M149M737O044R151J2209J2997J2379J2282J2231J0993R660R861
56232G97788J0575J0010R059R731J1641J3299J5353J9065K2923K4247K3212K2124
56220I89027K1760K1577K2264K4722K7410K8088K7468K8103L0572L3580L6766
56209A291337M0281M2752M3103M3416M6623N2096N6840O0187O3928O8562P3046
56198A882171P7791Q4454R2946J01640J10259J19623J29121J37559J45928J56195
$$ plain form
56287 524692 526530 528001 529285 530550 531869 533973 537649 542193 545858 548070 549948 552450 555340 558245
56273 558245 561521 565633 570467 575393 579504 582222 584386 587902 593251 598377 601450 603688 607649 613729
56259 613729 620379 626789 632968 637945 640665 642448 645912 651457 657164 662053 666870 671678 675375 678014
56245 678014 681095 685244 689981 696025 705176 717385 730382 742761 755043 767274 778267 787927 797788
56232 797788 808363 818373 827432 837163 848804 862103 877456 896521 919444 943691 966903 989027
56220 989027 1010787 1032364 1054628 1079350 1106760 1134848 1162316 1190419 1220991 1254571 1291337
56209 1291337 1331618 1374370 1417473 1460889 1507512 1559608 1616448 1676635 1740563 1809125 1882171
56198 1882171 1959962 2044416 2137362 2239002 2349261 2468884 2598005 2735564 2881492 3037687
56188C037687J67654J77556J84831J90306J93758J93863J90620J84885J75967
56179D697127J62550J45211J25097J01103P1749L9097P245k2455n1188p8366j01510
56168E095660j20357j37162j52549j64460j71773j75856j77954j77774j75141
56159C642634j70649j64488j56710j48529j41208j34184j26377j18519j11825
56150B370145j05410r7664q9265q2090p6154p0339o5023o1129n7623n2929m7771
56139A564748m3868m1013l8100l5469l3411l0340k5602k1738k0571j9470j5640
56128A239526j1466j0817j2379j1982r693q838r410q390n820m674m972l696n98
56115A136791J366J582K511M545N264M333M404O498Q773J0256J1715J2911J3041
$$ plain form
56188 3037687 3205341 3382897 3567728 3758034 3951792 4145655 4336275 4521160 4697127
56179 4697127 4859677 5004888 5129985 5231088 5302837 5341934 5349179 5326724 5275536 5197170 5095660
56168 5095660 4975303 4838141 4685592 4521132 4349359 4173503 3995549 3817775 3642634
56159 3642634 3471985 3307497 3150787 3002258 2861050 2726866 2600489 2481970 2370145
56150 2370145 2264735 2167071 2077806 1995716 1919562 1849223 1784200 1723071 1665448 1612519 1564748
56139 1564748 1520880 1479867 1441767 1406298 1372887 1342547 1316945 1295207 1274636 1255166 1239526
56128 1239526 1228060 1217243 1204864 1192882 1183189 1174351 1164941 1156551 1150731 1146057 1141085 1137389 1136791
56115 1136791 1138157 1139739 1142250 1146795 1152059 1156392 1160796 1167294 1176067 1186323 1198038 1210949 1223990
56102A223990J3630J6728K0752K2390K1880K1984K2832K2725K2830K5754L0304
56091A465799L3193L5004L8823M4070M7804N1245N8370O8593P7540Q4776R3905
56080B099122J05055J14233J20334J25696J29314J26770J17686J06306R4039P8726
56070C217281O2019M9673M2970L7091K9514K2581J6281O472p225j9181k6177l1314
56058C399985l7237m2601m7901n7765p3966r2055j07494j19447j26747j26752
56048B568020j20403j12170j03109r0460p5384o3614n6530m9372m0303l3279k9494
56037A793902k4510j7000j1950j1518j0870p128m374n391o141l256J74J014J438
56024A694390L399M456L558M490R198J3731J4724J3956J3328J1952J1048J4359
$$ plain form
56102 1223990 1237620 1254348 1275100 1297490 1319370 1341354 1364186 1386911 1409741 1435495 1465799
56091 1465799 1498992 1533996 1572819 1616889 1664693 1715938 1774308 1842901 1920441 2005217 2099122
56080 2099122 2204177 2318410 2438744 2564440 2693754 2820524 2938210 3044516 3138555 3217281
56070 3217281 3279300 3328973 3371943 3409034 3438548 3461129 3477410 3483882 3476657 3457476 3431299 3399985
56058 3399985 3362748 3320147 3272246 3214481 3140515 3048460 2940966 2821519 2694772 2568020
56048 2568020 2447617 2335447 2232338 2141878 2066494 2002880 1946350 1896978 1856675 1823396 1793902
56037 1793902 1769392 1752392 1740442 1728924 1718054 1710926 1706552 1701161 1695020 1691764 1691938 1692952 1694390
56024 1694390 1697789 1702245 1705803 1710293 1719491 1733222 1747946 1761902 1775230 1787182 1798230 1812589
56012A812589K0593K3194K0780J9739K3075K5459K3405K1404K3121K5197K4838
56001B063394K5233K8164K9435K6826K4635K5437K5518K3210K3080K6800K8805
55990B350537K6345K4824K7649L0093K8946K8866L3053L6992L7678L9621M5324
55979B709928M9459M9003M9450N4325N8526N8820O0651O7254P2634P3087P5002
55968C378139Q2983R0696R2134R1903R5731J00787J03769J08344J16333J22009
55958D382828J23344J27967J39852J51716J58861J68197J84605K01390K13738
55949E852498K28426K50256K72551K91348L14592L46237L76192L98057M21585
55940H751742M54932M90008N18957N49495N89499O31876O69314P08229P53212
$$ plain form
56012 1812589 1833182 1856376 1877156 1896895 1919970 1945429 1968834 1990238 2013359 2038556 2063394
56001 2063394 2088627 2116791 2146226 2173052 2197687 2223124 2248642 2271852 2294932 2321732 2350537
55990 2350537 2376882 2401706 2429355 2459448 2488394 2517260 2550313 2587305 2624983 2664604 2709928
55979 2709928 2759387 2808390 2857840 2912165 2970691 3029511 3090162 3157416 3230050 3303137 3378139
55968 3378139 3461122 3551818 3643952 3735855 3831586 3932373 4036142 4144486 4260819 4382828
55958 4382828 4506172 4634139 4773991 4925707 5084568 5252765 5437370 5638760 5852498
55949 5852498 6080924 6331180 6603731 6895079 7209671 7555908 7932100 8330157 8751742
55940 8751742 9206674 9696682 10215639 10765134 11354633 11986509 12655823 13364052 14117264
55931A4117264P94243Q25119Q57793R02203R49195R89801J032756J085442J137351
55922B2691167J181497J232268J302110J381180J460376J552159J666673J790893
55914C4258323J914897K053903K219466K395237K567873K753641K966271L190151
55906E4319762L417390L678313M000474M373428M792306N296980N925242O669937
55898I2473832P530647Q561010R810596J1270838J2937761J4868207J7105169
55891A74558060J9614893K2363588K5342356K8402959L1203073L3452435L4939507
55884C69876871L4877444L1370213K2352257P719561r578385k5020221l5289545
55877C96308195l9744888l9710788l6976407l2971941k8680050k4679769k1176494
$$ plain form
55931 14117264 14911507 15736626 16594419 17496622 18445817 19435618 20468374 21553816 22691167
55922 22691167 23872664 25104932 26407042 27788222 29248598 30800757 32467430 34258323
55914 34258323 36173220 38227123 40446589 42841826 45409699 48163340 51129611 54319762
55906 54319762 57737152 61415465 65415939 69789367 74581673 79878653 85803895 92473832
55898 92473832 100004479 108565489 118376085 129646923 142584684 157452891 174558060
55891 174558060 194172953 216536541 241878897 270281856 301484929 334937364 369876871
55884 369876871 404754315 436124528 458476785 466196346 456617961 431597740 396308195
55877 396308195 356563307 316852519 279876112 246904171 218224121 193544352 172367858
55870A72367858j8169856j5644388j3581058j1890335j0457195r227843q185076
55863H5212107p280024o456938n712175n067205m509859m012514l579172l224300
55855D5369920k928792k661586k423177k227319k061017j901584j753841j633542
55847B7779062j531073j425681j319792j227651j145135j060668r81251r19017
55839A8168794q65559q06631p48952p06485o73117o34187n92923n60957n34240
55830A2045743n02105m69269m45743m25324l96582l65397l44707l30954l12004
55821H453658k89890k75088k66203k55203k45139k43092k42817k33511k19331
55812F183384k11953k10072k04167j95278j91258j89929j83305j73654j68695
$$ plain form
55870 172367858 154198002 138553614 124972556 113082221 102625026 93397183 85212107
55863 85212107 77932083 71475145 65762970 60695765 56185906 52173392 48594220 45369920
55855 45369920 42441128 39779542 37356365 35129046 33068029 31166445 29412604 27779062
55847 27779062 26247989 24822308 23502516 22274865 21129730 20069062 19087811 18168794
55839 18168794 17303235 16496604 15747652 15041167 14368050 13733863 13140940 12579983 12045743
55830 12045743 11543638 11074369 10628626 10203302 9806720 9441323 9096616 8765662 8453658
55821 8453658 8163768 7888680 7622477 7367274 7122135 6879043 6636226 6402715 6183384
55812 6183384 5971431 5761359 5557192 5361914 5170656 4980727 4797422 4623768 4455073
55803D455073j65569j55788j41828j33203j30106j25694j20419j19482j20166
55794C242818j15997j09728j08464j09850j06532j00079r7105r5743q9628q1344
55784B228348p8165p8049p3448o5821o2785o3548o0661n3995n0050m9166m5946
55773A546714m0858l9263m0232l7896l2757l0513l0974k8855k4351k2382k2677
55762A195956k0822j7775j8341k1598k2542k1480k2132k2460j7595j0161p368
55751I93682r146r112o049m425m517k128K298L930K676L076N446N859M473N123
55737I91186P102N833J475j363j965l680o420o993o279q163j1877j3007j1360
55724I34489j0425j0195q188o240q109j1408j0025l901J471M373P680J1410J2714
$$ plain form
55803 4455073 4289504 4133716 3991888 3858685 3728579 3602885 3482466 3362984 3242818
55794 3242818 3126821 3017093 2908629 2798779 2692247 2592168 2495063 2399320 2309692 2228348
55784 2228348 2150183 2072134 1998686 1932865 1870080 1806532 1745871 1691876 1641826 1592660 1546714
55773 1546714 1505856 1466593 1426361 1388465 1355708 1325195 1294221 1265366 1241015 1218633 1195956
55762 1195956 1175134 1157359 1139018 1117420 1094878 1073398 1051266 1028806 1011211 1001050 993682
55751 993682 984536 975424 969375 964950 960433 958305 960603 964533 967209 970285 975731 981590 986063 991186
55737 991186 998288 1004121 1005596 1004233 1002268 998588 992168 985175 978896 970733 958856 945849 934489
55724 934489 924064 913869 905681 899441 891332 879924 869899 865998 867469 871842 879522 890932 903646
55711I03646J2643J4625J6616J2899L474o151j4023k2452l0215l2649l0037k7704
55699H00672k7236k5243k1216j8783j8388j6407j2485j0400j0773r961p114n417
55687F17249n572m840l211l710n877n752l051j715k739l003j898k281m317n045
55673E64238m734o766j0611j1827r831q683r319q137m525k571l645m272l055k914
55659D73348m415l749K10L219K764K041M109P310R040R421Q962O989M058J790
55645E25097o75n530j1143j3123j1121r189q803p376m598m024o688q941q552p546
55631D17788p232n798k709l92L25J531L415L245P01q01K93J752K614M874Q465
55616D28071R953Q114N830M707K940J75r57k13j061m354o027l755p91l13q21j76
$$ plain form
55711 903646 916289 930914 947530 960429 963903 957752 943729 921277 891062 858413 828376 800672
55699 800672 773436 748193 726977 708194 689806 673399 660914 650514 639741 629780 622666 617249
55687 617249 611677 606837 603626 599916 594039 588287 585236 583521 580782 577779 575881 573600 569283 564238
55673 564238 559504 552738 542127 530300 520469 511786 502467 494330 489805 487234 483589 479317 476262 473348
55659 473348 468933 465184 465394 468613 471377 473418 477527 484837 493877 503298 512260 519249 523307 525097
55645 525097 524422 518892 507749 494626 483505 474316 465513 458137 453539 449515 442827 433886 425334 417788
55631 417788 410556 404758 402049 401657 401982 403513 406928 410173 410874 410073 410366 412118 414732 419606 428071
55616 428071 438024 446138 451968 456675 459615 459790 458833 458620 457559 453205 447178 443423 442632 442319 441498 441322
55600D41322M27k91m71J539M062M999M799M306K965J043L21Q39L29j640k714k194
55584D59641k466m510o123o149o365p509p694o584o853r466j1559j1036r389q119
55570C55819o362l902k516k505j782j66l56k882m403l024j098p15o98j24m73k076
55554C22737k728j997k540m837n367k679m64j520l170k311o92j212k630k160m60
55539B87970n1j009j670j752j885j862j582j872k601k246q13l98j469j747k66
55524B66747Q80N69P60K559L874L196K230K444K640K222L190O287Q790Q843Q534
55509C23765R876J1258J0835R950R996R127N472Q31k160l976o193q022p938o695
55495C56126n948n745n698o399p657p708o137m949m930m068j568m6j276l108l173
$$ plain form
55600 441322 441749 441458 440987 442526 446588 451587 456386 460692 463657 464700 465021 465860 466189 464549 461835 459641
55584 459641 457175 452665 446542 440393 434028 426519 418825 412241 405388 395922 384363 373327 363938 355819
55570 355819 349457 345555 343039 340534 338752 338586 338230 335348 330945 327921 326823 326108 325410 325286 324813 322737
55554 322737 320009 318012 315472 310635 305268 302589 302125 300605 297435 295124 294432 293220 290590 288430 287970
55539 287970 287919 286910 285240 283488 281603 279741 278159 276287 273686 271440 270627 270229 268760 267013 266747
55524 266747 267627 268196 268956 271515 275389 278585 280815 283259 285899 288121 291311 297598 306388 315231 323765
55509 323765 333641 344899 355734 365684 375680 384807 390279 391110 388950 384974 378781 370759 362821 356126
55495 356126 350178 344433 338735 332336 324679 316971 310834 305885 300955 296887 295319 295273 293997 290889 287716
55480B87716k392k084j059J395K807J258j045j155J80N51j60q97j977l615m218
55465B75305l054k198l154m119l314k303l082m590n006m922n271m867l007j816
55451B24602k912m332l921k929l072k947r56R84N01r67q40n9j057l071l433j963
55435A93628m32P83K083K329O46j013m17J314J772J250J522K317K265J791J894
55420B11732J775P21N40K843N650N995M160K157Q5k574m134k999j094j150k211
55405B21496j722m06q93k753l172j811q66q75l19R14J315Q29Q27J267Q94l2j03
55388B14590M99L71n24j138j535k248k369q81J016J507J024R93R90J5p59L92K408
55371B14351K825J594O50O53J015K040M032N263L950J334rJ01J78K57J275K484
$$ plain form
55480 287716 285324 283240 282181 283576 286383 287641 286596 285441 285621 286172 286012 285115 283138 279523 275305
55465 275305 272251 270053 266899 262780 259466 257163 254081 249491 244485 239563 234292 229425 226418 224602
55451 224602 221690 217358 213437 210508 207436 204489 203533 204517 205018 204051 203211 203152 202095 199024 195591 193628
55435 193628 193196 193979 196062 198391 199037 198024 197607 198921 200693 201943 203465 205782 208047 209838 211732
55420 211732 213507 214228 214768 217611 223261 229256 233416 235573 235658 233084 228950 225951 224857 223707 221496
55405 221496 219774 219368 218475 215722 212550 210739 209873 208998 208679 209593 210908 211737 212564 213831 214725 214693 214590
55388 214590 215089 215460 214936 213798 212263 210015 207646 206765 207781 209288 210312 211305 212295 212310 211551 211943 214351
55371 214351 217176 218770 219420 220073 221088 223128 227160 232423 236373 237707 237698 237799 237977 238234 239509 241993
55355B41993K618K545L641M755L950K018R49K12j842m132m225k672k155l064l608
55340B40983l570m130m595l279j233j128k667k991j534o01r86r27K66J145J188
55325B15941J549K234J732l9j313j412j266r66K22J332L68k136l276k008l60M9
55309B10651K2O35J521J841J225l93k194k378n99O24o72k485j818L54O94r26j644
55292B04458q00o29j787k361j788j738k419j804N51K350K238J425Q52j44j529
55277A96875j971j418j385j989j590j3R55R44J749L753M720L282Q70q91k024k563
55261A99304j835m62l88j779k362r85N96O56o9j39L74O98P25O89P06J148K138
55244A99015K712K020R11O36O38j58q00K46J870J650j27r82l65J24K22J024J761
$$ plain form
55355 241993 244611 247156 250797 255552 259502 261520 262469 262681 260839 256707 252482 249810 247655 244591 240983
55340 240983 237413 233283 228688 225409 224176 223048 220381 217390 215856 215255 214269 213342 213608 214753 215941
55325 215941 217490 219724 221456 221417 220104 218692 217426 216460 216682 218014 218382 216246 212970 210962 210602 210651
55309 210651 210673 211308 212829 214670 215895 215502 213308 210930 210331 210955 210283 207798 205980 206334 207028 206102 204458
55292 204458 203658 203029 201242 198881 197093 195355 192936 191132 191683 194033 196271 197696 198548 198404 196875
55277 196875 194904 193486 192101 190112 188522 188509 189464 190408 192157 195910 200630 203912 204782 203891 201867 199304
55261 199304 197469 197007 196619 194840 192478 191493 192089 192745 192676 192537 192911 193609 194334 195023 195729 196877 199015
55244 199015 201727 203747 204658 205294 205932 205774 204974 205220 207090 208740 208613 207631 207266 207390 207612 208636 210397
55227B10397N09j819k212n74J70o94p84L19j1k150k756o20P01j176l257k100P28
55210A94671J728J018J110K225K438J120o48k110k956k510p62P91R70N20N52P12
55194A98869J63r19j961k768k841j540M12J356J281J866L243L238J039q84j34
55179B00420K313L754K911K74k912m718l528k73J939J516K9m78J20J117K197K651
55163B07332J533m84j516j351j529k096j413J86J4k233l114p59J947K028R70J548
55147B01063K923K468M04q31o60o56j537k445k660k056n48J294K071J401Q05J389
55131B02425K128J867J259J069L23j836l967m090k434o41N50J213J144N64N78
55116B00152J370J315n09k451k606j455m68L84J783L161L620L542L483K810J209
$$ plain form
55227 210397 210906 209087 206875 206301 206471 205777 204993 205312 205301 203151 200395 199775 200476 199300 196043 193943 194671
55210 194671 196399 197417 198527 200752 203190 204310 203662 201552 198596 196086 195324 196115 197085 197605 198157 198869
55194 198869 199032 198113 196152 193384 190543 189003 189415 190771 192052 193918 197161 200399 201438 200554 200420
55179 200420 202733 206487 209398 209672 206760 202042 198514 198241 200180 201696 201725 201247 201367 202484 204681 207332
55163 207332 208865 208381 206865 205514 203985 201889 200476 200662 200676 198443 195329 194570 196517 198545 199515 201063
55147 201063 203986 206454 206858 206027 205367 204711 203174 200729 198069 196013 195465 196759 198830 200231 201036 202425
55131 202425 204553 206420 207679 208748 209071 207235 203268 199178 196744 196103 196653 197866 199010 199574 200152
55116 200152 201522 202837 202328 199877 197271 195816 195348 195732 197515 200676 204296 207838 211321 214131 215340
55101B15340J60R37K363K478J351L22l71j301k150k156j498o80L73J244M30k335
55085B14507m509l545k60K472L331K953J797j73k136k827k139r75Q3Q21Q00l2
55069B10168q31r29p06n65j52N52O91L6l81j1L63M42J078J974J129j776l718k231
55051B05133J000K727K415J528M45j077j862q56M08k16j888k020m88N09L75P98
55035B06931K324L195K312R66O60J124J434J580J921K043J158o07j923j426P23
55020B22415K676K931K220K229K747J935l90j986j478k24K57L96P29K15j557k559
55004B30556j047J532K580J849P40l91j864k909k675k008j994j910q26Nj067k968
54988B17603l267j838n07K31J400K814K968J678M52N5k40q93j443j682j887j863
$$ plain form
55101 215340 215500 216437 218800 221278 222629 222951 222580 221279 219129 216973 215475 214795 215168 216412 216842 214507
55085 214507 209998 206453 206193 208665 211996 214949 216746 216573 214437 211610 209471 208496 208579 209400 210200 210168
55069 210168 209337 208408 207702 207137 206985 207537 208228 208264 207883 207872 208235 208677 209755 211729 212858 211082 207364 205133
55051 205133 206133 208860 211275 212803 213248 212171 210309 209453 209861 209645 207757 205737 205249 205758 206133 206931
55035 206931 209255 212450 214762 215728 216388 217512 218946 220526 222447 224490 225648 225041 223118 221692 222415
55020 222415 225091 228022 230242 232471 235218 237153 236763 234777 233299 233075 233332 233728 234457 234672 233115 230556
55004 230556 229509 231041 233621 235470 236210 235819 233955 231046 228371 226363 224369 222459 221633 221638 220571 217603
54988 217603 214336 212498 211991 212222 213622 216436 219404 221082 221534 221589 221349 220456 219013 217331 215444 213581
54972B13581j200k12N94J420K337K482J557R55J650K184Q61j226j701m56P23J190
54956B24739J486J089r95l626m313k714r88n81q04o77m7J118K560L056J821K84
54940B21408L92J603J805P97J81J37p81k472k894j411J01L14J74O93J283J293
54924B22623J263J520J344N44J85P43J051K27p15l52R87J781J378O24O05J339
54908B35147J781J117k5k26O62J181M80l96m64n34j462k114j058P36J247O82J016
54891B37770K620L798L582K715J784M87r46j599j331p74Q7J587K790K267M78n34
54875B54781j3Q15R69P44M88K35O74K523M764N545M974N015O336P501P697P992
54859C11040R030R567Q421O277M451L143J792J24j852m019n921p198q269r592
$$ plain form
54972 213581 212381 212169 212763 214183 216520 219002 220559 221514 223164 225348 226209 224983 223282 222826 223549 224739
54956 224739 226225 227314 226319 222693 218380 215666 214678 214097 213293 212616 212569 213687 216247 219303 221124 221408
54940 221408 221800 223403 225208 226005 226186 226323 225542 223070 220176 218765 218866 219180 219354 220047 221330 222623
54924 222623 223886 225406 226750 227294 227479 228222 229273 229500 228785 228433 229420 231201 232579 233203 233808 235147
54908 235147 236928 238045 238020 237794 238456 239637 240117 239721 239257 238723 237261 235147 234089 234825 236072 236754 237770
54891 237770 240390 244188 247770 250485 252269 252756 251810 250211 248880 248106 248193 249780 252570 254837 255315 254781
54875 254781 254768 255583 256552 257296 257784 258019 258693 261216 265980 271525 276499 281514 287850 295351 303048 311040
54859 311040 320070 329637 338058 344335 348786 351929 353721 353845 351993 347974 342053 334855 326586 316994
54845C16994j0391r487p238n193l924k753j527q25m40N21J795K022R92P0KK3l78
54828B80263m90K27J239K021K737L503M123M877O289P931Q745Q608Q278P849O760
54813C52960N320M537M273L185Q32j705l533m883o158p319q327r089r016p832
54799C13245o416n618m890l607k820l746n309n546m679m370m536l784k510k403
54785B53011l018k164J3P44q63k358j991j084j118j426j251j290j697j113O52
54770B35047J455J03j440j064L99R30M08l2j21k36k24J7L0m9P24K189K631J362
54752B42129J0N3Q01J059R68Q88K80p10m40J774L946L938K258Q00R9m87j054j252
54734B55060j164q97k59K46m36j828j780L96K476K450J231N96L44l54n40J117
$$ plain form
54845 316994 306603 297116 289878 284685 280761 278008 276481 275656 275216 275737 277532 279554 280546 280616 280618 280641 280263
54828 280263 279773 280000 281239 283260 285997 289500 293623 298500 304789 312720 321465 330073 338351 346200 352960
54813 352960 358280 362817 367090 370275 371107 369402 365869 360986 354828 347509 339182 330093 321077 313245
54799 313245 306829 301211 296321 292714 289894 286148 280839 275293 270614 266244 261708 257924 255414 253011
54785 253011 249993 247829 247842 248586 247723 245365 243374 242290 241172 239746 238495 237205 235508 234395 235047
54770 235047 236502 236605 235165 234101 234500 235430 235838 235806 235685 235449 235225 235242 235272 235223 235947 238136 240767 242129
54752 242129 242139 242192 242993 244052 245020 245908 246188 245478 245038 246812 250758 254696 256954 257754 257853 257366 256312 255060
54734 255060 253896 252999 252740 252986 252550 250722 248942 249338 251814 254264 255495 256091 256435 256081 255541 256658
54718B56658L648M879M503L932L840L916M461O145Q391R733R726R117Q523Q176
54704C45648Q483R422R740Q083M754J332j136k695l784m900o450q141r092r128
54690C42136r118r387q997p385n546m478l709k591j733j683j361M69K952M061
54676B93630L241J650K59p52j118n14O62J673K460L410M423N179N890O812P384
54661C34289O897N702M807M422L770K276K12j820l586n300p120q582q830p810
54647C19327o721o536o554n545l791k570k087j617j418k410m030m516l554k463
54633B65515j734p97l94k133n045n768l393r60p20j074j53Q06K21o87l69o5j208
54616B42042k107o68J398R10j613k895k102j432j860k013j244n13J31J818L955
$$ plain form
54718 256658 260306 265185 269688 273620 277460 281376 285837 291982 300373 310106 319832 328949 337472 345648
54704 345648 354131 363553 373293 381376 386130 387462 386326 383631 379847 374947 368497 360356 351264 342136
54690 342136 333018 323631 314634 307249 301703 297225 293516 290925 289192 287509 286148 286617 289569 293630
54676 293630 296871 298521 298780 298028 296910 296396 297058 298731 301191 304601 309024 314203 320093 326905 334289
54661 334289 341186 346888 351695 356117 359887 362163 362375 360555 356969 351669 344549 335967 327137 319327
54647 319327 312606 306070 299516 293971 290180 287610 285523 283906 282488 280078 276048 271532 267978 265515
54633 265515 263781 262984 262590 260457 255412 249644 246251 245291 244571 243497 243344 244150 244371 243684 243315 243250 242042
54616 242042 239935 239267 240665 241575 239962 237067 234965 233533 231673 229660 228416 227903 228034 229852 233807
54601B33807L993J091k287l425k295n47P19J329J427J294J052L81p99j612j278
54586B32850l82jM9O83J737K171J775J199N73m52j484j661j013l41L1K23o1r35
54568B34961j354k14J822K986K718J982J507J052K96o31j388j483n47P02P90l40
54552B42859p64N66J811R02j208j993j003K58J113J884J989O04j161j230K88J381
54536B46296J415J616K246J983N78m14k15N0m29q03l56K08J10m11r99j715k118
54519B47042j390J08R28O33K54K30k39j151r61R74K905K956J625O13K20n45j809
54502B52393k311j154R00K242K142J312Q16Q20Q75J111K041L141K996J567P17
54487B69608J440K175J413L91R45K140J713L0m64N80R30k36r74j78L90q48k557
$$ plain form
54601 233807 237800 238891 236604 233179 230884 230337 231056 232385 233812 235106 236158 236539 235740 234128 232850
54586 232850 232468 232467 232516 233199 234936 237107 238882 240081 240654 240202 238718 237057 236044 235703 235734 235957 235896 234961
54568 234961 233607 233393 235215 238201 240919 242901 244408 245460 245756 245125 243737 242254 241707 242409 243199 242859
54552 242859 242095 242661 244472 245374 244166 242173 241170 241428 242541 244425 246414 247018 245857 244627 244915 246296
54536 246296 247711 249327 251573 253556 254134 253720 253505 253555 253126 252323 251967 252175 252285 251874 250875 249160 247042
54519 247042 245652 245760 246688 247321 247575 247805 247566 246415 245454 246428 249333 252289 253914 254527 254747 254202 252393
54502 252393 250082 248928 249828 252070 254212 255524 256340 257160 258035 259146 261187 264328 267324 268891 269608
54487 269608 271048 273223 274636 275027 275972 278112 279825 279855 279391 279971 280901 280665 279691 279513 279903 279055 276498
54470B76498k565j012K96L87m50j712k753k632j165M09Q23L37J30O82J423J544
54454B70240P33n25j067q3J754K765K203R53K47K98N34M78Q9l52o01r12j773k734
54436B72247k309L0K438K741J446J163L009N135N107K540r23l152k948r10R14
54421B86528J076L04K43J194K172K629K651J957M48n94K72K291L231K500J670
54406C08572J742J882J294N78M24N56N61M42k1j163k378k575j919j673k107k187
54390C02028j536r74q58o04k43n84j449j632j138j426k782l497k587j259o86j99
54374B80574R08J651R54m46j138r62m67K61J130J454J075R61J626K089J557Q50
54358B92077Q96R50q1j478j460L31K369L141K554J641J377J582R12j325l493l089
$$ plain form
54470 276498 273933 272921 273217 273604 273154 271442 268689 266057 264892 265301 266124 266461 266591 267273 268696 270240
54454 270240 270973 270448 269381 269298 271052 273817 276020 276973 277220 277518 278052 278530 278619 278267 277666 276754 274981 272247
54436 272247 269938 269968 272406 275147 276593 277756 280765 285900 291007 293547 292624 289472 286524 285614 286528
54421 286528 287604 287908 288151 289345 291517 294146 296797 298754 299202 298608 298880 301171 304402 306902 308572
54406 308572 310314 312196 313490 314068 314492 315048 315609 316051 316030 314867 312489 309914 307995 306322 304215 302028
54390 302028 300492 299518 298660 298056 297813 297229 295780 294148 293010 291584 288802 285305 282718 281459 280773 280574
54374 280574 281482 283133 284087 283641 282503 281541 281074 281335 282465 283919 284994 285955 287581 289670 291227 292077
54358 292077 292973 293923 293842 292364 290904 291235 293604 296745 299299 300940 302317 303899 304811 303486 299993 296904
54342B96904j80K274K143N95r7L77Q49Q77Q98R92Q90O70M60Q5j40P46K732L969
54324C15044K823J17j836j948r83K4Q22J616K548L474L902L462K668K553L287
54309C37573L887L582K631J527M54j71K14J157J341M04o18j109j711k616k669
54294C43876j275J74J15j078j995k245k419k861l529m237m212k549K1J104m26
54279C18464k720l378k346j045l6P00M76r57j891o16J561J592j003l294k880o58
54263C01969J118J891K546L134K380l27l443m555l126j210r56j992k182o44J406
54248B96009K692L214L149K069L1j800k568k628k397j616n77n66j947l214l108
54233B86743k339j878j038R42K812K863J693J301J990K214J237L1m95m31j1P56
$$ plain form
54342 296904 296724 298998 301141 301736 301639 302016 302865 303742 304640 305632 306522 307192 307652 307737 307597 308343 311075 315044
54324 315044 317867 317984 316148 314200 313217 313241 314063 315679 318227 321701 325603 329065 331733 334286 337573
54309 337573 341460 345042 347673 349200 349654 349483 349697 350854 352195 352599 351981 350872 349161 346545 343876
54294 343876 342601 342775 342890 341812 339817 337572 335153 332292 328763 324526 320314 317765 317786 318890 318464
54279 318464 315744 312366 310020 308975 308939 309639 310115 309158 307267 306651 308212 309804 308801 305507 302627 301969
54263 301969 303087 304978 307524 310658 313038 312711 309268 304713 301587 300377 299421 297429 295247 294603 296009
54248 296009 298701 301915 305064 307133 307164 305364 302796 300168 297771 296155 295578 295012 293065 289851 286743
54233 286743 284404 282526 281488 282430 285242 288105 289798 291099 293089 295303 296540 296571 296076 295645 295634 296390
54217B96390J409J283N33r4l81n63m01M34J302J173J83m48oJ148K417L408L673
54200C11460L171K686K935L337K672P58j353k563k331o39J662K933K264N78o52
54185C26918j141j224m75J469L328L214J240n91j052p79p47j202k153l351l673
54170C19781k109L53J419N37m17l9N72j87j856k674k084j057l97KJ74m66k155
54153C09397l852l917j789J293L432L781K828J278o94k815m108l623j566P02J733
54138C02080R81q30k107j765m27L48J68K32J258K151J670M21m5N72J257J377J302
54121C08643J484J880K216K159J489O50O09J471J955J058m37j074o56J9O38J184
54105C23288Q50j222m176n804m821j931J270L429L757K418P54J10L89M79j78j237
$$ plain form
54217 296390 297799 299082 299615 299521 299140 298577 298176 298610 299912 301085 301268 300820 300814 301962 304379 307787 311460
54200 311460 314631 317317 320252 323589 326261 327019 325666 323103 320772 320133 321795 324728 326992 327570 326918
54185 326918 325777 324553 324078 325547 328875 332089 333329 332738 331686 330907 330160 328958 326805 323454 319781
54170 319781 317672 318025 319444 319981 319564 319525 320097 319910 318054 315380 313296 312239 311842 311844 312018 311552 309397
54153 309397 305545 301628 299839 301132 304564 308345 311173 312451 311757 308942 304834 301211 299645 300347 302080
54138 302080 303061 302231 300124 298359 297932 298280 298448 298680 299938 302089 303759 304180 304135 304707 305964 307341 308643
54121 308643 310127 312007 314223 316382 317871 318521 319130 320601 322556 323614 323177 322103 321447 321466 322104 323288
54105 323288 324138 322916 318740 312936 308115 306184 307454 310883 314640 317058 317812 317922 318311 318790 318612 317375
54089C17375k336l238l370k373r60j63N7M13P92N43R0P70K680M033L257R11j006
54072C17475j096L19J723J888J093O88J231J831J761J709K452L230K965K255K514
54057C42038L667M458M668N109N533M721K851J717J946J963N43j307k145k196
54043C73566k424k714k378j656j402j784k410l217m179m478l192q81N12k39k142
54028C40982k958j555J029K820K960K218J622J247O12k89j006j194p07N44K250
54013C48575L680M547N370O262O164M325J940R22J341J545Q28L34R43J754J487
53998C90017L76k95QN95O77M48R63K989N910P996Q010O501N157N138O300P688
53982D48478Q273P625O394N927O893Q602J0038J0943J1480J1609J1480J1675J2185
$$ plain form
54089 317375 315039 311801 308431 306058 305098 304935 304992 305405 306197 306740 306830 307600 310280 314313 317570 318481 317475
54072 317475 316379 316698 318421 320309 321402 322090 323321 325152 326913 328622 331074 334304 337269 339524 342038
54057 342038 345705 350163 354831 359940 365473 370194 373045 374762 376708 378671 379214 377907 375762 373566
54043 373566 371142 368428 366050 364394 362992 361208 358798 355581 351402 346924 343732 342851 343363 343124 340982
54028 340982 338024 336469 337498 340318 343278 345496 347118 348365 348977 348688 347682 346488 345781 346325 348575
54013 348575 352255 356802 362172 368434 374598 378923 380863 381785 383126 384671 385499 385833 386776 388530 390017
53998 390017 390393 390098 390106 390701 391378 391826 392789 395778 401688 409684 417694 424195 429352 434490 440790 448478
53982 448478 456751 464376 470770 476697 483590 492192 502230 513173 524653 536262 547742 559417 571602
53969E71602J1991J0595R110Q612Q279O628L932J794Q30L83R4J24O2o56j415j263
53953F30702r15k065m695o989q138r162j0600j1430j1009j0228r766q864o998
53940E29843n282m953n595o017o004o002n871n120l909k799j860q43N0K14m73
53925D75379j294j234J28K149L684M316M785N849P245Q309Q883Q783P113L417
53911E37512j006m304o210p589q338p571n730m544m570m537l521k117j019q7P01
53896D77070R60J091K159L934M702L848K990L597M938N503N129M591M209M003
53882E28724M333N288O185O556O859P507Q061Q173Q350Q902R055Q075O565N700
53868F28333N771O250O750P186P456P606P947Q627R472J0412J1421J2075J2089
$$ plain form
53969 571602 583593 594188 603298 611910 620189 626817 630749 632543 633373 633756 633850 633974 634036 633380 631965 630702
53953 630702 629787 627722 623027 616038 607900 598738 588138 576708 565699 555471 545705 536841 529843
53940 529843 524561 519608 514013 507996 501992 495990 490119 484999 481090 478291 476431 475588 475638 475852 475379
53925 475379 474085 472851 472979 475128 478812 483128 487913 493762 501007 509316 518199 526982 534095 537512
53911 537512 536506 532202 525992 518403 510065 502494 496764 492220 487650 483113 479592 477475 476456 476369 477070
53896 477070 478030 479121 481280 485214 489916 493764 496754 500351 505289 510792 515921 520512 524721 528724
53882 528724 533057 538345 544530 551086 557945 565452 573513 581686 590036 598938 607993 616068 622633 628333
53868 628333 634104 640354 647104 654290 661746 669352 677299 685926 695398 705810 717231 729306 741395
53855G41395J2235J3606J5819J7130J6669J5228J3563J1409Q716O437N251M669
53843H82127M025L188J775q54m156o340o678o558p341q494q934q960r618j1074
53829H12108j2696j4046j4960j5356j5526j5775j5505j3950j2048j1773j3073
53818F57400j3452j1613r402q770q899q115o793o273o427o462o875q242r191q062
53804E38824n944n514p161q546q026o408n157m709m868n300n260m160k678k140
53790D62953k646k920k155j038p35j656l214m205l607j675L3L30l59q68p03K6
53774D37561J163K075J696O8j100o35L43J75q56j343j110q33j08J934M440N307
53758D48777L937J879P71J073K578M542N557M974M255N198P192Q202Q158Q847
$$ plain form
53855 741395 753630 767236 783055 800185 816854 832082 845645 857054 865770 872207 877458 882127
53843 882127 886152 889340 891115 890261 886105 879765 873087 866529 859188 850694 841760 832800 823182 812108
53829 812108 799412 785366 770406 755050 739524 723749 708244 694294 682246 670473 657400
53818 657400 643948 632335 622933 614163 605264 597149 590356 584083 577656 571194 564319 556077 546886 538824
53804 538824 532880 527366 520205 511659 503633 497225 492068 487359 482491 477191 471931 467771 465093 462953
53790 462953 460307 457387 455232 454194 453459 451803 448589 444384 440777 439102 439135 439465 439106 438238 437535 437561
53774 437561 438724 440799 442495 442563 441463 440828 441171 441346 440490 439147 438037 437204 437096 439030 443470 448777
53758 448777 452714 454593 455364 456437 459015 463557 469114 474088 478343 483541 490733 498935 507093 515940
53744E15940J0439J0848R358Q283R559J1796J2408J1161R764R074Q483P495O359
53731F40967N326M509M289M853N446M887K915L61j976m021n786o677o002m216
53717F44875l088m053o529q527r039q934r173r380q964q563q961r415q698p332
53703E34219p000p840q187p179n854n160m551l455k590k760l418l513l002k528
53689D67182k324k331k690l234l109j949r13j319k589k774j244L98M74o70j459
53674D41449j202n01J08Q35J781K404K426K489L140L777L545K909K986L479K860
53659D72485R83j53Q43K624L092K433K538M087N804O396N777M397K799J858K211
53644E18174L243L758L749M235N251N451M293L162L381M277M355L598L269L812
$$ plain form
53744 515940 526379 537227 546585 554868 564427 576223 588631 599792 609556 618630 627113 634608 640967
53731 640967 646293 650802 655091 659944 665390 670277 673192 673553 671577 667556 661770 655093 649091 644875
53717 644875 641787 637734 631205 622678 613639 604705 595532 586152 577188 568625 559664 550249 541551 534219
53703 534219 527219 519379 511192 504013 498159 492999 488448 484993 482403 479643 476225 472712 469710 467182
53689 467182 464858 462527 459837 456603 453494 451545 450632 449313 446724 443950 442706 443104 443578 442908 441449
53674 441449 440247 439746 439854 440689 442470 444874 447300 449789 452929 456706 460251 463160 466146 469625 472485
53659 472485 473468 473315 474158 476782 479874 482307 484845 488932 494736 501132 506909 511306 514105 515963 518174
53644 518174 521417 525175 528924 533159 538410 543861 548154 551316 554697 558974 563329 566927 570196 574008
53630E74008M302M081L677L583L149J595m14j297o98Ll08r94j018p98j437k579
53614E84855k640j211K67N48pm97o23k12R52K078J641l92j926j458k7P32R40J328
53596E84348J236p5j304o05J400K480K157J831J776P29j158j669K19K615L512
53581E97492L481M149N395N761M867L961M198N329O093N489L797K412K375L153
53567F57952L420K809K064J623J143N60N38J474K887M064M673M653M265M239N040
53552G01404O013O171N735N761O311O357N566M790M433L832K918K970M734O772
53538G73767O898M758K126Q88J227J682P77j288k842k944k666l284m003l172j329
53523G70595q50k383l770l315k103j874k350k169j318r94j790l258m604m872l222
$$ plain form
53630 574008 578310 582391 586068 589651 592800 594395 593981 592684 591986 591989 591681 590687 589669 588871 587434 584855
53614 584855 582215 581004 581271 581819 581812 581315 580692 580480 581432 583510 585151 584759 582833 581375 581348 582080 583020 584348
53596 584348 585584 585509 584205 583600 585000 587480 589637 591468 593244 593973 592815 591146 591365 593980 597492
53581 597492 600973 605122 610517 616278 621145 625106 629304 634633 640726 646215 650012 652424 654799 657952
53567 657952 661372 664181 666245 667868 669011 669571 670109 671583 674470 678534 683207 687860 692125 696364 701404
53552 701404 707417 713588 719323 725084 731395 737752 743318 748108 752541 756373 759291 762261 766995 773767
53538 773767 780665 785423 787549 788437 789664 791346 792123 790835 787993 785049 782383 779099 775096 771924 770595
53523 770595 769745 767362 763592 760277 758174 756300 753950 751781 750463 749469 747679 744421 739817 734945 731723
53508G31723j90K088K110Q24J93N65P25L5p81q73j90P94J550J789J892K630L868
53491G48752M228K940J348J398L033M449M805N173O552Q201Q736Q003P141P127
53477H21886P866Q566Q596P999P463P851R603J2396J5266J7229J8087J8661J9861
53464I81330K1527K2694K3057K3522K4896K6661K7749K8126K8767L0103L1405
53453A269837L1951L2107L2736L3996L5427L7097L9698M3050M5343M4813M1975
53442A688030L9156L7774L7068L5917L4758L4724L5675L6200L5366L3590L1907
53431B080165L1085L1231L1635L1293L0123K9202K9060K8656K7038K5242K5033
53420B399763K6194K6738K5658K3838K2154K0397J8322J6212J3896J0705O934
$$ plain form
53508 731723 731533 733621 735731 736555 736748 737313 738038 738073 737292 736419 736229 737023 738573 740362 742254 744884 748752
53491 748752 752980 755920 757268 758666 761699 766148 770953 776126 782678 790879 799615 807618 814759 821886
53477 821886 829752 838318 846914 854913 862376 870227 879830 892226 907492 924721 942808 961469 981330
53464 981330 1002857 1025551 1048608 1072130 1097026 1123687 1151436 1179562 1208329 1238432 1269837
53453 1269837 1301788 1333895 1366631 1400627 1436054 1473151 1512849 1555899 1601242 1646055 1688030
53442 1688030 1727186 1764960 1802028 1837945 1872703 1907427 1943102 1979302 2014668 2048258 2080165
53431 2080165 2111250 2142481 2174116 2205409 2235532 2264734 2293794 2322450 2349488 2374730 2399763
53420 2399763 2425957 2452695 2478353 2502191 2524345 2544742 2563064 2579276 2593172 2603877 2610811
53409B610811L892J936k51l767q106j2306j6137j9460k1655k2567k2926k3138
53397B466326k2744k1759k1353k2407k4464k6793k9271l1475l2312l1563l0458
53386B171727k9716k8448k6093k3833k2626k1398j9015j6631j5752j5126j2116
53375A940973o784k042K47J074J981L207M696O954R879J2284J3558J4723J6965
53362B017715K0018K2792K4817K6413K8064L0151L2829L5786L8561M1271M4359
53351B362776M7532M9863N1081N1922N2936N3896N4814N6454N9193O2291O5004
53340B967762O7674P0875P4217P6891P8938Q0963Q3016Q4695Q6091Q7610Q8883
53329C847615Q8839Q7056Q4250Q1318P8654P6577P5402P4592P2662O8675O3390
$$ plain form
53409 2610811 2614703 2616639 2616388 2612621 2604515 2592209 2576072 2556612 2534957 2512390 2489464 2466326
53397 2466326 2443582 2421823 2400470 2378063 2353599 2326806 2297535 2266060 2233748 2202185 2171727
53386 2171727 2142011 2113563 2087470 2063637 2041011 2019613 2000598 1983967 1968215 1953089 1940973
53375 1940973 1934189 1932147 1932394 1933468 1935449 1938656 1943352 1950306 1960185 1972469 1986027 2000750 2017715
53362 2017715 2037733 2060525 2085342 2111755 2139819 2169970 2202799 2238585 2277146 2318417 2362776
53351 2362776 2410308 2460171 2511252 2563174 2616110 2670006 2724820 2781274 2840467 2902758 2967762
53340 2967762 3035436 3106311 3180528 3257419 3336357 3417320 3500336 3585031 3671122 3758732 3847615
53329 3847615 3936454 4023510 4107760 4189078 4267732 4344309 4419711 4494303 4566965 4635640 4699030
53318D699030N8223N3460M8213M1867L4757K7498K0394J3564P005M00o694j4387
53306D983330k2606l1428m0689m9500n7019o3596p0147p6292q0413q1894q2124
53295D327622q2688q3597q4020q3659q2577q0686p8352p6531p5339p3499p0408
53284C456266o7728o7419o8952o9919o8809o5733o1221n6110n2049n0090m8954
53273B779282m6524m2914m0152l8921l7657l5085l1603k7902k4259k1646k1434
53262B411185k3242k4886k5161k4860k4360k2457j8674j4700j2081j0223q131
53251B202410o463o162o393n587l456n18L219P570J1239J3342J4924J7368K0125
53238B261618K1750K2409K3508K5336K6922K7940K9090L0643L2135L3463L4943
$$ plain form
53318 4699030 4757253 4810713 4858926 4900793 4935550 4963048 4983442 4997006 5004011 5004411 4997717 4983330
53306 4983330 4960724 4929296 4888607 4839107 4782088 4718492 4648345 4572053 4491640 4409746 4327622
53295 4327622 4244934 4161337 4077317 3993658 3911081 3830395 3752043 3675512 3600173 3526674 3456266
53284 3456266 3388538 3321119 3252167 3182248 3113439 3047706 2986485 2930375 2878326 2828236 2779282
53273 2779282 2732758 2689844 2649692 2610771 2573114 2538029 2506426 2478524 2454265 2432619 2411185
53262 2411185 2387943 2363057 2337896 2313036 2288676 2266219 2247545 2232845 2220764 2210541 2202410
53251 2202410 2195947 2189785 2183392 2177805 2174349 2173831 2177050 2184620 2195859 2209201 2224125 2241493 2261618
53238 2261618 2283368 2305777 2329285 2354621 2381543 2409483 2438573 2469216 2501351 2534814 2569757
53227B569757L6303L6736L5989L4418L2139K9074K5621K2327J9139J5874J2889
53216B870266J0263O924J899l921q747j2265j5628j9215k2080k3895k5873k9112
53204B728616l3117l6700l9534m2137m4715m6657m7208m6500m5842m6658m8954
53193B250594n1254n2230n1742m9998m6849m2908m0306m0749m3086m4206m2481
53182A744785l9222l6716l5936l6415l7230l7572l6971l5514l3731l2096l0735
53171A352647k9503k8140k6467k4659k3004k1329j9158j6738j5175j5188j6260
53160A117026j7552j8907k0372k1449k1591k1044k0447k0008j9534j8816j7548
53149H99758j5638j3905j3674j4993j6274j6298j5590j5096j4700j4032j3513
$$ plain form
53227 2569757 2606060 2642796 2678785 2713203 2745342 2774416 2800037 2822364 2841503 2857377 2870266
53216 2870266 2880529 2887453 2889352 2885431 2876684 2864419 2848791 2829576 2807496 2783601 2757728 2728616
53204 2728616 2695499 2658799 2619265 2577128 2532413 2485756 2438548 2392048 2346206 2299548 2250594
53193 2250594 2199340 2147110 2095368 2045370 1998521 1955613 1915307 1874558 1831472 1787266 1744785
53182 1744785 1705563 1668847 1632911 1596496 1559266 1521694 1484723 1449209 1415478 1383382 1352647
53171 1352647 1323144 1295004 1268537 1243878 1220874 1199545 1180387 1163649 1148474 1133286 1117026
53160 1117026 1099474 1080567 1060195 1038746 1017155 996111 975664 955656 936122 917306 899758
53149 899758 884120 870215 856541 841548 825274 808976 793386 778290 763590 749558 736045
53138G36045j3398j2894j1640j0905j1763j2953j2429j0416r135r751j1279j2240
53126E97242j1956j0437q373p049o910o584m684k157j246k464m155m859m525l558
53112E18285k247j234j102j458j636j999l169m365m190k941k370l083l865l664
53098D80962k711j517l14L59J07k38M68J634J457l97k322l199l522l738l306j962
53082D61761l27J200K659L299K001m61j526j86J437J011q51j629j19K496M150
53067D74915L726J926O88J199K463K750K089J869K190J688L13k3J521L079K851
53052E03244J810J965L259L856K780O81j455l097l914l813l246k830k792k942
53038D93506k833j934l81N38l74k459l805l707l229l192l135k642k074j482l97
$$ plain form
53138 736045 722647 709753 698113 687208 675445 662492 650063 639647 630512 620761 609482 597242
53126 597242 585286 574849 566476 559427 552517 545933 541249 539092 537846 535382 531227 526368 521843 518285
53112 518285 516038 514804 513702 512244 510608 508609 505440 501075 496885 493944 491574 488491 484626 480962
53098 480962 478251 476734 476420 476779 476886 476648 477116 478750 480207 479810 477488 474289 470767 467029 463723 461761
53082 461761 461434 462634 465293 468592 470593 470132 468606 468420 469857 470868 470017 468388 468269 470765 474915
53067 474915 478641 480567 481255 482454 484917 487667 489756 491625 493815 495503 495816 495793 497314 500393 503244
53052 503244 505054 507019 510278 514134 516914 517595 516140 513043 509129 505316 502070 499240 496448 493506
53038 493506 490673 488739 488358 488896 488522 486063 482258 478551 475322 472130 468995 466353 464279 462797 462400
53023D62400O85L50j301k065o82J074Q22j218k944l265k781k314k054j803j184
53008D43720j86K22r52k747k867r78L42p53k678k946j676n70J65J484L002L316
52992D35898K456J866J997J895J064R8n81r62o10P32J807R79j191k352j723j106
52976D40267j859k666j680L99J067o23k749k866p34J741K871K850K922L503L843
52961D46286L363K382J366L68m83q39r52j568k438k171m38R15L40r08n13J319
52945D46029K054N65j210q77J533L949M585L282J228j27j66N92J351J899K218
52930D66905J919Q68m0K04J171J455O25k65l09J94N77R05J653K789L634L494K355
52913D88134R99K53O1k91p43k38J553L130K962J683J075J386J334N55J53M58J78
$$ plain form
53023 462400 463085 463435 462134 460069 459387 460461 461283 460065 457121 453856 451075 448761 446707 444904 443720
53008 443720 443534 443756 442804 440057 437190 436212 436554 435801 433123 430177 428501 427931 428096 429580 432582 435898
52992 435898 438354 440220 442217 444112 445176 445274 444693 443731 443121 443853 445660 446639 445448 443096 441373 440267
52976 440267 438408 435742 434062 434461 435528 434905 432156 429290 428556 430297 433168 436018 438940 442443 446286
52961 446286 449649 452031 453397 453765 453282 452443 451491 449923 447485 445314 444876 445791 446131 445223 444710 446029
52945 446029 448083 448648 447438 446561 448094 452043 456628 459910 461138 461011 460845 461437 462788 464687 466905
52930 466905 468824 469692 469652 469856 471027 472482 473107 472842 472533 472727 473304 474209 475862 478651 482285 485779 488134
52913 488134 489133 489386 489447 489156 488413 488175 489728 492858 495820 497503 498578 499964 501298 501853 502006 502464 502642
52896E02642j331k583k053n91k60j429k514k372j613j355j759k249k435k330k056
52881D75712j678j231p14k02O1j08n09q16j137j897k962l384k417n25J083J785
52865D61061J874J782J518J020L72m35j392j992j534k34P68Q39M69lj095k788
52849D60230l531k053N31J989J878J585J813J881J497J378J720J746J239R94J105
52834D74002N20j011k024j341L88K079L627M865M546J970j397l380l439k428r72
52819D76005N49J257O02n52r52o42l65N8J287K891L744L829M207N140N628M968
52803E07654L648K425J346n4k102m528o294o309m900l940m717o197o400m985l397
52788D61250k815l055l371l273k641j833j545j854j944j456j394k487l496k702
$$ plain form
52896 502642 501311 498728 496675 496084 495824 494395 491881 489509 487896 486541 484782 482533 480098 477768 475712
52881 475712 474034 472803 472089 471887 471948 471840 471331 470515 469378 467481 464519 461135 458718 458193 459276 461061
52865 461061 462935 464717 466235 467255 467627 467192 465800 463808 462274 462040 462808 463647 464116 464113 463018 460230
52849 460230 456699 454646 455177 457166 459044 460629 462442 464323 465820 467198 468918 470664 471903 472897 474002
52834 474002 474522 473511 471487 470146 470534 472613 476240 481105 485651 487621 486224 482844 479405 476977 476005
52819 476005 476554 477811 478413 477861 476909 476267 475902 475960 477247 480138 483882 487711 491918 497058 502686 507654
52803 507654 511302 513727 515073 515019 512917 508389 502095 495786 490886 486946 482229 476032 469632 464647 461250
52788 461250 458435 455380 452009 448736 446095 444262 442717 440863 438919 437463 436069 433582 430086 427384
52774D27384n90O69L44l1R00K666M181N136N461M639K418l94k510l238k796j961
52758D42278j442j139k03J586K969K598R86j11l1L20L20O15J751K987L083J613
52742D58180r59l844o127o944n949l649j272j93q71k098k051n91M77J41q9J413
52726D25574L453L514J483k65k90N84J282J600J098p37k703k516j50J577Q11r74
52710D33341j593j032j92J151K970L290M71l630n342l673r87N92J250J820K215
52695D30651K204K070J797Q27n76r94L01K186L257L691M487N499N483L959J921
52680D66763O28M43J071K072K837K689J555K29m52l64K72J424K810L403K392N23
52664D88295m79n3N69J05j292k638l270k955j878j101j902l728l966j200K286
$$ plain form
52774 427384 426794 427463 427807 427776 428676 431342 435523 440659 446120 450759 453177 452783 450273 447035 444239 442278
52758 442278 440836 439697 439494 441080 444049 446647 447633 447522 447491 447811 448131 448746 450497 453484 456567 458180
52742 458180 457221 453377 447250 440306 434357 430708 429436 429243 428372 426274 424223 423632 424109 424250 424161 425574
52726 425574 429027 432541 434024 433759 433469 434053 435335 436935 438033 437296 434593 432077 431927 433504 434315 433341
52710 433341 431748 430716 430524 431675 434645 437935 438406 434776 429434 425761 424774 425366 426616 428436 430651
52695 430651 432855 434925 436722 437549 436973 435979 436280 438466 441723 445414 449901 455400 460883 464842 466763
52680 466763 467391 467834 468905 470977 473814 476503 478058 478287 477835 477471 477743 479167 481977 485380 487772 488295
52664 488295 487816 487763 488332 488437 487145 484507 481237 478282 476404 475303 473401 469673 465707 464507 466793
52649D66793K988O59j611j699p12n26r90p81L08J301J605J517J451J488J485J120
52633D74396K2j649l041l431l000k455k154j920j526r21q5J066K472L637L643
52618D65054J838j224l737m088k319J10J811K383K097J415P52L06Jj17L39J419
52602D66040K287K026Q39j59k53M50J705L317M657M928M174L360L203L430L361
52587E03365K690J446k74k262m086n097m662k763o24P3q93j725q45J000J934J597
52571D88874J199J384J659J835K384K996K456M72j673k866l349l561l104j772
52557D86934n67n80j542k285k224j600p74O0P26J138J369J378R76J25r67j935
52541D80232k147r23J353K835K123K62m85K85Q67L66r2M13J019P95L49N36R18
$$ plain form
52649 466793 469781 470440 468829 467130 466418 465892 464902 464121 464429 465730 467335 468852 470303 471791 473276 474396
52633 474396 474418 472769 469728 466297 463297 460842 458688 456768 455242 454321 454236 455302 457774 461411 465054
52618 465054 466892 465668 461931 457843 455524 455634 457445 459828 461925 463340 464092 464398 464399 464282 464621 466040
52602 466040 468327 470353 471192 471033 470780 471230 472935 476252 480909 485837 490011 493371 496574 500004 503365
52587 503365 506055 507501 507227 504965 500879 495782 491120 488357 487733 487806 486913 485188 484343 485343 487277 488874
52571 488874 490073 491457 493116 494951 497335 500331 502787 503259 501586 498720 495371 491810 488706 486934
52557 486934 486367 485787 484245 481960 479736 478136 477362 477422 478148 479286 480655 482033 483009 483134 482167 480232
52541 480232 478085 477162 478515 481350 483473 483735 483250 483535 484402 484768 484676 485089 486108 486903 487252 487788 488706
52524D88706Q43R11J790K599K062O40p4L35Q12O56J94l27j183k266k811k428j675
52507D88784j331j491j637j253l45M30K88p47j685j544l45J020J618J012m97j959
52491D80318k527k289j853j224L7J476J815P79k77l86l34j038j807j529o09j57
52475D70395J22J397L438M616M237L258K372J139m21r27M69K278K170j16k365
52460D92062k367m0K933M839N078M160K989K209J882J705J419J079J007J587K931
52445E23473M516N234M152J512j278k977l615l912l996l453k527k117k329k250
52431E10433j730k089l860n104l681n29J397J215J074K592M442M464K598N34n07
52416E11249l99N67J786K304J710P40K65J96N2M5P26J875K718L020L215L536L622
$$ plain form
52524 488706 489549 490460 492250 494849 496911 497551 497477 497812 498624 499280 499474 499147 497964 495698 492887 490459 488784
52507 488784 487453 485962 484325 483072 482727 483157 483445 482698 481013 479469 479124 480144 481762 482774 482277 480318
52491 480318 477791 475502 473649 472425 472462 473938 475753 476532 476255 475869 475535 474497 472690 471161 470552 470395
52475 470395 470517 471914 475352 479968 484205 487463 489835 490974 490553 489626 490095 492373 494543 494427 492062
52460 492062 489695 489655 492588 497427 502505 506665 509654 511863 513745 515450 516869 517948 518955 520542 523473
52445 523473 527989 533223 537375 538887 537609 534632 531017 527105 523109 519656 517129 515012 512683 510433
52431 510433 508703 506614 502754 497650 493969 493440 494837 496052 497126 499718 504160 508624 511222 511756 511249
52416 511249 510850 511417 513203 515507 517217 517957 518222 518418 518470 518515 519241 521116 523834 526854 530069 533605 537227
52399E37227L012J654l3j351j785j506j224j426j985k531k795k583j968j554j805
52384E19347k152j616m67j76j297k503k420j352l70L85J288J846J118o91k130
52369E08810k267j544p22K11J584L002L520K932K347K892M097M358L201K098K398
52354E36917L378L498K925L239M844O265O284N489N247O200Q051R791R938P634
52340F19700L832L71k151m384o188o376m852l323l056l405l379l092k801j932
$$ plain form
52399 537227 540239 541893 541860 540509 538724 537218 535994 534568 532583 530052 527257 524674 522706 521152 519347
52384 519347 517195 515579 515112 514936 513639 511136 508716 507364 506994 507379 508667 510513 511631 510940 508810
52369 508810 506543 504999 504277 504488 506072 509074 512594 515526 517873 520765 524862 529220 532421 534519 536917
52354 536917 540295 543793 546718 549957 554801 561066 567350 572839 578086 584286 592337 602128 612066 619700
52340 619700 623532 623903 621752 617368 611180 604804 599952 596629 593573 590168 586789 583697 580896 578964
$$ [...]
##END NTUPLES=NMR SPECTRUM
##END=
