
##TITLE=UV1019_M2-1005-1001_6269241_XHeYjly8f8
##JCAMPDX= 6.0         $$ Bruker NMR JCAMP-DX V2.0
##DATA TYPE= NMR SPECTRUM
##DATA CLASS= NTUPLES
##ORIGIN= BRUKER
##OWNER= Administrator
$$ 1.72 TOPSPIN		Version 2.1
$$ 2012-06-02 03:54:56.640 -0500  Administrator@TOPSPIN
$$ Compression mode = diff/dup
##.OBSERVE FREQUENCY= 400.13188235
##.OBSERVE NUCLEUS= ^1H
##.ACQUISITION MODE= SIMULTANEOUS (DQD)
##.ACQUISITION SCHEME= undefined
##.AVERAGES= 8
##.DIGITISER RES= 22
##SPECTROMETER/DATA SYSTEM= spect
##.PULSE SEQUENCE= zg30
##.SOLVENT NAME= COFFEE_calctemp
##.SHIFT REFERENCE= INTERNAL, COFFEE_calctemp, 1, 14.98061
##AUDIT TRAIL= $$ (NUMBER, WHEN, WHO, WHERE, PROCESS, VERSION, WHAT)
$$ ##TITLE= Audit trail, TOPSPIN		Version 2.1
$$ ##JCAMPDX= 5.01
$$ ##ORIGIN= Bruker BioSpin GmbH
$$ ##OWNER= Administrator
$$ $$ C:\Bruker\TOPSPIN/data/COFFEE/nmr/UV1019_M2-1005-1001_6269241_XHeYjly8f8/10/pdata/1/auditp.txt
$$ ##AUDIT TRAIL=  $$ (NUMBER, WHEN, WHO, WHERE, PROCESS, VERSION, WHAT)
(   1,<2012-06-02 03:54:47.734 -0500>,<Administrator>,<TOPSPIN>,<go>,<TOPSPIN 2.1>,
      <created by zg
	started at 2012-06-02 03:53:40.781 -0500,
	POWCHK enabled, PULCHK disabled,
       configuration hash MD5:
       D5 CA 7A 23 FE 6B EE E2 50 67 74 61 24 F7 5E 3B
       data hash MD5: 64K
       05 28 A5 B6 C8 62 FD C5 5F 42 A0 5E 79 87 8E 63>)
(   2,<2012-06-02 03:54:52.375 -0500>,<Administrator>,<TOPSPIN>,<proc1d>,<TOPSPIN 2.1>,
      <Start of raw data processing
       efp LB = 0 FT_mod = 6 PKNL = 1 PHC0 = 0 PHC1 = 0 SI = 32K 
       data hash MD5: 32K
       95 6F 1A 2F 75 C1 4E B2 F2 F1 9B 9F A7 EF 95 7C>)
(   3,<2012-06-02 03:54:52.734 -0500>,<Administrator>,<TOPSPIN>,<proc1d>,<TOPSPIN 2.1>,
      <pk PHC0 = 209.7125 PHC1 = 0 
       data hash MD5: 32K
       A4 18 1C 9D 65 98 4F 26 AF 9B 7E 5F 35 01 77 EE>)
(   4,<2012-06-02 03:54:52.890 -0500>,<Administrator>,<TOPSPIN>,<proc1d>,<TOPSPIN 2.1>,
      <abs ABSG = 1 
       data hash MD5: 32K
       6B EE 46 34 FD F6 02 36 F7 00 80 21 05 37 03 27>)
(   5,<2012-06-02 03:54:53.046 -0500>,<Administrator>,<TOPSPIN>,<proc1d>,<TOPSPIN 2.1>,
      <abs ABSG = 2 
       data hash MD5: 32K
       95 A4 62 EF 95 EB 33 7E 27 93 7F FA 87 34 E1 2D>)
(   6,<2012-06-02 03:54:53.078 -0500>,<Administrator>,<TOPSPIN>,<proc1d>,<TOPSPIN 2.1>,
      <abs ABSG = 3 
       data hash MD5: 32K
       5E 59 3A 17 D5 FE 68 3D A9 A3 0B A4 92 46 1A 66>)
(   7,<2012-06-02 03:54:53.125 -0500>,<Administrator>,<TOPSPIN>,<proc1d>,<TOPSPIN 2.1>,
      <abs ABSG = 4 
       data hash MD5: 32K
       73 EB 30 C8 3D E3 0C 0F 8F 76 F3 32 6E 1C A7 95>)
(   8,<2012-06-02 03:54:53.156 -0500>,<Administrator>,<TOPSPIN>,<proc1d>,<TOPSPIN 2.1>,
      <abs ABSG = 5 
       data hash MD5: 32K
       08 48 F0 96 FF 68 63 0D 7A 92 2B 96 1B 14 02 AF>)
$$ ##END=
$$ 
$$ $$ hash MD5
$$ $$ 0D BF 28 AC 29 94 5D E5 AE E8 D4 08 8F F3 A1 11
##$RELAX= 
##$RELAX= 
##$RELAX= 
##$RELAX= 
##$RELAX= 
##$RELAX= 
##$RELAX= 
$$ Bruker specific parameters
$$ --------------------------
$$ [...]
##$TP= (0..7)
150 150 150 150 150 150 150 150
##$TP07= 0
##$TPNAME0= <>
##$TPNAME1= <>
##$TPNAME2= <>
##$TPNAME3= <>
##$TPNAME4= <>
##$TPNAME5= <>
##$TPNAME6= <>
##$TPNAME7= <>
##$TPOAL= (0..7)
0.5 0.5 0.5 0.5 0.5 0.5 0.5 0.5
##$TPOFFS= (0..7)
0 0 0 0 0 0 0 0
##$TUNHIN= 0
##$TUNHOUT= 0
##$TUNXOUT= 0
##$USERA1= <user>
##$USERA2= <user>
##$USERA3= <user>
##$USERA4= <user>
##$USERA5= <user>
##$V9= 5
##$VALIST= <valist>
##$VCLIST= <CCCCCCCCCCCCCCC>
##$VD= 0
##$VDLIST= <DDDDDDDDDDDDDDD>
##$VPLIST= <PPPPPPPPPPPPPPP>
##$VTLIST= <TTTTTTTTTTTTTTT>
##$WBST= 2048
##$WBSW= 25
##$XGAIN= (0..3)
0 0 0 0
##$XL= 0
##$YL= 0
##$YMAX_a= 531635
##$YMIN_a= -648282
##$ZGOPTNS= <>
##$ZL1= 120
##$ZL2= 120
##$ZL3= 120
##$ZL4= 120
##$ABSF1= 14.98061
##$ABSF2= -5.57192
##$ABSG= 5
##$ABSL= 3
##$ALPHA= 0
##$AQORDER= 0
##$ASSFAC= 0
##$ASSFACI= 0
##$ASSFACX= 0
##$ASSWID= 0
##$AUNMP= <proc_prof1d_extract_pilot.lims>
##$AXLEFT= 0
##$AXNAME= <>
##$AXNUC= <1H>
##$AXRIGHT= 0
##$AXTYPE= 0
##$AXUNIT= <>
##$AZFE= 0.1
##$AZFW= 0.1
##$BCFW= 0
##$BC_mod= 0
##$BYTORDP= 0
##$COROFFS= 0
##$CY= 15
##$DATMOD= 1
##$DC= 0
##$DFILT= <>
##$DTYPP= 0
##$F1P= 0
##$F2P= 0
##$FCOR= 0.5
##$FTSIZE= 32768
##$FT_mod= 6
##$GAMMA= 0
##$GB= 0
##$INTBC= 1
##$INTSCL= 1
##$ISEN= 128
##$LB= 0
##$LEV0= 0
##$LPBIN= 0
##$MAXI= 10000
##$MC2= 0
##$MEAN= 0
##$ME_mod= 0
##$MI= 0
##$NCOEF= 0
##$NC_proc= -8
##$NLEV= 6
##$NOISF1= 0
##$NOISF2= 0
##$NSP= 0
##$NTH_PI= 0
##$NZP= 0
##$OFFSET= 14.98061
##$PC= 1
##$PHC0= 209.7125
##$PHC1= 0
##$PH_mod= 1
##$PKNL= yes
##$PPARMOD= 0
##$PPDIAG= 0
##$PPIPTYP= 0
##$PPMPNUM= 2147483647
##$PPRESOL= 1
##$PSCAL= 4
##$PSIGN= 0
##$PYNMP= <proc.py>
##$REVERSE= no
##$SF= 400.13
##$SI= 32768
##$SIGF1= 0
##$SIGF2= 0
##$SINO= 400
##$SIOLD= 32768
##$SPECTYP= <>
##$SREGLST= <1H.CDCl3>
##$SSB= 0
##$STSI= 32768
##$STSR= 0
##$SW_p= 8223.68421052632
##$SYMM= 0
##$S_DEV= 0
##$TDeff= 65536
##$TDoff= 0
##$TI= <>
##$TILT= no
##$TM1= 0
##$TM2= 0
##$TOPLEV= 0
##$USERP1= <user>
##$USERP2= <user>
##$USERP3= <user>
##$USERP4= <user>
##$USERP5= <user>
##$WDW= 1
##$XDIM= 32768
##$YMAX_p= 462901643
##$YMIN_p= -686602
##$CURPLOT= <Network HP LaserJet P1505>
##$CURPRIN= <$Network HP LaserJet P1505>
##$DFORMAT= <normdp>
##$LAYOUT= <+/1D_H.xwp>
##$LFORMAT= <normlp>
##$PFORMAT= <normpl>
##$SURQMSG= 1
$$ End of Bruker specific parameters
$$ ---------------------------------
##NTUPLES= NMR SPECTRUM
##VAR_NAME=  FREQUENCY,     SPECTRUM/REAL,   SPECTRUM/IMAG
##SYMBOL=    X,             R,               I
##VAR_TYPE=  INDEPENDENT,   DEPENDENT,       DEPENDENT
##VAR_FORM=  AFFN,          ASDF,            ASDF
##VAR_DIM=   32768,         32768,           32768
##UNITS=     HZ,            ARBITRARY UNITS, ARBITRARY UNITS
##FACTOR=    0.250966925370066, 1,           1
##FIRST=     8223.43324360095, 84583,        -51622
##LAST=      0,             -33056,          15773
##MIN=       0,             -686602,         0
##MAX=       8223.43324360095, 462901643,    0
$$ Real data points
##PAGE= N=1
##DATA TABLE= (X++(R..R)), XYDATA
$$ [...]
19546G7282c09645B09844d26770h8358k0130n0472I2260m0367a84118j25033A3226
19534B69468q3112j1642j8205a71295b3460j32646b7437B30559a43196P0897C37606
19522c47603B6548a62131j5722A10300a94367M3219j93900L3926h8332k5864L5801
19511g8395k84907A22278a50253k7671h4835j19388I4325a2239j59136b6630H3691
19499A65794c2176i850m11726F6233B149P6762L1575d636A55117a85297g0184
19487A04550d37561a48614H460L1664a96064q0433h440A15747c00694p1400a08245
19475a45514j1552j73550J31511l0642A82526b34727Q4849n594C56027j75335
19465A80692e8799j0262B74143d1155j01723j67943a5977p3105F8917J01502a36539
$$ y = [77282, -309645, 209844, -426770, -88358, -108488, -158960, 92260, 51893, -184118, -309151, 13226, 269468, 186356, 174714, 156509, -171295, -23460, -156106, -27437, 230559, -143196, -72299, 337606, -347603, 26548, -162131, -177853, 110300, -194367, -151148, -345048, -311122, -88332, -114196, -78395, -363302, 122278, -150253, -177924, -84835, -204223, 94325, -12239, -171375, -26630, 83691, 165794, -32176, -9850, -421576, 66233, 2149, 78911, 110486, -4636, 155117, -185297, -70184, 104550, -437561, -148614, 8460, 40124, -196064, -276497, -8440, 115747, -300694, -372094, -108245, -145514, -157066, -330616, -199105, -229747, 182526, -234727, -149878, -155472, 356027, 180692, -58799, -69061, 274143, -41155, -142878, -310821, -15977, -89082, 68917, 170419, -136539]
19453E7817c31846A11718b33413h4712A59120e3710j44214Q224k6112g4915j62489
19442b37404M7199O7864B9836a55026o081J6503A67386c2002G9420K25648i2690
19430b67543A37804A5867a01421A58913b46806B36021e8702C0165b63432h0430
19419a28135o3015L6807l60602A26797l223f3005k26640A81096l1838b46127F9350
19407e6105j77660c9326A3760J49682b52239f5072a9779B03881a38312A12597
19396B28171g6447B47728g22A61291a74101A65250f7993J1793F2795J59229d756
19384a89808A3681P49a48585I5925c1084j30741E0234a37727L52f053l53125B74836
19371b6090j88019i9140L388J9586j26270L3130k7656E3013A0223a83731B5125
$$ y = [57817, -331846, 111718, -233413, -84712, 159120, -53710, -197924, -189700, -215812, -74915, -237404, -190205, -122341, 29836, -155026, -161107, -144604, 167386, -32002, 79420, 305068, -92690, -267543, 137804, 15867, -101421, 158913, -246806, 236021, -58702, 30165, -263432, -80430, -128135, -191150, -154343, -514945, 126797, 123574, -63005, -289645, 181096, 149258, -246127, 69350, -56105, -233765, -39326, 13760, 163442, -252239, -65072, -19779, 203881, -138312, 112597, 228171, -76447, 247728, -722, 161291, -174101, 165250, -67993, -56200, 62795, 222024, -4756, -189808, 13681, 14430, -148585, 95925, -31084, -161825, 50234, -137727, -137375, -6053, -359178, 274836, -26090, -214109, -99140, -95752, -76166, -202436, -169306, -196962, 53013, 10223, -183731, 25125]
19359B03833e3137J6487j97250O6084N6194k346j09388M6275A76483a03597C6320
19347b48653j66162J07333e6252J5030K309m54149J30134A61673P907e2228a5413
19335C11781d945q5396E313a16905C3569f6552E8066Q0067m0090D8437c9531j7883
19323e7414A73462h5615e901o6700K6979F2751a04114k0797k27146A83587B5675
19311c30084A97803f7141a3751j49442f9885I6684N74i0125C28779b23600A83084
19299b40092b0426m9045p7518A19736f2844H4986a32155A59110a96956B39971
19288d6594j38685O4855A71759i4823M6583l49602A65449a12734j20251H5714
19277G4863b03008I803b72311a1341m86887K13772a10075c2710r094D02984A25878
$$ y = [203833, -53137, -36650, -233900, -167816, -111622, -113968, -223356, -177081, 176483, -103597, 36320, -248653, -414815, -307482, -56252, -41222, -38913, -493062, -362928, 161673, 169580, -52228, -15413, 311781, -4945, -90341, 5313, -116905, 33569, -66552, 58066, 138133, 98043, 48437, -39531, -57414, 173462, -85615, -5901, -72601, -45622, 62751, -104114, -124911, -352057, 183587, 25675, -330084, 197803, -67141, -13751, -163193, -69885, 96684, 97258, -90125, 328779, -223600, 183084, -240092, -20426, -69471, -146989, 119736, -62844, 84986, -132155, 159110, -196956, 239971, -46594, -185279, -120424, 171759, -94823, -48240, -397842, 165449, -112734, -232985, 85714, 74863, -203008, 9803, -272311, -11341, -498228, -284456, -110075, -32710, -41804, 402984, 125878]
19265g6621B04730a1934A29953P3653b11242q6568g5440C4355a0608I7426b4441
19253a55932A5017a68429F6775J03747H4276l8949a22212p453c204j07736l7484
19242a48424m5200Q0117H1842b99985A41522C1124f2469g76A31103a45780r594
19231a55374B61011a6739l17519e1634j0143A22555b78869Q3122p9814J30552
19221a45009A35613a51118j5654j95805f2607D7088c58226a65093A9494b62038
19210A31120b03468A62665a62839P852n7058O1789c8542j09723M7645j88995A7901
19198c66214j0854B24797q4841h1523A2372K24273g0667B4776N0347J62616b56049
19186A08790E0160f4334H48c02438J13504C1587h5507l66335g2730c5736p0779
$$ y = [-76621, 204730, -11934, 129953, 203606, -211242, -297810, -75440, 34355, -10608, 97426, -24441, -155932, 15017, -168429, 66775, 170522, 84276, 45327, -122212, -129665, -3204, -110940, -148424, -193624, -113507, 81842, -299985, 141522, 31124, -62469, -776, 131103, -145780, -155374, 261011, -16739, -334258, -51634, -61777, 122555, -278869, -195747, -275561, -145009, 135613, -151118, -166772, -362577, -62607, 47088, -358226, -165093, 19494, -262038, 131120, -203468, 162665, -162839, -154987, -212045, -150256, -38542, -148265, -100620, -289615, 17901, -366214, -377068, 224797, 139956, -81523, 12372, 236645, -70667, 24776, 75123, 237739, -256049, 108790, 50160, -64334, 848, -302438, -188934, 31587, -85507, -451842, -72730, -35736, -106515]
19175a06515k32181H3444R620a861k1903j74473A13033M2548h1871L9935D7878
19163b21280j27296C85372c90868L8504f6690J1973j40095A1528N9534O4598b23534
19151a6752n7787C49632F775J89182F5211O7569m7083h0099a7490j44220A08132
19139C33844c9587k31624R3915O4346p0216P1001D2906c37205c8752n5573n9054
19128a53379k68781f7059K1888J4123j55684E5355a07844m8858D5269a5628o1178
19117g6806n0765n9600j04918M8204B77707R7857a7644m0290B95944a3680l347
19106a7027l6384p45j05837l00450f3210B30364I7876Q8680a74422A30816C1511
19094b57961a8633E5216g8283l8980B7988P0560c69128J13796B7735d8489q4405
$$ y = [-106515, -338696, 83444, 93064, -1861, -23764, -198237, 113033, 155581, -81871, -41936, 47878, -221280, -348576, 385372, -390868, -352364, -66690, -54717, -194812, 11528, 71062, 135660, -223534, -16752, -74539, 349632, 6775, 195957, 65211, 132780, 85697, -80099, -17490, -161710, 108132, 333844, -39587, -271211, -177296, -112950, -183166, -112165, 42906, -337205, -38752, -94325, -153379, -422160, -67059, -45171, -31048, -186732, 55355, -107844, -156702, 45269, -15628, -76806, -127571, -187171, -292089, -243885, 277707, 375564, -17644, -57934, 295944, -13680, -17027, -53411, -54156, -159993, -460443, -63210, 230364, 97876, 186556, -174422, 130816, 31511, -257961, -18633, 55216, -78283, -117263, 27988, 98548, -369128, -255332, 27735, -48489, -132894]
19083a32894K1701A237h2046G9035c5266k3567C2507a07780c362A76532g4901
19071c7969p6600E6850O05f9877A20556b5452A70869l7545a51676n9301E3843
19059A88178c7387E7681f6861J1794r0872I2197h1048a9190q9444A47333a55735
19047a17722B02057I1638c77098a38557k94136a9457A73447a25169j4969d6593
19036f2029k29877B0153g9958j35692f5600r4345g1909I3501A7408J50797a59050
19024B41803j6473b44499B80187a16937B41625A04580O9385a16716M6006G2800
19013b06185D316c29392F7992I30a50247j15639d4909m0070n0828A65167a68629
19001a63737c8676n619m7978p992L4060I8437Q1674a87202d4958m25272J75690
$$ y = [-132894, -111193, 1237, -82046, 79035, -35266, -58833, 32507, -107780, -3362, 176532, -74901, -37969, -114569, 56850, 57455, -69877, 120556, -25452, 170869, 133324, -151676, -210977, 53843, 188178, -37387, 57681, -66861, -55067, -145939, 92197, -81048, -19190, -108634, 147333, -155735, -117722, 202057, 91638, -377098, -138557, -432693, -19457, 173447, -125169, -140138, -46593, -62029, -291906, 20153, -79958, -215650, -65600, -159945, -71909, 93501, 17408, 168205, -159050, 241803, 225330, -244499, 280187, -116937, 241625, 104580, 173965, -116716, -70710, 72800, -206185, 4316, -329392, 67992, 930, -150247, -265886, -44909, -84979, -135807, 165167, -168629, -163737, -38676, -44295, -92273, -100265, -66205, 98437, 180111, -187202, -44958, -470230, -294540]
18990b94540A929O552a19259j2286l1A04845a75367P0550p6812B84160A4599O1788
18978G6387h501j9692J0491q0651H3641J35847b6970j18163B2924g6294n4945
18967a31239A77537a1163B62767a14445B17540a64728F8383K0301a80857M1331
18957a39526n6717E2380L18638f2491l77055d9106m42250b21368K1179g0660m1663
18946a12323E755J83014a65871B32449a6418l58072H046J57765j2971i6880J0475
18935h6405m2610K0502B55308a16469j53147H3071R7240b29657J2340J07539C22890
18923G1536k8502K84354A47149b39195A14383P2547a40405A36396b1055B52476
18912I2233J4992B253J71258a56824r1104j5016b8542G3682f3103E4602A1776
$$ y = [-294540, 1929, 8481, -119259, -131545, -131576, 104845, -175367, -104817, -181629, 284160, 14599, 76387, -8501, -28193, -17702, -98353, 83641, 219488, -26970, -145133, 22924, -76294, -131239, 177537, -11163, 262767, -114445, 217540, -164728, 68383, 88684, -180857, -139526, -196243, 52380, 371018, -62491, -439546, -49106, -491356, -221368, -200189, -70660, -112323, 5755, 188769, -165871, 232449, -16418, -374490, 8046, 165811, 152840, -96880, -86405, -129015, -108513, 255308, -116469, -269616, 83071, 180311, -229657, -217317, -109778, 322890, 71536, 43034, 327388, 147149, -239195, 114383, 186930, -140405, 136396, -21055, 252476, 92233, 107225, 2253, 173511, -156824, -247928, -262944, -28542, 73682, -63103, 54602, 11776]
18900a2464k33079a7452l6097D72c37964h8358j0313K4709k16606A3372b67350
18888e7950A0719f342m11499d877r5655o249k6315f01p8910o9825B6145a98382
18875b18870D8840a94558Q776H793a7500A52893a61132A19348C6297J29005L609
18864A68911E7539J08623a67208l0752A53530a60877n4163j18892C2301R8869
18854A31170h2952B0761b3378A47360e4942r525E3600K10753c69877b7615r6978
18843a24593b1607D5187k1771f0939k17047A83883H9676b71534Q1585c9387j10127
18832a49514A7108k999b63833D2587J6473d9573A70256G3395b39960C57120i0617
18820B6923g4173n1174k60394d4534r890j3096E3165h231A27543b97362A44822
$$ y = [-12464, -245543, -17452, -53549, 472, -337964, -88358, -98671, -73962, -290568, 13372, -267350, -57950, 10719, -6342, -417841, -4877, -100532, -106781, -133096, -601, -79511, -149336, 26145, -198382, -218870, 48840, -194558, -185782, 8793, -17500, 152893, -161132, 119348, 36297, 165302, 168911, 57539, 166162, -167208, -197960, 153530, -160877, -215040, -333932, 32301, 131170, -82952, 20761, -23378, 147360, -54942, -64467, 53600, 264353, -369877, -27615, -124593, -21607, 45187, 23416, -60939, -277986, 183883, 89676, -271534, -189949, -39387, -149514, 17108, 14109, -263833, 42587, 59060, -49573, 170256, 73395, -239960, 357120, -90617, 26923, -74173, -125347, -385741, -44534, -54424, -67520, 53165, -8231, 127543, -297362, 144822]
18808e2980A43934k7747K7566B2293R4852c11352e0569J1179B238J32400l2520
18797A02118N5438b7602A53734a22662A31386b6218B00380a63998P4181b7644
18786a8929B40641b69459J22130k0971b1646j13007p6567d0004j49660H6191c00907
18774a92221b6566G0680g4201j97463J23444K6900F9047B0364K53281b89260g3426
18762c42433J15612N9339A51860b01195q5890B06935a39527j13006Q0306A82384
18751b9984J96j40605e813A61864b6987n0357o339q0989A22512m6035N3961a6855
18738G9741a09291A3123J01751c6906A28030a82817B3200f0515A68197a7493j78472
18727a95965K4167f3032C1376F181M3783k399R1156a4585A95739a05982d9040
$$ y = [-52980, 143934, 116187, 143753, 22293, 117145, -311352, -50569, -39390, 2238, 134638, 102118, 157556, -27602, 153734, -122662, 131386, -26218, 200380, -163998, -89817, -27644, -18929, 240641, -269459, -147329, -168300, -21646, -134653, -211220, -40004, -189664, 86191, -300907, -192221, -26566, 70680, -74201, -271664, -148220, -121320, 69047, 20364, 273645, -289260, -73426, -342433, -226821, -167482, 151860, -201195, -287085, 206935, -139527, -252533, -172227, 182384, -29984, -29788, -170393, -5813, 161864, -26987, -77344, -83683, -164672, 122512, 76477, 130438, -16855, 79741, -109291, 13123, 114874, -36906, 128030, -182817, 23200, -60515, 168197, -17493, -195965, -171798, -63032, 31376, 6181, 49964, 47565, 138721, -14585, 195739, -105982, -49040]
18715E9437f5065G0708c0044j93142f5354A08350b42871A0149c0602A35075c14239
18703b11144g3389a6664n0761G514a23988r151I9363A163J12774I337c17538h7893
18690A02415J24172a84093j58566q669J60427a1450j88866A47279a47749K2520
18680a25229A54997j4839a51445B8189N1597a2211A85961a1805K776j53523l8123
18669b00675C7083e48345B6289e7195g125r7926j9692L3247o9716A17721R9124
18658B16845a69809A70231a07542B33444c64419a54530M7233A18696c73920a47894
18647d9788l2855A92295e3971B3085J82059A1452J46927d29832H1976J56908q0601
18636A58283p3572i8024E3410J06402b33692i5196J9212A73140b16778B45006
$$ y = [59437, -65065, 70708, -30044, -223186, -65354, 108350, -242871, 10149, -30602, 135075, -314239, -211144, -73389, -16664, -67425, 7514, -123988, -133139, 99363, 1163, 113937, 9337, -317538, -87893, 102415, 226587, -184093, -342659, -351328, -190901, -11450, -200316, 147279, -147749, -125229, 154997, 140158, -151445, 28189, 79786, -12211, 185961, -11805, -9029, -162552, -200675, 37083, -548345, 26289, -57195, -7125, -105051, -124743, -91496, -161212, 117721, 216845, -169809, 170231, -107542, 233444, -364419, -154530, -107297, 118696, -373920, -147894, -49788, -82643, 192295, -53971, 23085, 205144, 11452, 158379, -429832, 81976, 238884, 158283, 84711, -98024, 53410, 159812, -233692, -95196, -75984, 173140, -216778, 245006]
18625B20973C5025b74465A31800e3665r5542j29534a16007p0757G0300k4862a17929
18613e7023j05027k30244B06228I1769b48885d4036r787I9748Q3620G7797a58898
18601A80816b18856f2433G5564e1984A61778e5072A9230b79616f5007A20896a60294
18589d0131A0610c02730b3203j68402b0878l1658P124K586j05789B59222C7672
18577e6744r1974B4673P5379a22563k2628a2793k85200J09626c8297H1422K56846
18566C38268D8582c59605B1395O139a86591N1396A30789a53725a3095n596q0293
18555i8984I2557e1660I1085g4331j71145d1589k28016e4917A70046c2071j56008
18544a88079k02986A34896c40909d8167D8218f8136m42495G7774L1799k6409l8255
$$ y = [220973, 35025, -274465, 131800, -53665, -149207, -278741, -116007, -186764, 70300, 45438, -117929, -57023, -162050, -392294, 206228, 91769, -248885, -44036, -53823, 99748, 183368, 77797, -158898, 180816, -218856, -62433, 75564, -51984, 161778, -55072, 19230, -279616, -65007, 120896, -160294, -40131, 10610, -302730, -23203, -191605, -20878, -52536, -45412, -42826, -148615, 259222, 37672, -56744, -148718, 24673, 100052, -122563, -145191, -12793, -297993, -188367, -38297, 81422, 338268, 48582, -359605, 21395, 27534, -186591, -135195, 130789, -153725, -13095, -18691, -98984, 92557, -51660, 91085, -74331, -245476, -41589, -269605, -54917, 170046, -32071, -188079, -391065, 134896, -340909, -48167, 48218, -68136, -510631, 77774, 109573, 83164, 44909]
18533D4909Q0775J38613F8794c02853b4707E4111J84528B4102a82253G9642A1677
18521A16284c58244A05561B2722a5366A13844b48861e7279j34222D4526a74043
18510B40590c16998a07160d7813l7920a800A03978E1724d0149j15510A79316A3634
18498G9901J02958C1128J42306G6475a22336A28286E7614K51737h2489H7586b90125
18486a4998A71243a31378k83573a10469j6182a3088k56964G7907a79408b8676
18475h1538C0902H897i7836A98729a86345P0294k4849A18423g5462o5881e3106
18463A75134a44590a7762j12371j6310I4766b43186C1002R7234P8437a13591A91260
18451A89273D7897a3742j29344A74947p2674k2078e3172p0485M9535j645L5542
$$ y = [44909, 125684, 264297, 68794, -302853, -24707, 54111, 238639, 24102, -182253, 79642, 11677, 116284, -358244, 105561, 22722, -15366, 113844, -248861, -57279, -191501, 44526, -174043, 240590, -316998, -107160, -47813, -85733, -1800, 103978, 51724, -40149, -155659, 179316, 13634, 79901, 182859, 31128, 173434, 76475, -122336, 128286, 57614, 309351, -82489, 87586, -290125, -14998, 171243, -131378, -414951, -110469, -126651, -13088, -270052, 77907, -179408, -28676, -81538, 30902, 8897, -97836, 198729, -186345, -116051, -140900, 118423, -75462, -141343, -53106, 175134, -144590, -17762, -130133, -146443, 94766, -243186, 31002, 128236, 206673, -113591, 191260, 189273, 47897, -13742, -143086, 174947, 102273, 80195, -53172, -123657, -74122, -75767, -40225]
18440d0225l2014G5030a13206C6695M5110P4737F4112b0484q5244F4511J7384
18429H1895e45305E1422b04284j27536g9790n8268f7864j50457K7458a0326K968
18418g358B24773j05595L9077f81n5782B23296a23400A22341P9790a27444A08554
18406A20934h7708L3333k22754l2203n9382N3664J01640E1538c0280H4634J11352
18395A95986b41442H2023J12917B9711J3821J75009B6789e6874C406K32368b87793
18383a61389O2871C6357d0319j6480l58266a09545c8773a1909A83616a28788E1347
18371a42992I9934l3380A2036K00125b00107O2687j27394i4424D7512A6406O5907
18360H2313K1565C9213b65135F5196a35449d1371D0340a754A14613a56258C49356
$$ y = [-40225, -72239, 75030, -113206, 36695, 81805, 156542, 64112, -20484, -105728, 64511, 81895, -545305, 51422, -204284, -331820, -79790, -138058, -67864, -218321, -190863, -10326, -7358, 224773, 119178, 158255, -681, -56463, 223296, -123400, 122341, 202131, -127444, 108554, 120934, -87708, -54375, -277129, -309332, -368714, -315050, -213410, 51538, -30280, 84634, 195986, -241442, 82023, 194940, 29711, 43532, 218541, 26789, -56874, 3406, 235774, -287793, -161389, -98518, 36357, -40319, -56799, -415065, -109545, -38773, -11909, 183616, -128788, 51347, -142992, 99934, 66554, 12036, 212161, -200107, -137420, -264814, -94424, 47512, 16406, 82313, 103878, 39213, -265135, 65196, -135449, -41371, 40340, -1754, 114613, -156258, 349356]
18348f5987j69244B34316b02398g6882A04818d7737j8034A51372a37211A52560
18337F900J15699m5590c79874A50529B4531b57158f3655b6495A20657K8077b09448
18325b30252k1703K5292j1602B07772H7790a52432l0444d4529D5372A0017J01449
18314A11466K1334a36372B82043c9567j9051N881l8164j16632i6930j69345i9033
18302B5234Q6725a31539k37482H6019b18612P6135J4740j16047A3459J19852g5660
18290A41792E6011J56930a03325A92715a50884A50776b59471d3658K1046A41155
18279A61037F3061j9894J9516h9179H4310a11928a4249G2222g8663m17545a78241
18267B9559b24912K6340m8173p3288A38570A1257b8841B77539h9484c4926A63376
$$ y = [-65987, -235231, 234316, -202398, -76882, 104818, -47737, -65771, 151372, -137211, 152560, 6900, 122599, 77009, -379874, 150529, 24531, -257158, -63655, -26495, 120657, 148734, -209448, -230252, -251955, -226663, -238265, 207772, 87790, -152432, -182876, -44529, 45372, 10017, 111466, 132800, -136372, 282043, -39567, -58618, -52737, -90901, -207533, -96930, -266275, -99033, 25234, 111959, -131539, -369021, 86019, -218612, -142477, -127737, -243784, 13459, 133311, -75660, 141792, 56011, 212941, -103325, 192715, -150884, 150776, -259471, -43658, -22612, 141155, 161037, 63061, 43167, 62683, -89179, 84310, -111928, -14249, 72222, -78663, -496208, -178241, 29559, -224912, -198572, -246745, -320033, 138570, 11257, -28841, 277539, -89484, -34926, 163376]
18255d2648J2305o789A4385b32885L3028a7258j45937C03359a67893J2118d3098
18243A17781J03437Q5258A21635a728D8800d75854g5268m7963B21069b63196C65820
18231f0223j45200l16997a34199m1220k1915C8630a06424M6562q0070l9087d1430
18219f5327A23709B2543a21835k08144H8192c6338k87871a06447F5942d2604E645
18207A8839f226j29949K8217R237o8268D5565h0253l3391q9626g9927C05160a39286
18194b46957i6566D7335K17278b07153A84485c9022B0288E011a8125p3726B22793
18182i6982i18D7157P9308J0671a36211A8415b2824A9617b73152b9379l652r3259
18170a26290A39186D0496J20477e6614A69862A2760b4795j9870F3428d6256k57430
$$ y = [-42648, -30343, -37132, 14385, -232885, -199857, -17258, -163195, 303359, -167893, -155775, -43098, 117781, 221218, 306476, 121635, -1728, 48800, -475854, -75268, -123231, 221069, -263196, 365820, -60223, -205423, -522420, -134199, -175419, -197334, 38630, -106424, -59862, -139932, -179019, -41430, -65327, 123709, 22543, -121835, -329979, 88192, -36338, -324209, -106447, 65942, -42604, 5645, 18839, -6226, -136175, -107958, -98721, -166989, 45565, -80253, -113644, -203270, -79927, 305160, -139286, -246957, -96566, 47335, 264613, -207153, 184485, -39022, 20288, 5011, -18125, -91851, 222793, -96982, -918, 47157, 126465, 137136, -136211, 18415, -22824, 19617, -273152, -29379, -33031, -126290, 139186, 40496, 160973, -56614, 169862, 12760, -24795, -44665, 63428, -46256, -303686]
18159c03686d5058G4761a6900k00659e8823J4164m12745b23088O0929A77591i192
18147H7302a02300B01739n7863J15742H7350b9989B12484b47000B073c5261M205
18136c1056l17163a64369D59286c90201b9432A50140d5158p2202A03137K1265
18126A24402m8576b14536R7710D1503J24153a18794k0301L323A49715d6395k8895
18115g5290B09595N8647a69191k16316c4600J029A52742C5532b59920G103K9129
18104C6232N17437e2265n0427j64038A42788P132O9428D1489a00625b0822r5953
18093a16775b5233q6358o0483c4508r1885p9643C2995e9749j66109A80906a17162
18081a67092C23619A19921K04579a09721A85478e508A33098C2865j2038J9359
$$ y = [-303686, -45058, 74761, -16900, -217559, -58823, -44659, -457404, -223088, -162159, 177591, -9192, 87302, -102300, 201739, 143876, 259618, 87350, -29989, 212484, -247000, 2073, -35261, -31056, -348219, -164369, 459286, -390201, -29432, 150140, -45158, -117360, 103137, 124402, 75826, -214536, -116826, 41503, 165656, -118794, -139095, -135772, 149715, -46395, -75290, 209595, 268242, -169191, -385507, -34600, -33571, 152742, 35532, -259920, 7103, 36232, 553669, -52265, -102692, -266730, 142788, 149920, 219348, 41489, -100625, -20822, -116775, -25233, -111591, -172074, -34508, -126393, -206036, 32995, -59749, -225858, 180906, -117162, -167092, 323619, 119921, 324500, -109721, 185478, -5508, 133098, 32865, 20827, 40186]
18071D0186f7276J0905o2124j43159A05346c15928P2221B26476a03847A45699
18060h7814l015k7950A1162c10494e2421j60015R4074j698m1143B06679b0614
18048b39403l21675B48642f1822a8764B3720a44000b6646j9524K0099k2129k7328
18037g5528k9352F9261b51498H8126O2719K30527b1043j5339A27651h2566j03094
18026a85660i2461C51245a3347H9349e116A54463c6266q052j18150A79461G5155
18014a78071j52823a09807n0276I287i37j77023m252O8076A02219j2758D0087
18002d1157D8278g2429j21020B86671i6150a7724j17272b204j49314G2491D647
17990B31363b47691h8293A52739p3472J17912H3652d78814a34100j93240a21505
$$ y = [40186, -67276, -56371, -118495, -261654, 105346, -315928, -243707, 226476, -103847, 145699, -87814, -90829, -118779, 11162, -310494, -52421, -212436, -118362, -120060, -161203, 206679, -20614, -239403, -561078, 248642, -61822, -18764, 23720, -144000, -26646, -46170, -26071, -48200, -75528, -104880, 69261, -251498, 88126, 150845, 381372, -21043, -36382, 127651, -82566, -185660, -92461, 351245, -13347, 89349, -5116, 154463, -36266, -44318, -162468, 179461, 75155, -178071, -330894, -109807, -160083, 9287, -937, -177960, -182212, -114136, 102219, 89461, 40087, -41157, 48278, -72429, -193449, 286671, -96150, -17724, -134996, -2204, -151518, 72491, 4647, 231363, -247691, -88293, 152739, 79267, 197179, 83652, -478814, -134100, -327340, -121505]
17979a23590e0666j05972l01087a35357O5485J2276A37682D0209L4713g995r2004
17968i9999a577I2941c12735B52095A19424P960E7148J41063a22994C2130b71280
17956A58035b5325g414I0878D2677N2498L34609c96705a90388d6799r9851j96704
17945c43354a01521A0874a94787J1116F7648j2227B2239J93833j418N4717a56825
17933b34501H7801B2057a10250H444J19639a57484C5299g3915k50644c9655D6433
17921E659J80227c9495D1378a51273o1743d009A620K28799G2291P9840e1270j34097
17909a85367B7568j1055c9225I3658a26264B38029e89900B6880a85443B3964N7478
17898H1442a80899g6896k1182b9416D8795a96759A02616L9394b45969o9572i8122
$$ y = [-123590, -50666, -156638, -457725, -135357, -69872, -57596, 137682, 40209, 74922, -7995, -99999, -1577, 92941, -312735, 252095, 119424, 127384, 57148, 198211, -122994, 32130, -271280, 158035, -25325, -7414, 90878, 42677, 95175, 429784, -396705, -190388, -46799, -146650, -343354, -101521, 10874, -194787, -183671, 67648, 55421, 22239, 216072, 214654, 269371, -156825, -234501, 87801, 22057, -110250, 8444, 128083, -157484, 35299, -73915, -324559, -39655, 46433, 5659, 185886, -39495, 41378, -151273, -213016, -4009, 1620, 230419, 72291, 152131, -51270, -185367, 27568, 16513, -39225, 93658, -126264, 238029, -589900, 26880, -185443, 23964, 81442, -180899, -76896, -98078, -29416, 48795, -196759, 102616, 142010, -245969, -315541, -98122]
17886a00058a9763A95223C1239C825a75793D9992f0742G1533N9823J70535a7225
17874B9249K60921a51942P86A34604J5660g9121B70275m8326r4049d5705B05302
17862a68377A70548j7487B008P2395N2659n4090i332E0984e2437b1637l0277A2537
17849a48775B01477n8707F4186d5131b0798C5982L51261d3433d801A06275B5000
17837d6014A89515c97940C20469b15386I4947a19158D1491e3424A3040c46040
17826B42343a06030D05659g7665M498j81493Q2168m2746e111o3500j79693e7412
17814a5468A5294K89470c709A35788c7455I4911j0421a12926r4513A23511D7636
17802a46937A8994b89572B20726J8740g6433J1072k0137E5193N9991b04590p0528
$$ y = [-100058, -19763, 195223, 31239, 3825, -175793, 49992, -60742, 71533, 131356, 301891, -17225, 29249, 290170, -151942, -151156, 134604, 150264, -79121, 270275, 221949, 127900, -45705, 205302, -168377, 170548, 153061, 2008, 74403, 127062, 72972, -9332, 50984, -52437, -21637, -51914, 12537, -148775, 201477, 142770, 64186, -45131, -20798, 35982, 387243, -43433, -4801, 106275, 25000, -46014, 189515, -397940, 320469, -215386, 94947, -119158, 41491, -53424, 13040, -346040, 242343, -106030, 405659, -77665, -73167, -254660, -172492, -215238, -5111, -68611, -248304, -57412, -15468, 15294, 304764, -3709, 135788, -37455, 94911, 84490, -112926, -207439, 123511, 47636, -146937, 18994, -289572, 220726, 239466, -76433, -65361, -85498, 55193, 115184, -204590, -275118]
17791b75118a00472d3655A31800e7712m7174I6721b9924A19852a63609O4564J6685
17780h2360a1878n1639m2766I8778i0043f782m9183A90608n0288O896A8014b42248
17767B8054a15842G5244J39152F6770O0866C868i6528k70271E584M760a2741p7495
17755i0236l56337a31258L7092B29861j07122N7415e44439F7106J35484M347a71831
17743f6858o0305G7511a25115n0733B02274b59329K6645C07439a79181D67a49582
17731e5053A38218d0476E8929h696m19757A2602K95308F9975J2118J07274c9967
17719a29832c9874j60110F025a04076c0780j21751D1244K62563b69452F4644c6333
17707B34104r7736J92674e1293B05765J7624e5924k56690B43130b4344m0745A5658
$$ y = [-275118, -100472, -43655, 131800, -57712, -104886, 96721, -29924, 119852, -163609, -99045, -82360, -11878, -63517, -106283, 98778, -90043, -6782, -55965, 190608, 140320, 147216, 18014, -242248, 28054, -115842, 75244, 214396, 66770, 127636, 3868, -96528, -366799, 5584, 10344, -12741, -90236, -446573, -131258, -94166, 229861, 122739, 180154, -544439, 67106, 202590, 206937, -171831, -66858, -127163, 77511, -125115, -175848, 202274, -259329, -232684, 307439, -179181, 467, -149582, -55053, 138218, -40476, 58929, -8696, -428453, 12602, 307910, 69975, 82093, 189367, -39967, -129832, -39874, -199984, 6025, -104076, -30780, -152531, 41244, 303807, -269452, 64644, -36333, 234104, 136368, 329042, -51293, 205765, 223389, -55924, -312614, 243130, -24344, -65089, 15658]
17695B4931L10796A67439b26303h6290n4732H8200J29781g2467F4541c6511E3990
17683a49093I2143K9675g8815A68001h4142B5414J87031F4519K22264F2951a88128
17671F9112L9750c11759D0747c5461a4438A3188d49692B7816a67150B15553l1153
17660A84400C6203a39783i367l3913A35261b37419A04456a7622A7882d10287g7938
17648G689a70254P7721A30723b06595l2471B66240f9005l7071A02005b5887o964
17637c2851A9109k516K57418o0159a23171C42338B1211a10635j87627A96078o0446
17626A35632j0665d4363j15168A60151o5982k9486c4094C7655A1329K69637b54072
17614g2140j0311H38K34352c4844E622a40327c8403A77611k4822J97758r4173
$$ y = [24931, 335727, 167439, -226303, -86290, -141022, 88200, 217981, -72467, 64541, -36511, 53990, -149093, 92143, 121818, -78815, 168001, -84142, 25414, 212445, 64519, 286783, 62951, -188128, 69112, 108862, -311759, 40747, -35461, -14438, 13188, -449692, 27816, -167150, 215553, 184400, 36203, -139783, -9367, -43280, 135261, -237419, 104456, -17622, 17882, -410287, -77938, 7689, -170254, -92533, 130723, -206595, -239066, 266240, -69005, -106076, 102005, -25887, -32851, 19109, 16593, 274011, 213852, -123171, 342338, 21211, -110635, -298262, 196078, 135632, 124967, -44363, -159531, 160151, 94169, 64683, -34094, 37655, 11329, 280966, -254072, -72140, -82451, 838, 235190, -34844, 5622, -140327, -38403, 177611, 152789, 350547, 256374]
17603B56374a61463C15864e3496m2184E2030M6810Q1220B5758J74187a55356H3819
17591g7230A1766K7779a43049D07866a52133j4266A10982a37653E5415K57425
17581C12840A41853K02372b6888q9782b6277j32150k66166c2204A57538G2445
17570e9646I3901K74885b11166B22419C7189R6924P0904K8520M4832H864b04808
17558C2314n801b39667E1114b63409i2915L529A2118L91502a64964F074a99223
17546G9741M6649K23784b97347D13676j37729C341N3702J33126I728c1832A07886
17534a66678A62038i7863D2313K0239b04565g3708a3522B47019D6601R7342b1075
17522b19607C74910h2712A34560A9232J35242F6491c4510k8714l5844J5751B02042
$$ y = [256374, -161463, 315864, -53496, -95680, 52030, 98840, 180060, 25758, 199945, -155356, 83819, -77230, 11766, 39545, -143049, 407866, -152133, -166399, 110982, -137653, 55415, 312840, 141853, 344225, -26888, -116670, -26277, -158427, -424593, -32204, 157538, 72445, -59646, 93901, 368786, -211166, 222419, 37189, 134113, 205017, 233537, 278369, 8864, -204808, 32314, 26513, -239667, 51114, -263409, -92915, -89386, 12118, 403620, -164964, 6074, -199223, 79741, 126390, 350174, -297347, 413676, 275947, 3341, 57043, 190169, 9728, -31832, 107886, -166678, 162038, -97863, 42313, 62552, -204565, -73708, -13522, 247019, 46601, 143943, -21075, -219607, 374910, -82712, 134560, 19232, 154474, 66491, -34510, -63224, -99068, -83317, 202042]
17510B85383d5661C3834K71608j16138m9584d0026C02412g0588L1267A50561a61510
17498g4554a3572o3501C2795J51388m1414K33440A69883J85917F9989A9618g2102
17486C3480M2679C6976J63296o7728a04389A43572H41R3516R6746e6613B94182
17474A34975k1439a09843C45131N3246A78626H4693J77127E9881J31923L30276
17464E22080A77771K17594F3082Q9339L99457E1423K18044E3059N31003A36629
17453A45907b6098C4520a68665B15750k6036L1367F3369J32144J38580A11073
17442B11107p6637M13909A00299K03756K28918A18561Q7779N1576A08152K09234
17432C17386q422p8615a12632k1843B02850J45368A54203K07261D2960N299K00603
$$ y = [285383, -45661, 33834, 305442, 189304, 139720, -40026, 302412, -70588, -39321, 150561, -161510, -74554, -13572, -77073, 32795, 184183, 142769, 376209, 169883, 355800, 69989, 19618, -72102, 33480, 76159, 36976, 200272, 132544, -104389, 143572, 841, 94357, 191103, -56613, 294182, 134975, 113536, -109843, 345131, 398377, 178626, 84693, 261820, 59881, 191804, 522080, 177771, 395365, 63082, 152421, 551878, 51423, 269467, 53059, 584062, 136629, 145907, -26098, 34520, -168665, 215750, 189714, 221081, 63369, 195513, 334093, 111073, 211107, 134470, 548379, 100299, 304055, 532973, 118561, 206340, 257916, 108152, 317386, 308964, 230349, -112632, -134475, 202850, 348218, 154203, 361464, 42960, 48259, 248862]
17421B48862N6330I9119K23115b86843C55456a85299E36319A30448a13759D64733
17410A62736N3925J55238n917H7529J44656c64140B72104K14087j24016e597D14548
17398A94858l9015N1194I5237L0181c9275A32553d2324D2158J34782K51379a46679
17386a92588d8734a3446A2110N1347k2995K26429j20391J11005n5806d0907G5037
17374B34785I4060N3161M8447L5148Q6411f499E93216a64103G6002J26160n4122
17363A48040k2959J13361l7483p5421k2343B2896L20784N2143e1609A76469K14814
17352C91283a4536E24803A0150J73377J70321A0222a45297C15298e9521A74799
17341B39595j17637n5338K72894j54745a25821A74497K8368H4359K99730e113
$$ y = [248862, 305192, 99119, 322234, -286843, 355456, -185299, 536319, 130448, -113759, 464733, 162736, 216661, 371899, 365982, 87529, 232185, -364140, 272104, 486191, 362175, -5597, 414548, 194858, 155843, 207037, 95237, 125418, -39275, 132553, -42324, 42158, 176940, 428319, -146679, -192588, -48734, -13446, 12110, 63457, 40462, 266891, 146500, 257505, 201699, -40907, 75037, 234785, 94060, 147221, 195668, 230816, 317227, -6499, 593216, -164103, 76002, 202162, 148040, 125081, 238442, 200959, 125538, 103195, 22896, 343680, 395823, -51609, 176469, 391283, -14536, 524803, 10150, 183527, 353848, 10222, -145297, 315298, -59521, 174799, 239595, 121958, 66620, 339514, 184769, -125821, 174497, 202865, 84359, 384089, -5113]
17330a44382B90076A5857L71969E0055K55778I0416J70694Q293j31335B3501J11712
17319A35213J11219H8913g0234A39279E8379P8822A8271K58257D214L13856A5889
17307B92618D6296A7899K27603f832B94081j5905b43190A95333F2586K02912I2687
17295a18110C82363j86221j3757h5460B82625G7508J65314E71L26460l803o4229
17284B58999M7775g0758B15016j06605c3600B78554P5587c9175C49581a72446
17273A28540K03725J15713H7949N2310J0199k4495J91414k1790A29994L6559a40817
17261I3660l9014L68423A83423J50037D4218O1097P3273p9068C5281K78737g0472
17249B49782A1886N34846a99905A76494k2020K84166k16113M7948E4537a08744
$$ y = [-144382, 290076, 15857, 387826, 50055, 305833, 90416, 261110, 269403, 138068, 23501, 135213, 246432, 88913, -70234, 139279, 58379, 137201, 18271, 276528, 4214, 318070, 15889, 292618, 46296, 17899, 245502, -6832, 294081, 278176, -243190, 195333, 62586, 265498, 92687, -118110, 382363, 196142, 182385, -85460, 282625, 77508, 242822, 571, 327031, 323228, 258999, 306774, -70758, 215016, 108411, -33600, 278554, 354141, -39175, 349581, -172446, 128540, 332265, 447978, 87949, 140259, 150458, 125963, 317377, 295587, 129994, 166553, -140817, 93660, 54646, 423069, 183423, 333460, 44218, 105315, 178588, 99520, 35281, 314018, -70472, 249782, 11886, 546732, -199905, 176494, 154474, 438640, 222527, 270475, 54537, -108744]
17238A62375L27289D9767M07432E3624J97529D1615K28955M8788j32448G0198
17227B4682b16466C03279l2092P6926J70931B41396L9288J72386j26698g707B31371
17215A1184P7865C2166L9232K32509j02804R9747j5209A32055B8969K79420B4584
17203B76880Q3513J52489O6101A13031O153n6161D477M93518A08016L92951j65815
17192C35152i5491B92333J50047n4073A65065k5698P0375J46716B5213J8774K34593
17181B78580J73137r3081a34488B10938K50410j46581K58333D8180J52741L48632
17171E49553A79552L61875A51605M76343B34675r9298J39890d1651A29908L0625
17161A60533L70143N7115B74993J5072K21582E6443j6815L50613j63243K40227
$$ y = [162375, 489664, 49767, 457199, 53624, 251153, 41615, 270570, 319358, 186910, 70198, 24682, -216466, 303279, 271187, 348113, 519044, 241396, 280684, 453070, 326372, -7707, 231371, 11184, 89049, 32166, 71398, 303907, 201103, 300850, 285641, 132055, 28969, 308389, 24584, 276880, 360393, 512882, 578983, 113031, 119184, 63023, 4477, 497995, 108016, 500967, 335152, -95491, 292333, 442380, 388307, 165065, 139367, 209742, 356458, 25213, 43987, 278580, 451717, 358636, -134488, 210938, 461348, 314767, 573100, 48180, 200921, 549553, 179552, 541427, 151605, 627948, 234675, 135377, 275267, -41651, 129908, 160533, 530676, 587791, 274993, 290065, 511647, 56443, 39628, 390241, 226998, 467225]
17151D67225k28589M2239J75936j64500J75042n6669A44260J57327P4703k4140
17141C52150A16758J24314H2373K08409A43769K85318A06459M39916m689k7335
17131E14351l1429j64556J89758j63673b2193A79777M0496J91769j38440A06743
17120A46264K04423A13502J83807A07959K37152J16996P4420r4318j09005J21266
17110D54470k03005K90257A48760N16806q5226A22542J60101L88229r7984k1438
17100E51450D9893J1346L78018e1958C10155K72014k63914P9357j142R1415o2756
17089D25129J34494f6369C62621J61594j21772J8299m8940J50665A66436M57729
17079F24165j88325n4378K02488l7877J72872k70151J32871J19851j41716m2166
$$ y = [467225, 238636, 280875, 456811, 292311, 467353, 410684, 144260, 301587, 376290, 352150, 116758, 241072, 82373, 290782, 143769, 429087, 106459, 546375, 541686, 514351, 482922, 318366, 508124, 344451, -22193, 179777, 220273, 412042, 273602, 106743, 146264, 350687, 113502, 297309, 107959, 345111, 462107, 536527, 442209, 333204, 454470, 251465, 541722, 148760, 665566, 580340, 122542, 282643, 670872, 572888, 551450, 49893, 61239, 439257, -51958, 310155, 582169, 318255, 397612, 396470, 487885, 425129, 559623, -66369, 362621, 524215, 402443, 420742, 371802, 522467, 166436, 624165, 435840, 381462, 583950, 546073, 718945, 448794, 581665, 701516, 559800, 517634]
17069E17634k48154M52013j11042C00337R7452o1454L97035A91895K69908j92657
17059B69146K26308m316K29530k33052k03534K30839P1731K51625B88226L09126
17049E97352j07664l4844L95527l86007k7437J13214R1391j3648q6136J92767
17039G34515p3541m9798j5098k94980K06254j44602J37599o4996K85747k30217
17029D90883J47899j28025j11305L55684o6518n955J76387J12372m30345J7230
17019E58307J92690J55354m41767j01532M99138k90446r9548L26963l74271L81631
17009H06519l27809O5366R6430K65462D34680J73959j74985K62322J68729k27631
16999F37074K42128D18922K04096K18109l15173L1806J45607K20367Q3927j99132
$$ y = [517634, 269480, 721493, 610451, 300337, 397789, 336335, 733370, 191895, 461803, 269146, 495454, 491138, 720668, 487616, 284082, 514921, 586652, 838277, 288226, 597352, 489688, 454844, 850371, 464364, 436927, 550141, 641532, 627884, 541748, 734515, 660974, 611176, 596078, 301098, 507352, 362750, 500349, 435353, 721100, 490883, 638782, 510757, 399452, 755136, 688618, 682663, 859050, 971422, 541077, 558307, 750997, 906351, 464584, 363052, 862190, 571744, 472196, 799159, 424888, 806519, 478710, 544076, 640506, 905968, 434680, 608639, 433654, 695976, 864705, 637074, 879202, 418922, 623018, 841127, 525954, 557760, 703367, 923734, 1007661, 808529]
16989H08529k53663J52444M9226j00003J93955q4384P7627N4229J13709j45483
16979H66186J86654l24330N1364K10138m58620l8032L28375L09786l40704r6709
16969F94108Q8542K30245j17503P6840J73281j93886l6801L07906k39132j6671
16959I66929j05818J56566j493M7477K54772j59779L18756l19415l38751j10933
16949G08311K23926j68879Q6133L60904F00318O4107O63908l49097J76921j46176
16939A009981K10524J91921k43442N2557J18211m9215k73252K62272m4726j497
16929A233334J23613n8651J34539k96941J76703J28785P8389m22316K18625M0083
16919A356163k01645L04767N5287J9897l70114L38815Q1339j28413r3781K56070
$$ y = [808529, 554866, 707310, 756536, 656533, 850488, 766104, 843731, 897960, 1011669, 866186, 1052840, 728510, 779874, 990012, 531392, 493360, 821735, 1131521, 790817, 694108, 782650, 1012895, 895392, 972232, 1145513, 951627, 914826, 1222732, 983600, 966929, 861111, 1017677, 1016184, 1063661, 1318433, 1158654, 1477410, 1157995, 819244, 708311, 932237, 763358, 849491, 1210395, 600318, 664425, 1328333, 979236, 1156157, 1009981, 1220505, 1412426, 1168984, 1221541, 1339752, 1290537, 1017285, 1279557, 1234831, 1233334, 1356947, 1298296, 1432835, 1135894, 1312597, 1441382, 1519771, 1097455, 1316080, 1356163, 1154518, 1459285, 1514572, 1534469, 1164355, 1503170, 1584509, 1456096, 1362315, 1618385]
16909A618385o9356J66472m6815l50779K83696j73817k42464O818K18183m3153
16899A367170j47919P37644l24107o5838L21592J19736J49051n67087J08905L7962
16889A737109L40848l33811p2832K07836P8072p8721J1332K71918K1587k26077
16879A957261J2999L79837k81359K87455j58648p1192P996K54352j32450M8082
16869B304333k48555J78428J29901J33119l7542p9916K87576m97173L31932O9475
16859B571578J79884k67952J16781l2183J63101J10400K3636o3580o6638K01463
16849B936490R712L41035m35085K83514M00310k22512j19839K28430M1310m27526
16839C035839O19515j51755K60020k75742L12028k41251N43464l07431K13272
$$ y = [1618385, 1549029, 1715501, 1668686, 1317907, 1601603, 1427786, 1185322, 1192140, 1410323, 1367170, 1219251, 1956895, 1632788, 1566950, 1888542, 2008278, 2157329, 1590242, 1699147, 1737109, 2077957, 1744146, 1671314, 1879150, 1957222, 1878501, 1889833, 2161751, 2183338, 1957261, 1970260, 2350097, 2068738, 2356193, 2197545, 2126353, 2134349, 2388701, 2256251, 2304333, 2055778, 2234206, 2364107, 2497226, 2459684, 2379768, 2667344, 2170171, 2502103, 2571578, 2751462, 2483510, 2600291, 2568108, 2731209, 2841609, 2865245, 2801665, 2735027, 2936490, 2946202, 3287237, 2852152, 3135666, 3535976, 3313464, 3193625, 3422055, 3463365, 3035839, 3655354, 3503599, 3763619, 3487877, 3799905, 3558654, 4102118, 3794687, 4007959]
16830D007959l34742K00158N30909l18537J39934K30766l71990L05227Q1655O120
16820D477459K45681J17078J53411k58249K77812J22516j11970L50666j28751
16811E245653j07380O39440p9371q8902L24979L16590o8966m3445O3985K94331
16801F496914j8573K34712R5434M70442M3175L2428o3267L98858L70752j38191
16791G922684J38753M14255j66233K95478J46454L54594L41686j75962L64301
16782I636010O12606J84756R5277N41236N872K76366M34205K78279L63788K72413
16772A2700808L21667J55625N00645N70274N39401P6102M24841O38459M04338
16763A6332160O13246N07376P11998K91979P26485P94341K49669J436585L42192
$$ y = [4007959, 3673217, 3873375, 4404284, 4085747, 4225681, 4456447, 4084457, 4389684, 4471339, 4477459, 4723140, 4840218, 4993629, 4735380, 5013192, 5135708, 5023738, 5374404, 5245653, 5138273, 5777713, 5698342, 5609440, 5934419, 6251009, 6182043, 6138598, 6202583, 6496914, 6478341, 6713053, 6808487, 7278929, 7322104, 7354532, 7291265, 7690123, 8060875, 7922684, 8061437, 8475692, 8309459, 8604937, 8751391, 9105985, 9447671, 9271709, 9636010, 10248616, 10433372, 10528649, 11069885, 11075757, 11352123, 11786328, 12064607, 12428395, 12700808, 13022475, 13178100, 13678745, 14249019, 14788420, 14864522, 15289363, 15927822, 16332160, 16945406, 17452782, 18164780, 18456759, 19183244, 19977585, 20227254, 21663839, 22006031]
16754B2006031Q46997P69335P38602J104266Q49724J405468J076682J267645P12558
16745C0777308J350074J357468J767344J317605J590702J900168J875314J901685
16737D3837668K357424K184537K264029K820825K679722K786243K884494L804775
16729F5619717L110218L905035L910099M057363M741403M840832N004607N450343
16721A00639617N506435N289982O309805O447193N768508O466665O278221O054047
16713A48760473O124363N671390N577289M330554M249230L426132K462109J494468
16705A82096008O49890o29492j268483k172408l518630l789480m738998m743124
16697A61885283n608406n787001o282830n942575o200074o299109n591403n898141
$$ y = [22006031, 22853028, 23622363, 24360965, 25465231, 26314955, 27720423, 28797105, 30064750, 30777308, 32127382, 33484850, 35252194, 36569799, 38160501, 40060669, 41935983, 43837668, 46195092, 48379629, 50643658, 53464483, 56144205, 58930448, 61814942, 65619717, 68729935, 72634970, 76545069, 80602432, 85343835, 90184667, 95189274, 100639617, 106146052, 111436034, 117745839, 124193032, 129961540, 136428205, 142706426, 148760473, 154884836, 160556226, 166133515, 170464069, 174713299, 178139431, 180601540, 182096008, 182745898, 182116406, 180847923, 178675515, 175156885, 171367405, 166628407, 161885283, 156276877, 150489876, 144207046, 138264471, 132064397, 125765288, 120173885, 114275744]
16689A14275744n949388n739206n209904m991252n125473m629669m373485m091370
16681G4165997l849729m334665l031653l275803l143180k901978k841334k350374
16673D8437281k387723k150607k151825j989952j590017j786290j522478j403701
16665C3454688k000068p65488j469648j487974j122155p68406j150964p83032
16657B3906953j523178n31136o02900r29086r80346j35673q30487q79891n50744
16648A6943512n50060m18801l05196q92164l96708m81132k49663l22627n41029
16639A2786132n57279j42914k87542m30132l38129k49218n15703l04323J3695
16630I974587k73989j91186m25052k55062l8108m12025l98609J02298k21686k30728
$$ y = [114275744, 108326356, 102587150, 97377246, 92385994, 87260521, 82630852, 78257367, 74165997, 70316268, 65981603, 62949950, 59674147, 56530967, 53628989, 50787655, 48437281, 46049558, 43898951, 41747126, 39757174, 38167157, 36380867, 34858389, 33454688, 31454620, 30689132, 29219484, 27731510, 26609355, 25840949, 24689985, 23906953, 22383775, 21852639, 21249739, 20320653, 19340307, 19204634, 18374147, 17494256, 16943512, 16393452, 15974651, 15669455, 14777291, 14380583, 13899451, 13649788, 13327161, 12786132, 12228853, 12085939, 11798397, 11368265, 11030136, 10780918, 10265215, 9960892, 9974587, 9700598, 9509412, 9084360, 8829298, 8791190, 8379165, 7980556, 8082854, 7861168, 7630440]
16620G630440k14024K6320l79850J02775l58685m40467j93147J11347r3203k68450
16610E923056P1820m02562j64815J71851l55895o0925O1742j67993J34855o74867
16600D536267M61096j34044l36549n2492J86150n6933k28612K0686l77551j09315
16590C908703J05662j18691J55713l09670K27509r7102m48698M07643m36538K05435
16580C599966m14200K05612m48554q3579J93637K44127n06063K77640o0625R3046
16570C101007l42769J75406j47578p3524k5934K75596l68137l7364J315k10618
16560B347400m09499M63963M1063k588k10139j39020L61978j12203l15708J56746
16550B181993j59573k00476K08421N523R1797j94494K36061J8510k50530q8308
$$ y = [7630440, 7416416, 7442736, 7062886, 7165661, 6806976, 6366509, 6173362, 6284709, 6191506, 5923056, 5994876, 5592314, 5427499, 5599350, 5243455, 5182530, 5244272, 5076279, 5211134, 4536267, 4997363, 4863319, 4526770, 4474278, 4660428, 4603495, 4374883, 4395569, 4018018, 3908703, 4014365, 3895674, 4051387, 3741717, 3969226, 3872124, 3423426, 3831069, 3394531, 3599966, 3185766, 3391378, 2942824, 2859245, 3052882, 3297009, 2790946, 3068586, 3007961, 3101007, 2758238, 2933644, 2786066, 2712542, 2686608, 2962204, 2594067, 2556703, 2558018, 2347400, 1937901, 2401864, 2442927, 2440339, 2230200, 2091180, 2453158, 2340955, 2025247, 2181993, 2022420, 1821944, 2030365, 2035888, 2127685, 1933191, 2169252, 2187762, 1937232, 1848924]
16540A848924J00845N2742m3636m08201K03488J55318k48565j33059J3064J35436
16530A676356P5152J23302k35298k18396O7982L1352k69008O2834J92980N2893
16520A560149l81122K04632R6870j13242l50l49711N97257j43586m95966K60124
16510A235055j31150J73925J08519j93473j18758m1755K15340R0147j36122l68487
16500H33241M82638j21167J17580l71089L22871l31037K99435j67600K5470J57082
16490A247424k25851k8031J8439j27739P9578K42909j82663L0241l23849j17047
16480F13411K71355j66496K99090J5175l65618K71666j67172K64037m40451Q3912
16470F78909K92387k60504J99430l93541L56190L5714Q9531o2997k03356n6887
$$ y = [1848924, 1949769, 2002511, 1958875, 1550674, 1754162, 1909480, 1660915, 1527856, 1540920, 1676356, 1751508, 1874810, 1639512, 1421116, 1489098, 1520450, 1251442, 1314276, 1507256, 1560149, 1179027, 1383659, 1480529, 1367287, 1366937, 1017226, 1614483, 1470897, 974931, 1235055, 1103905, 1277830, 1386349, 1192876, 1074118, 1032363, 1247703, 1337850, 1201728, 833241, 1315879, 1194712, 1312292, 941203, 1264074, 933037, 1232472, 1064872, 1090342, 1247424, 1021573, 993542, 1011981, 884242, 963820, 1206729, 1024066, 1054307, 730458, 613411, 884766, 718270, 1017360, 1032535, 666917, 938583, 771411, 1035448, 594997, 678909, 971296, 710792, 910222, 516681, 872871, 908585, 998116, 935119, 731763, 674876]
16460F74876K65337k41685N9394j68260K88441l52977K79986M1522L9537l07591
16450E78580l2277L01168k24742J37955k03358K27374n1343k19515J08016j92615
16440D29243J33529L4366J46887q2224j80265R5451j05612K13037R7421B16295
16429E14538p0037r4678R5747K62505j0724j80553m5686J89989j35953N7179M3609
16418F25936l10943M5596J41471k6808j61810j0216J58396A71816K78233J76109
16408F26158j39332A08850N85811J31348l04647l7583J58288Q6598C11627M37743
16398G49370l07044j57573j18724J18964L65497k45302M0171J07151k14635M4658
16388C82533J81576k17400M2560J4903j70774J80937p9042K47292g602D39083
$$ y = [674876, 940213, 698528, 757922, 589662, 878103, 525126, 805112, 846634, 886171, 578580, 546303, 847471, 622729, 760684, 557326, 784700, 733357, 513842, 621858, 429243, 562772, 597138, 744025, 661801, 481536, 576987, 471375, 684412, 781833, 216295, 514538, 444501, 349823, 445570, 708075, 697351, 516798, 471112, 661101, 525148, 582327, 625936, 314993, 360589, 502060, 475252, 313442, 303226, 461622, 171816, 450049, 626158, 486826, 108850, 694661, 826009, 521362, 483779, 642067, 728665, 311627, 749370, 442326, 284753, 166029, 284993, 650490, 405188, 445359, 552510, 337875, 382533, 564109, 346709, 389269, 404172, 233398, 414335, 335293, 582585, -7602, 439083]
16377C46655K64784k8868j04705r6645J27394k17617r8182K03034j25678J44418
16367D14590J4160n7900n5984K60928a68519I4881M83521A95454o5445l217H389
16355E60585A75265J09933o5283J80658A11676J51723O052j9240J97838A44098
16344B72533j2987J07209J38221B19053Q4684J07931A86467K27730J82728k22802
16334C74123j33967L17170A90643Q7157J06845j8081j50475K23536h1567E73075
16323i4179C65245p659H6354K23195d8962A70247M0650G1131J74963A13637L48937
16312D62574I0473N0914l38j978b2767A25364K86358j26196D5067L1990J85648
16301B62705j26664a24368C16255K76303j00681j73276p6062E5410K5866L33355
$$ y = [346655, 611439, 582571, 477866, 381221, 508615, 290998, 192816, 395850, 270172, 414590, 428750, 370850, 314866, 575794, -168519, 94881, 578402, 195454, 130009, 126792, 8389, 560585, 175265, 285198, 219915, 400573, 111676, 263399, 269451, 250211, 448049, 144098, 272533, 259546, 366755, 504976, 219053, 303737, 411668, 186467, 414197, 596925, 374123, 240156, 557326, 190643, 277800, 384645, 366564, 216089, 439625, -81567, 573075, -94179, 365245, 357586, 86354, 309549, -48962, 170247, 210897, 71131, 246094, 113637, 462574, 90473, 141387, 141049, 139071, -22767, 125364, 411722, 285526, 45067, 77057, 262705, 136041, -124368, 316255, 592558, 491877, 318601, 242539, 55410, 81276, 414631]
16291D14631B1210L39927L24098B00276J7662C5139f731j97053A79660q0052J29695
16280B29303Q9077a37839b7247B96554M89I054K3183i2478I7858J59750L1387
16269B88995H1967c45j36092K8274A18225K63346A75852a46418C5177K55992A934
16257B38537n2753m6440l5222c97938f8202F8702k7986J10846p1828k6299b09346
16245h4383B08804A00346J42391i5233r1979d2428A30788C6410R5158g988A37060
16233b38854N0344I9511R5198R4449E2533P3796c9673C10357A08199R5423D6321
16221A78664J147n7599A215K77991a92098A6514P2773o531K10182A31125a99125
16209h3892D9542K66091A3098L5539B0144O4405b38820A91313c3966j82304A37161
$$ y = [414631, 21210, 361137, 685235, 200276, 217938, 35139, -6731, -203784, 179660, 99608, 229303, 318380, -137839, -27247, 296554, 297043, 9054, 32237, -92478, 97858, 257608, 288995, 81967, -345, -136437, -108163, 118225, 381571, 175852, -146418, 35177, 291169, 1934, 238537, 185784, 139344, 104122, -397938, -68202, 68702, 40716, 151562, 79734, 53435, -209346, -84383, 208804, 100346, 242737, -95233, -187212, -42428, 130788, 36410, 131568, -7988, 137060, -238854, -188510, 99511, 194709, 289158, 52533, 126329, -39673, 310357, 108199, 203622, 46321, 178664, 179811, 122212, 1215, 279206, -192098, 16514, 89287, 82756, 292938, 131125, -199125, -83892, 49542, 315633, 13098, 48637, 20144, 84549, -238820, 191313, -33966, -216270, 137161]
16197B65216I0859J65377j08350o2572f0281D0659J05813D3084J76108k2364r4555
16186A02273c0394j43077A18094e4710B44582c9058B20637J32566e5776j58722
16176b14498C78J31974e7758A26477l4544M8051b03490A77862m0533b3496A46789
16164A13466K7983E6484K11432E2098a1132q0898j96232h5953l9978F3037j773
16153F1264Q1362J15582H8196a2626A77446j8638a7969n1329D8504a94962B89516
16141B17780b35923f0650l1464C4547O7905d4878E6443b67955a1831B15564I7571
16129i0023K8762C1261j3860a84605A3151J909K75953g3655F1794i1367I4749
16117B06692b95592J16965A89963f5481j73957A79374F1037P8879a89011A95747
$$ y = [265216, 90859, 256236, 147886, 85314, -60281, 40659, 146472, 43084, 219192, 196828, 102273, -30394, -173471, 118094, -54710, 244582, -39058, 220637, 353203, -55776, -214498, 378, 132352, -57758, 126477, 91933, 139984, -203490, 177862, 137329, -23496, 146789, 113466, 141449, 56484, 267916, 52098, -11132, -92030, -288262, -85953, -125931, 63037, 61264, 142626, 258208, 88196, -12626, 177446, 158808, -17969, -69298, 48504, -194962, 289516, 217780, -235923, -60650, -92114, 34547, 102452, -44878, 56443, -267955, -11831, 215564, 97571, -90023, -61261, 31261, 17401, -184605, 13151, 15060, 291013, -73655, 61794, -91367, 94749, 206692, -295592, -178627, 189963, -65481, -239438, 179374, 61037, 139916, -189011, 195747]
16106F4807a49681a2036c16k03615r8805A56878A5933a83810g9128A48776a84156
16094H8061e4271k55554B16049a15495d1874D94301b61798B62646j26363K3705
16084A59988a68675d8863B91807J62978g1011k4808B59763a18221C854h0942C28297
16072A41525i3995C1564J36764n3843b20445B65296E1473c564l42289e8762B71909
16060C9562N2740c3551b534B19283c86539A1211M529R583a7085B0414J02993K927
16048A26334n3876a03067f873D3994a19984d9970R762j19734C8994b94224f7265
16036b54223d4161o7352M7294a3172A7080b16o00952K87240D6067l799a65474
16024c33189i8577q5221K9231P5406D4120i912A59604a41531B39623H2039b4907
$$ y = [64807, -149681, -12036, -316, -203931, -302736, 156878, 15933, -183810, -79128, 148776, -184156, 88061, -54271, -309825, 216049, -115495, -41874, 494301, -261798, 262646, 136283, 159988, -168675, -48863, 291807, 454785, -71011, -95819, 259763, -118221, 3854, -80942, 328297, 141525, -93995, 31564, 168328, 114485, -220445, 265296, 51473, -3564, -345853, -58762, 271909, 39562, 92302, -33551, -2534, 219283, -386539, 11211, 15740, 25323, -17085, 20414, 123407, 126334, 72458, -103067, -6873, 43994, -119984, -49970, -40208, -159942, 38994, -294224, -67265, -254223, -44161, -111513, -64219, -13172, 17080, -216, -601168, -313928, 46067, 42268, -165474, -333189, -98577, -183798, -154567, -79161, 44120, -9912, 159604, -141531, 239623, 82039, -24907]
16012c5324H3606a12871l147m0759d7795j07069A9528J9340a2883p807j71302
16001a91992B3318l091f0716H7273d6248B82605p2147a52305B87201h510D299
15989A41792a25941C64489a04340B86906j15684D4247b36189i5573c838k11418
15979b15256i9723M3139B23056a95649C70262H5466J27535R1335d9697A47757
15968A58007K86873j55849D7979K94375A43117e0723j445H0517K7853O0776F9168
15956B01619a47038K1003E5031A6458a88339g2711A35242K86381c51693B89583
15945B68074e742E6462a9469k4248q2812L2316A13293J84718a33057f2866m2582
15934a05448E5483c60q0158k8192O716k8302k58645A30778h5553l6333a4156j1823
$$ y = [-35324, 83606, -112871, -116018, -156777, -47795, -154864, 19528, 38868, -12883, -20690, -191992, 23318, 20227, -60716, 87273, -46248, 282605, 210458, -152305, 287201, -8510, 4299, 141792, -125941, 364489, -104340, 286906, 171222, 44247, -236189, -95573, -3838, -215256, -99723, -56584, 223056, -195649, 370262, 85466, 213001, 304336, -49697, 147757, 158007, 444880, 289031, 47979, 342354, 143117, -50723, -52168, 80517, 108370, 169146, 69168, 201619, -147038, -126035, 55031, 16458, -188339, -72711, 135242, 421623, -351693, 289583, 268074, -5742, 56462, -19469, -43717, -126529, -94213, 113293, 298011, -133057, -62866, -105448, 55483, -360, -80518, -108710, -101994, -130296, -388941, 130778, -85553, -121886, -14156, -25979]
15922b5979k06811i7124a8507D13708a60599C3070K3691H444J638m766K10656
15911B15972a02886A61032a51158A23920a02814j9284A32559d36756J26646J47585
15901a62525A10152J11014a00503O781J4701n1586k11765A1113h5066q0633B31135
15889a48871j66116A35155k3926A0315J58328h4023B1219c10744F5948f358E1225
15877i4924L1345k38721B68118c56766i8725B98100a09434m118A17945a22775
15866B75702a88577H7304c07615c7913F8516a21456L7057A57676b75824L6297
15856b39527a7466l1330j65107g3943A33720a88953A5610Q5882J77085a07483
15845d1667j1987l4754A31793g8767C0385K58368j28731a90277N4068A3840L4522
$$ y = [-25979, -232790, -97124, -18507, 413708, -160599, 33070, 56761, 8444, 10082, 5316, 215972, -102886, 161032, -151158, 123920, -102814, -122098, 132559, -436756, -310110, -162525, 110152, 221166, -100503, -93722, -79021, -130607, -342372, 11113, -85066, -165699, 231135, -148871, -314987, 135155, 111229, 10315, 168643, -84023, 21219, -310744, 65948, -6358, 51225, -94924, -63579, -302300, 268118, -356766, -98725, 298100, -109434, -113552, 117945, -122775, 275702, -188577, 87304, -307615, -37913, 68516, -121456, -84399, 157676, -275824, -239527, -17466, -48796, -213903, -73943, 133720, -188953, 15610, 101492, 278577, -107483, -41667, -53654, -88408, 131793, -78767, 30385, 288753, 160022, -190277, -136209, 13840, 48362]
15834D8362J2364k9128O7887M7274A7233a25350g774o4447n0938G71a44345N6567
15822h7778E6023g6837C074M1041h8833f873q0198b6361B97951A19160M0651f9072
15809e561j92149g7325H4960a27292l6326B13871e8698m1449J4419b9626j81124
15798b10750A72798b17191c7661A26108D3419a86516j35672D3786a59351D952
15787b1908o20076a24947j0850A8176b51263C7469O9560a26183l17409a01417
15776C4302L9721J7684j6280J40647e7624A25286f4850J0808B58070J20675r7899
15765B80846b1272q6137A27671g5497n5203k28811F8462K85979a72156B9810K2346
15754E2156K94570c12595g8012c5930m2866F1057r76b40377F3676a61989f6084
$$ y = [48362, 60726, 31598, 99485, 146759, 17233, -125350, -7774, -72221, -123159, 771, -144345, -87778, 56023, -76837, 3074, 44115, -88833, -6873, -87071, -26361, 297951, 119160, 159811, -69072, -5561, -197710, -77325, 84960, -127292, -163618, 213871, -58698, -100147, -85728, -29626, -210750, 172798, -217191, -37661, 126108, 43419, -186516, -322188, 43786, -159351, 4952, -21908, -641984, -124947, -135797, 18176, -251263, 37469, 107029, -126183, -443592, -101417, 34302, 74023, 91707, 75427, 216074, -57624, 125286, -64850, -54042, 258070, 378745, 280846, -21272, -107409, 127671, -75497, -130700, -359511, 68462, 354441, -172156, 29810, 52156, 346726, -312595, -78012, -35930, -78796, 61057, 60081, -240377, 63676, -161989, -66084]
15742B66538j02002J62011j32913a97974B16627I4863J07968g8902q1164d4487
15731a9062B50708A8784O2145Q0402E7797a21736M9676n5044r7157a2037p7662
15720h9699n5043D5321m108f9517H6127b66355F7222b06348C4698K25447M4810
15709C04955c14259C15550a54781M4252c2412F4811A8020f0873l83974C8261i7276
15697c30755E2623O1274a89507C88058d16936c2868l4944n9787N2075j83280c6654
15685a1312o496E7491b53510F4633l071P214B4999N642K29263j24171b69867C30708
15672B5999a14801A54773b24834B90921b97612F4866k4277e5569A78006b62545
15661A97657A803L4478a39723D0147a45664A5400i006m2192A28173i8221I008
$$ y = [266538, 164536, 326547, 193634, -197974, 216627, 94863, 202831, -78902, -160066, -44487, -19062, 250708, 18784, 80929, 161331, 57797, -121736, -72060, -127104, -224261, -12037, -89699, -144742, 45321, 41213, -69517, 86127, -266355, 67222, -206348, 34698, 260145, 304955, -314259, 315550, -154781, -110529, -32412, 64811, 18020, -60873, -444847, 38261, -97276, -330755, 52623, 113897, -189507, 388058, -416936, -32868, -67812, -127599, -75524, -258804, -36654, -11312, -17808, 57491, -253510, 64633, 61562, 68776, 24999, 30641, 259904, 135733, -269867, 330708, 25999, -114801, 154773, -224834, 290921, -297612, 64866, 40589, -55569, 178006, -262545, 197657, 1803, 36281, -139723, 40147, -145664, 15400, -9006, -51198, 128173, -98221, 9008]
15649b83601B80157b18073f9680A53042A8965d8001L415B3322g8066a2040D3794
15637d05204N7229C795J39356d2192l2321I1994b44829a06634B37154Q333h8900
15625A76556a44685O286j28358B7479b66263a12225j6996p2676B71570a77040
15614h6947A7507c19280C50J31672Q8351D4413A9928J13549o3085R9305p707p7169
15602H4821i8643B34599K6126e046q4567B15830A03418c3241j78491N6232B58476
15590I6108a14502j50406b6914B01996d81105a99874D3751a13033n082F4933J95623
15579B60556E4519a03189K3972k1690F6865h0605l2409A19868b27279Q8074f6230
15567b2574j84059E6014f4741f643j44954b4663j51622b650j18584k29179A7605
$$ y = [-283601, 280157, -218073, -69680, 153042, 18965, -48001, -44586, 23322, -78066, -12040, 43794, -405204, -347975, 3795, 143151, -42192, -74513, 91994, -244829, -106634, 237154, 245487, -88900, 176556, -144685, -138399, -266757, 27479, -266263, -112225, -129221, -201897, 271570, -177040, -86947, 17507, -319280, 350, 132022, 220373, 44413, 19928, 133477, 70392, 169697, 161990, 84821, -98643, 234599, 260725, -5046, -89613, 215830, 103418, -33241, -211732, -155500, 258476, 96108, -114502, -264908, -26914, 201996, -481105, -199874, 43751, -113033, -118115, 64933, 260556, 54519, -103189, -79217, -100907, 66865, -80605, -113014, 119868, -227279, -139205, -66230, -22574, -206633, 56014, -64741, -6643, -151597, -24663, -176285, -2650, -121234, -350413, 17605]
15555e43173a06744B07250F1304Q8817e5496K6347C57375j43729j06242D12d0474
15543H7760J11437b10515C3104a64409Q0339L2262A70176i4654A65664g3311k1222
15532i4533D3380J35195q3640J40617a0454k38961i4654G2820L6737c6295d750
15520D555Q3925g141F1600J11093K9230c279A04101a88065C6728Q4530A4856b75926
15507F5118J44214a95656d992o9350j201H5280e7583l1002L350B0323b44770D2548
15494a49656g160A56725a21278C24106c2572F8082d4005E0982N86a15154j64430
15483b79584A74988A1383M41182d42817E5927c75402B06957c78071a79460h6867
15472E0823i3675H3513a45444B66715E1324m94J00812N8497c6378m02399J47707
$$ y = [-543173, -106744, 207250, 61304, 150121, -55496, -29149, 357375, 213646, 107404, 412, -40474, 87760, 199197, -210515, 33104, -164409, -84070, -51808, 170176, -94654, 165664, -73311, -94533, 43380, 178575, 94935, 235552, -10454, -249415, -94654, 72820, 109557, -36295, -4750, 4555, 88480, -7141, 61600, 172693, 201923, -3279, 104101, -188065, 36728, 121258, 14856, -275926, 65118, 209332, -195656, -4992, -74342, -75543, 85280, -57583, -88585, -85235, 20323, -244770, 42548, -149656, -7160, 156725, -121278, 324106, -32572, 68082, -44005, 50982, 51568, -115154, -279584, 174988, 11383, 452565, -442817, 55927, -375402, 206957, -378071, -179460, -86867, 50823, -93675, 83513, -145444, 266715, 51324, 50830, 151642, 210139, -36378, -438777, -291070]
15461b91070h2125k42382E0711J05743k2677L1632A8588J08778m2136f5329p49
15450f6078o3571B58840a63273n9792I6364a69669O3623j5876A52861M8894E0604
15438A54304a19323H302K06665c03699i440A22558c2513B59671j20438a52516
15427C32008A59176F2461O6775A979a10279A07618J17736j4110a69300D07712
15416a79003A87794H7846b89178a08877B87134h3871D360J16717L3344A0357K30652
15405B41009h5850G3638N9628b12016B68147B8567p40J5635i1411a2961m0139
15394e3100n7879F209c478j35500B0452e5509A61933a51921k78174D3720J59780
15383B03500j6837a30481B61579H775K39345j16780i1809J2047j87432A1507R2287
$$ y = [-291070, -82125, -324507, 50711, 156454, 133777, 165409, 18588, 127366, 85230, -65329, -66078, -129649, 258840, -163273, -223065, 96364, -169669, -106046, -121922, 152861, 201755, 50604, 154304, -119323, 8302, 214967, -303699, -9440, 122558, -32513, 259671, 139233, -152516, 332008, 159176, 62461, 129236, 1979, -110279, 107618, 225354, 211244, -169300, 407712, -179003, 187794, 87846, -289178, -108877, 287134, -83871, 4360, 121077, 154421, 10357, 241009, -85850, 73638, 133266, -212016, 268147, 28567, 27827, 43462, -91411, -12961, -53100, -110979, 6209, -3478, -138978, 20452, -55509, 161933, -151921, -430095, 43720, 203500, 186663, -130481, 261579, 8775, 248120, 131340, -91809, -79762, -267194, 11507, 103794]
15372A03794J6204l4096m1495e181m5940K4424j44213H5371a41972e7857B39391
15360f0571k777p9220G2950b56557G2203J35392a41825A68591K148a71042D5613
15348B57089E0675b08023A85523a79871N4515A2961P718b6203j28891c8649E149
15336c4810H6774L12310b14800a05305m580j28406B62676b82470I2371a78188
15325G8836J41769A4369c49128r9553a85039A51451a60376C6717a47670c6337
15314a00677B03751F2975h6467r430B41189a15458A52252p5004a01571d3333j51396
15303a94729r4888C8360j0813d2626D22697A48829K989a74818m3248b6078l02412
15292c28490A11942K91990A93012R2665H4152B6511K01525G8484i4429B44409
$$ y = [103794, 119998, 85902, 44407, -5181, -51121, -26697, -170910, 85371, -141972, -57857, 239391, -60571, -63348, -142568, 72950, -256557, 72203, 207595, -141825, 168591, 170739, -171042, 45613, 257089, 50675, -208023, 185523, -179871, -125356, 12961, 20679, -26203, -155094, -38649, 5149, -34810, 86774, 399084, -214800, -105305, -109885, -238291, 262676, -282470, 92371, -178188, 78836, 220605, 14369, -349128, -448681, -185039, 151451, -160376, 36717, -147670, -36337, -100677, 203751, 62975, -86467, -95897, 241189, -115458, 152252, 77248, -101571, -43333, -194729, -289617, 38360, 27547, -42626, 422697, 148829, 151818, -174818, -218066, -26078, -328490, 111942, 403932, 193012, 285677, 84152, 26511, 228036, 78484, -94429, 244409]
15281D6423O5446k0083o551l3108a95750q5824d081F6756d2823C1272N4827a0296
15268F8659L7865k2678a85543B38426c7668C9577f0936D0528K03453n2666Q3413
15257B74728B9490L20848A15902k5850B7698M210J85799L2209Q2510h6555a0966
15245F9706L87422B564a75994I8941J47381a58488A5370J56463K95530j66930
15235C00433M55126J53155M01726l56260K33246l21826l53370r9622j77657A05505
15224i1706E7920J62346l710j3779J91887j79046b76902a18175A21547A809K80816
15213B82625b52765G9842j6348J78363K15785A03256M6749B586R2286B8136K86087
15202C14223F9998J55353d4305E6068h691j25412A46181b60333e4304F5192L03981
$$ y = [46423, 111869, 91786, 85235, 52127, -195750, -281574, -4081, 66756, -42823, 31272, 86099, -10296, 68659, 106524, 83846, -185543, 238426, -37668, 39577, -60936, 40528, 243981, 191315, 274728, 29490, 350338, 115902, 90052, 27698, 31908, 217707, 249916, 332426, -86555, -10966, 69706, 457128, 2564, -175994, 98941, 246322, -158488, 15370, 171833, 467363, 300433, 755559, 908714, 1310440, 954180, 1187426, 865600, 512230, 412608, 234951, 105505, -91706, 57920, 220266, 216556, 202777, 394664, 215618, -276902, -118175, 121547, 1809, 282625, -252765, 79842, 63494, 241857, 457642, 103256, 150005, 2586, 94872, 28136, 314223, 69998, 225351, -44305, 56068, -8691, -134103, 146181, -260333, -54304, 65192, 369173]
15191C69173a87508j31519G0298K99231D8399P1618C1863J70781b4043r9775A5507
15179A08987b36907G5141J77718A02043a45050E22464B8469a48131B41743B1669
15168a48442C44656C6710a90400a9328n7689A16252l023O8159J79144b5729A78541
15156B97772j05067C97J69023a02426F7455k7736J72832r9334a84704C351J97339
15145B00690B9063P5984L30819r7337c3919B10053b61192A87843p9561J96955
15135C05237H9918K08705o3270a02153B01484H1161Q024L13469a8414C15134c901
15123A12821D2407F656M8481c4042p8690A97174G7911K18396l9252F7885J8770
15112H6655J38447B3720O9377J54831P2626c0653C01623A06654B6808K06411J11100
$$ y = [369173, -187508, -319027, 70298, 369529, 48399, 120017, 31863, 202644, -24043, -123818, 15507, 108987, -236907, 75141, 252859, 102043, -145050, 522464, 28469, -148131, 241743, 21669, -148442, 344656, 36710, -190400, -19328, -77017, 116252, 113229, 181388, 360532, -25729, 178541, 297772, 192705, 397, 169420, -102426, 67455, 39719, 212551, 113217, -184704, 3351, 200690, 29063, 105047, 435866, 338529, -33919, 210053, -261192, 187843, 108282, 305237, 89918, 298623, 235353, -102153, 201484, 81161, 89185, 402654, -18414, 315134, -3901, 112821, 42407, 6656, 55137, -34042, -112732, 197174, 77911, 296307, 257055, 67885, 86655, 225102, 23720, 93097, 247928, 320554, -30653, 301623, 106654, 26808, 233219, 344319]
15101C44319A63565a70353C24883a46602B6216j1520J27653b1709A47711b86955
15090C49292k5690A45274L7825i7418C35211A20940e4820H9711a41274A83853
15079C58004g2114D73100j44189a51483A70485p1559J25061b8314A80511p1021
15069A09490l6466J54253J20026i1679D67454A02469J03849m3587C7939J20194
15059A58133J83871A31151a41201q8448C7491K51980M2437J40569A17565K76168
15049C93733H6184R910K88116D0535e5881E39061d2288H4718J94561J29981H0140
15037c31425A29576L2959L5616o6278K15852i622A05693J15712j07001K7332R2004
15026B33740K136J34607l472j4612d0940B43811A18327N588m13J25260r5404m2295
$$ y = [344319, 163565, -170353, 324883, -146602, 26216, 14696, 142349, -21709, 147711, -286955, 349292, 323602, 145274, 183099, -97418, 335211, 120940, -54820, 89711, -141274, 183853, 358004, -72114, 473100, 328911, -151483, 170485, 98926, 223987, -28314, 180511, 109490, 73024, 227277, 347303, -91679, 467454, 102469, 206318, 162731, 37939, 158133, 342004, 131151, -141201, -229649, 37491, 289471, 331908, 472477, 117565, 393733, 86184, 96094, 384210, 40535, -55881, 539061, -42288, 84718, 279279, 409260, 80140, -331425, 129576, 162535, 198151, 131873, 347725, -9622, 105693, 221405, 114404, 141736, 233740, 235876, 370483, 367011, 352399, -40940, 243811, 118327, 123915, 123502, 248762, 153358, 111063]
15014A11063J95055H9797K79519p2854L3532l7544K0984I0727B7858J70858a26262
15002A74137K60822b14313C21065A8454o272c3653A52000F1692N3419N0723J27475
14991B93309p3754p3137J09421n6955a7339A14214J66759Q2898j33344J92004
14981D22531r7686i8172B59039Q9067A26640M6849C5383a19371C96950j76301
14971B20649l2418R6924c6020C79523a91038B86033j41759J43602j08840g7604
14960i6388D06706j30969K60344A09883J81790J06867a79719A23073J05685l8915
14950A89843L15381o4653b1741I6008J648J26446n1826J10330r1479K03847i337
14938E90219k35746j36165N3200J19271H9327J5170K07225m1813J01865j0307
$$ y = [111063, 306118, 89797, 369316, 296462, 329994, 292450, 313434, 90727, 27858, 198716, -126262, 174137, 434959, -214313, 321065, 18454, 12182, -33653, 152000, 61692, 115111, 165834, 293309, 219555, 146418, 255839, 198884, -17339, 114214, 280973, 363871, 230527, 422531, 324845, -98172, 259039, 348106, 126640, 173489, 35383, -119371, 396950, 220649, 188231, 285155, -36020, 379523, -191038, 286033, 144274, 287876, 179036, -77604, -96388, 406706, 275737, 536081, 109883, 291673, 398540, -179719, 123073, 228758, 189843, 505224, 440571, -21741, 96008, 97656, 224102, 172276, 282606, 191127, 394974, -9337, 590219, 354473, 218308, 271508, 390779, 89327, 104497, 311722, 269909, 371774, 361467]
14928C61467J3182j07783J69764G7917J08925M04163n3140j87201J73083A43184
14917C38854L6441l1982j41716P0030A12194L632M2059J63240J83576j17703j65652
14906B21346J93484m0522A3074K48627J63965C4497J17074K04627j32726R9224
14896C22696o3773o7618K7200m4230m5188p381J6410P8629L47512J5946k67357
14885C12846m323k4636O7754L1990j51402K20081K2048J57618k41448j35855a34340
14873C63857J21739k6729P8161A49584M68200l00860r9931K73605j56625J61310
14863D95283J40183k43960R4488A61861K47241A66868P5561J77056L1710j7279
14853D33916j11680P7191J19476q8043j41870P902Q4136J8795K29974R0911B73215
$$ y = [361467, 374649, 266866, 436630, 77917, 186842, 591005, 537865, 350664, 523747, 143184, 338854, 375295, 343313, 201597, 271627, 112194, 115826, 157885, 321125, 504701, 386998, 221346, 414830, 374308, 13074, 261701, 425666, 34497, 151571, 356198, 223472, 322696, 258923, 191305, 218505, 174275, 129087, 121706, 138116, 216745, 564257, 580203, 312846, 308523, 283887, 351641, 383631, 232229, 452310, 474358, 631976, 390528, 254673, -134340, 363857, 485596, 458867, 537028, 149584, 617784, 316924, 216993, 490598, 333973, 495283, 635466, 391506, 485994, 161861, 409102, 166868, 242429, 419485, 451195, 433916, 322236, 399427, 518903, 430860, 288990, 296892, 381028, 399823, 629797, 720708, 273215]
14841E51690r1877J25579k73513J01460Q7269r0547J61222B54506N28226B37670
14830B47946J2934O8676J35451R5110k62773J83055J7088j22316L86336l34587
14820D26920A85490L60326B52733K48273p9625L15011k71231k7103M1452k1138
14810D58372L56356C29351M91452B18497L95587q5621l7104K4146J17332j17975
14800E14862Q3923J13417k12936L42209C61855o2814K04569j46648R2953j19230
14790C30685K70378j56703j36287M2092o9170J181J52882M917R2443j63315L92048
14779G61151j78926J75765l19676N36418D72462M18388o6122l17963k7472J88702
14769F67995l7447l13582P8419J67001K50298r1280q1769l7445j67310L87247
$$ y = [551690, 459813, 585392, 311879, 413339, 500608, 410061, 571283, 254506, 782732, 237670, 247946, 260880, 329556, 465007, 560117, 297344, 480399, 497487, 375171, 761507, 426920, 185490, 545816, 252733, 501006, 421381, 736392, 465161, 438058, 479510, 458372, 814728, 329351, 820803, 218497, 614084, 528463, 491359, 515505, 632837, 514862, 598785, 712202, 499266, 841475, 361855, 299041, 503610, 356962, 449915, 330685, 601063, 444360, 308073, 350165, 280995, 282176, 435058, 439975, 532418, 369103, 761151, 582225, 757990, 438314, 974732, 472462, 890850, 824728, 506765, 479293, 667995, 630548, 316966, 395385, 562386, 812684, 721404, 639635, 602190, 434880, 822127]
14759H22127j86278C12790O63431l15853J13560j90147J01060j94391J20883q4988
14749E26345J22469J60801l20612J83048m2087K1749n42M04785j83458j13466
14739G59032k99014L23497r4115k7224k80856L64577J66353k52395J31379k08952
14729E82282J13555j54979P9883M50653k18516K60038l04841j36451J54830J147
14719H27601k24008N75855m40878M27135m70335M9086j74905N5014M1215J51372
14709H17152O3238k66209j51850M05706j04994M11450n06445j44223m3906K00986
14699F80905L8358n0980l0397j40929J2379J12450J35110k9442Q2032J99494j60490
14688H48490k27584J92059J70107l72805K61506J63506l18397K20014j00115k17068
$$ y = [822127, 635849, 312790, 976221, 660368, 773928, 583781, 684841, 490450, 611333, 526345, 648814, 809615, 489003, 672051, 629964, 651713, 651171, 1055956, 872498, 759032, 460018, 783515, 689400, 662176, 381320, 745897, 912250, 659855, 791234, 582282, 695837, 540858, 620741, 1071394, 852878, 1112916, 808075, 671624, 826454, 827601, 603593, 1179448, 738570, 1165705, 695370, 744456, 569551, 624565, 665780, 817152, 880390, 614181, 462331, 868037, 763043, 1174493, 668048, 523825, 479919, 680905, 719263, 668283, 637886, 496957, 509336, 621786, 756896, 727454, 809486, 1008980, 848490, 620906, 812965, 983072, 610267, 871773, 1035279, 716882, 936896, 836781, 619713]
14678F19713P21989m05969j70326k68920J90847K60150l22778J88519J17382M30590
14668A361197n23580k0412p5460J95058O2465L83467l15251k13290J1428J46723
14658A012345l9563m2400L27941l44760k6948K80304k10382J81101O8787k81834
14648I24591J52628j68260k4629Q9404J267q9464M16684k79431J84571J54829
14638A362190l00040o9449N20078l05522L30370k76215N9285k16745J14299J78607
14628A396858l12581K74555P7673r3936j75375n1698J99729Q9665k01721L9756
14618A242925J06637j28268K11130k63038K66696k67433K38831j53558J65870
14609A419792k06798J00376j14095L11734k75031N5975K65660k22032n9675M5347
$$ y = [619713, 1341702, 935733, 765407, 496487, 687334, 947484, 624706, 813225, 930607, 1361197, 837617, 817205, 741745, 936803, 999268, 1382735, 1067484, 854194, 865622, 1012345, 972782, 930382, 1258323, 913563, 886615, 1166919, 956537, 1137638, 1206425, 924591, 1077219, 908959, 884330, 973734, 975001, 885537, 1302221, 1022790, 1207361, 1362190, 1062150, 992701, 1512779, 1207257, 1537627, 1261412, 1320697, 1103952, 1218251, 1396858, 1084277, 1358832, 1436505, 1342569, 1167194, 1115496, 1315225, 1404890, 1203169, 1242925, 1349562, 1221294, 1432424, 1169386, 1436082, 1168649, 1407480, 1253922, 1419792, 1212994, 1313370, 1199275, 1511009, 1235978, 1291953, 1557613, 1335581, 1275906, 1321253]
14599A321253r1400J64810k0704k14288R7870L67061J95947r4586j87263n1446
14589A487254J92372k13445k7935K91054l27944K21902L23717j04363k49951J02067
14579A694728n4615J5921Q9038J25817j71479L63313l53473K07934J98792j13522
14569B002454L3486l692j01218J47006k60555J33475L40169k25272r4330J12616
14559B084139L17802m46589q1406R8175L72962l67465K43127K99633j10755J53111
14549B562734p5281K70840l57185K30135K35455n2164K29651j9202M51025L42948
14539C818956K43787M43662P20532J060358J355880K511659M098138P820774J1330791
14530C3404537m039257j0902680p529459l522149k094406p26647o34780o15345
$$ y = [1321253, 1229853, 1394663, 1373959, 1159671, 1257541, 1624602, 1820549, 1725963, 1538700, 1487254, 1679626, 1466181, 1438246, 1729300, 1401356, 1623258, 1946975, 1842612, 1592661, 1694728, 1640113, 1656034, 1745072, 1870889, 1699410, 2062723, 1709250, 1917184, 2115976, 2002454, 2035940, 2032248, 1931030, 2078036, 1817481, 1950956, 2291125, 2065853, 1971523, 2084139, 2401941, 1955352, 1873946, 1972121, 2345083, 1977618, 2220745, 2520378, 2409623, 2562734, 2487453, 2758293, 2401108, 2631243, 2866698, 2814534, 3044185, 3024983, 3476008, 3818956, 4062743, 4506405, 5226937, 6287295, 7643175, 10154834, 14252972, 22073746, 33404537, 29365280, 18462600, 10933141, 7410992, 5316586, 4589939, 3955159, 3339814]
14522C339814r6666l10498m01946J99744l69288R7175L46633j57721k01748r1409
14512B354090j31981L0870q2781L71116l124k8041J77537j36585N1861J98077
14502B801039k47932M2730q5910M50579k96357j13320J63766j05461L14911l4396
14492B889649j44081k0099K47249j82431K01583Q0192N6560J41731o0033k46772
14482B963548M16176R1226l65014J52504L58759m43320K62253l37204L91785K08512
14472C699225P2750L93549o20018r7260L97555l5294N5136j02786L73192k29930
14462C906119J29902n2393L31832j47088n1089L35710m73747L96691j08855K25827
14452D492909L283l6268P8759K29691k5161J54200j93455M94368l71092R7521
$$ y = [3339814, 3243148, 2932650, 2530704, 2730448, 2361160, 2458335, 2804968, 2647247, 2445499, 2354090, 2222109, 2252979, 2170198, 2541314, 2538190, 2510149, 2687686, 2551101, 2602962, 2801039, 2553107, 2595837, 2509927, 2960506, 2664149, 2550829, 2714595, 2609134, 2924045, 2889649, 2745568, 2725469, 2972718, 2790287, 2991870, 3072062, 3128622, 3270353, 3210320, 2963548, 3379724, 3470950, 3105936, 3258440, 3617199, 3173879, 3436132, 3098928, 3490713, 3699225, 3771975, 4165524, 3545506, 3448246, 3845801, 3810507, 3865643, 3762857, 4136049, 3906119, 4036021, 3983628, 4315460, 4168372, 4117283, 4452993, 3979246, 4375937, 4267082, 4492909, 4496192, 4459924, 4538683, 4768374, 4743213, 4897413, 4703958, 5198326, 4827234, 4924755]
14442D924755j87077K11799M44511J3489l55270L77674p6535M35880j13908k22404
14432E452914L78435J1825j52859K06611j29256J92330K24278k38554M59985k78998
14422F126711K38720K86393k19080M7269J35780K0540L81125O7782J8679L16905
14412G420824M9118j69530M43734l41704K45393K04776O1687J5860K68661K95806
14402H494625l62781N88669l22288L46994K45312m3401K12266J43277n6786L32876
14392I578763j4167M6813L93031L33031j67423L78362O0388R5561K62892J94873
14382A1162124L18233L27712j2012K83881K46059k7234M53833L5275K46878M6393
14372A3081142N94519k45848P27608p5121M34539K7820K57361M36489N00424J16748
$$ y = [4924755, 4737678, 4949477, 5393988, 5407477, 5052207, 5429881, 5353346, 5789226, 5675318, 5452914, 5831349, 5843174, 5690315, 5896926, 5767670, 5960000, 6184278, 5945724, 6405709, 6126711, 6365431, 6651824, 6432744, 6480013, 6615793, 6636333, 7017458, 7085240, 7103919, 7420824, 7469942, 7300412, 7744146, 7402442, 7647835, 7852611, 7914298, 7930158, 8198819, 8494625, 8131844, 8720513, 8398225, 8745219, 8990531, 8947130, 9159396, 9302673, 9245887, 9578763, 9564596, 9611409, 10004440, 10337471, 10170048, 10548410, 10608798, 10704359, 10967251, 11162124, 11480357, 11808069, 11796057, 12079938, 12325997, 12298763, 12752596, 12787871, 13034749, 13081142, 13675661, 13429813, 14157421, 14082300, 14516839, 14544659, 14802020, 15238509, 15738933, 15855681]
14362A5855681J71196M65892J19431L04610N22275J69712P18780J69839L46998
14353A8844414M47450J94661N88662O17088K23587j463O61145O14151O64552L92389
14343B3246636M60474M83129N58929O78815P01115L36647O46896R35525P99967
14334B8848133P50372L78417Q05038P01206O09370J247509O54208J242055Q35495
14325C6071803J067311R83818O11487J571602Q11929J349046J561019J214282
14317D5242297J572775J284724J654121J330471J641712J668145J930952K199920
14309E8525117J769211K008776K404055K110078K493107K803210K478259K743920
14301G7335733K979624L284309L286920L589372L760284L637583M300473M371848
$$ y = [15855681, 16026877, 16492769, 16612200, 16916810, 17439085, 17608797, 18327577, 18497416, 18844414, 19291864, 19486525, 20075187, 20692275, 20915862, 20914399, 21575544, 22189695, 22854247, 23246636, 23707110, 24190239, 24749168, 25427983, 26129098, 26465745, 27112641, 28048166, 28848133, 29598505, 29976922, 30781960, 31483166, 32092536, 33340045, 33994253, 35236308, 36071803, 37139114, 38122932, 38734419, 40306021, 41117950, 42466996, 44028015, 45242297, 46815072, 48099796, 49753917, 51084388, 52726100, 54394245, 56325197, 58525117, 60294328, 62303104, 64707159, 66817237, 69310344, 72113554, 74591813, 77335733, 80315357, 83599666, 86886586, 90475958, 94236242, 97873825, 102174298, 106546146]
14293A06546146M577804M733887N227596N451742N987876N924582O651507P098697
14285A52199837P065783Q059851Q164152R177274Q666486J0117512J0489885J0828384
14277B24769164J1646155J2101301J2729210J3769582J3688734J5235842J4773158
14270C18713146J5675813J6032063J6059803J5028938J3904074J2349489J0980632
14263D18743958J0306340R486659Q061518O855725M394098K287063J702374O17030
14255D62454765M46878o018362q616743q661662j1059460j1804286j2462614r937581
14247C94340935j0243289j2410866j1502761j2520016j2562912j2897887j3145737
14240C09057467j2083491j3003750j2765075j1638954j2167949j2795299j1792445
$$ y = [106546146, 111123950, 115857837, 121085433, 126537175, 132525051, 138449633, 145101140, 152199837, 159265620, 167325471, 175489623, 184666897, 193333383, 203450895, 213940780, 224769164, 236415319, 248516620, 261245830, 275015412, 288704146, 303939988, 318713146, 334388959, 350421022, 366480825, 381509763, 395413837, 407763326, 418743958, 429050298, 438536957, 446598475, 453454200, 457848298, 460135361, 461837735, 462454765, 462901643, 456883281, 448266538, 439604876, 428545416, 416741130, 404278516, 394340935, 384097646, 371686780, 360184019, 347664003, 335101091, 322203204, 309057467, 296973976, 283970226, 271205151, 259566197, 247398248, 234602949, 222810504]
14233B22810504j1111293j0937680j0031271r125909q652703q177304p796979
14226A56977365p669627o951546o333846n932993o041510n092845n549071m754789
14218A08651138m648992m132316m010975l700503l644193l711155l455622k894781
14210G8452601l195564k504631k750208k409990k343834k304192k091072j936823
14202E8916287k069935j787850j778045j423591j680850j643111j344272j304884
14194D5883749j423993j099895q08274j666843j097556j068849j205501r41538
14186C6571300p62410q80882j213147o00607j110403o81886j500185K09053j339111
14177B8691722o48725m04808o89577o45163o30460n24041o20861m00608o72921
$$ y = [222810504, 211699211, 200761531, 190730260, 181604351, 172951648, 164774344, 156977365, 149307738, 142356192, 136022346, 130089353, 124047843, 118954998, 113405927, 108651138, 104002146, 99869830, 95858855, 92158352, 88514159, 84803004, 81347382, 78452601, 75257037, 72752406, 70002198, 67592208, 65248374, 62944182, 60853110, 58916287, 56846352, 55058502, 53280457, 51856866, 50176016, 48532905, 47188633, 45883749, 44459756, 43359861, 42551587, 40884744, 39787188, 38718339, 37512838, 36571300, 35808890, 34928008, 33714861, 33114254, 32003851, 31321965, 29821780, 30030833, 28691722, 28042997, 27638189, 26948612, 26303449, 25672989, 25148948, 24528087, 24127479, 23454558]
14168B3454558n83759o18600n70773k64160k61742l28719n91496q17047j62443
14159A9255819n45580q5568l98991k04897o23408j39832l32676m38076k27516
14150A6259275m84130j70731l64565o26155K39281l72907l26277j3212m93478
14141A3647101K1626k43640m97020N6919k64081k17822l79661k5535k6005o18720
14131A1453162L41856p71442L96860o71909j73272r5616k19483J94370j19859
14122A0334667l51706k21847J13809k33725K24207m96301j39737J7109l98658
14113H847818K44956k80307o5311k31430K0841l84493j64475K8252J1228j31117
14103G895962k23264R0845k60523K79393k28394m82758m9138K6027k36019J47327
$$ y = [23454558, 22870799, 22252199, 21681426, 21417266, 21155524, 20826805, 20235309, 19418262, 19255819, 18710239, 18624671, 18225680, 18020783, 17397375, 17257543, 16924867, 16486791, 16259275, 15775145, 15604414, 15239849, 14613694, 14852975, 14480068, 14153791, 14140579, 13647101, 13668727, 13425087, 12928067, 12984986, 12720905, 12503083, 12123422, 12097887, 12071882, 11453162, 11795018, 11023576, 11420436, 10748527, 10575255, 10479639, 10260156, 10454526, 10334667, 9982961, 9761114, 9874923, 9641198, 9865405, 9369104, 9229367, 9246476, 8847818, 9092774, 8812467, 8747156, 8515726, 8536567, 8152074, 7987599, 8015851, 8027079, 7895962, 7672698, 7763543, 7503020, 7782413, 7554019, 7071261, 7022123, 7048150, 6812131, 6959458]
14093F959458j20234j46137n0975n6177K17333k27204j95659j32681j3244r9876
14083F134604l0261R2654l59093K2572J47063j79197K1041q8551k25610k7216
14073E508006j64318J5243K42592k79696m4884j7420l4956k68840r0058L01830
14063E167499o85622Q17665n2002m92378K95136l89209l59187O39015m99919J62966
14053D603964l04267J11268l1584p110k92094J93826J24938m52165J08944o5857
14043C989863J64089j96588n2008J89639l21039j3433Q5736j2261k24353K44379
14033C854024j63394j1978O2444j51889k03978J98233N853k27589J9595J0909
14023C392230K11134k02589j48315J35256l43844j72392J22174L58432j12382
$$ y = [6959458, 6839224, 6693087, 6642112, 6585935, 6803268, 6576064, 6380405, 6247724, 6234480, 6134604, 6104343, 6196997, 5837904, 5860476, 6007539, 5828342, 5849383, 5760832, 5535222, 5508006, 5343688, 5358931, 5601523, 5321827, 5276943, 5259523, 5224567, 4955727, 4865669, 5167499, 4481877, 5299542, 5247540, 4755162, 5050298, 4661089, 4301902, 4940917, 4440998, 4603964, 4299697, 4410965, 4379381, 4372271, 4080177, 4274003, 4398941, 3946776, 4055720, 3989863, 4153952, 3957364, 3905356, 4094995, 3773956, 3760523, 3846259, 3833998, 3609645, 3854024, 3690630, 3678652, 3741096, 3589207, 3385229, 3583462, 3589315, 3361726, 3381321, 3392230, 3603364, 3400775, 3252460, 3387716, 3043872, 2871480, 2993654, 3352086, 3239704]
14014C239704j9880k69877r4777J56215o8300k39771J94146K0770Q6839J39194
14004C144263m20423k76438M72485l83474K43032K2300n67865L73135J25949o2162
13994B670802k2169j73910L7033l46254L22822l92582K30011Q4902n35514K93956
13984B169097L94414l83744K28455l4476K36199Q6807K98712L32035N91890Q89054
13974D808443J759468L117175O852452J1979650J395981r450272p129780l842781
13966I490336j859021j209686r78054o87224l29613m48344j68415l73027j68787
13957C268165j54226n8036r4551j46183l03929J95053l42801j74668M13781P865
13947B610470K7299m00732j48355J35920K28506k50005K04196l30683j61575K35909
$$ y = [3239704, 3219824, 2949947, 2855170, 3011385, 2943085, 2703314, 2897460, 2918230, 3005069, 3144263, 2723840, 2447402, 2919887, 2536413, 2779445, 2801745, 2233880, 2607015, 2732964, 2670802, 2648633, 2474723, 2511756, 2165502, 2488324, 2095742, 2325753, 2410655, 1875141, 2169097, 2563511, 2179767, 2408222, 2373746, 2609945, 2696752, 2995464, 3327499, 3919389, 4808443, 6567911, 9685086, 16537538, 28517188, 29913169, 20462897, 13333117, 9490336, 7631315, 6421629, 5443575, 4756351, 4426738, 3978394, 3809979, 3436952, 3268165, 3113939, 3055903, 2961352, 2815169, 2511240, 2706293, 2363492, 2188824, 2602605, 2610470, 2637769, 2237037, 2088682, 2224602, 2453108, 2203103, 2407299, 2076616, 1915041, 2150950]
13937B150950o8537j71865j23373K78780j0691m67803J40859J91657N4962J14255
13927B089194j89764j08700L33542m55074k908m7334r6719L86402J4586j18154
13917A805071q2826L5613j81847n2982K16629R1215k0174m44271L04050K67727
13907A938205n35090M56119j83698j61110R7546l4220k47491K51785k57075J04236
13897A429207K86572j16559m1995j12830O6151J17445l56740M22902l33281k77434
13887A083438N15870j96722j91382M71652j48290k80927J34913J79420l65019
13878A202953K07167J08961k36640K40537k35120j94492L60826k4358l04141K34125
13868A359818m27491M8696L25833M86395l75332q2699J37218j75561r0128k7289
$$ y = [2150950, 2082413, 1910548, 1787175, 2065955, 2055264, 1587461, 1728320, 1919977, 1974939, 2089194, 1899430, 1790730, 2124272, 1669198, 1666290, 1618956, 1522237, 1908639, 1923225, 1805071, 1722245, 1757858, 1576011, 1523029, 1739658, 1830873, 1810699, 1366428, 1670478, 1938205, 1403115, 1859234, 1675536, 1514426, 1611972, 1577752, 1330261, 1582046, 1324971, 1429207, 1715779, 1599220, 1557225, 1444395, 1510546, 1627991, 1271251, 1694153, 1360872, 1083438, 1599308, 1402586, 1211204, 1682856, 1534566, 1253639, 1388552, 1567972, 1202953, 1410120, 1519081, 1282441, 1522978, 1287858, 1093366, 1454192, 1429834, 1125693, 1359818, 932327, 981023, 1306856, 1793251, 1417919, 1335220, 1472438, 1296877, 1206749, 1179460]
13858A179460P8850M3162k05388j33501M15216k45031k02568J83565p75J08747
13848A221737K1976k8112J18215m00188J21936J27699j16263j44943k46374M05308
13838A080991L4214j81081K64674k59184J34976p8148L4243q1894j93964K96525
13828A051352m64970K65806n6967J68535J56029j34005J47077k97126k1832K61002
13818A074901j42418J87558j84475J84862l53914q0899k4790Q8178L46346J29912
13808A225261j92859l64145R7975L05731j32020J84727m84739R9519J76320j29571
13798G86199P8391l06160K64743L24524m23769K7797o3457j46011L31669k30541
13788F43385J14134L13999E04627L9283K88545k48186L74989l05590K34388k23629
$$ y = [1179460, 1258310, 1301472, 1096084, 962583, 1377799, 1132768, 930200, 1113765, 1112990, 1221737, 1243713, 1215601, 1333816, 933628, 1055564, 1183263, 1067000, 922057, 675683, 1080991, 1115205, 934124, 1198798, 939614, 1074590, 996442, 1030685, 948791, 754827, 1051352, 586382, 852188, 795221, 963756, 1119785, 985780, 1132857, 835731, 813899, 1074901, 932483, 1120041, 935566, 1120428, 766514, 685615, 660825, 749003, 1095349, 1225261, 1032402, 668257, 766232, 1071963, 939943, 1124670, 639931, 739450, 915770, 786199, 864590, 558430, 823173, 1147697, 723928, 751725, 688268, 542257, 873926, 643385, 757519, 1071518, 504627, 543910, 832455, 584269, 959258, 653668, 888056, 664427]
13778F64427r9623M56210j33315o352j89504r4566O1063n8244j17011J77559N9534
13767G20178j12831k8344J53159K0382K09945k35535k66283O41070j07272l78144
13757F16325J83006l3011J75375k23585n0704J81435J52117l16568L18479j31609
13747H71260L696C13237M68393P0122l06431j33308m1364K55522k04953J26454
13737E47672j18810O04992m41063K03202n6650j95090L77668k33184k98315K55777
13727F46199J46732R626P0111m23455K99897k42536L15839j56377j54462K20533
13717G32107k80997L80020k4098j90190L2266n3457l6337R4502l26022K64889
13707E92683J30724L2150M5559B55854M34745l8922m5420M358M80r3066K8240
$$ y = [664427, 564804, 1021014, 887699, 881347, 691843, 597277, 658340, 600096, 483085, 660644, 720178, 607347, 579003, 732162, 752544, 962489, 726954, 460671, 1101741, 994469, 616325, 799331, 766320, 941695, 718110, 667406, 848841, 1000958, 684390, 1002869, 871260, 874956, 313237, 781630, 851752, 545321, 412013, 370649, 626171, 421218, 547672, 428862, 1033854, 592791, 795993, 739343, 544253, 921921, 688737, 390422, 646199, 792931, 802557, 872668, 449213, 749110, 506574, 822413, 666036, 511574, 732107, 451110, 831130, 807032, 616842, 649108, 595651, 559314, 653816, 327794, 592683, 723407, 755557, 801116, 255854, 690599, 651677, 606257, 610615, 611095, 518029, 546269]
13696E46269K64095k15976N1469j80987J83459C06443O0254M17995K5515l56370
13686D53837N698r2444Q9342K00526l17813J89762M1320R5680m7079B41735K75205
13675E16940r6253j23703K31844L7088k11300q8681K26023A85788L12836Q1813
13665E80437j13675O9860L9254P0478R531k73440n2466M62609C45894J65279p2566
13654D38607J16369o1573j36657J29657O2692k47484J53217J4045I3529L99490
13644D93019J26582n0101k69718j00408N12244B58024L10560J17681o3203B93915
13633D09034L14346l07679m5326R6795J3554J9491A62021K77059j17369K66970
13623E88681k15544l0659K51985o4190H2892K10009M71411k92122N092m5561D4010
$$ y = [546269, 810364, 594388, 645857, 464870, 648329, 306443, 366697, 784692, 810207, 453837, 459535, 367091, 456433, 656959, 339146, 528908, 570228, 665908, 618829, 241735, 516940, 420687, 296984, 528828, 565916, 354616, 265935, 491958, 185788, 498624, 580437, 466762, 536622, 575876, 646354, 655885, 382445, 329979, 792588, 345894, 511173, 438607, 554976, 493403, 356746, 486403, 549095, 301611, 454828, 468873, 93529, 493019, 619601, 569500, 299782, 199374, 711618, 258024, 568584, 686265, 623062, 293915, 409034, 723380, 415701, 370375, 467170, 480724, 500215, 162021, 439080, 321711, 588681, 373137, 342478, 594463, 530273, 82892, 292901, 764312, 472190, 477282, 431721, 44010]
13611E49968j60754n4176P7057R5361j79523l353N5277J19380J29247j80030m766
13600D43688A9840J46388J11703J07771l6563l0335J18776A92061L1303J28655
13590C52019O7496J13741O060j86141J7583K00892j88780J97385r1767j02918
13580C85570j27219J97656A68757q0781M37954j30057A75675K76603A17335J82591
13570B99926J46848j62909j07663K30154M7510A28735J97956J42o6358p1416K84724
13559D73783j20086q329A725J22160K90906r8729J17546b627E72549A61358l1029
13548A30329O9159K99259Q7844j53434J86503B17237J8139o8360J12629j13400
13538A66245k1467R8503n4412m7756g8206A66949j4792K06794A20386L15292O9215
$$ y = [549968, 389214, 335038, 412095, 507456, 327933, 324580, 379857, 499237, 628484, 448454, 443688, 19840, 166228, 277931, 385702, 349139, 318804, 437580, 192061, 223364, 352019, 419515, 533256, 539316, 353175, 370758, 571650, 382870, 580255, 488488, 385570, 258351, 456007, 168757, 87976, 525930, 395873, 175675, 452278, 117335, 299926, 446774, 283865, 176202, 406356, 453866, 128735, 326691, 326833, 260475, 189059, 473783, 353697, 345368, 1725, 123885, 414791, 316062, 433608, -2627, 572549, 161358, 130329, 199488, 498747, 586591, 433157, 619660, 217237, 235376, 167016, 279645, 166245, 144778, 243281, 188869, 141113, -78206, 166949, 152157, 358951, 120386, 435678, 504893]
13527E04893N9880j13730j36600M31582B26202O7032J91836r0122j28855J70274
13517D36367g2862A20381P7754K10116K5269n8784I2534J54085M6418J2902A06320
13505C46048A31706M36344E88M69969p8431J67142B10870o7971O8558h317D02058
13493G1359K19230R3865A20698L26035J02134E0372B1719j297J16907K33820A01271
13481C11442j39752F0607K17476k2228D1778J08926m7071L75319c4738B80107
13470B15642a09627B13439B8129L42088E7745N23531B71437B1574K41860n6188
13460B07246K08729j74722C4318P9301M74955p3978D4830O07169B58722K4981
13450B83703k6947K69398F3990j8513J48285J42413j28048J37387j57580J50274
$$ y = [504893, 564773, 451043, 314443, 746025, 226202, 293234, 485070, 394948, 266093, 436367, -72862, 120381, 198135, 408251, 433520, 374736, 92534, 246619, 293037, 305939, 106320, 346048, 131706, 568050, 588, 470557, 392126, 559268, 210870, 142899, 211457, -8317, 402058, 71359, 290589, 384454, 120698, 446733, 548867, 50372, 21719, 20422, 137329, 371149, 101271, 311442, 171690, 60607, 278083, 255855, 41778, 150704, 103633, 478952, -34738, 280107, 215642, -109627, 213439, 28129, 370217, 57745, 581276, 271437, 21574, 263434, 207246, 415975, 241253, 34318, 113619, 588574, 514596, 44830, 651999, 258722, 283703, 256756, 526154, 63990, 45477, 193762, 336175, 208127, 345514, 187934, 338208]
13440C38208C245J30154k2156J41569K77124A31862o057L30495m2017l677J20233
13429E30839B31412K80420B8318L01289d77882A61719R393M8096L3021N2874A02509
13417A25821K07995G1368J02032K54387j59481f3519a6218G7670J96783F2578
13406A09280K866B987O111K61976r4448m4977A4816L46642A21100J80626j44334
13395A57392B8925K72820c3376D29319j27175J07215A67718e0188j5481D71607
13384C0909p630a02271E01507B07414j01654J14725P4679A03213L49043k21542
13374B30714J9917O7590j58942O4267I3251a4583B49844a62841D51576A24488
13363A96809j7445L62327I4413K43014j52707n6013J93715A11484K37444j69852
$$ y = [338208, 3245, 133399, 111243, 252812, 529936, 131862, 125805, 456300, 414283, 410606, 530839, 231412, 511832, 28318, 329607, -477882, 161719, 171112, 219208, 252229, 305103, 102509, 125821, 333816, 71368, 173400, 427787, 268306, -63519, -16218, 77670, 274453, 62578, 109280, 112146, 2987, 9098, 271074, 176626, 131649, 14816, 361458, 121100, 301726, 157392, 28925, 301745, -33376, 429319, 302144, 409359, 167718, -50188, -65669, 471607, 30909, 23279, -102271, 501507, 207414, 105760, 220485, 295164, 103213, 452256, 230714, 250631, 318221, 159279, 223546, 93251, -14583, 249844, -162841, 451576, 124488, 196809, 179364, 541691, 94413, 337427, 184720, 128707, 322422, 111484, 348928, 179076]
13353A79076P922J91149J36996o2270k24160L41582q4416j62784q2161N0318P5015
13342C66267J3675K5134H6746K67411j43013J97036n5677L7519A62008n7384J65068
13331B69692j30330J09811J15925J9565b3268C60084b7999B86462p8044J46221
13321C54639a59623A10145K87957A53095a71374B01965K13475a83441B72344j11324
13311A61020G7543K55911A12805h6717G5146M49530A38843L21292E2960i2432
13300h9056k27664C11100e1659D35088j90193q7198m2797J34730r9663K39298
13290C89265j08788a45558l8093A21390O6839A9308P58690C59558b2928i651C46895
13278B13473N5676l5309J72948P0195A43469O2180J50031j68601J091a62771p720
$$ y = [179076, 186998, 378147, 515143, 452873, 228713, 570295, 485879, 323095, 240934, 291252, 366267, 379942, 405076, 86746, 354157, 211144, 408180, 352503, 390022, 162008, 104624, 269692, 139362, 249173, 365098, 384663, -23268, 360084, -27999, 286462, 208418, 354639, -159623, 110145, 398102, 153095, -171374, 201965, 415440, -183441, 272344, 161020, 77543, 333454, 112805, -86717, 75146, 524676, 138843, 460135, 52960, -92432, -89056, -316720, 311100, -51659, 435088, 244895, 157697, 114900, 249630, 149967, 389265, 280477, -145558, -183651, 121390, 188229, 19308, 777998, 359558, -22928, -9651, 346895, 213473, 269149, 233840, 406788, 476983, 143469, 205649, 355680, 187079, 188170, -162771, -170491]
13267a70491D39908A6876M56304H2730a19211A47289B3084b02740E6752M59588
13257E16340q1609F4211j657L39735j37206G0110K57473B3631g516j69997A81000
13245A68519b358A96402C9238K59798b54718B62669G022K19557A03296C1629J81155
13234B12784A01977K87440A12843J8021p305k5724B4227i8878H5830Q2460J88219
13223C56509f5720C0312L06866b1342B39943L2233E5072M66685A94873n3174O1654
13212B03353I7406b01033A34134C0571M99062a10415B01240b0682k9002j02645
13202a52329j13363C47178q7143L2966f089B76860j33128a26171a0128C04107
13191A04024D7909K11241H8103L24609A84725N911b8559C3107j2020c06495a00917
$$ y = [-170491, 439908, 16876, 473180, 82730, -119211, 147289, 23084, -202740, 56752, 516340, 434731, 64211, 62554, 402289, 265083, 70110, 327583, 23631, -7516, -177513, 181000, 168519, -2358, 196402, 39238, 299036, -254718, 262669, 7022, 226579, 103296, 31629, 212784, 101977, 389417, 112843, 130864, 123559, 97835, 24227, -98878, 85830, 168290, 356509, -65720, 30312, 337178, -21342, 239943, 272176, 55072, 521757, 194873, 141699, 203353, 97406, -201033, 134134, 30571, 529633, -110415, 201240, -20682, -49684, -152329, -265692, 347178, 260035, 293001, -6089, 276860, 143732, -126171, -10128, 304107, 104024, 47909, 259150, 88103, 412712, 184725, 190636, -28559, 33107, 21087, -306495, -100917]
13179b06332A02090K13984A15564R2140a8954A10703R5849J05190i2933A23710
13168e3918B3418J86080J33536a53669B65795l6489l966m7951J6687j8141J06537
13157B82472I8550L0323L4506b698m5480C00338a01159C8641o033J1487a50178
13145c9312R094E840K05181A05013l5373e0104a3844A76568a73420B1829r102
13134A2727O1017M18060B9754J27021n8691a1020B95387e76325b02583I669a63461
13122A15156a09801B3453N05510I3710J97375a31324O903A88637J42919A31786
13111A80325o4143K93016j53569d11352e3991j24263A70085f8741o8528j60004
13101b97273F3446J18669j4208P8604A15963J79855g344L000C71527A50548p2932
$$ y = [-206332, 102090, 316074, 115564, 207704, -18954, 110703, 206552, 311742, -92933, 123710, -53918, 23418, 209498, 343034, -153669, 265795, 229306, 225340, 177389, 194076, 175935, 282472, 98550, 128873, 163379, -2698, -48178, 300338, -101159, 38641, 32608, 44095, -150178, -39312, -30218, 5840, 211021, 105013, 69640, -50104, -13844, 176568, -173420, 21829, 12727, 73744, 491804, 29754, 156775, 98084, -11020, 295387, -576325, -202583, 9669, -163461, 115156, -109801, 23453, 528963, 93710, 291085, -131324, -124421, 188637, 331556, 131786, 180325, 116182, 409198, 255629, -411352, -53991, -178254, 170085, -68741, -137269, -297273, 63446, 182115, 167907, 246511, 115963, 295818, -7344, -4344, 371527, 150548, 77616]
13090G7616j2652p112a59256q0075D8231K02714f4491A66735L4509M0599l289
13079B38554h6520A31906E9711a15503a6585C97832g945B21867n9085G611a97222
13067C27893A11345B5965f4380m0520D1890L4207A9469L99D71a38854D27319A04429
13054i7508B27919J37962I7509a88111r7606G4440b61850R3030A21851J33532
13044B55383A6336N02040a1710j2803k79836B3690r90R5174c8518C50969b99420
13032A35653a3560f623o7176E1153c5875C24818P5387A07285j3188m2409O3104
13021A14792J2164L22889e1906D53137j78279o0998c213p0291B30603a30828A10572
13009B37900f8289b3386A47936J53101j09187F4670h1413A63941b5711A69098
$$ y = [77616, 64964, 57852, -159256, -239331, 48231, 250945, -64491, 166735, 201244, 241843, 238554, -86520, 131906, 59711, -115503, -16585, 397832, -7945, 221867, 162782, 7611, -197222, 327893, 111345, 25965, -64380, -104900, 41890, 76097, 19469, 19868, 471, -138854, 427319, 104429, -97508, 227919, 365881, 97509, -188111, -285717, 74440, -261850, -168820, 121851, 255383, 16336, 518376, -11710, -24513, -304349, 23690, 22700, 117874, -38518, 350969, -299420, 135653, -13560, -6623, -73799, 51153, -35875, 324818, 400205, 107285, 94097, 51688, 114792, 126956, 449845, -51906, 453137, 274858, 213860, -3213, -73504, 230603, -130828, 110572, 237900, -68289, -23386, 147936, 301037, 191850, 64670, -81413, 163941, -25711, 169098]
12998a33405B4154K70788j22633J95434a65791A12302H457L2605L35280D638J12991
12987A17629Q9552F6585J81398f1259m7319A56223f8549j33683M4524A13188a11820
12975c9426n5823I4347f319C46907b14919A95503K64974E912M40390C0079b60877
12963A96045n3556C6083a58781A3220d8398j1533B39600b29246G7528J02208D9455
12951G1845e7458I3798f3358C23548A38328g5867n1267J9767G7111l1410P8388
12940A24089J35081G6598j2847N7886b9803I2696A9629L17736D8377a54476C2772
12928d3995I2278b64265D02662F5232a01656j07207a00633M8871i947B26867b295
12916B62218o9954a96313j81932D5643K64381E8142b79754B01129j00161a43046
$$ y = [-133405, 24154, 294942, 172309, 367743, -165791, 112302, 8457, 41062, 376342, 4638, 117629, 207181, 66585, 247983, -61259, -108578, 156223, -68549, -202232, -157708, 113188, -111820, -39426, -95249, 94347, -6319, 346907, -214919, 195503, 460477, 5912, 446302, 30079, -260877, 196045, 142489, 36083, -158781, 13220, -48398, -59931, 239600, -229246, 77528, 179736, 49455, 71845, -57458, 93798, -63358, 323548, 138328, -75867, -127134, -107367, 77111, 45701, 124089, 259170, 76598, 63751, 121637, -29803, 92696, 19629, 337365, 48377, -154476, 32772, -43995, 92278, -264265, 402662, 65232, -101656, -208863, -100633, -51762, -9947, 226867, -2295, 262218, 192264, -196313, -378245, 45643, 310024, 58142, -279754, 201129, 100968, -143046]
12905d9124o3979j80581C2392Q0710C0557A3414b68755D02554j68795A11951l307
12894A08644K27705G5615f86E3577A7555g2783a6538A94863a5200j34671c3355
12882E9773K52973f1242D598d08821b1585m22155b2551k779j14280I1523b8694
12870A98916f299B98362a04081K6796A54797b15945H4186P775c09341e9713A63457
12858a21595A35213m8889f202l80770A1874f2441H6415d3631K1710G0374L1977
12847A02351L61991A17821K51274g4914I1778a66595G8288N6281K83261D6589
12836B06997P4575c5654B76635A19003J00339a03032A30395b23403j41521e7597
12825A68542M2952N687i9035B3939a01279k6541L1723B24986j12361D6276c01355
$$ y = [-49124, -113103, -293684, 32392, 113102, 30557, 13414, -268755, 402554, 233759, 111951, 108644, 336349, 75615, -686, 53577, 17555, -72783, -16538, 194863, -15200, -149871, -33355, 59773, 312746, -61242, 4598, -408821, -21585, -443740, -22551, -25330, -139610, 91523, -28694, 198916, -6299, 298362, -104081, -77285, 154797, -215945, 84186, 91961, -309341, -59713, 163457, -121595, 135213, 86324, -6202, -386972, 11874, -62441, 86415, -43631, -21921, 70374, 102351, 464342, 117821, 369095, -74914, 91778, -166595, 78288, 134569, 417830, 46589, 206997, 281572, -35654, 276635, 119003, 219342, -103032, 130395, -223403, -364924, -57597, 168542, 211494, 217181, -99035, 23939, -101279, -127820, -96097, 224986, 112625, 46276, -301355]
12813B01132q9119p611j2355K6512f156q8943K9893A29092A3419f2846O519j03424
12801a59751A48230J59762A33040k7294J4673j4756J61072d6315A35297g0248
12790A66923a75130D42032a91540D3662b81184J27335E5170a15844l895n417H1773
12778F2046J18031L47847B7044K04213F0279K06584a32306B95506D4256a0951
12767b64890F8174J07826a40172n6872E5748g2964b9187A01662c06139I8030b32297
12755d2612k55415B19989j06254a65295B1464a33991B22200a36292A23752B9887
12744c00127B38766a3952j6368l9685A26879F616Q5298B5378d4589j83461b9361
12732D08154a57879N0047H0845a47092P1272b7477B24097N8329Q9386a10007d5091
$$ y = [201132, 112013, 104402, 92047, 118559, -6156, -95099, -65206, 129092, 13419, -62846, -56327, -159751, 148230, 307992, 133040, 105746, 120419, 105663, 266735, -46315, 135297, -70248, 166923, -175130, 442032, -191540, 43662, -281184, -153849, 55170, -115844, -119739, -125156, 81773, 62046, 180077, 527924, 27044, 231257, 60279, 266863, -132306, 295506, 44256, -10951, -264890, 68174, 176000, -140172, -197044, 55748, -72964, -29187, 101662, -306139, 98030, -232297, -42612, -298027, 219989, 113735, -165295, 21464, -133991, 222200, -136292, 123752, 29887, -300127, 238766, -13952, -30320, -70005, 126879, 6616, 91914, 25378, -44589, -228050, -29361, 408154, -157879, -107832, 80845, -147092, -75820, -27477, 224097, 282426, 371812, -110007, -45091]
12720a0248A46723m3683k7695b03054B20142e6882E7687d2945B76349E2374a34268
12708C61908b0015m610j20938J597e5800C57046D6925K52585a7647r3750K3912
12697h7485a4598C6600K42985i0232A17969j9794P3865b42364A18748a76466C97941
12685D63188A65242J22768A19223K1203n5631R0690K6499g6015A20559Q9087a33864
12673B6572J37095e2984B76444B2260a01799E2293a00346F6076L23388A1289J59147
12662A70436D1905J51282a71489A64799F8842K89241g3266E2845K57074j38149
12652A71770J02349a04237A34014J53270D1294b1071A66037l5488J44050P0178
12642C44777f6731A14653a24155A21639K84752A06882K419L50474c20687B53890
$$ y = [-10248, 146723, 103040, 75345, -203054, 220142, -56882, 57687, -42945, 276349, 52374, -134268, 361908, -20015, -24625, -145563, -143966, -55800, 357046, 46925, 299510, -17647, -111397, -87485, -14598, 36600, 279585, -90232, 117969, 98175, 172040, -242364, 118748, -176466, 397941, 463188, 165242, 288010, 119223, 140426, 84795, 175485, 201984, -76015, 120559, 209646, -133864, 26572, 163667, -52984, 276444, 22260, -101799, 52293, -100346, 66076, 389464, 11289, 170436, 41905, 193187, -171489, 164799, 68842, 358083, -73266, 52845, 309919, 171770, 274119, -104237, 134014, 287284, 41294, -21071, 166037, 130549, 274599, 344777, -66731, 114653, -124155, 121639, 406391, 106882, 109301, 459775, -320687, 253890]
12631b15736M7470A4422L76549A64230p7385c1323E4703J9372K02465c73508J37437
12620b36071C3209J92030N4011f963C62318i7767C45774h8438A3367L96354D3440
12608A56036a53661q8627A94531I519L68246k5927b45112G776K47754I6545N2801
12597A49346a87325q0026a32284d1253G3446P5825C2596a63282L7693j9396A31687
12585A87102H8328d1016q7261N5836D32434d0744I4119K56789g8882k80000M7590
12574c11292b8953B2403b6966j84711C6879C70a32261A09164i446C240b75618
12562d1847B35896a56784D32519k00413L3313a15395C10812a18540A31049P9851
12552B10900j1349H4478B4712J57051N6964c9508B13222a83644A2175J15628b7136
$$ y = [-215736, -168266, 14422, 390971, 164230, 86845, -31323, 54703, 74075, 276540, -373508, -236071, 33209, 225239, 279250, -6963, 362318, -97767, 345774, -88438, 13367, 409721, 43440, 156036, -153661, -242288, 194531, 9519, 377765, 351838, -245112, 7776, 255530, 96545, 149346, -187325, -267351, -132284, -41253, 73446, 149271, 32596, -163282, -125589, -144985, 131687, 187102, 88328, -41016, -128277, -72441, 432434, -40744, 94119, 350908, -78882, -358882, -311292, -28953, 22403, -26966, -211677, 36879, 370, -132261, 109164, -9446, 3240, -275618, -41847, 235896, -156784, 432519, 232106, 265419, -115395, 310812, -118540, 131049, 210900, 199551, 84478, 24712, 181763, 238727, -39508, 213222, -183644, 12175, 127803, -27136]
12540E4249M116g9429D9845b03543B949K01213j9876C4766j6327J02478g8037
12528a907A06413J24451f562A42780C4593c09051A07648a72475A68717O5852a32600
12516B32509c9586Q003G0266K04B8854c0707B4254L15078F3407K02279L6476j06345
12504A95817C8816J0411a66386J4214e9620G2836J52231k9531I5443a18465A15849
12492E6579f3217A31892C304b26595N4712h5870k20836B21816g6073c0114H4164
12480A38572c12334J42789l4653C79015e3273l40314a68635i096m1319A10984
12469E9432K0586a23109A15107e4710C3218c00214e0143k8764p4381k2803A55065
12457c07027E8883e1372j9029B21928C3439h3549A53905F4961P9094b21413C5598
$$ y = [54249, 58365, -79429, 49845, -203543, 2949, 204162, 184286, 34766, 18439, 120917, -78037, -1907, 106413, 230864, -6562, 142780, 34593, -309051, 107648, -172475, 168717, 234569, -132600, 232509, -39586, -31583, 70266, 70470, 28854, -30707, 24254, 339332, 63407, 265686, 302162, 195817, 38816, 49227, -166386, -152172, -59620, 72836, 225067, 195536, 95443, -118465, 115849, 56579, -63217, 131892, 3304, -226595, -171883, -85870, -306706, 221816, -76073, -30114, 84164, 138572, -312334, -169545, -204198, 379015, -53273, -393587, -168635, -9096, -50415, 110984, 59432, 80018, -123109, 115107, -54710, 33218, -300214, -50143, -78907, -153288, -176091, 155065, -307027, 58883, -51372, -70401, 221928, 33439, -83549, 153905, 64961, 144055, -221413, 35598]
12445b56295C11431B9006f4481k2635F1986b15518R3190F46720a33403C17012
12434a36279D1326a36910B18303I3195f7950c531C45936k4622g4056A33616C1033
12422B32185b14361A12919c2312k0320A40833f6455j06322B40866b29883B9084
12411B59795e5745r1661c3934j53025k8499i2915n7416O771J7636b8440D53465
12399A60469o6083L0338J4459Q703C9375c37168A49088K2902a1287A82533p1606
12388A10927g2713j69394C47227a80377B66102a0594j60970B69623E5440a6643
12377B9179J30426c26658A93862k134L3372g79j77815a1129F3579K9375J15839
12366B08793b21393K4807c03A4250e9097G1867a53397d3984A47892b65788g8624
$$ y = [-256295, 311431, 29006, -64481, -87116, 61986, -215518, -122328, 646720, -133403, 317012, -136279, 41326, -136910, 218303, 93195, -67950, -3531, 345936, 321314, -74056, 133616, 31033, 232185, -214361, 112919, -32312, -52632, 140833, -66455, -172777, 240866, -229883, 29084, 259795, -55745, -147406, -33934, -186959, -215458, -92915, -150331, -143560, -125924, -28440, 453465, 160469, 94386, 124724, 139183, 147886, 39375, -337168, 149088, 171990, -11287, 182533, 110927, -72713, -242107, 347227, -180377, 266102, -10594, -171564, 269623, 55440, -16643, 29179, 159605, -326658, 193862, 191728, 225100, -779, -178594, -11129, 63579, 92954, 208793, -221393, -196586, -303, 14250, -59097, 71867, -153397, -43984, 147892, -265788, -78624]
12354e1125B74653k8921A08524C7586Q2747l1907b813E798J46400F381b32537
12342a64817e4864B93170a17164E9989a02844p5264d419A42516F028a21151r2719
12331b13870A56639h9974P969j27388C35394J13999A26026b53093A45870j5412
12321A30458a52338D5527d9556A64392c4748H1689a6708A16995P2895a74114f3610
12309A64684d58775a21611n4873D08301b70351A24320b85098A06788a25142D75198
12298b75876C5246K16693j09023a25968H0416J883B6475K50034I3598b09807R8820
12287a10987m8178C9268b33624E4168K20308i2477C2518g9922q0686A17398J05298
12276B22696j10482a26347A36521P6371a65268A71214a80501b273j5889k40899
$$ y = [-51125, 274653, 245732, 108524, 37586, 120333, 88426, -2813, 5798, 152198, 6381, -232537, -164817, -54864, 293170, -117164, 59989, -102844, -178108, -4419, 142516, 6028, -121151, -213870, 156639, -89974, -82005, -209393, 335394, 449393, 126026, -253093, 145870, 130458, -152338, 45527, -49556, 164392, -34748, 81689, -16708, 116995, 189890, -174114, -63610, 164684, -458775, -121611, -176484, 408301, -270351, 124320, -285098, 106788, -125142, 475198, -275876, 35246, 251939, 142916, -125968, 80416, 82299, 26475, 276509, 93598, -209807, -110987, -159165, 39268, -233624, 54168, 274476, -92477, 32518, -79922, -160608, 117398, 222696, 112214, -126347, 136521, 212892, -165268, 171214, -180501, -2273, -18162, -259061]
12266b59061H5346a45594D18691q1508j17528R5643A52824m5569O4331q4698B075
12254A92894N2689m504d1037j9416H8953r702b2035I8625D1418L6303M13951A20230
12241c7571A61331a45450N2144B0453J43400N1767a19054A78952J31782b43716
12230B6171r527J14690o4703K90607A61321j1831a55415d4241F9881a08706A19292
12218B27397a16537G9214O9209a1718G8661Q2178K52390b12636B38037J34879
12208C72916K64131A99026m8035K76446j98822d4733A6100K88715I3144J11183
12198B04327g8809H5502k2204f9836A40797N2733E3177M6018K1516K54419A20673
12186f237C57809b38093B38315O1111A33282D9487K44570q2581Q741l3968H9030
$$ y = [-259061, 85346, -145594, 418691, 337183, 219655, 315298, 152824, 107255, 171586, 86888, 2075, 192894, 245583, 241079, -41037, -60453, 88953, 79251, -22035, 98625, 41418, 77721, 491672, 120230, -37571, 161331, -145450, -93306, 20453, 163853, 215620, -119054, 178952, 310734, -243716, 26171, 16644, 131334, 66631, 357238, 161321, 149490, -155415, -44241, 69881, -108706, 119292, 227397, -116537, 79214, 148423, -11718, 78661, 160839, 413229, -212636, 238037, 372916, 637047, 199026, 150991, 427437, 228615, -44733, 16100, 304815, 93144, 204327, -78809, 85502, 63298, -69836, 140797, 193530, 53177, 99195, 120711, 375130, 120673, -6237, 357809, -238093, 238315, 299426, 133282, 49487, 294057, 211476, 220217, 186249, 89030]
12174B44962b25863n3577B34415C4656a18071F3435a72183B35333a8863A55087
12163C52771b5081G2838j2639g5112b0042G1793C2351a15005J692B05019K79784
12152D84803g4889A14909J84440P1252E0083c4495l5871A74693H0606G304J98274
12141B05578c68423A14000J1074c095C45196J08550B22238I1639b07320H8048
12130b18864O2831H3595l8519J92790n3490a29743D0334J73530O0268f851G6639
12118d7319A84843j7884f0730G6581I613L12248f7516j61358K8456A03071a69571
12106A30772c9436k0207j55981Q8481A75797A5584J71651b30944b7274a638B66299
12094b06567C3711c08609A34464b5602j06783F163a39746A64195j3448d4987a6463
$$ y = [244962, -225863, -279440, 234415, 34656, -118071, 63435, -172183, 235333, -18863, 155087, 352771, -25081, 72838, 60199, -75112, -20042, 71793, 32351, -115005, -113313, 205019, 484803, -74889, 114909, 299349, 370601, 50083, -34495, -70366, 174693, 80606, 7304, 205578, -368423, 114000, 125074, -3095, 345196, 453746, 222238, 91639, -207320, 88048, -218864, -156033, 83595, 45076, 237866, 184376, -129743, 40334, 213864, 274132, -6851, 76639, -47319, 184843, 166959, -60730, 76581, 9613, 321861, -67516, -228874, -200418, 103071, -169571, 130772, -39436, -59643, -215624, -127143, 175797, 15584, 187235, -230944, -27274, -1638, 266299, -206567, 33711, -308609, 134464, -25602, -132385, 6163, -139746, 164195, 150747, -44987, -16463]
12082I4939P4706o0982c4573n1992n1468M4823A16641C2297K30541c5152B3527
12070A11531j2162b95429L1236A72282C9399J39620L22474L35858Q6688N7426
12060I81465D37731A41720J1730G3738b27269B58117p5444n324c259j97513b1978
12048C6256a89509A8667K7598J43462O1001j02666J17195b59203J19757G4852
12037a3183r2673k23412C79523j67575i6387L3771A27690N5142r0057e541D9083
12025b84963J00592F1228b4782j66043C6370i4578J7095j27972M0674f9755j44408
12014b14163M6508C7359j383J11422B3067a5285l4960l9316A11262c2743a4851
12002a11990B13924b8946j27682B29865G7691J00549q45b87064J24321n2896A96716
$$ y = [94939, 169645, 108663, -34573, -86565, -138033, -93210, 116641, 32297, 262838, -35152, 23527, 111531, 99369, -295429, -264193, 172282, 39399, 179019, 501493, 837351, 924039, 981465, 437731, 141720, 153450, 73738, -227269, 258117, 182673, 177349, -3259, -200772, -21978, 36256, -189509, 18667, 46265, 189727, 250728, 148062, 265257, -259203, -139446, 74852, -13183, -105856, -329268, 379523, 211948, -96387, -62616, 127690, 182832, 92775, -5541, 49083, -284963, -184371, 61228, -24782, -190825, 36370, -94578, -77483, -205455, -164781, -69755, -214163, -167655, 37359, 35976, 147398, 23067, -15285, -50245, -89561, 111262, -32743, -14851, -111990, 213924, -28946, -156628, 229865, 77691, 178240, 177395, -287064, -162743, -215639, 196716]
11990a57318M1755b9640C4054g1602c181A29033K6063c6308B3771c4256l24445
11979c58701f506C35230I2875c94042h6025r6081Q798j42178C7987a8216n148
11968b3364C16031A12729a6638A18663A1211L41505A64145b4657n1419j06439
11958a82515E4832J93765D5716L37611I2361Q6458a06748r9503H4262b19151P1540
11947a47611K3501A15045b62670a06268E6038J82096D8721k3274L45917B607J21199
11936A23806a62151L5745C03477p0324E0209h5928j27628o2621N361B5300L1661
11925E6961f0856A83702P50E81K57747f7436D8316a79940g3415D90498D635K07842
11913B12477J96178c47433A29717h5287l7088A8752a2101F2434b3981o2507G8616
$$ y = [-157318, -115563, -29640, 34054, -71602, -3181, 129033, 155096, -36308, 23771, -34256, -358701, -6506, 335230, 92875, -394042, -86025, -182106, -173308, -315486, 37987, -18216, -23364, 316031, 112729, -16638, 118663, 11211, 352716, 164145, -24657, -76076, -182515, 54832, 248597, 45716, 383327, 92361, 178819, -106748, -206251, 84262, -219151, -147611, -124110, 115045, -262670, -106268, 56038, 238134, 48721, 25447, 371364, 2607, 123806, -162151, -126406, 303477, 233153, 50209, -85928, -213556, -276177, -270816, 25300, 56961, -60856, 183702, 184452, 581, 258328, -67436, 48316, -179940, -73415, 490498, 4635, 212477, 408655, -347433, 129717, -85287, -122375, 18752, -12101, 62434, -23981, -86488, 78616]
11901A20816d9915A92901e712k10911J00989m2858g7370p2596b4699m41309a13088
11889b31260D4134f6372B9958K01119A15070B9113c04042g4530l0615B25365K95695
11878E21060i9596C98136a5819C10884j31764f4223m5598A98784k6320L402H0774
11866b70827g232L544A79165j7364a40394C7246a39100L2625B1154h3356l15265
11855c98621A82599c8376l33226g2939k1054k36027B00901a31675E4796b77534
11844a9447J819j85795B4672a24984j01513a07288B0227a1169l6708k07441d4587
11832g926j60561C09311D5122b58368c9939B08410a31171j7117a2527n7934j52539
11821b23000D5805L8758a38073f0484q310C92829b17923F9054a09724C9541a70335
$$ y = [120816, -49915, 192901, -5712, -216623, -115634, -158492, -77370, -149966, -24699, -466008, -113088, -231260, 44134, -66372, 29958, 231077, 115070, 29113, -304042, -74530, -105145, 225365, 521060, -99596, 398136, -15819, 310884, 179120, -64223, -109821, 198784, 172464, 175866, 80774, -270827, -7232, -3688, 179165, 161801, -140394, 37246, -139100, -106475, 21154, -83356, -398621, 182599, -38376, -371602, -72939, -93993, -330020, 200901, -131675, 54796, -277534, -19447, -17628, -203423, 24672, -124984, -226497, -107288, 20227, -11169, -47877, -255318, -44587, -7926, -168487, 309311, 45122, -258368, -39939, 208410, -131171, -148288, -12527, -70461, -223000, 45805, 84563, -138073, -60484, -68794, 392829, -217923, 69054, -109724, 39541, -170335]
11809a26689C62950D9621b36742j13881B58289a32345B92748b94083A47916b35334
11798a491E6809f7826l7118A19789a30134m6210h4418A38455h716A44139e5329
11786A03957a14428j63172F1437Q6699m1112a45072O7603A03127B849a17666A89799
11774A41836a0854j599I954b61260A33759K8893e5944k59648d4375H0880c6322
11762b0752k49285N1430m253A53188a56196A22125a24555J1028c9139j45969a7242
11750C33914b80789H081a09646j11934A70755J07036c5220H8140a40223g916A38300
11738b2475F4601a57451e2785B08391K9698i618B17041a62993G2993O1024B4267
11726a45835N4680B92949D4810J15249a0079I3865d3696j80543h0769A67491a5658
$$ y = [-126689, 362950, 49621, -236742, -350623, 258289, -132345, 292748, -294083, 147916, -235334, -1491, 56809, -67826, -104944, 119789, -130134, -176344, -84418, 138455, -8716, 144139, -55329, 103957, -114428, -277600, 61437, 148136, 107024, -145072, -77469, 103127, 2849, -117666, 189799, 141836, -10854, -12453, 9954, -261260, 133759, 162652, -55944, -315592, -44375, 80880, -36322, -20752, -270037, -218607, -222860, 153188, -156196, 122125, -124555, -113527, -39139, -185108, -17242, 333914, -280789, 8081, -109646, -221580, 170755, 277791, -35220, 88140, -140223, -7916, 138300, -22475, 64601, -157451, -52785, 208391, 238089, -9618, 217041, -162993, 72993, 134017, 24267, -145835, -91155, 292949, 44810, 160059, -10079, 93865, -43696, -224239, -80769, 167491, -15658]
11714E7487b48C3486b100m6731e124B21359A4644R3442J3874c7146C2748P8246
11702A10994Q3443a43011p7800B51527n6304M7628o1750a2360m8835A01150i7406
11690i5233A37505R8284H9165e3258B02486g0837H2327N8961O9205F7598Q0465
11679A48063j8774e2409j6423F35370b5484j26470h867l3848o3412G9784l4205
11668D5579b6220B03986p9904K0477E782P5964J00697L003l1876g6500c764k20088
11656b23852h0482C65515i7976I3577R451c3074H3974O0680F1601K76014A2883
11644g3463L4268r1006H1426J07113n1311B6355J91943G3875a07366B19919b21019
11632c6267E2498b16995B22699r1511a45708C47963a05729G2323C2646J94525
$$ y = [57487, -248, 33486, -2100, -48831, -5124, 221359, 14644, 108086, 121960, -37146, 32748, 110994, 194437, -143011, -220811, 251527, 195223, 242851, 181101, -12360, -61195, 101150, -97406, -95233, 137505, 235789, 89165, -53258, 202486, -70837, 82327, 141288, 210493, 67598, 148063, 129289, -52409, -68832, 635370, -25484, -151954, -8867, -42715, -106127, 79784, 45579, -26220, 203986, 124082, 144559, 5782, 81746, 182443, 185446, 153570, -76500, -3764, -223852, -80482, 365515, -97976, 93577, 103028, -33074, 83974, 144654, 61601, 337615, 12883, -73463, -39195, -130201, 81426, 188539, 137228, 26355, 218298, 73875, -107366, 219919, -221019, -36267, 52498, -216995, 222699, 131188, -145708, 347963, -105729, 72323, 32646, 227171]
11622B27171r3688b74907J37404B70232a4008j35833C18367H8823i4743C11091
11611h9338A33661a97546A3587M3980O1065j7397c03774A54710c6270A6826J14861
11600A31687b35321i4722j8466N1873j67635q8362B78326a26668K3901A87279
11589a63979D9345J26647d7695j8789E9637h3656P531A38047n6103h5809G4494
11577A14604Q0924M6075g8793A21751m8867a63590G8618K6055K19094j3844E1939
11565B5276a30811O4973B25514A09053R9900D7872J41176a85011A87452G8495
11554g2149k7903c5822O320F8447O0320m5595g3338A78352j4878Q641a58070g4152
11541h2596j19017H498b47793C30117j47310A272J65590a08524o581A04286k1075
$$ y = [227171, 133483, -274907, -137503, 270232, -14008, -149841, 318367, 88823, -94743, 311091, -89338, 133661, -197546, 13587, 57567, 118632, 101235, -303774, 154710, -36270, 16826, 131687, -235321, -94722, -113188, -61315, -228950, -317312, 278326, -126668, -102767, 187279, -163979, 49345, 175992, -47695, -66484, 59637, -83656, -76125, 138047, 81944, -85809, 74494, 114604, 195528, 241603, -78793, 121751, 72884, -163590, 78618, 104673, 323767, 309923, 51939, 25276, -130811, -65838, 225514, 109053, 208953, 47872, 189048, -185011, 187452, 78495, -72149, -100052, -35822, -29502, 68447, 128767, 83172, -73338, 178352, 163474, 172115, -158070, -74152, -82596, -201613, 8498, -247793, 330117, 182807, 1272, 166862, -108524, -115105, 104286, 83211]
11530H3211a96940C71L05174E3894J14782A6454a80442D24696k01365h6785A62691
11518D8426L34973k7943a54556B07574g5312k5760k00995B10884D516a00865o4752
11507a65617r5241A79264K37189A42322L2751a7821j80505g8431c8433B1191K44077
11496B65268F0385J61701l6887D9347J30660D9161k0078a41414B18978a32802
11485C2806j6254M18503a67239B04238H8782J7759J90592A27336c93974C4004
11474a59818B08023K86104d5017C69957A00355L30839j74495a95420E3116A7267
11463H9032O7175Q769e2316a2808F4773O19593C0758R9223K32136A66930d4409
11451b26354c9619J8275B68720r249j18668P5157a93408B19247J0586J96748A3292
$$ y = [83211, -196940, 371, 305545, 53894, 168676, 16454, -180442, 424696, 223331, -86785, 162691, 48426, 383399, 355456, -154556, 207574, -75312, -101072, -302067, 210884, 4516, -100865, -165617, -260858, 179264, 416453, 142322, 175073, -17821, -198326, -78431, -38433, 21191, 265268, 60385, 222086, 185199, 49347, 180007, 49161, 29083, -141414, 218978, -132802, 32806, 16552, 435055, -167239, 204238, 88782, 106541, 297133, 127336, -393974, 34004, -159818, 208023, 494127, -45017, 369957, 100355, 431194, 256699, -195420, 53116, 17267, 89032, 156207, 164976, -52316, -12808, 64773, 684366, 30758, 129981, 362117, 166930, -44409, -226354, -39619, -21344, 268720, 259471, 140803, 215960, -193408, 219247, 229833, 426581, 13292]
11439A39990f1099E79d9018D0631J53241a709B0080c23775a08573C7472R9364
11428A36836F1463c9190J0228B03729b19014A16116j4178a16196M9591J1618j4017
11417f9004B19047j9195g8050j80002a11411B09041b2977H2490b0972A3079O2050
11406G5129g9415O000A5426R7175h9539B28573j02110m9295M9434E0925P5531
11395A26456g0790g705H934J81539a2331B6877a1954A94267a03265j06220G9928
11383a01495E04227B51581A1520J89485G6608a27051c9029A20305b20794i4452
11372d7946B22462a46951A90519Q8595F944a66874o569G9611a2582I9943b42648
11360a0390j28377N3862l2899F0274E327J98116a41823p9777B42914b9433j79452
$$ y = [139990, -61099, 579, -49018, 40631, 193872, -1709, 20080, -323775, -108573, 37472, 136836, 61463, -39190, -28962, 203729, -219014, 116116, 101938, -116196, -66605, -54987, -69004, 219047, 199852, -78050, -258052, -111411, 209041, -22977, 82490, -20972, 13079, 75129, -79415, -73415, 15426, 112601, -89539, 228573, 126463, 77168, 126602, 50925, 126456, -70790, -7705, 8934, 190473, -12331, 26877, -11954, 194267, -103265, -209485, 79928, -101495, 504227, 251581, 11520, 201005, 76608, -127051, -39029, 120305, -220794, -94452, -47946, 222462, -146951, 190519, 279114, 6944, -166874, -173443, 79611, -12582, 99943, -242648, -10390, -138767, -84905, -117804, 60274, 5327, 203443, -141823, -221600, 242914, -29433, -208885]
11349b08885Q7733L6544q1179r1821c1063R204E0664M3420B362b0671A54177a21852
11336C2640i679c068j31936B68576b7128K321G1329K62824A38208C31b11327P449
11324b03878A6517P2225K1884L1758E7415b47629C51286d7701B49158f90k25861
11313b26551b387I0913K17540a15546I5836J22289a35154j60940B53506r7770
11303A55736h3433H1379A9841b40987A07457Q9050n0190L0150a30392P824K9806
11292i2762l7559C66436h8757c5455a021A6473b07371r5978A5119J10252N9767
11281A85138a05058A10151a6596j05332l05296a52767g0546E4216b255m27825
11271d30080c3953n278m2749j91588A02912k8253B5229a0628n3202B6018K36985
$$ y = [-208885, -121152, -84608, -165787, -257608, -31063, -21859, 50664, 94084, 2362, -20671, 154177, -121852, 32640, -9679, -3068, -135004, 268576, -27128, -24807, 71329, 334153, 138208, 331, -211327, -203878, 16517, 88742, 110626, 142384, 57415, -247629, 351286, -47701, 249158, -690, -226551, -2387, 90913, 308453, -115546, 95836, 218125, -135154, -296094, 253506, 155736, -83433, 81379, 19841, -240987, 107457, 196507, 146317, 176467, -130392, -122568, -92762, -130321, 366436, -88757, -35455, -1021, 16473, -207371, -303349, 15119, 125371, 185138, -105058, 110151, -16596, -121928, -427224, -152767, -70546, 54216, -2255, -430080, -33953, -39231, -81980, -273568, 102912, 74659, 25229, -10628, -63830, 26018, 263003]
11260B63003M1322D751J86082C5557O2935L6613Q62d44643E2904J32268D3780
11248B17956a02263E7481j2209r732K0319a93524N9072a272A38459F1555B9582
11236B1466a4869j02003j36468r4336a23880c8542j0816o7970l56524A10547l6657
11225G3890O0354b14754A70124m2841b1582C7752b1273j47439A4249O1006b31452
11213c93673J02771B66196l9697a37218e8156A23451E7454I95e5010j55939M2111
11202a68838b4839A46174L4257g0437C9589a18366l1237e4749q3981C12667a50330
11190a05907j05734B18598a48714K8617l70B04083g5135m0612I619J34320N336
11179A49275E7381a89997D508c50977L0269a28985G6716a36663A08589a44481
$$ y = [263003, 304325, 4751, 190833, 35557, 98492, 135105, 135967, -444643, 52904, 185172, 43780, 217956, -102263, 57481, 45272, 35540, 55859, -193524, -134452, -1272, 138459, 61555, 29582, 21466, -14869, -116872, -253340, -347676, -123880, -38542, -49358, -117328, -473852, 110547, 73890, 134244, -214754, 170124, 127283, -21582, 37752, -21273, -168712, 14249, 75255, -231452, -393673, -290902, 266196, 226499, -137218, -58156, 123451, 57454, 995, -55010, -210949, -168838, -24839, 146174, 180431, -70437, 39589, -118366, -149603, -54749, -138730, 312667, -150330, -105907, -211641, 218598, -148714, -120097, -120467, 204083, -75135, -115747, 9619, 143939, 149275, 57381, -189997, 4508, -350977, -320708, -128985, 76716, -136663, 108589, -144481]
11168b0867r9587l4419N6337j39215C1786b20652a03588o6253l01047h294D2095
11156A77945H8105l0853a26712i509k82750J3597J22988j4404H9811J76869e9796
11144c58865b1430r4995C60289D8491L3943a04102A04695h1964C06473A230N9955
11133F1185N4264h3337A57553E5537K4227a65044A19564d4799B13141r9030n3510
11122F0601B1140a37679j55226B22650A4342b8593A57445A2311a18211m4334O9473
11111i3072A85273n0491l4470b44271A85842F4288J08982a49944A33414c32687
11100A00683a6567B857J00841m5301N6696k2825c06296H8642a98009B52375A03018
11088E19327k55753d6007C95079A29559e6330k17844e2973k48089E30386P8k61237
$$ y = [-20867, -120454, -154873, -98536, -237751, 31786, -220652, -103588, -169841, -470888, -8294, 42095, 177945, 88105, 57252, -126712, -9509, -292259, -278662, -155674, -170078, 89811, 266680, -59796, -358865, -21430, -116425, 360289, 48491, 82434, -104102, 104695, -81964, 306473, 1230, 61185, 115449, -83337, 157553, 55537, 79764, -165044, 119564, -44799, 213141, 114111, 60601, 21140, -137679, -292905, 222650, 14342, -28593, 157445, 12311, -118211, -162545, -93072, 185273, 134782, 100312, -244271, 185842, 64288, 173270, -149944, 133414, -332687, 100683, -16567, 2857, 103698, 58397, 115093, 92268, -306296, 88642, -198009, 252375, 103018, 519327, 263574, -46007, 395079, 129559, -56330, -274174, -52973, -301062, 530386, 530464, 269227]
11077B69227a0832B90180j33233J01254q6821j0621J42641J21314A22267J14427
11067B36694J56033A91723i129B2104d7096D10852J05113B44076M9299o0022M3777
11056B77130p6396K07320k5018J30707k06516J68922o4491J4599J71987B25334
11045E78802N3724K32611C29849L6206J73531r113q926J33851j92557j39234L82931
11034G06538J3567j85740J44876J33004l29555M57466N4994m79894K799l6025
11024D82030K01354j07431k3894j02054L28533k24202J60065k29136R8248K2865
11014F06378J7906K31206M1496l49516l4588J51939j8656n0007p4682K10011p5343
11003F56144o9005L05754D21702J52290M11577D54791M18017D16188L9293K72757
$$ y = [269227, -10832, 290180, 156947, 258201, 171380, 160759, 303400, 424714, 122267, 236694, 392727, 191723, -9129, 22104, -47096, 410852, 515965, 244076, 293375, 233353, 277130, 200734, 408054, 383036, 513743, 307227, 476149, 411658, 426257, 598244, 225334, 578802, 632526, 865137, 329849, 366055, 539586, 530473, 521547, 655398, 462841, 323607, 706538, 720105, 534365, 679241, 812245, 482690, 940156, 995150, 515256, 518055, 482030, 683384, 575953, 552059, 450005, 778538, 554336, 714401, 485265, 583513, 606378, 624284, 855490, 896986, 547470, 512882, 664821, 646165, 596158, 521476, 731487, 656144, 587139, 892893, 421702, 573992, 985569, 454791, 872808, 416188, 455481, 728238]
10993G28238B77414K75959k16238O1611K39656k84595K69450j08008K62470r6156
10983F81563k61567K11044K77339l12663k07283K95936j93455O39815D72657q9008
10973C83649K41824K9511M94084k85774J51238j35194P8620m0115L62877K41566
10963A522286j48602K82353K22477j09241L46738K39562k02314N9064L92702j05521
10953B499504l47680K2394k1463j63044j31147K08521n17651J49293k08152K81631
10943A772206k37731J88298j35830J77562j46098M6177m80656l22348R1829J35957
10933A089366m01804R185J1010J48295j06624j78174B40166Q7268I8042L44786
10923D42828j20419a79226B9678K11927r5036n370h0343H7689l3415a64750H721
$$ y = [728238, 277414, 553373, 337135, 398746, 638402, 353807, 623257, 515249, 777719, 681563, 419996, 631040, 908379, 595716, 388433, 684369, 490914, 1130729, 472657, 383649, 625473, 654984, 1149068, 863294, 1014532, 879338, 957958, 917843, 1280720, 1522286, 1373684, 1656037, 1878514, 1769273, 2116011, 2355573, 2153259, 2212323, 2605025, 2499504, 2151824, 2174218, 2152755, 1989711, 1858564, 2067085, 1549434, 1698727, 1490575, 1772206, 1534475, 1722773, 1586943, 1764505, 1618407, 1664584, 1183928, 861580, 953409, 1089366, 687562, 696747, 707757, 856052, 749428, 571254, 240166, 327434, 98042, 442828, 322409, -179226, 29678, 241605, 146569, 141199, -80343, 87689, 54274, -164750, 8721]
10911F0825K052N7646K93835j97474I0907b38561e345j8960C4641J89431a95045
10899d4238A0031N8538b29853A56735G0042m061b82641J25556A14963B3686d9578
10887A6061d74693c4734E7594R743O2764a85380g0644A62283D1208a5629A2135
10875h5610A05071o917i3405B81987F9143a36622J3555C09545D1883b76395c3182
10863A27265J54484h3335j66514l9491a44224b4899A72546b59781D0083j9236
10853B0847J8686e5007J6896A29574a04067A81203p6062c23276j01872C73840
10842b3846k1433k02969m6113C44368j70302a6923A42443E0015a32309B15390
10831B44228C9105P0793a70826j8550f4816F5646K3564a07844I4227J04070g6221
$$ y = [60825, 62877, 120523, 414358, 216884, 90907, -238561, -5345, -24305, 34641, 224072, -195045, -44238, 10031, 68569, -229853, 156735, 70042, 65981, -282641, -157085, 114963, 23686, -49578, 16061, -474693, -34734, 57594, 67337, 130101, -185380, -70644, 162283, 41208, -15629, 12135, -85610, 105071, 98154, -93405, 281987, 69143, -136622, -123067, 309545, 41883, -276395, -33182, 127265, 281749, -83335, -249849, -289340, -144224, -24899, 172546, -259781, 40083, 20847, 39533, -55007, -38111, 129574, -104067, 181203, 105141, -323276, -425148, 373840, -23846, -45279, -248248, -294361, 344368, 174066, -16923, 142443, 50015, -132309, 215390, 244228, 39105, 109898, -170826, -189376, -64816, 65646, 89210, -107844, 94227, 198297, -76221]
10819b31738g8409k80367J56519A49588a89851P9440Q297j30443f9447G657b11738
10807a23660c5891E2733c6996m0561E3827K84137j57247K7155C8926a74967C55323
10795a94455B9212M5465a62708o4042M2427E729J32921a46992A16298B6584a48455
10783b15119k5304J09261k57412a02330j3238K3843K0933p0391m70405C6645c70358
10771f2354K2229j15573A58483b90134a09829B94040g0419H6601l2916b02629
10760B29153e3101C23187a68999A25156M8947n0775a24331j43113B4159c72853
10749d8761j53671B13849g3063r8340A52103f3754G642a53991g5584b461B10019
10737a35480C4845b28790D9280d8325k05200K3887h7853A71209a05822j37419
$$ y = [-231738, -78409, -358776, -202257, 149588, -189851, -110411, -102114, -232557, -69447, 7657, -211738, -123660, -35891, 52733, -36996, -77557, 53827, 337964, 180717, 207872, 38926, -174967, 355323, -194455, 29212, 74677, -162708, -226750, -184323, 5729, 138650, -146992, 116298, 26584, -148455, -215119, -240423, -131162, -388574, -102330, -115568, -91725, -70792, -141183, -611588, 36645, -370358, -62354, -40125, -155698, 158483, -290134, -109829, 294040, -70419, 86601, 53685, -202629, 229153, -53101, 323187, -168999, 125156, 174103, 123328, -124331, -267444, 24159, -372853, -48761, -202432, 213849, -73063, -171403, 152103, -63754, 7642, -153991, -75584, -2461, 210019, -135480, 34845, -228790, 49280, -48325, -253525, -229638, -87853, 171209, -105822, -243241]
10727b43241B11320F3720J49204b8085q753I6066c01361G8646J01753E1556j1137
10716D0419E073M5671K78825b41410A66588n2112M9710d06259a9382k10027A49679
10704A1237f1472j25063g8793k75813a20191k68829a81957h0165I9790a15643
10693a38018M2235p0656D9527b56158h8363f426I6694f2018D4075q632C672M6100
10681D9772M2626b04296e6989A72755a28722A54091L8387B0340J4715c9108B89028
10669H5963h6834k6644M2893A75939G4999a95930N1081N9570C5969J15990l5374
10658A16585p000l7722B3492K56958d25496J42878f9760j13559o181N8442l12078
10647d43136A02575K4035P8181B4310g8587q0532A22882b4987A8224a7923j14729
$$ y = [-243241, 211320, 63720, 212924, -28085, -36838, 96066, -301361, 78646, 180399, 51556, 40419, 5073, 50744, 329569, -241410, 166588, 114476, 164186, -406259, -19382, -229409, 149679, 11237, -61472, -186535, -78793, -354606, -120191, -389020, -181957, -80165, 99790, -115643, -138018, -95783, -166439, 49527, -256158, -88363, -6426, 96694, -62018, 44075, 35443, 3672, 49772, 92398, -204296, -56989, 172755, -128722, 154091, 192478, 20340, 35055, -39108, 289028, 85963, -86834, -113478, -70585, 175939, 74999, -195930, -144849, -85279, 35969, 151959, 116585, 109585, 71863, 23492, 280450, -425496, -282618, -69760, -183319, -189500, -131058, -443136, 102575, 126610, 204791, 24310, -78587, -159119, 122882, -24987, 18224, -17923, -132652]
10636a32652A45146j3460c52472N0604E8706d123k20226b1770m6206B0462a47486
10624g9100B05496b3962n28447b8020j23939L0056d7982H4923c1101D34377m7087
10613C87290b10771d5491r306b1147F7195B3027d64042b00963A95066a39766E5460
10601C8766a75431J2248j09369h4928B3727f178j4248B16199G3774b07728g2058
10589E5144a82589n5256C578g9493I8551a55419c2508F0241M2601a90026d9352
10577f1175E2755P7412a86893G910b13121A49681R1539f3837l09090a18820c4912
10565b64427B58965a25946B23875b6145A41586L0313a98433A85919c0354k85457
10555c15811H7868i2521k2160A86431i0123k24565J11245k00442A60422f5782
$$ y = [-132652, 145146, 131686, -352472, -301868, 58706, -4123, -224349, -21770, -67976, 20462, -147486, -79100, 205496, -23962, -552409, -28020, -151959, -121903, -47982, 84923, -31101, 434377, 387290, -210771, -45491, -54797, -21147, 67195, 23027, -464042, -200963, 195066, -139766, 55460, 38766, -175431, -163183, -272552, -84928, 23727, -6178, -20426, 216199, 73774, -207728, -72058, 55144, -182589, -237845, 3578, -79493, 98551, -155419, -32508, 60241, 102842, -190026, -49352, -61175, 52755, 130167, -186893, 7910, -213121, 149681, 241220, -63837, -372927, -118820, -34912, -264427, 258965, -125946, 223875, -26145, 141586, 171899, -198433, 185919, -30354, -315811, 87868, -92521, -114681, 186431, -90123, -314688, -203443, -403885, 160422, -65782]
10544a34640B1979a18776J8054l3625e7431F1863a52351B83606q1462a4317j83595
10533a97912L4983j08731J27144A13262a06755j54250j48143F6939J13875B1240
10522d56359f1092p2181o8401l6774e8562A18133c1596j06564n3375C02189c85175
10510a55765l03547e9659m38572b37469B31506a61620l8253h9966b2594B88835
10499i3271A05746B8390a98886l659e6341J4561A25442a93755N1118E8424g9751
10487c7144C1627b74933A94456b03390C13344A15387g1494B13521c52043i4817
10476B74509b0416A25370b86987G8099Q744b9518A7264K93969f0958B93273L32410
10465F25683k16492k01342J59181J02150j69929b86599A84374C4999j4809Q4747
$$ y = [-134640, 21979, -118776, -100722, -134347, -57431, 61863, -152351, 283606, 202144, -14317, -197912, -162929, -271660, -144516, 113262, -106755, -261005, -409148, 66939, 180814, 21240, -456359, -61092, -133273, -201674, -238448, -58562, 118133, -31596, -138160, -191535, 302189, -385175, -155765, -459312, -59659, -498231, -237469, 231506, -161620, -199873, -89966, -22594, 288835, -93271, 105746, 28390, -198886, -202545, -56341, -41780, 125442, -193755, -142637, 58424, -79751, -37144, 31627, -274933, 194456, -203390, 313344, 115387, -71494, 213521, -352043, -94817, 274509, -20416, 125370, -286987, 78099, 86843, -29518, 17264, 311233, -60958, 293273, 625683, 409191, 207849, 367030, 469180, 299251, -286599, 184374, 34999, 20190, 104937]
10455A04937J16059J04350A03301a38399A70101b24411F1525B7650P459N9153
10445I4262a5465k93791n6746a31124D525Q8458l2577a19640J1213k6106d2615
10433b1820j21836j46599J11065I7394O0064l3544d4566H2658a70407H6167b36791
10421d4497k79853A26133g8248A4740a10177b6756k98865a5160C7608R5531f4607
10409a12053l6618e0692F3230i4566A4269b04724G6451a58481B51333a73540b6089
10397A11237a91291M1854j17501I449g6552G8612l3488a94888h6440B02749b04724
10385c26503a03030G3064A0217i9811B61373I479i2063j65181A46122c0481B36403
10373C2058O287c0425B55750J3070J64969j73186r1702L96840B59068C9593j2219
$$ y = [104937, 220996, 325346, 103301, -138399, 170101, -224411, 61525, 27650, 35109, 94262, -15465, -309256, -366002, -131124, 4525, 92983, 60406, -119640, -108427, -134533, -42615, -21820, -143656, -290255, -179190, 97394, 157458, 123914, -44566, 82658, -170407, 86167, -236791, -44497, -324350, 126133, -78248, 14740, -110177, -26756, -325621, -15160, 37608, 133139, -64607, -112053, -148671, -50692, 63230, -94566, 14269, -204724, 76451, -158481, 251333, -173540, -26089, 111237, -191291, -149437, -266938, 9449, -76552, 78612, 45124, -194888, -86440, 202749, -204724, -326503, -103030, 73064, 10217, -99811, 261373, 9479, -92063, -257244, 146122, -30481, 236403, 32058, 38345, -30425, 255750, 268820, 433789, 260603, 168901, 565741, 259068, 39593, 27374]
10362B7374L03462a01696B36604A2812K31398d1613C78396A01881K41290A22782
10351C50469R1880j67934j0480j7097K90388D9544J18639D9022J33331F5416R5205
10340A60621p0479L25269A68208L24955j86525I3696J65379J64544j92272L48423
10330E79770A59680J51697p6653J23336r3232N8291r6561O4064J47399c673E4494
10318B7999b7891r5389A53101J34734a27173N9491A63842g3485B36110b00884
10307A97703J80758n4659A250K91701o7541F2500M3494B3698L15608A68860c2731
10295b64006i192j03675B45631n3966J5720c44792D6703J4646b85269A73979n8681
10284A15298g4054k4953A77096j120a23575a7170D8212b85112c297A97308p0776
$$ y = [27374, 330836, -101696, 236604, 12812, 244210, -41613, 378396, 101881, 343171, 122782, 350469, 442349, 274415, 263935, 246838, 537226, 49544, 168183, 49022, 182353, 65416, 160621, 90142, 415411, 168208, 493163, 306638, 93696, 259075, 423619, 231347, 579770, 159680, 311377, 234724, 358060, 264828, 323119, 226558, 290622, 438021, -3673, 54494, 27999, -27891, -123280, 153101, 287835, -127173, -67682, 163842, -73485, 236110, -200884, 197703, 378461, 323802, 1250, 292951, 225410, 62500, 105994, 23698, 339306, 168860, -32731, -264006, -9192, -112867, 245631, 191665, 207385, -344792, 46703, 61349, -285269, 173979, 115298, -74054, -99007, 177096, 175976, -123575, -17170, 48212, -285112, -3297, 197308, 126532]
10273A26532b97930B6442a35871k26956a00914j85334B68120D8938G091a37826
10262e9963b9691q1756a4639H9984J46238i7702a4994B5776K61162f7315C0568
10250D04783A66081F7215b15473B73677m0787n8630D4165M12834G0016J33342
10240B03358f2783A86592a49292P4236B95155r8467a8044M912A8129g6914J6284
10229f0630J0687k12905B25296f6769A36485K9187g4933F4281J9120b63127a05483
10217g8320j51823A21941b75149A38780F1296a47102A66358a26849B44243I6292
10206B33155a86262C19758b08826R3171D9510a52202Q025c4522G6936L3028a72012
10194a14819k47730a00718n6420f724j12966A60203E4403b21291B37443b66049
$$ y = [126532, -297930, 26442, -135871, -362827, -100914, -286248, 268120, 48938, 7091, -137826, -59963, -29691, -111447, -14639, 89984, 236222, -97702, -14994, 25776, 286938, -67315, 30568, 404783, 166081, 67215, -215473, 273677, 232890, 174260, 44165, 456999, 70016, 203358, -62783, 186592, -149292, -75056, 295155, 196688, -18044, -13132, 18129, -76914, -60630, -49943, -262848, 225296, -66769, 136485, 165672, -74933, 64281, 83401, -263127, -105483, -78320, -230143, 121941, -275149, 138780, 61296, -147102, 166358, -126849, 244243, 96292, 233155, -186262, 319758, -208826, -115655, 49510, -152202, -144177, -34522, 76936, 109964, -172012, -114819, -362549, -100718, -157138, -6724, -119690, 160203, 54403, -221291, 237443, -266049]
10183a47722l8904c7009j68341A88893q7283c21141A82503b29123f8338A81211
10172A82426g9000j4024B37856r9807a94703n5437N6598d5624B10125a02557L7240
10161f5317k61978D8821a26047b1941l12517c2417j0170j40009J735A01393c08857
10149h7139g673q8624E0822j6417e7950F7938a555A2337b82903I6489i3177j94979
10137b88156h6417A68626c18896G2941a20114m61B37943G338b04173j08034a19186
10125H4261a73268b7337j13396k7403C7244P3716a02889A54507c928l5963k00876
10114b40767k1985I497a38629b1172j10837A29334b21351d1255J016k82809L8118
10103b84930A18274b2022g571l17467n4332D7736b05524f8637G1748a50591L4665
$$ y = [-147722, -186626, -37009, -205350, 188893, 101610, -321141, 182503, -229123, -68338, 181211, 182426, -79000, -93024, 237856, 138049, -194703, -250140, -193542, -45624, 210125, -102557, -65317, -327295, 48821, -126047, -21941, -334458, -32417, -42587, -182596, -180861, 101393, -308857, -87139, -7673, -96297, 50822, 34405, -57950, 67938, -1555, 12337, -282903, 96489, -93177, -288156, -86417, 168626, -318896, 72941, -120114, -120575, 237943, 7338, -204173, -312207, -119186, 84261, -173268, -27337, -140733, -168136, 37244, 110960, -102889, 154507, -3928, -39891, -240767, -262752, 9497, -138629, -21172, -132009, 129334, -221351, -41255, -40239, -323048, -284930, 118274, -22022, -7571, -325038, -379370, 47736, -205524, -68637, 71748, -150591, -115926]
10092a15926D07496a27D1737I751K45240G8727K03814c25592a34158p3827P4775
10081a33210g745n8178j80998F1176J18463J38277H506c50504J35243J2444j12041
10070c14858a23143j7768C66498a99219q0622R7138A08520L0422o9422b11532
10059d4762r9948a8016l1356j51444f4551k10163a2029l73259J24388m6341J29450
10048a77791a0694A54931E3130C079K6947a35578M7530l4235k7568b5150B71634
10036I369a02017p7996N5343j24390d0983o0087C3328K222h8009d2188p6413o077
10024a24678N6492H1127a68125A14681B6503Q1776a65919f7851j27146m9660C7235
10012h7463d1913a7635F9452C1145b10717j8177A0110a50981B23823b58710p4692
$$ y = [-115926, 407496, -127, 41737, 9751, 254991, 78727, 282541, -325592, -134158, -207985, -133210, -7745, -65923, -246921, 61176, 179639, 317916, 8506, -350504, -215261, -202817, -314858, -123143, -140911, 366498, -199219, -279841, -182703, 108520, 138942, 69520, -211532, -44762, -144710, -18016, -49372, -200816, -64551, -274714, -12029, -385288, -260900, -307241, -177791, -10694, 154931, 53130, 3079, 30026, -135578, -88048, -122283, -149851, -25150, 271634, 9369, -102017, -180013, -124670, -249060, -40983, -101070, 33328, 35550, -88009, -42188, -118601, -124678, -68186, 81127, -168125, 114681, 26503, 108279, -165919, -67851, -194997, -244657, 37235, -87463, -41913, -17635, 69452, 31145, -210717, -228894, 10110, -150981, 223823, -258710, -333402]
10001c33402D1716b27558E6785L8525f1022o0236B9474a32248H0020b1386B04894
9989h3866j22146C06594a27704F2226b69270I6151B6266J78469b54038J13633
9979a40405o2144g8138C03223f2892a2318A0885a31433q5830j5016J1332F115
9967a21019Q515C688c50588I664J0018f9927c2252j59836P5749m7717P8341B45557
9954d7399C20532a63538B08596b62022j16723f5321I3375M1388c11844B13528
9943e7662m1235q7805f5720K085H9165a67778K6631B29995P6494b78970B9485
9931a55718A87999c76423a48125B72486A07215h1092k87503A28681c23777j14578
9921d38355B01150c5597o7849k02320a40295P347m1845A9634Q2200A513L365M1923
$$ y = [-333402, 41716, -227558, 56785, 95310, -61022, -121258, 29474, -132248, 80020, -21386, 204894, -83866, -206012, 306594, -127704, 62226, -269270, 96151, 26266, 204735, -254038, -140405, -202549, -78138, 303223, -62892, -12318, 10885, -131433, -217263, -232279, -220947, 6115, -121019, -112504, 3688, -350588, 9664, 19682, -69927, -32252, -192088, -116339, -164056, -85715, 245557, -47399, 320532, -163538, 208596, -262022, -378745, -65321, 93375, 134763, -311844, 213528, -57662, -98897, -186702, -65720, -63635, 89165, -167778, -141147, 229995, 306489, -278970, 29485, -155718, 187999, -376423, -148125, 272486, 107215, -81092, -368595, 128681, -323777, -438355, 201150, -35597, -103446, -305766, -140295, -132948, -174793, 19634, 101834, 1513, 4878, 46801]
9909D6801d5240k12672k02107J73515F6191P8087h7143p5009d5679k70595f629
9897h1025B12209a87166c4786o9294j43973l2119A70Q1448h6175B05489m6633
9886A58856a56482b2244l08619I7112a51911f4836k5614j24808P9897A6725a16980
9874A64599K36412a50678C9858a12995A36621J7028a17829G0692a17397L8566
9864g8831r8726F1593n581B1738a71145A85433a71979D524J20438g6277H0155
9852b29877h3896n3990L519B25054r484g705B93313e5862o0442b6627A03359J70194
9840B73553j01879a03247C8232D014M1604J36781c34521D8526a91068F2101c9194
9828F2547b76851A5970a62214j91838J72332A46266c378k94839i1930l51828a15991
$$ y = [46801, -45240, -257912, -460019, -286504, 66191, 144278, -87143, -162152, -45679, -316274, -6629, -81025, 212209, -187166, -34786, -104080, -248053, -280172, 170, 81618, -86175, 205489, 158856, -156482, -22244, -330863, 97112, -151911, -64836, -90450, -215258, -135361, 16725, -116980, 164599, 401011, -150678, 39858, -112995, 136621, 153649, -117829, 70692, -117397, -78831, -177557, 61593, 56012, 21738, -171145, 185433, -171979, 4524, 124962, -76277, 80155, -229877, -83896, -137886, -134367, 225054, 215570, -7705, 293313, -55862, -116304, -26627, 103359, 273553, 171674, -103247, 38232, 4014, 45618, 182399, -334521, 48526, -191068, 62101, -39194, 62547, -276851, 15970, -162214, -354052, -181720, 146266, -3378, -298217, -91930, -443758, -115991]
9816c26445J51451l79946c9666A47314h19B22653a75517C9812J15215G748a24094
9804d4908o1999b343l22105a12932A1320q13M3993e1708C8247A0391N0619J33199
9792A94209a3494G2794k4961c08631a8868k375r4444j70921m4814J05560B91283
9780b07750A76019m6008i0418C26114c07804e2503l6800M2120l5804l9773q5297
9769b08057d1672D4050d5862B11868C2926a56659A03992c6868a8317n5943B53330
9757C2726J77727c44975O6207f9912c3452k10828g8234j22099d4064B083a04327
9745A12438a37086L9116F4898d38521J42384B18724F5829f3367j5981L7011I8896
9733b4993A18398R3258g8195n8299j51038g2107j20560m7739i4717K0036K1043
$$ y = [-326445, -174994, -554940, -39666, 147314, -819, 222653, -175517, 39812, 155027, 7748, -124094, -44908, -106907, -2343, -324448, -112932, 11320, 10507, 54500, -51708, 38247, 10391, 61010, 194209, -13494, 72794, 47833, -308631, -18868, -21243, -115687, -286608, -331422, -225862, 291283, -207750, 176019, 130011, -90418, 326114, -307804, -52503, -89303, -47183, -82987, -122760, -208057, -41672, 44050, -45862, 211868, 32926, -156659, 103992, -36868, -18317, -74260, 253330, 32726, 210453, -344975, -278768, -69912, -33452, -244280, -78234, -200333, -44064, 2083, -104327, 112438, -137086, -97970, 64898, -438521, -296137, 218724, 65829, -63367, -79348, -42337, 98896, -24993, 118398, 211656, -78195, -136494, -287532, -72107, -192667, -240406, -94717, -74681, -53638]
9722e3638A47277g6896c0015j06213p915p2218c6299l73513a37894L6438A24327
9710B34524C3071b72931J04499o7020A91897F0904g7737j26430C3044a71095L8516
9699a32579o4160A6605b2638j10166M600p0417a5408l75024A18622J48663C7000
9687d3396Q560n4947l31646b1271j64043j48933a18645j33291l9958J5763a22797
9675I3402G562a57968j07036F5328j8967J94341d18960G640a30194o8980j28685
9664c27859g5692B26230G0466b32647A40939a49430A24613b1153o6607F5802b96131
9652A17806d5061B30048d36884A06168l6716P1245a07795q1279E5256b17187i0130
9640a47258i170A73325j4370n6588m0028h7696n7998c0858I5851c52413i035k02172
$$ y = [-53638, 147277, -76896, -30015, -136228, -144143, -216361, -36299, -409812, -137894, -101456, 124327, 234524, 33071, -272931, -168432, -235452, 191897, 60904, -77737, -204167, 33044, -171095, -132579, -196739, 16605, -22638, -132804, -128204, -198621, -15408, -390432, 118622, 267285, 37000, -43396, -34836, -89783, -421429, -21271, -185314, -334247, -118645, -251936, -291894, -276131, -122797, 93402, 7562, -157968, -265004, 65328, 46361, 240702, -418960, 7640, -130194, -199174, -327859, -75692, 226230, 70466, -232647, 140939, -149430, 124613, -21153, -87760, 65802, -296131, 117806, -45061, 230048, -436884, 106168, 69452, 140697, -107795, -189074, 55256, -217187, -90130, -147258, -9170, 173325, 158955, 102367, 62339, -87696, -145694, -30858, 95851, -352413, -9035, -211207]
9628b11207a00392B695E81b35833m8234B51698F6350f7745k2507A10642C3832
9616a71195A68610a45996p6246A49630P656J20853b31232d3906J0897j86408A17345
9604i4608A75563c5184n1483G785a64211B29397o6777b62732b3359j92634Q1672
9593a34321e291A99847c7293p3051j6675D3096a46850f497A35124l4262m867a65757
9580A32018b2297I6010i8466B7111g9407a9427A49141c00660k9395N6034i7718
9568a08079k42692K6959a50477b3642l92872J0038C04218c31164n8825J11290
9558b78699A2726i8901k36408B10874b47617f4501B3056d6079C9585j0725j0901
9547A7959K270d60634J78874N3821E538J6592f9258C0918a6364I984g456j03799
$$ y = [-211207, -100392, 2695, 581, -235833, -284067, 251698, 66350, -67745, -90252, 110642, 33832, -171195, 168610, -145996, -222242, 149630, 157286, 278139, -231232, -43906, -33009, -219417, 117345, -94608, 175563, -35184, -86667, 7785, -164211, 229397, 162620, -262732, -23359, -215993, -134321, -5291, 199847, -37293, -110344, -127019, 43096, -146850, -6497, 135124, 100862, 95995, -165757, 132018, -22297, 96010, -98466, 27111, -79407, -19427, 149141, -300660, -330055, -274021, -97718, -108079, -350771, -323812, -150477, -23642, -416514, -406476, 304218, -331164, -389989, -278699, 12726, -98901, -335309, 210874, -247617, -64501, 23056, -46079, 39585, 28860, 17959, 20229, -460634, -281760, -227939, 5538, 22130, -69258, 30918, -16364, 9984, -7456, -111255]
9535a11255j6623c5889j82886A81297d35631f1298I3194a52941j16174g3056G0447
9523d567j9910l97972f8124A29066B8985j1607P1033K09474e5295p8404B83318
9511f6333h453j02496B06332O9749d7526J2190j58623A07626J04927H6650g6144
9499H7014a01679a3544B00169I3327a89673A9989b99792j3789i8500H129f0437
9487H5920M2859a13889K1951L051D20407G5009e1974j6416G1237i7884k1245K8841
9475i0288E5744a71012P631F9842e6122G8692J63085b4107k2150F6066b28482
9463A31479g750m7087J4660a0034j67516d7547k66934a42870c6785r3991B7648
9451a13666K8450A50306K15217h2879J003L4946j54813B1777K066b49841L7650
$$ y = [-111255, -127878, -35889, -218775, 181297, -435631, -61298, 93194, -152941, -269115, -73056, 70447, -4567, -24477, -422449, -68124, 129066, 28985, 17378, 88411, 297885, -55295, -133699, 283318, -66333, -8453, -110949, 206332, 276081, -47526, -35336, -193959, 107626, 212553, 86650, -76144, 87014, -101679, -13544, 200169, 93327, -189673, 19989, -299792, -313581, -98500, 8129, -60437, 85920, 128779, -113889, -91938, -88887, 420407, 75009, -51974, -68390, 71237, -97884, -119129, -90288, 55744, -171012, -163381, 69842, -56122, 78692, 241777, -24107, -46257, 66066, -228482, 131479, -7750, -54837, -40177, -10034, -177550, -47547, -314481, -142870, -36785, -130776, 27648, -113666, -85216, 150306, 365523, -82879, -81876, -46930, -201743, 21777, 23843, -249841, -212191]
9440b12191B74031a50147M8840A75774i2915e024n2423l28209A64223a85520j53869
9429c39389J9492I2186E787Q5390c8511A00598a56665M1811e5426j41953r4847
9418b92226h6549l9644A37592D5274e1109H0432a8240A07144b77745a08102C9878
9406C64911a187k95086k6266A64979a27015A78706f4739D8151b13568m2606B43763
9394H0568f0706I4218a74050e3212K1818B04020p7355E8234f6194o3935a2688
9382C6565i578l3247E8989a25523J5235L4483N699B50018d8836k51732H5400J83906
9370B69306b55923k349J24629F6353b2157p6604j3608O600J4133E9461e8539K5806
9358c2733j22297A16130b73219i5924A98945B6005i3447K2942q0470b8629B20758
$$ y = [-212191, 274031, -150147, -101307, 175774, -92915, -5024, -57447, -385656, 164223, -185520, -339389, -319897, 92186, 5787, 91177, -38511, 100598, -156665, -114854, -55426, -197379, -292226, -86549, -126193, 137592, 45274, -51109, 80432, -18240, 107144, -277745, -108102, 39878, 364911, -1187, -296273, -322539, 164979, -127015, 178706, -64739, 48151, -213568, -256174, 243763, 80568, -60706, 94218, -174050, -53212, -31394, 204020, 126665, 58234, -66194, -130129, -12688, 36565, -9578, -42825, 58989, -125523, -110288, -75805, -70106, 250018, -48836, -300568, 85400, 269306, -255923, -258272, -133643, 66353, -22157, -98761, -112369, -105769, -91636, 59461, -58539, -32733, -155030, 116130, -273219, -95924, 198945, 26005, -93447, -70505, -150975, -28629, 220758]
9346a25231j31497d7738m3199a0755j67093d7879J7044k61792A42687e5534p7272
9335a32806A57650j8871b87551R0632C8566a42968J982A9127N9224P0884E5478
9323b3494C8650a81191A55254B1002c3966k57247F3356A5983e4567B4888a31986
9311G3649j2632K7642a6991k18019A6240c57768J36163G2327b62665F1133a54641
9299D5710K80529M9278a22226A41302b58928A81289D2933b04907j5132J1722l44423
9288e52740A66559g332k16753A51949b03814h0437A43783b38909P9800E5215K92638
9277C47853c7339I4457A179K5776c55531f6143A9307J88309f03247E7946b57662
9265b36652a07192A12477c70245E7605b2047j85593B3038c03189a35505G6650
$$ y = [-125231, -256728, -47738, -90937, -10755, -177848, -47879, -30835, -292627, 142687, -55534, -132806, 157650, 138779, -287551, -196919, 38566, -142968, -140986, 19127, 78351, 149235, 55478, -23494, 38650, -181191, 155254, 21002, -33966, -291213, 63356, 15983, -54567, 24888, -131986, 73649, 61017, 88659, -16991, -235010, 16240, -357768, -221605, 72327, -262665, 61133, -154641, 45710, 326239, 375517, -122226, 141302, -258928, 181289, 42933, -204907, -220039, -208317, -552740, 166559, -7332, -224085, 151949, -203814, -80437, 143783, -238909, -159109, 55215, 347853, -37339, 94457, 1179, 26955, -355531, -66143, 19307, 207616, -603247, 57946, -257662, -236652, -107192, 112477, -370245, 57605, -22047, -207640, 23038, -303189, -135505, 76650]
9254b26101A54807i0923K6145o1358b5206k99082f4486m7563p948j27741k33432
9243d81170A98970a73283A10719a8247j23263d1057F203K25005a54400c8662B7881
9231B35144H0516J98660c6171k71084J26750f0543j17692B8506a78706E8630a37392
9219a90588j42943R1403J2941a10868k8628E1657h9990I9752a39559e4759K696
9208e2063k24291a6277j1462q9648H1224g806k17410l1062A50786a71777D8940
9196D8418O3197P0589b19305n9715C33621p8858c19174J30282C56112C8791a8275
9184h5177o5926A63800a16081j52747c6962q9059l1257K0409C6520p329d44192
9172G333i0367E6054e077B03673a14574F1505k7578a05928C544a44868o5431o2216
$$ y = [-226101, 154807, -90923, -64778, -126136, -25206, -324288, -64486, -112049, -119997, -247738, -481170, 198970, -173283, 110719, -18247, -141510, -41057, 6203, 231208, -154400, -38662, 27881, 235144, 80516, 279176, -36171, -307255, -180505, -60543, -178235, 28506, -178706, 58630, -137392, -190588, -333531, -242128, -229187, -110868, -139496, 51657, -89990, 99752, -139559, -54759, -52063, -276354, -16277, -27739, -117387, 81224, -7806, -225216, -256278, 150786, -171777, 48940, 48418, 111615, 182204, -219305, -279020, 333621, 254763, -319174, -188892, 356112, 38791, -18275, -85177, -151103, 163800, -116081, -268828, -36962, -126021, -157278, -136869, 36520, 29191, -444192, 7333, -90367, 56054, -5077, 203673, -114574, 61505, 33927, -105928, 3544, -144868, -210299, -272515]
9160b72515B28120c0030n7132A08764a96356r1998e9497j5696B09927E9144b4525
9148C6391a27389k36675E0430Q3102C7718c0945m29959a15673M6560k5074l44966
9137d39153h0503p1561j43223B24860d12925D8825C165a89930q8981h7751A25977
9125B34790A0003K24402i1395j071A22375n4646P7248p1713J14405l9179c7215
9113a48786L874b3981j40880b8639A21188d7086n6736o7683K7681F6285d4914
9101a32632l88973I2239b75225E7612O3178B8068K2653e1242o1412a2035A84359
9089A50626a25811j06545j10513C24137i2724A35310d7016B57501q2716c63669
9078A93373a65450A08103R1815d3782j15836A07845c19274c9426j76648g5920
$$ y = [-272515, 228120, -30030, -87162, 108764, -196356, -288354, -59497, -75193, 209927, 59144, -24525, 36391, -127389, -364064, 50430, 133532, 37718, -30945, -460904, -115673, -69113, -94187, -439153, -80503, -152064, -295287, 224860, -412925, 48825, 3165, -189930, -278911, -87751, 125977, 234790, 10003, 234405, -91395, -92466, 122375, 67729, 144977, 73264, 187669, 148490, -37215, -148786, -144912, -23981, -164861, -28639, 121188, -47086, -103822, -171505, -143824, 66285, -44914, -132632, -521605, 92239, -275225, 57612, 120790, 28068, 50721, -51242, -112654, -12035, 184359, 150626, -125811, -232356, -342869, 324137, -92724, 135310, -47016, 257501, 174785, -363669, 193373, -165450, 108103, 199918, -43782, -159618, 107845, -319274, -39426, -216074, -75920]
9067f7499D4742b48307n095Q6585l08608B20463o4473n5832b41583G1766c05087
9055f8037m5536j91660A57594d7285j77389j12150R8025A02208n0967b81593k59467
9044e41060a53626J0451o9435J05822B96596i8437J1705A16183b00809R229F7040
9032a87640A54527f0696I2587b33060c1982B64878i4593I7528b09805A59255P0558
9021B29813P6065a00579l0034b797p6574k71306B67105b18380H31O7357M7710
9010A15898e3111n749C11016a24382n7929A25597b96108K7026b2963A74878A0430
8998h0811b238A77141b99651J30291k7058B12230a67420m1073B85618c10475B45811
8986g1862b7177B20580a48165a1443j16783A14971b73090B18868i8220B6638i2540
$$ y = [-67499, 44742, -248307, -253402, -166817, -475425, 220463, 155990, 100158, -241583, 71766, -305087, -68037, -113573, -305233, 157594, -47285, -224674, -336824, -238799, 102208, 51241, -281593, -541060, -153626, -143175, -212610, -106788, 296596, -98437, -86732, 116183, -200809, -191580, 67040, -187640, 154527, -60696, 92587, -233060, -31982, 264878, -94593, 97528, -209805, 159255, 229813, 305878, -100579, -130613, -2797, -79371, -350677, 267105, -218380, 831, 68188, 115898, -53111, -58860, 311016, -124382, -182311, 125597, -296108, -269082, -22963, 174878, 10430, -80811, -2238, 177141, -299651, -169360, -196418, 212230, -167420, -208493, 285618, -310475, 245811, -71862, -27177, 220580, -148165, -11443, -128226, 114971, -273090, 218868, -98220, 26638, -92540]
8974b17437h392o8912A54351a35024B45152a18949K930A38781P4061o495i6423
8962E2113A7243R9135J13188F1915a79768h3351L58k64722B06132a03431j13601
8951b17032h6630A33658b2270l52484G8117R7166B955K86922a62124b8281A57052
8939a5084l48211g1335E2628f7619L560p8581q1610I4790c61694G434J8255b01486
8926C43957E6732j5972J21161E9893a49436N5864M1554C32621j60480G7953e9478
8914h3942B07473D6514L32770n5529M47571L51003O64239J573862L865561K515883
8904I741874m729138B470947j012558m51841o9861l35778j28990J3036k14517
8895B70438M7237j00996J83971A69289D6779R7090M8520h8920A41533f8018D34624
$$ y = [-217437, -8392, -77304, 154351, -135024, 245152, -118949, -116019, 138781, 212842, 206347, -96423, 52113, 17243, 116378, 229566, 61915, -179768, -83351, -82993, -347715, 206132, -103431, -217032, -86630, 133658, -22270, -374754, 78117, 175283, 2955, 289877, -162124, -28281, 157052, -15084, -363295, -71335, 52628, -67619, -64059, -142640, -224250, 94790, -361694, 7434, 25689, -201486, 343957, 56732, 40760, 161921, 59893, -149436, -93572, -52018, 332621, 172141, 77953, -59478, -83942, 207473, 46514, 379284, 323755, 771326, 1122329, 1786568, 3360430, 7225991, 9741874, 5012736, 2470947, 1458389, 1006548, 936687, 600909, 471919, 484955, 270438, 317675, 216679, 400650, 169289, 46779, 143869, 192389, -88920, 141533, -68018, 434624]
8883b10706O3250B152a04939A71466q4173C9204a92822c5178C3852d0474G5695
8871a97751b622n3635j90790j1267B554J15356a1173D4188K1674b7923G1585b3955
8858c6163n5515c3967a6888A7763b9878j87143h3266k9820j41097J0262E0972
8846c8493B7154O3829g4294A18652e0584j91515r7007a65721D6576N4345f5424
$$ y = [-210706, -147456, 2152, -104939, 171466, 87293, 39204, -192822, -35178, 33852, -40474, 75695, -197751, -2622, -56257, -247047, -258314, 2554, 117910, -11173, 44188, 65862, -27923, 71585, -23955, -36163, -91678, -33967, -16888, 17763, -29878, -217021, -83266, -113086, -254183, -243921, 50972, -38493, 27154, 90983, -74294, 118652, -50584, -242099, -339106, -165721, 46576, 100921, -65424]
$$ [...]
##END NTUPLES=NMR SPECTRUM
##END=
