
##TITLE=UV1019_M2-1005-1001_6269241_XHeYjly8f8
##JCAMPDX= 6.0         $$ Bruker NMR JCAMP-DX V2.0
##DATA TYPE= NMR SPECTRUM
##DATA CLASS= NTUPLES
##ORIGIN= BRUKER
##OWNER= Administrator
$$ 1.72 TOPSPIN		Version 2.1
$$ 2012-06-02 04:08:00.187 -0500  Administrator@TOPSPIN
$$ Compression mode = diff/dup
##.OBSERVE FREQUENCY= 400.13188235
##.OBSERVE NUCLEUS= ^1H
##.ACQUISITION MODE= SIMULTANEOUS (DQD)
##.ACQUISITION SCHEME= undefined
##.AVERAGES= 64
##.DIGITISER RES= 22
##SPECTROMETER/DATA SYSTEM= spect
##.PULSE SEQUENCE= noesygpps1d.comp
##.SOLVENT NAME= COFFEE_calctemp
##.SHIFT REFERENCE= INTERNAL, COFFEE_calctemp, 1, 14.96692
##AUDIT TRAIL= $$ (NUMBER, WHEN, WHO, WHERE, PROCESS, VERSION, WHAT)
$$ ##TITLE= Audit trail, TOPSPIN		Version 2.1
$$ ##JCAMPDX= 5.01
$$ ##ORIGIN= Bruker BioSpin GmbH
$$ ##OWNER= Administrator
$$ $$ C:\Bruker\TOPSPIN/data/COFFEE/nmr/UV1019_M2-1005-1001_6269241_XHeYjly8f8/12/pdata/1/auditp.txt
$$ ##AUDIT TRAIL=  $$ (NUMBER, WHEN, WHO, WHERE, PROCESS, VERSION, WHAT)
(   1,<2012-06-02 04:07:54.718 -0500>,<Administrator>,<TOPSPIN>,<go>,<TOPSPIN 2.1>,
      <created by zg
	started at 2012-06-02 03:56:24.562 -0500,
	POWCHK enabled, PULCHK disabled,
       configuration hash MD5:
       D5 CA 7A 23 FE 6B EE E2 50 67 74 61 24 F7 5E 3B
       data hash MD5: 64K
       C9 AA ED F7 13 2E C3 6E F8 83 99 C5 A9 52 1C 88>)
(   2,<2012-06-02 04:07:57.656 -0500>,<Administrator>,<TOPSPIN>,<proc1d>,<TOPSPIN 2.1>,
      <Start of raw data processing
       efp LB = 0.3 FT_mod = 6 PKNL = 1 PHC0 = 0 PHC1 = 0 SI = 128K 
       data hash MD5: 128K
       A3 F0 9B 78 18 10 72 CA F7 BA A3 92 36 5E 5A 65>)
(   3,<2012-06-02 04:07:59.171 -0500>,<Administrator>,<TOPSPIN>,<proc1d>,<TOPSPIN 2.1>,
      <pk PHC0 = 31.48682 PHC1 = 0 
       data hash MD5: 128K
       6D F0 F9 09 9E BF 2B 27 7C 4E 76 F1 DA 9E C0 92>)
(   4,<2012-06-02 04:07:59.843 -0500>,<Administrator>,<TOPSPIN>,<proc1d>,<TOPSPIN 2.1>,
      <abs ABSG = 1 
       data hash MD5: 128K
       40 CE 1C C7 AD F8 E7 18 F9 3F 93 1E F4 FA 85 EC>)
(   5,<2012-06-02 04:07:59.921 -0500>,<Administrator>,<TOPSPIN>,<proc1d>,<TOPSPIN 2.1>,
      <abs ABSG = 2 
       data hash MD5: 128K
       02 4A E9 5C 99 84 AA 45 A2 32 0E 08 C8 0A F3 AD>)
(   6,<2012-06-02 04:07:59.968 -0500>,<Administrator>,<TOPSPIN>,<proc1d>,<TOPSPIN 2.1>,
      <abs ABSG = 3 
       data hash MD5: 128K
       73 FA 44 C5 E7 E5 74 56 AF C7 57 B7 C6 55 47 1C>)
(   7,<2012-06-02 04:08:00.031 -0500>,<Administrator>,<TOPSPIN>,<proc1d>,<TOPSPIN 2.1>,
      <abs ABSG = 4 
       data hash MD5: 128K
       C7 80 1A 9C B5 F2 5F 14 C7 71 07 A9 6B 1C 05 2B>)
(   8,<2012-06-02 04:08:00.093 -0500>,<Administrator>,<TOPSPIN>,<proc1d>,<TOPSPIN 2.1>,
      <abs ABSG = 5 
       data hash MD5: 128K
       F3 A0 BA 7C A1 03 6E 63 5C 26 E5 3E D6 53 7F 93>)
$$ ##END=
$$ 
$$ $$ hash MD5
$$ $$ 6D 0B 4A 8B 86 9B DC 73 5E 18 08 DB 78 B0 EC 51
##$RELAX= 
##$RELAX= 
##$RELAX= 
##$RELAX= 
##$RELAX= 
##$RELAX= 
##$RELAX= 
##$RELAX= 
$$ [...]
##$TP07= 0
##$TPNAME0= <>
##$TPNAME1= <>
##$TPNAME2= <>
##$TPNAME3= <>
##$TPNAME4= <>
##$TPNAME5= <>
##$TPNAME6= <>
##$TPNAME7= <>
##$TPOAL= (0..7)
0.5 0.5 0.5 0.5 0.5 0.5 0.5 0.5
##$TPOFFS= (0..7)
0 0 0 0 0 0 0 0
##$TUNHIN= 0
##$TUNHOUT= 0
##$TUNXOUT= 0
##$USERA1= <user>
##$USERA2= <user>
##$USERA3= <user>
##$USERA4= <user>
##$USERA5= <user>
##$V9= 5
##$VALIST= <valist>
##$VCLIST= <CCCCCCCCCCCCCCC>
##$VD= 0
##$VDLIST= <DDDDDDDDDDDDDDD>
##$VPLIST= <PPPPPPPPPPPPPPP>
##$VTLIST= <TTTTTTTTTTTTTTT>
##$WBST= 2048
##$WBSW= 25
##$XGAIN= (0..3)
0 0 0 0
##$XL= 0
##$YL= 0
##$YMAX_a= 11727228
##$YMIN_a= -6419321
##$ZGOPTNS= <>
##$ZL1= 120
##$ZL2= 120
##$ZL3= 120
##$ZL4= 120
##$ABSF1= 14.96692
##$ABSF2= -5.58561
##$ABSG= 5
##$ABSL= 3
##$ALPHA= 0
##$AQORDER= 0
##$ASSFAC= 0
##$ASSFACI= 0
##$ASSFACX= 0
##$ASSWID= 0
##$AUNMP= <proc_prof1d_extract.lims>
##$AXLEFT= 0
##$AXNAME= <>
##$AXNUC= <1H>
##$AXRIGHT= 0
##$AXTYPE= 0
##$AXUNIT= <>
##$AZFE= 0.1
##$AZFW= 0.1
##$BCFW= 0
##$BC_mod= 0
##$BYTORDP= 0
##$COROFFS= 0
##$CY= 15
##$DATMOD= 1
##$DC= 0
##$DFILT= <>
##$DTYPP= 0
##$F1P= 0
##$F2P= 0
##$FCOR= 0.5
##$FTSIZE= 131072
##$FT_mod= 6
##$GAMMA= 0
##$GB= 0
##$INTBC= 1
##$INTSCL= 1
##$ISEN= 128
##$LB= 0.3
##$LEV0= 0
##$LPBIN= 0
##$MAXI= 10000
##$MC2= 0
##$MEAN= 0
##$ME_mod= 0
##$MI= 0
##$NCOEF= 0
##$NC_proc= -3
##$NLEV= 6
##$NOISF1= 0
##$NOISF2= 0
##$NSP= 0
##$NTH_PI= 0
##$NZP= 0
##$OFFSET= 14.96692
##$PC= 1
##$PHC0= 31.48682
##$PHC1= 0
##$PH_mod= 1
##$PKNL= yes
##$PPARMOD= 0
##$PPDIAG= 0
##$PPIPTYP= 0
##$PPMPNUM= 2147483647
##$PPRESOL= 1
##$PSCAL= 4
##$PSIGN= 0
##$PYNMP= <proc.py>
##$REVERSE= no
##$SF= 400.130005477278
##$SI= 131072
##$SIGF1= 0
##$SIGF2= 0
##$SINO= 400
##$SIOLD= 131072
##$SPECTYP= <>
##$SREGLST= <1H.CDCl3>
##$SSB= 0
##$STSI= 131072
##$STSR= 0
##$SW_p= 8223.68421052632
##$SYMM= 0
##$S_DEV= 0
##$TDeff= 65536
##$TDoff= 0
##$TI= <>
##$TILT= no
##$TM1= 0
##$TM2= 0
##$TOPLEV= 0
##$USERP1= <user>
##$USERP2= <user>
##$USERP3= <user>
##$USERP4= <user>
##$USERP5= <user>
##$WDW= 1
##$XDIM= 131072
##$YMAX_p= 495562244
##$YMIN_p= -83676391
##$CURPLOT= <Network HP LaserJet P1505>
##$CURPRIN= <$Network HP LaserJet P1505>
##$DFORMAT= <normdp>
##$LAYOUT= <+/1D_H.xwp>
##$LFORMAT= <normlp>
##$PFORMAT= <normpl>
##$SURQMSG= 1
$$ End of Bruker specific parameters
$$ ---------------------------------
##NTUPLES= NMR SPECTRUM
##VAR_NAME=  FREQUENCY,     SPECTRUM/REAL,   SPECTRUM/IMAG
##SYMBOL=    X,             R,               I
##VAR_TYPE=  INDEPENDENT,   DEPENDENT,       DEPENDENT
##VAR_FORM=  AFFN,          ASDF,            ASDF
##VAR_DIM=   131072,        131072,          131072
##UNITS=     HZ,            ARBITRARY UNITS, ARBITRARY UNITS
##FACTOR=    0.0627417313425165, 1,          1
##FIRST=     8223.62146879498, 5109,         -111546
##LAST=      0,             6784,            -110736
##MIN=       0,             -83676391,       0
##MAX=       8223.62146879498, 495562244,    0
$$ Real data points
##PAGE= N=1
##DATA TABLE= (X++(R..R)), XYDATA
$$ [...]
$$ plain form
63527 1247131 1218417 1191166 1163831 1136297 1110571 1088300 1069032 1051414 1035028 1020489 1008572
63516 1008572 999980 995431 995147 998362 1003807 1010612 1018499 1027284 1036672 1046578 1057407 1069862 1084495
63503 1084495 1101382 1120174 1140494 1162292 1185715 1210744 1237197 1265119 1294868 1326751 1360928
63492 1360928 1397971 1439134 1485332 1535470 1585909 1631778 1668969 1695284 1710360 1715091 1711208 1701048
63480 1701048 1687238 1672200 1657623 1644099 1631170 1617784 1602864 1585668 1565812 1543046 1516956
63469 1516956 1486947 1452731 1414964 1375182 1334832 1294478 1254099 1213893 1174387 1135974 1098980
63458 1098980 1064159 1032390 1003626 976799 951126 926934 904825 884671 866085 849300 834758
63447 834758 822178 810801 800275 790504 780950 771151 761798 754201 748547 743704 739008 735184 732960
$$ packed form
63527A247131k8714k7251k7335k7534k5726k2271j9268j7618j6386j4539j1917
63516A008572q592m549k84L215N445O805P887Q785R388R906J0829J2455J4633
63503A084495J6887J8792K0320K1798K3423K5029K6453K7922K9749L1883L4177
63492A360928L7043M1163M6198N0138N0439M5869L7191K6315J5076M731l883j0160
63480A701048j3810j5038j4577j3524j2929j3386j4920j7196j9856k2766k6090
63469A516956l0009l4216l7767l9782m0350m0354m0379m0206l9506l8413l6994
63458A098980l4821l1769k8764k6827k5673k4192k2109k0154j8586j6785j4542
63447H34758j2580j1377j0526r771r554r799r353p597n654m843m696l824k224
$$ plain form
63434 732960 731620 729653 726325 722126 718118 715258 713935 713738 713910 714152 714602 715133 715475 716152 718308 722182
63418 722182 726593 730368 733328 735408 735952 734822 733222 732244 731178 728412 723514 717372 710786 704177 698393
63403 698393 694457 692488 691925 692777 695548 699944 704817 709583 714658 720410 726879 734869 746007 760954
63389 760954 778387 796396 814187 831905 849760 868272 888675 911944 937757 965407 995607
63378 995607 1030233 1069930 1112663 1155020 1194475 1230111 1261849 1289851 1314751 1337876 1360878
63367 1360878 1385285 1412438 1443559 1479437 1520021 1564409 1611189 1658834 1706175 1752778 1798381
63356 1798381 1841291 1877692 1903593 1917810 1922475 1920582 1913913 1903463 1890496 1876098 1860343 1842928
63344 1842928 1824087 1803867 1780876 1752925 1719096 1680494 1639111 1596700 1554508 1513075 1472089
$$ packed form
63434G32960j340j967l328m199m008k860j323j97J72K42M50N31L42O77K156L874
63418G22182M411L775K960K080N44j130j600r78j066k766m898o142o586o609n784
63403F98393l936j969n63Q52K771M396M873M766N075N752O469P990J1138J4947
63389G60954J7433J8009J7791J7718J7855J8512K0403K3269K5813K7650L0200
63378I95607L4626L9697M2733M2357L9455L5636L1738K8002K4900K3125K3002
63367A360878K4407K7153L1121L5878M0584M4388M6780M7645M7341M6603M5603
63356A798381M2910L6401K5901J4217M665j893o669j0450j2967j4398j5755j7415
63344A842928j8841k0220k2991k7951l3829l8602m1383m2411m2192m1433m0986
$$ plain form
63333 1472089 1431226 1391287 1353795 1319416 1287589 1257948 1231303 1208839 1190919 1177116 1166853
63322 1166853 1159488 1154104 1149897 1147082 1147201 1152092 1162069 1175177 1189020 1203605 1221528 1244639 1271315
63309 1271315 1298151 1323853 1350145 1378965 1410272 1442931 1476620 1512204 1550893 1593296 1638524
63298 1638524 1683955 1726538 1764535 1797389 1824153 1843355 1854674 1859420 1858720 1852467 1840890 1826010
63286 1826010 1810262 1794234 1776883 1757481 1736126 1712452 1685081 1652838 1615892 1575327 1531989
63275 1531989 1486289 1439189 1392937 1350066 1311364 1275442 1240975 1208865 1181241 1158759 1140251
63264 1140251 1124893 1112881 1103274 1092837 1078288 1058809 1035519 1009710 982932 957674 935863
63253 935863 916812 898225 879379 861951 847489 835469 824473 814246 805655 799090 793781 788662
$$ packed form
63333A472089m0863l9939l7492l4379l1827k9641k6645k2464j7920j3803j0263
63322A166853p365n384m207k815J19M891R977J3108J3843J4585J7923K3111K6676
63309A271315K6836K5702K6292K8820L1307L2659L3689L5584L8689M2403M5228
63298A638524M5431M2583L7997L2854K6764J9202J1319M746p00o253j1577j4880
63286A826010j5748j6028j7351j9402k1355k3674k7371l2243l6946m0565m3338
63275A531989m5700m7100m6252m2871l8702l5922l4467l2110k7624k2482j8508
63264A140251j5358j2012r607j0437j4549j9479k3290k5809k6778k5258k1811
63253I35863j9051j8587j8846j7428j4462j2020j0996j0227q591o565n309n119
$$ plain form
63241 788662 783429 778502 774151 769919 765106 759527 753407 746654 738910 730432 722144 714513 707078 699529
63227 699529 692372 685923 679543 672876 667097 663612 661812 659435 655283 650505 647015 645488 645146 644724 643391
63212 643391 641333 639709 639573 640759 642290 643770 645741 648669 652397 656688 661580 666962 672444 677863
63198 677863 683390 689097 695071 701974 710589 720556 730540 740099 750446 762613 775803 788642 801513
63185 801513 816275 833680 852334 870759 889511 910418 934135 959397 984833 1010811 1039020
63174 1039020 1070501 1104597 1139796 1175092 1210210 1244873 1278360 1309993 1339976 1369599 1400430
63163 1400430 1433055 1466609 1499733 1531942 1563699 1595135 1625155 1651985 1674316 1691898 1705612
63152 1705612 1717080 1727271 1734848 1736552 1730157 1716735 1699295 1679701 1657892 1633719 1608098 1582069
$$ packed form
63241G88662n233m927m351m232m813n579o120o753p744q478q288p631p435p549
63227F99529p157o449o380o667n779l485j800k377m152m778l490j527l42m22j333
63212F43391k058j624j36J186J531J480J971K928L728M291M892N382N482N419
63198F77863N527N707N974O903Q615R967R984R559J0347J2167J3190J2839J2871
63185H01513J4762J7405J8654J8425J8752K0907K3717K5262K5436K5978K8209
63174A039020L1481L4096L5199L5296L5118L4663L3487L1633K9983K9623L0831
63163A400430L2625L3554L3124L2209L1757L1436L0020K6830K2331J7582J3714
63152A705612J1468J0191P577J704o395j3422j7440j9594k1809k4173k5621k6029
$$ plain form
63140 1582069 1555973 1530271 1506429 1486229 1470403 1458276 1448524 1440163 1433213 1428631 1427393 1429633
63128 1429633 1434972 1443390 1455076 1469499 1485596 1503024 1522395 1543978 1567063 1590865 1614995 1638533
63116 1638533 1659852 1678434 1696014 1714695 1734420 1753453 1770770 1786456 1799879 1809136 1812902 1811605
63104 1811605 1806089 1796001 1780304 1758683 1731625 1699628 1663285 1623972 1583540 1543150 1502973
63093 1502973 1463120 1424357 1387686 1353755 1322981 1295764 1271921 1250028 1228112 1205485 1183605
63082 1183605 1164668 1149479 1137169 1126867 1118880 1113688 1110407 1107182 1103256 1099897 1098879 1100524 1103714
63069 1103714 1107590 1112588 1119594 1128493 1137947 1146615 1154192 1161012 1166820 1170633 1172218 1173175 1175625 1179729
63055 1179729 1183410 1184997 1185323 1186349 1188309 1189504 1188971 1188108 1189015 1192051 1195813 1198957 1201160 1202459 1202667
$$ packed form
63140A582069k6096k5702k3842k0200j5826j2127r752q361o950m582j238K240
63128A429633N339Q418J1686J4423J6097J7428J9371K1583K3085K3802K4130K3538
63116A638533K1319J8582J7580J8681J9725J9033J7317J5686J3423R257L766j297
63104A811605n516j0088j5697k1621k7058l1997l6343l9313m0432m0390m0177
63093A502973l9853l8763l6671l3931l0774k7217k3843k1893k1916k2627k1880
63082A183605j8937j5189j2310j0302p987n192l281l225l926l359j018J645L190
63069A103714L876M998P006Q899R454Q668P577O820N808L813J585R57K450M104
63055A179729L681J587L26J026J960J195n33q63R07L036L762L144K203J299K08
$$ plain form
63040 1202667 1201781 1200485 1199837 1200505 1202360 1204650 1206570 1207883 1209036 1210587 1212527 1214348 1215718 1216906 1218543
63025 1218543 1221118 1224757 1229426 1235235 1242341 1250383 1258275 1265170 1271701 1279671 1290202 1302776 1316449
63012 1316449 1331283 1347911 1366363 1386204 1407434 1430298 1454611 1480465 1509337 1543039 1581418
63001 1581418 1622520 1665400 1711371 1761776 1816001 1872741 1932092 1994967 2061179 2129551 2199538
62990 2199538 2271459 2345384 2421043 2498565 2577801 2656845 2732822 2804813 2874831 2945126 3015416
62979 3015416 3083579 3148242 3209660 3268550 3325103 3378969 3429252 3474309 3512140 3541032 3559440
62968 3559440 3565706 3559032 3540722 3513177 3476978 3430119 3371229 3302823 3229993 3156342 3082806 3010328
62956 3010328 2941526 2878675 2821622 2769227 2721893 2681137 2647357 2619873 2599071 2586817 2584359
$$ packed form
63040A202667q86j296o48O68J855K290J920J313J153J551J940J821J370J188J637
63025A218543K575L639M669N809P106Q042P892O895O531P970J0531J2574J3673
63012A316449J4834J6628J8452J9841K1230K2864K4313K5854K8872L3702L8379
63001A581418M1102M2880M5971N0405N4225N6740N9351O2875O6212O8372O9987
62990B199538P1921P3925P5659P7522P9236P9044P5977P1991P0018P0295P0290
62979C015416O8163O4663O1418N8890N6553N3866N0283M5057L7831K8892J8408
62968C559440O266o674j8310k7545l6199m6859n8890o8406p2830p3651p3536p2478
62956C010328o8802o2851n7053n2395m7334m0756l3780k7484k0802j2254k458
$$ plain form
62945 2584359 2591040 2605343 2626016 2651783 2681173 2713229 2747562 2783385 2819592 2856213 2894526
62934 2894526 2934911 2975538 3013998 3049423 3082289 3112994 3141348 3166504 3186547 3199105 3203478
62923 3203478 3201261 3193562 3178408 3152360 3114294 3066113 3010017 2946749 2876812 2801881 2724192 2645107
62911 2645107 2564928 2483932 2403350 2325298 2251484 2181955 2115713 2052679 1994058 1940240 1889524
62900 1889524 1839971 1791559 1745249 1700883 1657646 1615973 1577134 1541088 1506464 1472654 1440207
62889 1440207 1409066 1378221 1347657 1318974 1293285 1269715 1246883 1224897 1205049 1188126 1173586
62878 1173586 1159951 1145809 1130952 1116519 1103477 1091396 1079783 1070004 1064058 1061422 1059059 1055026
62866 1055026 1050249 1046058 1041959 1037054 1031910 1027302 1022270 1015205 1006237 997082 988925 981740 975277 969456
$$ packed form
62945B584359O681J4303K0673K5767K9390L2056L4333L5823L6207L6621L8313
62934B894526M0385M0627L8460L5425L2866L0705K8354K5156K0043J2558M373
62923C203478k217p699j5154k6048l8066m8181n6096o3268o9937p4931p7689p9085
62911B645107q0179q0996q0582p8052p3814o9529o6242o3034n8621n3818n0716
62900A889524m9553m8412m6310m4366m3237m1673l8839l6046l4624l3810l2447
62889A440207l1141l0845l0564k8683k5689k3570k2832k1986j9848j6923j4540
62878A173586j3635j4142j4857j4433j3042j2081j1613r779n946k636k363m033
62866A055026m777m191m099m905n144m608n032p065q968r155q157p185o463n821
$$ plain form
62852 969456 963949 958390 952980 948168 943959 940127 936668 933437 929866 925828 922282 920158 918970 917442
62838 917442 915255 913364 912765 913570 915075 916109 915674 913947 912431 912440 913642 914612 914566 913979 913756 914275 914990
62821 914990 914619 912129 907934 903673 900526 898388 896935 896425 896694 896411 894423 891196 887936 884954 881925
62806 881925 879050 876809 875121 873939 874097 876213 879174 881168 881955 882668 883602 883764 882683 881150 879863
62791 879863 878661 877514 877084 877841 879470 881355 882802 882757 880504 876836 873469 871145 869461 868599 869676
62776 869676 872763 876003 877516 877252 876364 875912 876821 879753 883885 886850 887183 886215 886520 889135 893386 898715
62760 898715 905231 912689 920290 927654 935107 942897 950930 959308 968379 978136 988233 998641 1009704
62747 1009704 1021526 1033926 1047103 1061750 1078247 1096110 1114405 1132472 1150395 1169264 1190956
$$ packed form
62852I69456n507n559n410m812m209l832l459l231l571m038l546k124j188j528
62838I17442k187j891n99Q05J505J034m35j727j516RJ202R70m6n87k23N19P15
62821I14990l71k490m195m261l147k138j453n10K69k83j988l227l260k982l029
62806H81925k875k241j688j182J58K116K961J994P87P13R34J62j081j533j287
62791H79863j202j147m30P57J629J885J447m5k253l668l367k324j684q62J077
62776H69676L087L240J513k64q88m52R09K932M132K965L33r68L05K615M251N329
62760H98715O516P458P601P364P453P790Q033Q378R071R757J0097J0408J1063
62747A009704J1822J2400J3177J4647J6497J7863J8295J8067J7923J8869K1692
$$ plain form
62736 1190956 1217013 1247429 1280840 1316031 1353022 1392760 1436307 1484478 1537708 1595874 1658496
62725 1658496 1725408 1796991 1873604 1955174 2041691 2133635 2231239 2333400 2437891 2542646 2646281
62714 2646281 2747223 2843096 2931490 3010921 3080316 3137748 3180453 3206341 3215006 3207081 3183071
62703 3183071 3143245 3088416 3020461 2942061 2856023 2764643 2669593 2572483 2475266 2379562 2285605
62692 2285605 2192764 2101554 2014280 1932949 1857180 1785224 1716650 1652832 1594816 1542010 1493333
62681 1493333 1448563 1407883 1370994 1337473 1307476 1281200 1257982 1236648 1216692 1198570 1182993
62670 1182993 1170427 1161086 1154711 1150356 1147034 1144743 1144373 1146431 1150338 1155264 1161218 1168873 1178634 1190469
62656 1190469 1204672 1222234 1244138 1270455 1300388 1333024 1367851 1404809 1444430 1488032 1537141
$$ packed form
62736A190956K6057L0416L3411L5191L6991L9738M3547M8171N3230N8166O2622
62725A658496O6912P1583P6613Q1570Q6517R1944R7604J02161J04491J04755J03635
62714B646281J00942R5873Q8394P9431O9395N7432M2705K5888Q665p925k4010
62703C183071l9826n4829o7955p8400q6038r1380r5050r7110r7217r5704r3957
62692B285605r2841r1210q7274q1331p5769p1956o8574o3818n8016n2806m8677
62681A493333m4770m0680l6889l3521k9997k6276k3218k1334j9956j8122j5577
62670A182993j2566r341o375m355l322k291l70K058L907M926N954P655R761J1835
62656A190469J4203J7562K1904K6317K9933L2636L4827L6958L9621M3602M9109
$$ plain form
62645 1537141 1592128 1651684 1714265 1780071 1851012 1928496 2011774 2098744 2187829 2278417 2369770
62634 2369770 2460326 2548165 2631477 2708303 2776484 2834434 2881521 2916975 2938659 2943832 2931379
62623 2931379 2902684 2860096 2805205 2739069 2663433 2580828 2493579 2403410 2311918 2220777 2131255
62612 2131255 2044035 1959659 1878812 1802093 1729842 1662194 1598981 1539722 1484196 1432867 1386098
62601 1386098 1343084 1302429 1263870 1228548 1197273 1169442 1144038 1120700 1099156 1078509 1057975
62590 1057975 1037759 1018419 1000005 982679 967592 955976 947615 941098 935295 929711 923798 917170
62578 917170 910412 904568 899687 894844 889652 884704 880306 875824 870710 865346 860396 856042 852278 849317
62564 849317 847328 846251 846140 847245 849646 853390 858954 866685 875602 883895 891199 899461 910688 924472
$$ packed form
62645A537141N4987N9556O2581O5806P0941P7484Q3278Q6970Q9085R0588R1353
62634B369770R0556Q7839Q3312P6826O8181N7950M7087L5454K1684N173j2453
62623B931379k8695m2588n4891o6136p5636q2605q7249r0169r1492r1141q9522
62612B131255q7220q4376q0847p6719p2251o7648o3213n9259n5526n1329m6769
62601A386098m3014m0655l8559l5322l1275k7831k5404k3338k1544k0647k0534
62590A057975k0216j9340j8414j7326j5087j1616q361o517n803n584n913o628
62578I17170o758n844m881m843n192m948m398m482n114n364m950m354l764k961
62564H49317j989j077j11J105K401L744N564P731Q917Q293P304Q262J1227J3784
$$ plain form
62550 924472 938565 951514 963996 977854 994510 1014128 1035743 1058238 1081590 1107039 1135883
62539 1135883 1168501 1204848 1245165 1289477 1336722 1385267 1434233 1483647 1533348 1582325 1629154
62528 1629154 1672349 1710077 1740216 1761336 1773511 1777786 1774881 1764734 1747332 1723503 1694485 1660893
62516 1660893 1622754 1580784 1537048 1493785 1451760 1410329 1368908 1327836 1287941 1250004 1214751
62505 1214751 1182652 1153522 1126784 1102253 1080140 1060310 1042299 1026208 1012670 1001423 990805
62494 990805 979444 968037 958697 952667 949153 946183 942273 937579 933777 932528 933720 935561 936702 937730
62480 937730 940078 943992 948299 951878 954646 957236 960485 965302 972396 981780 992821 1005150 1019539
62467 1019539 1037697 1060728 1087599 1115610 1143135 1171680 1204410 1242640 1284756 1328653 1374012
$$ packed form
62550I24472J4093J2949J2482J3858J6656J9618K1615K2495K3352K5449K8844
62539A135883L2618L6347M0317M4312M7245M8545M8966M9414M9701M8977M6829
62528A629154M3195L7728L0139K1120J2175M275k905j0147j7402k3829k9018l3592
62516A660893l8139m1970m3736m3263m2025m1431m1421m1072l9895l7937l5253
62505A214751l2099k9130k6738k4531k2113j9830j8011j6091j3538j1247j0618
62494I90805j1361j1407r340o030l514k970l910m694l802j249J192J841J141J028
62480I37730K348L914M307L579K768K590L249M817P094R384J1041J2329J4389
62467A019539J8158K3031K6871K8011K7525K8545L2730L8230M2116M3897M5359
$$ plain form
62456 1374012 1421800 1472886 1528007 1587799 1651557 1716772 1781140 1844451 1907373 1969162 2027878
62445 2027878 2082211 2131456 2174193 2208893 2235927 2257362 2274652 2288117 2298959 2309939 2323241
62434 2323241 2339009 2356821 2377476 2402629 2433824 2472614 2520265 2576109 2637045 2699977 2764244
62423 2764244 2830616 2898344 2964109 3023414 3072131 3107435 3128633 3136979 3133562 3117240 3085432 3036839
62411 3036839 2972597 2895013 2806422 2709557 2607887 2504631 2401564 2299102 2197419 2097484
62401 2097484 2001319 1911273 1828720 1753557 1685288 1624282 1571318 1526065 1486897 1452328 1421799
62390 1421799 1394788 1370152 1347124 1326398 1309324 1296159 1285798 1277188 1270377 1266057 1264539 1265373
62378 1265373 1267558 1269877 1271254 1271115 1269415 1266218 1261312 1254254 1244663 1232405 1217694 1201223 1184124
$$ packed form
62456A374012M7788N1086N5121N9792O3758O5215O4368O3311O2922O1789N8716
62445B027878N4333M9245M2737L4700K7034K1435J7290J3465J0842J0980J3302
62434B323241J5768J7812K0655K5153L1195L8790M7651N5844O0936O2932O4267
62423B764244O6372O7728O5765N9305M8717L5304K1198Q346l417j6322l1808m8593
62411C036839o4242p7584q8591r6865j01670j03256j03067j02462j01683r9935
62401B097484r6165r0046q2553p5163o8269o1006n2964m5253l9168l4569l0529
62390A421799k7011k4636k3028k0726j7074j3165j0361q610o811m320j518Q34
62378A265373K185K319J377j39j700l197m906p058r591j2258j4711j6471j7099
$$ plain form
62365 1184124 1167466 1151646 1136345 1121152 1106167 1092034 1079537 1069144 1060533 1052344 1042861 1031584
62353 1031584 1020083 1010701 1004177 999061 993637 987812 982626 978457 974593 970433 966308 962969 960874 960241
62339 960241 961163 963310 965964 968813 972370 977157 982813 988518 994072 999901 1006088 1012241 1018638 1026840
62325 1026840 1038498 1053643 1070542 1087242 1103037 1118649 1135349 1153941 1174254 1195467 1217017
62314 1217017 1239213 1262858 1288355 1315481 1344015 1374258 1406814 1442247 1481241 1524676 1572888
62303 1572888 1624904 1679123 1735143 1794568 1859579 1930834 2006996 2085864 2165252 2242756 2315507
62292 2315507 2380845 2437161 2483786 2520258 2546034 2560862 2565145 2559897 2546385 2525590 2497798 2462953
62280 2462953 2421759 2376150 2328167 2278549 2227075 2174297 2122096 2072221 2025017 1980058 1937448
$$ packed form
62365A184124j6658j5820j5301j5193j4985j4133j2497j0393q611q189r483j1277
62353A031584j1501r382o524n116n424n825n186m169l864m160m125l339k095o33
62339I60241R22K147K654K849L557M787N656N705N554N829O187O153O397Q202
62325A026840J1658J5145J6899J6700J5795J5612J6700J8592K0313K1213K1550
62314A217017K2196K3645K5497K7126K8534L0243L2556L5433L8994M3435M8212
62303A572888N2016N4219N6020N9425O5011P1255P6162P8868P9388P7504P2751
62292B315507O5338N6316M6625L6472K5776J4828M283n248j3512k0795k7792l4845
62280B462953m1194m5609m7983m9618n1474n2778n2201m9875m7204m4959m2610
$$ plain form
62269 1937448 1897739 1860927 1826297 1793177 1761261 1730276 1700009 1670669 1642567 1615350 1588172
62258 1588172 1560847 1534230 1509190 1485704 1463318 1442015 1422103 1403552 1385965 1369140 1353321
62247 1353321 1338896 1325980 1314051 1301841 1288045 1272750 1257994 1246276 1238313 1232571 1226971 1220646
62235 1220646 1214028 1207870 1202687 1198864 1196736 1196458 1198049 1201645 1207408 1214985 1223262 1230932 1237418 1243114
62221 1243114 1248774 1254977 1262341 1271855 1284400 1299788 1316742 1334089 1351874 1371181 1393072 1417949
62209 1417949 1445661 1475854 1508224 1542725 1579622 1619321 1662301 1709399 1761901 1820822 1886035
62198 1886035 1956468 2031263 2110187 2192540 2275983 2356865 2431582 2497380 2552366 2595763 2628348
62187 2628348 2651732 2666494 2671391 2665047 2648032 2622366 2588942 2546508 2493703 2431450 2362634 2289939
$$ packed form
62269A937448l9709l6812l4630l3120l1916l0985l0267k9340k8102k7217k7178
62258A588172k7325k6617k5040k3486k2386k1303j9912j8551j7587j6825j5819
62247A353321j4425j2916j1929j2210j3796j5295j4756j1718p963n742n600o325
62235A220646o618o158n183l823k128k78J591L596N763P577Q277P670O486N696
62221A243114N660O203P364R514J2545J5388J6954J7347J7785J9307K1891K4877
62209A417949K7712L0193L2370L4501L6897L9699M2980M7098N2502N8921O5213
62198A886035P0433P4795P8924Q2353Q3443Q0882P4717O5798N4986M3397L2585
62187B628348K3384J4762M897o344j7015k5666l3424m2434n2805o2253o8816p2695
$$ plain form
62175 2289939 2214940 2139164 2064954 1994609 1929057 1867877 1810529 1757281 1708931 1665888 1627661
62164 1627661 1593293 1562265 1534867 1511581 1492181 1475604 1460623 1446446 1432746 1419428 1406553
62153 1406553 1394340 1383078 1373027 1364348 1357111 1351428 1347684 1346490 1348242 1352774 1359555 1367978 1377314
62140 1377314 1386740 1395986 1405837 1417454 1431037 1445482 1459430 1472342 1484611 1497103 1510739 1526044
62128 1526044 1542799 1560258 1577802 1595182 1612277 1629078 1645953 1663375 1681214 1698742 1715507
62117 1715507 1731807 1748219 1765267 1783724 1804526 1827994 1853815 1882337 1915232 1954165 1999173
62106 1999173 2048967 2102287 2158007 2214140 2267761 2316127 2357378 2390374 2414725 2431004 2439957
62095 2439957 2441250 2433804 2417705 2394948 2367651 2336115 2299346 2257070 2210522 2161540 2111674 2062101
$$ packed form
62175B289939p4999p5776p4210p0345o5552o1180n7348n3248m8350m3043l8227
62164A627661l4368l1028k7398k3286j9400j6577j4981j4177j3700j3318j2875
62153A406553j2213j1262j0051q679p237n683l744j194J752M532O781Q423R336
62140A377314R426R246R851J1617J3583J4445J3948J2912J2269J2492J3636J5305
62128A526044J6755J7459J7544J7380J7095J6801J6875J7422J7839J7528J6765
62117A715507J6300J6412J7048J8457K0802K3468K5821K8522L2895L8933M5008
62106A999173M9794N3320N5720N6133N3621M8366M1251L2996K4351J6279Q953
62095B439957J293p446j6099k2757k7297l1536l6769m2276m6548m8982m9866m9573
$$ plain form
62083 2062101 2013627 1966530 1921012 1878042 1839280 1805729 1776823 1751244 1728396 1708597 1691874
62072 1691874 1677141 1662785 1647838 1632408 1617225 1603051 1590439 1579848 1571722 1566277 1563086 1561189
62060 1561189 1560018 1560121 1562489 1567088 1572522 1577251 1580455 1581452 1579204 1573338 1565255 1557204 1550244 1543786
62046 1543786 1536911 1529121 1519665 1507286 1491423 1473314 1455394 1439713 1426960 1416465 1406845 1397066
62034 1397066 1387308 1378770 1372657 1369640 1370069 1373958 1380663 1389261 1399506 1411795 1426023 1441239 1456847
62021 1456847 1473447 1492033 1512976 1536230 1561824 1589606 1619084 1650049 1682669 1716435 1749984
62010 1749984 1782945 1817159 1854818 1895740 1937653 1978889 2019524 2059863 2099066 2135541 2167654
61999 2167654 2193690 2211988 2221811 2223722 2218850 2208098 2192037 2170846 2144102 2111161 2072042 2027569
$$ packed form
62083B062101m8474m7097m5518m2970l8762l3551k8906k5579k2848j9799j6723
62072A691874j4733j4356j4947j5430j5183j4174j2612j0591q126n445l191j897
62060A561189j171J03K368M599N434M729L204R97k248n866q083q051o960o458
62046A543786o875p790r456j2379j5863j8109j7920j5681j2753j0495r620r779
62034A397066r758q538o113l017M29L889O705Q598J0245J2289J4228J5216J5608
62021A456847J6600J8586K0943K3254K5594K7782K9478L0965L2620L3766L3549
62010A749984L2961L4214L7659M0922M1913M1236M0635M0339L9203L6475L2113
61999B167654K6036J8298R823J911m872j0752j6061k1191k6744l2941l9119m4473
$$ plain form
61987 2027569 1978638 1925984 1870876 1815233 1760411 1706312 1652310 1598943 1548053 1501132 1457919
61976 1457919 1417000 1377718 1341149 1308931 1281252 1256392 1232306 1208362 1185577 1165611 1149648
61965 1149648 1137466 1127072 1115718 1101926 1086357 1070417 1054494 1038112 1021283 1004962 990290
61954 990290 977932 967883 959418 951602 944328 938332 933701 929198 924079 919749 918208 919342 921332 923432
61940 923432 926492 930589 934110 935837 936265 935998 934441 931315 928073 926110 924342 920235 912926 903908 894724
61925 894724 885402 875454 865233 855704 847461 840413 834052 827799 821479 815790 811936 810470 810516 810378 808902
61910 808902 806257 803581 802075 802312 804025 806225 807781 808367 808918 810717 813899 817374 820426 823708 828136
61895 828136 833540 839306 845757 853683 862687 871401 879724 889641 903085 919749 937766 956089 975553
$$ packed form
61987B027569m8931n2654n5108n5643n4822n4099n4002n3367n0890m6921m3213
61976A457919m0919l9282l6569l2218k7679k4860k4086k3944k2785j9966j5963
61965A149648j2182j0394j1354j3792j5569j5940j5923j6382j6829j6321j4672
61954I90290j2358j0049q465p816p274n996m631m503n119m330j541J134J990K100
61940I23432L060M097L521J727M28k67j557l126l242j963j768m107p309r018r184
61925H94724r322r948j0221r529q243p048o361o253o320n689l854j466M6j38j476
61910H08902k645k676j506K37J713K200J556N86N51J799L182L475L052L282M428
61895H28136N404N766O451P926R004Q714Q323R917J3444J6664J8017J8323J9464
$$ plain form
61882 975553 997702 1023032 1050372 1077879 1104709 1131544 1159177 1186898 1212925 1236280 1257467
61871 1257467 1277364 1296307 1314273 1330973 1345416 1356249 1362946 1366040 1366067 1363266 1358648 1354224 1351418
61858 1351418 1349949 1348898 1348191 1348531 1350659 1355352 1363414 1374932 1389114 1405384 1423827 1443837 1463220
61845 1463220 1479666 1492556 1502408 1509251 1512725 1513305 1512099 1509427 1504660 1497485 1488440 1478122 1466670
61832 1466670 1454348 1442068 1430999 1421636 1413165 1403840 1392552 1380101 1368099 1356397 1342790 1325960
61820 1325960 1307443 1289457 1271932 1253353 1233822 1215345 1199262 1185316 1173513 1165059 1160669 1159245
61808 1159245 1159025 1159240 1160131 1162328 1166883 1175116 1187640 1203790 1222297 1242203 1263181 1285745 1311199
61795 1311199 1340511 1373151 1407949 1445086 1485818 1529774 1574022 1615847 1655390 1694344 1732876
$$ packed form
61882I75553K2149K5330K7340K7507K6830K6835K7633K7721K6027K3355K1187
61871A257467J9897J8943J7966J6700J4443J0833O697L094K7k801m618m424k806
61858A351418j469j051p07L40K128M693Q062J1518J4182J6270J8443K0010J9383
61845A463220J6446J2890R852O843L474N80j206k672m767p175r045j0318j1452
61832A466670j2322j2280j1069r363q471r325j1288j2451j2002j1702j3607j6830
61820A325960j8517j7986j7525j8579j9531j8477j6083j3946j1803q454m390j424
61808A159245k20K15Q91K197M555Q233J2524J6150J8507J9906K0978K2564K5454
61795A311199K9312L2640L4798L7137M0732M3956M4248M1825L9543L8954L8532
$$ plain form
61784 1732876 1769058 1800730 1826546 1845573 1857354 1862664 1863152 1859943 1853340 1844078 1834015 1825130 1818317
61771 1818317 1813568 1810977 1811297 1815611 1824483 1837131 1851393 1864862 1876145 1884790 1890204 1891302 1887340
61758 1887340 1878509 1865359 1847976 1826067 1799485 1768489 1733922 1697487 1661325 1626668 1593184
61747 1593184 1560201 1528169 1498068 1469616 1441287 1412375 1383956 1357238 1332019 1307640 1284612
61736 1284612 1264080 1246167 1230190 1216254 1205125 1196251 1187447 1177343 1167096 1158750 1152553 1146839
61724 1146839 1140101 1132375 1124908 1119219 1116222 1115468 1115271 1114144 1112096 1110165 1109043 1108755 1109363 1111165 1114232
61709 1114232 1118506 1124358 1132292 1141875 1151679 1160783 1169972 1181110 1195350 1212011 1228962 1244034 1256310
61696 1256310 1266166 1274038 1279353 1280885 1278008 1271274 1261890 1250973 1239058 1225894 1210781 1193658 1175891
$$ packed form
61784A732876L6182L1672K5816J9027J1781N310M88l209o603r262j0063q885o813
61771A818317m749k591L20M314Q872J2648J4262J3469J1283Q645N414J098l962
61758A887340q831j3150j7383k1909k6582l0996l4567l6435l6162l4657l3484
61747A593184l2983l2032l0101k8452k8329k8912k8419k6718k5219k4379k3028
61736A284612k0532j7913j5977j3936j1129q874q804j0104j0247q346o197n714
61724A146839o738p726p467n689k997p54j97j127k048j931j122k88O08J802L067
61709A114232M274N852P934R583R804R104R189J1138J4240J6661J6951J5072J2276
61696A256310R856P872N315J532k877o734r384j0917j1915j3164j5113j7123j7767
$$ plain form
61683 1175891 1159443 1145122 1131991 1118651 1104825 1091549 1080101 1070822 1062901 1055367 1048422 1043450
61671 1043450 1041235 1040455 1038749 1035416 1032356 1031912 1034314 1037648 1039932 1040582 1040026 1038694 1036823 1034872 1033471
61656 1033471 1032823 1032488 1032018 1031437 1030645 1028572 1023656 1015411 1005048 994320 984225 975030 966875 959730
61642 959730 953059 946120 938561 930519 922427 914953 908664 903310 897844 891579 884955 878841 873583 869123
61628 869123 865291 861345 856054 849231 842561 837796 834619 831442 827824 824680 822447 820604 819002 818024
61614 818024 817171 815100 811599 808122 805809 804338 803368 803538 805036 806650 807634 809383 813710 820239 827061
61599 827061 833370 839777 846326 851984 856250 859651 862239 863069 861992 860799 861475 863973 866729 869032 871795
61584 871795 875934 881020 886052 890871 896036 901511 906344 909828 912246 913998 914630 913457 910719 907236
$$ packed form
61683A175891j6448j4321j3131j3340j3826j3276j1448r279p921p534o945m972
61671A043450k215p80j706l333l060m44K402L334K284O50n56j332j871j951j401
61656A033471o48l35m70n81p92k073m916q245j0363j0728j0095r195q155p145
61642I59730o671o939p559q042q092p474o289n354n466o265o624o114n258m460
61628H69123l832l946n291o823o670m765l177l177l618l144k233j843j602r78
61614H18024q53k071l501l477k313j471r70J70J498J614R84J749M327O529O822
61599H27061O309O407O549N658M266L401K588Q30j077j193O76K498K756K303K763
61584H71795M139N086N032M819N165N475M833L484K418J752O32j173k738l483
$$ plain form
61570 907236 903203 898342 893116 888430 883826 877389 868279 858281 849802 843223 837419 832088 827931 824762
61556 824762 821201 816643 812192 808923 806111 801901 795144 786049 775711 765666 757462 751663 747224 742335
61542 742335 736053 728932 722146 716320 711172 706041 700600 695151 690255 686193 682860 680023 677398 674594
61528 674594 671435 668398 666220 664852 663322 661040 658728 657512 657414 657482 657237 657154 657680 658586 659559 660661 661678
61511 661678 661699 660103 657690 656181 656697 659164 662914 667183 671201 674595 677900 682132 687652 693782 699415
61496 699415 703570 705582 705590 704932 705220 706726 708373 709423 710331 711616 712899 713650 714077 714645 715544 717313 721016
61479 721016 726722 732634 736953 739954 742822 745056 744889 742375 740128 740253 741888 742641 741465 739146 736661
61464 736661 734122 731182 727795 724446 721907 720733 720991 722529 725176 728339 730830 731837 731839 731749 731494 730593
$$ packed form
61570I07236m033m861n226m686m604o437r110r998q479o579n804n331m157l169
61556H24762l561m558m451l269k812m210o757r095j0338j0045q204n799m439m889
61542G42335o282p121o786n826n148n131n441n449m896m062l333k837k625k804
61528F74594l159l037k178j368j530k282k312j216r8O8k45q3N26R06R73J102J017
61511F61678K1j596k413j509N16K467L750M269M018L394L305M232N520O130N633
61496F99415M155K012Qo58K88J506J647J050R08J285J283P51M27N68Q99J769L703
61479G21016N706N912M319L001K868K234j67k514k247J25J635P53j176k319k485
61464G36661k539k940l387l349k539j174K58J538K647L163K491J007Kr0k55r01
$$ plain form
61448 730593 730013 731877 736824 742928 747984 751867 755914 760984 767043 773851 781065 788215 795427 803598
61434 803598 812975 822151 829392 834502 838420 841514 843391 844142 844560 845153 845900 846930 848516 850335 851687
61419 851687 852550 853469 854248 853750 851421 848129 844971 841971 838649 835331 833047 832306 832558 832863 832523 831032
61403 831032 827963 823380 818281 814214 812196 811990 812533 812980 813151 813107 812777 812234 811939 812313 813236 814331 815626
61386 815626 817621 820716 824885 829817 835084 840212 844929 849371 853804 858137 862009 865347 868547 871967
61372 871967 875494 878799 881880 885138 888934 893213 897737 902660 908587 915741 923150 929173 933125 936061
61358 936061 939491 943408 946147 946339 944650 943086 942665 942198 939657 934589 928796 924608 922876 922820 923436 924508
61342 924508 926247 928443 930305 931175 931329 931933 933915 936849 939331 940648 941666 943813 947666 952819 958466
$$ packed form
61448G30593n80J864M947O104N056L883M047N070O059O808P214P150P212Q171
61434H03598R377R176P241N110L918L094J877P51M18N93P47J030J586J819J352
61419H51687Q63R19P79m98k329l292l158l000l322l318k284p41K52L05l40j491
61403H31032l069m583n099m067k018k06N43M47J71m4l30n43k95L74R23J095J295
61386H15626J995L095M169M932N267N128M717M442M433M333L872L338L200L420
61372H71967L527L305L081L258L796M279M524M923N927P154P409O023L952K936
61358I36061L430L917K739J92j689j564m21m67k541n068n793m188j732n6O16J072
61342I24508J739K196J862Q70J54O04J982K934K482J317J018K147L853N153N647
$$ plain form
61327 958466 963433 966395 967125 967206 968420 970729 972946 974950 977537 980124 980714 978877 977037 977617 980376
61312 980376 983809 987691 992397 996776 998966 999051 998918 999354 999136 997398 995169 993742 992990 992451 993048 996302
61296 996302 1002254 1009334 1016241 1023000 1030016 1036985 1043208 1048481 1053107 1057314 1061226 1065374 1070500 1076489
61282 1076489 1082025 1085958 1088795 1092076 1096310 1100299 1102720 1103632 1104023 1104516 1105127 1105822 1106683 1107717 1109030
61267 1109030 1110944 1113480 1115896 1117223 1117235 1116772 1117400 1120889 1128209 1138289 1148189 1155468 1160456 1165667 1173123
61252 1173123 1182833 1193768 1205533 1218876 1234976 1254276 1275606 1296399 1314252 1328420 1339505
61241 1339505 1347841 1352770 1353627 1350939 1346232 1340744 1334490 1326591 1316550 1305245 1294477 1285338 1277095
61228 1277095 1267895 1256637 1244100 1232343 1222940 1215663 1208884 1201488 1194171 1188514 1185167 1183738 1184227
$$ packed form
61327I58466M967K962P30Q1J214K309K217K004K587K587N90j837j840N80K759
61312I80376L433L882M706M379K190Q5j33M36k18j738k229j427p52n39N97L254
61296I96302N952P080O907O759P016O969O223N273M626M207L912M148N126N989
61282A076489N536L933K837L281M234L989K421R12L91M93O11O95Q61J034J313
61267A109030J914K536K416J327J2m63O28L489P320J0080R900P279M988N211P456
61252A173123R710J0935J1765J3343J6100J9300K1330K0793J7853J4168J1085
61241A339505Q336M929Q57k688m707n488o254p899j0041j1305j0768r139q243
61228A277095r200j1258j2537j1757r403p277o779p396p317n657l347j429M89
$$ plain form
61215 1184227 1187147 1191773 1195617 1196772 1196105 1196142 1198405 1202787 1208863 1216315 1224230 1231480 1238225 1246033 1256021
61200 1256021 1267509 1278918 1289375 1299003 1307996 1315911 1321924 1325708 1328003 1330095 1332583 1334920 1336316
61187 1336316 1336657 1336226 1335040 1332990 1330286 1327285 1324167 1321210 1318855 1317010 1314867 1312064 1309434 1307778
61173 1307778 1306522 1304749 1303128 1303502 1306585 1311298 1316546 1322570 1330129 1339168 1348651 1357263 1364256 1370189
61159 1370189 1376751 1385108 1394430 1402770 1409333 1415108 1421359 1428415 1435986 1443703 1451132 1457981 1464430 1470603
61145 1470603 1475876 1479645 1482717 1486868 1492985 1500759 1510287 1522539 1537847 1555235 1573849 1593732 1614267
61132 1614267 1632978 1647165 1656250 1661673 1664989 1666839 1667180 1665514 1661079 1653581 1643646 1632115 1619335
61119 1619335 1605686 1592302 1580309 1569438 1558161 1545330 1531213 1516854 1502857 1488974 1474708
$$ packed form
61215A184227K920M626L844J155o67L7K263M382O076P452P915P250O745P808R988
61200A256021J1488J1409J0457R628Q993P915O013L784K295K092K488K337J396
61187A336316L41m31j186k050k704l001l118k957k355j845k143k803k630j656
61173A307778j256j773j621L74L083M713N248O024P559R039R483Q612O993N933
61159A370189O562Q357R322Q340O563N775O251P056P571P717P429O849O449O173
61145A470603N273L769L072M151O117P774R528J2252J5308J7388J8614J9883K0535
61132A614267J8711J4187R085N423L316J850L41j666m435p498r935j1531j2780
61119A619335j3649j3384j1993j0871j1277j2831j4117j4359j3997j3883j4266
$$ plain form
61108 1474708 1460133 1445934 1432515 1419236 1405071 1390017 1375317 1362138 1350603 1340360 1331410
61097 1331410 1323912 1317713 1312750 1309558 1308712 1309896 1312077 1314574 1317402 1320470 1322853 1323101 1320184 1314127
61083 1314127 1305975 1297283 1289570 1283968 1281025 1280630 1282189 1285020 1288685 1293116 1298697 1306198 1316178 1328272
61069 1328272 1341558 1355906 1372469 1392415 1415630 1441154 1468444 1497596 1528719 1561812 1596955
61058 1596955 1633943 1672042 1710772 1750569 1791897 1834135 1876197 1917851 1959365 2000209 2039353
61047 2039353 2076687 2112910 2148141 2181864 2214115 2245123 2273651 2297395 2315665 2330302 2343313
61036 2343313 2354918 2364631 2372859 2380275 2386638 2391450 2395200 2398952 2403105 2407285 2411040 2414053 2416121 2417396
61022 2417396 2418218 2418410 2417356 2414976 2411697 2407112 2399837 2389387 2377196 2364836 2352098 2337822 2321898
$$ packed form
61108A474708j4575j4199j3419j3279j4165j5054j4700j3179j1535j0243q950
61097A331410p498o199m963l192q46J184K181K497K828L068K383K48k917o057
61083A314127q152q692p713n602k943l95J559K831L665M431N581P501R980J2094
61069A328272J3286J4348J6563J9946K3215K5524K7290K9152L1123L3093L5143
61058A596955L6988L8099L8730L9797M1328M2238M2062M1654M1514M0844L9144
61047B039353L7334L6223L5231L3723L2251L1008K8528K3744J8270J4637J3011
61036B343313J1605R713Q228P416O363M812L750L752M153M180L755L013K068J275
61022B417396Q22J92j054k380l279m585p275j0450j2191j2360j2738j4276j5924
$$ plain form
61009 2321898 2305334 2288807 2272328 2256149 2240987 2227170 2214086 2200718 2186638 2172725 2160749
60998 2160749 2151717 2144636 2137654 2130441 2124539 2121401 2121522 2125742 2135646 2151552 2171487 2193539 2218198
60985 2218198 2246925 2279382 2313899 2350382 2391095 2438346 2492592 2553000 2618853 2690048 2766795
60974 2766795 2849210 2937049 3030087 3129073 3236000 3352871 3480177 3616836 3761524 3914180
60964 3914180 4076632 4251787 4441881 4648030 4872292 5119437 5394917 5701208 6038060
60955 6038060 6406605 6811234 7257226 7749422 8294632 8903086 9585915 10353498 11218073
60946 11218073 12195745 13304273 14562120 15992730 17627105 19499062 21640064 24075382
60938 24075382 26801594 29732793 32655214 35260845 37273365 38580376 39265934 39532020
$$ packed form
61009B321898j6564j6527j6479j6179j5162j3817j3084j3368j4080j3913j1976
60998B160749r032p081o982p213n902l138J21M220R904J5906J9935K2052K4659
60985B218198K8727L2457L4517L6483M0713M7251N4246O0408O5853P1195P6747
60974B766795Q2415Q7839R3038R8986J06927J16871J27306J36659J44688J52656
60964C914180J62452J75155J90094K06149K24262K47145K75480L06291L36852
60955F038060L68545M04629M45992M92196N45210O08454O82829P67583Q64575
60946A1218073R77672J108528J257847J430610J634375J871957K141002K435318
60938B4075382K726212K931199K922421K605631K012520J307011O85558K66086
$$ plain form
60930 39532020 39596914 39645819 39815538 40153999 40560362 40784244 40530733 39609401 38013826
60921 38013826 35885935 33422570 30805869 28181520 25657982 23305317 21157792 19225057
60913 19225057 17503014 15977541 14626839 13428078 12363462 11419897 10585398 9847796
60905 9847796 9195068 8614666 8093501 7620293 7187552 6790404 6424673 6087124 5776125
60896 5776125 5490375 5227595 4985533 4763320 4560348 4374330 4201537 4038475 3882501
60887 3882501 3731764 3585960 3446754 3316121 3194216 3079406 2969859 2864329 2762061
60878 2762061 2663193 2569065 2481105 2399417 2322985 2250895 2182615 2117612 2055740 1997701 1944066
60867 1944066 1893892 1845431 1798357 1754282 1714704 1679137 1645713 1613148 1581665 1552308 1525719
$$ packed form
60930C9532020O4894M8905J69719L38461M06363K23882k53511r21332j595575
60921C8013826k127891k463365k616701k624349k523538k352665k147525j932735
60913A9225057j722043j525473j350702j198761j064616r43565q34499p37602
60905I847796o52728n80402n21165m73208m32741l97148l65731l37549l10999
60896E776125k85750k62780k42062k22213k02972j86018j72793j63062j55974
60887C882501j50737j45804j39206j30633j21905j14810j09547j05530j02268
60878B762061r8868r4128q7960q1688p6432p2090o8280o5003o1872n8039n3635
60867A944066n0174m8461m7074m4075l9578l5567l3424l2565l1483k9357k6589
$$ plain form
60856 1525719 1501426 1478155 1454915 1431994 1410781 1392467 1376776 1362062 1346754 1330725 1315146
60845 1315146 1300982 1287897 1274840 1261396 1248121 1235712 1224270 1213399 1202616 1191612 1180270
60834 1180270 1168309 1154814 1138735 1120510 1102795 1088555 1078357 1070269 1062292 1053918 1045319 1036357
60822 1036357 1027074 1018236 1010553 1003750 997030 990090 983263 977017 971807 968107 966167 965849 966882 969010
60808 969010 971778 974572 977091 979453 981740 983896 986243 989597 994533 1000769 1007325 1013030 1016986 1019039
60794 1019039 1019848 1020115 1019942 1019447 1019541 1021026 1023031 1023507 1021460 1017566 1012469 1005826 997588 988821 980304 971336
60778 971336 960982 949745 939065 929776 921827 914715 907260 897802 886005 874085 864938 859098 854546
60765 854546 849353 843376 837280 831077 824283 816949 809979 804372 800161 796097 790719 784048 777812 773552
$$ packed form
60856A525719k4293k3271k3240k2921k1213j8314j5691j4714j5308j6029j5579
60845A315146j4164j3085j3057j3444j3275j2409j1442j0871j0783j1004j1342
60834A180270j1961j3495j6079j8225j7715j4240j0198q088p977q374q599q962
60822A036357r283q838p683o803o720o940o827o246n210l700j940l18J033K128
60808I69010K768K794K519K362K287K156K347L354M936O236O556N705L956K053
60794A019039Q09K67j73m95R4J485K005M76k047l894n097o643q238q767q517q968
60778I71336j0354j1237j0680r289p949p112p455r458j1797j1920r147n840m552
60765H54546n193n977o096o203o794p334o970n607m211m064n378o671o236m260
$$ plain form
60751 773552 770843 768010 764290 760539 757911 756560 755830 755144 754381 753602 752750 751779 751086 751527 753514 756236
60735 756236 758407 759812 761278 762945 763684 762957 762229 763328 765941 768005 768338 767681 767091 766578 765754 764898
60719 764898 764580 764553 763634 760800 756335 751837 748801 747036 744769 740696 735622 731698 730300 731155 733086
60704 733086 734867 735554 734961 734021 733974 735006 736115 736437 736097 735699 735660 736300 737886 740150 742309 743964 745523
60687 745523 747270 748561 748655 747981 747661 747799 747158 744865 741619 738575 735626 731765 727054 723238 721960 722956
60671 722956 724486 725220 725295 725822 727802 731272 735058 737518 737999 737436 737224 737744 738372 738580 738458 738477 739375 741893
60653 741893 745736 749133 750495 750411 750806 752172 753050 752538 751669 751451 751023 749120 746287 744067 742476 739934
60637 739934 735696 731022 727574 725617 724230 722618 720720 718897 717430 716347 715688 715846 717288 719817 722478
$$ packed form
60751G73552k709k833l720l751k628j351p30o86p63p79q52r71o93M41J987K722
60735G56236K171J405J466J667P39p27p28J099K613K064L33o57n90n13q24q56
60719G64898l18k7r19k834m465m498l036j765k267m073n074l924j398Q55J931
60704G33086J781O87n93r40m7J032J109L22l40l98l9O40J586K264K159J655J559
60687G45523J747J291R4o74l20J38o41k293l246l044k949l861m711l816j278R96
60671G22956J530P34P5N27J980L470L786K460M81n63k12N20O28K08j22J9Q98K518
60653G41893L843L397J362q4L95J366Q78n12q69k18m28j903k833k220j591k542
60637G39934m238m674l448j957j387j612j898j823j467j083o59J58J442K529K661
$$ plain form
60622 722478 724507 726029 727557 729312 731434 734313 738055 742009 745439 748314 750738 752082 751620 749876
60608 749876 748287 747373 746114 743424 739572 735738 732635 730055 727574 725362 724216 724735 726480 728292 729761
60593 729761 732021 736471 742743 748615 752101 753164 753234 753526 754189 754713 754527 753154 750277 746135 741823 738668
60577 738668 736984 735738 733933 732036 731293 731691 731559 729608 726642 724649 724780 726854 730342 734894 739958
60562 739958 744612 747978 749620 749750 749345 749699 751299 753275 754358 754230 753568 753085 753016 753246 753359 752763 751437
60545 751437 750504 751418 754493 758648 762572 765714 768193 770357 772625 775356 778606 782069 785216 787504 788775
60530 788775 789766 791891 795975 801249 805990 809179 811351 813973 818178 823822 829447 833475 835900 838586
60516 838586 843565 851232 860513 870340 880421 890865 901905 914080 928098 944256 962066 980350
$$ packed form
60622G22478K029J522J528J755K122K879L742L954L430K875K424J344m62j744
60608G49876j589r14j259k690l852l834l103k580k481k212j146N19J745J812J469
60593G29761K260M450O272N872L486J063P0K92O63N24j86j373k877m142m312l155
60577G38668j684j246j805j897p43L98j32j951k966j993J31K074L488M552N064
60562G39958M654L366J642J30m05L54J600J976J083j28o62m83o9K30J13n96j326
60545G51437r33R14L075M155L924L142K479K164K268K731L250L463L147K288J271
60530G88775R91K125M084N274M741L189K172K622M205N644N625M028K425K686
60516H38586M979P667R281R827J0081J0444J1040J2175J4018J6158J7810J8284
$$ plain form
60504 980350 997667 1013066 1026709 1039285 1050423 1058243 1061103 1059434 1055277 1050489 1046197 1043431 1043039
60491 1043039 1044955 1048515 1053659 1061001 1070641 1081876 1094430 1109130 1126846 1147391 1170026 1194626
60479 1194626 1221814 1252153 1285597 1321580 1359229 1397451 1435072 1470998 1504156 1533154 1556162
60468 1556162 1571508 1578830 1579429 1575008 1566068 1552128 1533584 1512609 1491906 1473175 1457053 1443666
60456 1443666 1432632 1423238 1415471 1410422 1409008 1410883 1415305 1422530 1433468 1448545 1467828 1491740 1520546
60443 1520546 1553570 1590248 1631711 1680073 1736077 1798539 1865937 1937200 2010736 2084120 2155271
60432 2155271 2222936 2285620 2341296 2389118 2430641 2468286 2502699 2532120 2554065 2567052 2570525
60421 2570525 2563481 2543734 2509102 2459330 2396256 2321987 2238001 2146710 2052707 1960950 1874058
$$ packed form
60504I80350J7317J5399J3643J2576J1138P820K860j669m157m788m292k766l92
60491A043039J916L560N144P342R640J1235J2554J4700J7716K0545K2635K4600
60479A194626K7188L0339L3444L5983L7649L8222L7621L5926L3158K8998K3008
60468A556162J5346P322N99m421q940j3940j8544k0975k0703j8731j6122j3387
60456A443666j1034r394p767n049j414J875M422P225J0938J5077J9283K3912K8806
60443A520546L3024L6678M1463M8362N6004O2462O7398P1263P3536P3384P1151
60432B155271O7665O2684N5676M7822M1523L7645L4413K9421K1945J2987L473
60421B570525p044j9747l4632m9772o3074p4269q3986r1291r4003r1757q6892
$$ plain form
60410 1874058 1792462 1716523 1646912 1583324 1524723 1471101 1423436 1381677 1344261 1309888 1278258
60399 1278258 1248773 1220213 1192332 1166169 1142110 1119304 1097761 1079194 1064525 1052202 1040376
60388 1040376 1029214 1019316 1009338 997578 985126 974979 968158 962859 957647 953304 950724 948763 945425
60375 945425 940188 934101 928172 922622 917369 912413 907766 903538 900138 898064 897331 897190 896452 894288 890971
60360 890971 887855 886390 886941 888468 889334 888558 886580 884937 884995 886899 889900 893617 898485 904761 911524
60345 911524 917088 920260 921116 920891 921408 924160 929342 935645 941341 945719 949596 954548 961571 970107 978290
60330 978290 984467 988532 991628 994751 998235 1002437 1007915 1014474 1020815 1025797 1029703 1033767 1038790 1044614
60316 1044614 1050596 1056106 1060836 1064970 1068801 1072049 1074151 1075572 1078108 1083182 1090262 1097641 1104310 1110381
$$ packed form
60410A874058q1596p5939o9611o3588n8601n3622m7665m1759l7416l4373l1630
60399A278258k9485k8560k7881k6163k4059k2806k1543j8567j4669j2323j1826
60388A040376j1162r898r978j1760j2452j0147o821n299n212m343k580j961l338
60375I45425n237o087n929n550n253m956m647m228l400k074p33j41p38k164l317
60360H90971l116j465N51J527Q66p76j978j643N8J904L001L717M868O276O763
60345I11524N564L172Q56k25N17K752N182O303N696M378L877M952P023Q536Q183
60330I78290O177M065L096L123L484M202N478O559O341M982L906M064N023N824
60316A044614N982N510M730M134L831L248K102J421K536N074P080P379O669O071
$$ plain form
60302 1110381 1116188 1122010 1128462 1135944 1143628 1150121 1155641 1162643 1173449 1187602 1202155 1214380 1223760
60289 1223760 1231454 1238436 1244378 1248082 1248625 1245911 1240291 1232062 1221724 1210594 1200601 1193027 1187448 1182189
60275 1182189 1175852 1168311 1160341 1152702 1145789 1139741 1134266 1128484 1121580 1113857 1106619 1100738 1095804 1091089
60261 1091089 1086864 1084256 1084247 1087356 1093878 1103613 1115580 1128759 1143079 1158881 1175515 1191342 1205351
60248 1205351 1218099 1230907 1244711 1259762 1275711 1291655 1306590 1319935 1331131 1338869 1341533 1338521
60236 1338521 1330383 1317637 1300429 1279656 1257341 1235331 1214312 1194554 1176719 1161236 1147501
60225 1147501 1134449 1121622 1109274 1097951 1088291 1080566 1074008 1067190 1059564 1051944 1045061 1038456 1031500
60212 1031500 1024689 1019043 1014690 1010874 1006947 1002655 997945 993236 989492 987237 985863 984581 983568 983390
$$ packed form
60302A110381N807N822O452P482P684O493N520P002J0806J4153J4553J2225R380
60289A223760P694O982N942L704N43k714n620q229j0338j1130r993p574n579n259
60275A182189o337p541p970p639o913o048n475n782o904p723p238n881m934m715
60261A091089m225k608rL109O522R735J1967J3179J4320J5802J6634J5827J4009
60248A205351J2748J2808J3804J5051J5949J5944J4935J3345J1196P738K664l012
60236A338521q138j2746j7208k0773k2315k2010k1019j9758j7835j5483j3735
60225A147501j3052j2827j2348j1323r660p725o558o818p626p620o883o605o956
60212A031500o811n646m353l816l927m292m710m709l744k255j374j282j013j78
$$ plain form
60198 983390 983834 984276 984844 986119 987834 988909 988904 988601 989021 990520 992915 995842 998810 1001403 1003517 1005157
60182 1005157 1006270 1007222 1009013 1012164 1015514 1017068 1016292 1014897 1015031 1017197 1020225 1022976 1025738 1029973 1036784
60167 1036784 1045726 1055302 1064558 1073627 1082632 1090942 1098272 1105847 1115426 1127338 1140451 1153956 1168165
60154 1168165 1183278 1198321 1211984 1224100 1235831 1248499 1262466 1276919 1290417 1301732 1310553
60143 1310553 1317777 1325173 1334328 1345245 1355927 1363939 1368738 1372103 1376058 1380778 1384756 1386458 1385451
60130 1385451 1382394 1378487 1374569 1370384 1365060 1358550 1352070 1346682 1342083 1337311 1332081 1326938 1322670 1320172
60116 1320172 1320124 1321999 1323965 1324586 1324057 1323051 1321203 1317923 1313963 1310621 1307682 1303622 1297858 1291450 1285533
60101 1285533 1280423 1276376 1273747 1271905 1269281 1265308 1261435 1259585 1260225 1262400 1264915 1267003 1268496 1269879
$$ packed form
60198I83390M44M42N68J275J715J075nl03M20J499K395K927K968K593K114J640
60182A005157J113R52J791L151L350J554p76j395J34K166L028K751K762M235O811
60167A036784Q942R576R256R069R005Q310P330P575R579J1912J3113J3505J4209
60154A168165J5113J5043J3663J2116J1731J2668J3967J4453J3498J1315Q821
60143A310553P224P396R155J0917J0682Q012M799L365L955M720L978J702j007
60130A385451l057l907l918m185n324o510o480n388m599m772n230n143m268k498
60116A320172m8J875J966O21n29j006j848l280l960l342k939m060n764o408n917
60101A285533n110m047k629j842k624l973l873j850O40K175K515K088J493J383
$$ plain form
60087 1269879 1271742 1273870 1275423 1276273 1277505 1280217 1284400 1289379 1294724 1300297 1305907 1311367 1316510 1320996
60073 1320996 1324735 1328799 1335024 1344005 1353957 1362305 1368100 1372297 1376102 1379967 1384217 1389725 1397333 1406734
60059 1406734 1416415 1425004 1432692 1441031 1451135 1462328 1472915 1482120 1490648 1499307 1507736 1514886 1520337
60046 1520337 1524695 1528844 1533153 1537411 1541262 1544522 1547068 1548640 1549058 1548660 1548106 1547556 1546502 1544652 1542472
60031 1542472 1540375 1537901 1534282 1529337 1523035 1514737 1503898 1491248 1478068 1464399 1449224 1432547
60019 1432547 1416010 1401118 1388021 1376416 1366180 1356275 1344435 1329472 1313163 1298472 1286176
60008 1286176 1274461 1261627 1247877 1234359 1221802 1210636 1201464 1194522 1189078 1184063 1179132 1174668
59996 1174668 1170921 1167658 1164645 1161901 1159275 1156188 1152265 1148157 1145369 1145187 1147892 1152922 1159395 1166330
$$ packed form
60087A269879J863K128J553Q50J232K712M183M979N345N573N610N460N143M486
60073A320996L739M064O225Q981R952Q348N795M197L805L865M250N508P608R401
60059A406734R681Q589P688Q339J0104J1193J0587R205Q528Q659Q429P150N451
60046A520337M358M149M309M258L851L260K546J572M18l98n54n50j054j850k180
60031A542472k097k474l619m945o302q298j0839j2650j3180j3669j5175j6677
60019A432547j6537j4892j3097j1605j0236r905j1840j4963j6309j4691j2296
60008A286176j1715j2834j3750j3518j2557j1166r172o942n444n015m931m464
59996A174668l747l263l013k744k626l087l923m108k788j82K705N030O473O935
$$ plain form
59982 1166330 1172775 1178111 1182241 1185396 1187883 1190069 1192191 1193934 1194479 1193277 1190600 1187124 1183200 1178766
59968 1178766 1173599 1167417 1160126 1152250 1144568 1136805 1127370 1115249 1101784 1089634 1080145 1072653 1066179
59955 1066179 1060682 1056459 1053354 1050990 1049004 1046658 1043024 1038082 1033019 1028922 1025634 1022310 1018574 1014555
59941 1014555 1010260 1005629 1001050 997196 994309 992124 990638 990614 992964 997570 1002957 1007529 1011222 1015521
59927 1015521 1021524 1028375 1034210 1038437 1042325 1047261 1052966 1057591 1059154 1056936 1052089 1046980 1043350 1040932
59913 1040932 1038294 1035001 1032165 1030763 1030372 1030119 1030069 1030888 1032547 1034228 1035414 1036444 1037920 1040036 1042512
59898 1042512 1044803 1046338 1046878 1046744 1046467 1046141 1045415 1044256 1043429 1043749 1044942 1045742 1045473 1045082 1046052 1048491 1051120
59881 1051120 1053148 1055232 1058147 1061391 1063870 1065447 1067026 1069450 1073058 1078061 1084567 1092375 1101299 1111450
$$ packed form
59982A166330O445N336M130L155K487K186K122J743N45j202k677l476l924m434
59968A178766n167o182p291p876p682p763r435j2121j3465j2150r489p492o474
59955A066179n497m223l105k364j986k346l634m942n063m097l288l324l736m019
59941A014555m295m631m579l854k887k185j486k4K350M606N387M572L693M299
59927A015521O003O851N835M227L888M936N705M625J563k218m847n109l630k418
59913A040932k638l293k836j402l91k53n0Q19J659J681J186J030J476K116K476
59898A042512K291J535N40j34k77l26p26j159q27L20J193Q00k69l91R70K439K629
59881A051120K028K084K915L244K479J577J579K424L608N003O506P808Q924J0151
$$ plain form
59867 1111450 1122523 1133163 1141880 1148422 1153460 1157208 1159377 1160489 1162094 1165314 1169786 1174197 1177354
59854 1177354 1178873 1179692 1182010 1187855 1197331 1208602 1219394 1228015 1233447 1235677 1235951 1235545 1234162 1230644
59840 1230644 1225354 1220500 1217637 1215959 1213635 1209875 1205190 1200764 1198264 1199252 1203766 1209933 1215681 1220398
59826 1220398 1224628 1229000 1234146 1240905 1249657 1259732 1270018 1279849 1289005 1297523 1305980 1315309 1325633
59813 1325633 1335702 1343980 1349921 1353831 1356143 1357372 1358306 1359647 1361677 1364469 1367913 1371361 1374080 1376450
59799 1376450 1379966 1385532 1392411 1399284 1405563 1411169 1415958 1420164 1424838 1431159 1439761 1450988 1464746
59786 1464746 1479367 1491631 1499060 1501680 1500865 1497464 1492167 1486724 1482976 1480788 1478244 1473991 1468371 1462283
59772 1462283 1455931 1448838 1440452 1430745 1420810 1412510 1406636 1401573 1394717 1385191 1374441 1364456 1356473 1351339
$$ packed form
59867A111450J1073J0640Q717O542N038L748K169J112J605L220M472M411L157
59854A177354J519Q19K318N845R476J1271J0792Q621N432K230K74m06j383l518
59840A230644n290m854k863j678k324l760m685m426k500R88M514O167N748M717
59826A220398M230M372N146O759Q752J0075J0286R831R156Q518Q457R329J0324
59813A325633J0069Q278N941L910K312J229R34J341K030K792L444L448K719K370
59799A376450L516N566O879O873O279N606M789M206M674O321Q602J1227J3758
59786A464746J4621J2264P429K620q15l401n297n443l748k188k544m253n620o088
59772A462283o352p093q386r707r935q300n874n063o856r526j0750r985p983n134
$$ plain form
59758 1351339 1349685 1351032 1353598 1355815 1357667 1359981 1362671 1364378 1363871 1361329 1357906 1354259 1350082 1345246
59744 1345246 1340743 1337732 1335914 1333771 1330452 1326491 1322410 1317676 1311678 1304935 1298550 1292931 1287636 1282107
59730 1282107 1276192 1270472 1266155 1263759 1261570 1256652 1248148 1238503 1230598 1224855 1220154 1216199 1213309 1210934
59716 1210934 1208412 1206673 1207221 1209608 1211799 1213072 1214754 1217964 1222532 1228449 1236488 1246588 1257292 1267698
59702 1267698 1278595 1290703 1303142 1314904 1326683 1339927 1354857 1370807 1387752 1405811 1423523
59691 1423523 1438457 1450104 1460830 1473097 1486478 1498343 1507107 1513772 1520151 1526501 1531632 1534977
59679 1534977 1537499 1540202 1542476 1542802 1540865 1538135 1536072 1534389 1531591 1526996 1521659 1517265 1514402 1512223
59665 1512223 1509722 1507023 1505179 1504877 1505721 1506827 1507762 1508687 1509878 1511351 1512917 1514509 1516596 1520232 1526374
$$ packed form
59758A351339j654J347K566K217J852K314K690J707n07k542l423l647m177m836
59744A345246m503l011j818k143l319l961m081m734n998o743o385n619n295n529
59730A282107n915n720m317k396k189m918q504r645p905n743m701l955k890k375
59716A210934k522j739N48K387K191J273J682L210M568N917Q039J0100J0704J0406
59702A267698J0897J2108J2439J1762J1779J3244J4930J5950J6945J8059J7712
59691A423523J4934J1647J0726J2267J3381J1865Q764O665O379O350N131L345
59679A534977K522K703K274L26j937k730k063j683k798m595n337m394k863k179
59665A512223k501k699j844l02Q44J106R35R25J191J473J566J592K087L636O142
$$ plain form
59650 1526374 1535078 1545644 1557517 1570666 1585061 1600333 1615978 1631453 1646091 1659680 1673183
59639 1673183 1687971 1704072 1720042 1734921 1749202 1763276 1776096 1786383 1794189 1799983 1802991 1801997
59627 1801997 1797539 1791864 1786585 1781462 1775552 1768480 1760307 1751072 1740887 1729979 1718449 1706431 1694464
59614 1694464 1683214 1672785 1662756 1652878 1643440 1635128 1628772 1624666 1621759 1618307 1614173 1611759 1613560
59601 1613560 1619241 1626332 1633324 1640664 1648897 1657538 1666093 1674754 1683500 1691556 1698263 1703463 1706467 1705563
59587 1705563 1699295 1687701 1671835 1652704 1631075 1607720 1583312 1558529 1534528 1512720 1493718
59576 1493718 1477010 1461900 1448161 1435394 1422535 1408709 1394132 1379560 1365085 1350061 1334119
59565 1334119 1317724 1301660 1286205 1270886 1255009 1238361 1221427 1205022 1189993 1177159 1166867
$$ packed form
59650A526374Q704J0566J1873J3149J4395J5272J5645J5475J4638J3589J3503
59639A673183J4788J6101J5970J4879J4281J4074J2820J0287P806N794L008r94
59627A801997m458n675n279n123n910p072q173r235j0185j0908j1530j2018j1967
59614A694464j1250j0429j0029r878r438q312o356m106k907l452m134k414J801
59601A613560N681P091O992P340Q233Q641Q555Q661Q746Q056O707N200L004r04
59587A705563o268j1594j5866j9131k1629k3355k4408k4783k4001k1808j9002
59576A493718j6708j5110j3739j2767j2859j3826j4577j4572j4475j5024j5942
59565A334119j6395j6064j5455j5319j5877j6648j6934j6405j5029j2834j0292
$$ plain form
59554 1166867 1158210 1149364 1139522 1130143 1123426 1119724 1117340 1114784 1112191 1110285 1108996 1107816 1107012 1107795
59540 1107795 1111267 1117308 1124360 1130304 1133874 1135368 1136019 1136804 1137942 1139135 1139929 1140159 1140244 1140526 1140032 1136791
59524 1136791 1130222 1122512 1116570 1113029 1110279 1106929 1102948 1098664 1094104 1089533 1085530 1082275 1079557 1077465
59510 1077465 1076181 1075340 1074628 1074680 1076009 1077346 1076820 1074846 1073926 1075120 1076664 1076916 1076749 1077644 1079021 1079274
59494 1079274 1078537 1078654 1080819 1084718 1089751 1095700 1102148 1108571 1115486 1124762 1138191 1155795 1175736 1196011
59480 1196011 1216502 1239223 1265950 1295278 1322436 1342292 1352462 1353976 1350014 1344247 1339214 1335343
59468 1335343 1331810 1328551 1326751 1327148 1328883 1330688 1332254 1333540 1333558 1331092 1326279 1320409 1314220 1307236 1298773
59453 1298773 1288876 1278191 1267460 1257176 1247292 1237306 1227062 1217353 1209232 1202606 1195894 1187311 1176515
$$ packed form
59554A166867q657q846r842r379o717l702k384k556k593j906j289j180q04P83
59540A107795L472O041P052N944L570J494O51P85J138J193P94K30Q5K82m94l241
59524A136791o569p710n942l541k750l350l981m284m560m571m003l255k718k092
59510A077465j284q41p12N2J329J337n26j974r20J194J544K52j67Q95J377K53
59494A079274p37J17K165L899N033N949O448O423O915R276J3429J7604J9941K0275
59480A196011K0491K2721K6727K9328K7158J9856J0170J514l962n767n033l871
59468A335343l533l259j800L97J735J805J566J286J8k466m813n870o189o984q463
59453A298773r897j0685j0731j0284r884r986j0244r709q121o626o712q583j0796
$$ plain form
59440 1176515 1165038 1155209 1148565 1145175 1144252 1144965 1146485 1147873 1148761 1150004 1152874 1157611 1163529 1170472
59426 1170472 1179021 1188888 1198174 1205057 1209623 1213432 1217775 1223027 1229173 1236052 1243047 1249143 1253524 1256070
59412 1256070 1257433 1258670 1260436 1262324 1263235 1262583 1260979 1259815 1260408 1263342 1268006 1272809 1276452 1279141 1282118
59397 1282118 1286172 1291292 1297541 1305239 1314151 1323455 1332734 1342132 1351351 1359510 1366300 1372208 1377149 1379866
59383 1379866 1379297 1375684 1369922 1362808 1355474 1349457 1345403 1342490 1339900 1338102 1337946 1339279 1341324 1343783
59369 1343783 1346719 1350067 1354145 1360071 1368804 1380228 1393898 1409925 1428319 1448265 1469170 1491836
59357 1491836 1517398 1545693 1576079 1609475 1647694 1690018 1731427 1765026 1786246 1794998 1794746 1789945
59345 1789945 1783885 1778265 1774245 1773373 1777250 1786485 1799827 1813659 1822413 1820883 1807480 1785135 1758616
$$ packed form
59440A176515j1477r829o644l390r23P13J520J388Q88J243K870M737N918O943
59426A170472Q549R867R286O883M566L809M343N252O146O879O995O096M381K546
59412A256070J363J237J766J888R11o52j604j164N93K934M664M803L643K689K977
59397A282118M054N120O249P698Q912R304R279R398R219Q159O790N908M941K717
59383A379866n69l613n762p114p334o017m054k913k590j798j56J333K045K459
59369A343783K936L348M078N926Q733J1424J3670J6027J8394J9946K0905K2666
59357A491836K5562K8295L0386L3396L8219M2324M1409L3599K1220Q752k52m801
59345A789945o060n620m020q72L877R235J3342J3832Q754j530j3403k2345k6519
$$ plain form
59332 1758616 1731321 1704805 1680022 1657590 1637181 1617989 1600038 1584262 1571236 1560369 1550501
59321 1550501 1540946 1532126 1525344 1521568 1520109 1519038 1517313 1515821 1515822 1517195 1519146 1521891 1526275 1531979 1537465
59306 1537465 1541929 1546364 1552332 1560328 1569554 1578827 1587524 1596047 1605551 1617015 1630576 1645846 1662588
59293 1662588 1680919 1701167 1723714 1748454 1774147 1798979 1822289 1845199 1868978 1893298 1916635
59282 1916635 1937730 1955877 1970357 1980643 1987009 1990187 1990459 1987536 1980992 1970354 1955344 1936666
59270 1936666 1916096 1895045 1873506 1850983 1827679 1803916 1779190 1753095 1726620 1701151 1676605
59259 1676605 1652130 1628424 1607526 1589871 1573082 1554493 1533880 1513067 1493912 1477507 1464462
59248 1464462 1454735 1447294 1440785 1434775 1430085 1428019 1429494 1434753 1443497 1455129 1468897 1483724 1497698
$$ packed form
59332A758616k7295k6516k4783k2432k0409j9192j7951j5776j3026j0867r868
59321A550501r555q820o782l776j459j071j725j492JJ373J951K745M384N704N486
59306A537465M464M435N968P996R226R273Q697Q523R504J1464J3561J5270J6742
59293A662588J8331K0248K2547K4740K5693K4832K3310K2910K3779K4320K3337
59282A916635K1095J8147J4480J0286O366L178K72k923o544j0638j5010j8678
59270A936666k0570k1051k1539k2523k3304k3763k4726k6095k6475k5469k4546
59259A676605k4475k3706k0898j7655j6789j8589k0613k0813j9155j6405j3045
59248A464462r727p441o509o010m690k066J475N259Q744J1632J3768J4827J3974
$$ plain form
59235 1497698 1507785 1510635 1504597 1491456 1475656 1460995 1448074 1435510 1423171 1412934 1406165 1401882
59223 1401882 1398200 1394660 1392389 1392839 1397174 1405998 1418541 1432638 1446580 1460722 1476546 1494612 1514177
59210 1514177 1534163 1553514 1571161 1586888 1601961 1617850 1634360 1649853 1662971 1673214 1680204
59199 1680204 1683627 1683975 1682413 1679834 1676634 1673179 1669747 1666208 1662533 1659132 1655853 1651274 1644282 1635996
59185 1635996 1628672 1622863 1617195 1610912 1604882 1599570 1593723 1586101 1577315 1568783 1560626 1551797 1541899 1531791
59171 1531791 1522416 1513811 1505398 1496584 1486853 1475772 1463539 1451383 1440712 1431465 1421790 1410079 1397148
59158 1397148 1385670 1377418 1371890 1367616 1363763 1360098 1356516 1353301 1351023 1349544 1347983 1346325 1346047 1348279
59144 1348279 1352300 1356819 1361813 1367867 1374455 1380299 1385017 1389262 1393603 1398244 1403266 1408213 1412099 1414992
$$ packed form
59235A497698J0087K850o038j3141j5800j4661j2921j2564j2339j0237o769m283
59223A401882l682l540k271M50M335Q824J2543J4097J3942J4142J5824J8066J9565
59210A514177J9986J9351J7647J5727J5073J5889J6510J5493J3118J0243O990
59199A680204L423L48j562k579l200l455l432l539l675l401l279m579o992q286
59185A635996p324n809n668o283o030n312n847p622q786q532q157q829r898j0108
59171A531791r375q605q413q814r731j1081j2233j2156j0671r247r675j1711j2931
59158A397148j1478q252n528m274l853l665l582l215k278j479j561j658k78K232
59144A348279M021M519M994O054O588N844M718M245M341M641N022M947L886K893
$$ plain form
59130 1414992 1418792 1425030 1432532 1438716 1442681 1445490 1447952 1449804 1450745 1450594 1448590 1444155 1438161 1431939
59116 1431939 1425329 1417315 1408258 1399580 1391483 1383017 1374411 1367170 1361598 1356342 1350820 1345918 1341767 1337142
59102 1337142 1332106 1328934 1328777 1329144 1326493 1320223 1312555 1305444 1299180 1293406 1287869 1282218 1276081 1269449
59088 1269449 1262515 1255364 1248113 1240898 1233396 1224940 1215505 1206112 1198008 1191864 1187617 1184295 1180094 1173860
59074 1173860 1166859 1162040 1160995 1162445 1164037 1164761 1165347 1167284 1171868 1179276 1188152 1196854 1205369 1215079
59060 1215079 1226610 1239197 1252438 1267172 1283901 1301632 1319211 1336728 1354644 1372467 1389263
59049 1389263 1404785 1419155 1431939 1442416 1450439 1456450 1460969 1464519 1467591 1470186 1471572 1470750 1467082
59036 1467082 1460803 1453294 1446397 1440626 1434612 1427286 1419924 1414503 1410645 1406305 1401277 1397486 1395347 1392380
$$ packed form
59130A414992L800O238P502O184L965K809K462J852R41j51k004m435n994o222
59116A431939o610q014r057q678q097q466q606p241n572n256n522m902m151m625
59102A337142n036l172j57L67k651o270p668p111o264n774n537n651o137o632
59088A269449o934p151p251p215p502q456r435r393q104o144m247l322m201o234
59074A173860p001m819j045J450J592P24N86J937M584P408Q876Q702Q515R710
59060A215079J1531J2587J3241J4734J6729J7731J7579J7517J7916J7823J6796
59049A389263J5522J4370J2784J0477Q023O011M519L550L072K595J386q22l668
59036A467082o279p509o897n771o014p326p362n421l858m340n028l791k139k967
$$ plain form
59022 1392380 1386625 1379220 1372072 1364821 1355998 1345830 1336003 1327424 1319830 1312940 1306590 1300226 1293500 1286950
59008 1286950 1281141 1275753 1270393 1265477 1261206 1256404 1249731 1241637 1233941 1227649 1222131 1216273 1209789 1203502
58994 1203502 1198766 1196213 1194773 1192501 1188635 1184173 1180351 1177696 1176775 1178339 1181918 1185591 1188081 1190010
58980 1190010 1192244 1194354 1195745 1196960 1198619 1200268 1201577 1203498 1206811 1210699 1214393 1219180 1226927 1237458
58966 1237458 1249307 1262384 1277726 1294879 1311711 1327261 1342949 1360320 1378809 1396255 1410738
58955 1410738 1421405 1428240 1431509 1431372 1428155 1423078 1417972 1413806 1410281 1407498 1406849 1409039 1412218 1413773
58941 1413773 1413545 1413695 1415624 1418603 1421459 1424038 1426601 1428980 1430811 1431820 1431648 1430137 1427962 1426243 1425383
58926 1425383 1424924 1424658 1425271 1427789 1432801 1440130 1448814 1457620 1466089 1475010 1485601 1498577 1514089 1531713
$$ packed form
59022A392380n755p405p148p251q823j0168r827q579p594o890o350o364o726o550
59008A286950n809n388n360m916m271m802o673q094p696o292n518n858o484o287
58994A203502m736k553j440k272l866m462l822k655r21J564L579L673K490J929
58980A190010K234K110J391J215J659J649J309J921L313L888L694M787P747J0531
58966A237458J1849J3077J5342J7153J6832J5550J5688J7371J8489J7446J4483
58955A410738J0667O835L269j37l217n077n106m166l525k783o49K190L179J555
58941A413773k28J50J929K979K856K579K563K379J831J009j72j511k175j719q60
58926A425383m59k66O13K518N012P329Q684Q806Q469Q921J0591J2976J5512J7624
$$ plain form
58912 1531713 1549995 1567039 1582516 1598235 1615620 1633387 1648990 1661701 1672793 1683107 1692073
58901 1692073 1699030 1703905 1706373 1705723 1701974 1696028 1688327 1678277 1665262 1649423 1631264 1611470 1591315
58888 1591315 1572252 1554580 1537220 1519239 1501059 1483878 1468613 1455789 1445818 1438667 1433452 1428845
58876 1428845 1423997 1419023 1414680 1411679 1410193 1409923 1410354 1410775 1410306 1408558 1406295 1404762 1404203 1403681 1402580
58861 1402580 1401395 1400642 1399981 1399136 1398832 1399815 1401480 1402507 1402615 1402914 1404742 1408871 1415572 1424735 1435966
58846 1435966 1448983 1463787 1480239 1497926 1516602 1536113 1555669 1574186 1591828 1610119 1629701
58835 1629701 1649035 1666395 1682308 1698898 1717524 1738259 1760967 1785461 1810842 1835949 1860301
58824 1860301 1883619 1904739 1922248 1936144 1947901 1958776 1968718 1976750 1981803 1983458 1982568 1980810 1979090
$$ packed form
58912A531713J8282J7044J5477J5719J7385J7767J5603J2711J1092J0314Q966
58901A692073O957M875K468o50l749n946p701j0050j3015j5839j8159j9794k0155
58888A591315j9063j7672j7360j7981j8180j7181j5265j2824r971p151n215m607
58876A428845m848m974m343l001j486k70M31M21m69j748k263j533n59n22j101
58861A402580j185p53o61q45l04R83J665J027J08K99J828M129O701R163J1231
58846A435966J3017J4804J6452J7687J8676J9511J9556J8517J7642J8291J9582
58835A629701J9334J7360J5913J6590J8626K0735K2708K4494K5381K5107K4352
58824A860301K3318K1120J7509J3896J1757J0875R942Q032N053J655q90j758j720
$$ plain form
58811 1979090 1976928 1973943 1970958 1968584 1965594 1960169 1952274 1943357 1933920 1922931 1909644 1894568 1878222
58798 1878222 1860077 1839432 1816723 1793392 1770623 1748398 1725865 1702639 1679517 1657497 1636524
58787 1636524 1616139 1596978 1580031 1564253 1546836 1526688 1505794 1486156 1467320 1448470 1430957
58776 1430957 1416451 1404036 1391693 1379765 1370354 1363739 1357920 1351735 1346083 1341837 1338581 1335793 1333519
58763 1333519 1331445 1328962 1326569 1325838 1327546 1330948 1334987 1338995 1342213 1344059 1345188 1347022 1349899 1352617
58749 1352617 1353838 1352995 1350025 1345456 1340652 1336725 1333183 1328701 1323061 1317198 1311637 1306139 1300604 1295007
58735 1295007 1288813 1281815 1275169 1270088 1266038 1261975 1258856 1258759 1261642 1265294 1268711 1273293 1280171 1288463
58721 1288463 1296985 1305919 1315930 1327119 1339413 1352409 1364220 1372235 1375901 1377274 1377991 1377203 1373458
$$ packed form
58811A979090k162k985k985k374k990n425p895q917r437j0989j3287j5076j6346
58798A878222j8145k0645k2709k3331k2769k2225k2533k3226k3122k2020k0973
58787A636524k0385j9161j6947j5778j7417k0148k0894j9638j8836j8850j7513
58776A430957j4506j2415j2343j1928r411o615n819o185n652m246l256k788k274
58763A333519k074k483k393p31J708L402M039M008L218J846J129J834K877K718
58749A352617J221q43k970m569m804l927l542m482n640n863n561n498n535n597
58735A295007o194o998o646n081m050m063l119r7K883L652L417M582O878Q292
58721A288463Q522Q934J0011J1189J2294J2996J1811Q015L666J373P17p88l745
$$ plain form
58708 1373458 1367108 1359548 1351280 1342070 1332194 1322225 1312014 1300979 1289305 1278251 1269329 1263225 1259100
58695 1259100 1254905 1249045 1241936 1235441 1230847 1227985 1226046 1224386 1222680 1221351 1221797 1225150 1230815 1237119
58681 1237119 1243239 1249479 1255942 1262352 1269138 1277338 1287183 1297917 1309078 1320772 1332620 1343670 1353565
58668 1353565 1362766 1371595 1380115 1388779 1397987 1407073 1415020 1422173 1429954 1438964 1448593 1458318 1468008 1477149
58654 1477149 1485203 1492545 1499512 1504804 1506542 1504605 1500063 1492585 1480671 1464549 1446454 1427540 1406670
58641 1406670 1382975 1357587 1331987 1306357 1280429 1254392 1228256 1201909 1176552 1154590 1137190
58630 1137190 1123025 1109919 1096715 1083414 1070866 1060476 1052727 1045934 1037929 1028859 1020556 1013486
58618 1013486 1006672 1000590 997426 997847 999896 1001766 1003399 1004854 1005759 1007174 1011345 1018495 1026390 1034160
$$ packed form
58708A373458o350p560q268r210r876r969j0211j1035j1674j1054q922o104m125
58695A259100m195n860p109o495m594k862j939j660j706j329M46L353N665O304
58681A237119O120O240O463O410O786Q200R845J0734J1161J1694J1848J1050R895
58668A353565R201Q829Q520Q664R208R086P947P153P781R010R629R725R690R141
58654A477149Q054P342O967N292J738j937m542p478j1914j6122j8095j8914k0870
58641A406670k3695k5388k5600k5630k5928k6037k6136k6347k5357k1962j7400
58630A137190j4165j3106j3204j3301j2548j0390p749o793q005r070q303p070
58618A013486o814o082l164M21K049J870J633J455R05J415M171P150P895P770
$$ plain form
58604 1034160 1043692 1055665 1067042 1074682 1079104 1082379 1084380 1083638 1080351 1075916 1070479 1063251 1054605 1045857
58590 1045857 1037406 1028643 1019333 1009839 1000515 991868 984678 979189 974926 971819 970354 970031 969082 966571
58576 966571 963406 960644 958298 956561 956385 957746 958964 958753 957339 954760 950198 944244 939671 938219 938374
58561 938374 937986 937313 937737 939182 940899 943326 947163 951781 956458 962032 969442 977605 984530 989687 993770
58546 993770 997199 1000379 1004307 1009247 1013860 1017241 1020734 1026017 1032494 1038269 1042775 1046748 1050615 1054698
58532 1054698 1060183 1068057 1077595 1087371 1097209 1107918 1119821 1132784 1146891 1161927 1177062 1192029
58520 1192029 1207545 1223655 1239074 1253233 1267386 1282408 1297230 1311081 1325535 1342436 1361355
58509 1361355 1381167 1402701 1427606 1455785 1486177 1519100 1555531 1594767 1634834 1674529 1713138
$$ packed form
58604A034160R532J1973J1377P640M422L275K001p42l287m435n437p228q646q748
58590A045857q451q763r310r494r324q647p190n489m263l107j465l23r49k511
58576I66571l165k762k346j737j76J361J218k11j414k579m562n954m573j452J55
58561I38374l88o73M24J445J717K427L837M618M677N574P410Q163O925N157M083
58546I93770L429L180L928M940M613L381L493N283O477N775M506L973L867M083
58532A054698N485P874R538R776R838J0709J1903J2963J4107J5036J5135J4967
58520A192029J5516J6110J5419J4159J4153J5022J4822J3851J4454J6901J8919
58509A361355J9812K1534K4905K8179L0392L2923L6431L9236M0067L9695L8609
$$ plain form
58498 1713138 1748836 1779384 1803983 1822902 1835986 1843114 1845296 1843658 1838206 1829182 1818602 1808518
58486 1808518 1798566 1786952 1772993 1756912 1738157 1716101 1691765 1666764 1640904 1612570 1581194
58475 1581194 1547921 1514449 1482594 1454218 1429940 1408395 1387919 1368226 1349513 1331381 1313979
58464 1313979 1298660 1285790 1273408 1259987 1247020 1236787 1228922 1221426 1213665 1206005 1197818 1188658
58452 1188658 1180443 1175545 1173188 1170376 1166058 1161908 1159257 1157661 1156455 1155472 1154238 1152360 1150674 1150334
58438 1150334 1151006 1151649 1152618 1155151 1159078 1162916 1166135 1169771 1174945 1182056 1191085 1201542 1212630 1224476
58424 1224476 1238401 1255018 1273180 1291804 1311227 1331560 1351558 1370804 1391017 1412978 1433854
58413 1433854 1449867 1460171 1465860 1466818 1462355 1453778 1443593 1432964 1422207 1412677 1405848 1401579 1399495
$$ packed form
58498A713138L5698L0548K4599J8919J3084P128K182j638n452r024j0580j0084
58486A808518r952j1614j3959j6081j8755k2056k4336k5001k5860k8334l1376
58475A581194l3273l3472l1855k8376k4278k1545k0476j9693j8713j8132j7402
58464A313979j5319j2870j2382j3421j2967j0233p865p496p761p660q187r160
58452A188658q215m898k357k812m318m150k651j596j206r83j234j878j686l40
58438A150334O72O43R69K533L927L838L219L636N174P111R029J0457J1088J1846
58424A224476J3925J6617J8162J8624J9423K0333J9998J9246K0213K1961K0876
58413A433854J6013J0304N689R58m463q577j0185j0629j0757r530o829m269k084
$$ plain form
58400 1399495 1400721 1405934 1413130 1419902 1426599 1434720 1443812 1452752 1462409 1473713 1484353 1490825 1492815
58387 1492815 1492311 1489339 1482084 1470660 1457387 1443528 1428737 1413519 1399557 1387760 1378067 1370444
58375 1370444 1364153 1357369 1349773 1343875 1341379 1340486 1339696 1341631 1349051 1359360 1367599 1373243 1379298 1386138
58361 1386138 1391282 1394326 1396871 1397984 1394905 1388219 1381386 1374967 1366237 1355004 1344937 1338215 1333240
58348 1333240 1328552 1324791 1321861 1318230 1314085 1311463 1310383 1308481 1305210 1302834 1302687 1303983 1306752 1312187
58334 1312187 1319611 1326873 1334115 1343310 1353777 1362382 1368692 1375732 1384937 1394546 1403668 1413522 1423737
58321 1423737 1431903 1438045 1445245 1454428 1462723 1468543 1474250 1482034 1490934 1499649 1508713 1518162 1526454 1533429
58307 1533429 1541313 1551411 1562702 1574672 1588373 1603764 1619240 1634653 1651563 1669789 1687070
$$ packed form
58400A399495J226N213P196O772O697Q121R092Q940R657J1304J0640O472J990
58387A492815n04k972p255j1424j3273j3859j4791j5218j3962j1797r693p623
58375A370444o291o784p596n898k496q93p90J935P420J0309Q239N644O055O840
58361A386138N144L044K545J113l079o686o833o419q730j1233j0067o722m975
58348A333240m688l761k930l631m145k622j080j902l271k376j47J296K769N435
58334A312187P424P262P242R195J0467Q605O310P040R205R609R122R854J0215
58321A423737Q166O142P200R183Q295N820N707P784Q900Q715R064R449Q292O975
58307A533429P884J0098J1291J1970J3701J5391J5476J5413J6910J8226J7281
$$ plain form
58296 1687070 1702705 1718016 1732758 1744880 1754384 1763479 1772324 1778699 1782668 1787409 1794510 1802448 1810488
58283 1810488 1819990 1831017 1841739 1852088 1864092 1878111 1892817 1909007 1928809 1950960 1971910
58272 1971910 1991885 2014434 2039514 2062898 2083295 2103861 2125285 2143704 2157535 2170339 2184512
58261 2184512 2197876 2209121 2221041 2235553 2250617 2264880 2280514 2298942 2318518 2338720 2361775
58250 2361775 2387873 2413647 2437519 2461652 2486860 2510935 2533906 2559255 2587842 2616332 2643762
58239 2643762 2673705 2707573 2741904 2774790 2808826 2845098 2880606 2914517 2950536 2990150 3030001
58228 3030001 3069055 3111597 3159635 3209083 3257191 3307148 3361443 3417297 3472734 3530645 3592670
58217 3592670 3655556 3717762 3783216 3854265 3927442 4000562 4077332 4160359 4246007 4330859 4417174
$$ packed form
58296A687070J5635J5311J4742J2122R504R095Q845O375L969M741P101P938Q040
58283A810488R502J1027J0722J0349J2004J4019J4706J6190J9802K2151K0950
58272A971910J9975K2549K5080K3384K0397K0566K1424J8419J3831J2804J4173
58261B184512J3364J1245J1920J4512J5064J4263J5634J8428J9576K0202K3055
58250B361775K6098K5774K3872K4133K5208K4075K2971K5349K8587K8490K7430
58239B643762K9943L3868L4331L2886L4036L6272L5508L3911L6019L9614L9851
58228C030001L9054M2542M8038M9448M8108M9957N4295N5854N5437N7911O2025
58217C592670O2886O2206O5454P1049P3177P3120P6770Q3027Q5648Q4852Q6315
$$ plain form
58206 4417174 4507689 4601426 4698713 4803609 4917146 5034807 5154607 5280517 5414212 5551313
58196 5551313 5689991 5835142 5989583 6149413 6312676 6483979 6665755 6853890 7047031
58187 7047031 7251237 7470456 7701759 7944762 8205527 8486135 8781593 9092930 9431778
58178 9431778 9805486 10209574 10641834 11111464 11626517 12184971 12786572 13440789 14154189
58169 14154189 14922699 15745295 16632149 17590103 18613863 19700828 20859875 22095905 23401818
58160 23401818 24776872 26237186 27798057 29464529 31251286 33191715 35312961 37621447
58152 37621447 40126609 42857175 45839811 49087797 52630436 56529623 60848180 65627365
58144 65627365 70913461 76774481 83269021 90436656 98350161 107144614 116972500 127982288
$$ packed form
58206D417174R0515R3737R7287J04896J13537J17661J19800J25910J33695J37101
58196E551313J38678J45151J54441J59830J63263J71303J81776J88135J93141
58187G047031K04206K19219K31303K43003K60765K80608K95458L11337L38848
58178I431778L73708M04088M32260M69630N15053N58454O01601O54217P13400
58169A4154189P68510Q22596Q86854R57954J023760J086965J159047J236030J305913
58160B3401818J375054J460314J560871J666472J786757J940429K121246K308486
58152C7621447K505162K730566K982636L247986L542639L899187M318557M779185
58144F5627365N286096N861020O494540P167635P913505Q794453R827886J1009788
$$ plain form
58136 127982288 140382325 154475437 170581849 188972764 209911317 233680087 260532722
58129 260532722 290745441 324715112 362525055 402717363 441297731 472494658 491264085
58122 491264085 495562244 486563514 467145247 440388787 409075805 375709481 342379075
58115 342379075 310528578 280968598 254075413 229923037 208347280 189075604 171872518
58108 171872518 156565789 142989306 130967007 120335922 110935514 102584613 95106255
58101 95106255 88367224 82268976 76718522 71637408 66983115 62730728 58841195 55267674
58093 55267674 51978497 48949898 46146730 43531832 41085392 38796947 36648467 34622896
58085 34622896 32719017 30940122 29276265 27712633 26245372 24873623 23585478 22367478
$$ packed form
58136A27982288J2400037J4093112J6106412J8390915K0938553K3768770K6852635
58129B60532722L0212719L3969671L7809943M0192308L8580368L1196927J8769427
58122D91264085M298159q998730j9418267k6756460l1312982l3366324l3330406
58115C42379075l1850497k9559980k6893185k4152376k1575757j9271676j7203086
58108A71872518j5306729j3576483j2022299j0631085r400408q350901p478358
58101I5106255o739031o098248n550454n081114m654293m252387l889533l573521
58093E5267674l289177l028599k803168k614898k446440k288445k148480k025571
58085C4622896j903879j778895j663857j563632j467261j371749j288145j218000
$$ plain form
58077 22367478 21219577 20146117 19140131 18190472 17295823 16457290 15664971 14906247 14180649
58068 14180649 13493294 12840673 12216472 11624920 11074439 10562977 10082076 9630306 9210285
58059 9210285 8817133 8442184 8084329 7746446 7424544 7111498 6808030 6519478 6245099
58050 6245099 5980501 5727074 5488862 5263211 5044344 4833402 4635749 4451021 4274758
58041 4274758 4107049 3950753 3803866 3662313 3527939 3405437 3293708 3188158 3089005 2999367
58031 2999367 2917624 2839677 2766517 2701641 2643037 2585354 2528052 2473956 2421724 2367348 2311473
58020 2311473 2257943 2206586 2154452 2102634 2054832 2010451 1965920 1921521 1880276 1841354 1801338
58009 1801338 1761037 1724539 1692215 1660784 1629489 1600226 1572416 1543762 1515571 1491581 1471776
$$ packed form
58077B2367478j147901j073460j005986r49659q94649q38533p92319p58724p25598
58068A4180649o87355o52621o24201n91552n50481n11462m80901m51770m20021
58059I210285l93152l74949l57855l37883l21902l13046l03468k88552k74379
58050F245099k64598k53427k38212k25651k18867k10942j97653j84728j76263
58041D274758j67709j56296j46887j41553j34374j22502j11729j05550r9153q9638
58031B999367q1743p7947p3160o4876n8604n7683n7302n4096n2232n4376n5875
58020B311473n3530n1357n2134n1818m7802m4381m4531m4399m1245l8922m0016
58009A801338m0301l6498l2324l1431l1295k9263k7810k8654k8191k3990j9805
$$ plain form
57998 1471776 1452490 1432093 1411735 1391325 1369719 1348115 1328638 1310487 1291808 1273888 1258968
57987 1258968 1245629 1231122 1216477 1204324 1193458 1180866 1167409 1156119 1146482 1135913 1125287
57976 1125287 1117133 1109610 1098357 1083609 1069532 1057019 1042897 1026110 1008985 992281 974470 956354
57964 956354 941285 930070 920015 909440 899168 889573 880166 871879 865858 860516 853768 847287 844168
57951 844168 843270 840596 835579 831107 827923 824204 820508 819791 822012 823528 822489 820379 817923 814015 809230
57936 809230 805933 804100 801123 796391 792080 788996 785634 781844 779284 777626 774382 769288 765002 762628
57922 762628 760199 756418 752404 748997 745741 743081 742207 742317 741446 740197 741014 743449 744132 742078 740182
57907 740182 740589 742263 744060 746499 749235 750085 747931 743942 739166 733673 728506 725328 723528 720676 716374
$$ packed form
57998A471776j9286k0397k0358k0410k1606k1604j9477j8151j8679j7920j4920
57987A258968j3339j4507j4645j2153j0866j2592j3457j1290r637j0569j0626
57976A125287q154p523j1253j4748j4077j2513j4122j6787j7125j6704j7811j8116
57964I56354j5069j1215j0055j0575j0272r595r407q287o021n342o748o481l119
57951H44168q98k674n017m472l184l719l696p17K221J516j039k110k456l908m785
57936H09230l297j833k977m732m311l084l362l790k560j658l244n094m286k374
57922G62628k429l781m014l407l256k660q74J10q71j249Q17K435O83k054j896
57907G40182M07J674J797K439K736Q50k154l989m776n493n167l178j800k852m302
$$ plain form
57892 716374 712635 710176 707652 704954 703687 703763 703085 701536 701741 704768 708403 710936 713523 717534 722447
57877 722447 727624 733450 739630 745009 749960 756249 763599 769125 771144 770910 769811 767477 763466 758132
57863 758132 751105 741513 730357 719946 710456 699930 688168 677520 669191 661976 655394 650751 648130
57850 648130 645658 642980 642252 644350 647165 648974 650499 652254 652915 651867 650491 649424 647375 644129 641786
57835 641786 641394 641173 639828 638906 640037 642428 644885 647796 651351 654246 656002 658244 661917 665538 667832
57820 667832 669617 671353 671452 669158 666673 666161 666810 667188 668384 672269 678229 684075 688949 693261 696934
57805 696934 699670 701960 704325 706634 709367 713979 720678 727520 733163 738759 745513 752191 756972 760173
57791 760173 763071 765248 765145 762407 757986 752707 747172 742238 738222 734313 729796 725031 720518 716207
$$ packed form
57892G16374l739k459k524k698j267P6o78j549K05L027L635K533K587M011M913
57877G22447N177N826O180N379M951O289P350N526K019k34j099k334m011n334
57863G58132p027r592j1156j0411r490j0526j1762j0648q329p215o582m643k621
57850F48130k472k678p28K098K815J809J525J755O61j048j376j067k049l246k343
57835F41786l92k21j345r22J131K391K457K911L555K895J756K242L673L621K294
57820F67832J785J736R9k294k485n12O49L78J196L885N960N846M874M312L673
57805F96934K736K290K365K309K733M612O699O842N643N596O754O678M781L201
57791G60173K898K177j03k738m421n279n535m934m016l909m517m765m513m311
$$ plain form
57777 716207 712503 710601 710824 711903 712727 713453 714153 714133 713639 714481 717683 721937 725536 728389 731052 733308
57761 733308 734888 736139 736876 736091 733877 732097 732066 733056 733979 734633 734124 730133 721497 710040 698341 687134
57745 687134 676258 666547 659085 653768 649973 647433 645240 641452 635123 627615 620816 615368 611513 609859
57731 609859 609978 609921 608628 607377 607515 608276 608324 607923 608047 608597 608938 609114 609442 610178 612390 617443 624490 630274
57713 630274 632709 633005 633125 633139 632426 631374 630257 628276 625368 622996 621472 618641 613157 607035 602848
57698 602848 600403 598431 597547 598792 600877 601792 602118 604113 608343 613609 619445 626411 634500 643232 652752
57683 652752 663104 673209 682127 690291 698033 704226 708076 710784 713454 714889 713747 711544 711016 712483
57669 712483 714141 715112 715895 716547 716518 715720 714068 710981 707057 704869 705962 708232 708350 705601 701301 696002
$$ packed form
57777G16207l704j902K23J079Q24P26P00k0m94Q42L202M254L599K853K663K256
57761G33308J580J251P37p85k214j780l1R90R23O54n09l991q636j1457j1699j1207
57745F87134j0876r711p462n317l795k540k193l788o329p508o799n448l855j654
57731F09859J19n7j293j251J38P61M8m01J24N50L41J76L28P36K212N053P047N784
57713F30274K435K96J20J4p13j052j117j981k908k372j524k831n484o122m187
57698F02848k445j972q84J245K085R15L26J995M230N266N836O966Q089Q732R520
57683F52752J0352J0105Q918Q164P742O193L850K708K670J435j142k203n28J467
57669G12483J658R71P83O52k9p98j652l087l924k188J093K270J18k749m300n299
$$ plain form
57653 696002 689799 684024 679882 676501 672942 670845 672175 675458 677415 677502 677756 678900 679929 681015 683363
57638 683363 686235 687403 686736 686400 687343 688522 689751 692290 696158 699647 702100 704666 707823 710600 712668
57623 712668 714810 717020 718639 720784 726152 735790 748360 763014 780641 801782 825803 852877 884633
57610 884633 922242 965969 1016703 1074952 1137081 1194759 1239429 1265961 1272195 1258038 1226524 1183484
57598 1183484 1134459 1082968 1032010 984823 942993 905737 872155 842474 816372 792321 769888
57587 769888 750805 736389 725657 717201 711046 707097 703490 698323 691944 685935 680871 676485 673040
57574 673040 670941 669533 667561 664449 660263 655003 648815 642465 636867 632457 629271 626955 624504 620925
57560 620925 616547 612722 609874 606960 603265 599563 596757 594371 591325 587536 583949 581323 579440 577313
$$ packed form
57653F96002o203n775m142l381l559k097J330L283J957Q7K54J144J029J086K348
57638F83363K872J168o67l36R43J179J229K539L868L489K453K566L157K777K068
57623G12668K142K210J619K145N368R638J2570J4654J7627K1141K4021K7074L1756
57610H84633L7609M3727N0734N8249O2129N7678M4670K6532O234j4157l1514m3040
57598A183484m9025n1491n0958m7187m1830l7256l3582k9681k6102k4051k2433
57587G69888j9083j4416j0732q456o155l949l607n167o379o009n064m386l445
57574F73040k099j408j972l112m186n260o188o350n598m410l186k316k451l579
57560F20925m378l825k848k914l695l702k806k386l046l789l587k626j883k127
$$ plain form
57546 577313 574110 570185 566967 565293 564176 561995 558400 554135 549573 544762 540388 537204 534736 532023
57532 532023 529272 527223 525334 522585 519790 518929 519955 520460 518901 516234 513904 512164 510894 510082 508796
57517 508796 505492 500096 494192 488657 482932 477085 472441 469249 465777 460885 455680 451431 447560 443157
57503 443157 439082 437097 437886 440899 445052 448606 449613 447653 444332 441370 439171 437787 437839 439499 441678
57488 441678 443199 443946 444350 444799 446068 449094 453697 458716 463808 469767 476611 482878 487561 491383 495475
57473 495475 499993 504513 508423 510672 510757 510288 511659 514708 516782 516764 516680 518328 520620 521674 521468 520822
57457 520822 519640 517909 516828 517318 518757 520576 523530 527865 531754 533311 533001 532631 533148 534687 537383
57442 537383 540728 543387 544857 545841 546000 543374 537634 531956 529622 530286 531395 531637 530979 529029 525724
$$ packed form
57546E77313l203l925l218j674j117k181l595m265m562m811m374l184k468k713
57532E32023k751k049j889k749k795q61J026N05j559k667k330j740j270q12j286
57517E08796l304n396n904n535n725n847m644l192l472m892n205m249l871m403
57503D43157m075j985P89L013M153L554J007j960l321k962k199j384N2J660K179
57488D41678J521P47M04M49J269L026M603N019N092N959O844O267M683L822M092
57473D95475M518M520L910K249Q5m69J371L049K074j8q4J648K292J054k06o46
57457E20822j182j731j081M90J439J819K954M335L889J557l10l70N17J539K696
57442E37383L345K659J470R84J59k626n740n678k334O64J109K42o58j950l305
$$ plain form
57427 525724 522424 520099 517682 514261 511440 511006 511546 510190 506827 503873 502509 501880 501585 502037 502270 500031
57411 500031 494673 488004 481869 476560 471786 467475 463279 458791 454582 451822 450689 450182 449592 449230 449812
57396 449812 451952 455928 461158 466388 471155 476405 482877 489761 495856 500954 505052 507495 508236 508866 510928
57381 510928 514303 518511 524117 531193 537801 542112 544936 548198 552032 555397 558420 561995 566079 570572
57367 570572 576644 584752 592546 597507 600742 605219 611043 615643 618168 620357 623018 624935 625866 627653
57353 627653 631481 636394 641244 646009 650596 654438 657869 662016 667006 671987 677062 683208 690239 696913
57339 696913 703114 709836 716994 723544 729807 737258 745801 753752 760749 768107 775966 782862 788706 795401
57325 795401 803627 811782 819125 827278 837273 847641 857005 866247 876469 886763 895759 903687 911293
$$ packed form
57427E25724l300k325k417l421k821m34N40j356l363k954j364o29k95M52K33k239
57411E00031n358o669o135n309m774m311m196m488m209k760j133n07n90l62N82
57396D49812K140L976N230N230M767N250O472O884O095N098M098K443P41O30K062
57381E10928L375M208N606P076O608M311K824L262L834L365L023L575M084M493
57367E70572O072Q108P794M961L235M477N824M600K525K189K661J917R31J787
57353F27653L828M913M850M765M587L842L431M147M990M981N075O146P031O674
57339F96913O201O722P158O550O263P451Q543P951O997P358P859O896N844O695
57325G95401Q226Q155P343Q153R995J0368R364R242J0222J0294Q996P928P606
$$ plain form
57312 911293 918240 924129 929790 936164 943047 950146 958127 967519 977617 987411 996635 1005348 1013739 1022775
57298 1022775 1033397 1044543 1053768 1060591 1067455 1076569 1087592 1099288 1111518 1124433 1137598 1151130
57286 1151130 1165996 1181985 1197156 1210622 1224178 1239780 1256976 1274202 1291022 1307651 1323814
57275 1323814 1339689 1356574 1374950 1393106 1409259 1424078 1439760 1457636 1477696 1499163 1520296
57264 1520296 1539053 1555446 1572094 1591185 1612159 1633586 1655638 1678967 1702626 1725261 1747472
57253 1747472 1770976 1795975 1821140 1845766 1870460 1895947 1922424 1949825 1977737 2005359 2032247
57242 2032247 2058519 2084012 2108241 2131712 2155928 2181325 2206565 2230685 2254465 2278787 2303425
57231 2303425 2328702 2356609 2388578 2423463 2459299 2495768 2533450 2572010 2610863 2650364 2690598
$$ packed form
57312I11293O947N889N661O374O883P099P981R392J0098R794R224Q713Q391R036
57298A022775J0622J1146R225O823O864R114J1023J1696J2230J2915J3165J3532
57286A151130J4866J5989J5171J3466J3556J5602J7196J7226J6820J6629J6163
57275A323814J5875J6885J8376J8156J6153J4819J5682J7876K0060K1467K1133
57264A520296J8757J6393J6648J9091K0974K1427K2052K3329K3659K2635K2211
57253A747472K3504K4999K5165K4626K4694K5487K6477K7401K7912K7622K6888
57242B032247K6272K5493K4229K3471K4216K5397K5240K4120K3780K4322K4638
57231B303425K5277K7907L1969L4885L5836L6469L7682L8560L8853L9501M0234
$$ plain form
57220 2690598 2730102 2767654 2804326 2842060 2881095 2920442 2959796 2998934 3035968 3068382 3095736
57209 3095736 3119977 3143366 3167191 3191892 3217147 3242252 3267228 3292843 3318902 3343790 3366647
57198 3366647 3388617 3410913 3433222 3455305 3478465 3503904 3531165 3559769 3590655 3624233 3658794
57187 3658794 3692859 3727367 3763328 3798940 3831432 3860189 3885458 3905560 3918387 3924612 3926571 3924967
57175 3924967 3919636 3912607 3907027 3903498 3900717 3899767 3904871 3919685 3945444 3982831 4032884 4095440 4168642
57162 4168642 4250274 4337804 4427398 4515133 4599208 4679121 4753152 4818979 4876456 4927281 4971927
57151 4971927 5009262 5039219 5063510 5083508 5099528 5112094 5121721 5127529 5128537 5126534 5125332 5126848
57139 5126848 5130022 5133795 5138970 5146713 5157196 5170280 5186031 5204350 5225342 5249702 5277314 5306237
$$ packed form
57220B690598L9504L7552L6672L7734L9035L9347L9354L9138L7034L2414K7354
57209C095736K4241K3389K3825K4701K5255K5105K4976K5615K6059K4888K2857
57198C366647K1970K2296K2309K2083K3160K5439K7261K8604L0886L3578L4561
57187C658794L4065L4508L5961L5612L2492K8757K5269K0102J2827O225J959j604
57175C924967n331p029n580l529k781r50N104J4814K5759L7387N0053O2556P3202
57162D168642Q1632Q7530Q9594Q7735Q4075P9913P4031O5827N7477N0825M4646
57151D971927L7335K9957K4291J9998J6020J2566R627N808J008k003j202J516
57139E126848L174L773N175P743J0483J3084J5751J8319K0992K4360K7612K8923
$$ plain form
57127 5306237 5334900 5364457 5396811 5431159 5464918 5497303 5529324 5560762 5589899 5615851 5638444
57116 5638444 5656185 5667034 5670781 5667799 5656032 5632315 5596442 5550840 5496491 5432391 5358921 5278462
57104 5278462 5192729 5102624 5010592 4919769 4830855 4743027 4657622 4577438 4502844 4432551 4368059
57093 4368059 4312981 4267731 4229161 4195899 4169665 4150691 4136412 4125902 4121551 4125090 4135516 4151581
57081 4151581 4172442 4195422 4217485 4239726 4266222 4298165 4333849 4374766 4426063 4489876 4563838
57070 4563838 4647716 4745813 4860341 4987041 5118985 5249906 5372616 5479861 5568729 5639108
57060 5639108 5686324 5700662 5674880 5605778 5487404 5310124 5067982 4759395 4379135 3918789
57050 3918789 3378301 2768790 2101352 1382346 622478 -160464 -953185 -1752569 -2558220
$$ packed form
57127E306237K8663K9557L2354L4348L3759L2385L2021L1438K9137K5952K2593
57116E638444J7741J0849L747k982j1767k3717l5873m5602n4349o4100p3470q0459
57104E278462q5733r0105r2032r0823q8914q7828q5405q0184p4594p0293o4492
57093D368059n5078m5250l8570l3262k6234j8974j4279j0510m351L539J0426J6065
57081D151581K0861K2980K2063K2241K6496L1943L5684M0917N1297O3813P3962
57070D563838Q3878R8097J14528J26700J31944J30921J22710J07245Q8868P0379
57060E639108M7216J4338k5782o9102j18374j77280k42142l08587l80260m60346
57050C918789n40488o09511o67438p19006F22478a60464p92721p99384q05651
$$ plain form
57041 -2558220 -3373342 -4220460 -5146125 -6205470 -7453795 -8955472 -10781955 -12991057 -15621810
57032 -15621810 -18712644 -22299893 -26382864 -30894741 -35677891 -40421742 -44645489 -47926849
57024 -47926849 -50349983 -52718695 -56104167 -60971656 -66704251 -72025466 -75922025 -78230415
57016 -78230415 -79497986 -80426511 -81416820 -82458626 -83296069 -83676391 -83503648 -82818641 -81674500
57007 -81674500 -80049613 -77858827 -75009850 -71448876 -67199051 -62393519 -57265575 -52082433
56999 -52082433 -47071501 -42386698 -38106472 -34238972 -30739731 -27548618 -24621219 -21931195
56991 -21931195 -19457866 -17182933 -15092704 -13172907 -11403713 -9766367 -8251474 -6855577
56983 -6855577 -5573757 -4400795 -3334691 -2372238 -1503639 -716695 -3802 639266 1218043
$$ packed form
57041b558220q15122q47118r25665j059345j248325j501677j826483k209102k630753
57032a5621810l090834l587249m082971m511877m783150m743851m223747l281360
57024d7926849k423134k368712l385472m867489n732595n321215l896559k308390
57016g8230415j267571r28525r90309j041806q37443l80322J72743O85007J144141
57007h1674500J624887K190786K848977L560974M249825M805532N127944N183142
56999e2082433N010932M684803M280226L867500L499241L191113K927399K690024
56991b1931195K473329K274933K090229J919797J769194J637346J514893J395897
56983f855577J281820J172962J066104R62453Q68599g16695c802F39266N78777
$$ plain form
56974 1218043 1738303 2203820 2620195 2998438 3350229 3682082 3998630 4308833 4622527
56965 4622527 4939808 5246448 5519785 5738856 5893022 5985865 6030955 6042187 6028628 5997680
56955 5997680 5957680 5913494 5862643 5799659 5722472 5631888 5527626 5408953 5277790 5137961
56945 5137961 4992509 4844238 4697105 4554151 4415364 4279847 4148271 4020953 3896100
56936 3896100 3773194 3656286 3550658 3457893 3377238 3309775 3257364 3218688 3190205 3170389 3159672
56925 3159672 3156911 3159241 3164784 3171955 3176315 3171609 3154466 3125583 3086478 3038053 2982603 2924223
56913 2924223 2866142 2809426 2754636 2702809 2654371 2608586 2564185 2519258 2471056 2417851 2360963
56902 2360963 2303489 2247533 2194293 2145946 2104812 2070584 2040313 2011028 1980614 1946608 1906614
$$ packed form
56974A218043N20260M65517M16375L78243L51791L31853L16548L10203L13694
56965D622527L17281L06640K73337K19071J54166R2843M5090J1232j3559l0948
56955E997680m0000m4186n0851o2984p7187r0584j04262j18673j31163j39829
56945E137961j45452j48271j47133j42954j38787j35517j31576j27318j24853
56936C896100j22906j16908j05628r2765q0655o7463n2411l8676k8483j9816j0717
56925C159672k761K330N543P171M360m706j7143k8883l9105m8425n5450n8380
56913B924223n8081n6716n4790n1827m8438m5785m4401m4927m8202n3205n6888
56902B360963n7474n5956n3240m8347m1134l4228l0271k9285l0414l4006l9994
$$ plain form
56891 1906614 1860103 1807935 1750115 1686096 1617350 1547542 1479769 1415167 1354076 1296569 1241752
56880 1241752 1188702 1138578 1094081 1056493 1024891 998337 976938 960488 947973 938791 932374 925856
56868 925856 913920 892086 859244 816826 767065 712511 655708 598522 542664 490687 444741
56857 444741 404146 366081 329245 295182 265451 239450 215941 194881 176398 159341 142358
56846 142358 125673 110741 98812 90560 86278 85417 86339 87163 86680 84490 80959 76978 72882 67720
56832 67720 60843 54049 50481 51131 54235 58540 65182 75129 86415 95454 100137 100407 96755 89649 79928
56817 79928 68508 55786 42058 28199 15436 4927 -2104 -4629 -2727 2458 10357 21840 37969
56804 37969 58741 83893 114200 150882 193658 239664 283866 320597 345769 358516 360463 353447
$$ packed form
56891A906614m6511n2168n7820o4019o8746o9808o7773o4602o1091n7507n4817
56880A241752n3050n0124m4497l7588l1602k6554k1399j6450j2515r182o417o518
56868I25856j1936k1834l2842m2418m9761n4554n6803n7186n5858n1977m5946
56857D44741m0595l8065l6836l4063k9731k6001k3509k1060j8483j7057j6983
56846A42358j6685j4932j1929q252m282q61R22Q24m83k190l531l981m096n162
56832F7720o877o794l568O50L104M305O642R947J1286R039M683K70l652p106r721
56817G9928j1420j2722j3728j3859j2763D927b104k525J902B458P899J1483J6129
56804C7969K0772K5152L0307L6682M2776M6006M4202L6731K5172J2747J947p016
$$ plain form
56792 353447 338720 318272 295426 273335 253853 238410 228689 225417 227472 233382 243098 257457
56780 257457 276677 300553 329669 365446 409227 461777 522619 588429 652342 706218 744258
56769 744258 764493 767483 754616 727746 689805 645278 599584 557256 520348 488794 462155 440398
56757 440398 423307 410460 402178 399491 402732 411131 424126 441999 464847 491993 522655 555489
56745 555489 586726 610493 622430 622112 611094 590235 560412 524517 486728 450274 417094 388553
56733 388553 364779 344111 325132 308793 296907 289158 283634 280072 280481 286312 296791 310342 325982
56720 325982 342622 358252 370487 377249 376833 368465 353223 333603 311873 289254 266412 243712
56708 243712 221043 198348 176340 155909 137139 119932 105309 94579 87094 80162 71583 61339
$$ packed form
56792C53447j4727k0448k2846k2091j9482j5443r721l272K055N910R716J4359
56780B57457J9220K3876K9116L5777M3781N2550O0842O5810O3913N3876L8040
56769G44258K0235K990j2867k6870l7941m4527m5694m2328l6908l1554k6639k1757
56757D40398j7091j2847q282k687L241Q399J2995J7873K2848K7146L0662L2834
56745E55489L1237K3767J1937l18j1018k0859k9823l5895l7789l6454l3180k8541
56733C88553k3774k0668j8979j6339j1886p749n524l562M09N831J0479J3551J5640
56720C25982J6640J5630J2235O762m16q368j5242j9620k1730k2619k2842k2700
56708B43712k2669k2695k2008k0431j8770j7207j4623j0730p485o932q579j0244
$$ plain form
56696 61339 50722 40915 32648 26058 20429 14934 9847 6181 4042 2400 592 -1136 -2836 -5269
56682 -5269 -8556 -11535 -13217 -14043 -15072 -16599 -18210 -19574 -20558 -21039 -21071 -20959 -20978 -21368 -22607 -25078 -28306
56665 -28306 -31064 -32355 -31882 -29853 -27143 -25385 -25758 -27524 -28669 -28040 -25900 -22609 -18229 -13704 -10852
56650 -10852 -10386 -11058 -11471 -11648 -12028 -12014 -10652 -8183 -5882 -4645 -4374 -4531 -4746 -5001 -5364 -5383 -3997 -800
56631 2855 5137 6176 7974 11562 15677 18803 21063 23198 24997 26090 27346 30043 33994 37581 39374
56616 39374 39102 37615 36621 37743 40888 44073 45687 46254 47052 47904 47768 46997 47322 49472 52227 54083
56600 54083 54782 54766 54188 53048 51737 50819 50504 50575 50610 50236 49497 49186 50564 54422 60196 65945 69553 70535
56582 70535 70696 72355 75708 78679 79746 80072 82048 86327 91232 94727 96052 95608 94388 93771 94953
$$ packed form
56696F1339j0617r807q267o590n629n495n087l666k139j642E92a136j700k433
56682e269l287k979j682q26j029j527j611j364r84m81l2J12j9l90j239k471l228
56665b8306k758j291M73K029K710J758l73j766j145O29K140L291M380M525K852
56650a0852M66o72m13j77l80J4J362K469K301J237K71j57k15k55l63j9J386h00
56631B855K282J039J798L588M115L126K260K135J799J093J256K697L951L587J793
56616C9374k72j487r94J122L145L185J614N67P98Q52j36p71L25K150K755J856
56600E4083O99j6n78j140j311r18l15P1L5l74p39l11J378L858N774N749L608R82
56582G0535J61J659L353K971J067L26J976M279M905L495J325m44j220o17J182
$$ plain form
56567 94953 97941 101407 103871 104816 104491 103087 100659 97782 95642 94913 94710 93321 90154 86411 83491
56552 83491 81402 79466 77914 77618 78433 79073 78798 78115 77532 76765 75618 74655 74398 74683 75371 76817 79078
56535 79078 81427 83265 84730 85932 86453 86307 86539 88170 91221 95340 100390 105664 109602 111427 112282
56520 112282 113745 115929 118048 119951 121924 123664 124850 126158 128392 131077 133246 135253 138453 143385
56506 143385 149528 156493 164174 172123 180313 190184 203126 217863 231051 240782 248023 254414 260466
56493 260466 266547 273664 281877 289054 292591 291915 288511 284239 280460 278064 277048 276214 274211 270903 267194
56478 267194 263660 259997 255785 251190 246736 242751 239221 236031 233152 230558 228058 225412 222716 220382
56464 220382 218451 216127 212438 207409 202231 198267 196075 195320 195176 194759 193573 191840 190270 189361 188939
$$ packed form
56567I4953K988L466K464R45l25j404k428k877k140p29k03j389l167l743k920
56552H3491k089j936j552k96Q15O40k75o83n83p67j147r63k57K85O88J446K261
56535G9078K349J838J465J202N21j46K32J631L051M119N050N274L938J825Q55
56520A12282J463K184K119J903J973J740J186J308K234K685K169K007L200M932
56506A43385O143O965P681P949Q190R871J2942J4737J3188R731P241O391O052
56493B60466O081P117Q213P177L537o76l404m272l779k396j016q34k003l308l709
56478B67194l534l663m212m595m454l985l530l190k879k594k500k646k696k334
56464B20382j931k324l689n029n178l964k192p55j44m17j186j733j570r09m22
$$ plain form
56449 188939 188394 187279 185681 184005 182461 180881 179096 177256 175497 173636 171673 170301 170183 170884 171429
56434 171429 171906 173356 175772 177443 177057 175522 174846 175894 178101 180776 183723 186898 190165 193159 195018
56419 195018 194910 193321 192056 192286 193282 193770 193661 193531 193320 192706 192081 191856 191342 189608 187170 185558 185359
56402 185359 185769 185962 186002 186519 188243 191485 195337 197943 198458 198214 199039 201102 203455 205882 208817 212046
56386 212046 214894 217202 218721 218261 215124 210931 208195 207388 207218 207424 209067 211909 213777 213284 211389
56371 211389 209563 207987 206277 204603 203185 201851 200809 200930 202527 204638 206049 206436 206334 206662 208259
56356 208259 211030 213566 214531 214348 214555 215817 217633 219543 221105 221033 218285 214115 211288 210975 211938 212874
56340 212874 213801 214846 215575 216107 217224 218828 219921 220590 222186 224816 226510 225882 224095 223135 223493 224577
$$ packed form
56449A88939n45j115j598j676j544j580j785j840j759j861j963j372j18P01N45
56434A71429M77J450K416J671l86j535o76J048K207K675K947L175L267K994J859
56419A95018j08j589j265K30R96M88j09j30k11o14o25k25n14j734k438j612j99
56402A85359M10J93M0N17J724L242L852K606N15k44Q25K063K353K427K935L229
56386B12046K848K308J519m60l137m193k736q07j70K06J643K842J868m93j895
56371B11389j826j576j710j674j418j334j042J21J597K111J411L87j02L28J597
56356B08259K771K536R65j83K07J262J816J910J562p2k748m170k827l13R63R36
56340B12874R27J045P29N32J117J604J093O69J596K630J694o28j787r60L58J084
$$ plain form
56324 224577 226101 227956 229759 231486 233806 237135 241105 245225 249031 251513 251868 251062 251094 252383 253551
56309 253551 254087 255230 257642 260322 262598 265109 267813 269232 268988 269045 270937 273682 275974 278495 282209
56294 282209 286187 289158 291656 294517 296731 297110 297019 298887 302635 305744 306608 305974 305413 306079 308572 312320
56278 312320 315363 316331 316358 317597 320221 322484 323519 324454 326652 330244 334599 339197 343884 348979 355109
56263 355109 362299 369496 375522 380029 383016 384234 383924 383438 384100 386022 388788 392510 397204 401915 405636
56248 405636 408646 411910 415707 419824 424520 430254 436916 444309 452977 463605 475920 488832 501189
56235 501189 511954 520519 527656 535380 544984 555840 566795 577898 590032 603701 619042 636190
56223 636190 654815 674001 693245 712816 732727 752539 772627 794219 817466 841096 864903
$$ packed form
56324B24577J524J855J803J727K320L329L970M120L806K482L55q06L2J289J168
56309B53551N36J143K412K680K276K511K704J419k44N7J892K745K292K521L714
56294B82209L978K971K498K861K214L79r1J868L748L109Q64o34n61O66K493L748
56278C12320L043R68K7J239K624K263J035R35K198L592M355M598M687N095O130
56263C55109P190P197O026M507K987J218l10m86O62J922K766L722M694M711L721
56248D05636L010L264L797M117M696N734O662P393Q668J0628J2315J2912J2357
56235E01189J0765Q565P137P724R604J0856J0955J1103J2134J3669J5341J7148
56223F36190J8625J9186J9244J9571J9911J9812K0088K1592K3247K3630K3807
$$ plain form
56212 864903 890898 920789 953857 988650 1025183 1063954 1104336 1145820 1189751 1238105 1291469
56201 1291469 1349736 1413655 1484073 1560609 1642770 1731598 1828723 1934595 2049055 2172734 2306527
56190 2306527 2450517 2604507 2768387 2940682 3118030 3297617 3478942 3661720 3843325
56181 3843325 4019671 4187065 4341521 4477904 4591908 4681848 4746894 4785124 4795252 4778734
56171 4778734 4737900 4673412 4585892 4478844 4357422 4225151 4083915 3936089 3784391 3630561
56161 3630561 3476279 3324341 3176965 3034169 2895802 2763556 2638699 2519666 2404671
56152 2404671 2295069 2193108 2097959 2007325 1921550 1842383 1768713 1697534 1628718 1565011 1507447
56141 1507447 1454347 1404905 1360104 1319725 1281750 1245360 1211625 1180894 1152226 1125649 1102073
$$ packed form
56212H64903K5995K9891L3068L4793L6533L8771M0382M1484M3931M8354N3364
56201A291469N8267O3919P0418P6536Q2161Q8828R7125J05872J14460J23679J33793
56190B306527J43990J53990J63880J72295J77348J79587J81325J82778J81605
56181C843325J76346J67394J54456J36383J14004Q9940O5046L8230J0128j6518
56171D778734m0834o4488q7520j07048j21422j32271j41236j47826j51698j53830
56161C630561j54282j51938j47376j42796j38367j32246j24857j19033j14995
56152B404671j09602j01961r5149r0634q5775p9167p3670p1179o8816o3707n7564
56141A507447n3100m9442m4801m0379l7975l6390l3735l0731k8668k6577k3576
$$ plain form
56130 1102073 1080740 1059636 1038816 1020496 1005482 992227 979785 968889 959530 950183 940254 931014
56118 931014 923509 917557 913144 910756 910126 910591 912637 917102 923139 929166 935393 943093 951930 960519 969086
56103 969086 978858 989489 1000007 1011707 1026943 1045570 1065794 1087993 1114085 1143551 1173984 1205603
56091 1205603 1241302 1281958 1325536 1371424 1421977 1479057 1542530 1612946 1692362 1781791 1880830
56080 1880830 1990006 2109941 2237670 2367060 2493161 2612852 2721690 2814848 2892032 2957393
56070 2957393 3013825 3061342 3101428 3137779 3171000 3197113 3213415 3222001 3225661 3224209 3216795 3203960
56058 3203960 3184945 3156130 3114173 3057902 2985968 2896536 2791481 2677758 2562462 2449126
56048 2449126 2339946 2237986 2145158 2060989 1985111 1918315 1860040 1808038 1761661 1722177 1688908
$$ packed form
56130A102073k1333k1104k0820j8320j5014j3255j2442j0896r359r347r929r240
56118I31014p505n952m413k388o30M65K046M465O037O027O227P700Q837Q589Q567
56103I69086R772J0631J0518J1700J5236J8627K0224K2199K6092K9466L0433L1619
56091A205603L5699M0656M3578M5888N0553N7080O3473P0416P9416Q9429R9039
56080A880830J09176J19935J27729J29390J26101J19691J08838R3158P7184O5361
56070B957393N6432M7517M0086L6351L3221K6113J6302Q586L660j452p414j2835
56058C203960j9015k8815m1957n6271p1934q9432j05055j13723j15296j13336
56048B449126j09180j01960r2828q4169p5878o6796n8275n2002m6377l9484l3269
$$ plain form
56037 1688908 1658828 1631259 1609033 1593378 1581373 1570045 1559394 1550061 1541848 1535926 1534575 1537303
56025 1537303 1541129 1545751 1553920 1565558 1576655 1585788 1596502 1610879 1625828 1638484 1650493 1664133
56013 1664133 1678877 1694634 1713724 1736517 1759486 1780591 1802272 1826409 1851001 1874796 1900341
56002 1900341 1929102 1958208 1985454 2012858 2041915 2070112 2095864 2122117 2151146 2180454 2207779
55991 2207779 2235458 2265626 2295748 2323552 2352030 2384860 2420725 2456767 2493970 2534616 2577887
55980 2577887 2622250 2669031 2719787 2773262 2828153 2885312 2944512 3003360 3062241 3125395 3194053
55969 3194053 3263745 3331725 3401358 3475586 3552064 3628947 3709449 3796150 3886675 3979563 4078467
55958 4078467 4185939 4299174 4416528 4541743 4676969 4818593 4965092 5121708 5291680
$$ packed form
56037A688908l0080k7569k2226j5655j2005j1328j0651r333q213n922j351K728
56025A537303L826M622Q169J1638J1097R133J0714J4377J4949J2656J2009J3640
56013A664133J4744J5757J9090K2793K2969K1105K1681K4137K4592K3795K5545
56002A900341K8761K9106K7246K7404K9057K8197K5752K6253K9029K9308K7325
55991B207779K7679L0168L0122K7804K8478L2830L5865L6042L7203M0646M3271
55980B577887M4363M6781N0756N3475N4891N7159N9200N8848N8881O3154O8658
55969C194053O9692O7980O9633P4228P6478P6883Q0502Q6701R0525R2888R8904
55958D078467J07472J13235J17354J25215J35226J41624J46499J56616J69972
$$ plain form
55949 5291680 5470283 5653549 5845354 6049570 6263144 6483893 6717331 6968510 7234955
55940 7234955 7515117 7815724 8142977 8494837 8870181 9276949 9722561 10205038 10722557
55931 10722557 11282530 11891384 12544605 13237323 13975916 14769036 15616611 16517875 17479592
55922 17479592 18505106 19586560 20720511 21920536 23202785 24572410 26038283 27627279
55914 27627279 29367622 31270370 33342551 35604056 38075325 40766099 43697867 46922938
55906 46922938 50501520 54477002 58893913 63817573 69309931 75410549 82174996 89713185
55898 89713185 98162980 107661187 118387981 130617208 144683490 160939466 179800927
55891 179800927 201785630 227420341 257108037 291025957 328764554 368484802 406220060
$$ packed form
55949E291680J78603J83266J91805K04216K13574K20749K33438K51179K66445
55940G234955K80162L00607L27253L51860L75344M06768M45612M82477N17519
55931A0722557N59973O08854O53221O92718P38593P93120Q47575R01264R61717
55922A7479592J025514J081454J133951J200025J282249J369625J465873J588996
55914B7627279J740343J902748K072181K261505K471269K690774K931768L225071
55906D6922938L578582L975482M416911M923660N492358O100618O764447P538189
55898H9713185Q449795R498207J0726794J2229227J4066282J6255976J8861461
55891A79800927K1984703K5634711K9687696L3917920L7738597L9720248L7735258
$$ plain form
55884 406220060 436472391 454296910 457457680 446994137 426053321 398276194 366856679
55877 366856679 334302310 302424024 272376107 244803271 220018750 198081196 178821409
55870 178821409 161938585 147127449 134124758 122691025 112613693 103724897 95878658
55863 95878658 88915410 82675050 77033811 71903052 67204654 62874667 58881024 55210057
55855 55210057 51837937 48731812 45868217 43228687 40783937 38501802 36365435 34367167
55847 34367167 32491274 30719536 29047437 27478203 26005746 24618364 23313572 22093844
55839 22093844 20952059 19875629 18861373 17912888 17026785 16194261 15412676 14683047 13999049
55830 13999049 13350377 12734383 12153572 11604774 11081908 10586801 10126356 9700804 9304162
$$ packed form
55884D06220060L0252331J7824519L160770j0463543k0940816k7777127l1419515
55877C66856679l2554369l1878286l0047917k7572836k4784521k1937554j9259787
55870A78821409j6882824j4811136j3002691j1433733j0077332q888796p846239
55863I5878658o963248o240360n641239n130759m698398m329987l993643l670967
55855E5210057l372120l106125k863595k639530k444750k282135k136367j998268
55847C4367167j875893j771738j672099j569234j472457j387382j304792j219728
55839B2093844j141785j076430j014256r48485q86103q32524p81585p29629o83998
55830A3999049o48672o15994n80811n48798n22866m95107m60445m25552l96642
$$ plain form
55821 9304162 8933648 8588721 8263197 7948332 7642449 7348746 7065361 6786099 6509277
55812 6509277 6237529 5970671 5706981 5449888 5205369 4973849 4751828 4539721 4340789
55803 4340789 4154079 3975859 3806526 3649004 3501811 3360731 3225945 3100747 2984701
55794 2984701 2874820 2772079 2679898 2597226 2519569 2445702 2377061 2311667 2245198 2177499 2112195
55783 2112195 2050601 1991362 1934903 1882637 1832988 1783576 1735944 1692712 1651816 1609419 1566904
55772 1566904 1528857 1495436 1462922 1430738 1401554 1375078 1347986 1319798 1293006 1267579 1241030
55761 1241030 1213907 1189645 1168833 1148745 1128690 1110805 1095402 1080388 1065474 1052397 1041009
55750 1041009 1029692 1019547 1013623 1011942 1011656 1012024 1014805 1019859 1024861 1029463 1035438 1042571 1048512 1052712
$$ packed form
55821I304162l70514l44927l25524l14865l05883k93703k83385k79262k76822
55812F509277k71748k66858k63690k57093k44519k31520k22021k12107j98932
55803D340789j86710j78220j69333j57522j47193j41080j34786j25198j16046
55794B984701j09881j02741r2181q2672p7657p3867o8641o5394o6469o7699o5304
55783B112195o1594n9239n6459n2266m9649m9412m7632m3232m0896m2397m2515
55772A566904l8047l3421l2514l2184k9184k6476k7092k8188k6792k5427k6549
55761A241030k7123k4262k0812k0088k0055j7885j5403j5014j4914j3077j1388
55750A041009j1317j0145n924j681k86L68K781N054N002M602N975P133N941M200
$$ plain form
55736 1052712 1056416 1058729 1056717 1049569 1039023 1025878 1009829 992342 975734 959659 942401 925164
55724 925164 910910 899223 886637 872195 858669 848138 840189 834569 831782 830950 830761 832571 838969
55711 838969 849267 859904 869029 877030 882769 883214 877012 865108 848093 826382 802556 779863 758635
55698 758635 737486 717154 699343 682783 664759 645850 628825 613684 598556 584694 575133 568523
55686 568523 560014 548772 539129 533396 529134 524943 523414 525954 529388 530258 528567 525092 518851 509700
55672 509700 500193 492498 486117 480244 475496 471774 467411 461925 456880 452651 447310 440088 433148 428557
55658 428557 426184 425635 427378 430804 434086 437203 442307 450041 458277 465257 470924 474385 473654 469260 464580
55643 464580 460991 455940 447445 437231 427593 418303 408662 399635 391811 383905 375344 367890 362820 359005
$$ packed form
55736A052712L704K313k012p148j0546j3145j6049j7487j6608j6075j7258j7237
55724I25164j4254j1687j2586j4442j3526j0531p949n620k787q32j89J810O398
55711H38969J0298J0637R125Q001N739M45o202j1904j7015k1711k3826k2693k1228
55698G58635k1149k0332j7811j6560j8024j8909j7025j5141j5128j3862r561o610
55686E68523q509j1242r643n733m262m191j529K540L434Q70j691l475o241r151
55672E09700r507p695o381n873m748l722m363n486n045m229n341p222o940m591
55658D28557k373n49J743L426L282L117N104P734Q236O980N667L461p31m394m680
55643D64580l589n051q495j0214r638r290r641r027p824p906q561p454n070l815
$$ plain form
55629 359005 355611 354063 355204 356903 356810 355508 354935 355609 357307 360566 365430 370286 373715 376183 378629
55614 378629 380935 382900 384972 386893 387453 386565 385641 385058 383549 381099 379946 381421 384192 386916 390140
55599 390140 394175 397703 400144 402866 406287 408352 407815 406640 407009 408244 408807 409089 409826 409749 407337 403333
55583 403333 399276 395085 390148 385087 380227 373908 364762 354388 345435 338137 330948 323586 317218 312263
55569 312263 308002 303887 299747 295340 290973 287699 285670 283371 279691 275602 272539 270332 268058 265664
55555 265664 263420 260895 257842 254897 252303 249250 245592 242635 240871 238599 234364 229330 225628 223711
55541 223711 222748 222201 221440 219369 216155 214022 214652 216978 218927 219773 219334 216726 212004 207458 205090 204012
55525 204012 202332 200303 199551 200524 202898 207170 213441 219638 223475 225507 227968 231375 234593 237583 241547
$$ packed form
55629C59005l394j548J141J699r3j302n73O74J698L259M864M856L429K468K446
55614C78629K306J965K072J921N60q88r24n83j509k450j153J475K771K724L224
55599C90140M035L528K441K722L421K065n37j175L69J235N63K82P37p7k412m004
55583D03333m057m191m937n061m860o319r146j0374q953p298p189p362o368m955
55569C12263m261m115m140m407m367l274k029k299l680m089l063k207k274k394
55555B65664k244k525l053k945k594l053l658k957j764k272m235n034l702j917
55541B23711r63n47p61k071l214k133O30K326J949Q46m39k608m722m546k368j078
55525B04012j680k029p52R73K374M272O271O197L837K032K461L407L218K990L964
$$ plain form
55510 241547 246700 252180 257942 264452 270712 274831 276679 277969 279546 280427 279668 277364 273581 268044 261368
55495 261368 255123 250095 245581 240746 235744 231159 227166 223576 220310 217761 216765 217690 219307 219539 217873
55480 217873 216027 215478 215561 214982 213922 213258 212865 212265 211924 212214 212012 210197 207855 206898 206873 205250 200942
55463 200942 195628 191228 187631 183557 178485 173104 168541 165468 163578 161842 159604 157175 155176 153905
55449 153905 153657 154744 156553 157507 156775 155191 153833 152777 152040 152338 153622 154151 152661 150453 149687 150407
55433 150407 151016 150976 151208 152145 153198 154056 155028 156115 156890 157170 156888 155872 154718 155034 157438 160099 160840
55416 160840 160002 159567 160150 160833 161476 162885 164599 164652 162191 158713 156057 154449 153087 151533 149861 148148
55400 148148 146349 144298 141837 139264 137313 136177 135181 134047 133696 134723 135864 135330 133168 130914 129413
$$ packed form
55510B41547N153N480N762O510O260M119J848J290J577Q81p59k304l783n537o676
55495B61368o245n028m514m835n002m585l993l590l266k549r96R25J617K32j666
55480B17873j846n49Q3n79j060o64l93o00l41K90k02j815k342r57k5j623m308
55463B00942n314m400l597m074n072n381m563l073j890j736k238k429j999j271
55449A53905k48J087J809R54p32j584j358j056p37K98J284N29j490k208p66P20
55433A50407O09m0K32R37J053Q58R72J087P75K80k82j016j154L16K404K661P41
55416A60840q38m35N83O83O43J409J714N3k461l478k656j608j362j554j672j713
55400A48148j799k051k461k573j951j136r96j134l51J027J141n34k162k254j501
$$ plain form
55385 129413 128403 127991 128887 131181 134105 137001 139364 140180 138682 135818 133779 133919 136072 139677 144305
55370 144305 149060 152644 154238 153729 151414 148373 146533 147033 148790 149927 150350 151606 154552 158692 163687
55355 163687 169873 177004 183830 189181 192458 193131 191142 187978 185966 185986 186782 186748 185473 183386 180899 178268
55339 178268 175617 172971 170712 169726 170274 170989 169919 166460 161567 156552 152543 150479 150341 150701 150273 149617
55323 149617 150140 151848 153473 154435 155143 155566 155079 153696 152064 150306 148200 146283 145343 145089 144844 145120
55307 145120 146593 147813 146281 142101 138344 137207 137851 138644 139390 140246 140385 139226 137728 137151 137452 137789
55291 137789 137571 136371 134037 131704 131334 133251 135377 136003 136085 137457 139908 141613 141801 141429 141491 141977 142403
55274 142403 142262 140974 138371 135435 133844 134457 136497 138310 138794 138249 137861 138246 138640 138003 136732 136461
$$ packed form
55385A29413j010m12Q96K294K924K896K363Q16j498k864k039J40K153L605M628
55370A44305M755L584J594n09k315l041j840N00J757J137M23J256K946M140M995
55355A63687O186P131O826N351L277O73j989l164k012K0P96l4j275k087k487k631
55339A78268k651k646k259r86N48P15j070l459m893n015m009k064j38L60m28o56
55323A49617N23J708J625R62P08M23m87j383j632j758k106j917r40k54k45K76
55307A45120J473J220j532m180l757j137O44P93P46Q56J39j159j498n77L01L37
55291A37789k18j200k334k333l70J917K126O26Q2J372K451J705J88l72O2M86M26
55274A42403j41j288k603k936j591O13K040J813M84n45l88L85L94o37j271k71
$$ plain form
55258 136461 138003 140345 142026 142694 142818 142562 141650 140000 137941 136096 135284 136107 138146 139784 139292 136156
55242 136156 131451 127179 125120 125720 127886 130104 131714 132811 133318 132994 132282 132231 133233 134527 135231 135426
55226 135426 135964 137508 139755 141317 140721 138117 135672 135474 137297 139328 140696 141976 143350 143934 143386
55211 143386 142738 142780 142768 141619 139517 137421 135737 134468 134059 134957 136526 137449 137258 136734 136635 136759 136588 136282
55193 136282 136494 137370 138269 138568 138277 137645 136648 135417 134696 135067 135964 136418 136544 136999 136956 134458 129494 124970
55175 124970 123346 123812 124331 124936 126836 129285 130080 129022 128415 129655 131381 131682 130446 128781 127544 127201
55159 127201 127942 129101 129355 128072 125785 123085 120027 116887 114509 113514 113942 115768 118774 121854 123573
55144 123573 123643 122888 121817 120522 119905 121306 124462 127382 128836 129600 130697 131910 132821 133873 135336 136304
$$ packed form
55258A36461J542K342J681O68J24k56r12j650k059j845q12Q23K039J638m92l136
55242A36156m705m272k059O00K166K218J610J097N07l24p12n1J002J294P04J95
55226A35426N38J544K247J562n96k604k445j98J823K031J368J280J374N84n48
55211A43386o48M2j2j149k102k096j684j269m09Q98J569R23j91n24r9J24j71l06
55193A36282K12Q76Q99K99k91o32r97j231p21L71Q97M54J26M55m3k498m964m524
55175A24970j624M66N19O05J900K449P95j058o07J240J726L01j236j665j237l43
55159A27201P41J159K54j283k287k700l058l140k378r95M28J826L006L080J719
55144A23573P0p55j071j295o17J401L156K920J454P64J097J213R11J052J463R68
$$ plain form
55128 136304 135801 134120 132329 131256 131373 132601 133680 133027 131083 130619 133629 138875 143446 145720 145856
55113 145856 144538 142677 141610 142097 143365 144206 144676 145719 147451 148863 149130 148414 147452 146956 147272 148167
55097 148167 149061 149627 149817 149230 147321 144601 142703 142586 143473 144285 145294 147332 149914 151324 150488 148037
55081 148037 145537 144181 144137 144788 145643 146989 149177 151361 151902 150463 148798 148772 150268 151724 152106 151520
55065 151520 150425 149086 147621 145919 143691 141094 138979 138045 137998 138064 138079 138603 140101 142334 144496 145799
55049 145799 146112 146095 146523 147618 149317 151819 155104 158265 160283 161404 162615 163778 163605 161750 159574
55034 159574 158284 157529 156650 156189 157144 159463 162024 163614 163415 161282 158223 156014 155834 157752 161520 166664
55018 166664 171490 173560 172240 169729 168538 168803 169074 168816 168793 169533 170591 171212 170997 170149 169585 170248 171818
$$ packed form
55128A36304n03j681j791j073J17J228J079o53j944m64L010N246M571K274J36
55113A45856j318j861j067M87J268Q41M70J043J732J412K67p16r62m96L16Q95
55097A48167Q94N66J90n87j909k720j898j17Q87Q12J009K038K582J410q36k451
55081A48037k500j356m4O51Q55J346K188K184N41j439j665k6J496J456L82n86
55065A51520j095j339j465j702k228k597k115r34m7O6J5N24J498K233K162J303
55049A45799L13j7M28J095J699K502L285L161K018J121J211J163j73j855k176
55034A59574j290p55q79m61R55K319K561J590j99k133l059k209j80J918L768N144
55018A66664M826K070j320k511j191K65K71k58k3P40J058O21k15q48n64O63J570
$$ plain form
55001 171818 172808 172492 171926 172349 173395 173760 172872 171041 168741 166731 166197 167594 169660 170461 169137 166070
54985 166070 162061 158150 155555 154698 154654 154236 153088 151151 148126 144578 142669 144251 148644 153546 157707
54970 157707 161359 164354 165617 164812 163257 162555 163023 163924 164716 165658 167297 169471 170872 170012 166917 163532
54954 163532 162053 163075 165488 167645 168406 167649 166309 165558 165744 166510 167799 169779 171768 172516 172039 171864
54938 171864 172856 174056 174433 174398 174535 174169 172577 170659 169992 170923 172760 175111 177810 180294 182194 183807
54922 183807 184965 184464 181924 179142 177981 177849 176965 175307 174363 174605 175269 176297 178418 181401 184160 186577
54906 186577 189345 191957 192843 191788 190338 189415 188378 186916 185899 185522 184447 182027 179936 180174 182383
54891 182383 184496 185421 185894 187021 188996 191138 192469 192313 190826 188983 187770 187493 187875 188500 188937 188785
$$ packed form
55001A71818R90l16n66M23J046L65q88j831k300k010n34J397K066Q01j324l067
54985A66070m009l911k595q57m4m18j148j937l025l548j909J582M393M902M161
54970A57707L652K995J263q05j555p02M68R01P92R42J639K174J401q60l095l385
54954A63532j479J022K413K157P61p57j340p51J86P66J289J980J989P48m77j75
54938A71864R92J200L77l5J37l66j592j918o67R31J837K351K699K484J900J613
54922A83807J158n01k540k782j161j32q84j658r44K42O64J028K121K983K759K417
54906A86577K768K612Q86j055j450r23j037j462j017l77j075k420k091K38K209
54891A82383K113R25M73J127J975K142J331j56j487j843j213k77L82O25M37j52
$$ plain form
54875 188785 187999 187162 187248 188974 192323 196745 201937 208251 215891 224023 231483 238421 246200 255246 264098
54860 264098 271243 276908 282182 287318 291982 296232 299869 301427 299399 294383 288739 284073 280046 275632
54846 275632 270531 265237 260368 255982 251223 245072 237873 231368 226599 222756 219019 216431 216487 218738 221432
54831 221432 223860 226355 228512 229397 229463 230427 233065 236722 241099 246824 253951 261395 268325 274830 280932
54816 280932 286278 291183 296626 302639 307876 311252 312971 313451 312197 308321 301539 292445 282387 273036
54802 273036 265250 258444 251833 245911 241576 238237 234358 229704 225406 221718 217465 212137 206890 202856
54788 202856 199870 197532 196163 195935 196111 195871 194985 193203 190158 186483 183926 183512 184286 184530 183560 181910
54772 181910 180395 179439 178778 177681 176001 174820 175069 175787 175075 172833 171102 171388 173065 174872 176575 178515
$$ packed form
54875A88785p86q37Q6J726L349M422N192O314P640Q132P460O938P779R046Q852
54860B64098P145N665N274N136M664M250L637J558k028n016n644m666m027m414
54846B75632n101n294m869m386m759o151p199o505m769l843l737k588N6K251K694
54831B21432K428K495K157Q85O6R64K638L657M377N725P127P444O930O505O102
54816B80932N346M905N443O013N237L376J719M80j254l876o782r094j0058r351
54802B73036p786o806o611n922m335l339l879m654m298l688m253n328n247m034
54788B02856k986k338j369k28J76k40q86j782l045l675k557m14P74K44r70j650
54772A81910j515r56o61j097j680j181K49P18p12k242j731K86J677J807J703J940
$$ plain form
54756 178515 180726 183164 185811 188010 188736 187967 186683 185193 182818 179800 178002 178759 181166 183535 185651
54741 185651 188575 192911 198121 203035 206391 207338 205960 202989 199032 194752 191544 190737 191941 193545 195104
54726 195104 197764 201878 205832 208136 209395 211204 214127 217611 220958 223602 225309 226805 229356 233169
54712 233169 237158 240695 244532 249564 255929 263720 273139 283305 292405 299775 306378 312488 316551 317240
54698 317240 314923 310169 302873 294271 287623 284644 282850 278739 272369 266388 261680 256851 251570 247541
54684 247541 245770 245251 244850 244491 243811 241597 237700 234148 233048 234161 235568 236203 236706 237914 239540 240953
54668 240953 242761 246648 253248 261032 268205 275162 283626 293579 302724 309345 313889 316937 317466 314511
54654 314511 309228 303677 298419 292758 286594 280579 274969 269568 264307 258820 252201 244436 237443 233347
$$ packed form
54756A78515K211K438K647K199P26p69j284j490k375l018j798P57K407K369K116
54741A85651K924M336N210M914L356R47j378k971l957m280l208q07J204J604J559
54726A95104K660M114L954K304J259J809K923L484L347K644J707J496K551L813
54712B33169L989L537L837N032O365P791R419J0166R100P370O603O110M063O89
54698C17240k317m754p296q602o648k979j794m111o370n981m708m829n281m029
54684B47541j771n19m01l59o80k214l897l552j100J113J407O35N03J208J626J413
54668B40953J808L887O600P784P173O957Q464R953R145O621M544L048N29k955
54654C14511n283n551n258n661o164o015n610n401n261n487o619p765o993m096
$$ plain form
54640 233347 232212 232561 233394 234328 234508 233051 230312 227287 224110 220450 216940 214633 213346 211955 210070
54625 210070 207933 205144 201268 197541 196053 196956 198163 198108 197228 196400 195571 194548 193634 192739 191168 189158
54609 189158 188483 190541 194522 198293 200512 201216 200990 200375 199835 199638 199740 199984 200355 200846 201253 201142 200102
54592 200102 198315 196916 197143 198715 199756 198953 197182 196136 196117 196274 196407 196986 197616 197133 195482 194120
54576 194120 194005 194334 193906 192846 192252 192712 193786 194598 194491 193375 191803 190652 190593 191768 193595 194799
54560 194799 194241 192252 190613 190642 191877 193274 194889 197190 199321 199622 197814 195338 193354 191660 189894
54545 189894 188695 189082 191323 194768 198258 200588 201154 200351 199027 197746 196976 197391 199094 200941 201677 201470
54529 201470 201332 201395 200975 200097 199522 199363 198994 198394 198219 198468 198428 198037 197918 197933 197301 196390 196689 198540 200612
$$ packed form
54640B33347j135L49Q33R34J80j457k739l025l177l660l510k307j287j391j885
54625B10070k137k789l876l727j488R03J207n5q80q28q29j023r14q95j571k010
54609A89158o75K058L981L771K219P04k26o15n40j97J02K44L71M91M07j11j040
54592B00102j787j399K27J572J041q03j771j046j9J57J33N79O30m83j651j362
54576A94120j15L29m28j060n94M60J074Q12j07j116j572j151n9J175J827J204
54560A94799n58j989j639K9J235J397J615K301K131L01j808k476j984j694j766
54545A89894j199L87K241L445L490K330N66q03j324j281p70M15J703J847P36k07
54529B01470j38O3m20q78n75j59l69o00j75K49m0l91j19J5o32r11K99J851K072
$$ plain form
54510 200612 202206 204228 206873 208188 206423 202499 198687 196033 194554 194776 197154 200548 203152 204731
54496 204731 206424 208569 210269 211137 211871 212788 213104 212201 210565 208957 207606 206816 207456 210016 213636 216891
54480 216891 219273 221189 222698 223116 222070 220271 218766 217876 217433 217637 218806 220295 220624 219151 216938
54465 216938 215408 214816 214702 215163 216569 218407 219653 220258 221095 222280 222747 221921 220770 220524 221113 221518 221028
54448 221028 219556 217360 215203 214254 214966 216322 216931 216753 217035 218601 220824 222498 223254 223833 225146 227271
54432 227271 229457 231112 232623 234923 238290 241888 244585 245887 245975 245270 244238 243348 242877 242890 243531 245035
54416 245035 247250 249427 250892 251878 253308 255709 258573 260925 262342 263161 263771 264093 264050 264204 265310 267184
54400 267184 268654 268847 268022 266788 265108 262640 259586 256455 253213 249377 244952 240765 237850 236689 236878
$$ packed form
54510B00612J594K022K645J315j765l924l812k654j479K22K378L394K604J579
54496B04731J693K145J700Q68P34R17L16r03j636j608j351p90O40K560L620L255
54480B16891K382J916J509M18j046j799j505q90m43K04J169J489L29j473k213
54465B16938j530n92j14M61J406J838J246O05Q37J185M67q26j151k46N89M05m90
54448B21028j472k196k157r49P12J356O09j78K82J566K223J674P56N79J313K125
54432B27271K186J655J511K300L367L598K697J302Q8p05j032q90m71J3O41J504
54416B45035K215K177J465R86J430K401K864K352J417Q19O10L22m3J54J106J874
54400B67184J470J93q25j234j680k468l054l131l242l836m425m187k915j161J89
$$ plain form
54385 236878 237278 237004 236585 237589 240547 243931 245917 246463 246613 246456 245249 243248 241747 241138 240409 238970
54369 238970 237617 237077 236847 236260 235731 236040 237039 237901 238270 238489 239074 240401 242567 245109 247149 248129 248075
54352 248075 247076 245186 243092 242129 242997 244861 246174 246166 245315 244789 245662 248160 251354 253999 255857 257729
54336 257729 260034 261984 262445 261137 258849 257117 257738 261540 267083 271414 272771 272031 271132 270972 271460 272615
54320 272615 274397 275967 276374 275859 275542 275890 276474 277226 278962 282225 286306 289938 292553 294432 296003 297503
54304 297503 299236 301479 303939 305828 306979 308332 310425 311629 309286 303153 296422 292228 290204 287919
54290 287919 284848 282745 282261 281564 279144 276050 274041 272900 271071 268100 265005 262708 261379 261018 261464
54275 261464 261900 261376 259924 258472 257608 257084 256500 255902 255643 256118 257610 259983 262464 264040 264071 262477 259732
$$ packed form
54385B36878M00k74m19J004K958L384J986N46J50j57j207k001j501o09p29j439
54369B38970j353n40k30n87n29L09R99Q62L69K19N85J327K166K542K040R80n4
54352B48075r99j890k094r63Q68J864J313qq51n26Q73K498L194K645J858J872
54336B57729K305J950M61j308k288j732O21L802N543M331J357p40q99j60M88J155
54320B72615J782J570M07n15l17L48N84P52J736L263M081L632K615J879J571J500
54304B97503J733K243K460J889J151J353K093J204k343o133o731m194k024k285
54290B87919l071k103m84o97k420l094k009j141j829k971l095k297j329l61M46
54275B61464M36n24j452j452q64n24n84n98k59M75J492K373K481J576L1j594k745
$$ plain form
54258 259732 256984 255750 256832 259459 261860 262790 262503 262392 263675 266120 267999 267653 265086 261625 258222
54243 258222 255013 252519 251920 253409 255286 255747 254931 254209 254015 253601 252684 252039 252209 252633 252480 251705 250858
54226 250858 250303 250045 249995 250058 250083 250090 250477 251730 253667 255189 255251 254333 254456 257117 261350 264445 264568 262103
54208 262103 258565 255170 252655 251540 251873 253223 255395 258610 262630 266392 269099 271166 273524 276368
54194 276368 279099 281046 281758 281082 279569 278374 278107 278110 277399 275972 274605 273736 273229 273049 273463 274602 276182
54177 276182 277600 278158 277604 276726 276888 278552 280691 282005 282140 281300 279475 276797 274025 271819 270021 268500
54161 268500 268043 269320 271384 272456 272088 271361 271019 270577 269427 267614 265175 261844 258070 255424 255100 256416
54145 256416 257439 256866 254922 252770 251554 251788 253039 254160 254304 253881 254224 256093 258698 260529 261059 261225
$$ packed form
54258B59732k748j234J082K627K401R30k87j11J283K445J879l46k567l461l403
54243B58222l209k494n99J489J877M61q16p22j94m14r17o45J70M24j53p75q47
54226B50858n55k58n0O3K5PL87J253J937J522O2r18J23K661M233L095J23k465
54208B62103l538l395k515j115L33J350K172L215M020L762K707K067K358K844
54194B76368K731J947P12o76j513j195k67Lp11j427j367q69n07j80M14J139J580
54177B76182J418N58n54q78J62J664K139J314J35q40j825k678k772k206j798j521
54161B68500m57J277K064J072l68p27l42m42j150j813k439l331l774k646l24J316
54145B56416J023n73j944k152j216K34J251J121J44m23L43J869K605J831N30J66
$$ plain form
54129 261225 262136 263783 265392 266594 267594 268464 269059 269597 270428 271131 270757 269415 268718 270020 272815 275470
54113 275470 276996 277458 277180 276362 275239 273945 272300 270106 267507 264859 262692 261930 263266 265815 267283
54098 267283 266362 264328 263386 264108 265538 267142 269185 271385 272714 272779 272323 272027 271753 271234 270598 269839 268617
54081 268617 266984 265637 264962 264460 263665 263178 264091 266496 269039 270094 269327 268034 267833 268970 270183 270459
54065 270459 270532 272089 275701 280250 284453 288258 292401 297106 301844 306206 310515 315339 320645 325766 330129
54050 330129 333671 336401 337978 338140 337159 335234 331811 326437 320201 315204 312276 310232 307792 305148 303000
54035 303000 301065 298628 295878 293695 292457 291880 291603 291253 290492 289795 290609 293688 297698 300417 301055 300545
54019 300545 299965 299720 300000 301002 302716 305207 308775 313156 317120 319786 321809 324204 326651 328381 330082
$$ packed form
54129B61225R11J647J609J202J000Q70N95N38Q31P03l74j342o97J302K795K655
54113B75470J526M62k78q18j123j294j645k194k599k648k167p62J336K549J468
54098B67283r21k034r42P22J430J604K043K200J329O5m56k96k74n19o36p59j222
54081B68617j633j347o75n02p95m87R13K405K543J055p67j293k01J137J213K76
54065B70459P3J557L612M549M203L805M143M705M738M362M309M824N306N121M363
54050C30129L542K730J577J62r81j925l423n374o236m997k928k044k440k644k148
54035C03000j935k437k750k183j238n77k77l50p61o97Q14L079M010K719O38n10
54019C00545n80k45K80J002J714K491L568M381L964K666K023K395K447J730J701
$$ plain form
54004 330082 333142 337121 339835 340251 339645 339605 340421 341883 343910 345617 345343 342767 339919 339124 340885 344584
53988 344584 350054 357159 364676 371030 375861 379954 384144 389229 396375 406266 417987 429850 441341
53975 441341 453229 465750 477856 488601 498329 507852 517152 525634 533287 540802 548493 555783 561985
53962 561985 567162 571834 576089 579479 581794 583458 584906 585863 585526 583299 579194 573690 567433 560798 553396
53947 553396 544210 532752 520281 509570 503034 500716 499974 497416 491568 483783 476492 470877 466600 463094
53933 463094 459950 456174 450540 443327 436566 431865 428925 426934 426274 427596 430084 432198 433790 436073
53919 436073 439522 443015 445258 446223 447103 449510 454573 461904 469394 474648 476663 475833 472903 468595 463685
53904 463685 458452 452455 445673 439409 435091 432751 431673 431775 432891 433488 432076 429787 429595 432777 437786
$$ packed form
54004C30082L060L979K714M16o06m0Q16J462K027J707k74k576k848p95J761L699
53988C44584N470P105P517O354M831M093M190N085P146R891J1721J1863J1491
53975D41341J1888J2521J2106J0745R728R523R300Q482P653P515P691P290O202
53962E61985N177M672M255L390K315J664J448R57l37k227m105n504o257o635p402
53947E53396r186j1458j2471j0711o536k318p42k558n848p785p291n615m277l506
53933D63094l144l776n634p213o761m701k940j991o60J322K488K114J592K283
53919D36073L449L493K243R65Q80K407N063P331P490N254K015q30k930m308m910
53904D63685n233n997o782o264m318k340j078J02J116N97j412k289j92L182N009
$$ plain form
53889 437786 442830 447795 453178 458834 464550 470535 476689 482562 488456 495213 502477 508761 513901 519887
53875 519887 528122 537189 544521 549329 552856 556645 561707 568595 577136 586384 595595 604819 614141 623227
53861 623227 632192 641974 652976 664202 674706 685231 697375 711558 726705 741614 755956 770215
53849 770215 785117 800664 815362 827055 835013 840480 844674 846982 845830 840762 833096 825110 818904
53836 818904 815179 812475 808335 801659 793101 782993 770416 755146 738942 723463 708117 691541
53824 691541 674317 658451 644688 632022 619657 607921 597249 587554 578687 570419 562069 553159
53812 553159 544315 536477 529460 522395 515312 508914 502879 495876 487535 479114 471795 465542 460080 455763
53798 455763 452638 449614 445519 440442 435254 430258 425135 419939 415285 411541 408430 405654 403426 402145
$$ packed form
53889D37786N044M965N383N656N716N985O154N873N894O757P264O284N140N986
53875E19887Q235R067P332M808L527L789N062O888Q541R248R211R224R322R086
53861F23227Q965R782J1002J1226J0504J0525J2144J4183J5147J4909J4342J4259
53849G70215J4902J5547J4698J1693P958N467M194K308j152n068p666p986o206
53836H18904l725k704m140o676q558j0108j2577j5270j6204j5479j5346j6576
53824F91541j7224j5866j3763j2666j2365j1736j0672r695q867q268q350q910
53812E53159q844p838p017p065p083o398o035p003q341q421p319o253n462m317
53798D55763l125l024m095n077n188m996n123n196m654l744l111k776k228j281
$$ plain form
53784 402145 401799 402037 402644 403494 404036 403465 401821 400381 400231 400759 400495 399337 398742 399441 400184 399553 398005
53767 398005 397096 397433 398571 400357 402849 404945 404738 401933 398964 398776 401916 406482 410634 414262 418086
53752 418086 422014 425198 427617 430710 436012 443653 452702 462535 473099 484098 494886 505249 515541
53739 515541 525881 535926 545526 554836 563666 571635 579195 587535 597021 606543 614815 621384 625996 628091
53725 628091 627793 626411 624979 622956 619303 614258 609061 604356 599765 594686 588760 581913 574705 568154
53711 568154 562340 555491 545418 531876 516936 503234 492363 484545 479011 474610 470463 466172 461449
53698 461449 456154 450850 446623 443919 442137 440562 438846 436309 432033 426375 421260 418104 416514 415825
53684 415825 416470 418412 419615 418026 414419 411363 409864 408879 407852 407549 408147 408366 407171 404990 402662
$$ packed form
53784D02145l46K38O07Q50N42n71j644j440j50N28k64j158n95O99P43o31j548
53767C98005r09L37J138J786K492K096k07k805k969j88L140M566M152L628L824
53752D18086L928L184K419L093N302P641R049R833J0564J0999J0788J0363J0292
53739E15541J0340J0045R600R310Q830P969P560Q340R486R522Q272O569M612K095
53725F28091k98j382j432k023l653n045n197m705m591n079n926o847p208o551
53711E68154n814o849j0073j3542j4940j3702j0871p818n534m401m147m291m723
53698D61449n295n304m227k704j782j575j716k537m276n658n115l156j590o89
53684D15825O45J942J203j589l607l056j499r85j027l03N98K19j195k181k328
$$ plain form
53669 402662 400368 398221 396992 397539 399957 403509 406952 409022 409293 408574 407960 407758 407946 409192 412345 417191
53653 417191 422674 428081 433006 436669 438686 440327 443533 448528 453736 458150 462445 467501 473120 478598
53639 478598 483480 487454 490499 493348 496735 500130 502544 504717 508946 516133 524343 531035 535585 538913
53625 538913 541653 543667 544607 544189 542420 540006 537913 536233 534311 532262 531327 532259 534293 536247 537607
53610 537607 538021 536935 534676 532952 533131 534634 535998 536971 538542 541184 543996 545564 545208 543591 542397
53595 542397 543042 545323 547752 549398 550602 551614 551623 550045 547957 547125 548004 549719 551763 554616 558628 563143
53579 563143 567070 569940 572281 575123 579085 583678 587701 590555 592880 595663 599094 602697 606166 609548
53565 609548 612821 615909 619116 623043 627905 633138 637694 640732 642236 643228 645198 648931 653875 658822
$$ packed form
53669D02662k294k147j229N47K418L552L443K070K71p19o14k02J88J246L153M846
53653D17191N483N407M925L663K017J641L206M995N208M414M295N056N619N478
53639D78598M882L974L045K849L387L395K414K173M229P187Q210O692M550L328
53625E38913K740K014R40m18j769k414k093j680j922k049r35R32K034J954J360
53610E37607M14j086k259j724J79J503J364R73J571K642K812J568l56j617j194
53595E42397O45K281K429J646J204J012Rj578k088q32Q79J715K044K853M012M515
53579E63143L927K870K341K842L962M593M023K854K325K783L431L603L469L382
53565F09548L273L088L207L927M862N233M556L038J504R92J970L733M944M947
$$ plain form
53551 658822 663268 667937 673779 680479 686332 690009 692338 695614 700925 706960 711998 716215 720931 726191
53537 726191 730507 733006 734499 736042 737543 738333 738213 737331 735689 733317 730443 727087 723039 718601 714812
53522 714812 712475 711362 710636 709638 708036 705746 703009 700102 696854 693038 689359 687239 687198 688123 688544 688065
53506 688065 687206 686564 686592 687621 689423 691090 691761 691220 689646 687315 684836 683077 682514 683033 684438 686412
53490 686412 687979 688168 687793 689491 695035 703235 711349 718033 724132 731093 739550 749183 759012 767889 775428
53475 775428 782584 790908 801289 813627 827427 842242 857787 874097 891490 910143 929883 950585
53463 950585 972405 995334 1018885 1042496 1066007 1089604 1113763 1139392 1167488 1198323 1231402
53452 1231402 1266263 1302627 1339645 1376049 1411709 1448217 1487084 1527854 1568711 1608488 1647351
$$ packed form
53551F58822M446M669N842O700N853L677K329L276N311O035N038M217M716N260
53537G26191M316K499J493J543J501P90j20q82j642k372k874l356m048m438l789
53522G14812k337j113p26r98j602k290k737k907l248l816l679k120m1R25M21m79
53506F88065q59o42K8J029J802J667O71n41j574k331k479j759n63N19J405J974
53490F86412J567J89l75J698N544Q200Q114O684O099O961Q457R633R829Q877P539
53475G75428P156Q324J0381J2338J3800J4815J5545J6310J7393J8653J9740K0702
53463I50585K1820K2929K3551K3611K3511K3597K4159K5629K8096L0835L3079
53452A231402L4861L6364L7018L6404L5660L6508L8867M0770M0857L9777L8863
$$ plain form
53441 1647351 1685889 1724373 1762728 1800639 1837715 1873969 1909984 1946355 1983087 2019666 2055317
53430 2055317 2089162 2120765 2150754 2180341 2209981 2239169 2267728 2296373 2325621 2355030 2383876
53419 2383876 2411647 2437514 2460605 2481509 2502147 2523134 2542424 2557710 2568944 2577120 2581862 2582151
53407 2582151 2578581 2572702 2564497 2552590 2536914 2519107 2500023 2478923 2455803 2432648 2411133 2390290
53395 2390290 2367555 2341399 2312258 2281666 2251234 2221798 2192901 2163570 2133980 2105598 2079278
53384 2079278 2054081 2028642 2002947 1978182 1955674 1936769 1922755 1913503 1906598 1899237 1891151 1884571
53372 1884571 1881102 1879778 1878808 1878328 1880414 1886650 1896635 1909019 1923237 1939767 1959002 1980564 2003856
53359 2003856 2028919 2056471 2087185 2121180 2158159 2197779 2239669 2283295 2328229 2374747 2423770
$$ packed form
53441A647351L8538L8484L8355L7911L7076L6254L6015L6371L6732L6579L5651
53430B055317L3845L1603K9989K9587K9640K9188K8559K8645K9248K9409K8846
53419B383876K7771K5867K3091K0904K0638K0987J9290J5286J1234Q176M742K89
53407B582151l570n879q205j1907j5676j7807j9084k1100k3120k3155k1515k0843
53395B390290k2735k6156k9141l0592l0432k9436k8897k9331k9590k8382k6320
53384B079278k5197k5439k5695k4765k2508j8905j4014r252o905p361q086o580
53372A884571l469j324r70m80K086O236R985J2384J4218J6530J9235K1562K3292
53359B003856K5063K7552L0714L3995L6979L9620M1890M3626M4934M6518M9023
$$ plain form
53348 2423770 2475764 2529828 2584495 2639572 2696582 2757101 2821276 2888494 2958796 3032720 3110105
53337 3110105 3190130 3272430 3357119 3443557 3530257 3616492 3703168 3791415 3880904 3970124 4057855
53326 4057855 4143732 4227577 4308734 4386219 4459519 4529243 4596576 4661598 4722485 4777078 4824926
53315 4824926 4866780 4902430 4930542 4950801 4964616 4973042 4975300 4970051 4956798 4935124 4903901 4862492
53303 4862492 4811802 4753198 4687519 4616301 4542528 4468292 4392583 4313384 4231420 4149815 4070224
53292 4070224 3991527 3912685 3834902 3760047 3688272 3618116 3548011 3476934 3404413 3330837 3257566
53281 3257566 3186253 3118079 3053498 2992190 2933291 2876216 2821318 2769322 2720412 2674539 2632328
53270 2632328 2594635 2561153 2530380 2501078 2472858 2445241 2417267 2388696 2360827 2335355 2312681
$$ packed form
53348B423770N1994N4064N4667N5077N7010O0519O4175O7218P0302P3924P7385
53337C110105Q0025Q2300Q4689Q6438Q6700Q6235Q6676Q8247Q9489Q9220Q7731
53326D057855Q5877Q3845Q1157P7485P3300O9724O7333O5022O0887N4593M7848
53315D824926M1854L5650K8112K0259J3815Q426K258n249j3253k1674l1223m1409
53303D862492n0690n8604o5679p1218p3773p4236p5709p9199q1964q1605p9591
53292D070224p8697p8842p7783p4855p1775p0156p0105p1077p2521p3576p3271
53281C257566p1313o8174o4581o1308n8899n7075n4898n1996m8910m5873m2211
53270B632328l7693l3482l0773k9302k8220k7617k7974k8571k7869k5472k2674
$$ plain form
53259 2312681 2291791 2271584 2251957 2233624 2217146 2202362 2188960 2177404 2168683 2163016 2159575 2157881
53247 2157881 2158572 2161990 2166942 2172112 2178155 2187031 2199568 2215007 2232764 2253083 2275842 2300285 2326383
53234 2326383 2355050 2386320 2418537 2450292 2482296 2516371 2553084 2591110 2628398 2663292 2694897
53223 2694897 2723146 2748635 2772010 2793530 2813099 2830226 2843848 2852820 2857065 2857868 2856520 2852726
53211 2852726 2844681 2830789 2811252 2787895 2762367 2734557 2703144 2667678 2629421 2589786 2548803
53200 2548803 2505875 2461392 2416481 2371513 2325996 2279885 2233896 2188409 2143034 2097491 2052121
53189 2052121 2007334 1963201 1919706 1876768 1833984 1790968 1747915 1705339 1663481 1622557 1583054
53178 1583054 1544894 1506853 1468085 1429829 1394196 1361555 1330742 1301710 1275986 1254177 1234818
$$ packed form
53259B312681k0890k0207j9627j8333j6478j4784j3402j1556q721n667l441j694
53247B157881O91L418M952N170O043Q876J2537J5439J7757K0319K2759K4443K6098
53234B326383K8667L1270L2217L1755L2004L4075L6713L8026L7288L4894L1605
53223B694897K8249K5489K3375K1520J9569J7127J3622Q972M245Q03j348l794
53211B852726q045j3892j9537k3357k5528k7810l1413l5466l8257l9635m0983
53200B548803m2928m4483m4911m4968m5517m6111m5989m5487m5375m5543m5370
53189B052121m4787m4133m3495m2938m2784m3016m3053m2576m1858m0924l9503
53178A583054l8160l8041l8768l8256l5633l2641l0813k9032k5724k1809j9359
$$ plain form
53167 1234818 1216244 1197883 1179132 1158935 1137584 1117133 1098571 1080030 1059409 1037528 1016735
53156 1016735 997213 976766 954093 930526 908224 888049 869633 852444 836135 820426 805173
53145 805173 790421 776262 762655 749306 735664 721334 706663 692634 679973 668610 658011
53134 658011 647603 636886 625694 614442 603573 592833 581812 571083 561737 553680 545604 536953
53122 536953 528672 521570 515186 508947 503227 498460 494323 490589 487580 484951 481497 477296 474471 474176
53108 474176 474278 472120 468514 466434 466270 465196 461579 457441 455469 455515 455342 453473 449977 445486 440884
53093 440884 437455 436013 435846 435329 433701 431747 430687 430829 431500 432076 432732 433971 435660 437102 438142 439459
53077 439459 441218 442141 440879 438012 435715 435447 436769 438473 439958 441312 442859 444956 447645 450184 451564
$$ packed form
53167A234818j8574j8361j8751k0197k1351k0451j8562j8541k0621k1881k0793
53156A016735j9522k0447k2673k3567k2302k0175j8416j7189j6309j5709j5253
53145H05173j4752j4159j3607j3349j3642j4330j4671j4029j2661j1363j0599
53134F58011j0408j0717j1192j1252j0869j0740j1021j0729r346q057q076q651
53122E36953q281p102o384o239n720m767m137l734l009k629l454m201k825k95
53108D74176J02k158l606k080j64j074l617m138j972M6j73j869l496m491m602
53093D40884l429j442j67n17j628j954j060J42O71N76O56J239J689J442J040J317
53077D39459J759R23j262k867k297k68J322J704J485J354J547K097K689K539J380
$$ plain form
53062 451564 451861 452552 455075 459395 464246 468324 470929 471941 471759 471103 470408 469477 468070 466748 466654 468310
53046 468310 470752 472087 470894 467249 462603 458767 456727 455981 454920 452179 447905 443615 440633 438892
53032 438892 437570 436461 436050 436263 435950 433979 430461 426679 424071 423243 423503 423275 421518 418860 416794 415787
53016 415787 414959 413735 412745 412579 412696 412332 411717 411452 411279 410477 409093 407824 406832 405520 403381 400416 396986
52999 396986 393921 392439 393117 395088 396927 398068 398605 398227 396579 394583 394121 396019 399253 402418 405058
52984 405058 407204 408589 408960 408516 407452 405671 403581 402645 404184 407609 410575 411150 409605 407934 407874 409526
52968 409526 411666 413042 413296 413015 413248 414786 417349 419413 419447 417599 415720 415338 416054 416369 415657 414652
52952 414652 414290 414740 415544 416143 416209 415934 416045 417180 419146 420957 421554 420507 418497 417407 419286 424278
$$ packed form
53062D51564K97O91K523M320M851M078K605J012j82o56o95r31j407j322r4J656
53046D68310K442J335j193l645m646l836k040p46j061k741m274m290k982j741
53032D38892j322j109m11K13l13j971l518l782k608q28K60k28j757k658k066j007
53016D15787q28j224r90j66J17l64o15k65j73q02j384j269r92j312k139k965l430
52999C96986l065j482O78J971J839J141N37l78j648j996m62J898L234L165K640
52984D05058K146J385L71m44j064j781k090r36J539L425K966N75j545j671o0J652
52968D09526K140J376K54k81K33J538K563K064L4j848j879l82P16L15p12j005
52952D14652l62M50Q04N99O6k75J11J135J966J811N97j047k010j090J879M992
$$ plain form
52936 424278 429699 432035 430193 426390 423792 423743 425402 427491 429832 433143 437621 442054 444591 444437 442583
52921 442583 440863 440494 441457 442824 443545 443317 442814 442806 443226 443717 444839 447550 451265 453739 453587 451950 450903
52904 450903 451226 452602 454865 457775 460363 461918 463044 464412 465017 463240 459352 455415 452702 450545 447774
52889 447774 444090 440011 436559 434909 435057 434969 432455 427928 423896 421739 420543 419288 418348 418148 418015 417364
52873 417364 416853 417374 418778 420338 421665 422636 423312 424389 426659 429474 430917 430163 428530 427467 426797 425885
52857 425885 425258 425747 426925 427695 427744 427273 426039 424009 422389 422504 423861 424564 423613 421783 420334 419858 420331
52840 420331 421369 422290 422627 422575 422421 421832 420460 419058 419068 421051 424144 427052 429037 429999 430255 430442 431333
52823 431333 433620 437629 442680 446805 448240 447727 448159 451003 454217 455063 453914 453412 454439 455166 454312 453263
$$ packed form
52936D24278N421K336j842l803k598m9J659K089K341L311M478M433K537j54j854
52921D42583j720l69R63J367P21k28n03qM20M91J122K711L715K474j52j637j047
52904D50903L23J376K263K910K588J555J126J368O05j777l888l937k713k157k771
52889D47774l684m079l452j650J48q8k514m527m032k157j196j255r40k00j33o51
52873D17364n11N21J404J560J327R71O76J077K270K815J443p54j633j063o70r12
52857D25885o27M89J178P70M9m71j234k030j620J15J357P03r51j830j449m76M73
52840D20331J038R21L37n2j54n89j372j402J0J983L093K908J985R62K56J87Q91
52823D31333K287M009N051M125J435n13M32K844L214Q46j149n02J027P27q54j049
$$ plain form
52807 453263 454132 457170 460969 464069 465497 464760 462312 459464 457100 454998 452818 450980 449895 449112 448010
52792 448010 446679 445290 443167 439438 434268 428542 422629 416387 410288 405550 402924 401912 401244 399646
52778 399646 396282 391187 385516 380858 378146 377552 379132 382656 386752 389411 390025 390224 391849 394595 396583
52763 396583 396877 396368 396156 396235 396173 396064 396022 395517 394263 393461 395015 399388 405060 410283 414529 417813 419580
52746 419580 419177 417038 414476 412314 410380 408372 406476 404957 403736 402759 402300 402485 402887 403007 402879 402689
52730 402689 402053 400397 398053 396203 395397 394808 393496 391895 391245 391753 392275 392017 391703 392494 394300 395871
52714 395871 396403 396420 396928 398029 398505 396837 392875 388588 386684 388038 390739 392097 391348 389973 389775 391353
52698 391353 394264 397666 400591 402340 403031 403369 403706 403739 403222 402499 402280 403359 406388 411051 415467 417617
$$ packed form
52807D53263Q69L038L799L100J428p37k448k848k364k102k180j838j085p83j102
52792D48010j331j389k123l729n170n726n913o242o099m738k626j012o68j598
52778C99646l364n095n671m658k712n94J580L524M096K659O14J99J625K746J988
52763C96583K94n09k12P9o2j09m2n05j254q02J554M373N672N223M246L284J767
52746D19580m03k139k562k162j934k008j896j519j221r77m59J85M02J20j28j90
52730D02689o36j656k344j850q06n89j312j601o50N08N22k58l14P91J806J571
52714C95871N32J7N08J101M76j668l962m287j904J354K701J358p49j375j98J578
52698C91353K911L402K925J749O91L38L37L3n17p23k19J079L029M663M416K150
$$ plain form
52682 417617 417874 418982 422815 428082 432160 434272 435624 437071 438223 438658 438655 438551 438575 439460 442010 445660
52666 445660 448541 449443 448816 447380 444814 440655 435683 431420 428702 427482 427522 428326 428806 428138 426951 426749
52650 426749 428105 430187 432054 433441 433993 432867 429932 426732 425291 426000 427273 427311 425690 423334 421465
52635 421465 420840 421620 423501 425898 428159 429799 430656 430851 430493 429478 427701 425374 422810 419912 416355
52620 416355 412518 409754 409257 410852 413281 415413 416722 416960 416162 414993 414399 414722 415544 416460 417393 418101
52604 418101 418049 417159 416289 416702 419263 423999 429802 434712 437523 439338 442485 447399 451652 452830 451327
52589 451327 449342 448055 447077 445928 444468 442286 439296 436908 437037 439691 442871 445132 446936 449038 451000
52574 451000 452045 452280 452295 452453 453325 455784 459723 463457 465368 465612 465349 465017 464385 463667 463363 463199 462271
$$ packed form
52682D17617K57J108L833N267M078K112J352J447J152M35lj04K4Q85K550L650
52666D45660K881R02o27j436k566m159m972m263k718j220M0Q04M80o68j187k02
52650D26749J356K082J867J387N52j126k935l200j441P09J273L8j621k356j869
52635D21465o25P80J881K397K261J640Q57J95l58j015j777k327k564k898l557
52620D16355l837k764m97J595K429K132J309K38p98j169n94L23Q22R16R33P08
52604D18101n2q90q70M13K561M736N803M910K811J815L147M914M253J178j503
52589D51327j985j287r78j149j460k182k990k388J29K654L180K261J804K102J962
52574D51000J045K35J5J58Q72K459L939L734J911K44k63l32o32p18l04j64r28
$$ plain form
52557 462271 460132 456943 452812 448008 443701 441295 440867 441192 441511 442377 444335 446593 447549 446201 442655
52542 442655 437766 432770 428907 426781 426070 426142 426866 428604 431463 434899 438143 440973 443803 446927 449791
52527 449791 451348 451195 450005 448685 447548 446627 446294 446871 447800 447989 447207 446624 447673 450674 454651 458180
52511 458180 460213 460438 459265 457506 455891 454725 453854 452842 451320 449289 446965 444223 440567 436114 432330
52496 432330 431042 432484 434876 436298 436627 437202 438907 441159 442808 443395 443195 442425 441081 439579 438941 439877
52480 439877 441940 444027 445595 446970 448639 450886 454056 458325 462797 465633 465798 464254 462852 462408 462609
52465 462609 463407 465367 468453 471295 472139 470229 466166 461455 457792 456150 456136 456635 457345 459195 462868 467483
52449 467483 471441 474340 477276 481176 485461 488709 490158 490109 489135 487505 485425 483247 481061 478462 475273
$$ packed form
52557D62271k139l189m131m804m307k406m28L25L19Q66J958K258R56j348l546
52542D42655m889m996l863k126p11P2P24J738K859L436L244K830K830L124K864
52527D49791J557j53j190j320j137r21l33N77R29J89p82n83J049L001L977L529
52511D58180K033K25j173j759j615j166q71j012j522k031k324k742l656m453l784
52496D32330j288J442K392J422L29N75J705K252J649N87k00p70j344j502o38R36
52480D39877K063K087J568J375J669K247L170M269M472K836J65j544j402m44K01
52465D62609P98J960L086K842Q44j910m063m711l663j642j4M99P10J850L673M615
52449D67483L958K899K936L900M285L248J449m9r74j630k080k178k186k599l189
$$ plain form
52434 475273 472348 470978 471356 472116 471768 470242 468672 467979 468157 468746 469482 470362 471368 472158 472002 470346 467702
52417 467702 465563 464904 465119 465178 465525 467727 472014 476270 478168 477624 476404 475941 476459 477869 480301 483517
52401 483517 486681 489247 491542 494040 496494 498303 499423 500242 500515 499122 495338 490173 486012 484686 485953
52386 485953 487847 488476 487389 485436 483629 482452 482100 482792 484393 485904 485898 483801 480555 477759 476259 475782
52370 475782 475771 476085 476688 477079 476636 475550 474964 475862 478019 480448 482704 485194 488128 490821 492535 493528
52354 493528 494614 495992 497386 499314 503113 509296 516686 523836 530689 538108 546242 554134 560626 564914
$$ packed form
52434D75273k925j370L78P60l48j526j570o93J78N89P36Q80J006P90j56j656k644
52417D67702k139o59K15N9L47K202M287M256J898n44j220m63N18J410K432L216
52401D83517L164K566K295K498K454J809J120Q19K73j393l784n165m161j326J267
52386D85953J894O29j087j953j807j177l52O92J601J511ok097l246k796j500m77
52370D75782j1L14O03L91m43j086n86Q98K157K429K256K490K934K693J714R93
52354D93528J086J378J394J928L799O183P390P150O853P419Q134P892O492M288
$$ [...]
##END NTUPLES=NMR SPECTRUM
##END=
