
##TITLE=UV1020_M2-1005-1001_6269306_dwkXDAK8ii
##JCAMPDX= 6.0         $$ Bruker NMR JCAMP-DX V2.0
##DATA TYPE= NMR SPECTRUM
##DATA CLASS= NTUPLES
##ORIGIN= BRUKER
##OWNER= Administrator
$$ 1.72 TOPSPIN		Version 2.1
$$ 2012-06-02 00:47:44.343 -0500  Administrator@TOPSPIN
$$ Compression mode = diff/dup
##.OBSERVE FREQUENCY= 400.13188235
##.OBSERVE NUCLEUS= ^1H
##.ACQUISITION MODE= SIMULTANEOUS (DQD)
##.ACQUISITION SCHEME= undefined
##.AVERAGES= 8
##.DIGITISER RES= 22
##SPECTROMETER/DATA SYSTEM= spect
##.PULSE SEQUENCE= zg30
##.SOLVENT NAME= COFFEE_calctemp
##.SHIFT REFERENCE= INTERNAL, COFFEE_calctemp, 1, 14.98061
##AUDIT TRAIL= $$ (NUMBER, WHEN, WHO, WHERE, PROCESS, VERSION, WHAT)
$$ ##TITLE= Audit trail, TOPSPIN		Version 2.1
$$ ##JCAMPDX= 5.01
$$ ##ORIGIN= Bruker BioSpin GmbH
$$ ##OWNER= Administrator
$$ $$ C:\Bruker\TOPSPIN/data/COFFEE/nmr/UV1020_M2-1005-1001_6269306_dwkXDAK8ii/10/pdata/1/auditp.txt
$$ ##AUDIT TRAIL=  $$ (NUMBER, WHEN, WHO, WHERE, PROCESS, VERSION, WHAT)
(   1,<2012-06-02 00:47:36.171 -0500>,<Administrator>,<TOPSPIN>,<go>,<TOPSPIN 2.1>,
      <created by zg
	started at 2012-06-02 00:46:29.515 -0500,
	POWCHK enabled, PULCHK disabled,
       configuration hash MD5:
       D5 CA 7A 23 FE 6B EE E2 50 67 74 61 24 F7 5E 3B
       data hash MD5: 64K
       21 09 86 FB 01 66 7A 43 69 12 25 8F 73 4D EE 99>)
(   2,<2012-06-02 00:47:40.078 -0500>,<Administrator>,<TOPSPIN>,<proc1d>,<TOPSPIN 2.1>,
      <Start of raw data processing
       efp LB = 0 FT_mod = 6 PKNL = 1 PHC0 = 0 PHC1 = 0 SI = 32K 
       data hash MD5: 32K
       19 DF A6 73 F1 13 C5 B6 CF AB F1 70 74 E4 86 8D>)
(   3,<2012-06-02 00:47:40.421 -0500>,<Administrator>,<TOPSPIN>,<proc1d>,<TOPSPIN 2.1>,
      <pk PHC0 = 205.2411 PHC1 = 0 
       data hash MD5: 32K
       43 AE AB 32 CB 19 B8 D3 69 CA 90 75 D4 54 7F AF>)
(   4,<2012-06-02 00:47:40.531 -0500>,<Administrator>,<TOPSPIN>,<proc1d>,<TOPSPIN 2.1>,
      <abs ABSG = 1 
       data hash MD5: 32K
       0D FE 4F 4F 08 7A 4E AA 01 6D 52 D8 56 F1 50 8B>)
(   5,<2012-06-02 00:47:40.734 -0500>,<Administrator>,<TOPSPIN>,<proc1d>,<TOPSPIN 2.1>,
      <abs ABSG = 2 
       data hash MD5: 32K
       8F 34 EF AE DA 03 D3 8E 06 B0 52 93 D1 31 54 1F>)
(   6,<2012-06-02 00:47:40.765 -0500>,<Administrator>,<TOPSPIN>,<proc1d>,<TOPSPIN 2.1>,
      <abs ABSG = 3 
       data hash MD5: 32K
       50 10 5E 97 19 DD 69 0E C6 1F 81 A4 1A FA 5C 73>)
(   7,<2012-06-02 00:47:40.812 -0500>,<Administrator>,<TOPSPIN>,<proc1d>,<TOPSPIN 2.1>,
      <abs ABSG = 4 
       data hash MD5: 32K
       AC C4 7C AC 06 BE A9 77 36 5C 0E 18 06 8B 79 BB>)
(   8,<2012-06-02 00:47:40.828 -0500>,<Administrator>,<TOPSPIN>,<proc1d>,<TOPSPIN 2.1>,
      <abs ABSG = 5 
       data hash MD5: 32K
       D8 95 23 B6 49 62 E9 E4 AB E2 8C C3 22 B6 92 88>)
$$ ##END=
$$ 
$$ $$ hash MD5
$$ $$ C0 B3 ED A2 EE 3C 31 60 8C B0 F7 66 BE 8B 8E 03
##$RELAX= 
##$RELAX= 
##$RELAX= 
##$RELAX= 
##$RELAX= 
##$RELAX= 
##$RELAX= 
$$ Bruker specific parameters
$$ --------------------------
$$ [...]
150 150 150 150 150 150 150 150
##$TP07= 0
##$TPNAME0= <>
##$TPNAME1= <>
##$TPNAME2= <>
##$TPNAME3= <>
##$TPNAME4= <>
##$TPNAME5= <>
##$TPNAME6= <>
##$TPNAME7= <>
##$TPOAL= (0..7)
0.5 0.5 0.5 0.5 0.5 0.5 0.5 0.5
##$TPOFFS= (0..7)
0 0 0 0 0 0 0 0
##$TUNHIN= 0
##$TUNHOUT= 0
##$TUNXOUT= 0
##$USERA1= <user>
##$USERA2= <user>
##$USERA3= <user>
##$USERA4= <user>
##$USERA5= <user>
##$V9= 5
##$VALIST= <valist>
##$VCLIST= <CCCCCCCCCCCCCCC>
##$VD= 0
##$VDLIST= <DDDDDDDDDDDDDDD>
##$VPLIST= <PPPPPPPPPPPPPPP>
##$VTLIST= <TTTTTTTTTTTTTTT>
##$WBST= 2048
##$WBSW= 25
##$XGAIN= (0..3)
0 0 0 0
##$XL= 0
##$YL= 0
##$YMAX_a= 510388
##$YMIN_a= -639820
##$ZGOPTNS= <>
##$ZL1= 120
##$ZL2= 120
##$ZL3= 120
##$ZL4= 120
##$ABSF1= 14.98061
##$ABSF2= -5.57192
##$ABSG= 5
##$ABSL= 3
##$ALPHA= 0
##$AQORDER= 0
##$ASSFAC= 0
##$ASSFACI= 0
##$ASSFACX= 0
##$ASSWID= 0
##$AUNMP= <proc_prof1d_extract_pilot.lims>
##$AXLEFT= 0
##$AXNAME= <>
##$AXNUC= <1H>
##$AXRIGHT= 0
##$AXTYPE= 0
##$AXUNIT= <>
##$AZFE= 0.1
##$AZFW= 0.1
##$BCFW= 0
##$BC_mod= 0
##$BYTORDP= 0
##$COROFFS= 0
##$CY= 15
##$DATMOD= 1
##$DC= 0
##$DFILT= <>
##$DTYPP= 0
##$F1P= 0
##$F2P= 0
##$FCOR= 0.5
##$FTSIZE= 32768
##$FT_mod= 6
##$GAMMA= 0
##$GB= 0
##$INTBC= 1
##$INTSCL= 1
##$ISEN= 128
##$LB= 0
##$LEV0= 0
##$LPBIN= 0
##$MAXI= 10000
##$MC2= 0
##$MEAN= 0
##$ME_mod= 0
##$MI= 0
##$NCOEF= 0
##$NC_proc= -8
##$NLEV= 6
##$NOISF1= 0
##$NOISF2= 0
##$NSP= 0
##$NTH_PI= 0
##$NZP= 0
##$OFFSET= 14.98061
##$PC= 1
##$PHC0= 205.2411
##$PHC1= 0
##$PH_mod= 1
##$PKNL= yes
##$PPARMOD= 0
##$PPDIAG= 0
##$PPIPTYP= 0
##$PPMPNUM= 2147483647
##$PPRESOL= 1
##$PSCAL= 4
##$PSIGN= 0
##$PYNMP= <proc.py>
##$REVERSE= no
##$SF= 400.13
##$SI= 32768
##$SIGF1= 0
##$SIGF2= 0
##$SINO= 400
##$SIOLD= 32768
##$SPECTYP= <>
##$SREGLST= <1H.CDCl3>
##$SSB= 0
##$STSI= 32768
##$STSR= 0
##$SW_p= 8223.68421052632
##$SYMM= 0
##$S_DEV= 0
##$TDeff= 65536
##$TDoff= 0
##$TI= <>
##$TILT= no
##$TM1= 0
##$TM2= 0
##$TOPLEV= 0
##$USERP1= <user>
##$USERP2= <user>
##$USERP3= <user>
##$USERP4= <user>
##$USERP5= <user>
##$WDW= 1
##$XDIM= 32768
##$YMAX_p= 449981828
##$YMIN_p= -675143
##$CURPLOT= <Network HP LaserJet P1505>
##$CURPRIN= <$Network HP LaserJet P1505>
##$DFORMAT= <normdp>
##$LAYOUT= <+/1D_H.xwp>
##$LFORMAT= <normlp>
##$PFORMAT= <normpl>
##$SURQMSG= 1
$$ End of Bruker specific parameters
$$ ---------------------------------
##NTUPLES= NMR SPECTRUM
##VAR_NAME=  FREQUENCY,     SPECTRUM/REAL,   SPECTRUM/IMAG
##SYMBOL=    X,             R,               I
##VAR_TYPE=  INDEPENDENT,   DEPENDENT,       DEPENDENT
##VAR_FORM=  AFFN,          ASDF,            ASDF
##VAR_DIM=   32768,         32768,           32768
##UNITS=     HZ,            ARBITRARY UNITS, ARBITRARY UNITS
##FACTOR=    0.250966925370066, 1,           1
##FIRST=     8223.43324360095, -57966,       -45849
##LAST=      0,             -123426,         -306232
##MIN=       0,             -675143,         0
##MAX=       8223.43324360095, 449981828,    0
$$ Real data points
##PAGE= N=1
##DATA TABLE= (X++(R..R)), XYDATA
$$ [...]
19534e6537k5205n6968A59967a98405H9906P0756a17349N036D6174i9771L8661
19523f1110C6948b40151g9178j73040A79761n519F7119R9516b56451Q4419J1579
19512a60453M5445k84404A32562a58798M0047a3626j00090j8516B5325a30000
19501a51942e9087n6541A03384J20564b13833g3148b131F6452a80547j30649i5298
19489c5900A0900b5924j02845j38907c1222k23318K8933j2484l4873B0338c50184
19477a64284m6598e6145j1400C5819a01551J9880k044j07462h8319c0595j4643
19466d5238l06719c5692j49519a1072C7130N7320N97b15481C7531c30197a41928
19454B95753A32904b61316j29841H2481e20023A17062d99j24719A9536R0226B4697
$$ y = [-56537, -81742, -138710, 159967, -198405, 89906, 160662, -117349, -112313, 46174, -99771, -61110, 36948, -240151, -79178, -252218, 179761, 174242, 67119, 166635, -256451, -172032, -160453, -115008, -399412, 132562, -158798, -118751, -13626, -113716, -132232, 25325, -130000, -151942, -59087, -115628, 103384, 223948, -213833, -73148, -2131, 66452, -180547, -311196, -95298, -35900, 10900, -25924, -128769, -267676, -31222, -254540, -225607, -238091, -272964, 20338, -350184, -164284, -210882, -56145, -67545, 35819, -101551, -81671, -83715, -191177, -88319, -30595, -45238, -351957, -35692, -185211, -11072, 37130, 94450, 95047, -215481, 37531, -330197, -141928, 295753, 132904, -261316, -391157, 82481, -520023, 117062, -499, -125218, 19536, 109762, 24697]
19442H2437J08093c75816E5250g4710l15230a46959q3830J12441r6804D4872J0150
19431E5022a47644J2459B57122A2307J74391a18245C03812a90034R4351c0233
19420b58454I0367g7303j27961A18698a46989f1647q8667n5711g8072m8471F325
19408a14975m1602A53625a63682l4253B65550a04167m5719n8816C19056b18017
19397a78814j77031g9581C67773a51028C45489i4358K918B2205K92617d25909
19386B31766G8187b45587A89369d2861A9732d5596B09403g628A68220a06952K0535
19375h6417e678H8303g4545B73651b85719c4718j66413C3956b93342B04640a14611
19363a42677P770c0875q426D29839b0143n4562G5370e6899k24728j72794f9193
$$ y = [82437, 190530, -375816, 55250, -74710, -389940, -146959, -230789, -118348, -215152, 44872, 55022, -147644, -135185, 257122, 12307, 186698, -118245, 303812, -190034, -95683, -30233, -258454, 90367, -77303, -205264, 118698, -146989, -61647, -150314, -206025, -78072, -126543, 6325, -114975, -156577, 153625, -163682, -197935, 265550, -104167, -149886, -208702, 319056, -218017, -178814, -355845, -79581, 367773, -151028, 345489, -94358, -91440, 22205, 314822, -425909, 231766, 78187, -245587, 189369, -42861, 19732, -45596, 209403, -7628, 168220, -106952, -86417, -5678, 88303, -74545, 273651, -285719, -34718, -201131, 33956, -293342, 204640, -114611, -142677, -134907, -30875, -39301, 429839, -20143, -74705, 75370, -56899, -281627, -454421, -69193]
19351f9210B4611J49200b41405f792o383A07608a18897A55814c44975R7766f7712
19339E1977b10650R8140I4715A2216c4483a3439B01780a04529A5536N0546O577
19328G2659a62440F5643c5668A33954b01389j28478J39904A94998B8895a59900
19317c72253A36901c6112j06021G502h0997B6459b38173c3248l5228l95264B74868
19305A20241A4033b88727f354j18870j2675b1333C6833a94749A58723b10213a02411
19293C0454K92702c5644I880d4941j9044b601n3898j09971d3440j32057A02317
19281a82319Q0095k12296A10001A2789D15d47764D09700E4099c1328o6093b7352
19269f3312l15377J81102L9515R439A30501J66394A22624Q421n9886b1813j03778
$$ y = [-69210, 24611, 173811, -241405, -6792, -13175, 107608, -118897, 155814, -344975, -247209, -67712, 51977, -210650, -112510, 94715, 12216, -34483, -13439, 201780, -104529, 15536, 66082, 72659, -162440, 65643, -35668, 133954, -201389, -329867, -189963, 194998, 28895, -159900, -372253, 136901, -36112, -142133, 7502, -80997, 26459, -238173, -33248, -68476, -463740, 274868, 120241, 14033, -288727, -6354, -125224, -137899, -21333, 36833, -194749, 158723, -210213, -102411, 30454, 323156, -35644, 9880, -44941, -63985, -2601, -56499, -166470, -43440, -175497, 102317, -182319, -102224, -314520, 110001, 12789, 415, -447764, 409700, 54099, -31328, -97421, -27352, -63312, -378689, -197587, -158072, -148633, 130501, 296895, 122624, 131045, 71159, -21813, -125591]
19258a25591a9426j39095r3928e4317j10668D13232b78926N7805B81069b7878
19247a63940K656N6347b9201D7952a53383j64125A89841H5107b87925a27937j80142
19236c08079i136k9135A86196K4797a50602A24390b93448A05710d9281E2657b28030
19224h4542r0121p9887D749a99618J8589B36939K09821b2222q6722H6267a1013
19212h2141I5990b88403e4176A16478a0870A7588J37999O9023a8272j72319k19952
19201d10543h7854k006j28601c0120N524j34390k95394a24570j03473j22205B25894
19189A3349a10082A68029e9428r3580f6104F9285d7013i684C5454L5750N9728
19178A30932L615N050a06036r7956a00935B10618p7728a43939l4671d9704C3994
$$ y = [-125591, -19426, -158521, -252449, -54317, -164985, 413232, -278926, -221121, 281069, -27878, -163940, -161284, -104937, -29201, 47952, -153383, -317508, 189841, 85107, -287925, -127937, -308079, -9136, -38271, 186196, 210993, -150602, 124390, -293448, 105710, -49281, 52657, -228030, -84542, -174663, -254550, 4749, -199618, -181029, 236939, 446760, -22222, -108944, 86267, -11013, -82141, 95990, -288403, -54176, 116478, -10870, 17588, 155587, 224610, -18272, -190591, -410543, -87854, -89860, -218461, -30120, -24596, -158986, -454380, -124570, -228043, -350248, 225894, 13349, -110082, 168029, -59428, -153008, -66104, 69285, -47013, -9684, 35454, 71204, 130932, 134547, 139597, -106036, -203992, -100935, 210618, 132890, -143939, -178610, -49704, 33994]
19166g0900j694i514k101j20763a4888m1339A30738a74636g3363A34825F1449
19154A05157d52359a65030j40352J45511j02077K1223F9677b68505h6431L8789
19144d7642j20976A86b00553K354j15163m1d0590m8340j11082P8113l0407O1074
19132i1232B36500g3377k06261J8140a08370p8213B02771f9672g479n7985a1828
19120a16560K5281J3717D8004h9460j1815a3369C50816a03695K8165k4132m29048
19109e28710A62717p4978b86753a09012q2117O7757b2102g508n6668j66853n4582
19098b85611N7160A02175Q890c3143A02585a14363B71249a37857A27616d20917
19087a0475A15976b83429J18286A91213b53029f1641A22898f5113A41600H456
$$ y = [-70900, -72594, -9514, -11615, -132378, -14888, -56227, 130738, -174636, -73363, 134825, 61449, 105157, -452359, -165030, -305382, -159871, -261948, -240725, 69677, -268505, -86431, -47642, -168618, 186, -200553, -198199, -313362, -313403, -40590, -88930, -200012, -121899, -152306, -91232, 236500, -73377, -279638, -261498, -108370, -186583, 202771, -69672, -7479, -65464, -11828, -116560, -91279, -77562, 48004, -89460, -101275, -13369, 350816, -103695, -75530, -99662, -528710, 162717, 87739, -286753, -109012, -191129, -123372, -22102, -7508, -64176, -231029, -285611, -228451, 102175, 111065, -33143, 102585, -114363, 271249, -137857, 127616, -420917, -10475, 115976, -283429, -165143, 191213, -253029, -61641, 122898, -65113, 141600, 8456]
19076b01438B66218b28720B38843B6702c86163A39030e5016B6567b65748h9109
19065a45540A4686a48120L9383l2855D09262a7336k67480G5855M13a37254A35193
19053a65560B678g3054j9384l2876B9181Q5441b7165A04354b81601q5070a33553
19041a54740P5608j55341B8784a34458B86299F8834c1620j84088N3051A87180
19030a8881A45871a83641H5546K23517C8935N4331O902d9492p5172F476a08025
19018B39506H4297a13816B91767b2096D17731E2062k2239d6514A26066R7589b51614
19006b37345B36001P204b6152j79826H1895a24737A98234C9445L05632A36462
18995a14640p1480Q1376r4942A94563B6558a40589l21345B40925a60789D0752
$$ y = [-201438, 266218, -228720, 238843, 26702, -386163, 139030, -55016, 26567, -265748, -89109, -145540, 14686, -148120, -108737, -141592, 409262, -17336, -284816, 75855, 76268, -137254, 135193, -165560, 2678, -73054, -92438, -125314, 29181, 114622, -27165, 104354, -281601, -366671, -133553, -154740, -79132, -234473, 28784, -134458, 286299, 68834, -31620, -215708, -162657, 187180, -18881, 145871, -183641, 85546, 309063, 38935, 93266, 100168, -49492, -124664, 6476, -108025, 239506, 84297, -113816, 291767, -22096, 417731, 52062, 29823, -46514, 126066, 223655, -251614, -237345, 236001, 243205, -26152, -205978, 81895, -124737, 198234, 39445, 345077, 136462, -114640, -186120, -104744, -199686, 194563, 26558, -140589, -461934, 240925, -160789, 40752]
18984a35784N9700j3692A86351i5122c2965j79552C10032E7703J46087B1548b11869
18972F3948L8134K18624c95521a27928p256I0845c02975a10388C1609J1851i3781
18960C8266J79713a09267b6427A62048J71880A10967f4123p233A18584g2534k34421
18949c06955D9451O4012a64036c3248k22525B0639J48704Q820p0244a15483l4026
18938a49509K3295j96993B5928f5478j24283M8436I0247c99783D0631g3130b0828
18926g00r4442j66252A32349m7084a72313A00973i2539a5597n0603o696K0148
18915e2748A4289a35102f1125n86781d7389I7964g345n5432H1472J37418c3839
18903H1382i8523a3269p7998m9474N493K3720h225k31441F1648a25760I5176a87237
$$ y = [-135784, -76084, -89776, 186351, -95122, -32965, -212517, 310032, 57703, 203790, 21548, -211869, 63948, 102082, 320706, -395521, -127928, -135184, 90845, -302975, -110388, 31609, 43460, -93781, 38266, 217979, -109267, -26427, 162048, 333928, 110967, -64123, -71356, 118584, -72534, -306955, 49451, 113463, -164036, -33248, -255773, 20639, 169343, 178163, 107919, -115483, -149509, -126214, -323207, 25928, -65478, -189761, -141325, 90247, -399783, 40631, -73130, -20828, -700, -95142, -261394, 132349, 85265, -172313, 100973, -92539, -15597, -66200, -72896, -52748, 14289, -135102, -61125, -647906, -47389, 97964, -7345, -62777, 81472, 218890, -33839, 81382, -98523, -13269, -91267, -140741, -135248, -111528, -8225, -239666, 61648, -125760, 95176, -187237]
18890a52435C4095c38583a35089L2777L0913d207H5187L8293m6738K32604b0693
18878a60750B35800g5973c5654r3637a499A21292a88121B94155m146b8945j0979
18867c9924F9302b99788O2494E8600B4539c5973B17832b69048c4530j75558A19749
18855c3846H8609M0291e9325L281D6997J037j1825a28466M2465k86203I3300Q2070
18843A75370M6910D3285d16531J91381D701K25574G4006a92212A10683J11686
18833B22369e7399A42850a06787I7446d07775J67738H5191b31138A10024b24484
18822a30679A21474E4869L0981a73167k17904B0386J54778a86970k8364B41288
18811f4055j40842a5732l0459F2617a53349A72736a59392a4191l6813j23009D5108
$$ y = [-152435, 34095, -338583, -135089, -102312, -71399, -4207, 85187, 123480, 76742, 309346, -20693, -160750, 235800, -75973, -35654, -129291, -1499, 121292, -188121, 294155, 290009, -28945, -39924, 69302, -299788, -237294, 58600, 24539, -35973, 217832, -269048, -34530, -210088, 119749, -33846, 88609, 128900, -59325, -56044, 46997, 48034, 36209, -128466, -86001, -372204, 93300, 175370, 222280, 43285, -416531, -225150, 4701, 230275, 74006, -192212, 110683, 222369, -57399, 142850, -106787, 97446, -407775, -240037, 85191, -231138, 110024, -224484, -130679, 121474, 54869, 85850, -173167, -391071, 20386, 175164, -186970, -215334, 241288, -64055, -204897, -15732, -46191, 62617, -153349, 172736, -159392, -14191, -51004, -174013, 45108]
18799b68191a5455l8411j86940E03026a61493a4204l9820o2995B80788a8605F7678
18787B73140b52243j4559P2910Q8256j63354C01708j08627b486A4127a8907q9738
18776a08645B41736b79839D16089A9491f9936A00968a41836r168E3042K61733
18766C14775A27274A7159d8963A8829h5256m7040A63413f5187j6006C9935d61913
18754A36616b74984h9529k4760C1320e2181C3415d9123j48625A95540c3930A26117
18742A05210b70068o3957a19512B94456a23610a5199j65252D24489a59823q9044
18732b48867a9735r3275j91687j85687a96390A66328f3809q5470j02335n2862
18722c04476J6649h7386j61524J24303M3668I6271b5980b986l2672j01307A3578
$$ y = [-268191, -15455, -53866, -240806, 503026, -161493, -14204, -54024, -117019, 280788, -18605, 67678, 273140, -252243, -266802, -193892, -105636, -268990, 301708, 193081, -2486, 14127, -18907, -108645, 241736, -279839, 416089, 19491, -69936, 100968, -141836, -151004, 53042, 314775, 127274, 17159, -48963, 18829, -85256, -132296, 163413, -65187, -81193, 39935, -461913, 136616, -274984, -89529, -114289, 31320, -52181, 33415, -49123, -197748, 195540, -33930, 126117, 105210, -270068, -334025, -119512, 294456, -123610, -15199, -180451, 424489, -159823, -248867, -19735, -113010, -304697, -490384, -196390, 166328, -63809, -149279, -251614, -304476, -287827, -87386, -248910, -124607, -80939, 96271, -25980, -2986, -35658, -136965, 13578]
18710a36871F1524J67415b20480A40058a88072m5024B735e6156A12973j4839m7963
18699E0171c8924j31744B43162a88461D5543N6581h0522B56662D3062f3245k83385
18688c46630A5958a77831j17594f8118l7428c2476A32265J67574b27814A38158
18677a06279A57897c39535B03048I8914C1173j5500a44084j15353A49034d02843
18666b06760a3537F5431b812m58420F35379C16076b16297A96342b3228D8977N1646
18655A00623J944k7472c86449a03144K724A37774b31618M3795A29696m6228k866
18644H0602b16167E5838a12407k3212Q281F4348c92124J27031O2635a131j20141
18633a21272j31424H4586O3149b5883j2075j55544A32672n3412h4574A15632D8636
$$ y = [-136871, 61524, 228939, -220480, 140058, -188072, -233096, 2735, -56156, 112973, 98134, 50171, -38924, -170668, 243162, -188461, 45543, 102124, -80522, 256662, 43062, -63245, -346630, 15958, -177831, -295425, -68118, -105546, -32476, 132265, 299839, -227814, 138158, -106279, 157897, -339535, 203048, 98914, 31173, 15673, -144084, -259437, 149034, -402843, -206760, -13537, 65431, -2812, -461232, 635379, 316076, -216297, 196342, -23228, 48977, 100623, 102567, 75095, -386449, -103144, -100420, 137774, -231618, -187823, 129696, 83468, 80602, -216167, 55838, -112407, -135619, -127338, 64348, -392124, -265093, -202458, -1131, -121272, -252696, 84586, 147735, -25883, -37958, -193502, 132672, 79260, -84574, 115632, 48636]
18621H6680N3415a42184L3247j81838n1715A50822b52741I0505A3374a05164p1310
18610a76474A18042c4411k91996N9598A2602f6484A08016e3047J4887j73258q6803
18599b98221A03137J13417d0350j13228C0051K0208J19316A7083M61176q5913
18589C92346b01446B8608a74058o3364K8885k05576A9139a19357A9791O9023i9510
18577h7914a063j66089h0012L9177G1513L9553C7384a25600L5603A23139a68573
18565f5281B3267b94229C54026j72990b25188C9909b9541D4784N3304C049a90709
18553B33825b53974h7565l6180C02667D074L5409b49610B97824b57021B68623
18542a26942A01688d9082J7005C4584a19927E6557O9518b83298j8246C216M7756
$$ y = [86680, 140095, -142184, -108937, -290775, -342490, 150822, -252741, 90505, 13374, -105164, -176474, 118042, -34411, -326407, -266809, 12602, -66484, 108016, -53047, -38160, -211418, -298221, 103137, 216554, -40350, -153578, 30051, 50259, 169575, 17083, 478259, 392346, -201446, 28608, -174058, -237422, -208537, -414113, 19139, -119357, 19791, 88814, -99510, -87914, -1063, -167152, -80012, -40835, 71513, 111066, 37384, -125600, -89997, 123139, -168573, -65281, 23267, -294229, 354026, 181036, -225188, 39909, -29541, 44784, 98088, 3049, -190709, 233825, -253974, -87565, -123745, 302667, 4074, 39483, -249610, 297824, -257021, 268623, -126942, 101688, -49082, -32077, 34584, -119927, 56557, 126075, -283298, -301544, 3216, 50972]
18531E0972a18794C1345L2393d5271D5104f6227a228o6400l9206A69649o0432
18520A09217a98797A07560b94811g2220A57698i910I6182f647l05039H0762C1383
18508a08727J4809A26472a05141B9716a30948j1629B56065b49167G053b5496k01808
18497b27304J09191D96654a44851a0041A3662L0597b70531f9703j92703A28410
18486b63765J13538E666K1803c25946J14722c4539A82645e9022D15251g640l0834
18475c8474l28432a49236I3799A4240J30318B5624I920c74341C40822c50845J37299
18464b13546j28017B748c0923A33495A9945b30157B19084c94714a50899A26462
18453b85k74987P7342d3385q3174E2925a17226M8652j11971b7571B93334d8048
$$ y = [50972, -118794, 31345, 63738, -45271, 45104, -66227, -1228, -67628, -106834, 169649, 109217, -198797, 107560, -294811, -72220, 157698, -9910, 96182, -6647, -311686, 80762, 31383, -108727, -93918, 126472, -105141, 29716, -130948, -142577, 256065, -249167, 7053, -25496, -227304, -118113, 496654, -144851, -10041, 13662, 44259, -270531, -69703, -262406, 128410, -263765, -150227, 5666, 27469, -325946, -211224, -34539, 182645, -59022, 415251, -7640, -38474, -366906, -149236, 93799, 14240, 144558, 25624, 9920, -374341, 340822, -350845, -213546, -341563, 2748, -30923, 133495, 19945, -230157, 219084, -394714, -150899, 126462, -285, -275272, -197930, -43385, -126559, 52925, -117226, -68574, -180545, -27571, 293334, -48048]
18441A58695E6323a84232B383a13404G4442b0518A51981d07654B97520a15898
18430A15526i4940k24360R1372M0280e370E3935b53113B79834c35819B6550f3643
18418a76770B65834c08865F4095a76096j59017A43114a2803A12927c47432J46590
18408b00842B19083a21622L7218B38364b39480n6083e4403j92743h445I6876c60254
18396a5083j99889Q8362G5352d7529A62285a92866A60242a0135n9087j58977B67340
18384a06620L3817B11388n5854J08863b33437C2045a44188E7605a13524A85700
18373h6947p4322I9813J55427a47045A30377a47915A66798a74749f7305l3016
18363a00321a4318l8534B2496J50857f2102Q00j23118l9326M9943A4973b5278
$$ y = [158695, 56323, -184232, 2383, -113404, 74442, -20518, 151981, -407654, 297520, -115898, 115526, -94940, -319300, -227928, -187648, -5370, 53935, -253113, 279834, -335819, 26550, -63643, -176770, 265834, -308865, 64095, -176096, -335113, 143114, -12803, 112927, -347432, -200842, 219083, -121622, -84404, 238364, -239480, -295563, -54403, -247146, -8445, 96876, -360254, -15083, -214972, -126610, 75352, -47529, 162285, -192866, 160242, -10135, -69222, -228199, 267340, -106620, -72803, 211388, 155534, 264397, -233437, 32045, -144188, 57605, -113524, 185700, -86947, -161269, 99813, 255240, -147045, 130377, -147915, 166798, -174749, -67305, -100321, -14318, -52852, 22496, 173353, -62102, -61302, -184420, -223746, -173803, 14973, -25278]
18351A47585J12999a81434j05980B2809c13051L5248d0631j83468A12437b77167
18340A50644D780J70376A5734M8470P6621a98880i9244p1171E3355b58210O609
18329b51601b3528j01290j43892A83118a857k79154a25355B2705b96545r391J46991
18318a58945m8635A4129a09259A4020R5696K1288b92036F662O39e827B4123a44577
18305A66506F0263R5107J13269J03486G5206J56721o0362b3091k83097C510g4088
18293c07329A59108B0020n454a04992L4925A53616f1723p6747A04543d46358g6938
18281g3120o4316J0994A37376O12Q7866j04754g4064A25335c3737m4320a8818
18269A38488R1070d04301a19927l4895m4599e1330l76506a67669D2011a35789
$$ y = [147585, 260584, -181434, -287414, 22809, -313051, -277803, -40631, -224099, 112437, -277167, 150644, 4780, 175156, 15734, 64204, 140825, -198880, -99244, -170415, 53355, -258210, -251601, -23528, -124818, -268710, 183118, -1857, -281011, -125355, 22705, -296545, -305936, -158945, -207580, 14129, -109259, 14020, 109716, 131004, -292036, 6662, 7301, -5827, 24123, -144577, 166506, 60263, 155370, 268639, 372125, 75206, 231927, 171565, -23091, -306188, 3510, -74088, -307329, 159108, 20020, 14566, -104992, -70067, 153616, -61723, -138470, 104543, -446358, -76938, -73120, -137436, -126442, 137376, 137988, 225854, 121100, -74064, 125335, -33737, -78057, -18818, 138488, 229558, -404301, -119927, -154822, -199421, -51330, -427836, -167669, 42011, -135789]
18258a21102C7628a48884N004C73829a24098A13728c19786D5589c66234a78860
18247F6613a50977A00817i7347l9605L4775A39274i4795k5582j37791M2506f2385
18235B16259q9249B0041a8499B3596e4279k4859c4599l1326j02393f018j74925
18224a80943A49157b75446A03163a69370A3788L60878F5267f3038A00165N1804
18214A51969N958a25645A12668K67988a22855M4277B34565a88891J5707j32112
18204c05296a31185c3376j02165a2742k40181I2941J53190c6259l22808A18750
18193A90704C9655d5412k8794R166K5304A21217d9067j5850A30249b07481I1611
18181d1519j08069B11392G7369b24943C32319H1035a87691A05391K9520a85794
$$ y = [-121102, 37628, -148884, -143880, 373829, -124098, 113728, -319786, 45589, -366234, -178860, 66613, -150977, 100817, -97347, -136952, -102177, 139274, -94795, -120377, -258168, -215662, -62385, 216259, 127010, 20041, -18499, 23596, -54279, -79138, -34599, -65925, -168318, -6018, -180943, 149157, -275446, 103163, -169370, 13788, 374666, 65267, -63038, 100165, 151969, 157927, -125645, 112668, 380656, -122855, -78578, 234565, -188891, -173184, -305296, -131185, -33376, -135541, -12742, -252923, 92941, 246131, -36259, -359067, 118750, 190704, 39655, -45412, -74206, -65040, -39736, 121217, -49067, -64917, 130249, -207481, 91611, -41519, -149588, 211392, 77369, -224943, 332319, 81035, -187691, 105391, 134911, -185794]
18170H9636L0854J01442F588M1249L77238a38958E3939M7160a09904b971k78651
18159b81622N540e7366j13309f009m20498a25213B85157b23698q7145E2021J4606
18148F6627a41310G4285K4382J8550a42247B56775H1958B3219a08421C2233a2561
18136B98407a28318c8594B15475n669a43601O5932G9982b7782l47055C8503b13576
18124b0808j76428n2347G5221f2409A13528A1996K28598D007d9139a9262l59143
18113c78405P4385A89873r4273M4036D9061R4346g1741B37062c0560H7666e9003
18101b7792A4063g6645g602m62670A3537a20253k8404E554h9280l57067g0659
18089c04002i6470B19966I1375P1643g0065B940b50674B04959A0121J03522J78527
$$ y = [89636, 120490, 221932, 6588, 47837, 425075, -138958, 53939, 101099, -109904, -2971, -281622, -276082, -57366, -170675, -6009, -426507, -125213, 285157, -223698, -310843, 52021, 66627, -141310, 74285, 98667, 117217, -142247, 256775, 81958, 23219, -108421, 32233, -12561, 298407, -128318, -38594, 215475, 209806, -143601, -77669, 79982, -27782, -374837, 38503, -213576, -20808, -197236, -249583, 75221, -62409, 113528, 11996, 240594, 4007, -49139, -19262, -378405, -304020, 189873, 95600, 139636, 49061, 143407, -71741, 237062, -30560, 87666, -59003, -27792, 14063, -76645, -7602, -470272, 13537, -120253, -148657, 5554, -89280, -446347, -70659, -304002, -96470, 219966, 91375, 163018, -70065, 2940, -250674, 204959, 10121, 113643, 292170]
18078B92170b8499A19064i8824b5535j12761o3496c5022C53798c0132F8576k0268
18067D8308J3502D72L1304P5412b18581c1107o9910A27766g128B03834b05904
18055c52288J6044A23733c44153B35803c70586j9438A24498n8206O8746R5845
18045B30883c73448a6090l18052Q1988C6369K6770c2519d190l5934q6881B72046
18033a39950c8974n006F6471J17464a58591g6533f615C54378B9431Q0482M1339
18022A51252c84321a89244C3391P9186a31710p9204B184d27101i340A3265b5325
18010i1475k7124A06882i3129A04966b59826N2366F0778I588b69396A3436h7096
17998F4985K11040j20540J55146b73707a20922I5575b78836A65501B032N1899
$$ y = [292170, -28499, 119064, -98824, -25535, -138296, -201792, -35022, 353798, -30132, 68576, 48308, 61810, 472, 31776, 107188, -218581, -31107, -101017, 127766, -7128, 203834, -205904, -352288, -336244, 123733, -344153, 235803, -370586, -390024, 124498, 66292, 135038, 230883, -373448, -16090, -334142, -252154, 36369, 63139, -32519, -4190, -40124, -127005, 272046, -139950, -38974, -43980, 66471, 183935, -158591, -76533, -6615, 354378, 29431, 109913, 151252, -384321, -189244, 33391, 112577, -131710, -210914, 2184, -427101, -9340, 13265, -25325, -91475, -118599, 106882, -93129, 104966, -259826, -207460, 60778, 9588, -269396, 13436, -87096, 64985, 276025, 155485, 310631, -273707, -120922, 95575, -278836, 165501, 2032, 53931]
17988E3931a52184E0165b3003k39146J6582A25588J08989a53849B1309O7307f4892
17976a26770j37160J26011C9291O7528l4727a18169j17640a02864a1051j59165
17966a70216A98512h3A45716d664j6174A78960b23984B06220c0535k01379A21776
17954b71478B49515k4307a75671A30385b10510d5912A4013a19793b7149k4282
17944e1431j54252A01936C9121b43689c565j38859e5589j75474a14508C12051
17933C5944c9311j07726L8251G5302K1188K0920J34238O0822b43796a07966n5535
17922a63501H857b9319k62071f3765A1205R9610c1796A9936K31075o2127B7662
17910A36769a39842J6729d9461J0707I2428A7880a74843Q1265A11733B0635a13826
$$ y = [53931, -152184, 50165, -23003, -262149, -245567, 125588, 234577, -153849, 21309, 88616, -64892, -126770, -263930, -137919, 39291, 106819, 72092, -118169, -235809, -102864, -11051, -170216, 198512, -83, 145716, -4664, -20838, 178960, -223984, 206220, -30535, -231914, 121776, -271478, 249515, 225208, -175671, 130385, -210510, -45912, 14013, -119793, -27149, -51431, -205683, 101936, 39121, -243689, -3565, -142424, -55589, -231063, -114508, 312051, 35944, -39311, -147037, -108786, 75302, 96490, 117410, 251648, 312470, -243796, -107966, -163501, 8857, -29319, -291390, -63765, 11205, 110815, -31796, 19936, 251011, 188884, 27662, 136769, -139842, -123113, -49461, -38754, 92428, 17880, -174843, -93578, 111733, 20635, -113826]
17898E6527Q8565n6971b9012C44227b06220G7801g7264A0595c16277c9666j70936
17887b10602n9328K4261a22512I2731k3390L0465B9251J43521k6173i9189j65833
17876b65022A8419J9999a7627j54610l0878A54464g5897M372A8795H854a70613
17864c9987j30829B12654M0362b37129E7203M4358a57222e2512k91968G5948a34701
17852A3759c07226a15344a7970j19090e752I898J49112a13265g092H0474f0598
17840c7624j32919f5397j37886F2911J87744c98430B68194A32425K0217n8258
17830I4384b01971D580K8317a09356j29046e2324d612r7385k66941h7753j12940
17819b00693B41265B5163b7153C31162b04930B26213J5082b78481D28768A57952
$$ y = [56527, 145092, 88121, -29012, 344227, -206220, 77801, -77264, 10595, -316277, -39666, -210602, -269930, -245669, -122512, 92731, 69341, 99806, 29251, 172772, 146599, -99189, -265022, 18419, 38418, -17627, -172237, -203115, 154464, -75897, -71525, 18795, 8854, -170613, -39987, -170816, 212654, 253016, -237129, 57203, 101561, -157222, -52512, -344480, 75948, -134701, 13759, -307226, -115344, -17970, -137060, -5752, 9898, 159010, -113265, -7092, 80474, -60598, -37624, -170543, -65397, -203283, 62911, 250655, -398430, 268194, 132425, 152642, 94384, -201971, 4580, 32897, -109356, -238402, -52324, -4612, -101997, -368938, -87753, -200693, 241265, 25163, -27153, 331162, -204930, 226213, 241295, -278481, 428768, 157952]
17808D6111N0628D5097g5892l9083A43074b48311A98788a63400K6501b2465o7663
17797i0128B18873L4805e9812r3225B34349m4676D819J53800n19c44359a49300
17785i796k21173M1841E8565P0442a37030B56831d8585j1130N887k60156J19875
17774a94109m705b6839l32498K6180i4081E3197a41721g0780j61689f8036q8706
17763a56742l19507b33147f1965F0191J16615k2646b6555A26689R5981a80849
17752a34572A1432b5803A19017d74746K25680n5676a07621d8807A96770g8790
17741a71104C51434a45917j90302a58298E9424K10245B0187M8507K32952j40280
17731A61366j3941a76966H9916L3179d28825J70775B67575a71117A42665j5684
$$ y = [46111, 96739, 45097, -75892, -114975, 143074, -248311, 198788, -163400, -136899, -22465, -90128, 218873, 253678, -59812, -153037, 234349, 189673, 4819, 158619, 158100, -344359, -149300, -9796, -230969, -189128, 58565, 129007, -137030, 256831, -48585, -59715, -53828, -313984, -194109, -198814, -26839, -359337, -333157, -94081, 53197, -141721, -70780, -232469, -68036, -156742, -476249, -233147, -61965, 60191, 176806, 154160, -26555, 126689, 222670, -180849, -134572, 11432, -25803, 119017, -474746, -249066, -304742, -107621, -48807, 196770, -78790, -171104, 351434, -145917, -336219, -158298, 59424, 269669, 20187, 68694, 301646, 161366, 147425, -176966, 89916, 123095, -428825, -258050, 267575, -171117, 142665, 126981]
17721A26981k6943L0339K1665G4651a41863q4023O4769C64856j10007p9103D9744
17709A97744I5876J32500G9168J37913I7873C1415L64523a586j95701A64302J30257
17698B94559i5039A5650O2235b31322H8949J58372l9920o5677K74052B4N6257
17687E6281J7560a31193C2898K85862e3643I6992f4823A78624A3531Q7330a1416
17675C47655A58796b02100N8966a8887q5137j04485h4064q5093a5969q9538A73357
17663b02376k10238I5167B0444J44150a50165B9556b54223H5457J88193b83691
17652a18122K7577A71695N8625E9513a02874k29768a42834P1090H0080a03314
17641C76823B8840R1001l6667e7944b5952l4449E7162b6526D0009A7621D276a74644
$$ y = [126981, 100038, 130377, 152042, 74651, -141863, -225886, -161117, 364856, 254849, 175746, 49744, 197744, 95876, 228376, 79168, 217081, 97873, 31415, 395938, -1586, -197287, 164302, 294559, -95039, 15650, 77885, -231322, 88949, 247321, 207401, 141724, 415776, 24, 56281, 73841, -131193, 32898, 318760, -53643, 96992, -64823, 178624, 13531, 100861, -11416, 347655, 158796, -202100, -143134, -18887, -104024, -208509, -84064, -169157, -15969, -105507, 173357, -202376, -412614, 95167, 20444, 164594, -150165, 29556, -254223, 85457, 273650, -283691, -118122, -90545, 171695, 230320, 59513, -102874, -332642, -142834, -71744, 80080, -103314, 376823, 28840, 119841, 83174, -57944, -25952, -60401, 57162, -26526, 40009, 17621, 4276, -174644]
17628A40013d8684C9370J87726l5312h0723A93231b4239A02411h9878J0846C55504
17616a00751C23281b18707i2056q8504b0106k5938G3590J12431l9398E8902e7027
17604b46492A96966o8660B2453c53310a4653B79210C6522J62001r0353c8507H6795
17592a70034C6824L0547b37905A5398P8374e2767A54654b6957G4811A5387J51685
17581A67072a18712F9227L5919B3706b7338C04539g8998A11684c12727g8897Q963
17570f9934D15941k04255j04673m2924J86981c14185f2943a939E559J7186O8686
17559I1431J43961m1030F6852J54017b755B74688j12699n2058a44888A37003D5123
17547A05990a32515A51586m3939l765o075J6171J72092K0152e7288J0884B92669
$$ y = [140013, -48684, 39370, 227096, 191784, -80723, 193231, -24239, 102411, -89878, -79032, 355504, -100751, 323281, -218707, -92056, -180560, -20106, -46044, 73590, 186021, 146623, 58902, -57027, -246492, 196966, 128306, 22453, -353310, -14653, 279210, 36522, 198523, 108170, -38507, 86795, -170034, 36824, 67371, -237905, 15398, 93772, -52767, 154654, -26957, 74811, 15387, 167072, -118712, 69227, 105146, 23706, -27338, 304539, -78998, 111684, -312727, -78897, -69934, 415941, 211686, 107013, 64089, 251070, -314185, -62943, -1939, 5559, 22745, 91431, 235392, 194362, 66852, 220869, -2755, 274688, 161989, 109931, -144888, 137003, 45123, 105990, -132515, 151586, 107647, 103882, 97807, 113978, 286070, 306222, -57288, -46404, 292669]
17535H4648a08975A4785b13864D11117G965b04368E9118b15430f9377n9919A01496
17523b78011A79879F4114A6112N311P1234M37452k27427o4747a01819F783L5883
17512D2666d08908B56095c5710o7924d8425B55717C4307J4777A8387K3701a08383
17500a57729B88588m4023b11327D1473a5161j41266n5178H4279J47042f9279L0802
17489c8477A80512i765A72912j3765f2709B51177k6098Q2667a77326B48703L1590
17478B80293F6013J30017h6602F4059l988a42089B3964J40385P2941O4831i9171
17466D11152g7486B13245p5572K66241F1159K54329B4935K57839q6743K26243
17456D22274B04829a78838j47271B39735l756E0597a7122F0198a04872a2201B15139
$$ y = [84648, -108975, 14785, -213864, 411117, 7965, -204368, 59118, -215430, -69377, -129296, 101496, -278011, 179879, 64114, 16112, 21423, 92657, 530109, 302682, 237935, -101819, 6783, 42666, -408908, 256095, -35710, -103634, -48425, 255717, 34307, 49084, 18387, 42088, -108383, -157729, 288588, 244565, -211327, 41473, -15161, -156427, -211605, 84279, 231321, -69279, -38477, 180512, -9765, 172912, 159147, -62709, 251177, 225079, 307746, -177326, 248703, 280293, 66013, 196030, -86602, 64059, 60071, -142089, 23964, 164349, 237290, 302121, -99171, 411152, -77486, 213245, 137673, 403914, 61159, 315488, 24935, 282774, 196031, 422274, 204829, -178838, -326109, 239735, 235979, 50597, -17122, 60198, -104872, -12201, 215139]
17444a31112B89273q939l2288C5708P2763p819J48034k7299R4542A29677B1417
17432B62194q8395d9880B51351H9656O4684j3693M40954B4714M00978j72599K38953
17421D92046k41941m5112J58997I9133N46213B46465h7463E32698B9623a39739
17410H8904J10222K0558k9167n2851L24826A89250J2473J43485q6153Q1445p8668
17399B61832j06965J25553J7997m300l8508H6216J25354L77137C1006Q5538k2462
17388I4082l6793O3511M7861A2746L9619L08772H0469K34775H4942D1857O5059
17377A06916K2700l7945h9596K7977A76681c9531B70761A15246k3663L47054p0442
17366C68195p9777a17993A08122m2561L27019C4202M80050A61344L87067B53712
$$ y = [-131112, 289273, 280334, 248046, 35708, 108471, 100652, 248686, 221387, 315929, 129677, 21417, 262194, 173799, -49880, 251351, 89656, 154340, 140647, 581601, 24714, 425692, 253093, 492046, 250105, 204993, 363990, 99133, 645346, 246465, -87463, 532698, 29623, -139739, 88904, 199126, 219684, 190517, 137666, 462492, 189250, 201723, 345208, 259055, 340500, 261832, 154867, 280420, 298417, 294117, 255609, 86216, 211570, 588707, 31006, 116544, 94082, 57289, 120800, 168661, 12746, 52365, 361137, 80469, 315244, 84942, 41857, 106916, 129616, 91671, -89596, -61619, 176681, -39531, 270761, 115246, 91583, 438637, 368195, 288418, -117993, 108122, 65561, 392580, 34202, 514252, 161344, 548411, 253712]
17355A82098K34895q3683a43758A1712J43806k3538n6141a05256D21220b86445
17344A25650c23560B90235J1222A08505c5199i656A51195L284p4393P5622H383
17332D66694E1532j4687J14370D7921K81746j39775K82169I5680R0055F2697K47315
17321C10012f9603B67669O11o7863r728H8231J03051J49127a05045J5902A72946
17309B66527c4568A87033l7876l4034K4517K9611L5736N6829P6841j36814Q268
17298B10111K36137G6310r952K43437e8051B97302H861K63615C7644M75598D7955
17286C96342A39939R5476A03622a79069c8697B45690o6944k7254J45684j44285
17276A52891k6775O0240m307K76306F401J54286R7386q3021J6942e8841D38120
$$ y = [182098, 416993, 333310, -143758, 11712, 155518, 131980, 75839, -105256, 421220, -286445, 125650, -323560, 290235, 301457, 108505, -35199, -9656, 151195, 154479, 80086, 155708, 8383, 466694, 51532, 36845, 151215, 47921, 329667, 189892, 472061, 95680, 185735, 62697, 310012, -69603, 267669, 268280, 200417, 190689, 88231, 191282, 340409, -105045, -89143, 172946, 266527, -34568, 187033, 149157, 115123, 139640, 169251, 204987, 261816, 338657, 201843, 210111, 446248, 76310, 66358, 309795, -58051, 297302, 8861, 272476, 37644, 513242, 47955, 396342, 139939, 235415, 103622, -179069, -38697, 245690, 178746, 151492, 297176, 152891, 126116, 186356, 182049, 458355, 6401, 160687, 258073, 175052, 191994, -58841, 438120]
17264D48090b44906A75025n3824L16582j49735L9693I1863b02810B61968K39184
17254E01152e949C5943L75958j32954r6052O6022N5510j4820j01514N2170J78674
17243D18937a24155K3688F25087B50545d4105B77107B1643P5406J78972C0305
17232B96601E433K76447j18964b08755a9175A27027O8515H2166J81973C08L45754
17221C46062r3967M7225r8279k0814N0021J18718K70551j51420A31638M7863r00
17210A78601d8625B03502L59554j89759A63728M05640G7057M29821a00418B10006
17199G98858B20088E7909b6671G3076Q0524a20229C36341l5227a33203E29937
17188E22754A49299R617j1044J55153M5993H6540K58851J02726n7568a42774C08618
$$ y = [448090, -244906, 175025, 121201, 437783, 288048, 327741, 91863, -202810, 261968, 501152, -5949, 35943, 411901, 278947, 182895, 248917, 304427, 289607, 188093, 240263, 418937, -124155, -100467, 625087, 250545, -44105, 277107, 21643, 97049, 276021, 30305, 296601, 5433, 281880, 162916, -208755, -19175, 127027, 195542, 82166, 264139, 308, 346062, 252095, 299320, 201041, 180227, 230248, 348966, 619517, 468097, 131638, 179501, 178601, -48625, 203502, 563056, 373297, 163728, 569368, 77057, 506878, -100418, 210006, 798858, 220088, 57909, -26671, 73076, 153600, -120229, 336341, 301114, -133203, 529937, 522754, 149299, 158916, 147872, 303025, 349018, 86540, 345391, 448117, 390549, -142774, 308618]
17176A41858l0740k3701K73580L530N7924F9709C1357K33015J16125A25494L89848
17165E15342a01830A77382K02782n7255Q9897K30224A3138J13013J5021N17310
17155F58482k88544j34314j6673J93688N1065k06300J20207j10963J39816j25426
17145B81038o5744K22791J16796c5260A14967J19412J80562j72707H3246J90526
17135B73772C3204K28933p2326K26075A83674N7218Q7952O0715M724j57881C6885
17123B02341L04155F6325J36291L637j8457p0194L10957q0018J72918J28563A93972
17111A90770L07878A33102K56755j43441O6555K12318n4065K27458A74974M96702
17101F71676k25624J53057k28559C1102L36410M27480l46920k17173L73529B65651
$$ y = [141858, 111118, 87417, 360997, 364527, 422451, 69709, 31357, 264372, 380497, 125494, 515342, -101830, 177382, 380164, 322909, 412806, 643030, 13138, 126151, 141172, 658482, 369938, 235624, 218951, 412639, 463704, 257404, 377611, 266648, 406464, 281038, 215294, 438085, 554881, -35260, 114967, 234379, 414941, 242234, 83246, 273772, 33204, 262137, 189811, 415886, 183674, 240892, 328844, 389559, 394283, 236402, 36885, 202341, 506496, 66325, 202616, 206253, 187796, 117602, 428559, 348541, 521459, 650022, 193972, 190770, 498648, 133102, 389857, 246416, 312971, 525289, 471224, 698682, 174974, 671676, 446052, 599109, 370550, 31102, 367512, 794992, 448072, 230899, 604428, 265651]
17090B77556L9506K03271j04202O3962H2860J60069j1127O7377K73002J24323
17080F96504B80911J73284Q0449k66451m6000M71611l22845R9221r739K72802
17070G33243k79061B21235J28148p8336N51580l96521K66506j59384l1407j35120
17060C66701Q8276j83489M44J58107N1993J15555J29867A90183K827J62344K95270
17049F50624m3268B93323G4754K10140M02553K43816k47198j67636M7474j23326
17039D40577J57894k51151M49072l18568K76750j43065K06088m04604L6276M36298
17029H85567k58707P2313N6693j76352q160k0594M3587m9784J83044j72686j57552
17018C97369J69817J10834l9740Q455j7614J78931Q42K61085k26876J02444k87936
$$ y = [277556, 317062, 520333, 416131, 480093, 82860, 242929, 231802, 299179, 572181, 696504, 280911, 454195, 534644, 268193, 222193, 693804, 370959, 470180, 460441, 733243, 454182, 221235, 349383, 271047, 822627, 426106, 692612, 533228, 501821, 366701, 454977, 271488, 271932, 430039, 482032, 597587, 727454, 190183, 193010, 355354, 650624, 607356, 293323, 74754, 284894, 687447, 931263, 684065, 516429, 563903, 440577, 598471, 347320, 796392, 477824, 754574, 611509, 817597, 412993, 449269, 885567, 626860, 699173, 755866, 579514, 571354, 550760, 594347, 544563, 727607, 554921, 397369, 567186, 678020, 638280, 646735, 629121, 808052, 808894, 1069979, 843103, 945547, 657611]
17007F57611r6836L56423m08044M18221m12556L31023k77689M0292A93160N72873
16997G66033Q788j1268m9260p6489J79910m812j60834J7895J31195k64827K49124
16986G85455k28524K17865K94006l84481k6136j35252L27066k70518Q7177K4129
16976F90787M3298J22665j99995K28255M9961k35479K71396l12900J56173P8399
16966H92560L51966j94979j87180k8856K96513l31457J35318n8197r4994K79917
16956A060611l05113J32481N5099K99670p0594j88946j01255K18356N4821j57856
16946I97274K60176l84415K37447j9701M4738m17708N28333k15518K05016L0167
16936A265809l20598J45923L60724l89694Q2650j2253k16712M85860k62382J96
$$ y = [657611, 560775, 917198, 509154, 927375, 514819, 845842, 568153, 608445, 193160, 766033, 774821, 763553, 714293, 637804, 817714, 812902, 652068, 669963, 801158, 536331, 785455, 556931, 774796, 1068802, 684321, 658185, 522933, 849999, 579481, 666658, 690787, 734085, 856750, 656755, 885010, 934971, 699492, 970888, 657988, 814161, 892560, 1244526, 1049547, 862367, 833511, 1130024, 798567, 933885, 875688, 780694, 1060611, 755498, 887979, 943078, 1242748, 1172154, 983208, 881953, 1100309, 1155130, 997274, 1257450, 873035, 1110482, 1090781, 1135519, 717811, 1246144, 1030626, 1235642, 1265809, 945211, 1091134, 1451858, 1062164, 1144814, 1132561, 915849, 1401709, 1139327, 1139523]
16926A139523L60111j99405l52644O40914j32622l70576N28812k57209J23519
16917A480423k41968K26796O06M850p0251K86578l11552J05511k07768K52178
16907A525403K23036k02331P5448N6632k65778K02000Q0328k88655J43853J5217
16897A565153j98429M24006l11048J81905j87057M72998m78826J80868o2686J04481
16887A691365J93419Q1580j45222j25895J74037L3536j69413J92375k5109K73127
16877B173800k92966L46935k2974m47909M56721r0138J07948J39650j770J5419
16867B384716j40954J31578J48058k19248K29043k16986k0034N97623n02027J57366
16857B549135J15708k66071K69957L54070k49573l56185K86628J56592l6317J55207
$$ y = [1139523, 1499634, 1300229, 947585, 1588499, 1455877, 1085301, 1614113, 1356904, 1480423, 1238455, 1465251, 1465857, 1470707, 1400456, 1687034, 1375482, 1480993, 1273225, 1525403, 1748439, 1546108, 1621556, 1678188, 1412410, 1614410, 1694738, 1406083, 1549936, 1565153, 1366724, 1790730, 1479682, 1661587, 1474530, 1947528, 1468702, 1649570, 1586884, 1691365, 1884784, 1966364, 1821142, 1695247, 1869284, 1902820, 1733407, 1925782, 1900673, 2173800, 1880834, 2227769, 2204795, 1756886, 2213607, 2123469, 2231417, 2371067, 2369297, 2384716, 2243762, 2375340, 2523398, 2304150, 2533193, 2316207, 2296173, 2893796, 2391769, 2549135, 2664843, 2398772, 2668729, 3022799, 2773226, 2417041, 2703669, 2860261, 2823944, 2979151]
16847B979151K29624j49789K2650J48168J47165k47340k20550P7029M58156N644
16837C449908n6231M21166j17759k56426J36021J79801k843K06455K54288j48198
16827D066182n5658l3227L1936O11287P4964m51478L00752q1792L5440M2731J92330
16816D733467M26119j05219R1022J89170p2878m5359M00741k33135K32684J03250
16806E719862J48540k16542N93026O7663K21392j29657J52281K78253j7083J31854
16796F949589J35712O74032Q055k8695K86168r8844K91571L07097N429J77930
16786H708044L00017N79067k01994J95225J89429J83489J72577J57213N58335
16777A0841402K54109M09368M41228k03079P71764M82999J06521N97710l5361
$$ y = [2979151, 3208775, 3058986, 3081636, 3229804, 3376969, 3129629, 2909079, 2986108, 3444264, 3449908, 3393677, 3814843, 3697084, 3440658, 3576679, 3756480, 3753637, 3960092, 4214380, 4066182, 4010524, 3977297, 4009233, 4620520, 4695484, 4244006, 4544758, 4462966, 4498406, 4541137, 4733467, 5159586, 5054367, 5145389, 5334559, 5261681, 5216322, 5617063, 5383928, 5616612, 5719862, 5868402, 5651860, 6244886, 6312549, 6533941, 6404284, 6556565, 6834818, 6817735, 6949589, 7085301, 7759333, 7767388, 7738693, 8024861, 7926017, 8217588, 8524685, 8530114, 8708044, 9008061, 9587128, 9385134, 9580359, 9769788, 9953277, 10125854, 10283067, 10841402, 11095511, 11504879, 11946107, 11743028, 12514792, 12997791, 13104312, 13702022, 13666661]
16768A3666661N45366M14600M90760L40320O22308O06065N08001K70979L69620
16759A7834680J000738N70567J191245N46355N55695Q71515N08090J062381N58530
16750B4699796J162332J215768Q86099J170698J078945J156729J300981J633645
16742C4304993J376698J400007J711034J220129K003560K008061K458652K102349
16734D8585483K518312K069966L141041K574867L088106L111968L489607L602792
16726G2182142L900153M227925M617631M422565M823155N365888N235896N493209
16718A10268564O028459N573423O351609O086088N926743N819370O073888N182728
16710A57310872M910850M420791L795102L158548J731571J984356Q6140r61003
$$ y = [13666661, 14212027, 14626627, 15117387, 15457707, 16080015, 16686080, 17194081, 17465060, 17834680, 18835418, 19405985, 20597230, 21143585, 21699280, 22570795, 23078885, 24141266, 24699796, 25862128, 27077896, 27963995, 29134693, 30213638, 31370367, 32671348, 34304993, 35681691, 37081698, 38792732, 40012861, 42016421, 44024482, 46483134, 48585483, 51103795, 53173761, 56314802, 58889669, 61977775, 65089743, 68579350, 72182142, 76082295, 80310220, 84927851, 89350416, 94173571, 99539459, 104775355, 110268564, 116297023, 121870446, 128222055, 134308143, 140234886, 146054256, 152128144, 157310872, 162221722, 166642513, 170437615, 173596163, 175327734, 177312090, 177398230, 176437227]
16702A76437227j441910k611165l067323m210239m749273n083542n845055o086117
16694A43342603o128315o064611o115087o206012n884323n846603n462628n482247
16686I6152777n052624m965025m676566m718359l919103l800274l676587l650208
16678F1694031k916360k904790l046265k735237k484576k477616k092022j933404
16670D1103761j908531k096725j439377j628627j582101j113322j424364j249976
16662B8660738j209333j104809j114863j027129r51758q52352q83257p97011l50924
16653B0369302j041198k15313j312590p14131n66281k62902n22220n77282p11938
16644A4445447j32963k83730q45136j14083q28417j42361m50513k22794l13089
$$ y = [176437227, 174995317, 172384152, 169316829, 165106590, 160357317, 155273775, 149428720, 143342603, 137214288, 131149677, 125034590, 118828578, 112944255, 107097652, 101635024, 96152777, 91100153, 86135128, 81458562, 76740203, 72821100, 69020826, 65344239, 61694031, 58777671, 55872881, 52826616, 50091379, 47606803, 45129187, 43037165, 41103761, 39195230, 37098505, 35659128, 34030501, 32448400, 31335078, 29910714, 28660738, 27451405, 26346596, 25231733, 24204604, 23252846, 22400494, 21517237, 20720226, 20369302, 19328104, 19112791, 17800201, 17086070, 16519789, 16256887, 15734667, 15157385, 14445447, 14312484, 14028754, 13183618, 13069535, 12241118, 12098757, 11648244, 11425450, 11112361]
16635A1112361k63691k05190k21625n36288l58608k82541r9697j10005k52844
16626H781872m38411Q2725k27650n96723k434k38252r4406K92234m17011o52374
16616F489570L4466o8161K3278k49372K17362l48576k59875k47920k12388J44578
16606E522962l39581R0280q9507l44799J2159O0335L6342m30183j8997J37750
16596D636761k30976m33144K19105k02100j29120L58847k98473J85248k74476
16587C831672Q6486k50931r2257Q6908l79386M21849l57827k38410m5257K01156
16577C264003p9904j96721J87799j32716k8325k81536r0944N57707m77448j3838
16567B708077j9490r176m87172K70924K82633k99295j2228J81414j85859r3353
$$ y = [11112361, 10848670, 10643480, 10421855, 9885567, 9526959, 9244418, 9144721, 9034716, 8781872, 8343461, 8426186, 8198536, 7601813, 7599379, 7361127, 7266721, 7558955, 7141944, 6489570, 6524036, 6455875, 6479153, 6229781, 6447143, 6098567, 5838692, 5590772, 5378384, 5522962, 5183381, 5273661, 5184154, 4839355, 4851514, 4911849, 4948191, 4518008, 4499011, 4636761, 4405785, 3972641, 4191746, 3989646, 3860526, 4219373, 3920900, 4106148, 3831672, 3918158, 3667227, 3574970, 3661878, 3282492, 3704341, 3346514, 3108104, 3062847, 3264003, 3184099, 2987378, 3175177, 3042461, 3014136, 2732600, 2641656, 3199363, 2721915, 2708077, 2688587, 2679411, 2192239, 2463163, 2745796, 2446501, 2434273, 2615687, 2429828, 2336475]
16557B336475K4822K15569j26932n50965L15844k52928K24128J51023k23423k88288
16547A825325K28842M7122m974J03938l26171k04139J73430o5557k80196J83207
16537A680827J34514j65999j77884M84192l56419M2916Q5556j43924J8292P527
16527A609598j61977L38185J26027m31516k42097K9000M56378l30549l649N0933
16517A440333p2216N5715n2066L20572l85705J25373j01108k55922K31241J6196
16507A322413Q3376m01142J84292R526j75860K8841M22214n41166L83712j40554
16497A175652N2861l42423K97689N5665j99928j01040K92022l97305K84068m37700
16487F79561O51893D53363K98566P7227O8164l9127j56746K22779K54419k10416
$$ y = [2336475, 2361297, 2576866, 2449934, 1898969, 2214813, 1961885, 2186013, 2337036, 2113613, 1825325, 2054167, 2101289, 2096315, 2200253, 1874082, 1669943, 1843373, 1777816, 1497620, 1680827, 1815341, 1649342, 1471458, 1955650, 1599231, 1642147, 1727703, 1583779, 1602071, 1609598, 1447621, 1785806, 1911833, 1480317, 1238220, 1267220, 1723598, 1393049, 1389400, 1440333, 1368117, 1423832, 1371766, 1692338, 1306633, 1432006, 1330898, 1074976, 1306217, 1322413, 1405789, 1004647, 1188939, 1198465, 1022605, 1051446, 1473660, 932494, 1316206, 1175652, 1228513, 886090, 1183779, 1239444, 1039516, 938476, 1230498, 833193, 1117261, 679561, 1331454, 453363, 751929, 829156, 897320, 858193, 701447, 924226, 1178645, 968229]
16477I68229j35398L06871j09889j71541L4913L0662l12032N30184K3028l75196
16467G89831k10644L43842j57476J49562j58040j49258J64194j5922P8149r4953
16457G39285r3367j8394j46651l9931K76511j73106j29478K07995J34823M0743
16447G98430k68318J97318k03257J48525k76277K21344K07276j75377n2550k01879
16437C95235j2670L45979K0418J39069l16064L1881j92347P6844R7198J3906Q2633
16426F82082k13830m0721K22350j38418N5012L4241j57632q9923K81712j36274
16416D98599A98118M00139r2892j5971K12088L1846C50567L53523o4218B75771
16405G59051j16306l15821p0204J77374m4018P4856F7737M47107O3772j58254
$$ y = [968229, 832831, 1139702, 1029813, 858272, 893185, 923847, 611815, 1141999, 1165027, 789831, 579187, 923029, 765553, 915115, 757075, 607817, 772011, 756089, 834238, 739285, 645918, 627524, 480873, 440942, 717453, 544347, 414869, 622864, 757687, 798430, 530112, 727430, 524173, 672698, 396421, 617765, 825041, 649664, 597114, 395235, 382565, 728544, 748962, 888031, 571967, 603848, 411501, 488345, 585543, 599449, 682082, 468252, 427531, 649881, 511463, 566475, 600716, 443084, 353161, 634873, 498599, 198118, 598257, 505365, 489394, 701482, 733328, 350567, 704090, 639872, 275771, 759051, 642745, 326924, 256720, 434094, 390076, 464932, 67737, 514844, 578616, 420362]
16395D20362j26564K51258B17081J36845l8895O6641K10837j51343B05009j4601
16385A90408K84624A53097L34697k37372J2186F6424N4413K41910k1486R5798
16375D37059j51400M91835A87027J35976j48090E5689M03448K2611G0894K22228
16365B93122j43877K86462M4458r9287K05954k89198G5035L75854A70713l1277
16355A39436J78350E130L89837r9849I6177a15531A09101M87997k54200K7236
16345C70134j16699k0310j10933N34020A20329M0130L5674J42547J3451K9508
16335C81639J55717k13938a44334E1290R8645D668K93598A28801K60510N7681
16325D46992B499L87459J01664m2990j63666p03e4890B41388J25157j49042K73046
$$ y = [420362, 293798, 545056, 217081, 353926, 315031, 381672, 592509, 441166, 205009, 190408, 475032, 153097, 487794, 250422, 262608, 66424, 120837, 362747, 341261, 437059, 285659, 777494, 187027, 323003, 174913, 55689, 459137, 481748, 70894, 293122, 149245, 435707, 480165, 380878, 586832, 297634, 75035, 450889, 170713, 139436, 317786, 5130, 394967, 295118, 96177, -115531, 109101, 597098, 342898, 370134, 253435, 233125, 122192, 656212, 120329, 160459, 196133, 338680, 352131, 381639, 537356, 323418, -144334, 51290, 149935, 4668, 298266, 128801, 389311, 446992, 2499, 389958, 491622, 448632, 284966, 284263, -54890, 241388, 366545, 217503, 490549]
16314D90549j39867l7150f1183D62941j07037p0856A38994J32827J36467g6533
16303c33318C02414C1662J2434a94963A15311K72135A23542J68052a05174A35330
16292I8385l005F395g2318B80287o1466r3304o561M2919c06128J07641B01896
16280B502M6404f2376B30368g1901D74900A21710K4996J63723R2559A7245J36482
16269A53727l0415a8437C95415r453j66373P1162D0742J39441N3887J49386A24733
16257c6864A21140k7669N4876K54107G3716J42113I148J55135R5374b79512B54378
16245C41321f4570j74160D30459A64885j1832b43126d1138B77594E0616g421A49629
16233A57372l4389J232b33346B91604M840A16745J21646k8126b7668k55611E7823
$$ y = [490549, 350682, 313532, -61183, 462941, 355904, 285048, 138994, 271821, 408288, -76533, -333318, 302414, 31662, 44096, -194963, 115311, 387446, 123542, 291594, -105174, 135330, 98385, 95380, 6395, -72318, 280287, 218821, 125517, 118956, 161875, -306128, -198487, 201896, 2502, 48906, -62376, 230368, -71901, 474900, 121710, 146706, 310429, 402988, 17245, 153727, 123312, -18437, 395415, 385962, 219589, 290751, 40742, 180183, 234070, 383456, 124733, -36864, 121140, 93471, 148347, 402454, 73716, 215829, 9148, 164283, 259657, -279512, 254378, 341321, -64570, -238730, 430459, 164885, 153053, -243126, -41138, 277594, 50616, -7421, 149629, 157372, 122983, 124215, -233346, 291604, 296444, 116745, 238391, 210265, -27668, -283279, 57823]
16221B93091j40817K36697j70523k975r8564J91632r1856e4326C0555L6120c3844
16209A02835Q1764J20219d0825A13354Q5313l6418L32170i7104A63664O9482H5418
16197B08064G2448k9950R7254n006J81796A19639D879h4447F9820J37164r5013
16186A11971g1737j13124B71085e1291A04234J31749H8269j6546J29498q5080
16176A16141J55430C2633I836e7261B7144b2252B44706C3764P1748J76384a79618
16164d4891D07060d1164B65790J7113r8506b8784A40566g7149B29915d2635A08952
16152d6648H7246c4700B82296a67553E0421R5912E1515N5882b94404B26250i8235
16140A80029b60634A6661J12955F3398g8503p3971A40165g4595A43348b19154
$$ y = [293091, 152274, 388971, 218448, 215473, 116909, 308541, 216685, -54326, 30555, 66675, -33844, 102835, 184599, 304818, -40825, 113354, 198667, 162249, 494419, -97104, 163664, 233146, 85418, 208064, 72448, 42498, 139752, 134746, 316542, 119639, 4879, -84447, 69820, 206984, 111971, -71737, -184861, 271085, -51291, 104234, 235983, 88269, 71723, 201221, 116141, 271571, 32633, 9836, -57261, 27144, -22252, 244706, 33764, 105512, 281896, -179618, -44891, 407060, -41164, 265790, 282903, 184397, -28784, 140566, -77149, 229915, -42635, 108952, -46648, 87246, -34700, 282296, -167553, 50421, 146333, 51515, 107397, -294404, 226250, -98235, 180029, -260634, 16661, 129616, 63398, -78503, -152474, 140165, -74595, 143348, -219154]
16129b10741O0956A39134j6528a67293a898j5782A42552J3664G628a2694A35993
16117i5212A58368o1979a51887B59795B9465J03443N2456N7123J2468I2002d6540
16105a38006L7825I5412L0989b28982B8592O2245K32505c6637A65256a66472G1568
16093a87412k5395B91906A40774J04400p4268G3801J00646Q5575A4335L46454
16083C60789I1366J17613I7494n294J29006e7617m9772k4082l653C3736f8307
16071a52562B18918f7871r1409H320M8460i2826L8205i748o704q8170B0338b66493
16058I5419a23751A48725a98232A00935L05348b6811d88p1333F5764c03324h4025
16046C44989A3496O3382i073C262d6181I9759l0503a22744A97847a24167m7784
$$ y = [-210741, -149785, 139134, 122606, -167293, -1898, -17680, 142552, 156216, 7628, -12694, 135993, -95212, 158368, 96389, -151887, 259795, 29465, 132908, 185364, 242487, 254955, 92002, -46540, -138006, -100181, 95412, 126401, -228982, 28592, 90837, 323342, -36637, 165256, -166472, 71568, -187412, -212807, 291906, 140774, 245174, 170906, 73801, 174447, 260022, 14335, 360789, 91366, 208979, 97494, 92200, 221206, -57617, -107389, -131471, -135124, 33736, -68307, -152562, 218918, -67871, -159280, 8320, 56780, -92826, -54621, -9748, -16452, -104622, 20338, -266493, 95419, -123751, 148725, -198232, 100935, 406283, -26811, -488, -71821, 65764, -303324, -84025, 344989, 13496, 76878, -9073, 3262, -46181, 99759, 69256, -122744, 197847, -124167, -171951]
16035a71951i66D8423K8168g8894A798i809j41167D6065K54008b08907A18536
16023a2059L186l9013A9138N1253j0303a46056f094j20453A61101b1609A52537
16011b14166B33292F6707a68993M1282J2547l0891H3507J70428I3521A0293d0442
15999G6004J26545d2760I9090f3217n9087D04122A05575a48186N8078b4739A4852
15987A43362c93968a37846B15282a53438A89758I4757a61983A06232a10385H4032
15976B03396G6201N392J21494G2123L19914A65837k3996B7435L35905J37210B4358
15964H2920K51595J16569B5997P2693a65942A04548b50385a00490A24208a94182
15953h7372A01746e145o986k28714a8513o7752k9535Q160F5516h9544C7109L6817
$$ y = [-171951, -966, 48423, 76591, -78894, 1798, -9809, -150976, 46065, 300073, -208907, 118536, -12059, -8873, -47886, 19138, 70391, 60088, -146056, -6094, -126547, 161101, -21609, 152537, -214166, 233292, 66707, -168993, -127711, -115164, -146055, 83507, 253935, 93521, 10293, -40442, 76004, 202549, -42760, 99090, -63217, -122304, 404122, 105575, -148186, -90108, -24739, 14852, 143362, -393968, -137846, 215282, -153438, 189758, 94757, -161983, 106232, -110385, 84032, 203396, 76201, 81593, 203087, 72123, 392037, 165837, 141841, 27435, 363340, 500550, 24358, 82920, 334515, 451084, 25997, 98690, -165942, 104548, -250385, -100490, 124208, -194182, -87372, 101746, -5145, -12131, -240845, -18513, -86265, -115800, -107640, 65516, -89544, 37109, 73926]
15941G3926a68090k4230B65452j21686k4419O254J1668K0872e8942k7276k5092
15930a11310J2240b1732j84639m7554i1427n7234f129G9153i3043a6509A69865
15918a1021L254B8288e3425j10411G4192A4520J72205a42507j03677A27302L2282
15907A59584E3231a07908E1398b47660B03717c10609A89954b8575p2920A124a86692
15895a48615A31146a45431c3176o317A34810m2695b40661g8353B06248o7201e0483
15883a39935A4777b0593l64378B42137L063c85498O6191i6805B03570G5367b77230
15871G8707L97044E823h7711b2028D5204d9141O584j99116J9023a01828j52536
15860b54364A4368J62039a64475N4276j31691d5826H5692d2322j86315Q0328B43883
$$ y = [73926, -168090, -192320, 265452, 143766, 119347, 125601, 137269, 158141, -58942, -86218, -111310, -99070, -21732, -206371, -253925, -91427, -148661, -6129, 79153, -93043, -16509, 169865, -11021, -7767, 28288, -53425, -163836, 74192, 14520, 186725, -142507, -246184, 127302, 159584, 53231, -107908, 51398, -247660, 203717, -310609, 189954, -28575, -101495, 1124, -186692, -148615, 131146, -145431, -33176, -39493, 134810, 92115, -240661, -78353, 206248, 139047, -50483, -139935, 14777, -20593, -384971, 242137, 245200, -385498, -319307, -96805, 203570, 75367, -277230, 78707, 475751, 5823, -87711, -22028, 45204, -49141, -42557, -241673, -222650, -101828, -254364, 14368, 176407, -164475, -110199, -241890, -45826, 85692, -42322, -228637, -148309, 243883]
15848a16728B06328a26163G7594J09477C6530N8192J46792F1548h9938n3798M7669
15837i6067M3075r833D249J16023a9470C4958h3961n6603c5397j93900C9954a82739
15824G1484I304g8620b9581E2523a68989G6355k1730g0713B11366b1040G0309
15812F4374N2784j7214e9547m4656A23936e5690j20544P8048F9257a39928F0177
15800E7274a1871p8215m9839I004M8138A6755M8500b81198C02557A37009J28319
15789B65328o7684N6835b27493A90895b49948b9439A95674o5531R8759a93589
15778a50879c558l75957h6269H3860Q4551L6548n7716a7014F4226d5458G9891
15766A37613g0757B65459e448G710a6543k66612h6879K5047r9627B5400a25421
$$ y = [-116728, 206328, -126163, 77594, 187071, 36530, 94722, 241514, 61548, -89938, -143736, -96067, -52992, -62825, 4249, 120272, -19470, 34958, -83961, -140564, -35397, -229297, 39954, -182739, 71484, 9304, -78620, -29581, 52523, -168989, 76355, 54625, -70713, 211366, -21040, 70309, 64374, 117158, 99944, -59547, -104203, 123936, -55690, -176234, -98186, 69257, -139928, 60177, 57274, -11871, -90086, -139925, 9004, 57142, 16755, 65255, -281198, 302557, 137009, 265328, 197644, 254479, -227493, 190895, -249948, -29439, 195674, 130143, 228902, -193589, -150879, -3558, -379515, -86269, 83860, 168411, 204959, 147243, -17014, 64226, -45458, 79891, 137613, -70757, 265459, -5448, 7710, -16543, -283155, -86879, -61832, -161459, 25400, -125421]
15754A73298J53124M6672a29403L6947A12098C9063R5631a1381q5604a3322H8750
15742h5565j20609K8683F7726K52799r8713a6786j19125B60144a70791B4172N4772
15731G8944b7488j960B38110F8345k5231a26182B0889a64962A66366G9793d40833
15719a67631B46141b08355j18905a54218q401A61091a15978j27512A88279b86926
15708A16476J77238a99757l55196a0027D22787B08238B4429J88585f3177n22929
15698e86106b09815e8580B18069c47806G9768b77342A34828g8682B1947J83328
15688B05275a97383k0644a01699B14398a24295j47226J29633e2072B35234b99618
15677D7830a63040O4132a8058I8047D1383a259C34315A6528b32400A02325j0413
$$ y = [173298, 326422, 373094, -129403, -92456, 112098, 39063, 134694, -11381, -96985, -13322, 88750, -85565, -206174, -177491, 67726, 320525, 221812, -16786, -135911, 260144, -170791, 24172, 78944, -27488, -29448, 238110, 68345, 43114, -126182, 20889, -164962, 166366, 79793, -440833, -167631, 246141, -208355, -327260, -154218, -162619, 161091, -115978, -243490, 188279, -286926, 116476, 293714, -199757, -554953, -10027, 422787, 208238, 24429, 213014, -63177, -586106, -209815, -58580, 218069, -347806, 79768, -277342, 134828, -78682, 21947, 205275, -197383, -218027, -101699, 214398, -124295, -271521, -141888, -52072, 235234, -299618, 47830, -163040, -98908, -18058, 98047, 41383, -1259, 334315, 16528, -232400, 102325, 91912]
15666I1912b36153O9005D2181b34669h71B70305a27399H4381i6957A54206b47084
15654A18217i2208J6726J1008j62194P0081J4004A13137k8130b6781E4524a83232
15642b52426B53854a50984d4770R709k92143E4320b8980r3335A68078a84793L8170
15631a46623j02081D64014C844b0573A75124b9749J014C45442G8281H414b10600
15619a28229H2427b58478A33908b45680J5867A16229C5499a43666A3476a75412
15608g5444K5889D13900i0541A34367o0966P1643J41052c1942o5418F2381a97009
15596H4114L765b46528K4030J06722f423j38427o6917q30n0067g9614J4093q9013
15584a54534G2476G305J1995h4094C813a667j4029C8821c0595c065j57688l5461
$$ y = [91912, -236153, -167148, 42181, -234669, -871, 270305, -127399, 84381, -96957, 154206, -247084, 118217, -92208, -75482, -64474, -226668, -156587, -142583, 113137, 85007, -26781, 54524, -183232, -252426, 253854, -150984, -44770, -35061, -327204, 54320, -28980, -122315, 168078, -184793, -146623, -248704, 464014, 3844, -20573, 175124, -29749, -28735, 345442, 78281, 8414, -210600, -128229, 82427, -258478, 133908, -245680, -229813, 116229, 35499, -143666, 13476, -175412, -75444, -49555, 413900, -90541, 134367, 73401, 145044, 286096, -31942, -97360, 62381, -197009, 84114, 87879, -246528, -222498, -115776, -6423, -144850, -211767, -212597, -262664, -79614, -65521, -154534, 72476, 7305, 19300, -84094, 3813, -1667, -15696, 38821, -30595, -3065, -160753, -196214]
15572a96214b5320j94543c6489B7386b64153d033o6217m56K0123J9509C0060e63323
15559B06317P9624j00163K3244E4121H716K5578a31867D8706J22777L1614D7512
15547A22731J8611k0075a45108e0684A6061J5344L12937a10897A69645e2008q4892
15536a36900k5175B00447b41677j5917g8015B27258k8052b9777j4515A90871g3000
15524a81578N6474A29937D4413J46785G0638j7774b18227C06881b02814J73j1330
15513b13971b7083E1048a55241B25618f3062j96844A86887a65596H2263e9452
15502A36145M2440f3656D0310M7529K7211a12251C10189A55040p4075a06177G064
15490d3736B92520I7122b0720j32744E5634K8585a12897B0637a52059C7335c145
$$ y = [-196214, -25320, -219863, -36489, 27386, -264153, -4033, -70250, -70706, -50583, -31074, 30060, -563323, 206317, 285941, 185778, 209022, 54121, 8716, 34294, -131867, 48706, 171483, 203097, 47512, 122731, 141342, 121267, -145108, -50684, 16061, 31405, 344342, -110897, 169645, -52008, -136900, -162075, 200447, -241677, -257594, -78015, 227258, 199206, -29777, -44292, 190871, -73000, -181578, -125104, 129937, 44413, 191198, 70638, 52864, -218227, 306881, -202814, -202641, -213971, -27083, 51048, -155241, 225618, -63062, -259906, 186887, -165596, 82263, -59452, 136145, 178585, -63656, 40310, 87839, 115050, -112251, 310189, 155040, 80965, -106177, 7064, -43736, 292520, 97122, -20720, -153464, 55634, 84219, -112897, 20637, -152059, 37335, -3145]
15478f1484j27004A82868b57121d5878G150K01188E6057J16518a7940E3483a195
15466C72708j49974f8356J3161H0991c9927C28511A23685K9994n8051b6035n6399
15455h2434C2768a5852l6317n9161A0829Q3005b4190B261Q8608h0120L2581D3129
15442D8758A6629f2624D03074c05000B08958E1454J69729b02726C67786A01159
15431A01578r815N4464C0839f925j07598A3216a19974A05947K01857a5921F4390
15419b24955h8285A59385f543B16867c83803J75450j54477L8144d4520B88832
15408a42159A7255M6476a73796A07349L79394j60093j14038d3204B88621a76485
15397a58966D5466M4058i8806i429j94426l89213A6002b1546A52925r755a71261
$$ y = [-61484, -188488, 182868, -257121, -45878, 7150, 208338, 56057, 172575, -17940, 53483, -1195, 372708, 222734, -68356, -55195, 80991, -39927, 328511, 123685, 153679, 95628, -26035, -82434, 32768, -15852, -52169, -111330, 10829, 93834, -24190, 2261, 90869, -80120, -47539, 43129, 48758, 16629, -62624, 403074, -305000, 208958, 51454, 221183, -202726, 367786, 101159, 101578, 91763, 146227, 30839, -6925, -114523, 13216, -119974, 105947, 307804, -15921, 64390, -224955, -88285, 159385, -6543, 216867, -383803, -208353, -362830, -324686, -44520, 288832, -142159, 17255, 63731, -173796, 107349, 486743, 326650, 212612, -43204, 288621, -176485, -158966, 45466, 89524, -98806, -9429, -203855, -593068, 16002, -21546, 152925, 143170, -171261]
15385B23914D1151I484a35401a8883B73435d0436n3777j22789B49756b71529h7194
15373C23014i1976j03416j72637C75857D266K75016d00968J18349a17259m5247
15363a62506L2010e2881N203B71658A34517j9993K96578B03350n4709a84962g0346
15351b27433A11719A0182b99833A14205M085b94719M4798M8370e558B03288p8657
15340A24631J3044J46714b62097A04693l095a21119N2990k26770J26322A52829
15329C05199A02055m4244a18235l469B58583a29349l6091C15927B3003a67648
15318A76114a08328j89530K5139J00665F0855J00231l8177k1633K00619F1602
15307E124b63197a1210C6031b05533Q9734M7922A20608R7273a43424C25040a73351
$$ y = [223914, 41151, 9484, -135401, -18883, 273435, -40436, -94213, -217002, 249756, -271529, -87194, 323014, -91976, -195392, -368029, 375857, 4266, 279282, -400968, -282619, -117259, -162506, -130496, -52881, -47678, 271658, 134517, 114524, 411102, 203350, 148641, -184962, -70346, -227433, 111719, 10182, -299833, 114205, 118290, -294719, -249921, -201551, -5558, 203288, 124631, 137675, 284389, -262097, 104693, 101598, -121119, -68129, -294899, -168577, 152829, 305199, 102055, 57811, -118235, -121704, 258583, -129349, -165440, 315927, 23003, -167648, 176114, -108328, -297858, -272719, -172054, 60855, 161086, 122909, 101276, 301895, 61602, 5124, -263197, -11210, 36031, -205533, -115799, -67877, 120608, 217881, -143424, 325040, -173351]
15295a6548F3323j8111b5956B65098D3003j083a82576k4909E9523a40127m8473
15284a88600O291e3824m5445r2260i5117A10278A8058b0808m9514A24142m7571
15273G6571a84086A90705L7649i7338A21488a00287j982H8364J38821j06333l2980
15262H7872f8721A12965J86524q6987J68958j55688J54884j56557l5284N1214
15252B40029a98608E16150A17981K38775j74146J25055l7114q5888k5284j4874
15242A44505R9627J86985D0047L27052G2146K3214L58866o0728N28156L53691
15232A275345n61059N30352k45543m92805J11258j66661r3282A51070l136j6911
15222A31023a16765A66055C4546L50470g1748L5048G2491J85210j14330J76797
$$ y = [-16548, 63323, 45212, -25956, 265098, 43003, 41920, -182576, -207485, 59523, -140127, -188600, -182309, -53824, -99269, -191529, -95117, 110278, 18058, -20808, -70322, 124142, 76571, -184086, 190705, 228354, -97338, 121488, -100287, -102269, 88364, 227185, 120852, 87872, -68721, 112965, 299489, 212502, 381460, 225772, 380656, 224099, 188815, 240029, -198608, 516150, 117981, 356756, 182610, 307665, 270551, 184663, 159379, 144505, 244132, 431117, 40047, 367099, 72146, 95360, 454226, 393498, 921654, 1275345, 714286, 1244638, 999095, 506290, 617548, 450887, 357605, 151070, 147934, 131023, -116765, 166055, 34546, 385016, -71748, -36700, 72491, 257701, 143371, 320168]
15212C20168n9717J87907B17564a39316A51981D5595a765q3620A54851J64021
15202C18872A43337j1423f77F8557a13852j15237B06070D3435M12355M8913E8144
15190d8434A93556M6678b78405r789e3618C38285F8557e3858F0922k9558i0132
15178a19875b099B74229b0755B01375A8826P5070d4598j47060e7866k8299D71970
15166e797j5741B97192n1547a25854e9220D05834H5557f3875F9918l3369a77884
15154B01464a03689B82187C2884K0232a05910B6637J8309L7946f5625O327B4882
15142A97599q9368m2692K34014A48586l3821P6172B5602b21344P8735A01021R7568
15131A98589B1407M04240A9078M9489J16467F9562c7666G606A738a7798A56034
$$ y = [320168, 260451, 448358, 217564, -139316, 151981, 45595, -1765, -85385, 154851, 318872, 143337, 131914, -677, 68557, -113852, -229089, 206070, 43435, 455790, 504703, 58144, -48434, 193556, 240234, -278405, -288194, -53618, 338285, 68557, -53858, 60922, 31364, -90132, -119875, -2099, 274229, -20755, 201375, 18826, 93896, -44598, -191658, -57866, -86165, 471970, -5797, -21538, 297192, 245645, -125854, -59220, 405834, 85557, -63875, 69918, 36549, -177884, 201464, -103689, 282187, 32884, 53116, -105910, 26637, 44946, 82892, -65625, -59298, 24882, 197599, 108231, 65539, 299553, 148586, 114765, 190937, 25602, -221344, -142609, 101021, 198589, 21407, 425647, 19078, 68567, 185034, 69562, -37666, 7606, 1738, -17798, 156034]
15119A62082D6357a0865j9321B1749L20294j19845r0481l387N4521i6565F0143
15107D5760J05108I512R058J11704K95411Q7801a21841D19381g0256B88366f6709
15095B2131K0370M5358L82847I3872J27850a23309E1850a04134k40763g2415B44328
15083C44337d8636C85582A23862e4923C30914A42329d0933B25283r779F0999g8787
15071A08786J23336o8785J47244j523r5765P3736Q9276A15595B4374J13812J24237
15060B62423A16363R6861f3539D1764j4087L11860h2404A46834c0568A03191C5315
15048A78137J62679q0036l3454r8632a13026l5574B07467g7082A12895l7837a04220
15036C37370k4848n4393q8123K57950j79859K86686B36004r4421G0404J22877
$$ y = [162082, 46357, -10865, -30186, 21749, 342043, 222198, 131717, 128330, 182851, -96565, 60143, 45760, 150868, 9512, 18570, 130274, 425685, 513486, -121841, 419381, -70256, 288366, -66709, 22131, 42501, 87859, 470706, 93872, 221722, -123309, 51850, -104134, -344897, -72415, 244328, 344337, -48636, 385582, 123862, -54923, 330914, 142329, -40933, 225283, 215504, 60999, -78787, 108786, 232122, 163337, 310581, 309058, 213293, 287029, 376305, 115595, 24374, 138186, 262423, 116363, 213224, -63539, 41764, 27677, 339537, -82404, 146834, -30568, 103191, 35315, 178137, 340816, 260780, 227326, 128694, -113026, -148600, 207467, -77082, 112895, 75058, -104220, 337370, 312522, 258129, 170006, 427956, 248097, 534783, 236004, 141583, 70404, 193281]
15026A93281O3260K20695k22432o9541n7296L7973c734A97110a78519h7013j33286
15015b20299c4968D6525J23820J77644J58562A95767O966H8930N2306K05403A44580
15003E21508B6174L07399g0188A80114J0028I2087K25995o7298K16918C9245J60011
14992A99256K19696j0446H9217J6871L0184L4582M9439p9328m2719J30518J75107
14981D03871A37441k0582J19318J1026p3614M9954R1944j07063l0202J04538f2213
14969A2410L27777j66539Q4477K15412j73400Q6277J1556H1305b725A35339L8718
14958A74057F0878A5630M45241k19399J61714m2169j73585l4435K79350J9826
14948D52173j57038A42602K76761j77257Q498K1551C7622M70121k32249K2022
$$ y = [193281, 256541, 477236, 254804, 185263, 127967, 165940, -3734, 197110, -178519, -87013, -220299, -34968, 46525, 170345, 347989, 506551, 195767, 202733, 88930, 141236, 346639, 144580, 521508, 26174, 333573, -70188, 180114, 190142, 92087, 318082, 250784, 467702, 39245, 199256, 418952, 408506, 89217, 106088, 136272, 170854, 220293, 140965, 98246, 228764, 403871, 137441, 116859, 236177, 247203, 173589, 223543, 315487, 208424, 178222, 282760, -62213, 12410, 340187, 173648, 258125, 473537, 300137, 386414, 397970, 81305, -2725, 135339, 174057, 60878, 15630, 460871, 241472, 403186, 361017, 187432, 152997, 432347, 452173, 295135, 142602, 419363, 242106, 250604, 272155, 37622, 507743, 275494, 297516]
14938B97516j01558P274L64421j35633j45840m5071l3696F7582L75979J8284j3321
14927D48524a1744C85272g2694C9366L2954L50932r2018j03673B9936p429L60135
14916C82642j27449a11242C10398j06903M5811J90666K4594A80243K8633J87292
14906C96168j39804K39708G7385L47004j47156K71141j78635j83050J45646A42663
14895B97660M438j21332L6181O53K85105K6560A87162J29009L45410A90104J09848
14884B99952J97812B28175R6748A36785O2111k3277q1921K69096A58649P7779
14874B36428l7255K7844e4716C79431n0902J80917k3573q7210A16824J14576L26502
14863E57902B00707K87977A99780J67538n5483I1619K87266j74640J25605J08124
$$ y = [297516, 195958, 203232, 567653, 432020, 286180, 241109, 207413, 67582, 443561, 461845, 448524, -11744, 385272, -72694, 39366, 72320, 423252, 331234, 227561, 29936, 22507, 382642, 255193, -111242, 310398, 203495, 249306, 439972, 464566, 180243, 208876, 396168, 256364, 496072, 77385, 424389, 277233, 548374, 369739, 186689, 332335, 142663, 297660, 302098, 180766, 216947, 217600, 502705, 529265, 187162, 316171, 661581, 190104, 299952, 497764, 228175, 324923, 136785, 198896, 175619, 93698, 362794, 158649, 236428, 199173, 227017, -54716, 379431, 328529, 509446, 485873, 398663, 116824, 231400, 557902, 200707, 488684, 199780, 367318, 311835, 91619, 378885, 204245, 329850, 437974]
14853D37974j44486o4863K94836r5395O1907L9339B14706L45765J00424j46656
14843E14239p9578P4980j11362L6237j00803K76256o2137K00270j95576k61902
14833B90624J44865m3734K0865A11364O03274C25602R1900J15182j1744J65984
14823F86924k46934R5820O53k0964o6800Q0052A58963J00630J45584J85220M699
14812E95096B26821L38952J9966K41863l99569n8267L52957j87971j0009k37731
14802B87012J49565K7478n7509A55518M20136r5281K3841j88564J79152J24169
14792F18971q6384R0623k97300K39456k5474B66133N8861J04570J06963j26959
14782D09568K964M8160J6770J10854j52822J42272K68445j54398l15910K40933
$$ y = [437974, 293488, 228625, 523461, 428066, 489973, 529312, 214706, 560471, 660895, 514239, 434661, 509641, 398279, 434516, 333713, 609969, 547832, 748102, 552526, 290624, 435489, 391755, 412620, 111364, 714638, 325602, 417502, 532684, 520940, 686924, 439990, 535810, 536463, 515499, 448699, 528751, 158963, 259593, 405177, 590397, 595096, 226821, 565773, 585739, 827602, 428033, 369766, 722723, 534752, 524743, 287012, 436577, 464055, 406546, 155518, 575654, 480373, 504214, 315650, 494802, 618971, 532587, 623210, 325910, 565366, 539892, 266133, 324994, 429564, 536527, 409568, 412532, 460692, 477462, 588316, 435494, 577766, 846211, 691813, 375903, 616836]
14772F16836n0785J95480m9223E8896M43092B14649L92055L4330j05275j60150
14762C75609L97078j37168k9043L76951m02362k23379R5494K04268M82229C74787
14751E44231J66410k24433J27507L77476j69319C60532M09184N4492l12136K56484
14741G68556n5298k11252Q4147J22018k53668L69739k92926r384M14334j48450
14731G87816l14364k14814O18541l08441J50021l6257q553j92720J52431j39182
14721D94478J9042K07117J59684m22406K35769j73378L2763J20376l0214K16826
14711H60057j68926m1279m086J96573C33822M65997r5669K59477D25132K88340
14701G13472l7932K28760j21507j70180n2599J48151j40539J05749J08232J79889
$$ y = [616836, 566051, 761531, 712308, 58896, 501988, 214649, 606704, 641034, 535759, 375609, 772687, 635519, 606476, 983427, 581065, 357686, 453180, 657448, 1139677, 374787, 544231, 710641, 486208, 613715, 991191, 821872, 360532, 769716, 824208, 512072, 768556, 713258, 502006, 586153, 708171, 454503, 824242, 531316, 521932, 936266, 787816, 473452, 258638, 877179, 568738, 718759, 682502, 673949, 481229, 633660, 494478, 513520, 720637, 880321, 457915, 693684, 520306, 553069, 673445, 643231, 860057, 691131, 649852, 645766, 842339, 333822, 799819, 704150, 963627, 425132, 713472, 675540, 904300, 782793, 612613, 560014, 708165, 567626, 673375, 781607, 961496]
14691I61496j75146K21047l61853L3331N39163m85219k26262K89293N7615R6929
14681I50394m2180Q0094j36933J58916j82099j7437k98299L65199j44105M33063
14671A166613l84682K85501l65120J75016R6568q037J91377k23667j00587O5096
14661H98078L27896l57756K87319l81614L25138k48416J30133k278r2670K14846
14651A100676J25693J06280l05903p5238j4689N1789R0246J25461q6722n8604
14641A058989M00347n70958K46006p2182L31272m68827J56158L2789R6720m45008
14631G65306N33519k70996J29681K20115j92826J80001j75424k26178L82994j62803
14621A183389o909J17962j39656L82324Q7318k95068k23012L95181p5565l05676
$$ y = [961496, 786350, 1007397, 645544, 678875, 1218038, 732819, 506557, 795850, 853465, 950394, 908214, 988308, 851375, 1010291, 828192, 810755, 512456, 877655, 733550, 1166613, 781931, 1067432, 702312, 877328, 973896, 965859, 1157236, 933569, 832982, 898078, 1225974, 868218, 1155537, 773923, 1099061, 850645, 980778, 978500, 885830, 1100676, 1226369, 1332649, 1026746, 951508, 936819, 988608, 1078854, 1204315, 1117593, 1058989, 1459336, 888378, 1134384, 1062202, 1393474, 924647, 1080805, 1113594, 1210314, 765306, 1298825, 1027829, 1157510, 1377625, 1184799, 1364800, 1189376, 963198, 1346192, 1183389, 1176480, 1294442, 1154786, 1537110, 1624428, 1329360, 1106348, 1501529, 1425964, 1120288]
14611A120288K09418J21511j78293N6316J4342k5734J81131m2027k19109N12956
14601A750799j69824q907p4600J3852L5462k88758M17687k75869J11425j2500
14591A498767j90009k0990R3952K03437N2046p7080j59786M40200m05850O7451
14581A502138Q6310J45099p6032J11170j79901Q4458K06987J7542j25906j7991
14571A753874Q5514O9409P8158J02907j24295L0422j49964K07653l4068K3935
14561B043545q248o9371O02290n34144K93729M2312j48441l03765L28447L55411
14551B601765j37592J15745r3446M2343J45509N12435k69112m6042j51352M99880
14541C220133L38931L51954R942O92380M86306J163966J795386K224624L353899
$$ y = [1120288, 1329706, 1451217, 1272924, 1329240, 1343582, 1317848, 1498979, 1456952, 1237843, 1750799, 1580975, 1572068, 1497468, 1511320, 1546782, 1258024, 1675711, 1399842, 1511267, 1498767, 1308758, 1287768, 1381720, 1585157, 1637203, 1560123, 1400337, 1840537, 1434687, 1502138, 1588448, 1733547, 1657515, 1768685, 1588784, 1673242, 1880229, 1897771, 1771865, 1753874, 1839388, 1908797, 1986955, 2089862, 1965567, 1995989, 1846025, 2053678, 2019610, 2043545, 2035297, 1965926, 2568216, 2034072, 2327801, 2370113, 2221672, 1917907, 2246354, 2601765, 2464173, 2579918, 2486472, 2528815, 2674324, 3186759, 2917647, 2871605, 2720253, 3220133, 3559064, 3911018, 3920960, 4613340, 5099646, 6263612, 8058998, 10283622, 13637521]
14532A3637521O715358J1010200r30521j1251213q133151m264251k054085q80214
14524C849644m66523k07990n58487n06475M96640k56942L8520l74984K94154K29025
14514B536582l42970L39914o1607J035j77783J31657J18278k49099O1073J43280
14504B500360o1384K31410K26066k85990K93772k67324j06499K45467R2894l27930
14494B540842o3079Q7251L78453p2002K75531K2047n5921O59J6446J50868k10355
14483C070740j22629J01473J55199J24335R8581q7149N2345J79937J54992j57089
14473C570735K7642k54988M96211n08485L60611j99821L23260o0207J24608j60226
14463C719340N6541M56461l67111J41106K22573K19715k50952o2793m1083K28154
$$ y = [13637521, 20352879, 31363079, 30432558, 19181345, 11048194, 6783943, 4729858, 3849644, 3383121, 3175131, 2616644, 2110169, 2606809, 2349867, 2388387, 2013403, 2307557, 2536582, 2193612, 2533526, 2471919, 2472954, 2295171, 2426828, 2545106, 2296007, 2357080, 2500360, 2438976, 2670386, 2896452, 2610462, 2904234, 2636910, 2530411, 2775878, 2868772, 2540842, 2477763, 2565014, 2943467, 2871465, 3146996, 3169043, 3113122, 3113781, 3130227, 3281095, 3070740, 2948111, 3049584, 3204783, 3329118, 3427699, 3340550, 3392895, 3572832, 3727824, 3570735, 3598377, 3343389, 3839600, 3331115, 3691726, 3491905, 3815165, 3754958, 3879566, 3719340, 3775881, 4232342, 3865231, 4006337, 4228910, 4448625, 4197673, 4134880, 4093797, 4321951]
14453D321951j58911J06132K27343P2304j59590N63313m37964L05293j76038m5096
14443D618737J75888Q3540K1353J69620J00060P5542J92745Q5853k32070L49391
14433E640659Q638K42813j79217M27327m62473N4872L27806k06606K98242K33804
14423F385865j02626J89785o3357L18769j48340O5760J23669M58753k58385K58966
14413G228859k09107J72035L56402O5132k78125N12020j54040K34243o3200M63476
14403H327695l57312L28338L8831L0029Q9647O17205K95596m50309P9497M77924
14393I477141J48369L81501j23082K24880J25783K15258J81141J18085L1762N34032
14383A1314870j9051O1379P3814L46624j60617P13621K38570L85153j8091J15253
$$ y = [4321951, 4163040, 4269172, 4496515, 4568819, 4409229, 4972542, 4534578, 4839871, 4663833, 4618737, 4794625, 4878165, 4899518, 5069138, 5169198, 5244740, 5437485, 5523338, 5291268, 5640659, 5649297, 5892110, 5712893, 6140220, 5677747, 5732619, 6060425, 5853819, 6152061, 6385865, 6283239, 6473024, 6409667, 6728436, 6580096, 6645856, 6769525, 7228278, 6969893, 7228859, 7019752, 7191787, 7548189, 7613321, 7335196, 7847216, 7693176, 7927419, 7864219, 8327695, 7970383, 8298721, 8337552, 8367581, 8457228, 9074433, 9370029, 8919720, 8999217, 9477141, 9625510, 10007011, 9883929, 10108809, 10234592, 10449850, 10630991, 10749076, 10780838, 11314870, 11295819, 11357198, 11431012, 11777636, 11617019, 12330640, 12569210, 12954363, 12936272, 13051525]
14373A3051525K99600O0955K19451O23513J41865j1400K91935L33749K33533J69650
14363A5414376M18956M22338j29622N47364K99210N90614J63993N59519J62270
14354A8449018L58266O87938J83698K66268M42368R75910J81126K54141P51862
14345B2550595L02292P01702N55579M23253N15002P27974K83048R45939P70458
14336B7775842N02772O11519P93864O93626P32294J043735P56000Q68795O14807
14327C4393254J399837Q49375R35174J200850J099685J336330R04413J347626
14319D3466544J257882J408564J543408J297606J659516J643054J905536K031052
14311E6213162J771299J724509K050018J951605K385885K644720K151082K864107
$$ y = [13051525, 13351125, 13412080, 13631531, 14255044, 14396909, 14385509, 14677444, 15011193, 15244726, 15414376, 15833332, 16255670, 16126048, 16673412, 16972622, 17563236, 17727229, 18286748, 18449018, 18807284, 19495222, 19678920, 19945188, 20387556, 21363466, 21544592, 21798733, 22550595, 22852887, 23554589, 24110168, 24533421, 25048423, 25776397, 26059445, 27005384, 27775842, 28278614, 28890133, 29683997, 30377623, 31109917, 32153652, 32909652, 33778447, 34393254, 35793091, 36642466, 37577640, 38778490, 39878175, 41214505, 42118918, 43466544, 44724426, 46132990, 47676398, 48974004, 50633520, 52276574, 54182110, 56213162, 57984461, 59708970, 61758988, 63710593, 66096478, 68741198, 70892280, 73756387]
14303G3756387K782642K954268K644924L517420L256832L366537L719332L971464
14295I9969806M210548M451289M899121N057761M808806N681290N570631O196100
14287A40845352O481364P163544P069583Q421382P645418Q978656R016853J0140299
14279B05762451J0340500J0497938J1757153J1702096J2765894J3404588J3797688
14272B90028308J4060697J4474105J5088219J5118618J5151786J4723016J3921154
14265C92565903J2070325J0387887R304486Q256168P309187M698811K171887J067947
14257D47832601J159356R89871k11198n699065p292756q973114j0735747j2533746
14249D04536202j1711499j2051591j1153958j3303478j3879293j4076828j3896953
$$ y = [73756387, 76539029, 79493297, 82138221, 85655641, 88912473, 92279010, 95998342, 99969806, 104180354, 108631643, 113530764, 118588525, 123397331, 129078621, 134649252, 140845352, 147326716, 154490260, 161559843, 169981225, 177626643, 186605299, 195622152, 205762451, 216102951, 226600889, 238358042, 250060138, 262826032, 276230620, 290028308, 304089005, 318563110, 333651329, 348769947, 363921733, 378644749, 392565903, 404636228, 415024115, 424328601, 432584769, 439893956, 444592767, 446764654, 447832601, 448991957, 449981828, 449770630, 444071565, 436778809, 427805695, 417069948, 404536202, 392824703, 380773112, 369619154, 356315676, 342436383, 328359555, 314462602]
14242C14462602j4164503j3967521j3560826j2963678j2770596j2492021j2000627
14235B22542830j0444423j0281396r537484r761449q887301q026227p682544p441525
14227A50480481p060169o574988o043224n976493n122422n442815n049184m690081
14219A04521105m279738m200530l953848l294591l493250l540467l092654l486453
14211G5179574k141687l015991k464587k613104k473453j904675k138141j723414
14203E6704522k348452j273865j815649j813386j127461j394107j392260j748223
14195D3791119j335047j090812o67148j201312j070076j301821j169817j139230
14187C4815856o11016q79233n81533q29835r32424r17939o44032o65285j012875
$$ y = [314462602, 300298099, 286330578, 272769752, 259806074, 247035478, 234543457, 222542830, 212098407, 201817011, 192279527, 182518078, 173630777, 165604550, 157922006, 150480481, 143420312, 136845324, 130802100, 124825607, 119703185, 114260370, 109211186, 104521105, 100241367, 96040837, 92086989, 88792398, 85299148, 81758681, 78666027, 75179574, 73037887, 70021896, 67557309, 64944205, 62470752, 60566077, 58427936, 56704522, 54356070, 53082205, 51266556, 49453170, 48325709, 46931602, 45539342, 43791119, 42456072, 41365260, 40698112, 39496800, 38426724, 37124903, 35955086, 34815856, 34204840, 33325607, 32744074, 31914239, 30981815, 30063876, 29419844, 28754559, 27741684]
14178B7741684n61291n48763o16067n39781r22051n49082m03271l15990r41403
14169B2343985m28806l64720l93970n42165l87350n79381m67821l21429J05663
14160A8964006m16608o39088m80871k97551m3081l77356l25026n35782J21358
14151A5970001q96465K6704l3726o35136j35769m89485k69920q489r8938k51599
14141A3177178l91007m47540K23133P4967q15387M1303k62032k52825l16161k8209
14131A1003420R8059n83040N4022l53233o1508k0825j09005k53300k7697j9353
14121I727540n76558J49359k21354K65782n15192k92640j8256m0774k56407M08893
14111H630393m52598K53105n67288K93454m48321q6427j50536k20428J87922k41935
$$ y = [27741684, 27180393, 26631630, 26015563, 25475782, 24553731, 24004649, 23601378, 23285388, 22343985, 21915179, 21550459, 21156489, 20614324, 20226974, 19647593, 19179772, 18858343, 18964006, 18547398, 17908310, 17427439, 17129888, 17086807, 16709451, 16384425, 15848643, 15970001, 15073536, 15100240, 15066514, 14431378, 14295609, 13806124, 13536204, 13527715, 13428777, 13177178, 12786171, 12338631, 12561764, 12636731, 11821344, 11862647, 11600615, 11347790, 11031629, 11003420, 11101479, 10518439, 10572461, 10219228, 10157720, 10136895, 10027890, 9774590, 9746893, 9727540, 9150982, 9300341, 9078987, 9344769, 8829577, 8536937, 8518681, 8477907, 8221500, 8630393, 8177795, 8430900, 7863612, 8157066, 7708745, 7622318, 7471782, 7251354, 7439276, 7197341]
14101G197341J26656r7059K23885n01821M3076P9519j8342l31616k52419M6262
14091F515482l1601l46318J55817k65385K67800N2386n89683k12244J48742k16836
14081E478160L33423l22313J60779n8861l00393Q1431j3681L9043k17138L4626
14071E215076o2187k90606k6756Q1351j53633P8508q2478k25195L7742J0122J18551
14060D700495k94980J1825k57148J19136L22009k84094r52l24458j85769O17948
14050D424012l04462K297m50534M62600J1036m02118j75949P05449n78795J61611
14040C855147q6880l30076L40647m71292N32403k75292j41624O8479J202m27955
14030C064759M39713k81582P1878K16920n33344M45506m57145k62617L90261j09660
$$ y = [7197341, 7323997, 7226938, 7450823, 6949002, 6992078, 7071597, 7053255, 6721639, 6469220, 6515482, 6483881, 6137563, 6293380, 6027995, 6295795, 6348181, 5758498, 5546254, 5694996, 5478160, 5811583, 5489270, 5650049, 5591188, 5290795, 5372226, 5358545, 5397588, 5180450, 5215076, 5152889, 4862283, 4835527, 4916878, 4763245, 4841753, 4759275, 4534080, 4571822, 4581944, 4700495, 4405515, 4417340, 4160192, 4279328, 4601337, 4317243, 4316291, 3991833, 3806064, 4424012, 4119550, 4121847, 3671313, 4133913, 4144949, 3742831, 3566882, 4272331, 3693536, 3855147, 3768267, 3438191, 3778838, 3307546, 3839949, 3564657, 3423033, 3491512, 3492714, 3064759, 3504472, 3222890, 3294768, 3511688, 2978344, 3423850, 2966705, 2704088, 3094349, 2984689]
14020B984689J58294k83026M47653j51537k9757j63356j50377J7691l8592j422
14010B790260l299o17725M64939P0436J36993m36491l8909M83167j98292j18640
14000B532439L2133k64425K74193j96325M3803o2867p0863p3368L2877n923J54568
13989B396242j54468R1469m50073O18367N75k49676J95921K27441j21746o8590
13979B485462L53541Q357N90072K32891J539891J593816K962840N171429J1719194
13970B6657493M341529j0435054p610346l686137k143611j337393n92103o16994
13962D577384o15684m29228n725n03078k22510J9500k37417J05842J2244k83230
13952B418098m998J2961k11623j31630N3792J67903k12104J23133l72490K29787
$$ y = [2984689, 3142983, 2859957, 3307610, 3156073, 3126316, 2962960, 2812583, 2830274, 2791682, 2790260, 2786961, 2169236, 2634175, 2704611, 2841604, 2405113, 2366204, 2849371, 2651079, 2532439, 2564572, 2300147, 2574340, 2378015, 2421818, 2358951, 2288088, 2214720, 2247597, 2241674, 2396242, 2241774, 2333243, 1883170, 2501537, 2502112, 2252436, 2448357, 2675798, 2554052, 2485462, 2839003, 2847360, 3437432, 3670323, 5210214, 6804030, 9766870, 14938299, 26657493, 30999022, 20563968, 12953622, 9267485, 7123874, 5786481, 5194378, 4577384, 3961700, 3532472, 3526747, 3023669, 2801159, 2820659, 2583242, 2689084, 2701328, 2418098, 2413100, 2426061, 2214438, 2082808, 2136600, 2304503, 2092399, 2215532, 1843042, 2072829]
13942B072829J0869k83019J13992Q0897n2829L30446L7222n74249J19232K24925
13932B080315m30064L98331k94322j46067J19361j07162O31396n19162K07764
13923A940390n70478K10304j15643j08073J96495J93037n780j70101O7708j55041
13913A482818M5982L19361r2441l04841J26296k65281J67524K10517l78138J20970
13903A432767M6274R887j27705K5475K1311n2726L30271j21765Q3954k30630l30735
13892A086378L02040L23792n71514L318N76988k56317Q9122r9584j01769P3108
13882A425562k71092R4200j74830L79063J04152J8278l24837m406J2209Q1396
13872A339695k9484n888J89664k76515r5562K20319q3835k47127P9757J2930R9594
$$ y = [2072829, 2083698, 1800679, 1914671, 1995568, 1942739, 2273185, 2310407, 1736158, 1855390, 2080315, 1650251, 2048582, 1754260, 1608193, 1727554, 1620392, 2251788, 1732626, 1940390, 1369912, 1580216, 1464573, 1356500, 1552995, 1746032, 1740252, 1570151, 1637859, 1482818, 1528800, 1848161, 1755720, 1450879, 1577175, 1311894, 1479418, 1689935, 1311797, 1432767, 1479041, 1488928, 1361223, 1386698, 1408009, 1355283, 1685554, 1563789, 1647743, 1417113, 1086378, 1388418, 1712210, 1140696, 1144014, 1721002, 1464685, 1553807, 1454223, 1352454, 1425562, 1154470, 1248670, 1073840, 1452903, 1557055, 1575333, 1250496, 1246090, 1258299, 1339695, 1310211, 1304323, 1493987, 1217472, 1121910, 1342229, 1258394, 1011267, 1091024, 1103954, 1203548]
13861A203548J39338l71438J44219J70748J03526k28880m7345r686p6536j2720
13851A014774M08363j65610O049J14049l01898M1141J99402l43250J04010J02544
13841A179574j29976J93856l79215m4523K88432k80382J75950l4232K50733r5114
13831A125103j30037j52353J27618J71389j41891l11922L84546M392q818k9597
13821A038430j52801M608L44342m09834K1413J58509R2012m71104K38233J20796
13811I84604O5333j24162L54539j39521m05100N725J26890j93818k68662P74785
13801A180613m11593O8775l5058J32826L27261j06459l80027J11155j36047K57218
13791A008664l8806k49163k39289J85540L27050j73265M6171O7189k6725j11237
$$ y = [1203548, 1342886, 971448, 1115667, 1286415, 1389941, 1161061, 1113716, 1104030, 1027494, 1014774, 1423137, 1257527, 1263576, 1377625, 1075727, 1116868, 1316270, 973020, 1077030, 1179574, 1049598, 1243454, 864239, 819716, 1108148, 827766, 1003716, 969484, 1220217, 1125103, 995066, 842713, 970331, 1141720, 999829, 687907, 1072453, 1076845, 1068027, 1038430, 885629, 890237, 1234579, 824745, 846158, 1004667, 1096679, 625575, 863808, 984604, 1049937, 925775, 1280314, 1140793, 735693, 741418, 868308, 674490, 405828, 1180613, 769020, 837795, 802737, 935563, 1262824, 1156365, 776338, 887493, 751446, 1008664, 969858, 720695, 481406, 666946, 993996, 820731, 866902, 934091, 907366, 796129]
13781G96129o0627m058J75521O6640j13278J71073j95843J34625N9544k37967
13771G91759n3694j70084J7679J08467k6488R174R0363N0222R4462k25557l09302
13760C77001M04984r2111Q7038L07967k78322J07636j5882K3334k79890r0518
13750E51237J55821m2498j38642M3149j191N29702D00284R0399K09837k7691n6422
13739F16407j52304L57804r0249l8958k03994K13801M3088q9996L7550J01818
13729G94967J09017j73678k46259m4306K20648K3661M36673k93003j77774r5100
13719E54846J05985J7346N8670j35832J61843k22884B69612L54336P236J74635
13709H05819r475j95128j03821B46963K63483n0755J05206K63081l61822k0343
$$ y = [796129, 735502, 731444, 906965, 973605, 860327, 1031400, 835557, 970182, 1029726, 791759, 738065, 567981, 585660, 694127, 667639, 676813, 767176, 817398, 911860, 686303, 377001, 781985, 689874, 776912, 1084879, 806557, 914193, 898311, 921645, 641755, 551237, 707058, 664560, 525918, 569067, 567876, 1097578, 400284, 490683, 700520, 672829, 616407, 464103, 821907, 731658, 692700, 488706, 702507, 745595, 655599, 693149, 794967, 903984, 730306, 484047, 439741, 660389, 684050, 1120723, 827720, 649946, 554846, 660831, 678177, 736847, 601015, 762858, 539974, 269612, 623948, 631184, 805819, 796344, 601216, 497395, 246963, 510446, 459691, 564897, 827978, 466156, 445813]
13699D45813M7382O7000q5490j68244R0307L97430C54396M46967C77227J37507
13689E14734q6305L52738j05621A89762l6364K80489j88793L13859q7693J06005
13679E77265N5263l15190J20753m2899R0445O3955j1640J02134k37107j15610
13669B87369J78550j30667J37502j93292M83872l22501j58802M35247B8568M43880
13659D72448j42430J97252j32486j28797K31495K36090F0193N19735K00716k12100
13649E68544j98571R4971o1605O3993m945A72878J11265L61158k04660A52551
13638D28918j0248o3849Q6767j81989n392L92752i2674C49462K3635K34669C00458
13626C72990J28307k49075J2594J06677L13792B32855J31587j0470m0545j27455
$$ y = [445813, 493195, 560195, 474705, 306461, 396768, 794198, 354396, 801363, 377227, 514734, 428429, 781167, 675546, 189762, 153398, 433887, 245094, 558953, 471260, 577265, 632528, 317338, 438091, 395192, 485637, 549592, 537952, 640086, 402979, 287369, 465919, 335252, 472754, 279462, 763334, 440833, 282031, 717278, 28568, 472448, 330018, 527270, 394784, 265987, 497482, 733572, 60193, 579928, 780644, 568544, 369973, 464944, 403339, 467332, 462387, 172878, 284143, 645301, 440641, 152551, 428918, 418670, 354821, 441588, 259599, 254207, 646959, -92674, 349462, 373097, 607766, 300458, 372990, 501297, 252222, 264816, 371493, 685285, 232855, 364442, 353972, 313427, 185972]
13616A85972M62859k84619K30162k01816k1409J16737j23899f659D54629k9011
13606D25618j74116J89939l3359j36341J9331J06086j70820B5178L24650J14665
13596D64493G1986J49199j7543M04106k17153l3565I4968N17306A37802J48840
13586B86642M32666k50354A92262J97209A30526L41225B24431J93976j38Q1228
13576D99497A83017L85941B52955J91065K18717k08176j85723K88911j91823j49038
13566B16888L38718B32521J54733K36421j26662j32362j16586B7245K56071A36329
13555B06901O01986A72875J69310A67612C8030M73160j35662A82452L144N80419
13545G66015k22053m1949r3875J31768r8615J40121j91585m3758r9000Q0742R9814
$$ y = [185972, 648831, 364212, 594374, 392558, 371149, 487886, 363987, -6659, 454629, 425618, 251502, 441441, 408082, 271741, 291072, 397158, 226338, 25178, 349828, 464493, 71986, 221185, 203642, 607748, 390595, 357030, 94968, 612274, 137802, 286642, 719308, 468954, 192262, 389471, 130526, 471751, 224431, 418407, 418269, 499497, 183017, 568958, 252955, 444020, 662737, 454561, 268838, 557749, 365926, 216888, 555606, 232521, 387254, 623675, 497013, 364651, 248065, 27245, 283316, 136329, 206901, 808887, 172875, 342185, 167612, 38030, 511190, 375528, 182452, 185596, 766015, 543962, 502013, 408138, 539906, 441291, 581412, 389827, 346069, 247069, 327811, 427625]
13534D27625J21583J50890l06390r8589L31635B67281k9316Q1253K2780j15698
13524B26300L855K3345O7181J26013k13810K8385J47942P0210o3062j35336J56843
13513D37866l5061q1165N8828j24655P7274j17365K97216A97696j3474q7077a4055
13501A98025L64135A81287M44757H8642J40286O6065l7606E3957L8775J83838
13491B76570A10107L74103p3320E0498f4180Q865A07765J73811A34681L334J68507
13480C06522M9350M7262n1175J06313A79110A6553N2449e7766C93359j65637J03261
13469C30983A35077e261D90555L19680I6750K12280p5600e9078E5796K21539a45981
13457D80646B27500J61379A9869J24465N4410J34808J6857A64920o3055l012L34497
$$ y = [427625, 549208, 700098, 393708, 295119, 626754, 267281, 237965, 319218, 341998, 226300, 230155, 253500, 320681, 446694, 232884, 261269, 409211, 479421, 416359, 281023, 437866, 402805, 321640, 380468, 255813, 333087, 215722, 512938, 197696, 184222, 97145, -14055, 198025, 562160, 181287, 626044, 88642, 228928, 294993, 257387, 53957, 92732, 276570, 110107, 484210, 410890, 50498, -64180, -55315, 107765, 281576, 134681, 138015, 306522, 355872, 403134, 351959, 458272, 179110, 16553, 69002, -57766, 393359, 227722, 330983, 135077, -5261, 490555, 810235, 96750, 309030, 233430, -59078, 55796, 277335, -145981, 480646, 227500, 388879, 19869, 144334, 198744, 333552, 350409, 164920, 101865, 98853, 433350]
13446D33350N1906l4723a66500B65881K49942k32705J07331D0544M2778c5605
13435A10765l0805M4677J6262N8042L9428L2633C6277K80696A40426J084M14178
13424E55688O4426D1784i656H4869R4267j4687F0891J15973O3663P8216H0674
13412A19093J4954J71747d617E66522A62705p8485b1421j37352A75671O6332j10012
13401A31991J64939K4615K66000A11476J83807K03931a6214D24823A58313J35687
13391B94000J30527R6711j23575E475O3817K20576K64600B11545b53467B11177
13380a42795I4044K49242l493b89650D19692J63876k08950j44145j0463R6218
13370C16228n8279k2232b0376B12001B4319i0852A87367a16103A77189K00310
$$ y = [433350, 485256, 450533, -166500, 265881, 515823, 283118, 390449, 40544, 83322, -35605, 110765, 79960, 124637, 140899, 198941, 238369, 271002, 36277, 316973, 140426, 141510, 555688, 620114, 41784, -9656, 84869, 179136, 164449, 60891, 176864, 240527, 318743, 80674, 119093, 134047, 305794, -4617, 566522, 162705, 84220, -21421, -158773, 175671, 242003, 131991, 296930, 321545, 587545, 111476, 295283, 499214, -16214, 424823, 158313, 294000, 424527, 521238, 397663, 5475, 69292, 289868, 554468, 211545, -253467, 211177, -142795, 94044, 343286, 339793, -289650, 419692, 583568, 374618, 230473, 220010, 316228, 257949, 235717, -20376, 212001, 24319, -90852, 187367, -116103, 177189, 377499]
13360C77499a09660C14342a31413A27620b12676C6755M21888o8537r1989O0075
13350C58192J75662j75342A20398R7822B1290K27723E8129M9306J40599J07520
13340C55554j19344O7610a53836A69338J11104n3911q5810o9270K41423L6301
13330C49175j02749B4168K58203A01762L37623j01284J64164A96245K09045p9551
13320C25739P2714L7947j62456R1919Q4374A36328l247J61791l6194K67179k41489
13309B84368E7329i7161B83637A8502J76284L5654j15213J93117Q7143j45795
13299B49692F5071J49908c54533C14284A42334B4850a32178A52779K31209A02464
13288I8960E737d5174A22047K20210j28895O6043a68788h502n2537C25980A43050
$$ y = [377499, -109660, 314342, -131413, 127620, -212676, 36755, 458643, 390106, 298117, 358192, 533854, 358512, 120398, 218220, 21290, 249013, 58129, 107435, 248034, 355554, 236210, 303820, -153836, 169338, 280442, 226531, 140721, 71451, 312874, 349175, 246426, 24168, 282371, 101762, 439385, 338101, 502265, 196245, 405290, 325739, 398453, 436400, 273944, 365863, 450237, 136328, 133081, 294872, 258678, 525857, 284368, 57329, -97161, 283637, 18502, 194786, 230440, 115227, 308344, 395487, 249692, 65071, 214979, -354533, 314284, 142334, 24850, -132178, 152779, 383988, 102464, 98960, 5737, -45174, 122047, 342257, 213362, 279405, -168788, -8502, -61039, 325980, 143050]
13276a22670C60013A50553a9495j47526A43488a25020B7520L1801f8984A25833
13265C30498o7554B3596b06553A99477R5690H0790K73242K737j56898G5820J31601
13254B07421K15621a78561A21229K10180A50587L5809g2542B23527g3946A81584
13243C75423A49218F9162Q749a9661D14800j87572p8144l8392e3462F4757d0080
13231B08183o4679C2315a38019C5998a44296A02586J53390J34627c8685a0993
13220C3818K4008K42833C7495a3398D08626A27966d2978B63278J42650H4818J41938
13209B26756a24397c6004A25331J06439J44180a03287B72485A9600a12294A0784
13198D9868J23884p8439K94427j85354f4637B61397g2878H4183l7922d5163B50502
$$ y = [-122670, 360013, 150553, -19495, -167021, 143488, -125020, 27520, 59321, -68984, 125833, 330498, 262944, 23596, -206553, 199477, 295167, 80790, 354032, 356769, 199871, 75820, 207421, 423042, -178561, 121229, 331409, 150587, 186396, -72542, 223527, -73946, 181584, 375423, 149218, 69162, 77911, -19661, 414800, 227228, 149084, 110692, -53462, 64757, -40080, 208183, 143504, 32315, -138019, 35998, -144296, 102586, 255976, 390603, -38685, -10993, 33818, 57826, 300659, 37495, -13398, 408626, 127966, -42978, 263278, 405928, 84818, 226756, -124397, -36004, 125331, 231770, 375950, -103287, 272485, 19600, -112294, 10784, 49868, 173752, 95313, 389740, 204386, -64637, 261397, -72878, 84183, 46261, -45163, 250502]
13186A90544K57549j94222R413A13307m5183B1151c75715F634R4446D5963J08987
13175A54950K10980A80820O8136J6706i147o8287A89105J7878O1507p1586l3192
13164A63712k5006O0969a79074G5663a11950B10470f5805C13665F148R4160q144
13153I2164P4002f7340j05552B35748c3506B06650E0332k2669L0889J3350a6425
13141c72697K4150A75669j3875j1809L41329A39241J40659c83102f7556m8970
13131a16526A5660b75554A18244P4147H1754N9651P5339m1101a12952q9280d0295
13119B74183a03758M7343A84015c1148E15944A00989M4971m6202e0400A76003
13108B10295H9942k4326L4649n531A3254K71114a12190G3344a15919H1843j9457
$$ y = [190544, 448093, 253871, 263284, 113307, 68124, 21151, -375715, 6634, 101080, 45963, 154950, 365930, 180820, 248956, 265662, -9147, -77434, 189105, 206983, 268490, 196904, 163712, 138706, 199675, -179074, 75663, -111950, 210470, -65805, 313665, 6148, 100308, 92164, 166166, -67340, -172892, 235748, -33506, 206650, 50332, 27663, 58552, 71902, -16425, -372697, -348547, 175669, 161794, 149985, 491314, 139241, 279900, -383102, -67556, -116526, 15660, -275554, 118244, 192391, 81754, 141405, 216744, 175643, -112952, -202232, -40295, 274183, -103758, -56415, 184015, -31148, 515944, 100989, 145960, 99758, -50400, 176003, 210295, 89942, 65616, 100265, 94734, 13254, 284368, -112190, 73344, -115919, 81843, 62386]
13097F2386J84460A14297N6436F5252J63569i0696A15523l6924K8712f4104A1228
13085E5429K02669M7904A09948J1039P3338a21291A59687K84532N220B2248c46237
13073B23141b0760B46750b54751G1038O7516E3297M7273B1652M84621A21939A6289
13061D05736i1091B90498b33093A85334k3528J26378j24197B2601L664a52648
13050I3423l7558J17554i9981B16622n0220h6972C37249e1720j54307C9631L05769
13039C45400e9072j58722B40609p5526E3706P9996L30754B05797L2096i0455A1616
13027B64561J37700b5263C30912A46758N0932B5019g5895A45493J14187d2325
13016a49913j787C7436J01327m9247d0434j16175B37683f850k31133F10550A1812
$$ y = [62386, 246846, 114297, 170733, 65252, 228821, -90696, 115523, 78599, 107311, -64104, 11228, 55429, 258098, 306002, 109948, 120987, 194325, -121291, 159687, 444219, 449439, 22248, -346237, 223141, -20760, 246750, -254751, 71038, 138554, 53297, 100570, 21652, 506273, 121939, 16289, 405736, -91091, 290498, -233093, 185334, 161806, 288184, 163987, 22601, 26265, -152648, 93423, 55865, 173419, -99981, 216622, 166402, -86972, 337249, -51720, -206027, 39631, 345400, -59072, -217794, 240609, 165083, 53706, 133702, 464456, 205797, 237893, -90455, 11616, 264561, 402261, -25263, 330912, 146758, 197690, 25019, -75895, 145493, 259680, -42325, -149913, -151700, 37436, 138763, 89516, -40434, -156609, 237683, -6850, -237983, 610550, 11812]
13004A88744i4357I7828K0400D1427K37443P8697c5420C29163a6116A80578l9124
12993A41454K02668A28871J77480A27138b21946h834C41526I753J8440b21307
12982a3874l9496B41656G2938d4414p303E47884g833M93C29787D6198R4798a49995
12969h5602M1692H5874M1117J26800M4516A30753N8290d2595F2271a22946B45153
12957B78380O5136b0336H7095a507o4227J987k23657B75978e6960B35146D3089
12945e3167p4104B94534g2252A52264K20823b1025G4063g7744j81380B58543i776
12933G3166h3885L6784l23056g7453A97769H3394f4396k12565A05689R331a77916
12921f8515C9475J73679d7367B73790r8954C9106b8767A51779f6538A74393k9053
$$ y = [188744, -94357, 97828, 118228, 41427, 278870, 357567, -35420, 329163, -16116, 180578, 141454, 344122, 128871, 306351, 127138, -221946, -8834, 341526, 9753, 28193, -221307, -13874, -53370, 241656, 72938, -44414, -51717, 547884, -7833, -7340, 329787, 46198, 140996, -149995, -85602, -43910, 85874, 126991, 253791, 298307, 130753, 189043, -42595, 62271, -122946, 245153, 278380, 343516, -20336, 87095, -1507, -65734, -63747, -287404, 275978, -56960, 235146, 43089, -53167, -127271, 294534, -72252, 152264, 373087, -21025, 74063, -77744, -259124, 258543, -9776, 73166, -83885, -47101, -370157, -77453, 197769, 83394, -64396, -276961, 105689, 115020, -177916, -68515, 39475, 213154, -47367, 273790, 174836, 39106, -28767, 151779, -66538, 174393, 145340]
12910A45340h9574D68318B02731M871R2489a09490C5832J58860k1288c42642B34619
12898B04188j6108F420e8663A17683J56690m3506m0177a8766m4224A28112h2386
12886B30303p6432c7155f006C35592b08476A69900a81058b2976j51584B8942a2658
12874D5234h2913A92450L6642f4319b2055A49906a05463c4081j80072j15787E45717
12862C29520a11708B66791E7078M9201g9701A81658o9459J43860o0772L9769G9813
12850B23448b03911B91890d60320J73884A75115a2644A64426p046N1918b5094
12839B99534G632h8721J2818J2572A17372a85015l9401J2635n902O2716e7077
12827C0790d0765m8343B57351h5900C37352E8993R1383b87648g232A26446O3235
$$ y = [145340, -89574, 468318, 202731, 207602, 300091, -109490, 35832, 194692, 173404, -342642, 234619, 204188, 188080, 6420, -58663, 117683, 274373, 230867, 190690, -18766, -62990, 128112, -82386, 230303, 153871, -37155, -6006, 335592, -208476, 169900, -181058, -22976, -174560, 28942, -12658, 45234, -82913, 192450, 229092, -64319, -22055, 149906, -105463, -34081, -214153, -329940, 545717, 329520, -111708, 266791, 57078, 106279, -79701, 181658, 112199, 256059, 195287, 235056, 79813, 223448, -203911, 291890, -460320, -286436, 175115, -12644, 164426, 157380, 209298, -25094, 299534, 7632, -88721, -75903, -63331, 117372, -185015, -224416, -211781, -217683, -154967, -57077, 30790, -40765, -89108, 257351, -85900, 337352, 58993, 150376, -287648, -7232, 126446, 189681]
12816A89681a04856E9687b07239h2261A32408a28387k79819J50109B73419e3245
12805a2383B72647d2284j44805A43176q33j1935a51399I1151a77475C07755d41443
12793G821f2883B09410g1144B14063H8702A062a75784E7734a18261c8043m34833
12782d72876A87331a37888B27570b95922J28031E76692B4082M3461a69719M9403
12772a20316B2224h5198J22C293J9035c7900A90600G4865l6454J23714k6198D1240
12759C8843g8834l5844L8280A17278e6627b1051A51169d9936r3371C92979a216
12747h2261F3311b34291j0297C39502l2135K6256a591j2127B4428J34532a35306
12735b4259m75372B6528f8039K4648O65I055a44844A86983H3810J45436A03703
$$ y = [189681, -104856, 59687, -207239, -82261, 132408, -128387, -408206, -258097, 273419, -53245, -12383, 272647, -42284, -187089, 143176, 142343, 130408, -151399, 91151, -177475, 307755, -441443, 7821, -62883, 209410, -71144, 214063, 88702, 1062, -175784, 57734, -118261, -38043, -472876, 187331, -137888, 227570, -295922, -167891, 576692, 24082, 67543, -169719, -120316, 22224, -85198, -85076, 3293, 22328, -37900, 190600, 74865, 38411, 162125, 135927, 41240, 38843, -78834, -114678, -76398, 117278, -56627, -21051, 151169, -49936, -143307, 392979, -1216, -82261, 63311, -234291, -244588, 339502, 307367, 333623, -1591, -13718, 24428, 158960, -135306, -24259, -499631, 26528, -68039, -43391, -42726, 9055, -144844, 186983, 83810, 229246, 103703]
12723a15195B6611J99650C5962M73979h9387C38868A03533i4470D5173K02807
12713B47980C557a33028j1314e157r8312H3345m418c34477B9518N5834a4100k14565
12701b28665A15320B9931K50283b93007A31052k6161c06176C62516A01067K002
12691A03069n0150c1253g864H3927J857l3276A915N8749J9256i9676C28907j3984
12679C14923j48034i476l075A39145F0360b8147H6426J54093D4842a24115B23300
12667I9287N0528g8110B03584N8236G6334L32023j89081C7028J1185K96405D8700
12655C1743g8789J8851D04718C8341e8451B10495h5543B2459P688K51242E6935
12643A11985K23693N1426h516B38373a32706B03080h4146D10505p1671a62985
$$ y = [-115195, 26611, 226261, 35962, 509941, -89387, 338868, 103533, -94470, 45173, 247980, 3557, -133028, -144342, -5157, -103469, 83345, 78927, -334477, 29518, 85352, -14100, -228665, 115320, 29931, 280214, -293007, 131052, 104891, -306176, 362516, 101067, 103069, 52919, -31253, -7864, 83927, 85784, 52508, 1915, 60664, 79920, -99676, 328907, 314923, 166889, -9476, -12551, 139145, 60360, -28147, 86426, 240519, 44842, -124115, 223300, 99287, 149815, -78110, 203584, 261820, 76334, 408357, 219276, 37028, 48213, 344618, 48700, 31743, -78789, -59938, 404718, 38341, -58451, 210495, -85543, 22459, 30147, 281389, 56935, 111985, 335678, 387104, -8516, 238373, -132706, 203080, -84146, 410505, 338834, -162985]
12632A18836m9781a96486A35322J70039A44259h4302j78779H8527a79144o7242
12622b46386B7003M1821a68174C906L17127A48652k0682A9100M31626A27360K33787
12611C61147A30756O8341i6459b4642H81K781a53380f4120p1827C22307B6808
12599A95952h0538L6403C2499b27222C23421I9114m2609a28016D8423L03256b40744
12587C97924A7209J6647e5354B26314q69P5963j34550m1524c42800A58022L0914
12576A88936n5316b58781C50664a65910K1208d0947A30171A9517a1455q3307J1300
12565h3462k7645M9156q0650H4158A3726J25463a04808A60913a6241A33281D2925
12553A97588a42847P0442I2231B3283K05743k8483p7775K41504A59767b38166
$$ y = [118836, 69055, -196486, 135322, 305361, 144259, -84302, -263081, 88527, -179144, -246386, 27003, 68824, -168174, 3906, 321033, 148652, 127970, 19100, 450726, 127360, 361147, 130756, 199097, -96459, -24642, 881, 3662, -153380, -64120, -135947, 322307, 26808, 195952, -80538, -44135, 32499, -227222, 323421, 99114, 56505, -128016, 48423, 351679, -240744, 397924, 17209, 33856, -55354, 226314, 225445, 301408, 166858, 125334, -342800, 158022, 188936, 133620, -258781, 350664, -165910, -144702, -40947, 130171, 19517, -11455, -94762, -83462, -111107, -61951, -142601, 84158, 13726, 139189, -104808, 160913, -16241, 133281, 42925, 197588, -142847, -72405, 92231, 23283, 229026, 200543, 122768, 364272, 159767, -238166]
12542B37599D8212h5440A59420b55264b4679C3566a99824A35496k3800a11017
12531a24618I2077b47599G2143A1914J3644m630e4655k9411E7535d0917H9746
12519b24018a8505j6874j06326A47347L1332N09005A13714O5151d8038l9694D1474
12507a37996c8897b948H0963R246a93357B84491g3727j05951M6604A8838J1145
12496B9983b75917A62247e7274I5804a23037N1279A90644d9110m5518j10976A46930
12484F2636K17374c5946I5655h2908L0580l1975j27K5993B61298a77152H6073
12472A91614c249m6960q6282A06637C4279a61508q7524J15719o9187l03876J95132
12461c11244A7828J29117b43835C68068b71655j52362A89786d15469a34353D10797
$$ y = [237599, 48212, -85440, 159420, -255264, -24679, 33566, -199824, 135496, 111696, -111017, -124618, 92077, -247599, 72143, 11914, 25558, 20928, -54655, -84066, 57535, -40917, 89746, -224018, -18505, -35379, -141705, 147347, 178679, 687684, 113714, 178865, -48038, -87732, 41474, -137996, -38897, -2948, 80963, 90209, -193357, 284491, -73727, -179678, -133074, 18838, 29983, -275917, 162247, -57274, 95804, -123037, -71758, 190644, -49110, -94628, -205604, 146930, 62636, 280010, -35946, 95655, -82908, -52328, -84303, -84430, -58437, 261298, -177152, 86073, 191614, -3249, -50209, -136491, 106637, 34279, -161508, -249032, -133313, -202500, -506376, -311244, 17828, 146945, -243835, 368068, -271655, -424017, 189786, -415469, -134353, 410797]
12450A18277E226K2745h1524p7187j59947c6532B77690r1611a61878A6488L64658
12439C81146a68525H5394d8794F4581i5793B61659a80734D9083a7751r3715H6648
12427A08986K89999j6301b2127J0680G7596L2162N878e598B4168Q4179a30295
12415G9256J02824C8095a18829k6385A78603d50261J31296J56598I8305m7446
12405E0859J34871f4036l9504J9600F8930b80428j11455D598J02658J08370k7846
12394A87780a35787D1378a95168A65600A0864a6573k3495q4031J543M740N1461
12383f6355k05775F4608a11881G0137a39155d6724n04202K48821K6909I6206a7468
12371a55942C20554a07238F3994a42835C4547J33930a60009A51107i6041A0181
$$ y = [118277, 5226, 27971, -81524, -158711, -318658, -36532, 277690, 186079, -161878, 16488, 381146, -168525, 85394, -48794, 64581, -95793, 261659, -180734, 49083, -17751, -111466, 86648, 108986, 398985, 382684, -22127, -11447, 77596, 109758, 115636, -5598, 24168, 108347, -130295, 79256, 182080, 38095, -118829, -145214, 178603, -450261, -318965, -162367, 98305, 50859, 185730, -64036, -103540, -83940, 68930, -280428, -391883, 4598, 107256, 215626, 187780, -135787, 41378, -195168, 165600, 10864, -16573, -40068, -124099, -122556, -117816, -66355, -272130, 64608, -111881, 70137, -139155, -46724, -550926, -302105, -275196, 96206, -17468, -155942, 320554, -107238, 63994, -142835, 34547, 168477, -160009, 151107, -96041, 10181]
12360B9976L4086g6960p3273F7397d64769R5927e7690C00325C4504a05600K5339
12349h0261A80119D6843L3033f2544B37375A16277n5820j7919J75651a19816m8618
12338a68434p8814g5394j0566j04675C16273b34504j41725A49878C6305L8324
12328G4629d1083I3076D2645a84181A63641P2335K4623F1648b3250B61930b02248
12316A17566K04866a9558k49607D4752b10607A98432q3775j7533i8135j6691A89770
12304B8595R0078a8763C09622a42841p3135B17659n2598A0769a47761B33247J24418
12293C57665D5344b06416d5456A71923d1784B1129K74343h9750E1964J17087a77411
12281F8140b14351b0428A03706a14722a4000b746B77439g9706A61160F3963j3288
$$ y = [29976, 64062, -76960, -150233, 67397, -464769, -368842, -57690, 300325, 34504, -105600, -80261, 180119, 46843, 79876, -62544, 237375, 116277, 60457, 42538, 218189, -119816, -168434, -247248, -75394, -85960, -190635, 316273, -234504, -376229, 149878, 36305, 74629, -41083, 93076, 42645, -184181, 163641, 235976, 260599, 61648, -23250, 261930, -202248, 117566, 322432, -19558, -269165, 44752, -210607, 198432, 114657, 97124, -98135, -114826, 189770, 28595, 118673, -18763, 309622, -142841, -215976, 217659, 165061, 10769, -147761, 233247, 357665, 45344, -206416, -45456, 171923, -41784, 21129, 295472, -89750, 51964, 169051, -177411, 68140, -214351, -20428, 103706, -114722, -14000, -2746, 277439, -79706, 161160, 63963, 50675]
12270E0675R0015k4424K4158J6027a04846B61402C0058P2673E1348P4872C7132
12258A59280B0228K40601j24391R5364a73712B31320D0527b2606j5391B4248e5528
12246B73763n0333c4625n3921A99160J2231m0253g4856A09718i2121B60560j18317
12235A42243M8134h7261o5687l6494A13580j1858L1661E7856j1921K27737D8722
12223d8934D7750a26084F8335L4320J15389g5140B10979a11961K8534A66055a58599
12211E6245O7445J19227r6250o4438f1680A49831k0146K00762A55888j1303F950
12199B13360b7642n8838D9093L09861B9827J75281J51387K19278B75675j30783
12189A44892J74909A0699J86753K05380g9898B32208p785i0237A96172J25767
$$ y = [50675, 140690, 116266, 140424, 156451, -104846, 261402, 30058, 102731, 51348, 126220, 37132, 159280, 20228, 260829, 136438, 231802, -173712, 231320, 40527, -22606, -37997, 24248, -55528, 273763, 223430, -34625, -88546, 199160, 211391, 171138, -74856, 109718, -92121, 260560, 142243, 190377, -87261, -152948, -189442, 113580, 101722, 133383, 57856, 45935, 273672, 48722, -48934, 47750, -126084, 68335, 102655, 218044, -75140, 210979, -111961, -83427, 166055, -158599, 56245, 123690, 242917, 146667, 82229, -61680, 149831, 129685, 330447, 155888, 144585, 6950, 213360, -27642, -86480, 49093, 358954, 29827, 205108, 356495, 575773, 275675, 144892, 319801, 10699, 197452, 402832, -79898, 232208, 224423, -90237, 196172, 321939]
12179C21939b58F7229R868j788P5225L01065A77935d4977A17165M00618F5867
12167B99390c1447A52364n5669i4779A29064F3457k3565d164B73301K7000c95798
12155A70200p714q455J08405o2460A4982a07076F0857J83598a69836P4275A74769
12143I5861K13712d48577B18694E6544J68054R12j12324j0788N7435J56969j47163
12132A69639m3770g7494C8736L09140j62167L57208F8214A7661J66161g6870A06310
12120A31735d3631a10j09958j08396C4919N4302j1061A330J84133a40934C44587
12108D2728b9495l24396J28288J7542m8438d9678l088n8753b844q0081k7298j48482
12096b58705d1233g029G8116R6423a0290I1759d72708D2223J2369P5777C913h1051
$$ y = [321939, -258, 67229, 77097, 75309, 150534, 451599, 177935, -44977, 117165, 517783, 65867, 299390, -31447, 152364, 96695, -94779, 129064, 63457, 39892, -4164, 273301, 300301, -395798, 170200, 162486, 154031, 262436, 199976, 14982, -107076, 60857, 244455, -169836, -95561, 174769, 95861, 309573, -448577, 218694, 56544, 224598, 225510, 113186, 102398, 159833, 316802, 169639, 125869, -77494, 38736, 347876, 185709, 542917, 68214, 17661, 183822, -76870, 106310, 131735, -43631, -110, -110068, -218464, 34919, 89221, 78160, 1330, 185463, -140934, 344587, 42728, -29495, -353891, -225603, -208061, -256499, -49678, -52766, -111519, -2844, -82925, -110223, -258705, -41233, -7029, 78116, 174539, -10290, 91759, -472708, 42223, 54592, 130369, 3913, -81051]
12083e5863k4498q0680b5051B2419N4291c44388A60182J5993p4306a51738g1617
12071B91933c18169J20630E986a83831D34536k11479K67596Q0035j94056O94810
12061A071442K69203E64860j23396I7979g539G105L0158J25032D9798c13763R6204
12050b17559A30509P0663a96748E7586K13814D7815a78951j52504i3193e373j32841
12039a38214A4351J94738q3814R96c45831f2283p1936A98722J62666e0425q397
12028e8822A33705f7932F9762M7375e0804j45135B01934Q9221F6264f1050n7275
12017a18325d3650C60386G1520R1060i6359L2044q1011j15372J00236C09039B0866
12005d11371b1474B3980J04310J03564B8990J24998d441I798a13908A58589f4969
$$ y = [-55863, -80361, -161041, -25051, 22419, 76710, -344388, 160182, 176175, 101869, -151738, -71617, 291933, -318169, -197539, 5986, -183831, 434536, 223057, 490653, 570688, 376632, 1071442, 1340645, 564860, 441464, 97979, -7539, 7105, 37263, 162295, 49798, -313763, -217559, 130509, 201172, -196748, 57586, 271400, 47815, -178951, -331455, -93193, -5373, -138214, 14351, 209089, 125275, 126271, -345831, -62283, -134219, 198722, 361388, -50425, -58822, 133705, -67932, 69762, 117137, -50804, -195939, 201934, 291155, 66264, -61050, -118325, -43650, 360386, 71520, 162580, -96359, -64315, -145326, -260698, -160462, 309039, 20866, -411371, -21474, 23980, 128290, 231854, 28990, 153988, -4441, 9798, -113908, 158589, -64969]
11993a17091B49554A2253a01953J9637A75169l4900F9558a36073B9225g503k19471
11982b26974C03301a18549B51670b69508f8228A01328J37513C0604f0807k3877
11972h4684C52213a22688A13576c6126r9608k0957c412A50156a06956A37819c63328
11960A30878E907d30011i6999B70145A11702C4537h8940B23294J68f5226Q657
11949e6569j94341J16348j88436A39869m4539d602j00241d3272D8210Q3448K4761
11938A56419D1018l43M6659g3137r491A52694b93352h1652J0191k23704D5379
11926a52776B0010L1792K1393c8427m8293B19990i4200K4311B50194d7261A62195
11914i2866A34227O077F9437O0998B5313b75634i245k39732B4898H204K28227
$$ y = [-117091, 249554, 12253, -101953, -82316, 175169, 140269, 69558, -136073, 29225, -7503, -226974, 303301, -118549, 251670, -269508, -68228, 101328, 238841, 30604, -60807, -84684, 352213, -122688, 113576, -36126, -135734, -156691, -3412, 150156, -106956, 137819, -363328, 130878, 5907, -430011, -96999, 270145, 111702, 34537, -88940, 223294, 223462, -65226, -56569, -250910, -134562, -322998, 139869, 95330, -4602, -104843, -43272, 48210, 131658, 156419, 41018, 40675, 87334, -73137, -82628, 152694, -293352, -81652, -71461, -295165, 45379, -152776, 20010, 51802, 73195, -38427, -86720, 219990, -94200, -69889, 250194, -47261, 162195, -92866, 134227, 140304, 69437, 130435, 25313, -275634, -9245, -248977, 24898, 8204, 236431]
11903B36431f9117A30092a09023b1425E6464c30400J11397q612g9958B89012a74199
11891A04858c02493C7085j174b04635r653r9595Q9326a4575j38393A35555h628
11879C29592G8504a79618B6228h9424n0369L6865A69371a89295F10439d2108k24734
11868b66842Q3394l8588F4931g517l81169D434J05789d54081i9671n2886A09437
11856A5379J40753b54419h4473G321f9816A96429B0892F097a74465r626k2702
11845b06793a8850I6618K3308J05500D6799a65966M5333k29421F6896J78055b06838
11833c26806a06892j7220B36930b26832h2768b0714j552j53693D1819e2444d609
11821A07438A6823b6468l4518D8594K9745a63828G4876a65671B4539f8057A7984
$$ y = [236431, -69117, 130092, -109023, -21425, 56464, -330400, -219003, -227615, -79958, 289012, -174199, 104858, -302493, 37085, 35911, -204635, -214288, -313883, -224557, -14575, -152968, 135555, -8628, 329592, 78504, -179618, 26228, -89424, -139793, -102928, 169371, -189295, 610439, -42108, -266842, -183448, -222036, 64931, -7517, -388686, 4434, 110223, -454081, -99671, -152557, 109437, 15379, 156132, -254419, -84473, 7321, -69816, 196429, 20892, 6097, -174465, -184091, -206793, -18850, 96618, 119926, 225426, 46799, -165966, -120633, -350054, 66896, 244951, -206838, -326806, -106892, -124112, 236930, -226832, -82768, -20714, -22266, -175959, 41819, -52444, -4609, 107438, 16823, -26468, -60986, 48594, 78339, -163828, 74876, -165671, 24539, -68057, 17984]
11809b84743B4058j1024f6438J1420j07681B42033a43196e0301E2422c822B41091
11797B8172C597b03241I8106L4018b15856J01809m0359b8908j18554A20465a26657
11785h6287A1931a0933j02623K9512A46204a18589C5916d16971G1891a70112A10709
11773A34600b41592N2451r798k5698g4216A0150a64077G4680e3422G6272c5515
11761f2482j16935A4861e080m4301l87460f8447A1423a3252j15213I5195b4900
11749c11012C67376i64n6722A9950b63605f5274n4888B83603p1432J42410J2378
11738C66959d0505n167j15225e3371j60623f9781B25906a604D0964b7124k55118
11727b82242R9262P8481r8857A72115K25535a29454K1011A05055B2224b02352
$$ y = [-284743, 24058, 13034, -66438, -55018, -162699, 242033, -143196, -50301, 52422, -3822, 241091, 28172, 3597, -203241, 98106, 132124, -215856, -114047, -154406, -28908, -147462, 120465, -126657, -86287, 11931, -10933, -113556, -84044, 146204, -118589, 35916, -416971, 71891, -170112, 110709, 134600, -241592, -189141, -198939, -224637, -74216, 10150, -164077, 74680, -53422, 76272, -35515, -62482, -179417, 14861, -5080, -49381, -436841, -68447, 11423, -13252, -128465, 95195, -24900, -311012, 367376, -964, -57686, 19950, -263605, -65274, -120162, 283603, 212171, 354581, 366959, -40505, -45672, -160897, -53371, -213994, -69781, 225906, -1604, 40964, -27124, -282242, -182980, -104499, -203356, 172115, 397650, -129454, -108443, 105055, 22224, -202352]
11716h5218D8716J23213c33120a34973m6229A58631a75950B24938L0845l970a40385
11704B81795b39014B26602n3578b09555J03138b8057m0440L2692l07887A26342
11693a8263A58931b6832J2760E869J6485a29976p4631B51281D5982b20118N8265
11682a61853G0352c79591g5407j9901m9077B47107e479j73302C0176b3199m1664
11671f4863C75799b16397D7771J3259c0144B4062K95058f9417l28506A04236M7610
11660A51846B7323a71385A83421q2635D2759J3744b16704J01438A15128J054h3857
11648A91209k412e833A31701D8607R1540M0724J8794b05821F4411J51938b50642
11636g1667j21099C26089C5443J27411Q9521b1184B1045g4465C7060i7912I3824
$$ y = [-85218, 48716, 171929, -333120, -134973, -181202, 158631, -175950, 224938, 255783, 251813, -140385, 281795, -239014, 226602, 173024, -209555, -106417, -28057, -68497, -35805, -343692, 126342, -18263, 158931, -26832, -14072, 5869, 22354, -129976, -204607, 251281, 45982, -220118, -161853, 70352, -379591, -75407, -95308, -144385, 247107, -5479, -178781, 30176, -23199, -64863, 375799, -216397, 47771, 61030, -30144, 24062, 319120, -69417, -397923, 104236, 151846, 27323, -171385, 183421, 100786, 42759, 56503, -216704, -115266, 115128, 116182, -83857, 191209, 188797, -5833, 131701, 48607, 140147, 180871, 199665, -205821, 64411, 216349, -250642, -71667, -192766, 326089, 35443, 162854, 252375, -21184, 21045, -74465, 37060, -97912, 93824]
11624b71477a10830d95k6293B32672I2207a0535C98760b64481A97603a74324K2658
11613a51666B365b12574k0993g2987A24974l5570a02593A42349h1223K7125C02382
11601D4085P3577m4661J19102d6744p5060B1340b59192J16694n9125h9990b4032
11589C61873F6407f1056A5101N72O3083e3606o1956j87121f6706A63645O7457
11578B31102j09226J3980b27270B4973a17800b1346A18367C8643a05940B15991
11567e193A16193N7102A0896K03987o3601N3569E1579j491O116k7492i1752A29254
11554B29697G5918Q6526i1582L0593j16557B32636a77709A46582B9153K09718
11544B38871L6519i1659A76662o0248a33450P586j43800A42276J20655A11656
$$ y = [-271477, -110830, -495, -26788, 232672, 92207, -10535, 398760, -264481, 197603, -174324, -151666, 2365, -212574, -233567, -72987, 124974, 89404, -102593, 142349, -81223, -54098, 302382, 44085, 117662, 73001, 192103, -46744, -121804, 21340, -259192, -142498, -201623, -89990, -24032, 361873, 66407, -61056, 15101, 15673, 78756, -53606, -115562, -302683, -66706, 163645, 231102, 121876, 135856, -227270, 24973, -117800, -21346, 118367, 38643, -105940, 215991, -5193, 116193, 173295, 10896, 214883, 151282, 204851, 51579, 50088, 56204, 28712, -91752, 129254, 229697, 75918, 162444, -91582, -60989, -177546, 232636, -177709, 146582, 29153, 238871, 275390, -91659, 176662, 116414, -133450, -125864, -269664, 142276, 262931, 111656]
11533B78271Q0351g8376B45459g5691G0485J9990a78845A88852a69675C19402
11522I3420b20118a0213G5101J21471l2892B8536J88420j01909m3296c99589c932
11510A49165a91010B72161d55728b8207p6430C51281e2510J7705j27458C5735
11499b26689D00159H4967K14343I9175k3111K09750E6654K09619j21644a03222
11488G8224O5999J61051l2571p5926j8120L9402J69019j31521K27018b28509e4161
11476A23890J19852R2725j53232m1357O2536L0807j09060R4771E2566L17412A09499
11464B48107g9720q6427m780G7536H646K09839E827K14466k3602j5777b1333C84967
11451B35709p3898E5884a22502D06130a79603C53459A55550b2501k27023M3762
$$ y = [278271, 358622, -78376, 245459, -75691, 70485, 90475, -178845, 188852, -169675, 319402, 93420, -220118, -10213, 75101, 196572, 163680, 28536, 216956, 115047, 71751, -399589, -3932, 149165, -191010, 272161, -455728, -28207, -104637, 351281, -52510, -34805, -162263, 35735, -226689, 400159, 84967, 299310, 99175, 76064, 285814, 56654, 266273, 144629, -103222, 78224, 144223, 305274, 272703, 196777, 178657, 218059, 387078, 255557, 482575, -228509, -54161, 123890, 243742, 336467, 183235, 141878, 204414, 235221, 126161, 220932, 52566, 369978, 109499, 248107, -79720, -166147, -170927, 77536, 8646, 218485, 5827, 220293, 196691, 180914, -21333, 384967, 235709, 161811, 55884, -122502, 406130, -179603, 353459, 155550, -22501, -249524, -205762]
11441b05762k5255l8568A42382J99421c1971B1266d2873j7925B59655p6679l6345
11430A46631F0248a18613f650j43718b0860B30782G2429B5150J11692J0226a62830
11418g026j15810K4817B88527f4129H8202d6320m5683k48457C460M5728b4953
11406A65372h6774a0385o0431B68420j22013k8597f9397B38252A09623a95984
11395a45603j99413A08447j2503J01375a37427L3560K6732f282q2713j87837A19114
11383A58665a23167A84194g5109D00657E8898g784j87427C86371A44392m0482
11373A03910C9888L9560K53202A02140k5491a96704L2778A14115K4765J06453
11363B45333d2511q2776D1648M9009N4513j6991f514p7240C61961j41796N9411
$$ y = [-205762, -231017, -269585, 142382, 341803, -31971, 21266, -42873, -60798, 259655, 182976, 146631, 60248, -118613, -6650, -150368, -20860, 230782, 72429, 25150, 136842, 147068, -162830, -7026, -122836, -98019, 288527, -64129, 88202, -46320, -92003, -340460, 3460, 49188, -24953, 165372, -86774, -10385, -70816, 268420, 146407, 117810, -69397, 238252, 109623, -195984, -145603, -345016, 108447, 95944, 197319, -137427, -103867, -77135, -6282, -88995, -276832, 119114, 158665, -123167, 184194, -75109, 400657, 58898, -7784, -195211, 386371, 144392, 103910, 39888, 79448, 332650, 102140, 76649, -196704, -163926, 114115, 138880, 245333, -42511, -125287, 41648, 90657, 145170, 128179, -6514, -83754, 361961, 220165, 279576]
11352B79576D8513K0648J31296c71247a61817o0051C10209b19732M9087o5966
11342b36611J11392F8012k8085L30915j61618A4959J00240c9650a6260H6243O7831
11331A54074a92391A16893b19488E9983R0441a58662r9935P939c2871A9392b40328
11319b00941K9022h2199j3777A9407K13388H051J1253M3662n195J21247J81428
11308C60446a63428J0678M0519F9401c3231k86824d702H9925J90987i8750A20059
11296a17359j5796m6398h1607C6309L9050b51245N8405f2964G5475B2772K3026
11285D5798g8803A45375l5055c26866a45414r3432B2323O2889b37426E4037a11065
11273E9517g6158k93148A75320f1613k60212A59169h8767j48569c5302p1571E5668
$$ y = [279576, 48513, 69161, 200457, -371247, -161817, -221868, 310209, -219732, -170645, -236611, -125219, 68012, 39927, 370842, 209224, 14959, 115199, -39650, -16260, 86243, 154074, -192391, 116893, -219488, 59983, 150424, -158662, -258597, -250658, -32871, 19392, -240328, -200941, -171919, -82199, -95976, 19407, 232795, 8051, 19304, 62966, 57771, 179018, 360446, -163428, -152750, -112231, 69401, -33231, -320055, -4702, 89925, 280912, -98750, 120059, -117359, -133155, -179553, -81607, 36309, 75359, -251245, -192840, -62964, 75475, 22772, 45798, -78803, 145375, 110320, -326866, -145414, -238846, 22323, 85212, -237426, 54037, -111065, 59517, -76158, -369306, 175320, -61613, -321825, 159169, -88767, -237336, -35302, -106873, 55668]
11261c58964B0399i6407r1393C03857a27610B42521E1521c27309b2781A57970
11250G3685O9989b02369P3713p2646d9999j9871B0355M382B711c88272E247P0457
11238G5704a74068G5628a72959c2355B25617a0839A3073J2811i5051e63k89043
11227b89606O9286m3745i5106J88A50081c38972I1718J15708h1073k1582d3687
11215a78403B54908e2914o023I0016b44052e978A38581j8554a37567d9381B04710
11203b96242E5865e5683j1195n05961b73889J02255A47930J5941N8034H0955a20944
11191E887a82003o4104B77343F0360b7956m8878q7370A04846j653g7518p0556
11180a48074A42751J77215a44285e4774p3116A34911b70966a05404A08023C0028
$$ y = [-358964, 20399, -96407, -187800, 303857, -127610, 242521, 51521, -327309, -22781, 157970, 73685, 143674, -202369, -128656, -201302, -49999, -69870, 20355, 24737, 2711, -388272, 5247, 75704, -174068, 75628, -172959, -32355, 225617, -10839, 13073, 25884, -95051, -563, -289606, -220320, -264065, -95106, -94918, 150081, -338972, 91718, 207426, -81073, -102655, -43687, -178403, 254908, -52914, -58937, 90016, -244052, -5978, 138581, 120027, -137567, -49381, 204710, -296242, 55865, -55683, -66878, -572839, -273889, -171634, 147930, 163871, 221905, 80955, -120944, 5887, -182003, -246107, 277343, 60360, -27956, -76834, -164204, 104846, 103193, -77518, -148074, 142751, 319966, -144285, -54774, -127890, 134911, -270966, -105404, 108023, 30028]
11169e0375l15622A839a9133B7129c06981g1778C6823b59090g4894C58509g8113
11157A65043e05776g4694G0013a2266k34263b3324A66609G2333b91994h2990A68220
11145a88512L8947C42374I3759J68602i6061G4945g3927p6268c7833l03471a9863
11133A33749A8070i1128n9906q0501J2940B10273g9577A66162b00196g3747k0252
11122i3999k22389A61245b13220E1867K13951H8209K03867j26681c7344B42429
11111B63851G8943f859F5587N7436M2237l2928b02978B77702B2747j873J6086
11100C6960J4635L29727f4354E921b8024p5577G815a56202C42099j18020K5978
11089B50057o0113H7555l4003L5479f9068H4737i3270B10303n7395b41075A64099
$$ y = [-50375, -365997, 1839, -19133, 27129, -306981, -71778, 36823, -259090, -74894, 358509, -78113, 165043, -505776, -74694, 70013, -12266, -246529, -23324, 166609, 72333, -291994, -82990, 168220, -188512, -149565, 342374, 93759, 262361, -96061, 74945, -73927, -150195, -37833, -341304, -19863, 133749, 18070, -91128, -151034, -231535, -218595, 210273, -79577, 166162, -200196, -73747, -93999, -316388, 161245, -213220, 51867, 265818, 88209, 292076, 165395, -37344, 242429, 263851, 78943, -6859, 65587, 123023, 165260, 132332, -202978, 277702, 22747, 20874, 36960, 51595, 381322, -64354, 5921, -28024, -103601, 7815, -156202, 342099, 224079, 250057, 189944, 87555, 53552, 89031, -69068, 84737, -93270, 210303, 152908, -241075, 164099]
11077A3268J80388F3431K58501J34591j37094F7470O9101m3822h2196C07923g7751
11065a96545D40331A95566q4618M51944j12469J04149F7817J36888K29115J24007
11055E57827k56263M1737J09086o2719N3433C147R2061c0167E32921k59123L30590
11044F04388B02466L08284R9226B72576O65102k58328j37919K58728j10024j31082
11034E59053K56342j70672J03197k40302K98226k11046B61419M40003k38427J23020
11024E86015J57462C17649O53864j07167j61830K4011J09901k07447k96005L14285
11014F47261k67983L17930N4866r727j53199R1516k47066J30106K04744j69120
11004E99328j04270N2061J24328o5271K0223R7475k23906O0343K21677l20309
$$ y = [13268, 193656, 63431, 321932, 456523, 319429, 67470, 136571, 92749, -82196, 307923, -77751, -196545, 440331, 195566, 110948, 562892, 450423, 554572, 67817, 204705, 433820, 557827, 301564, 343301, 452387, 389668, 443101, 3147, 95208, -30167, 532921, 273798, 604388, 202466, 510750, 609976, 272576, 937678, 679350, 541431, 800159, 690135, 559053, 815395, 644723, 747920, 507618, 805844, 594798, 261419, 701422, 462995, 586015, 743477, 317649, 971513, 864346, 702516, 726527, 836428, 628981, 332976, 647261, 379278, 697208, 752074, 742347, 589148, 680664, 433598, 563704, 768448, 599328, 495058, 547119, 671447, 606176, 626399, 723874, 499968, 560311, 781988, 461679]
10994D61679k18251L15132J05253j67806K02459p4875k41339m9087M72393k767
10984H02791l76905J06991J69588N9609k56839J05129m5241j57398K85227J25146
10974H18098L95799k10012j29784j7149L88926j24228k31782j1314J71893q3847
10964I66600l420K32329L14711J71175K21654Q6511M03914k45080J81637M5230
10954B375261p2160L87680m04111j85410o710L5422p22721k30090N10087o9628
10944A617620N2499k96685j33174K65932q4313J25738k43047k00954j62783L0908
10934I71741k54731l9419k61659l6096J40125B54060j7087N7740m1238K2891A19475
10922C04517l1668e6568C62982j63897g4620E2909Q0876e1064E0013J34008E7021
$$ y = [461679, 243428, 558560, 663813, 496007, 698466, 623591, 382252, 333165, 805558, 802791, 425886, 532877, 702465, 762074, 505235, 610364, 565123, 407725, 692952, 818098, 1213897, 1003885, 874101, 856952, 1245878, 1121650, 889868, 878554, 1050447, 966600, 963180, 1195509, 1510220, 1681395, 1903049, 1989560, 2393474, 2148394, 2330031, 2375261, 2303101, 2690781, 2286670, 2101260, 2094550, 2129972, 1407251, 1177161, 1687248, 1617620, 1670119, 1373434, 1240260, 1506192, 1421879, 1547617, 1304570, 1103616, 940833, 971741, 717010, 677591, 415932, 379836, 519961, 254060, 236973, 294713, 253475, 276366, 119475, 304517, 272849, -56568, 362982, 199085, -74620, 52909, 133785, -51064, 50013, 184021, 57021]
10910B47217k0385f2744C14039a1955B38971a99188C24238q6953m8962b00165
10899C8396j8135b0291C32071b904G5670d3675j04679N7056o181A96375b97371
10887C48684c27972J17145C6729a6155A78989d44953E8876P8550b22644A35559
10876B4209J11520f1061E43393H845K20755c6978o4064A05966d02535i586p605
10865a7191I7161L83535a3153k2380A7354c16442i1299E7983N234e595k95955
10854c01550a38556A20011i911C8204L4356l1935b060A39991B0250K09808b14064
10842F8862a05914B25496a13997D9165K88122a06500K7433B5544h418C36474b00500
10830e1198B62082a02031A6595C286K38607G050a20804E5026M8974e327j23467
$$ y = [247217, 226832, -62744, 314039, -11955, 238971, -199188, 324238, 237285, 188323, -200165, 38396, 20261, -20291, 332071, -2904, 75670, -43675, -148354, -91298, -97479, 196375, -297371, 348684, -327972, -210827, 36729, -16155, 178989, -444953, 58876, 137426, -222644, 135559, 24209, 135729, -61061, 543393, 8845, 229600, -36978, -101042, 105966, -402535, -9586, -17191, 97161, 480696, -13153, -35533, 17354, -316442, -91299, 57983, 63217, -5595, -301550, -138556, 120011, -9911, 38204, 72560, 40625, -2060, 139991, 20250, 230058, -214064, 68862, -105914, 225496, -113997, 49165, 337287, -106500, -79067, 25544, -8418, 336474, -200500, -51198, 262082, -102031, 16595, 3286, 241893, 7050, -120804, 55026, 104000, -5327, -128794]
10819a28794D6744J06401K27216b23470g1215a4477j20405b8023n3521E9076b0684
10807a05129A95025G7765d93645G8508g1824G5152J92972p4896b12353I6370b4545
10795a62681f7449q6256a4812H9782M01159c1298q8426j9356H6061b46542Q6869
10784a59673d6966C301J26627c00756A89901a85751q3600A13972F1c61251B76407
10772A2401K88770b14724C62i2341d205F3683b69449B8984b78766b4807j03129
10761a27936A05375m840l4069b27354L7036L3517b6944A76524c40200d3694j8128
10750f1822B31841I9933K39678K1778H3726C0102C212J38772f0663b4789k30664
10739b55453e3999k93426a3188k15981M1433a4881D8681d4998p5919B05343A4076
$$ y = [-128794, 46744, 153145, 380361, -223470, -71215, -14477, -134882, -28023, -81544, 59076, -20684, -105129, 195025, 77765, -493645, 78508, -71824, 75152, 268124, 193228, -212353, 96370, -24545, -162681, -67449, -153705, -14812, 89782, 490941, -31298, -119724, -139080, 86061, -246542, -159673, -46966, 3301, 129928, -300756, 189901, -185751, -269351, 113972, 61, -361251, 276407, 12401, 301171, -214724, 362, -92341, -4205, 63683, -269449, 28984, -278766, -24807, -127936, 105375, 100535, 66466, -227354, -190318, -156801, -26944, 176524, -340200, -43694, -61822, 231841, 99933, 339611, 361389, 83726, 30102, 3212, 141984, -60663, -24789, -255453, -53999, -347425, -13188, -229169, -187736, -14881, 48681, -44998, -120917, 205343, 14076]
10727b519j22520e5431P687k6927k4495I5245N3270h9544q3692O2581A43422a14094
10714a18097G9378k0404d0041A11464e1020A07527m8723B3637c02461A28186b06179
10702C63125A39249c06337a27032C9108b89771R4204A67976G0183r946b0083l06372
10691c26455F5852d74739A08841C9714A5881O5066a73540A20980c30700J27953
10681b02747i6041a0358B38453a89j74897L352P506A32525a57443A0128c70251
10669a01367A17742f1100j85398g3835A32401E0770R9085a01804j2377b9692A7683
10657A3419a82372i0571j08210B31511I6740b06291C18825c01277A21548b05602
10646c34402i0007B04895d3999A49516a81573j59801a06712H807J35454a62249
$$ y = [-2519, -125039, -55431, -47744, -74671, -99166, 95245, 148515, -89544, -173236, -110655, 143422, -114094, -118097, 79378, 58974, -40041, 111464, -51020, 107527, 58804, 23637, -302461, 128186, -206179, 363125, 139249, -306337, -127032, 39108, -289771, -195567, 167976, 70183, 60237, -20083, -326455, 65852, -474739, 108841, 39714, 15881, 80947, -173540, 120980, -330700, -202747, -96041, -10358, 238453, -189, -175086, -171734, -164228, 132525, -157443, 10128, -370251, -101367, 117742, -61100, -246498, -73835, 132401, 50770, 149855, -101804, -114181, -29692, 17683, 13419, -182372, -90571, -198781, 231511, 96740, -206291, 318825, -301277, 121548, -205602, -334402, -90007, 204895, -43999, 149516, -181573, -341374, -106712, 8807, 144261, -162249]
10635c7108a0136G6440l1805A01a90558o7775H1738J8866B4276h9540C5678c03226
10622b37693d2826k70802J28466a0572j56255B1329j0006a35569A86114b02200
10611F8135B2955J9877c4950r9363A3064b27149J4249i554k06819H5889b52820
10599c08560c121m03484F1068g4552l9232n5378J6670A93131d5571e766B08140
10587a19497E3978a22756F7466a33954I6562d9674A72413f359B02582n629f8178
10575a77549A03008c69852i986m9048j51100D3966g3916m1776j95344E2341k3652
10564B8689b11328a01387D0842a4747A1993h1357o9012n4176k05052a34707j26717
10553b61424B18086i8143j9217e5061B53131b26375D1731L17785a52499A80613
$$ y = [-37108, -10136, 76440, 44635, 101, -190558, -258333, 81738, 100604, 24276, -89540, 35678, -303226, -237693, -42826, -313628, -185162, -10572, -166827, 21329, 11323, -135569, 186114, -202200, 68135, 22955, 42832, -34950, -134313, 13064, -227149, -212900, -9554, -216373, 85889, -252820, -308560, -3121, -406605, 61068, -74552, -113784, -169162, -152492, 193131, -45571, -5766, 208140, -119497, 53978, -122756, 67466, -133954, 96562, -49674, 172413, -6359, 202582, 196953, -68178, -177549, 103008, -369852, -9986, -59034, -210134, 43966, -73916, -115692, -311036, 52341, 28689, -211328, -101387, 40842, -14747, 11993, -81357, -150369, -204545, -409597, -134707, -261424, 218086, -98143, -117360, -55061, 253131, -226375, 41731, 359516, -152499, 180613]
10542B78066C8997a75127B28568a59273L3842I9234a15182p5397h3996n789p3638
10531a63423E087b25676J01717A31074a31563N7261A54388a47912n1608J4042
10521a85478A09691J46767f9860C05807a39909q0195A42665e3332E13313I300
10510C52727a21454m7407B4732a89415j60328G4723a45929A76710a58352A91354
10499a42514J8686l14153L4662F6928f4446D3342C346a57348p521A55565h1772
10487A71148b08119C57801a11938A07616a74420l3352a00375j88402D116b0039
10476F5128J52594a95853R7347l4477C04474M1251I7251k1551a9758B48258o574
10465B41684r7645K10832j47841P817a3876C3561L71594a4873B05846H435R6536
$$ y = [278066, 38997, -175127, 228568, -159273, -125431, 99234, -115182, -190579, -83996, -89785, -163423, 5087, -225676, -123959, 131074, -131563, -74302, 154388, -147912, -199520, -185478, 109691, 256458, -69860, 305807, -139909, -220104, 142665, -53332, 513313, 9300, 352727, -121454, -168861, 24732, -189415, -349743, 74723, -145929, 176710, -158352, 191354, -142514, -123828, -437981, -403319, 66928, -64446, 43342, 3346, -157348, -164869, 155565, -81772, 171148, -208119, 357801, -111938, 107616, -174420, -207772, -100375, -288777, 4116, -20039, 65128, 217722, -195853, -98506, -132983, 304474, 345725, 97251, 75700, -19758, 248258, 241684, 144039, 354871, 207030, 214847, -13876, 33561, 405155, -14873, 205846, 8435, 104971]
10454A04971Q190g9706k96501a19690A91998a0092A28977K4610a14687k3574G7420
10442A942f4909k28179a43375A0040M2667L07081D1290e5936l37786M4653c7631
10430A63785c39559B54046B0215a61618A28791a6879G4900a5060A21031J7345
10420A38376F0587a66282A3968b02781C8049Q4660P3071p0585k8122b23281f4301
10408a93735A83795a64408H5353N3862R8527L0821a28659K8978E1894i1948L2811
10397e9137n8488k3329A319d4085p7895B0400a0742j64392b1177j78458L392J4115
10385a82128A81747a2054l260p7690C13024G7564b27674a11909A1912a5952q8041
10374a03993B4805P2821j5737J08525b953A9700O70619k96069b38340B39115g8508
$$ y = [104971, 113161, -79706, -376207, -119690, 191998, -10092, 128977, 153587, -114687, -138261, 77420, 1942, -64909, -293088, -143375, 10040, 52707, 359788, 41290, -55936, -393722, -349069, -37631, 163785, -339559, 254046, 20215, -161618, 128791, -16879, 74900, -15060, 121031, 138376, 60587, -166282, 13968, -202781, 38049, 122709, 195780, 125195, 97073, -223281, -64301, -193735, 183795, -164408, 85353, 139215, 237742, 268563, -128659, -99681, 51894, -91948, -59137, -117625, -140954, 1319, -44085, -121980, 20400, -10742, -175134, -21177, -199635, -196243, -182128, 181747, -12054, -15314, -93004, 313024, 77564, -227674, -111909, 11912, -15952, -103993, 24805, 97626, 81889, 190414, -2953, 19700, 690319, 394250, -238340, 239115, -78508]
10362A6072O758O70476a63136H2614N07809k25861o8045J13114A31242M08815
10352E40057A63575L65791L998k50903J94525B34087M22232i4842F78712B11084
10341a3626k1886B38323J86200C5049P6265L81957R3414j55647k07458M5097k7076
10330B41601q2531L42939j38072n5210j06457a36976A52978F1442K11483J32723
10320D05648I8845J77166J85860j89046i4935B52842r7336O6893L6877A13194
10309A53022D9635K14652j26353J62296E6208L38665r8304j47011A1828Q1372
10299I3200a66229E3911a07059A67450a8164n5990j24672f4916q6671A24784L92614
10288E17398b12229B2166a9448l8590j53085h0438A97062B8787c19196B4045a45877
$$ y = [16072, 22830, 693306, -163136, 82614, 590423, 364562, 296517, 409631, 131242, 540057, 163575, 529366, 533364, 282461, 476986, 234087, 656319, -94842, 678712, 211084, -13626, -35512, 238323, 424523, 35049, 111314, 493271, 586685, 431038, 223580, 268677, 241601, 159070, 502009, 363937, 308727, 202270, -136976, 152978, 61442, 272925, 405648, 98845, 276011, 461871, 272825, -94935, 252842, 155506, 222399, 259276, 113194, 153022, 49635, 264287, 137934, 300230, 56208, 394873, 296569, 149558, 11828, 93200, -166229, 53911, -107059, 167450, -18164, -74154, -198826, -64916, -151587, 124784, 517398, -212229, 22166, -19448, -58038, -211123, -80438, 197062, 28787, -319196, 24045, -145877]
10276a82957j6997P5403r7850k07270C66537I1134b2708B53249a25826k48249
10266c74075F0999R2990Q6579b37193j6912f0508C32347A46619A2492D450g307
10254D1138b21619A02462a02515k20301e9375r9837F910b5213A46390m4159K5563
10243A27794B2175L4104K95573E9167i2734A31156J41924J63915j88594I5411
10232F6181b31267A41629a2523j11074d4445E4354d4971m46312B09835b04337
10221A54840h1223k46663A09702a08187B63J52174a32150d9419B7331J62721b5166
10209e11B14095A03769C3760J35505A2572c2491j65069f3184o0835f1323B6709
10197f6216e025j2960j80414A320J53970C2787c38180D6753b9194k16689M3654
$$ y = [-182957, -199954, -124551, -222401, -429671, 366537, 91134, -22708, 253249, -125826, -374075, 60999, 153989, 240568, -237193, -254105, -60508, 332347, 146619, 12492, 4450, -7307, 41138, -221619, 102462, -102515, -322816, -59375, -159212, 6910, -25213, 146390, 102231, 127794, 22175, 56279, 351852, 59167, -92734, 131156, 273080, 436995, 248401, 95411, 66181, -231267, 141629, -12523, -123597, -44445, 54354, -44971, -491283, 209835, -204337, 154840, -81223, -327886, 109702, -108187, 263, 152437, -132150, -49419, 27331, 190052, -25166, -511, 214095, 103769, 33760, 169265, 12572, -32491, -197560, -63184, -124019, -61323, 26709, -66216, -5025, -17985, -198399, 1320, 155290, 32787, -338180, 46753, -29194, -245883, -202229]
10186b02229c6407j96483i1748j21217I3141b30223d7981p2364k9001j40387D9085
10174d41895a2105j57856I9834c63888g9504n2528b6401B4516K87073A12604A5357
10162i396A83916a27282A31114a41164A71127a39945a3610A38480J0147g2252
10151a98190e447j82138b7140A553g7360A95391a50953j04834L2546O2951k2006
10140a82296j65887J15300j72885n2313A08408a79574c7588G6881a34688B35079
10129b44067D5876A6096J43599k8183B804O4594i9038A47944c46233J07370F35
10117h6337b7624A51577f6177B58038a00699m6672A04924b57806F5539J08904
10107A74443k4329h2516A02016J19773f3270m02508a045k51572G8204a88823B4487
$$ y = [-202229, -36407, -232890, -91748, -212965, 93141, -230223, -47981, -120345, -149346, -289733, 49085, -441895, -12105, -169961, 99834, -363888, -79504, -132032, -26401, 24516, 311589, 112604, 15357, -9396, 183916, -127282, 131114, -141164, 171127, -139945, -13610, 138480, 148627, -72252, -198190, -5447, -187585, -27140, 1553, -77360, 195391, -150953, -255787, -223241, -160290, -182296, -348183, -232883, -405768, -458081, 108408, -179574, -37588, 76881, -134688, 235079, -244067, 45876, 16096, 159695, 131512, 2804, 67398, -99038, 147944, -346233, -238863, 635, -86337, -27624, 151577, -66177, 258038, -100699, -147371, 104924, -257806, 65539, 174443, 150114, -82516, 102016, 221789, -63270, -465778, -1045, -252617, 78204, -188823, 24487]
10095F9928a19237d5018m0793m9695J3082k25692d4570B4244R0154a0030k5257
10084c5287I645f8667k2507A10087a26390o1244A48301a02837l3459K382B3642
10072d560k1869p4615n676j97528B8868J05703c15799k055d4481k13983C12728
10060a04936A7641a02025A20793a27450A51835n4052A5708a80531I8545d97o3101
10049f3598q8351F3694R8625a55321F1408a64783F6200b08173D6388b67430G7181
10037F4195p737b10718b6352e754D3512a3651C2649a41859l4871b2539j64835
10026a87374C5004e3515a8412G5129a66960j69019e6723A2279J6517R1389b23594
10014F3895L23809A32486A6328f3773l01265a58549N970d7407m33967A26144b09201
$$ y = [69928, -119237, -45018, -85811, -135506, -122424, -348116, -44570, 24244, 114398, -10030, -35287, 9645, -68667, -91174, 110087, -126390, -187634, 148301, -102837, -136296, -133914, 23642, -4560, -26429, -101044, -106720, -304248, 28868, 134571, -315799, -317854, -44481, -258464, 312728, -104936, 17641, -102025, 120793, -127450, 151835, 97783, 15708, -180531, 98545, -497, -63598, -151949, 63694, 162319, -155321, 61408, -164783, 66200, -208173, 46388, -267430, 77181, 64195, 56458, -210718, -26352, -5754, 43512, -13651, 32649, -141859, -176730, -22539, -187374, 35004, -53515, -18412, 75129, -166960, -335979, -56723, 12279, 28796, 120185, -223594, 63895, 387704, 132486, 16328, -63773, -365038, -158549, -152579, -47407, -481374, 126144, -209201]
10002a03488k92163A26765a9200j46369g9779A8944c39418f9191B59716a2496
9991A83304q8035a6818A55200C1191b5479G9936l0218K8486b5734j40016N5008
9980a10742j41905C44309a76937d5653k15860P0098P8801N3550A55925l1872H069
9968a94292g5457k3442m8664B06597I3344d10005K01410h7249j50134g2138m2052
9957a14190C4674i4233E6921b49709J05081e759k79668B00235c30280a28745F8103
9945B574g3747b593j20782e4483A07982M8487A9128c06718F8457J3207a0398k79581
9933b89979a29037m5488g589A47316n741a97457A8244g0082l11540j4699i6954
9921b8090B11743a16058B6971g6648c260F3259h6321k0490D5982d8323l64058
$$ y = [-103488, -395651, 126765, -19200, -165569, -79779, 18944, -339418, -69191, 259716, -12496, 183304, 95269, -16818, 155200, 31191, -25479, 79936, 49718, 78204, -25734, -165750, -110742, -252647, 344309, -176937, -45653, -261513, -191415, -112614, -59064, 155925, 124053, 8069, -194292, -75457, -98899, -147563, 206597, 93344, -410005, -208595, -87249, -237383, -72138, -114190, 34674, -94233, 56921, -249709, -144628, -5759, -285427, 200235, -330280, -128745, 68103, 2574, -73747, -2593, -123375, -54483, 107982, 156469, 19128, -306718, 68457, 81664, -10398, -289979, -129037, -174525, -7589, 147316, 141575, -197457, 18244, -70082, -381622, -396321, -96954, -28090, 211743, -116058, 26971, -76648, -3260, 63259, -86321, -106811, 45982, -48323, -412381]
9910d12381A9165a12917D4078A8219J43206e26617H505Q8634b14710N3763D7971
9898a84595e5420A9828b34639G2811e24077A98942a02698e0638j24616f4837r6945
9887a61782J4835l512n9580g7285A43367r612i0560j48761D6011c4387o9481L0823
9875g3045O694j63812j45809Q5153a38939B0902a96876N3852B16478f5425G7253
9863B2213i5106A28298e3402C59559a79583A27445b62505a25852N4892B13865
9852A10328N656a92425a9553p8863r8989D307J78358B0792K59872b85223B91510
9840f9079J8518j4219F9217a66705B08768H7546a48039l6220b9829m5522A8332
9828c54064q1651h0675a8536j21552B0410m201a99430B54544e1842j40217j03239
$$ y = [-412381, 19165, -112917, 44078, 18219, 161425, -526617, 8505, 97139, -214710, -160947, 47971, -184595, -55420, 19828, -234639, 72811, -524077, 198942, -102698, -50638, -175254, -64837, -161782, -146947, -150459, -210039, -77285, 143367, 133755, -90560, -239321, 46011, -34387, -103868, -73045, -66351, -230163, -375972, -290819, -138939, 20902, -196876, -143024, 216478, -65425, 77253, 22213, -95106, 128298, -53402, 359559, -179583, 127445, -262505, -125852, -70960, 213865, 110328, 115984, -192425, -19553, -98416, -197405, 4307, 182665, 20792, 280664, -285223, 291510, -69079, -50561, -64780, 69217, -166705, 208768, 87546, -148039, -184259, -29829, -75351, 18332, -354064, -435715, -80675, -18536, -140088, 20410, 16209, -199430, 254544, -51842, -192059, -295298]
9817b95298a6039l26092G2685c7641l15233j13507b7345k90340c9301k52286J18780
9806a72807L8798o1115r1206e9020n3576A09466b07494R7321p9083l05848e3319
9794b66924j4805A39284L4208b74771o1061E2979A0990b89426G8233a09341H0628
9782i8858I4159a57114B36168A14351J3520a88122k9027D4054M4894K4415i7508
9770a01674C83938A34297C4843J01450a37768O688d5200J8609l3668m3171j32455
9759b35885R459L5443L784Q3883m6278k68511A52905g2338A29628a31702B94200
9747b42244A77881b23829A6846c7556A07721a21570A48012j4999b19518p4551
9737b94069a8319k72279H8864D2162b54104d4194b921B99950d11779i3595k89547
$$ y = [-295298, -16039, -342131, 72685, -37641, -352874, -466381, -27345, -317685, -39301, -291587, -172807, -134009, -195124, -286330, -59020, -112596, 109466, -207494, -110173, -189256, -495104, -53319, -266924, -281729, 139284, 173492, -274771, -335832, 52979, 10990, -289426, 78233, -109341, 80628, -98858, 94159, -157114, 236168, 114351, 127871, -188122, -217149, 44054, 88948, 113363, -97508, -101674, 383938, 134297, 34843, 136293, -137768, -131080, -45200, -26591, -60259, -103430, -235885, -226426, -190983, -187199, -103316, -149594, -418105, 152905, -72338, 129628, -131702, 294200, -242244, 177881, -223829, 16846, -37556, 107721, -121570, 148012, 133013, -219518, -294069, -18319, -290598, 88864, 42162, -254104, -44194, -2921, 299950, -411779, -93595, -383142]
9726c83142a84011F6321M8674J4036K8831a06285A82553a35950c5061k69463h7056
9714E0973b4212p6998B5665d6912a8206A74054i4347F940J15927b17820k20573
9703d38393A7617M3288b87133G7354j0637e9041b7692o5639J275l9930r5985A32542
9690I0511a45668b8195j60233a2922A31981b09627K726f225j09862C12142b35056
9678d5353j47572L271q5217I6109c20809h6427r1385j20168g0496A50194a85546
9666b37830b4582j74643d4858A39933a27285k93420a92375d0762r3993k2538l3182
9655a90475f8855r4105n1647j11625A68430b53770a7514k7769I2685a6415j42227
9644a58642B32975c53411e9446C0092b3906M979a099A20264a33523b627A35705
$$ y = [-383142, -184011, 66321, 114995, 129031, 157862, -106285, 182553, -135950, -35061, -304524, -87056, 50973, -24212, -101210, 25665, -46912, -18206, 174054, -94347, 6940, 122867, -217820, -438393, 17617, 60905, -287133, 77354, 66717, -59041, -27692, -93331, -92056, -131986, -227971, 132542, 90511, -145668, -28195, -188428, -12922, 131981, -209627, -206901, -6225, -116087, 312142, -235056, -45353, -192925, -189654, -274871, 96109, -320809, -86427, -177812, -297980, -70496, 150194, -185546, -237830, -24582, -199225, -44858, 139933, -127285, -420705, -192375, -40762, -134755, -157293, -190475, -68855, -162960, -214607, -326232, 168430, -253770, -17514, -45283, 92685, -16415, -158642, 232975, -353411, -59446, 30092, -23906, -18927, -1099, 120264, -133523, -2627, 135705]
9632a61444J2590n9799E6814J92581a50473C2942f770l96222B50473J45934c3145
9620A40830c33180H142a79106B63525b16209a0043G2338j5162J2004g0664j62037
9609b32701A20545n527b73842A30896a31142L3123c9540A8495a10123n1403C0984
9597a50842c9377C0222c52984B04329o7399G690e8529a4989d220A42488d39653
9585A28102a00761B05904l7264F6533b10668R4055p6724J2422K5556O5584B02482
9573C02447b33619f236A40398F535K14792O3942H1411a3829B61043a11027j44986
9562b56013A34375b62636F8417a29204B1445J4407b23918E6059i1734k33234J45474
9551a79494A20627d0952k82952a46065g0166J006Q699A95268e8177k14560a33539
$$ y = [-161444, -148854, -208653, 56814, 249395, -150473, 32942, -6770, -402992, 250473, 396407, -33145, 140830, -333180, 8142, -179106, 263525, -216209, -10043, 72338, 57176, 69180, -70664, -232701, 120545, 115018, -273842, 130896, -131142, -98019, -39540, 18495, -110123, -161526, 30984, -150842, -39377, 30222, -352984, 204329, 136930, 7690, -58529, -14989, -4220, 142488, -439653, 128102, -100761, 205904, 168640, 66533, -210668, -116613, -193337, -180915, -155359, -89775, 202482, 302447, -233619, -6236, 140398, 6535, 221327, 285269, 81411, -13829, 261043, -111027, -256013, 134375, -262636, 68417, -129204, 21445, 35852, -223918, 56059, -91734, -324968, -179494, 120627, -40952, -323904, -146065, -70166, -69160, -60461, 195268, -58177, -272737, -133539]
9539a31656A3982R9334e7234k25807B85761G1337k3366f0490K8477j74744A98722
9527a41949n581I6677K40251b67512R8415p4077A81458p0957b19387K6859J8859
9516a73669j04729N8234K1224J3017P0096C81910A43680b59267A33646a28062
9505a04921e532E7225c17676B31354a16299j0214B01834a77361h240A8938g0986
9493C66112A57252d36301a37171C68488b03920J0704q4965P1503R381j4475a3057
9481G7330J53019b10048P7280e3177k95225E8061a32911A50304c65879g2247j10923
9470a83170F9787C0445J4208J2495f9039k92453a3558A12575B9118R884a43598
9458H9168b57248A3075K1209d5346j79455a7993k44825j47294J45140H772d73748
$$ y = [-131656, 13982, 113316, -57234, -283041, 285761, 71337, 47971, -60490, -32013, -206757, 198722, -141949, -147530, 96677, 336928, -267512, -169097, -243174, 181458, 110501, -219387, -192528, -173669, -278398, -220164, -198940, -185923, -115827, 381910, 143680, -259267, 133646, -128062, -104921, -5532, 57225, -317676, 231354, -116299, -126513, 201834, -177361, -8240, 18938, -70986, 366112, 157252, -436301, -137171, 368488, -203920, -193216, -278181, -206678, -197297, -211772, -13057, 77330, 230349, -210048, -132768, -53177, -348402, 58061, -132911, 150304, -365879, -72247, -183170, 69787, 30445, 44653, 57148, -69039, -361492, -13558, 112575, 29118, 39002, -143598, 89168, -257248, 13075, 34284, -45346, -224801, -17993, -262818, -410112, -264972, 8772, -473748]
9446a37413A410g3332l04458A42190b27249f7860A07125a89188A78369b34731
9435d1411j40799D9416b44555B15226I9291g6748E8655b63158a843j19175p1322
9424a92340H862a59632a1081m6623q3239B04083c5300o3409d7197A83663J31822
9413C15485b00038i3674l1908N5186j46953B51836i0179c4825j88977D2646J9867
9402F2513a52535G4301a574j37012A16504Q7596c64940h272j82577A60760D3937
9390g8739A78752B7054b61899P6559e6217A4106J28852a52458k06507a53691j51013
9379c04704b0826A5490c3228q1535k11291i7526j71349L8686l708A12357a68048
9367f2082a2207j24620B5966L24594A31796a80916A05964a12890D6711O084g4218
$$ y = [-137413, 1410, -73332, -377790, 142190, -227249, -67860, 107125, -189188, 178369, -234731, -41411, -182210, 49416, -244555, 215226, 99291, -76748, 58655, -263158, -1843, -121018, -192340, 8862, -159632, -11081, -57704, -140943, 204083, -35300, -98709, -47197, 183663, 315485, -200038, -93674, -125582, -70396, -217349, 251836, -90179, -34825, -223802, 42646, 62513, -152535, 74301, -1574, -138586, 116504, 204100, -364940, -8272, -190849, 160760, 43937, -78739, 178752, 27054, -261899, -185340, -56217, 14106, 142958, -152458, -358965, -153691, -304704, -20826, 15490, -33228, -114763, -326054, -97526, -268875, -230189, -233897, 112357, -168048, -62082, -12207, -136827, 25966, 350560, 131796, -180916, 105964, -112890, 46711, 52795, -74218]
9355G9767B8739J64702a30929D4463A6258a94818j76549m635N1836c6666o3809
9344a00475m412N568m1207r23D4129a39218A24266c10272N9636I1926a47885n3282
9332b01167C4201b48989B43413N0088g7894D7326A9855b6851B76534b16089a4242
9320e1765G4507d7584A54200B1430c85402a49340B59647j08377b10646j33118
9310c43764J68000J4628K9306e9015B72392e5012G8139c77252J61064L4377j6794
9299a98605K1516C875c3645B31962a95987A08338K711C9170I964a20927j43151
9288b64078R4422H0951C508L10656g1782l42805E3347b03916E6675a94118P450
9277a86668A26394b64758A12222P7461q7477K44856a18876A24466R1313b93254
$$ y = [79767, 28739, 193441, -130929, 44463, 16258, -194818, -371367, -376002, -324166, -36666, -100475, -104887, -99319, -140526, -141449, 44129, -139218, 124266, -310272, -250636, 91926, -147885, -201167, 34201, -248989, 243413, 293501, -77894, 47326, 19855, -26851, 276534, -216089, -14242, -51765, 74507, -47584, 154200, 21430, -385402, -149340, 259647, 151270, -210646, -343764, -175764, -161136, -131830, -59015, 272392, -55012, 78139, -377252, -216188, -181811, -198605, -177089, 3875, -33645, 231962, -195987, 108338, 111049, 39170, 9964, -120927, -264078, -169656, 80951, 3508, 314164, -71782, -414587, 53347, -203916, 56675, -194118, -186668, 126394, -264758, 112222, 189683, 102206, 347062, -118876, 124466, 215779, -293254]
9266e3429a212H9391b10834N6281A31811J11029a88787L5535A16509a92036I7569
9254b09471a7618B77087a20581B28231e075q8906B13337c64715M4100J32753E4284
9242C6719b96281A38260a90543E2972O5606C1171J72270A5803L9695L80713d51069
9230b73433B7369J24002b61094a25140B93715d3310r320J3449A28045D7101J4654
9219F1755c38412e4467A85860b34772n066H5371a468k08469B22345k3060c19313
9207b15498a06129K9955j2022C578a93046k23355G6042e86488A3420b7109A50571
9195a12339C4008O2333J44995a36968j86842a45055j4427j76591B29274b15047
9184a69751a4942j13430A72703C1224N3991L13406a06193B04648c58179D01643
$$ y = [-53429, -1212, 89391, -210834, -154553, 131811, 242840, -188787, -153252, 116509, -192036, 97569, -209471, -17618, 277087, -120581, 228231, -5075, -93981, 213337, -364715, -320615, -187862, 54284, 36719, -296281, 138260, -190543, 52972, 118578, 31171, 203441, 15803, 55498, 436211, -451069, -273433, 27369, 151371, -261094, -125140, 293715, -43310, -52630, -39181, 128045, 47101, 61755, -338412, -54467, 185860, -234772, -239838, 85371, -1468, -209937, 222345, 199285, -319313, -215498, -106129, -76174, -88196, 3578, -193046, -416401, 76042, -586488, 13420, -27109, 150571, -112339, 34008, 96341, 241336, -136968, -323810, -145055, -159482, -336073, 229274, -215047, -169751, -14942, -128372, 172703, 31224, 85215, 398621, -106193, 204648, -358179, 401643]
9173c57193J16543A18955a14161j83995a33940m1535c2750j2207j75152h6447
9162a16003D5475a08638B31727a13222e1681O904C01916C7402b07723n8491I0221
9150b96320d8846k95420i8769k9627B7544d90608g9994l9268d0281k49443B14614
9138c9501F5902b85238B9987a17117k34205A60665b87375Q8820n0914J9574O3772
9127a66123B2083M2284j9059b25441q430R0715I5547a5330C3306K45191a42988
9115B12729a82119j14642F2771a63098O6051A95447B6194J74391a04337j3595
9105a17932o4914R1243l07713A96801f901D0850b3950f319k0660A41030a71032
9093B30851D8752R8079M6199a68627o2360f6980m6568F8954C03i9594p0209B43
$$ y = [-357193, -240650, 118955, -114161, -298156, -133940, -175475, -32750, -44957, -220109, -86447, -116003, 45475, -108638, 231727, -113222, -51681, -44777, 301916, 37402, -207723, -266214, 90221, -296320, -48846, -344266, -98769, -128396, 27544, -490608, -79994, -119262, -40281, -289724, 214614, -39501, 65902, -285238, 29987, -117117, -351322, 160665, -287375, -198555, -249469, -229895, -166123, 22083, 64367, 45308, -225441, -233871, -143156, 95547, -15330, 33306, 278497, -142988, 212729, -182119, -296761, 62771, -163098, -97047, 195447, 26194, 200585, -104337, -117932, -182846, -91603, -399316, 196801, -6901, 40850, -23950, -6319, -26979, 141030, -171032, 230851, 48752, 146831, 193030, -168627, -230987, -66980, -113548, 68954, 303, -99594, -169803, 243]
9080A69829b56038a14018A92397g784o6894a7816j23015M8916j28763o6324d2540
9068D9052a98888g8471H8467a83189F5765g3083A17468d1617l5220G9893c09994
9056i1894G7079h2455b5016l35568f1934j31412F3915e7667A42484a379l59676
9045c61055a83A75859B8549b07349C0707b0571j98956l5060g2771p81A38965a84757
9032C72655h8344c7941B6782a31908A97970m8266a62126a2695C29282a4609B49929
9020E6798g0733I3982A495K28883b90729D7862j9587J8592M929a95680f5483j02197
9008a67680e8214A41878a24645k49923e1219I477l871J09955k4658C0720e994
8996C3667O5720b71348H2224a41195B975b76009j2406K5007F5393a97314a2193
$$ y = [169829, -256038, -114018, 192397, -7784, -74678, -17816, -140831, -91915, -220678, -287002, -42540, 49052, -198888, -78471, 88467, -183189, 65765, -73083, 117468, -41617, -76837, 79893, -309994, -91894, 77079, -82455, -25016, -360584, -61934, -193346, 63915, -57667, 142484, -1379, -361055, -183, 175859, 28549, -207349, 30707, -20571, -219527, -254587, -72771, -73552, 138965, -184757, 372655, -88344, -37941, 26782, -131908, 197970, 149704, -162126, -12695, 329282, -14609, 249929, 56798, -70733, 93982, 1495, 230378, -290729, 47862, 28275, 46867, 51796, -195680, -65483, -167680, -58214, 141878, -124645, -374568, -51219, 9477, 5606, 115561, 90903, 30720, -5994, 33667, 99387, -271348, 82224, -141195, 2975, -276009, -288415, -263408, 65393, -197314, -12193]
8984a40495k2532A50096J16973a26199j34011E1114d10314b3098l101k55105j29149
8973d10453f4479m8794a9338q7169C79285b5056j84763h4307I5118a89995d6152
8961b22004h2385c1463B0987K17022j03221b09335d2692l6047j20729l8395e8801
8949A4425Q933c3902q2061C5822b70346f0872l749o0906B50172a37268B03675
8937h4699n4778C09838b87921N3124A27935m076J77038b78273a27427j0135A31762
8925F8220a40156I8340M343f1517A89227a06485L3558C46463p1629p7061A6087
8913c7485B33037O1599J66109K60794Q36314M17700J133438L158536M388577n304553
8903E351551k498264A300992j63355n51477n3869B63915J56969b50745C01202
$$ y = [-140495, -163027, 150096, 267069, -126199, -260210, 51114, -410314, -23098, -26199, -281304, -410453, -64479, -113273, -19338, -106507, 379285, -25056, -209819, -84307, 95118, -189995, -46152, -222004, -82385, -31463, 20987, 238009, 134788, -209335, -42692, -78739, -199468, -237863, -58801, 14425, 23358, -33902, -115963, 35822, -270346, -60872, -64621, -125527, 250172, -137268, 203675, -84699, -139477, 309838, -287921, -234797, 127935, 123859, 300897, -278273, -127427, -137562, 131762, 68220, -140156, 98340, 102683, -61517, 189227, -106485, -72927, 346463, 274834, 197773, 16087, -37485, 233037, 294636, 460745, 721539, 1557853, 1975553, 3108991, 6267527, 10656104, 5351551, 2853287, 1300992, 1137637, 586160, 532291, 263915, 420884, -250745, 301202]
8893A11618Q6321B5623K15315o9769C2002M8316O176f20828f7355p0152F7775
8881a12721d3215B91567a82094f1863k80687d1352j09812d4038j22453N8795c1786
8869a79068O7502E4895J99083a59963D1134b2737B45646a60943A02591d5171A7071
8857c99075N8401a18189j36853a01711k3905j7593b7716A43000g1383A92274f1106
8845b19386g7088A34144C4024a84919B29304p4771K3494i2078M67j9039j31496
$$ y = [111618, 197939, 25623, 240938, 171169, 32002, 80318, 86494, -620828, -67355, -137507, 67775, -112721, -43215, 291567, -182094, -61863, -342550, -41352, -151164, -44038, -166491, -107696, -31786, -179068, -111566, 54895, 253978, -159963, 41134, -22737, 245646, -160943, 102591, -45171, 17071, -399075, -340674, -118189, -255042, -101711, -125616, -143209, -27716, 143000, -71383, 192274, -61106, -219386, -77088, 134144, 34024, -184919, 229304, 154533, 178027, -92078, -91611, -110650, -242146]
$$ [...]
##END NTUPLES=NMR SPECTRUM
##END=
