
##TITLE=UV1020_M2-1005-1001_6269306_dwkXDAK8ii
##JCAMPDX= 6.0         $$ Bruker NMR JCAMP-DX V2.0
##DATA TYPE= NMR SPECTRUM
##DATA CLASS= NTUPLES
##ORIGIN= BRUKER
##OWNER= Administrator
$$ 1.72 TOPSPIN		Version 2.1
$$ 2012-06-02 01:00:47.546 -0500  Administrator@TOPSPIN
$$ Compression mode = diff/dup
##.OBSERVE FREQUENCY= 400.13188235
##.OBSERVE NUCLEUS= ^1H
##.ACQUISITION MODE= SIMULTANEOUS (DQD)
##.ACQUISITION SCHEME= undefined
##.AVERAGES= 64
##.DIGITISER RES= 22
##SPECTROMETER/DATA SYSTEM= spect
##.PULSE SEQUENCE= noesygpps1d.comp
##.SOLVENT NAME= COFFEE_calctemp
##.SHIFT REFERENCE= INTERNAL, COFFEE_calctemp, 1, 14.96703
##AUDIT TRAIL= $$ (NUMBER, WHEN, WHO, WHERE, PROCESS, VERSION, WHAT)
$$ ##TITLE= Audit trail, TOPSPIN		Version 2.1
$$ ##JCAMPDX= 5.01
$$ ##ORIGIN= Bruker BioSpin GmbH
$$ ##OWNER= Administrator
$$ $$ C:\Bruker\TOPSPIN/data/COFFEE/nmr/UV1020_M2-1005-1001_6269306_dwkXDAK8ii/12/pdata/1/auditp.txt
$$ ##AUDIT TRAIL=  $$ (NUMBER, WHEN, WHO, WHERE, PROCESS, VERSION, WHAT)
(   1,<2012-06-02 01:00:42.500 -0500>,<Administrator>,<TOPSPIN>,<go>,<TOPSPIN 2.1>,
      <created by zg
	started at 2012-06-02 00:49:12.234 -0500,
	POWCHK enabled, PULCHK disabled,
       configuration hash MD5:
       D5 CA 7A 23 FE 6B EE E2 50 67 74 61 24 F7 5E 3B
       data hash MD5: 64K
       71 77 3F 08 4D EE 82 0A D2 3C D7 96 42 96 EC 57>)
(   2,<2012-06-02 01:00:45.421 -0500>,<Administrator>,<TOPSPIN>,<proc1d>,<TOPSPIN 2.1>,
      <Start of raw data processing
       efp LB = 0.3 FT_mod = 6 PKNL = 1 PHC0 = 0 PHC1 = 0 SI = 128K 
       data hash MD5: 128K
       7B C1 1E 8F 37 D2 49 46 FC 0B 6C 53 6E 0B 78 53>)
(   3,<2012-06-02 01:00:46.703 -0500>,<Administrator>,<TOPSPIN>,<proc1d>,<TOPSPIN 2.1>,
      <pk PHC0 = 28.65234 PHC1 = 0 
       data hash MD5: 128K
       7A 98 E7 28 DC 31 3A F2 CF A3 E8 2D 2F F3 76 FF>)
(   4,<2012-06-02 01:00:47.234 -0500>,<Administrator>,<TOPSPIN>,<proc1d>,<TOPSPIN 2.1>,
      <abs ABSG = 1 
       data hash MD5: 128K
       6A 1B 42 CA D3 93 48 6C FE 71 1B F4 23 9D BA 88>)
(   5,<2012-06-02 01:00:47.296 -0500>,<Administrator>,<TOPSPIN>,<proc1d>,<TOPSPIN 2.1>,
      <abs ABSG = 2 
       data hash MD5: 128K
       04 A7 5B FD 1E DF A2 6E 16 20 6E 3C 07 AC 6F 44>)
(   6,<2012-06-02 01:00:47.359 -0500>,<Administrator>,<TOPSPIN>,<proc1d>,<TOPSPIN 2.1>,
      <abs ABSG = 3 
       data hash MD5: 128K
       A9 9F 2B 93 17 A4 CF 76 AB AA A4 11 ED 68 58 0C>)
(   7,<2012-06-02 01:00:47.406 -0500>,<Administrator>,<TOPSPIN>,<proc1d>,<TOPSPIN 2.1>,
      <abs ABSG = 4 
       data hash MD5: 128K
       B5 CD 69 E2 9A D1 B6 F2 9E F4 ED 85 B3 F5 FE 15>)
(   8,<2012-06-02 01:00:47.468 -0500>,<Administrator>,<TOPSPIN>,<proc1d>,<TOPSPIN 2.1>,
      <abs ABSG = 5 
       data hash MD5: 128K
       6B 8A 2B 3D 5E B1 1A B2 6C 4D 15 80 50 23 88 11>)
$$ ##END=
$$ 
$$ $$ hash MD5
$$ $$ 4C 9B E4 94 7C 68 BF 90 86 9F CE 5A 77 CD 24 ED
##$RELAX= 
##$RELAX= 
##$RELAX= 
##$RELAX= 
##$RELAX= 
##$RELAX= 
##$RELAX= 
##$RELAX= 
$$ [...]
##$TP07= 0
##$TPNAME0= <>
##$TPNAME1= <>
##$TPNAME2= <>
##$TPNAME3= <>
##$TPNAME4= <>
##$TPNAME5= <>
##$TPNAME6= <>
##$TPNAME7= <>
##$TPOAL= (0..7)
0.5 0.5 0.5 0.5 0.5 0.5 0.5 0.5
##$TPOFFS= (0..7)
0 0 0 0 0 0 0 0
##$TUNHIN= 0
##$TUNHOUT= 0
##$TUNXOUT= 0
##$USERA1= <user>
##$USERA2= <user>
##$USERA3= <user>
##$USERA4= <user>
##$USERA5= <user>
##$V9= 5
##$VALIST= <valist>
##$VCLIST= <CCCCCCCCCCCCCCC>
##$VD= 0
##$VDLIST= <DDDDDDDDDDDDDDD>
##$VPLIST= <PPPPPPPPPPPPPPP>
##$VTLIST= <TTTTTTTTTTTTTTT>
##$WBST= 2048
##$WBSW= 25
##$XGAIN= (0..3)
0 0 0 0
##$XL= 0
##$YL= 0
##$YMAX_a= 12365003
##$YMIN_a= -6754368
##$ZGOPTNS= <>
##$ZL1= 120
##$ZL2= 120
##$ZL3= 120
##$ZL4= 120
##$ABSF1= 14.96703
##$ABSF2= -5.585501
##$ABSG= 5
##$ABSL= 3
##$ALPHA= 0
##$AQORDER= 0
##$ASSFAC= 0
##$ASSFACI= 0
##$ASSFACX= 0
##$ASSWID= 0
##$AUNMP= <proc_prof1d_extract.lims>
##$AXLEFT= 0
##$AXNAME= <>
##$AXNUC= <1H>
##$AXRIGHT= 0
##$AXTYPE= 0
##$AXUNIT= <>
##$AZFE= 0.1
##$AZFW= 0.1
##$BCFW= 0
##$BC_mod= 0
##$BYTORDP= 0
##$COROFFS= 0
##$CY= 15
##$DATMOD= 1
##$DC= 0
##$DFILT= <>
##$DTYPP= 0
##$F1P= 0
##$F2P= 0
##$FCOR= 0.5
##$FTSIZE= 131072
##$FT_mod= 6
##$GAMMA= 0
##$GB= 0
##$INTBC= 1
##$INTSCL= 1
##$ISEN= 128
##$LB= 0.3
##$LEV0= 0
##$LPBIN= 0
##$MAXI= 10000
##$MC2= 0
##$MEAN= 0
##$ME_mod= 0
##$MI= 0
##$NCOEF= 0
##$NC_proc= -3
##$NLEV= 6
##$NOISF1= 0
##$NOISF2= 0
##$NSP= 0
##$NTH_PI= 0
##$NZP= 0
##$OFFSET= 14.96703
##$PC= 1
##$PHC0= 28.65234
##$PHC1= 0
##$PH_mod= 1
##$PKNL= yes
##$PPARMOD= 0
##$PPDIAG= 0
##$PPIPTYP= 0
##$PPMPNUM= 2147483647
##$PPRESOL= 1
##$PSCAL= 4
##$PSIGN= 0
##$PYNMP= <proc.py>
##$REVERSE= no
##$SF= 400.130005435123
##$SI= 131072
##$SIGF1= 0
##$SIGF2= 0
##$SINO= 400
##$SIOLD= 131072
##$SPECTYP= <>
##$SREGLST= <1H.CDCl3>
##$SSB= 0
##$STSI= 131072
##$STSR= 0
##$SW_p= 8223.68421052632
##$SYMM= 0
##$S_DEV= 0
##$TDeff= 65536
##$TDoff= 0
##$TI= <>
##$TILT= no
##$TM1= 0
##$TM2= 0
##$TOPLEV= 0
##$USERP1= <user>
##$USERP2= <user>
##$USERP3= <user>
##$USERP4= <user>
##$USERP5= <user>
##$WDW= 1
##$XDIM= 131072
##$YMAX_p= 486549271
##$YMIN_p= -5660152
##$CURPLOT= <Network HP LaserJet P1505>
##$CURPRIN= <$Network HP LaserJet P1505>
##$DFORMAT= <normdp>
##$LAYOUT= <+/1D_H.xwp>
##$LFORMAT= <normlp>
##$PFORMAT= <normpl>
##$SURQMSG= 1
$$ End of Bruker specific parameters
$$ ---------------------------------
##NTUPLES= NMR SPECTRUM
##VAR_NAME=  FREQUENCY,     SPECTRUM/REAL,   SPECTRUM/IMAG
##SYMBOL=    X,             R,               I
##VAR_TYPE=  INDEPENDENT,   DEPENDENT,       DEPENDENT
##VAR_FORM=  AFFN,          ASDF,            ASDF
##VAR_DIM=   131072,        131072,          131072
##UNITS=     HZ,            ARBITRARY UNITS, ARBITRARY UNITS
##FACTOR=    0.0627417313425165, 1,          1
##FIRST=     8223.62146879498, 338,          -116889
##LAST=      0,             3997,            -117445
##MIN=       0,             -5660152,        0
##MAX=       8223.62146879498, 486549271,    0
$$ Real data points
##PAGE= N=1
##DATA TABLE= (X++(R..R)), XYDATA
$$ [...]
64542 481468 477902 471920 463259 453358 443892 435551 428495 423204 419925 417489 413825 408206 402419 399191
64528 399191 399657 402683 406326 409464 412204 415109 418198 420651 421642 421367 420979 421398 422548 423828 424828
64513 424828 425346 425212 424497 423516 422255 420157 416871 412832 408622 404089 398650 392205 385273 378427 372165
64498 372165 367143 363961 362646 362652 363255 363721 363380 362006 360024 358083 356716 356542 358147 361153 364000 365440
64482 365440 365867 366386 367038 366980 366168 365584 365686 365750 365070 363852 362578 361388 360563 360778 362192 364012 365603
64465 365603 367510 370597 374459 377555 379009 379758 381651 385629 390991 396365 401144 405674 410234 414564
64451 414564 418818 424254 431957 441178 450019 457822 465813 475109 485101 494344 502026 507806 511051 511353
64437 511353 509482 506822 503913 500282 495673 490671 485949 481530 477117 472738 468707 465182 462041 459153
64423 459153 456521 454121 451711 448905 445445 441293 436504 431249 426130 422179 420103 419523 419239 418332 416828
64408 416828 415400 414851 415893 418983 424054 430458 437270 443618 448949 453264 457034 460652 464027 466937
64394 466937 469574 472323 475252 478305 481881 486642 492848 500365 509185 519252 529959 540695 551969
64381 551969 565146 580868 598501 617290 637173 658208 680190 703398 728916 757606 789473
64370 789473 824514 863369 906400 953000 1002807 1057116 1118089 1186816 1262965 1346082 1436332
64359 1436332 1533898 1638054 1746666 1856170 1962524 2062908 2156354 2242326 2319195 2384708
64349 2384708 2437399 2476537 2501018 2509392 2501042 2476630 2437358 2384457 2319198 2242647 2155461 2058597
64337 2058597 1954082 1844422 1731659 1618054 1507332 1403749 1309537 1224195 1146438 1075682
64327 1075682 1011464 953004 900300 854494 815989 782887 752481 723885 698195 676311 657591
64316 657591 640579 624197 608168 593007 579753 569131 560714 553194 545401 536795 527235 516976
64304 516976 506980 498588 492580 488822 486853 486358 486943 488013 489332 491359 494645 499102 504241 509898 516204
64289 516204 522860 528965 533763 537217 539653 541112 541377 540397 538357 535421 531794 528036 524934 522931 521959
64274 521959 521928 523030 525325 528306 531211 533692 536024 538833 542734 547871 553378 557528 558940 557723 554967
64259 554967 551147 545608 537822 528702 520114 513227 507582 501693 494299 485252 475656 467243 461247 457506
64245 457506 454646 451304 447195 443003 439403 436518 434419 433724 435174 438462 441966 444103 444945 446183 449370
64230 449370 454365 459681 464308 468965 475350 484199 494398 504205 513005 521353 529424 536203 540631 543088
64216 543088 545132 547942 551524 555276 558707 561395 562697 561866 558536 553180 547273 542777 540889 541102 541755
64201 541755 541677 541021 540395 539563 537451 533342 527694 521589 515537 509059 501510 493179 485179 478196 471697
64186 471697 464777 457563 451212 446473 442864 439613 436947 435909 437078 439953 443517 446919 449518 450851
64172 450851 451067 451165 452293 454673 457451 459656 461085 462141 463162 464192 465303 466760 468763 471144 473316
64157 473316 474437 473793 471385 468179 465584 464583 465380 467576 470240 471994 471830 470212 468932 469464 471745
64142 471745 474679 477283 478976 479485 479374 480353 484103 490640 498460 506316 514263 522999 533001 544471
64128 544471 557279 570512 582792 593536 603054 610727 613937 610230 600428 588285 576684 565288
64116 565288 552489 538522 525402 514228 504029 493601 483381 474720 467933 462040 456373 451682
64104 451682 449270 449405 450956 452534 453756 455315 457911 461302 464458 466567 467650 468330 469301 471017 473380
64089 473380 475521 476342 475672 474534 473942 473934 474234 475170 476904 478209 477347 474333 471209 469730 469848 470814 472549
64072 472549 475099 477764 479974 482419 486145 490800 494905 497824 500515 504234 509269 515110 521256 527663
64058 527663 534846 543634 554446 566754 579511 591914 603400 613270 621090 627367 633212 639204 645082
64045 645082 650507 655654 661072 667356 674767 682689 689716 694958 699126 703610 708628 713042 715897 717212
64031 717212 717202 715703 712660 708357 702867 695988 687973 679530 670777 661080 650435 640124 631292 623502
64017 623502 615572 607479 600615 596166 593718 591520 587904 582589 576799 572089 569217 568398 570099 574483
64003 574483 580082 584359 586322 587689 590698 595572 600987 606328 612285 619554 628025 637245 646882 656788
63989 656788 667320 679530 694249 710933 728044 744657 761071 777817 794739 811275 827056
63978 827056 841844 855126 866088 874021 878790 880914 880976 878869 874115 867164 859802 853592 848274 842391
63964 842391 835211 827286 819427 812082 805603 800000 794213 786702 777217 767192 757968 749534 741569 734755
63950 734755 730024 727098 724837 722809 721506 721134 721300 722007 723968 727447 731621 735773 740617 747722 757807
63935 757807 770077 783023 795341 806350 816314 826551 838755 853888 871899 892371 914904 938885
63923 938885 963656 989356 1017099 1047780 1081075 1116084 1152632 1191306 1232479 1276025 1322041
63912 1322041 1371259 1424530 1482145 1543588 1607680 1673285 1740545 1811385 1888249 1972321 2063432
63901 2063432 2161462 2267024 2380842 2503571 2636763 2783371 2946849 3130004 3334617 3561312
63891 3561312 3809701 4079664 4372851 4691928 5037827 5408718 5802185 6216891 6650773
63882 6650773 7098662 7553396 8008707 8459186 8897543 9313848 9698157 10042603 10340340
63873 10340340 10583936 10766366 10883502 10934902 10921969 10845395 10704248 10497779 10228754 9905122
63863 9905122 9537888 9137276 8711389 8268024 7815873 7362854 6914215 6473640 6045958
63854 6045958 5637646 5254384 4898744 4570400 4268015 3990684 3738009 3509344 3303156
63845 3303156 3117110 2948791 2796302 2658226 2533158 2419369 2314806 2217480 2126156 2040786
63835 2040786 1961897 1889233 1821248 1756307 1694192 1635915 1582136 1532375 1485926 1442860 1403558
63824 1403558 1367681 1334397 1303618 1276287 1253234 1234490 1220081 1210701 1206671 1206605 1208242 1210716 1215111
63811 1215111 1222520 1232474 1243796 1256156 1269949 1285145 1301239 1318172 1336313 1355179 1372774 1386767
63799 1386767 1396382 1402950 1408444 1413437 1416657 1416693 1413653 1408414 1400565 1388349 1371039 1350206 1327850
63786 1327850 1304204 1278369 1250301 1220850 1190254 1157953 1123880 1088905 1053970 1019642 986339
63775 986339 954070 922180 890429 860120 832828 808029 783470 758141 733519 711442 692125
63764 692125 674756 658685 643293 628067 613749 602151 593742 586568 578765 570966 564696 559421 553216
63751 553216 545928 539648 535798 533467 531145 528634 526519 524802 522928 520494 517251 512925 507600 501941
63737 501941 496569 491459 486297 481133 476388 472410 469212 466438 463489 459983 456258 453137 451013 449382
63723 449382 447414 444841 442167 440134 438957 437933 435882 432302 428112 424996 423914 424336 424785 423919 421393
63708 421393 418150 415821 415284 415709 415394 413659 411614 411024 412681 415781 418513 419386 418594 418089 419718 423147
63692 423147 426214 427436 427446 427694 428668 430089 432151 435543 440407 446119 452097 458068 463398 466981 468336
63677 468336 468519 469372 471812 475069 477756 479646 482187 487061 494299 502232 509458 516416 524543 534110 543585
63662 543585 551168 556424 560150 563122 565436 566802 567006 565999 563836 560680 556889 553077 550029 548281
63648 548281 547647 547328 546681 545776 545059 544718 544759 545502 547413 550284 553152 555421 557722 561155 565855 570820
63632 570820 575147 578905 582656 586522 590042 592703 594435 595746 597405 599643 601514 601488 599132 595903 593856
63617 593856 593719 594661 595688 596590 597544 598571 599730 601248 602987 604219 604466 604379 605148 607011 608770 608908
63601 608908 606819 602808 597226 590156 582045 574289 568645 565836 564899 564216 563101 562138 562141 563277 565209 567520
63585 567520 569758 571623 573492 576277 580288 584702 588798 593266 599470 607648 616779 626177 636157 646980
63571 646980 658319 670262 683828 699715 717273 735604 755049 776581 800139 824578 849155
63560 849155 874129 900144 928018 959073 994399 1033389 1073987 1114840 1156398 1199374 1242919
63549 1242919 1284963 1323752 1358328 1387995 1412179 1430608 1443031 1448964 1448418 1442772 1434244 1424308
63537 1424308 1412996 1399756 1384576 1368118 1350985 1332902 1312572 1288575 1260745 1230616 1200333
63526 1200333 1171297 1143940 1118232 1093875 1070375 1047788 1027412 1011041 999352 991435 986041 982753
63514 982753 981789 983212 986855 992736 1001024 1011479 1023219 1035273 1047367 1059985 1073619 1088185 1103510
63501 1103510 1120128 1139012 1160440 1183824 1208809 1235807 1265041 1296023 1328768 1364701 1405158
63490 1405158 1449418 1495324 1541401 1586789 1629044 1663744 1687031 1697809 1697236 1687490 1671683 1653577
63478 1653577 1635864 1619044 1602563 1586332 1570353 1553719 1535238 1514583 1491751 1465761 1435113
63467 1435113 1399514 1360175 1318466 1275401 1232454 1191532 1153423 1117073 1081149 1045950 1013239
63456 1013239 984401 959133 935796 912838 889984 868302 849161 833176 820117 809382 800162
63445 800162 791471 782751 774459 767486 761938 757061 752389 748220 744683 741061 736522 731103 725530 720506
63431 720506 716633 714562 714484 715578 716559 716838 716782 716926 717418 718305 719901 722628 726587 731282 735568 738078
63415 738078 738226 736896 735606 734729 732977 729071 723580 718483 715009 712562 709899 706800 704191 703080 703839
63400 703839 706329 710105 714474 718857 723248 728105 733711 740007 747087 755507 765844 778299 792906
63387 792906 809762 828720 849166 870653 893553 918560 945622 973993 1003517 1035240 1070268
63376 1070268 1108231 1147250 1185190 1220628 1252831 1281528 1307048 1330442 1353193 1376808 1402603
63365 1402603 1431507 1463807 1499334 1538139 1580667 1626758 1674605 1721316 1764622 1803539 1837261
63354 1837261 1864179 1882624 1892180 1893773 1888838 1878942 1865776 1850490 1832998 1812763 1790310 1767087
63342 1767087 1743493 1717885 1688053 1653144 1613713 1570720 1525374 1479528 1435117 1393031 1353115
63331 1353115 1315387 1280617 1249501 1221742 1196425 1173226 1153028 1137234 1126463 1119980 1116470 1115283
63319 1115283 1116682 1120991 1127996 1137346 1149035 1163202 1179863 1199160 1221384 1246204 1272205 1297839
63307 1297839 1322731 1347696 1373941 1402872 1436181 1474781 1517343 1560817 1602933 1643715 1684174
63296 1684174 1724081 1761337 1792907 1815888 1828502 1831226 1826994 1819350 1809857 1797568 1781135 1761009
63284 1761009 1739338 1718061 1697385 1675748 1650783 1620567 1584744 1544818 1503009 1460520 1417165
63273 1417165 1372767 1328372 1285590 1245289 1207761 1173838 1144676 1120369 1099932 1083036 1070488
63262 1070488 1061980 1054326 1043410 1027658 1008494 987624 965309 941574 917679 895418 875576 857777
63250 857777 841405 826067 811505 797715 785029 773722 763715 755010 748017 742891 738737 734191
63238 734191 728859 723629 719369 715782 711935 707431 702509 697131 690678 682872 674513 666824 660246 654378
63224 654378 648957 644236 640269 636546 632840 629790 627903 626445 624321 622025 621539 623810 627213 629371
63210 629371 629961 630731 632917 635701 637512 637943 637800 638014 639366 642808 648790 656119 662689 667913 673500
63195 673500 680968 689282 696243 701672 707649 715683 725386 736363 749549 765423 782256 797802 812111
63182 812111 827191 844369 863489 884459 907842 933588 960614 988262 1017051 1047378 1078415
63171 1078415 1109024 1139034 1168951 1198943 1228722 1257926 1286203 1313442 1340368 1368165 1396836
63160 1396836 1424563 1449551 1472117 1494101 1516574 1538997 1560354 1579939 1596847 1609739 1617691
63149 1617691 1620729 1619092 1612462 1600473 1583623 1563081 1539714 1513920 1486532 1459347 1434359 1412640
63137 1412640 1394242 1378991 1366897 1357819 1351256 1346839 1344698 1345060 1347683 1352138 1358500 1367307 1378825
63124 1378825 1392703 1408482 1426156 1446107 1468529 1492818 1517418 1540605 1561795 1581879 1601837
63113 1601837 1621305 1639131 1655073 1669960 1684050 1696243 1705339 1711138 1713442 1710725 1700985 1683896
63101 1683896 1661222 1634935 1605575 1572769 1536775 1499006 1461169 1424289 1388628 1354195 1321015
63090 1321015 1288909 1257463 1226736 1197996 1173271 1153768 1138777 1126233 1114229 1101985 1089769
63079 1089769 1078344 1068483 1060610 1054626 1050037 1046394 1043737 1042665 1043869 1047414 1052433 1057630 1062252 1066724
63065 1066724 1072414 1080609 1091352 1103191 1114336 1124132 1133111 1141569 1148715 1153597 1156289 1157594 1158053
63052 1158053 1158030 1158408 1160188 1163345 1166838 1169896 1172566 1174881 1176306 1176499 1176141 1176573 1178722 1182373 1186285
63037 1186285 1189142 1190788 1192321 1194473 1196366 1196753 1196237 1197012 1200169 1204354 1207514 1209078 1210087 1212076 1216295
63022 1216295 1223067 1231247 1238981 1245516 1251691 1258427 1265746 1273690 1282946 1293724 1305184 1317055 1330825
63009 1330825 1347973 1367705 1387899 1407947 1429374 1453924 1482351 1514941 1551779 1592126 1634611
62998 1634611 1678571 1724697 1774188 1827694 1884914 1944700 2005694 2067457 2130752 2196166 2262985
62987 2262985 2330229 2398110 2467067 2535713 2601425 2663259 2722795 2781664 2839674 2896106 2951376
62976 2951376 3006088 3059264 3108842 3153624 3193605 3228388 3256193 3274607 3281819 3277205 3261357 3235748
62964 3235748 3201850 3160298 3111057 3054461 2991873 2925289 2856678 2787925 2721171 2658763 2602642
62953 2602642 2553811 2512261 2477198 2447496 2422605 2403450 2392038 2389557 2395043 2406525 2423259 2445869
62941 2445869 2474165 2505905 2538404 2570688 2603443 2637405 2672519 2708298 2744261 2780118 2815832
62930 2815832 2851104 2884480 2913662 2937277 2955723 2969511 2977468 2977500 2968672 2951482 2926505 2893822
62918 2893822 2853498 2805403 2748808 2683488 2611329 2535665 2458762 2381008 2302690 2225332 2150777
62907 2150777 2079943 2013022 1950028 1890623 1834096 1779995 1728284 1678666 1630670 1584785 1542590
62896 1542590 1504924 1470434 1436699 1402558 1368857 1337211 1308453 1282093 1256908 1232113 1207986
62885 1207986 1185165 1163465 1141917 1120015 1098502 1078896 1062618 1050210 1040591 1031240 1020073 1007355
62873 1007355 995087 984629 975911 968774 963553 959895 956496 952856 950095 949043 948480 946489 942901 939224
62859 939224 936482 934117 930906 926244 920574 914950 909992 905116 899421 893472 889169 887290 886253 884220
62845 884220 881390 879010 877128 874940 872886 872499 874087 876068 877018 877181 877577 878780 881133 885038 890079
62830 890079 894453 896205 895020 892302 889616 887461 885496 883547 882054 881491 881535 881172 879773 877762 875967
62815 875967 874529 872707 869576 864765 858857 853366 849812 848264 847020 844339 840309 836589 834497 833904
62801 833904 833807 833349 832354 831389 831353 832538 834159 835287 836128 837793 840780 844219 846776 847886 847960 847715 847478
62784 847478 847088 846492 846310 847296 849024 849840 848756 846854 845926 846210 846572 846645 847351 849046 850541 850687 850053
62767 850053 850242 852216 855919 860913 866530 871907 876788 882009 888293 894697 899309 901822 904637 910769
62753 910769 920933 933040 944355 953749 962021 970552 979982 990119 1000944 1013437 1028989 1047755
62741 1047755 1067911 1087172 1105139 1123568 1144129 1166637 1190076 1214667 1241887 1272726 1307156
62730 1307156 1345325 1387974 1435236 1486279 1540927 1600527 1666085 1736356 1809107 1883821 1961924
62719 1961924 2044611 2131712 2222484 2315884 2409631 2500302 2585097 2662840 2732908 2794077 2844926
62708 2844926 2884474 2911712 2925205 2923903 2907876 2877686 2833680 2776699 2708949 2633217 2551441
62697 2551441 2464849 2375208 2284778 2194879 2105497 2016822 1930458 1848475 1771711 1699743 1632300
62686 1632300 1569895 1512779 1459940 1409880 1362349 1318737 1280453 1247238 1217438 1189696 1163878
62675 1163878 1140441 1119621 1101586 1086823 1075654 1067359 1060392 1053752 1047904 1044120 1043084 1044360 1047103
62662 1047103 1050972 1056396 1064256 1075327 1089612 1105988 1122945 1140202 1159382 1182545 1210176 1241185
62650 1241185 1274735 1311145 1350790 1393159 1437807 1485575 1537986 1595661 1657988 1724070 1793317
62639 1793317 1865473 1940890 2020466 2104192 2189799 2273960 2355130 2434077 2511070 2583450 2646746
62628 2646746 2697541 2734482 2757173 2765204 2758283 2736508 2700332 2650756 2589678 2519627 2442893 2361018
62616 2361018 2275019 2185934 2095238 2004888 1916833 1832313 1751837 1675987 1605720 1541377 1481783
62605 1481783 1425145 1370937 1320347 1274784 1234426 1198289 1165079 1133728 1103746 1075518 1049854
62594 1049854 1026750 1004989 983517 962901 944714 929548 916389 903932 891770 880123 869284
62583 869284 859852 852739 848139 844922 841896 839372 838505 839093 838995 836155 830551 823912 818071 813960 811609
62568 811609 810504 810170 810736 812682 815918 819546 822844 825962 829281 832655 835870 839465 844394 851039 859063
62553 859063 867987 877438 887122 897146 908161 920582 933924 947648 962427 979664 999751 1021714
62541 1021714 1044849 1069906 1098271 1130528 1166275 1204835 1245667 1288266 1332021 1376088 1419374
62530 1419374 1460923 1500304 1537287 1571077 1600301 1623752 1640622 1649986 1650808 1643028 1628170 1608299
62518 1608299 1584486 1556623 1524453 1488339 1449130 1407769 1365235 1322679 1281387 1242399 1206042
62507 1206042 1171923 1139511 1108690 1079550 1051888 1025323 999960 976652 956578 940655 929024
62496 929024 920544 913053 904956 896725 890196 886235 883780 881406 878965 877081 875786 874623 873828 874413 876915
62481 876915 880699 884829 889248 894718 901641 909215 915946 921102 925541 931033 938866 949379 962662 979025
62467 979025 998442 1019938 1042178 1064795 1088916 1116181 1147317 1181783 1218858 1258716 1301960
62456 1301960 1348191 1395951 1444634 1495726 1551112 1610371 1670869 1730549 1789506 1848380 1906195
62445 1906195 1960588 2009619 2052650 2089732 2120821 2145628 2164065 2176932 2186194 2194284 2203066 2213806
62433 2213806 2227837 2246386 2269682 2297288 2329686 2368519 2414564 2466315 2521323 2578183 2636452
62422 2636452 2695302 2753147 2807864 2856304 2894284 2918542 2928651 2925965 2910846 2882052 2838626
62411 2838626 2781010 2710236 2627575 2535496 2437653 2337060 2235028 2132533 2031776 1935547
62401 1935547 1845549 1762084 1684883 1613634 1548249 1489336 1437977 1394172 1355888 1320643 1288003
62390 1288003 1259616 1236787 1218958 1204739 1193307 1184085 1175940 1167940 1160746 1156172 1155027 1156052 1157338
62377 1157338 1158148 1158755 1158959 1157691 1154234 1149189 1143766 1138314 1131885 1123331 1112674 1101234 1090238 1079429
62363 1079429 1067510 1054115 1040753 1029142 1019031 1008624 997087 985603 975627 967075 958818 950181
62351 950181 941200 932077 923312 916045 911276 908835 907780 907640 908571 910529 913202 916736 921515 927122 932528
62336 932528 937726 944129 952535 961330 967808 971296 974252 979987 989659 1001665 1013746 1025319 1037638
62323 1037638 1051926 1067881 1084296 1100728 1117912 1136590 1156684 1177869 1200332 1224409 1249808
62312 1249808 1275735 1301733 1328123 1355767 1385729 1418977 1455951 1496397 1539935 1586907 1638435
62301 1638435 1695588 1758576 1826592 1898102 1971418 2045562 2120707 2197092 2272893 2343474 2403593
62290 2403593 2450568 2484975 2508451 2521657 2524658 2518222 2503749 2482192 2453923 2419486 2379568 2334242
62278 2334242 2283261 2227499 2169247 2110650 2052616 1995815 1941821 1892194 1846872 1804568 1764606
62267 1764606 1727388 1693031 1660617 1629019 1597586 1565681 1532502 1498138 1464209 1432588 1403688
62256 1403688 1376631 1350881 1326944 1305398 1285993 1268118 1251771 1237614 1226211 1217498 1210893 1205655
62244 1205655 1201246 1197762 1196025 1196791 1199572 1202484 1203632 1202652 1200823 1199947 1201316 1205291 1211197 1217633 1223470
62229 1223470 1228709 1234081 1239914 1245934 1251982 1258070 1263623 1267709 1270592 1274304 1280943 1290926 1303492 1318172
62215 1318172 1334863 1352983 1371727 1391026 1411383 1432900 1455474 1479874 1507508 1538916 1573432
62204 1573432 1610655 1651356 1696637 1747069 1803033 1864878 1932020 2002649 2075196 2149487 2225504
62193 2225504 2301448 2373957 2440009 2497617 2544932 2580089 2602602 2614018 2616361 2610224 2594829 2569471
62181 2569471 2534173 2489100 2434347 2370734 2300349 2225785 2149099 2071936 1996430 1925201 1860107
62170 1860107 1801351 1748149 1699976 1656694 1617640 1581323 1546520 1513582 1484248 1459947 1440317
62159 1440317 1423464 1407554 1391890 1376469 1361135 1345849 1331593 1320060 1312039 1306612 1302404 1299177
62147 1299177 1297688 1298314 1300566 1303890 1308328 1314251 1321862 1331057 1341452 1352459 1363679 1375310 1387916
62134 1387916 1401673 1416064 1430440 1444738 1459633 1476001 1494173 1513549 1533078 1552268 1571626
62123 1571626 1591982 1613536 1635637 1657158 1676930 1694348 1710156 1726292 1744381 1764489 1785897
62112 1785897 1808853 1834793 1864884 1899131 1937161 1979127 2025328 2075288 2127555 2180239 2231427
62101 2231427 2279177 2321364 2355831 2381077 2397024 2404799 2405417 2398899 2385047 2364582 2338753 2308016
62089 2308016 2271939 2230450 2184450 2135099 2083405 2030785 1979172 1930010 1883722 1840660 1801973
62078 1801973 1768780 1740797 1716450 1694324 1674000 1655493 1638378 1621735 1604802 1587511 1570509
62067 1570509 1554786 1541224 1530184 1521246 1513488 1506463 1500964 1498357 1499091 1502408 1507542 1514247 1521641
62054 1521641 1527617 1530469 1530356 1528094 1523324 1515507 1506390 1499468 1496510 1495832 1494359 1490069 1482219 1470931
62040 1470931 1457592 1444576 1433481 1424167 1415955 1408826 1403027 1398635 1396253 1396988 1400851 1406269 1412177
62027 1412177 1419508 1429476 1441450 1453976 1467019 1481568 1497643 1514488 1532542 1553463 1577995 1605191
62015 1605191 1634012 1664393 1696322 1729024 1761661 1794163 1826905 1860172 1894219 1929306 1965329
62004 1965329 2001662 2037448 2071776 2103754 2132653 2157568 2176510 2186644 2186457 2177322 2161942 2141663
61992 2141663 2116469 2086962 2054383 2018457 1977159 1929511 1877320 1823280 1768600 1713564 1659361
61981 1659361 1607795 1559475 1513482 1468882 1425797 1385029 1347305 1312957 1281806 1253179 1226333
61970 1226333 1201003 1177535 1156536 1138343 1122518 1107850 1093161 1078160 1063207 1048403 1033564
61959 1033564 1019075 1005940 994657 984662 975242 966326 958027 950116 942541 935890 930752 927085 924736
61946 924736 923976 924841 926460 927854 929032 930552 932445 934503 937229 941269 945890 949181 950057 949123 947298
61931 947298 944514 940241 934384 927016 917928 907150 895420 883436 871146 858513 846557 836674 829066
61918 829066 822708 816880 811808 807657 803855 799959 796478 794208 793109 792437 791700 790863 789865 788601 787459
61903 787459 787403 789388 793937 801087 810261 820175 829494 837830 845786 853975 862484 871492 881798 894218
61889 894218 908779 925022 942877 962697 984446 1007442 1031133 1055798 1082127 1110244 1139409
61878 1139409 1168786 1198300 1228459 1259202 1289177 1316559 1340639 1362363 1383138 1403286 1421841
61867 1421841 1437629 1450254 1459988 1466996 1470980 1471723 1469764 1466096 1461146 1454653 1447112 1440895 1439029 1442694
61853 1442694 1450486 1460281 1471218 1483728 1498387 1515288 1534090 1554046 1574029 1592794 1609133 1621867
61841 1621867 1630144 1633908 1633622 1629390 1620847 1608017 1591716 1572999 1552954 1533200 1515482 1500154
61829 1500154 1485907 1471595 1457412 1443502 1428538 1410985 1391131 1370546 1350094 1329796 1310203
61818 1310203 1292170 1275261 1257936 1239732 1222068 1206628 1194086 1184672 1178667 1175732 1174783 1175157 1177153
61805 1177153 1181150 1187205 1195977 1208838 1226227 1246807 1269156 1293572 1321322 1352731 1387027 1423667
61793 1423667 1462846 1504782 1549147 1595136 1641656 1687677 1732824 1777237 1820440 1860721 1896146
61782 1896146 1925782 1949395 1966480 1976403 1979330 1976338 1968796 1958200 1946388 1935077 1925090 1916565
61770 1916565 1910001 1906637 1907769 1913954 1924706 1938437 1952745 1965252 1974364 1979144 1978770 1972658 1960943
61757 1960943 1944240 1922774 1896198 1864421 1828310 1789403 1749171 1708624 1668456 1629328 1591844
61746 1591844 1556034 1520899 1485034 1448143 1411706 1377731 1347042 1319204 1293719 1270509 1249219
61735 1249219 1228989 1209479 1191621 1176655 1164488 1153510 1142157 1130367 1119385 1110379 1103403 1097547
61723 1097547 1091839 1086048 1080838 1077044 1074526 1071810 1067423 1061820 1057470 1056538 1058788 1062294 1065886 1070204
61709 1070204 1076468 1085025 1095250 1106249 1117474 1129049 1141543 1154977 1168191 1179957 1190665 1201969
61697 1201969 1214540 1227034 1237515 1244957 1248956 1249104 1245461 1238826 1229731 1217806 1202930 1186268 1169321
61684 1169321 1152654 1136565 1122171 1110339 1099912 1088588 1075738 1063102 1052475 1043863 1036232 1028945
61672 1028945 1021907 1015215 1009380 1005300 1003298 1002582 1002134 1001797 1001967 1002478 1002383 1000933 998510 996370 995434 995374
61656 995374 995052 993877 992413 991503 991201 990873 989817 987339 982680 975709 967449 959168 951082 942531 933216
61641 933216 923505 913881 904944 897629 892198 887194 880804 873320 866714 861482 855716 848231 840876 836093
61627 836093 833362 829979 824806 819289 814688 810196 804509 797965 792165 788109 785480 783411 781380 779595
61613 779595 778902 780169 783331 787071 789662 790224 789316 788518 789358 792192 795953 799313 802260 806126 811789
61598 811789 818198 823308 826377 828782 832357 837324 842219 845524 847001 847600 848569 850720 854113 858240 862733
61583 862733 867878 874115 881035 887456 892572 896306 898300 897643 894544 891386 890561 891377 890609 886316 879736
61568 879736 872961 866250 858779 850958 844398 839801 836048 831488 825354 817953 810167 802831 796112 789556
61554 789556 783186 778126 775330 773834 771201 765905 758600 750944 743897 737412 731024 724247 716765 708579
61540 708579 699812 690473 680979 672814 667662 665467 664143 661775 658469 655431 653022 650620 647935 645288
61526 645288 642773 640161 637746 636294 635870 635519 634515 633280 632685 633043 634199 635958 637788 638632 637918 636524
61510 636524 636007 636857 638204 639306 640652 643292 647586 652908 658235 662771 666400 669897 674327 679812 685085
61495 685085 688742 690819 692554 694607 696134 696051 694744 693921 694816 697026 699284 700925 702167 703252 704004
61480 704004 704420 705154 706876 709400 712004 714607 717894 722036 725845 727813 727759 726875 726189 725498 723936 721126
61464 721126 717502 713811 710568 707871 705543 703471 701835 700904 700586 700557 700914 702312 705044 708371 711315
61449 711315 713961 717245 721364 725145 727480 728807 730500 733115 736094 739128 742906 748115 754419 761039
61435 761039 767950 775844 785035 794944 804551 812819 818792 822032 823368 824705 827610 832099 836937 840869
61421 840869 843450 845029 846188 847067 847046 845362 842240 839121 837368 836875 836290 834487 831512 828141 824954
61406 824954 821954 818884 815636 812329 808972 805213 800735 796081 792719 791776 792709 793621 793050 791196 789298
61391 789298 788171 787678 787557 788251 790512 794281 798437 802036 805475 809882 815420 820836 824978 828165 831610
61376 831610 835930 840825 845954 851321 856689 861199 864016 865341 866679 869983 876140 884036 891407 896987
61362 896987 901614 906901 913205 919409 924377 927810 929845 930731 931039 931429 931851 931504 929781 926799 922938
61347 922938 918574 914459 911562 910098 909322 908585 907801 906533 903736 899431 895772 895019 896714 898185 897923
61332 897923 897228 898199 901213 905058 908746 912310 916193 920631 925653 931193 937102 943211 949391 955486 961425
61317 961425 967508 974262 981744 989355 996678 1004210 1012547 1020801 1026651 1028544 1027558 1026378 1026406 1026468 1024677
61302 1024677 1020966 1017100 1014459 1012777 1011346 1010577 1011615 1014828 1019499 1024975 1031334 1038771 1046981 1055455
61288 1055455 1063863 1071765 1078479 1083805 1088648 1094203 1100399 1105701 1108758 1109975 1111028 1112884 1114747 1115247
61274 1115247 1114314 1113305 1113212 1113436 1112788 1111118 1109118 1106899 1103895 1100403 1098042 1098037 1099892 1102522 1105839 1110188
61258 1110188 1114897 1118932 1122865 1128684 1137294 1147554 1158369 1170440 1184907 1201226 1217720 1233691
61246 1233691 1249740 1266181 1282376 1297694 1311891 1324146 1332734 1336392 1335564 1331815 1326457 1320118 1313137
61233 1313137 1305590 1296981 1286450 1273541 1258735 1243352 1229005 1216854 1207028 1198688 1190785 1182920
61221 1182920 1175650 1170185 1167685 1168441 1171565 1175606 1179614 1183526 1187703 1192481 1198183 1205057 1212849 1220698
61207 1220698 1227774 1233904 1239431 1244684 1249899 1255611 1262820 1272464 1284514 1297611 1309885 1320376 1329378
61194 1329378 1337184 1342994 1345792 1345982 1345299 1345066 1345321 1345638 1345708 1344777 1341589 1335624 1327818 1319555 1311653 1304745
61178 1304745 1299558 1295844 1291891 1286400 1280398 1276104 1274128 1273059 1271772 1270931 1271876 1274992 1279566 1284636
61164 1284636 1289686 1295072 1301931 1311096 1321927 1332593 1341577 1348545 1354031 1359019 1364712 1371665 1378926
61151 1378926 1384837 1389012 1392724 1397098 1401871 1406562 1411944 1419216 1428001 1436254 1442565 1448065 1455575 1466974
61137 1466974 1481677 1497745 1514044 1530792 1548135 1565077 1580165 1592473 1601324 1605887 1606140 1603699
61125 1603699 1600394 1596129 1589365 1579707 1568714 1557830 1546798 1534677 1521394 1507580 1493632 1479642
61113 1479642 1465727 1451952 1438396 1425516 1413682 1402071 1388926 1373490 1356901 1340652 1325033
61102 1325033 1309785 1295386 1282654 1271582 1261493 1252056 1243505 1236217 1230741 1227761 1227294 1228424 1230584
61089 1230584 1234581 1241262 1249360 1255707 1257782 1255465 1250340 1244010 1237256 1230235 1223114 1216537 1211405 1208182
61075 1208182 1206805 1207393 1210425 1215830 1222487 1229399 1237047 1246948 1260106 1276356 1294896 1314836 1335586
61062 1335586 1357486 1381880 1409850 1440832 1472976 1504874 1536518 1568670 1601692 1634983 1667340
61051 1667340 1698044 1727687 1757585 1788140 1818197 1846112 1870906 1892283 1910470 1926421 1941169
61040 1941169 1954249 1963669 1968215 1968894 1967345 1964000 1958988 1953618 1949116 1944574 1938083 1929782 1922100 1917039
61026 1917039 1914822 1915319 1919069 1926411 1936878 1949864 1964905 1981205 1998158 2016488 2037585 2061501
61014 2061501 2086997 2113735 2142823 2174691 2207987 2241320 2274625 2307956 2340405 2371365 2401595
61003 2401595 2431721 2460638 2486663 2509539 2530022 2548313 2564281 2578739 2592953 2607026 2620076
60992 2620076 2631971 2643629 2655468 2666923 2678016 2690450 2706300 2726127 2749030 2774211 2801740
60981 2801740 2831947 2865074 2902081 2945142 2996300 3055509 3120853 3191037 3266925 3350292 3442024
60970 3442024 3542400 3652199 3772167 3901870 4040450 4188300 4346590 4515333 4693750
60961 4693750 4883045 5087533 5312592 5562785 5842232 6154899 6503197 6887251 7306853
60952 7306853 7763913 8262963 8810554 9415134 10086940 10837503 11679733 12628147 13697667
60943 13697667 14902755 16260766 17797908 19550570 21558926 23855340 26444866 29270904
60935 29270904 32178307 34914143 37196907 38827668 39769534 40143639 40159677 40039017 39962505
60926 39962505 40030398 40221100 40373616 40233739 39561326 38236975 36299623 33903132 31239991
60917 31239991 28485834 25779182 23219303 20867507 18751530 16874619 15225127 13783241
60909 13783241 12526100 11431900 10480957 9654096 8931939 8296323 7731477 7224142 6764396
60900 6764396 6346521 5967154 5621824 5304517 5010819 4739621 4491204 4265269 4061304
60891 4061304 3878546 3714089 3562697 3420031 3284954 3157581 3036767 2921170 2811247
60882 2811247 2707950 2610271 2516282 2426079 2341461 2262813 2188484 2117548 2051094 1989985 1933046
60871 1933046 1878616 1826736 1778603 1734630 1694081 1656176 1620576 1587037 1555433 1526159 1499839
60860 1499839 1476488 1455445 1436186 1418757 1403085 1388303 1373313 1357998 1343401 1330522 1319425
60849 1319425 1309826 1301945 1296002 1291059 1285295 1277648 1268455 1258332 1247239 1235106 1222646 1210740 1199329
60836 1199329 1187501 1174502 1160314 1145577 1131329 1118441 1106816 1095388 1083261 1070515 1057648
60825 1057648 1044872 1032518 1021426 1012052 1003613 995002 986296 978338 971072 963422 954939 946558 939386
60812 939386 933562 928751 925155 923507 924339 927423 931637 935461 938175 940656 944446 950004 956487 963183
60798 963183 970138 977049 982578 985555 986335 986229 986069 985999 986343 987730 990230 992835 994011 992815 989696 986277
60782 986277 983844 981756 977883 970969 961952 952420 942549 931497 919272 906884 894795 882566 870319
60769 870319 859252 850063 841923 833892 826542 821106 817391 813663 808634 802722 797134 792244 787164 780710
60755 780710 772653 764152 756790 751021 745854 740341 734922 730738 727968 725704 723321 721047 719086 717116
60741 717116 715053 713487 712877 713034 713892 716014 719501 722939 724399 723381 721121 719249 718828 720409 723950
60726 723950 728591 733283 737831 742602 747177 750251 751308 751544 752432 753852 754388 753248 751243 749842 749685
60711 749685 750085 749740 747840 744505 740251 735299 729787 724438 720358 717987 716816 716365 716823 718278 719908
60696 719908 720615 720125 718826 716907 714493 712564 712740 715712 720241 724142 726173 726855 727662 729521 731930
60681 731930 733345 732445 729084 724250 719289 715069 711437 707328 701858 695558 690176 686995 685840 686009 687423
60666 687423 690130 693401 696419 699500 703375 707400 709952 710884 712174 715372 719535 722704 724528 726293
60652 726293 728912 732085 735220 738003 740063 740989 740926 740475 740025 739764 740188 741614 743032 742467 738979 733662
60636 733662 728338 723970 720714 718584 717249 715824 713857 712086 711237 710366 707658 703059 699018 698069 700369
60621 700369 704109 707676 710688 713408 716109 719149 723018 727899 733201 737614 739748 739070 736397 733198
60607 733198 730186 726896 722854 718553 714653 710685 705706 700307 696852 697069 700099 703650 706579 709454
60593 709454 712749 715662 717168 717687 718982 722456 727828 733365 737081 737866 735984 732838 730027 728195 726694
60578 726694 724503 721402 718032 714881 711762 708483 705466 703224 701609 700286 699731 700895 703716 706825
60564 706825 709085 710766 712675 714731 716112 716474 716322 716327 716940 718541 721286 724683 727818 730160 731868 733405
60548 733405 735232 737689 740577 742939 744033 744586 746293 749771 753773 756954 759697 763505 769049 775565
60534 775565 781824 786881 790096 791468 792194 794178 798487 804619 811423 818157 824278 828764 830525 829589 827361
60519 827361 825559 825184 826669 830556 837405 846985 857996 868997 879581 890457 902541 916295 931836
60506 931836 949136 967712 986434 1004100 1020164 1034539 1046732 1055615 1060307 1061118 1059491 1057134 1055220
60493 1055220 1054146 1053806 1054175 1055685 1058991 1064388 1071715 1080996 1092823 1107776 1125592 1145392 1166806
60480 1166806 1190511 1217522 1248281 1282618 1320210 1360625 1402980 1445977 1488312 1528616 1564936
60469 1564936 1594730 1615861 1627572 1630291 1624731 1611604 1592225 1568868 1544127 1519881 1496977 1475716
60457 1475716 1456455 1439753 1426222 1416489 1411226 1410941 1415414 1423378 1433194 1444210 1457438 1474598 1496545
60444 1496545 1522902 1553193 1587851 1627945 1674392 1727734 1788190 1855158 1926736 2000421 2074461
60433 2074461 2147947 2219387 2286030 2345403 2397170 2442637 2482581 2516559 2544584 2568252 2589049
60422 2589049 2605810 2614734 2611892 2595075 2563364 2516164 2453477 2376726 2288792 2193390 2094559 1996086
60410 1996086 1900623 1809455 1723401 1643566 1570668 1504130 1442818 1386683 1336832 1293851 1256835
60399 1256835 1224355 1195573 1169908 1146341 1123841 1102308 1082444 1064713 1048828 1034177 1020367
60388 1020367 1007289 994920 983189 972034 961584 952139 943752 936037 928846 922966 919310 917265 914771
60375 914771 910664 906196 903391 902435 901656 899752 896919 893683 889766 884699 879033 874324 871790 871132 870701
60360 870701 869081 866604 864902 864780 865170 864759 863903 863987 865449 867639 870294 873671 877216 879711 881175 883198
60344 883198 886647 890401 893280 895937 899467 903117 905138 905680 907262 912046 919643 927960 935404 941902
60330 941902 948219 954750 961014 966401 971194 976233 981411 985519 988268 991526 997292 1004924 1011715 1016029
60316 1016029 1018639 1021057 1023984 1027637 1032133 1036852 1040606 1043324 1046768 1052679 1060685 1068737 1075171 1079772
60302 1079772 1083378 1087198 1092165 1098227 1104488 1110598 1117669 1127116 1138795 1150965 1162034 1171728 1180646
60289 1180646 1189299 1197678 1205166 1210720 1213575 1213925 1212502 1209366 1203600 1194605 1183525 1172963 1165107 1160101
60275 1160101 1156271 1151945 1146914 1141948 1137118 1131271 1123540 1114817 1107011 1101013 1096071 1091093 1085750 1080131
60261 1080131 1074322 1069113 1066510 1068400 1074495 1082348 1089747 1096631 1104467 1114402 1126716 1141656 1159652
60248 1159652 1180196 1201136 1219862 1235316 1248623 1261715 1275447 1288907 1300293 1308310 1312724 1313430
60236 1313430 1309220 1298181 1279887 1256851 1233031 1210769 1189656 1168421 1147192 1127496 1110608
60225 1110608 1096595 1084834 1074841 1066424 1059422 1053622 1048745 1044275 1039380 1033377 1026399 1019283 1012520
60212 1012520 1005585 997845 989978 983670 979608 976542 972950 969057 966299 965215 964912 964593 964536 965183 966130
60197 966130 966530 966038 964949 963807 963145 963242 963951 965140 967316 971037 975577 979089 980617 981117 981860 982665
60181 982665 982694 982405 983447 986684 991264 995703 999143 1001562 1003586 1006208 1009971 1014272 1018184 1022151 1028015
60166 1028015 1036867 1047465 1057399 1065484 1072457 1079646 1087695 1096617 1106383 1117025 1128444 1140525 1153283
60153 1153283 1166575 1179777 1192236 1204078 1215974 1227911 1238836 1248165 1257034 1267034 1277921 1287668
60141 1287668 1294982 1300695 1306314 1312242 1318114 1323958 1329994 1335712 1340131 1342808 1344007 1344049 1343110 1341374 1338820
60126 1338820 1335154 1330442 1325408 1320468 1314991 1308398 1301569 1296072 1292235 1289100 1286330 1284857 1285170 1285984
60112 1285984 1285394 1282888 1279545 1276487 1273672 1270228 1265688 1260582 1255683 1250921 1245678 1240245 1236044 1233840
60098 1233840 1232536 1230742 1228908 1228713 1230647 1233475 1235968 1237908 1239339 1240204 1241088 1243095 1246467 1250232 1253541
60083 1253541 1256297 1258238 1258758 1258368 1259060 1262180 1266815 1271343 1275799 1281603 1289465 1298715 1308349 1317639 1325863
60068 1325863 1332464 1337668 1342288 1346875 1351522 1356455 1362241 1369314 1377636 1386784 1396209 1405559 1414987 1424915
60054 1424915 1435394 1446122 1457207 1469231 1482111 1494538 1505170 1513922 1521489 1528155 1533799 1538567
60042 1538567 1542595 1545334 1546071 1545044 1543283 1541428 1539487 1537613 1536158 1534835 1532751 1529559 1525862 1522083
60028 1522083 1517514 1510958 1501884 1490564 1477431 1462804 1447158 1431220 1415603 1400357 1384958 1368818
60016 1368818 1351796 1334140 1316093 1298004 1280906 1266246 1254429 1244037 1233199 1221536 1210030
60005 1210030 1199140 1188054 1176128 1164168 1153599 1144731 1136536 1128011 1119344 1111702 1106178 1103025 1101659
59992 1101659 1101228 1101205 1101438 1101788 1101998 1102156 1103083 1105730 1110032 1114665 1118315 1120881 1122958 1124445 1124624 1123803
59976 1123803 1123755 1125731 1128727 1130693 1130922 1130217 1129073 1127083 1124130 1120734 1116858 1111638 1104787 1097110 1089063
59961 1089063 1080011 1069724 1059452 1050422 1042216 1033794 1025418 1018319 1012937 1008678 1005066 1002095 999725
59948 999725 998032 997382 997417 996402 992959 988136 984368 982542 981480 980183 978902 977760 976117 974050 973037
59933 973037 974181 976789 979533 982148 985089 988402 991912 995875 1000442 1004979 1008867 1012610 1017121 1022115
59919 1022115 1026148 1028282 1028867 1028585 1027580 1025971 1024518 1024045 1024269 1023770 1021456 1017856 1014666 1013062 1012738
59904 1012738 1012774 1013025 1014231 1016910 1020638 1024498 1027828 1030436 1032410 1033956 1035274 1036362 1036923 1036531 1035067
59889 1035067 1033154 1032038 1032534 1034103 1035481 1036376 1037806 1040384 1043216 1045207 1046668 1048532 1050594 1051828
59875 1051828 1052191 1052805 1054440 1057111 1061218 1067695 1076647 1086973 1097710 1108579 1118920 1127490 1134043
59862 1134043 1139875 1145942 1151504 1155550 1158466 1161129 1163231 1163993 1164182 1166029 1171040 1178717 1187332 1195261
59848 1195261 1201740 1207072 1212008 1216459 1219169 1219306 1217887 1216680 1216061 1214940 1212584 1209371 1205888 1202592
59834 1202592 1200642 1201740 1206326 1212650 1218305 1222198 1224689 1226580 1228783 1232427 1238290 1246056 1254717 1263633
59820 1263633 1272806 1282330 1292271 1302973 1314656 1326453 1336666 1344509 1351041 1357690 1364336 1369711 1373402
59807 1373402 1376419 1379671 1382967 1385924 1388905 1392302 1395520 1397466 1397722 1396738 1395478 1395376 1397741 1402100 1405794
59792 1405794 1406627 1405577 1405519 1407530 1410178 1412471 1415452 1420100 1425302 1429148 1431094 1431709 1431303 1430036 1428609
59777 1428609 1427478 1425915 1422974 1418984 1414899 1410541 1404718 1396947 1387994 1378810 1370056 1362609 1357267 1353598
59763 1353598 1350068 1345812 1341537 1338314 1336149 1334224 1332107 1330236 1329447 1330220 1332118 1333748 1333583 1331044 1326788
59748 1326788 1321992 1317610 1314079 1311190 1308056 1303590 1297270 1289360 1280470 1271200 1262190 1254100 1247187 1241009
59734 1241009 1234707 1227722 1220345 1213535 1207997 1203351 1198451 1192638 1186412 1180745 1176086 1172231 1168774 1165366
59720 1165366 1161831 1158444 1155890 1154677 1154830 1156305 1159164 1163028 1167008 1170849 1175731 1183095 1192838 1203299
59706 1203299 1213019 1221954 1231059 1241284 1252971 1265757 1279034 1292747 1307427 1323027 1338119 1351068
59694 1351068 1361907 1372345 1383974 1397006 1410618 1423717 1435265 1444685 1452258 1458638 1463793 1466900
59682 1466900 1467523 1466468 1465298 1465256 1466655 1468793 1470358 1470383 1469087 1467622 1467026 1467615 1469090 1470571 1470637 1468201
59666 1468201 1463765 1459400 1457116 1457418 1459420 1461924 1464205 1466197 1468316 1471008 1474283 1477761 1481165 1484596
59652 1484596 1488401 1493012 1498882 1506320 1515335 1525724 1537194 1549234 1561181 1572775 1584488 1597037
59640 1597037 1610675 1625133 1639804 1653660 1665492 1674870 1682590 1689612 1695808 1700279 1702547 1702733 1700941
59627 1700941 1697358 1692768 1688009 1682871 1676377 1668315 1659778 1651973 1644908 1637259 1627252 1614102 1599285
59614 1599285 1585953 1576139 1568773 1561372 1553352 1546420 1541887 1539104 1536803 1534662 1533071 1532583 1534123 1538727
59600 1538727 1546409 1555968 1566214 1576581 1586515 1595567 1604330 1613860 1623563 1631077 1634965 1636124 1635570 1632330
59586 1632330 1624881 1613476 1599457 1583111 1563859 1542041 1518921 1495167 1470773 1446343 1423176
59575 1423176 1402008 1382704 1365186 1349703 1336177 1324048 1312591 1300637 1286533 1269553 1251196
59564 1251196 1233887 1218375 1203448 1188046 1172443 1157331 1143131 1130528 1120342 1112266 1104691 1096466
59552 1096466 1088090 1080750 1075009 1070934 1068628 1067817 1067490 1066753 1065781 1065393 1065977 1067283 1068927 1070601 1072067
59537 1072067 1073432 1075264 1078034 1081531 1085062 1087982 1089865 1090431 1089645 1087715 1084802 1081047 1077082 1074027
59523 1074027 1072421 1071400 1069452 1065943 1061539 1057281 1053812 1051484 1050509 1050546 1050544 1049525 1047510 1045281 1043227
59508 1043227 1040921 1038091 1035579 1034701 1035605 1036798 1036537 1034483 1031786 1029823 1029165 1029592 1030756 1032700 1035843
59493 1035843 1040454 1046215 1052434 1058622 1064600 1070107 1074890 1079438 1085111 1093165 1104036 1117887 1135259
59480 1135259 1156470 1180751 1206717 1233255 1258940 1280779 1295140 1300817 1300410 1297843 1294905 1290937
59468 1290937 1285437 1279844 1276499 1276642 1279859 1284914 1290335 1294308 1294964 1291561 1285235 1278013 1270891 1263193
59454 1263193 1253889 1243133 1232223 1222313 1213509 1205086 1196214 1186520 1176200 1165708 1155360 1145321
59442 1145321 1135894 1127492 1120364 1114631 1110633 1108566 1107664 1106466 1104457 1102868 1103179 1105352 1108348 1111921
59428 1111921 1116842 1123340 1130407 1136870 1142500 1147843 1153583 1160164 1167352 1174036 1179093 1182650 1185811 1188972
59414 1188972 1191284 1192221 1192839 1194675 1197822 1200850 1202487 1202764 1202562 1202583 1202990 1203863 1205710 1209193 1214216 1219580
59398 1219580 1224115 1228088 1232989 1239872 1248369 1257305 1265648 1272831 1278895 1284551 1290390 1295829 1299655 1301921
59384 1301921 1304241 1307544 1310452 1310798 1308055 1303302 1297468 1290837 1283939 1277705 1272652 1268866 1266701 1266587
59370 1266587 1268215 1270909 1274825 1280753 1288585 1297077 1305521 1314718 1325962 1339982 1357296 1378485 1403287
59357 1403287 1430152 1457694 1486150 1516888 1550841 1587741 1625764 1660897 1687685 1702490 1706337
59346 1706337 1703609 1697994 1690801 1683017 1677198 1676260 1681315 1691374 1704139 1716004 1722267 1719325 1707253
59333 1707253 1689369 1668972 1647208 1624227 1601158 1579866 1561272 1545022 1530851 1519252 1510358
59322 1510358 1502935 1495359 1487462 1480719 1476465 1474522 1473791 1473649 1474126 1474989 1475426 1474959 1474222 1474511 1476671 1480600
59306 1480600 1485683 1491406 1497587 1504230 1511323 1518845 1527014 1536355 1547247 1559322 1571654 1583804 1596516
59293 1596516 1611094 1628209 1647611 1668876 1691920 1716494 1741523 1765474 1787539 1808208 1828389
59282 1828389 1848040 1866023 1881468 1894757 1906613 1916330 1921711 1921108 1915032 1905373 1893474 1879454
59270 1879454 1862859 1843170 1820003 1793862 1766754 1740949 1716592 1691408 1663512 1634058 1606413
59259 1606413 1583041 1563722 1546380 1528777 1509627 1489163 1469064 1451219 1436085 1422487 1409125
59248 1409125 1395900 1383625 1373112 1365024 1360187 1359280 1362143 1367887 1375856 1386219 1399508 1415699 1433612
59235 1433612 1450837 1464146 1470514 1468344 1458002 1441413 1421344 1400912 1382862 1368468 1357127 1347577
59223 1347577 1339662 1334503 1332939 1334443 1337972 1343354 1351200 1361678 1374092 1387754 1402683 1419205 1437200
59210 1437200 1455987 1474637 1492201 1507992 1522072 1535355 1548823 1562486 1575229 1585688 1593169
59199 1593169 1597794 1599926 1599710 1597149 1592555 1586662 1580242 1573800 1567782 1562784 1559136 1556255 1552902 1548367
59185 1548367 1543201 1538635 1535466 1533649 1532644 1531742 1530094 1526923 1522002 1515850 1509193 1502180 1494360 1485655
59171 1485655 1477107 1470088 1464507 1458297 1449280 1437357 1424320 1411708 1399648 1387852 1376756 1366931
59159 1366931 1357886 1348411 1338122 1328121 1319990 1314416 1310862 1308224 1305741 1303456 1301972 1301639 1302009 1302267
59145 1302267 1302254 1302879 1305339 1309876 1315381 1320326 1324225 1328112 1333429 1340339 1347385 1353037 1357540 1362931 1370999
59130 1370999 1381320 1391564 1399790 1406151 1412095 1418336 1424277 1429262 1433337 1436288 1436886 1434051 1428420 1421901
59116 1421901 1415901 1410593 1405377 1399018 1389814 1377166 1363136 1350994 1341836 1333949 1325973 1319040 1314679
59103 1314679 1311925 1308190 1302376 1295634 1289303 1283476 1277715 1271945 1266223 1260230 1253337 1244977 1235082 1224481
59089 1224481 1214564 1206107 1198721 1191701 1184835 1177980 1170706 1163213 1156777 1152146 1148086 1142829 1136457 1130479
59075 1130479 1125427 1120553 1115831 1112538 1111554 1112660 1115908 1121930 1130155 1138348 1145162 1151958 1160915 1172253
59061 1172253 1184525 1196850 1209487 1222657 1236140 1249968 1264480 1279692 1295339 1311355 1327639
59050 1327639 1343559 1358413 1372115 1384734 1395666 1404186 1410603 1415977 1420712 1424332 1426650 1428198 1429249
59037 1429249 1429263 1427634 1424325 1419441 1412962 1405414 1398230 1392771 1389211 1386688 1384191 1380902 1376177 1369936
59023 1369936 1362951 1356083 1349141 1341021 1331140 1320289 1309849 1300543 1292171 1284269 1276533 1268723 1260646
59010 1260646 1252405 1244411 1236988 1230096 1223553 1217453 1212251 1208437 1206012 1204186 1201762 1198170 1194021 1190248
58996 1190248 1186713 1182285 1176509 1170540 1165919 1162943 1160905 1159465 1158929 1159374 1160433 1162016 1164292 1166708
58982 1166708 1167917 1167249 1165648 1164580 1164496 1164952 1165813 1167589 1170699 1174996 1180050 1185449 1190922 1196672 1203636
58967 1203636 1212885 1224517 1237442 1250538 1263888 1278728 1296221 1316321 1337571 1357844 1375391
58956 1375391 1389464 1400156 1407822 1412763 1415357 1416150 1415461 1413053 1408611 1402723 1397031 1393002 1390698 1389166
58942 1389166 1387979 1387823 1389361 1392037 1394438 1395648 1395854 1395763 1395843 1396089 1396211 1395846 1394688 1392533 1389388 1385724
58926 1385724 1382514 1380594 1379950 1380028 1380725 1382458 1385153 1388073 1391212 1396074 1404278 1415917 1430041 1446110
58912 1446110 1463850 1482118 1499280 1514823 1529522 1543874 1557352 1569363 1579914 1588954 1596009 1600881
58900 1600881 1603919 1605164 1604008 1600209 1594512 1587700 1579610 1569652 1557796 1544514 1530152 1514844 1498657
58887 1498657 1481501 1463351 1444931 1427745 1412998 1400832 1390748 1382224 1374633 1367332 1360393 1354633
58875 1354633 1350361 1346621 1342279 1337405 1332974 1329656 1327477 1326235 1325563 1324830 1323503 1321435 1318565 1314918
58861 1314918 1311385 1309718 1310831 1313413 1315080 1314753 1313363 1312614 1313775 1317303 1322695 1328841 1335310 1343240
58847 1343240 1354193 1368183 1383538 1398783 1413978 1430190 1448261 1468067 1488400 1507570 1524721
58836 1524721 1540592 1556541 1573081 1590024 1607705 1626907 1647488 1668260 1688689 1709796 1732658
58825 1732658 1756587 1779524 1799964 1817971 1834436 1849747 1863077 1872835 1878081 1879727 1880066 1880819 1881883
58812 1881883 1882134 1881063 1879159 1876922 1874192 1870660 1866579 1862444 1857895 1851272 1840665 1825432 1806571
58799 1806571 1785696 1764033 1742360 1721171 1700300 1678800 1655921 1632167 1608858 1586746 1565754
58788 1565754 1545963 1528018 1512209 1497825 1483840 1469638 1454660 1438099 1419778 1400911 1383060
58777 1383060 1366442 1350176 1334227 1320043 1308838 1300168 1292999 1287447 1284334 1283276 1282482 1280824 1279149
58764 1279149 1278896 1279934 1280541 1279304 1276484 1273582 1272047 1272423 1274256 1276531 1278249 1278784 1277999 1276369 1274897
58749 1274897 1274379 1274600 1274628 1273987 1272895 1271233 1268096 1262911 1256292 1249207 1242024 1235022 1228950 1224113 1219642
58734 1219642 1214855 1210596 1207876 1205916 1203377 1201166 1201857 1206136 1211899 1217448 1223549 1231292 1239768 1247350
58720 1247350 1254077 1261268 1269561 1278603 1287974 1297206 1305367 1311699 1316372 1319870 1322028 1322253 1320077 1314950
58706 1314950 1306394 1295128 1283173 1271942 1261023 1249714 1238729 1229239 1221121 1213630 1207191 1202995
58694 1202995 1201115 1200312 1199500 1198206 1195922 1192334 1188258 1185200 1183905 1184083 1185330 1187407 1189867 1192492 1196001
58679 1196001 1201404 1208785 1217549 1227605 1239288 1252282 1265625 1278730 1291587 1304124 1316161 1327707
58667 1327707 1338505 1347705 1354949 1361309 1368124 1375288 1381847 1387863 1394438 1402211 1411092 1421007 1431406
58654 1431406 1440295 1445501 1447105 1447258 1447428 1447075 1444969 1440304 1432372 1420586 1405114 1386313 1363581 1336340
58640 1336340 1306251 1276655 1249307 1223151 1196805 1170576 1145372 1121271 1098310 1077437 1059584
58629 1059584 1044665 1032228 1022108 1013629 1005214 995851 986381 978520 973054 969420 966430 963082 959361
58616 959361 956564 956046 957447 959100 960262 961671 963728 965766 967751 971125 976884 984172 991821 999998
58602 999998 1009016 1017622 1024043 1028120 1030949 1032820 1032886 1030750 1027177 1023066 1018493 1012913 1005855 997480 988714
58587 988714 980603 973280 965902 957857 949656 942434 936988 933299 930472 927260 923431 920536 920193 921614
58573 921614 922140 920525 918259 917105 916797 915992 914143 911393 907700 903262 899124 896414 895576 896813 900245
58558 900245 905007 909372 912604 915620 919076 922198 924598 927807 933465 941007 948599 955454 961755 967281
58544 967281 971742 975840 980376 984812 988143 990604 993066 995433 997311 999650 1003788 1009246 1014423 1019484
58530 1019484 1026550 1036698 1048610 1060828 1073829 1089005 1106628 1125582 1144495 1162581 1179905
58519 1179905 1197139 1214661 1231849 1247696 1261922 1275114 1288140 1302088 1318212 1336946 1357349
58508 1357349 1378525 1401208 1426852 1455573 1486326 1518817 1553657 1590432 1627036 1661328 1692368
58497 1692368 1719708 1742617 1760512 1773326 1781088 1783871 1782314 1777362 1769311 1758049 1744389 1730050
58485 1730050 1715770 1700331 1682104 1660986 1638230 1614756 1590127 1563078 1532895 1500443 1467742
58474 1467742 1436292 1406199 1377342 1350722 1327619 1307692 1289178 1271006 1253679 1237914 1223633
58463 1223633 1210703 1199574 1190422 1182348 1174145 1165557 1157404 1150777 1146297 1143626 1141382 1137962 1132877
58450 1132877 1127118 1122141 1118691 1116566 1115072 1113615 1112179 1111289 1111299 1111888 1112492 1112940 1113266 1113369 1113475 1114489
58434 1114489 1117030 1120410 1123563 1126797 1131613 1138786 1147780 1158308 1171289 1187634 1206759 1226954 1246808
58421 1246808 1265972 1285002 1304859 1326176 1348544 1370557 1390558 1407249 1419868 1428344 1433191 1434747
58409 1434747 1432639 1426581 1417628 1407801 1398315 1388919 1379358 1370889 1365779 1365438 1369232 1375092 1381248 1387544
58395 1387544 1395105 1404774 1416035 1427392 1437316 1444721 1449273 1451620 1452571 1451429 1445958 1434928 1420129
58382 1420129 1404876 1391045 1378670 1367838 1359383 1353552 1349384 1345891 1343074 1341484 1341506 1343225 1346399
58369 1346399 1350514 1355420 1361718 1369815 1378901 1387747 1396221 1404823 1412958 1419045 1422483 1424191 1424858 1423881
58355 1423881 1420546 1415080 1407970 1399268 1389317 1379275 1370203 1362302 1355699 1351242 1349603 1350006 1350733 1350765 1350347
58340 1350347 1350116 1350348 1351225 1353381 1357754 1364778 1373794 1383489 1393003 1402320 1411548 1420360 1428590 1436883 1445960
58325 1445960 1455456 1464203 1471663 1478477 1485575 1493337 1501650 1510285 1518949 1527287 1535057 1542471 1550557 1560953
58311 1560953 1574560 1590127 1604930 1617305 1627973 1638600 1650012 1662405 1676184 1691522 1707818
58300 1707818 1724645 1742541 1761802 1781187 1799053 1815279 1830868 1846160 1860584 1873649 1885007
58289 1885007 1894120 1901332 1908810 1918854 1931489 1945128 1959288 1975040 1992881 2011835 2030969 2050407
58277 2050407 2070539 2091364 2112925 2135483 2159030 2183226 2207635 2231508 2254022 2275555 2297837
58266 2297837 2321590 2345016 2366188 2385944 2406398 2427324 2446465 2463343 2480364 2499769 2521400
58255 2521400 2543916 2566488 2588892 2611560 2635913 2663207 2692714 2722308 2750893 2778893 2806696
58244 2806696 2834497 2863706 2896500 2933454 2973150 3014312 3056764 3100122 3143324 3185917 3228491
58233 3228491 3271767 3316566 3364414 3416329 3471031 3526115 3581052 3637365 3696062 3756792 3819353
58222 3819353 3883902 3949668 4015612 4082519 4152457 4226167 4302909 4382669 4466222 4553154 4642207
58211 4642207 4733635 4828959 4928552 5031851 5139632 5253287 5372074 5494091 5619952 5752329
58201 5752329 5891702 6035813 6183678 6336780 6495715 6658918 6825507 6996496 7172713
58192 7172713 7354571 7544121 7743975 7953890 8172010 8399672 8640921 8896715 9163969
58183 9163969 9441351 9731938 10039303 10365493 10714118 11090745 11498447 11937177 12408939
58174 12408939 12919029 13470589 14062977 14697772 15381780 16121926 16921765 17785192 18718468
58165 18718468 19725733 20806841 21962010 23194173 24504923 25893733 27363986 28924600
58157 28924600 30583206 32343438 34212208 36204770 38340578 40640692 43132311 45849664
58149 45849664 48827704 52101623 55714775 59717700 64153380 69048983 74424680 80303591
58141 80303591 86714120 93700044 101343348 109778294 119185478 129779650 141793654 155444688
58133 155444688 170900868 188295188 207795274 229690885 254462665 282739430 314913197
58126 314913197 350280456 386145666 417839376 440189980 449710595 445937952 431030532
58119 431030532 408235383 380554435 350306274 319276401 288874053 260114865 233588048
58112 233588048 209524992 187928648 168690751 151665506 136692494 123585143 112125775
58105 112125775 102088560 93267301 85483688 78585293 72446607 66963950 62039819 57576674
58097 57576674 53491667 49731656 46268114 43081822 40155260 37470767 35006912 32738453
58089 32738453 30643956 28710347 26927108 25280387 23756190 22344987 21039270 19829907
58081 19829907 18707933 17666600 16698954 15796711 14953728 14166993 13432075 12741395 12089082
58072 12089082 11473716 10894189 10346944 9829661 9343455 8888613 8461812 8060217 7684668
58063 7684668 7336054 7012094 6710494 6431783 6175901 5939092 5717218 5509267 5314673
58054 5314673 5130198 4952920 4783799 4624892 4474930 4330804 4191750 4059153 3933553
58045 3933553 3814309 3700907 3592454 3487274 3384923 3287142 3195172 3107912 3024309 2945350
58035 2945350 2871684 2801502 2733073 2667397 2605909 2547413 2489794 2433233 2379215 2327721 2277861
58024 2277861 2230041 2185100 2142265 2100039 2058145 2016658 1974515 1931090 1888150 1847994 1810471
58013 1810471 1773901 1738037 1703980 1671944 1641314 1612332 1585601 1560286 1534735 1508661 1482983
58002 1482983 1457797 1432154 1405742 1379343 1353706 1329027 1305261 1282005 1258624 1235395 1213706
57991 1213706 1194128 1175359 1156342 1138283 1122841 1109301 1095510 1081059 1067518 1055760 1044947
57980 1044947 1034276 1024036 1014527 1005198 995247 984272 972260 959582 946909 934463 921729 908568
57968 908568 895973 884802 874356 863392 852016 841350 831708 822491 813669 805924 799219 792481 785048
57955 785048 777527 770975 765975 762616 760549 758885 756733 754112 751775 750047 748367 746173 743707 741786
57941 741786 740994 741180 741502 740949 739110 736568 734550 734218 736058 739464 742839 744619 744492 743343 741927 740031
57925 740031 737064 733002 728524 724526 721551 719367 717203 714889 713437 713787 715178 715726 714540 712332 710160
57910 710160 708804 709269 712191 716236 718633 718114 716176 714779 714006 712862 711061 708841 705899 701704 696319
57895 696319 690125 683330 676469 670592 666113 662207 658152 654533 652254 651136 650486 650466 651860 654875 658971
57880 658971 663565 668264 672881 677832 684044 691910 700739 709565 717838 725081 730869 735641 740341 744604
57866 744604 746406 744403 739535 733475 726633 718779 710506 702690 695292 687969 681151 675258 669583 663196
57852 663196 656438 650438 645842 643159 643430 646975 652094 656459 659359 661234 661794 660460 658339 657716 659249
57837 659249 661117 661253 659222 655800 652014 648971 647493 647411 647780 647961 648095 648874 651512 657340 666213 675598
57821 675598 682482 686184 688299 690187 691834 693088 694486 696416 698518 700367 702043 703822 705977 708759
57807 708759 711767 713496 712698 710256 708648 709270 711245 713020 714168 715322 717252 720495 725118 730367 734949
57792 734949 737967 739355 739558 739268 739262 739777 740231 740163 740114 740583 740430 737592 731642 724678 719329 716559 715523
57775 715523 714744 713215 711093 709670 710265 713106 717613 723404 730267 737436 743820 748851 752345 753843 753178
57760 753178 751514 750579 750708 750594 748962 745520 740413 734085 727660 722065 716472 709012 699390 689427 680549
57745 680549 672239 663817 656220 650719 646755 642444 636856 630839 625879 622987 622384 623508 625346 627101
57731 627101 628494 629447 630155 631614 635050 640213 645005 647623 648564 649723 652011 654833 657738 661570 667617
57716 667617 676012 685220 693039 698212 701219 703495 705887 708089 709421 709713 709254 708318 706993 705312 703502
57701 703502 702169 701976 702767 703444 703421 703739 705658 708377 709596 708722 708194 710893 717251 725678 734760 743859
57685 743859 752241 759008 763862 767112 769014 769847 770467 771886 774179 776437 777881 778518 778670 778440 777906 777445
57669 777445 777539 778302 779218 779330 777836 774851 771650 769987 770990 774625 779955 785753 790998 795173 798406
57654 798406 801342 804597 808074 810849 812023 811696 810827 810183 809976 810660 813185 817771 823029 827192 829987
57639 829987 832506 835432 838283 840328 841366 841579 841370 841432 842199 843152 843412 843048 843005 843761 844996 846704 849522
57622 849522 853630 858322 863228 869187 877427 888565 902795 920301 941065 964954 992381 1024206
57610 1024206 1060817 1102228 1149264 1203095 1262446 1321918 1373891 1411713 1431077 1430224 1410653 1377116
57598 1377116 1335364 1289559 1242105 1195017 1150202 1108767 1071186 1038047 1009859 986390 967008
57587 967008 951317 938738 928046 918363 910212 904466 900595 897177 893852 891377 889788 887955 885320
57574 885320 882716 881021 880046 879344 879076 879378 879709 879603 879456 879806 880276 879971 878677 877053 875752 874776 873678
57557 873678 872106 870186 868499 867483 866836 865785 864063 862308 861398 861687 862977 864744 866289 867193 867953
57542 867953 869683 872763 876153 878501 879646 880594 882295 884971 888439 892416 896441 900070 903319 906502
57528 906502 909436 911271 911503 910876 910818 912100 914458 917568 921776 927457 933926 939599 943431 945836 947998
57513 947998 950469 952852 954737 956455 958592 961058 963162 964661 966228 968592 971610 974635 977557 980836
57499 980836 984662 988937 994123 1001023 1009092 1015964 1019766 1021465 1023866 1028601 1035148 1042537 1050521 1058864
57485 1058864 1066857 1074224 1081519 1089003 1096002 1102091 1108051 1114813 1122119 1129069 1135452 1141682 1147899 1153983
57471 1153983 1160130 1166587 1173106 1179415 1185874 1192905 1200177 1207249 1214662 1223339 1233113 1242982 1252799 1263585
57457 1263585 1275932 1289081 1301912 1314112 1326154 1338760 1352497 1367221 1381813 1395188 1407575
57446 1407575 1420021 1432723 1444892 1456323 1467737 1479169 1489374 1497646 1505113 1513324 1522536 1532366
57434 1532366 1543180 1555430 1568281 1580362 1591682 1603427 1615851 1627697 1638045 1647543 1657206 1666871
57422 1666871 1675617 1683358 1691371 1701248 1713491 1726974 1739747 1750599 1759910 1768845 1777994 1787239 1796758
57409 1796758 1807284 1819068 1831221 1842576 1852855 1862643 1872514 1882679 1893300 1904637 1916726 1929169
57397 1929169 1941505 1953794 1966744 1981096 1996852 2013326 2030020 2047175 2065199 2083932 2102900
57386 2102900 2122082 2141756 2161747 2181532 2201186 2221518 2242993 2265150 2287337 2309409 2331357
57375 2331357 2352966 2374365 2396248 2418900 2441591 2463769 2486326 2510639 2536625 2562832 2588392
57364 2588392 2613687 2638878 2663060 2685705 2708056 2731973 2757642 2783315 2807424 2830306 2853533
57353 2853533 2877921 2902630 2926336 2949029 2972209 2997108 3023133 3048606 3072856 3096800 3121373
57342 3121373 3146241 3170547 3194248 3217964 3241831 3265352 3288380 3311614 3335981 3361981 3389764
57331 3389764 3419355 3450346 3481648 3512009 3541026 3569523 3598759 3629188 3660087 3690517 3720547
57320 3720547 3751268 3783545 3816932 3850027 3881827 3912669 3943873 3976532 4010660 4045573 4081020
57309 4081020 4117629 4155920 4195126 4233534 4270077 4305269 4340467 4376480 4413015 4449190 4484445
57298 4484445 4519033 4553641 4588514 4623285 4657879 4693045 4729376 4766212 4802436 4838078 4874028
57287 4874028 4910236 4945524 4979569 5013742 5049304 5085741 5121676 5156492 5190236 5222824 5254378
57276 5254378 5285667 5317218 5348670 5380033 5412873 5448773 5486947 5524750 5560559 5595045 5629623
57265 5629623 5664858 5700624 5736769 5773075 5809094 5844354 5878516 5911516 5943913 5976740 6010469
57254 6010469 6044582 6078837 6114338 6152366 6192708 6234272 6276725 6320046 6362857 6403091 6440565
57243 6440565 6477279 6514754 6552469 6589297 6624949 6659331 6691893 6722596 6752579 6783130 6814843
57232 6814843 6848335 6884711 6924604 6967634 7013330 7061556 7111355 7160630 7207909 7253429 7297537
57221 7297537 7339173 7377177 7412097 7445159 7475925 7502390 7523196 7538605 7549582 7557104 7562321 7566415
57209 7566415 7570339 7575483 7584260 7598870 7619397 7644077 7671578 7702294 7737350 7777056 7820465 7865742
57197 7865742 7910767 7953937 7994594 8032503 8067198 8098232 8125593 8149002 8167070 8178246 8182794
57186 8182794 8183006 8181106 8177637 8172124 8164646 8156318 8148872 8144379 8145049 8152644 8168029 8191517 8223514 8264543
57172 8264543 8314831 8374274 8442828 8520572 8607188 8701585 8802262 8907962 9017881 9131412
57162 9131412 9247969 9367043 9488094 9610322 9732768 9854602 9975028 10092955 10207322
57153 10207322 10317772 10424342 10526394 10622758 10713343 10799530 10882066 10959536 11030124 11094155
57143 11094155 11153344 11207808 11255383 11293864 11322440 11340730 11348031 11344104 11329473 11304282 11267788
57132 11267788 11219493 11159778 11088894 11006188 10910705 10801536 10677093 10535169 10374483 10195544
57122 10195544 9999758 9788868 9565932 9335739 9103349 8872884 8648197 8433548 8232639
57113 8232639 8047688 7880229 7732010 7604170 7496146 7406127 7332009 7271303 7220895 7177803
57103 7177803 7139688 7104122 7068220 7030054 6990080 6950425 6912964 6878383 6846615 6817590 6791738
57092 6791738 6769828 6751840 6736160 6720518 6703401 6683512 6658415 6625699 6585850 6542365 6498531
57081 6498531 6455508 6413717 6373991 6336509 6300464 6265969 6234971 6209393 6189869 6177120 6173020
57070 6173020 6179286 6196454 6224750 6264078 6312029 6363319 6412024 6452896 6480237 6487683 6470069 6423688
57058 6423688 6344468 6228473 6074796 5884743 5656871 5385747 5067116 4701951 4295088 3854198
57048 3854198 3392330 2928350 2483372 2080194 1746819 1513997 1403948 1422850 1565623 1825736
57038 1825736 2203749 2719870 3430456 4434904 5865194 7864886 10563851 14059265 18434410
57029 18434410 23825068 30449728 38481498 47788126 57770050 67495285 76046341 82800934
57021 82800934 87494296 90142100 90929020 90055260 87557253 83258203 76966557 68780506
57013 68780506 59209529 49007596 38895847 29398869 20840691 13408045 7203888 2275787
57004 -1378841 -3824380 -5192125 -5660152 -5420563 -4658034 -3541556 -2217531 -803476 611993
56994 1966388 3222256 4362390 5378208 6261920 7010404 7631220 8139341 8549614 8875086
56985 8875086 9128733 9321586 9460378 9550555 9600149 9617860 9609490 9579437 9533528 9476937 9411163
56974 9411163 9336703 9257218 9177624 9099816 9024393 8955739 8901356 8866529 8853507 8865496 8905648
56963 8905648 8968246 9032541 9068512 9050623 8968432 8827819 8644736 8437350 8221331 8008973
56953 8008973 7809324 7627627 7465460 7322499 7197812 7089233 6993051 6905809 6826011 6753274
56943 6753274 6686493 6623844 6563892 6505616 6447885 6389832 6331457 6273194 6215336 6158337 6103031
56932 6103031 6050001 5999541 5952668 5911034 5874972 5842642 5812066 5783165 5756807 5732694 5709247
56921 5709247 5684782 5657614 5625627 5587091 5541754 5490297 5433037 5370070 5302496 5232634 5162992
56910 5162992 5095396 5030945 4970426 4914673 4864110 4817321 4770539 4720062 4665527 4609677 4554744
56899 4554744 4500454 4445867 4391060 4335571 4276553 4210054 4133572 4046523 3949407 3844000 3733652
56888 3733652 3621957 3511331 3403513 3300520 3203932 3113946 3030271 2953322 2883362 2819159
56878 2819159 2758982 2702675 2651589 2606619 2567341 2532916 2502718 2475920 2450904 2424839 2393370
56867 2393370 2351468 2295746 2226306 2146435 2061127 1975818 1894774 1819137 1747249 1677919 1612670
56856 1612670 1553624 1500225 1449823 1401111 1355207 1313317 1275011 1239177 1205286 1172896 1140807
56845 1140807 1107528 1072505 1036683 1002009 970214 941625 915124 889550 865046 842896 824384
56834 824384 810057 799636 792293 787444 785549 787707 794306 804788 818820 836432 856267 874754
56822 874754 888030 894048 892327 883011 867489 848862 830034 811587 792655 773322 754864 738235
56810 738235 723908 712995 706938 706010 709411 716874 729079 746549 769365 797938 832626 871999
56798 871999 912166 947942 974283 987398 986150 972769 951290 925039 896072 866296 837702 811643
56786 811643 789206 772139 761924 758028 758802 764314 776627 796886 824069 857448 898446 948661
56774 948661 1007190 1070996 1136389 1198369 1249447 1281566 1290082 1275515 1241938 1194801 1139928 1082745
56762 1082745 1027250 975730 929552 889825 857258 831924 813456 801286 794835 793951 799281 811828
56750 811828 831898 858714 891080 927809 966868 1004145 1033804 1050602 1052149 1039066 1013398 977373
56738 977373 933579 885515 837220 792074 751804 716384 684934 657138 633878 616123 603306
56727 603306 593593 586087 581983 582907 588795 598226 610294 624907 641122 656008 665456 665889 655601
56714 655601 635453 608505 578219 546590 514175 481707 450859 423162 398820 377080 357342
56703 357342 339502 323556 309403 296931 285875 275491 264846 253819 243689 236171 231665 228852
56691 228852 226379 224403 223685 223542 222001 218227 213670 210180 207989 206231 204515 202852 200735 197618 194054
56676 194054 191150 188922 186227 182431 178268 174915 172940 172239 172125 171247 168260 163169 157705 154052 153327
56661 153327 155224 158654 162460 165908 168815 171376 173871 176455 178938 180816 181895 182897 184797 187351
56647 187351 189038 188869 187588 186595 186419 186850 187653 188257 187525 185047 182161 180432 179510 177775 174902 172465
56631 172465 171898 173029 174848 176678 178236 179323 179898 180064 179966 180052 181146 183573 186494 188849 190662 192693
56615 192693 195105 197357 199008 199847 199748 199416 200579 204010 207980 210404 212081 215696 221591 226829 229129
56600 229129 229629 230672 232563 233985 234358 234299 234432 234920 235686 236193 235523 233459 231011 229214 227984 226855
56584 226855 226278 227326 230303 234127 236883 236894 233794 228952 224417 221298 219511 218836 219251 220225 220892 221234
56568 221234 221974 223011 223258 222479 221938 222434 223038 222774 222285 222569 223019 222217 220082 217933 216808 216901 218273
56551 218273 220825 223667 225648 226628 227424 228559 229822 231020 232291 233568 234397 234444 233668 232049 229761 227714
56535 227714 227278 229040 232185 235490 238770 242803 247586 251276 251779 249447 247130 247029 248453 249513 249913
56520 249913 250562 251232 250689 249094 248358 249706 252549 256073 260156 264286 267582 270727 275869 283380 290617
56505 290617 295396 298942 303652 309674 315960 323386 333992 347527 361207 372995 383028 391590 397839
56492 397839 401242 402699 403363 403463 402994 402649 403289 404976 406957 408251 408070 406106 402648 398298 393689 389556
56476 389556 386511 384337 382068 379330 376891 375137 372819 368442 362369 356312 351190 346787 343219 341106
56462 341106 340087 338557 335442 331356 327602 324836 323033 322003 321426 320827 319870 318468 316575 314198 311646
56447 311646 309568 308748 309783 312401 315054 316070 315707 316157 318826 322539 325247 326375 326217 324170 319483
56432 319483 313262 307819 304110 301391 299279 298331 298392 298178 297078 296057 296214 297543 299425 301176 301854 300763
56416 300763 298521 296416 294525 291847 288606 286640 286740 287177 286075 283976 282800 283240 284528 286092 287987
56401 287987 290001 291497 292159 292172 291701 290712 289172 287146 285031 283865 284760 287529 290531 292426 293529 294922
56385 294922 296979 299480 302466 305911 308955 310552 310730 310252 309110 306488 302523 299045 297893 299005 300836
56370 300836 302289 303458 304506 304803 303741 302009 301200 302159 304277 306547 308586 310289 311221 311106 310565 310618
56354 310618 311594 313119 314941 317097 319405 321581 323842 326726 330194 333501 336068 338001 339679 341347
56340 341347 343114 344875 346215 346842 347085 347529 348285 349129 350173 351671 353296 354373 354962 355972 358052 360866
56324 360866 363581 365580 366678 367100 367292 367412 367191 366672 366688 367962 370144 372463 374872 377628 380177 381662
56308 381662 382304 383111 384382 385761 387555 390490 394009 396393 397046 397331 398670 400988 403548 406032 408151
56293 408151 409333 409576 409687 410074 410230 409976 410224 411841 414637 418029 421800 425644 429009 432016 435526 439723
56277 439723 443785 447555 452074 457390 461329 462155 461465 462641 466833 472148 476631 480443 484805 490111 495695
56262 495695 500728 504870 508368 511677 514868 517509 519449 521456 524662 529482 535378 541584 547789 554191
56248 554191 560920 567457 572937 577422 582316 588734 596024 603122 610909 621218 633299 643555 649926
56235 649926 654705 661482 670766 680524 689950 700471 713220 727398 741477 754741 767413 780193
56223 780193 793936 809131 825660 843422 862799 883871 905747 927536 949638 973135 998246
56212 998246 1024302 1051038 1079072 1109265 1142378 1179135 1219673 1263086 1308277 1355355 1405691
56201 1405691 1460815 1521668 1588449 1660486 1736785 1817578 1905007 2001482 2107670 2222810 2346439
56190 2346439 2478728 2619483 2767920 2923341 3085050 3251692 3421495 3592970 3764352
56181 3764352 3932446 4092999 4242182 4376837 4493541 4588791 4660360 4707366 4728654 4722352
56171 4722352 4687928 4628023 4547315 4449551 4336217 4208109 4067716 3919575 3768191 3615993
56161 3615993 3463737 3312509 3164383 3021055 2883030 2750746 2625447 2507972 2397412
56152 2397412 2292147 2192008 2098399 2012348 1933145 1858998 1788629 1722441 1662240 1609275 1562196
56141 1562196 1517701 1473727 1431231 1392307 1357710 1327079 1300329 1277159 1255967 1235076 1214886
56130 1214886 1197375 1183546 1172665 1163829 1156813 1151300 1146723 1143145 1141005 1139629 1137265 1133248 1129179
56117 1129179 1127284 1128152 1130591 1133286 1136064 1139707 1144852 1151216 1158065 1165328 1173778 1184003 1195973 1209824
56103 1209824 1226083 1244460 1263431 1282048 1301369 1323027 1347063 1372327 1398433 1426178 1456525
56092 1456525 1490350 1528703 1572087 1619937 1671909 1729066 1792550 1861869 1936197 2016826 2106535
56081 2106535 2206785 2317238 2437734 2568587 2708441 2853242 2997610 3135993 3262881
56072 3262881 3374114 3468919 3549625 3619106 3679422 3732431 3779569 3820369 3852530 3873918 3883587
56061 3883587 3881335 3868184 3847247 3821625 3790446 3748732 3692117 3620184 3534452 3435307 3322834
56050 3322834 3199725 3071622 2944680 2823378 2709985 2605216 2509700 2425125 2353381 2294277
56040 2294277 2245038 2202563 2165575 2134269 2108722 2088207 2071444 2057188 2045095 2036086 2031198 2030066
56028 2030066 2031376 2034652 2040562 2049446 2060727 2073939 2089165 2106179 2124184 2142679 2161743 2181428
56016 2181428 2201839 2223663 2247421 2272284 2296941 2321583 2347642 2375603 2404597 2434249 2465315
56005 2465315 2498249 2532657 2568375 2605626 2643958 2682650 2722295 2764190 2807922 2851476 2894088
55994 2894088 2936987 2980751 3024132 3066558 3109925 3156591 3206892 3259668 3314020 3369599 3426232
55983 3426232 3483996 3542785 3601647 3659892 3719026 3781883 3849418 3920005 3992267 4066757 4144357
55972 4144357 4225103 4309530 4399338 4495516 4597141 4702903 4812627 4926795 5045838 5170203
55962 5170203 5299605 5432130 5565940 5702073 5843733 5992760 6148904 6312422 6484599
55953 6484599 6665340 6853147 7048369 7253932 7472042 7702675 7945799 8202084 8470475
55944 8470475 8748184 9034672 9333287 9648193 9982459 10339920 10725462 11141939 11589636
55935 11589636 12070047 12587176 13143986 13740875 14379178 15063119 15797144 16584770 17431379
55926 17431379 18344375 19328875 20386389 21518534 22727903 24014446 25376364 26816934
55918 26816934 28346068 29973534 31705918 33552888 35531878 37664962 39976737 42497264
55910 42497264 45260994 48300845 51650783 55357084 59478350 64068643 69166381 74803381
55902 74803381 81017896 87857020 95379222 103665972 112829884 123013466 134393768 147195287
55894 147195287 161691167 178194318 197066632 218740081 243701090 272414797 305175474
55887 305175474 341779394 380928710 419631074 453267952 476787013 486549271 481644484
55880 481644484 463849452 436501110 403228724 367201398 330886936 296038341 263755043
55873 263755043 234599838 208740766 186076472 166346399 149231407 134415477 121594672
55866 121594672 110472038 100773292 92266350 84759345 78089964 72125798 66764038 61916484
55858 61916484 57496933 53429965 49666486 46182202 42963515 39999258 37279001 34789085
55850 34789085 32509897 30420788 28505165 26747643 25130397 23636893 22255939 20978005
55842 20978005 19790961 18683540 17649752 16685693 15784856 14940490 14149733 13411361 12721690
55833 12721690 12076197 11472727 10909612 10383040 9889814 9430591 9006954 8617033 8256922
55824 8256922 7924308 7617790 7334956 7074310 6836758 6621610 6423005 6233805 6051235
55815 6051235 5875092 5702250 5527473 5349132 5170109 4992901 4817083 4641974 4468942
55806 4468942 4300376 4138320 3984456 3839728 3703729 3575567 3455102 3342198 3235461
55797 3235461 3133127 3034699 2940447 2850143 2763582 2681483 2604248 2530491 2458314 2387524 2319238
55786 2319238 2253965 2191447 2131760 2075101 2020886 1968279 1917278 1868362 1821662 1777316 1735797
55775 1735797 1696828 1658908 1621074 1584317 1550081 1518240 1487804 1458796 1431992 1407322 1383777
55764 1383777 1360568 1337457 1314359 1291310 1268205 1244077 1217696 1189633 1162525 1138356 1116637
55753 1116637 1096281 1077924 1062935 1051185 1041412 1033116 1026807 1023013 1022113 1024390 1029172 1034760 1040258
55740 1040258 1046525 1054235 1062076 1068033 1071279 1071517 1067774 1059549 1048055 1034562 1018514 999262 978816
55727 978816 960606 945807 932773 919924 907264 895002 882428 868583 853081 836381 820243
55716 820243 807453 799817 796702 796654 799755 806876 817159 828002 837265 843846 846250 842613 832584 817861
55702 817861 800454 781341 760864 739306 717139 695563 676456 660551 646064 630589 614110
55691 614110 598618 585028 572341 559940 548757 539579 531830 524767 518552 513394 508792 504269 499860
55678 499860 495345 490149 484593 480080 477132 474162 469169 462032 454276 447070 440429 434093 428231 422948
55664 422948 417624 411257 403698 396282 390774 387584 385531 383693 382683 383483 385826 388879 393037 399609
55650 399609 408605 417950 425131 428863 429153 426806 423189 419540 415998 411702 405974 398873 390673 381646
55636 381646 372594 364849 359412 356360 355026 354246 352643 349549 345741 342614 340631 339308 338558 339018 340871
55621 340871 343374 345972 348997 352720 356409 359098 360983 363348 366993 371099 373883 374366 373217 371535
55607 371535 369319 366003 362459 361066 363088 367126 371094 374620 378329 381882 384522 386891 390348 394702
55593 394702 398451 401178 403870 406776 408876 409792 410297 410272 408048 402714 395483 387782 379542 370492 361577
55578 361577 353598 345683 336844 328157 321603 317122 312558 306547 300064 294897 291655 289611 287663 285012
55564 285012 281478 277647 274579 273110 273155 273438 272099 268241 263058 258783 256341 254803 253397 252827 253579
55549 253579 253878 250963 244408 236881 231195 227522 224053 219690 215233 211975 209875 207627 204352 200663
55535 200663 197864 196608 196778 198114 200085 201413 200918 199147 198174 199295 201660 203707 205064 206325 207773
55520 207773 209379 211606 215050 219301 223095 225773 227884 230271 233226 236798 241295 246986 253550 260195
55506 260195 266272 271556 275975 279323 281420 282394 282471 281379 278345 273116 266811 261206 257071 253538 249083
55491 249083 242808 234832 226071 217786 210906 205585 201708 199780 200603 203887 207859 210730 212192 213209
55477 213209 214842 217583 221209 224649 226339 225365 222319 218724 215740 213526 211474 208762 204989 200684
55463 200684 197018 194713 193463 192559 191681 190759 189488 187567 185206 182861 180472 177443 173542 169547 166704
55448 166704 165449 164760 163083 160045 156951 155265 154983 155048 154921 154873 154968 154950 155243 156731 158952 159722 157493
55431 157493 153335 149592 147173 145194 142760 139997 137433 135453 134552 135413 138436 143433 149652 155735 160001
55416 160001 161517 160955 159924 159496 159751 160435 161362 162113 161941 160297 157281 153669 150743 149744 150900 152942
55400 152942 154049 153359 151287 148527 145366 142079 139457 138463 139409 141622 143983 145755 146906 147654 147972
55385 147972 147855 147873 148850 150805 152741 153784 154103 154416 155031 155730 156208 156321 156307 156978 159028 161738 163148
55368 163148 162292 160708 160818 163143 166036 167907 168608 168617 167981 166591 164925 163915 164190 165576 167314 168816
55352 168816 170316 172525 175443 177890 178619 177494 175127 171848 167749 163362 159453 156248 153620 151888
55338 151888 151612 152623 154029 155225 156106 156310 155214 153004 150952 150199 150693 151506 151641 150374 147584 144176
55322 144176 141626 140616 140377 139631 137812 135245 132653 130834 130226 130333 129913 128311 126403 125838 127311 129864
55306 129864 131844 132339 131660 130632 129645 128617 127764 127856 129319 131477 133221 134211 134941 135825 136850 137945
55290 137945 138936 139144 137839 135328 132945 131799 132060 133492 135875 138629 140817 141969 142392 142337 141530 139876
55274 139876 137987 136503 135442 134718 134661 135345 135954 135617 134631 134085 134392 134851 134662 133865 133237 133571 134976 136554
55256 136554 137042 136242 135582 136611 139027 140845 140702 139268 138052 137371 136235 134076 131836 130931 131497 132318
55240 132318 132439 132212 132275 132135 130660 127976 125961 126392 129088 132295 134578 135882 137009 138518 140109 140900
55224 140900 140365 139092 138318 138588 139271 139553 139455 139496 139864 140461 141451 143024 144697 145456 144709 142669 139836 136626
55206 136626 133735 132321 133300 136410 140164 142943 144256 145002 146423 148853 151562 153691 154904 155134 154314
55191 154314 152765 151424 151198 152216 154047 156293 158461 159602 158815 156191 152772 149515 146752 144603 143330
55176 143330 143075 143665 144823 146239 147377 147678 147189 146716 147124 148659 150893 152950 153760 152598 149778 146643
55160 146643 144677 144600 146102 148051 149179 149277 149752 152170 156024 158877 159165 157849 156537 155167 152969 150896
55144 150896 151021 153434 155655 155880 155184 155484 156700 157377 157204 157158 157550 157530 156524 154769 152331 148993 145434
55127 145434 143180 142789 143267 143898 145422 148511 152195 154907 156183 156129 154211 150334 146661 146290 149724 154178
55111 154178 156926 157979 158827 159903 160496 160387 160291 160918 162428 164659 167073 168642 168615 167548 167004 167950 169797
55094 169797 171196 171489 171089 170495 169338 166759 162740 158584 155635 153899 152529 151392 151254 152316 153541
55079 153541 153921 153656 153528 153822 154540 156008 158321 160544 161537 161478 161609 162338 162441 160589 157124 153898 152633
55062 152633 153573 155406 156234 154939 152048 149363 148573 150005 152462 154192 154280 153385 153065 154253 156499 158714
55046 158714 160352 161665 163264 165699 169065 172532 174599 174396 172553 170316 168128 165649 162911 160702
55032 160702 159918 161166 164715 169944 174978 178034 179283 180371 181842 182375 181186 179844 180379 182361 183369
55017 183369 182155 179980 178653 178521 178974 179925 181852 184656 187295 188563 187857 185264 181428 177441 174362
55002 174362 172473 171195 170096 169719 170876 173237 175342 176330 176896 177944 178951 178676 177185 176001 176127
54987 176127 176942 177395 177258 176706 175578 173931 172617 172343 172642 172660 172653 173676 175843 177881 178583 178013 177116 176683
54969 176683 176839 177057 176643 175648 175129 175914 177267 177627 176632 175452 175005 174921 174633 174357 174347 174107 173264 172409 172157
54950 172157 171992 171231 170638 171708 174364 176603 176719 175034 173204 172684 174063 176885 179592 180381 178830 176372
54934 176372 174813 174846 176146 178093 179762 179942 178135 175327 173129 172356 172901 174488 176729 178821 180241
54919 180241 181630 184026 187132 189370 189860 189410 189173 189335 189750 190916 193289 196120 197953 198125 197057 195423
54903 195423 193937 193702 195586 199000 202167 203957 204732 205117 204869 203544 201563 199835 198809 198581 199433 201353
54887 201353 203369 204461 205045 206533 209205 211652 212734 212995 213383 213547 212583 210931 210140 210728 211547 211581 211316
54870 211316 211765 213167 215545 219787 226838 235896 244625 251643 258033 265808 275323 284835 292548 298570
54856 298570 304697 312414 321040 327745 329565 325802 318655 311453 306145 302285 297942 291346 282083 271521
54842 271521 262253 256415 253934 252594 250289 247059 244586 243913 244303 244309 243274 241552 239914 239163 239780 241398
54826 241398 242977 244083 245566 248356 252001 255462 259137 264752 272880 281737 289242 295389 301652 308674
54812 308674 315596 321326 325303 326964 325519 320710 313298 304542 295569 287208 279824 273133 266735 260869
54798 260869 256024 251702 246475 239760 232821 227296 223284 219684 216119 213574 213074 214446 216531 218057
54784 218057 218189 216859 214945 213689 213467 213337 212107 209686 207039 204968 203360 201671 199766 198046 196948
54769 196948 196486 196234 195696 194776 193956 193831 194439 195236 195820 196312 196690 196075 193384 188785 183951 180663 179529
54752 179529 180201 182169 184904 187701 190107 192250 194194 195219 194460 192250 190140 189432 190195 191793 193800
54737 193800 196171 198979 202236 205618 208255 209297 208894 208209 208235 208966 209876 210693 211470 212444 214193 217316
54721 217316 221429 225006 226944 228081 230460 235151 241360 247615 253233 258499 263869 269320 274467 279309
54707 279309 284833 292413 302217 312504 321035 327120 331824 336245 340150 342368 342020 339142 334462 328803
54693 328803 322519 315359 307040 297989 289285 281827 275817 271026 267165 263769 260128 255821 251403 248250
54679 248250 247410 248561 250158 250735 250060 249017 248495 248621 249048 249552 250234 251492 254093 258989 266606 276336
54663 276336 286944 297325 306713 314510 320465 324918 328360 330609 330807 328393 323833 318141 311822 304531
54649 304531 295914 286667 278440 272356 267763 262995 257392 251994 247964 245074 242374 239817 238287 238120
54635 238120 238423 237981 236193 233033 228794 224232 220533 218594 218315 218605 218054 215823 212299 208854 206640
54620 206640 205680 205340 205416 206138 207232 207761 207117 205645 204040 202508 200723 198312 195198 191746 188739 186995
54604 186995 186955 188662 191811 195460 198137 199004 198799 198917 199643 200103 199909 199795 200378 201248 201737 201727 201219 199973
54586 199973 198314 197546 198640 200894 202591 202697 201398 199517 198130 198210 199765 201528 202414 203064 205006 208266
54570 208266 210806 210675 208055 204763 202355 201192 200961 201397 202310 203334 204028 204329 204620 205192 205867 206471 207415
54553 207415 209147 211055 211766 210799 209221 208261 208016 208041 208421 209356 210267 210408 210133 210580 212149 214165 215943
54536 215943 217323 218103 217887 216729 215161 213351 210901 207771 204777 202804 201977 201846 201957 202112 202542 203981
54520 203981 207010 211103 214810 217085 217974 217995 217607 217489 218386 220099 221341 221364 221175 222297 224718 226956
54504 226956 227966 228048 227842 227331 226237 224817 223780 223753 225106 227922 231605 234763 236100 235654 234831 234960
54488 234960 236053 237211 237960 238689 239911 241759 244340 247813 251491 253551 252583 249365 246235 244607 243836
54473 243836 242690 241050 239650 238767 237918 236736 235643 235581 237084 239442 240801 239661 236445 233162 231321
54458 231321 230672 230244 229851 229998 230865 232122 233393 234215 233964 232666 231632 232249 234132 235467 235452 235376 236674
54441 236674 238732 239518 238066 235513 233775 233949 236117 239955 244874 249821 253538 255354 255681 255652 256297 257950
54425 257950 260189 262216 263438 263895 264161 264791 265945 267501 269260 270831 271762 272220 273266 275716 278735
54410 278735 280344 279633 277857 276965 277599 279057 280622 282094 283225 283538 283050 282806 284288 288072 292916 296351
54394 296351 296696 294627 292280 290739 289129 286440 283214 280698 279237 278484 278441 279009 279030 277258 274164 271410
54378 271410 269576 267777 265560 263680 262712 262392 262736 264214 266166 266746 265498 264531 265760 268254 269802
54363 269802 270021 270183 270726 270905 270552 270370 270494 270368 270164 270757 272016 272583 271718 270156 268777 267640 266743
54346 266743 266461 266668 266554 265908 265577 266154 267282 268823 271429 275124 278557 280704 282280 284242 285948 286265
54330 286265 285727 285870 286801 287211 286811 286945 288262 289316 288464 286229 284792 285606 288212 291073 292926 293536
54314 293536 293724 294725 297179 300659 304243 307478 310714 314561 319060 323364 326288 327269 326742 325552 324235
54299 324235 322988 321991 321344 320910 320536 320254 319846 318493 315429 310939 306235 302324 299329 296797 294103 290700
54283 290700 286561 282440 279177 276706 274310 271875 270166 269655 269819 270015 270460 271771 273889 276033 277512
54268 277512 278109 277813 276743 275393 274535 274673 275712 277255 279074 281010 282395 281972 278941 274153 269668
54253 269668 266840 265281 264075 263246 263276 263789 263912 263703 263932 264383 263766 261740 259714 258943 258893 258425 257587 257153
54235 257153 257219 257519 258575 261012 263893 265151 263895 261258 258785 257103 256560 257949 261669 266599 270643
54220 270643 272418 272180 271280 270882 270942 270323 268174 265233 263318 263500 265298 267737 270389 272904 274310 273728
54204 273728 271611 269503 268595 269140 271145 274747 279522 284177 287613 290026 292337 294630 295763 294745 292060
54189 292060 289279 287519 286645 285985 285459 285717 287209 289451 291411 292443 292523 291705 289911 287566 285819 285429
54173 285429 285705 285313 284069 283038 282712 282229 280924 279670 279728 280981 282311 283170 283682 283618 282624 281239 280328
54156 280328 279411 276997 272927 269152 267630 268477 270544 272647 273696 272975 271245 270567 272106 274963 277806
54141 277806 280404 282587 283173 281632 279805 280083 282355 284487 285400 285844 286326 286278 285584 285126 285232 284999 283727
54124 283727 281808 279717 277459 275661 275983 279513 285430 291740 296577 298571 297267 293895 290687 288572
54110 288572 286407 283113 279566 277494 277300 277911 278131 277350 275609 273775 273038 273466 273655 272484 270440 268417
54094 268417 266198 263350 260891 260624 262948 266427 269288 270571 270265 269396 269474 270762 271426 269599 265907 262652
54078 262652 260941 260172 260066 261291 263751 266041 267342 268407 269962 271465 272308 273089 274653 276842 279184
54063 279184 282017 285779 289760 292626 293844 293778 292895 291869 292100 294914 300076 305878 310801 314642 318157
54048 318157 322247 327438 333523 339630 345023 349676 353627 356088 355988 353419 349920 347159 345754 345225 344505
54033 344505 342491 338867 334617 331181 328876 326725 324019 321439 320180 320426 321274 321810 321797 321435 321046 321050 321859
54016 321859 323486 325299 326382 326378 326111 327151 330315 334660 338411 340958 343329 346429 349478 350880 350311
54001 350311 349180 349001 349978 351307 352320 352927 353328 353711 354190 354861 355946 357918 361240 365797 370755 375300
53985 375300 379626 385036 392846 403052 414098 424141 432649 440621 449192 458392 467603 476845 486891
53972 486891 498097 509855 521504 533158 545072 556655 566755 574777 581049 586194 590623 594511
53960 594511 597747 599973 601128 601796 602373 602093 599800 595788 591724 588142 583113 574541 563196 552110
53946 552110 543103 535222 526810 517796 509175 501341 494004 487187 481167 475632 469996 464503 460059 456755
53932 456755 453559 449775 445901 442498 439192 435593 432474 430838 430194 428948 426452 423652 421671 420882 421606
53917 421606 424422 429012 433720 437354 440933 446598 454950 464429 473329 481601 490289 499666 508296 513884
53903 513884 515031 512260 507280 501302 494411 486658 479061 472898 468391 464750 461319 458124 455537 454074
53889 454074 454338 456504 459910 463778 468172 473516 479419 485053 490738 497960 507344 517512 526646 534521
53875 534521 542411 551438 561552 571653 580182 585992 589349 591947 595574 600802 607078 613688 620407 627605
53861 627605 636064 646298 657792 669313 680241 691140 702789 715242 728196 741590 755219 768364
53849 768364 780498 791910 802895 812736 820257 825175 828207 830036 830824 830554 829176 826559 822909 818999
53835 818999 815350 811328 805689 797831 787897 776050 762468 747946 733517 719418 705178 690694
53823 690694 676397 662392 648390 634682 622241 611521 601959 592878 584092 575308 565912 555961 546542
53810 546542 538377 530565 521497 510812 499844 490327 483121 477968 473925 470024 465844 461570 457558 454009
53796 454009 450977 448262 445282 441576 437560 434194 431705 429216 425895 421885 417853 414366 412076 411663
53782 411663 412793 413702 412731 410004 406967 404641 403156 402633 403515 405940 409532 413852 418450 422479 424967
53767 424967 425617 424853 423117 420639 417873 415455 413661 412470 412153 413096 415040 417321 420056 424142 429635
53752 429635 435032 438880 441515 444494 448839 454579 461571 469767 478745 487849 496959 506575 516973 527754
53738 527754 538310 548387 558158 568056 578366 588574 597382 604069 609680 615927 622780 628135 630283
53725 630283 629848 628709 627881 627194 626268 624632 621298 615483 607794 599697 591799 583553 574722 566038 558074
53710 558074 550468 542793 535352 528486 521820 514893 507859 500787 492888 483432 473149 463851 456851 452417
53696 452417 450259 449335 447408 442363 434590 427026 422176 419849 418338 416842 415621 414466 412472 409386
53682 409386 406013 402923 399731 396306 393894 394066 396748 400200 402931 404877 406423 407290 407204 407136 408739 412368
53666 412368 416401 418871 419371 419142 419768 421995 425337 428482 430386 431287 432303 433953 435623 436864 438456
53651 438456 441476 445822 450474 454953 459637 464787 470106 475273 480111 484142 486799 488438 490555 494556
53637 494556 500521 507295 513455 518159 521576 524749 528760 533851 539396 544552 548611 551055 551908 551917 551806
53622 551806 551381 550042 548038 546457 545899 545955 546079 546159 546077 545590 544993 545042 545797 546288 545769 544581 543310 541932
53604 541932 540375 539161 538685 538423 537657 536544 535853 536034 537153 539216 541848 544175 545825 547591 550252
53589 550252 553119 554738 554824 554507 554709 555226 555572 555924 556977 559397 563528 569069 574892 579745 583344 586455
53573 586455 589851 593564 597149 600216 602694 604955 607725 611464 615866 620238 624294 628189 631952 635505
53559 635505 639210 643784 649516 655964 662482 668653 674171 678754 682389 685367 688017 690654 693754 697886
53545 697886 703437 710485 718642 726722 733012 736638 738559 740594 743460 746386 748671 750802 753649 757036
53531 757036 759599 759930 757729 753959 750030 746774 744237 742266 740820 739461 737258 733810 729994 727016
53517 727016 725008 723301 721729 720759 720381 719754 718021 714788 710006 704342 699628 697693 698364 699445 699032
53502 699032 697084 694667 692743 692116 693403 696201 698948 700325 700361 699895 699727 700681 703462 707735 712203 716370
53486 716370 721308 727786 734679 740448 745432 751134 757755 764120 769966 776577 784790 793919 803413 814367
53472 814367 828306 845108 863042 880583 897519 914557 932533 951984 972989 995248 1018368
53461 1018368 1042052 1066122 1090739 1116729 1145150 1176177 1208747 1241789 1275546 1311104 1348722
53450 1348722 1387394 1426280 1465829 1506834 1548796 1590177 1630326 1670321 1711466 1753592 1795356
53439 1795356 1835741 1874566 1912012 1948593 1985414 2023344 2061740 2098873 2133901 2167571 2200716
53428 2200716 2233136 2264656 2296189 2328579 2360934 2391303 2418837 2444319 2468729 2492407 2515708
53417 2515708 2539278 2563006 2585351 2604480 2619924 2632654 2643465 2651668 2655649 2654705 2649938 2643035
53405 2643035 2634522 2623841 2610863 2596137 2579396 2559239 2535225 2509260 2483617 2458265 2431460
53394 2431460 2402386 2371734 2340050 2307279 2273955 2241162 2209026 2176815 2144915 2115023 2087754
53383 2087754 2061737 2035992 2011568 1989613 1969385 1949817 1931891 1917523 1906884 1898732 1892938 1890526
53371 1890526 1891201 1892880 1894333 1896747 1901980 1910567 1922225 1937159 1955758 1977705 2002308 2029358 2058982
53358 2058982 2090944 2124729 2160224 2197902 2238409 2282108 2328753 2377577 2428040 2480538 2535868
53347 2535868 2593930 2653617 2714166 2776009 2839998 2906571 2976065 3049115 3126042 3206263 3288925
53336 3288925 3373791 3461049 3550600 3641976 3734502 3827053 3918208 4007297 4094932 4181861 4267689
53325 4267689 4351345 4432358 4510783 4586240 4658025 4726044 4790598 4851135 4906070 4954055 4994763
53314 4994763 5028517 5056032 5078582 5097203 5111149 5117874 5115107 5102362 5080024 5047840 5005192 4952430
53302 4952430 4891050 4822628 4748212 4668711 4585300 4499191 4411242 4321944 4231745 4141361 4051712
53291 4051712 3963470 3876844 3792024 3709559 3629828 3552259 3475735 3399805 3324813 3250778 3177040
53280 3177040 3103428 3031092 2961573 2895527 2832831 2773427 2717559 2665485 2617455 2573737 2534408
53269 2534408 2499455 2469035 2442774 2418609 2393584 2366676 2339914 2315628 2293379 2270885 2247399
53258 2247399 2224677 2204839 2188646 2175770 2165249 2155510 2145427 2135975 2129755 2128313 2130820 2135768
53246 2135768 2142850 2152451 2164214 2177141 2190691 2205132 2221148 2239549 2260806 2284416 2309278 2335263
53234 2335263 2363824 2396313 2432178 2469585 2507365 2545509 2583952 2621948 2658799 2694401 2728682
53223 2728682 2761084 2791051 2818636 2844013 2866473 2884556 2897594 2906751 2913847 2919093 2920638 2916597
53211 2916597 2906779 2892017 2872785 2849547 2823651 2796169 2765943 2730532 2689590 2645801 2601842
53200 2601842 2557831 2512576 2465775 2417588 2367307 2314387 2260313 2207685 2157430 2108301 2059042
53189 2059042 2009699 1960754 1912479 1865529 1820783 1777908 1735088 1690957 1646031 1601620 1558096
53178 1558096 1515090 1472825 1432327 1394473 1359489 1327278 1297613 1270128 1244662 1221629 1201467
53167 1201467 1183574 1166162 1147512 1127222 1106115 1085080 1064244 1043199 1021709 1000015 978563
53156 978563 957614 937082 916615 895963 875463 856036 838412 822333 806868 791418 776029
53145 776029 760870 746116 732424 720596 710285 699891 688439 676852 666401 656542 645541 633027
53133 633027 620592 609682 600094 590905 581767 572545 562678 551937 541426 532852 526726 521895 516919
53120 516919 511443 506109 501428 497058 492219 486729 481421 477322 474427 471606 467834 463293 459184 456661
53106 456661 456016 456585 457206 456941 455704 454242 453437 453552 454116 454464 454346 454031 453784 453392 452452 451123 450183 450150
53088 450150 450665 451038 451011 450626 449800 448632 447875 448308 449662 450729 450547 448970 446300 443160 440780 440456 442257
53071 442257 444813 446723 447664 447913 447594 446996 447040 448535 451076 453333 454540 455289 456787 459604 463224 466579
53055 466579 468836 469801 469827 469587 469815 470828 472019 472181 470727 468375 466206 464370 462279 459836 457717 456374
53039 456374 455458 454256 452156 448851 444948 442327 442766 445776 448638 449113 447343 444758 442103 439310 436470
53024 436470 433863 431407 428917 426657 424955 423611 422300 421173 420382 419408 417742 415931 415002 414947 414733 413896
53008 413896 413217 413445 414117 414215 413581 413033 413085 413066 411940 409937 408801 409883 412333 413980 413963 413411 413241 412580
52990 412580 410316 407244 405336 405274 405975 406389 406567 406839 407061 407128 407527 408958 411653 415050 417809 418506 416971
52973 416971 414638 412881 411415 409382 407514 407582 409573 411111 410409 408390 406938 406286 405484 404526 404393 405160
52957 405160 405546 404685 403308 402681 403085 403972 405148 406963 409241 410679 409956 407358 404659 403195 402661 402245
52941 402245 402215 403450 405826 408267 410336 412503 414673 415823 415790 416189 418450 421692 423643 423278 421620 420358
52925 420358 420628 422882 426866 431544 435667 438623 440489 441643 442719 444375 446325 447156 446099 444624 445046
52910 445046 447716 450853 453144 454967 456662 457302 456304 455033 455313 456914 457893 457165 455363 453129 449992
52895 449992 445593 440957 437585 435764 434626 433616 433067 433291 433978 434866 436240 438116 439441 439047 437299
52880 437299 435797 435172 434131 431366 427602 424680 423023 421214 418233 414957 412927 412413 412407 412146 411986 412880
52864 412880 415303 418539 420852 420796 418687 416447 415640 416111 416886 417713 418850 419830 419647 418341 417291 417442
52848 417442 418012 417535 415688 413455 411907 411428 411970 413418 415648 418535 421879 425106 427341 428236 428528 429148
52832 429148 429843 429398 427441 425387 425071 426812 429206 430568 430180 428467 426600 425892 426871 428632 429533 428980
52816 428980 428308 429447 432796 436810 439794 441644 443528 446283 449751 453606 457915 462396 465710 466412 464581
52801 464581 461845 459665 458204 456902 455320 452965 449049 443309 436719 430645 425439 420545 415726 411357
52787 411357 407558 403960 400557 397909 396213 394923 393752 393303 394132 395815 397556 399053 400009 399422 396612
52772 396612 392777 390369 390676 392848 395441 397977 400562 402881 404337 404780 404570 404208 404288 405314 406962 407888
52756 407888 407021 404977 403538 403671 404613 405054 404776 404846 406473 409949 414508 418902 422032 423262 422478 420101
52740 420101 416940 413661 410243 406257 401816 397743 394474 391268 387267 383102 380619 380808 382652 384282
52726 384282 384741 384350 383984 384460 386086 388175 389211 388211 385920 384241 384442 386184 388130 389084 388694 387665
52710 387665 387376 388764 391348 393588 394276 393347 391578 390062 389935 391699 394381 395997 395517 393996 393243 393716
52694 393716 394343 394258 393967 394709 397129 400674 403989 405995 406925 408184 410755 414004 416712 419026 422301 426765
52678 426765 430563 431927 431538 431666 433411 435903 438056 439804 441231 441555 440001 437311 435554 436267 439082
52663 439082 442114 443507 442781 441101 440222 440763 441464 440484 437563 434431 432712 431835 429780 425953 422440 421813
52647 421813 424147 427080 428642 429022 429217 428966 427106 423632 420311 418882 419236 419736 419059 417429 416313 417146
52631 417146 420208 424516 428695 431928 434030 434996 434940 434367 433926 433728 433332 432514 431543 430566 429319 427819 426730
52614 426730 426422 426184 425097 423437 422403 422530 423143 423371 423007 422247 421314 420580 420453 420800 421089 421405 422716
52597 422716 425640 429430 432792 435359 437804 440784 444354 448165 451492 453097 451928 448311 444014 440864
52583 440864 439503 439571 440546 442070 443837 445662 447570 449482 450842 450956 449799 448260 447411 447668 448814 450678
52567 450678 453365 456601 459143 459352 456603 451998 447549 444665 443367 442699 441746 440387 439264 439016 439532
52552 439532 440139 440434 440597 440793 440694 439892 438463 436812 435315 434407 434558 435563 436258 435787 434999 435680 438317
52535 438317 441507 443809 445222 446319 446819 445942 443799 441572 440399 440653 442133 444282 446301 447706 448940
52520 448940 450901 453701 456358 457873 458150 457623 456504 454960 453692 453595 454650 455723 455861 455420 455403 455889
52504 455889 455896 454929 453814 453404 453110 451656 448975 446340 444675 443828 443577 444150 445254 445872 445851 446565 448881
52487 448881 451418 452288 451868 452144 453618 454757 454674 454382 454691 454642 453291 451723 451670 452859 453323 452084 450202
52470 450202 449131 449275 450374 452215 454486 456605 458216 459468 460552 461412 462131 463085 464282 464902 464045 461984
52454 461984 460368 460932 463980 468194 472058 475307 478604 481837 483614 483085 481684 481945 484498 487258 487964
52439 487964 486712 485408 485258 485568 484814 482352 479068 476624 475865 475800 474474 471229 467704 466002 466202 466508
52423 466508 465794 465024 465754 468110 470968 473569 475956 477885 478415 477123 475143 474282 475247 477215 479040 480315
52407 480315 481205 481917 482747 484172 486333 488615 490333 491822 494266 498181 502445 505152 505266 503322 500747
52392 500747 498695 497407 496426 495354 494322 493565 492751 491170 488662 485881 483490 481575 480090 479230 478878
52377 478878 478231 476713 474848 473504 472593 471516 470756 471741 474727 477816 478902 477948 476709 476702 478215 480932
52361 480932 484573 488731 492771 496228 499080 501496 503519 505157 506719 508920 512467 517344 522648 527490
52347 527490 532043 537319 543873 551207 558452 564979 570142 573230 574160 573492 571266 566711 559968 553236 548822
52332 548822 546432 543745 539602 535307 532667 532024 532553 533309 533569 533256 533591 536161 540629 544451 545810 545980
52316 545980 547713 552006 557603 563124 568321 573400 578373 583292 588280 593058 597040 599959 601914 602951
52302 602951 603211 603331 603975 604990 605758 606264 607018 608039 608900 609897 612070 615649 619504 622707 625729 629343
52286 629343 633072 635850 637805 640288 644081 648479 652435 655999 660274 666398 674904 685783 698687 712977
52272 712977 727759 742069 755229 767266 779049 791765 806013 821548 838093 856210 876796
52261 876796 899611 922938 945202 966510 987954 1009794 1031347 1052656 1074985 1099138 1124260
52250 1124260 1149143 1173856 1199065 1224364 1248576 1271423 1293676 1315662 1336900 1357444 1378382
52239 1378382 1400406 1422774 1444224 1464239 1482750 1499180 1512433 1521710 1527105 1529760 1531459 1533393
52227 1533393 1535078 1535135 1533275 1530633 1527795 1523801 1518052 1512204 1508744 1508089 1508438 1508433 1508627 1510079 1512679 1515699
52211 1515699 1519288 1524610 1532514 1542619 1553726 1564864 1575813 1586866 1598448 1611110 1625406 1641204
52199 1641204 1657282 1672404 1686921 1702492 1719890 1737948 1755321 1772413 1790577 1809890 1828796
52188 1828796 1845697 1859851 1870930 1878847 1884168 1887732 1889582 1889084 1886214 1881880 1876691 1870234 1861912
52175 1861912 1851752 1840185 1827854 1815922 1805485 1796093 1785866 1773919 1761807 1751627 1743416 1735625
52163 1735625 1727537 1719761 1712547 1705249 1697876 1691889 1688595 1687514 1687015 1686163 1685336 1685447 1687053 1690031 1693713
52148 1693713 1697577 1702020 1708013 1715603 1723315 1729649 1734848 1740469 1747361 1754814 1761724 1767886 1773942 1780575
52134 1780575 1787997 1795759 1802870 1808535 1813002 1817297 1821987 1826624 1830563 1833632 1835626 1835765 1833255 1827982
52120 1827982 1820183 1810057 1798419 1787175 1777957 1770391 1762774 1754543 1747076 1741794 1738514 1736195 1734372
52107 1734372 1733071 1731945 1730456 1728643 1726950 1725359 1723413 1721244 1720080 1721322 1725085 1729691 1732746 1733049
52093 1733049 1731587 1730517 1731176 1733310 1736063 1739010 1742072 1745061 1747830 1750465 1752927 1754964 1756763 1759177
52079 1759177 1762634 1766110 1767943 1767743 1767067 1768162 1772262 1778934 1786754 1794670 1802940 1812699 1824765 1839340
52065 1839340 1856864 1878133 1902887 1929073 1954487 1978946 2004108 2031455 2061223 2092949 2125930
52054 2125930 2159040 2191028 2221335 2250119 2277377 2302690 2326021 2348150 2369951 2391400 2411388
52043 2411388 2428441 2441919 2452829 2463081 2473460 2482780 2489654 2494470 2498503 2501370 2500779 2495039 2484696
52030 2484696 2471421 2456366 2440116 2423170 2405613 2386915 2366861 2346432 2327333 2310871 2297405
52019 2297405 2286375 2276560 2266912 2257503 2249333 2243031 2238341 2235021 2233458 2233969 2236244 2240042 2245861 2254155
52005 2254155 2264244 2274657 2284488 2294009 2304154 2315699 2328785 2342961 2357629 2372412 2386895 2400377
51993 2400377 2412377 2423071 2432455 2439413 2442722 2442857 2441534 2439329 2435240 2428817 2420904 2411472 2398601
51980 2398601 2381125 2360921 2340841 2321403 2301202 2279651 2257287 2234079 2209784 2185943 2165200
51969 2165200 2147951 2131462 2113083 2092876 2072335 2052082 2032011 2012547 1994302 1976995 1959842
51958 1959842 1942739 1926122 1909771 1892618 1873935 1854212 1834747 1816573 1799748 1783373 1766217
51947 1766217 1747380 1726530 1703800 1679713 1655013 1630198 1605243 1580041 1554929 1530371 1506275
51936 1506275 1482157 1457815 1433389 1408901 1384498 1361058 1339689 1320358 1301716 1282540 1262709
51925 1262709 1242515 1221785 1200266 1178353 1156846 1136264 1116848 1098924 1082736 1067993 1053989
51914 1053989 1040196 1026667 1014036 1003169 994434 987129 980014 972808 966916 964328 965883 970825 977756
51901 977756 985587 993603 1001114 1007403 1011999 1014839 1016041 1015645 1013757 1010932 1008172 1006523 1006908 1010248 1017042
51886 1017042 1026492 1036801 1047152 1059067 1075067 1096241 1121887 1151182 1184045 1220187 1258277
51875 1258277 1296346 1332162 1362988 1385861 1398851 1401711 1395099 1379772 1356759 1327664 1294338 1258616
51863 1258616 1222405 1187177 1152979 1118748 1084093 1050259 1018975 991018 966297 944486 924976
51852 924976 906961 890337 875934 864213 854426 845904 839396 836015 835368 835909 836932 838962 842080 844934
51838 844934 845693 843375 838156 831086 823478 815866 807414 797053 785287 774224 765640 759617 755126 751264
51824 751264 747704 744632 742716 742743 744915 748729 753636 759514 766406 774155 782391 790588 798184 805033 811653
51809 811653 818477 824774 828811 829303 826375 821144 814870 808579 802900 798026 794116 791741 791476 793047 795494
51794 795494 798115 800586 802136 801592 798643 794165 788824 782206 774006 765204 757041 749420 741449 733210
51780 733210 725676 718876 711468 702682 693815 687116 683784 683587 685827 689716 693933 696760 697147 695533 693385
51765 693385 692064 692164 693546 695556 697128 697083 694839 691020 687165 684557 683367 683012 683183 684120 685820 687500
51749 687500 688390 688888 690310 693270 696799 699419 700713 701274 701453 701056 700386 700581 702257 704366 705189 704220
51733 704220 702326 700196 697586 694290 691062 688912 687922 687316 686630 686286 686973 688778 691103 693277 695135
51718 695135 696944 698837 700547 701860 703216 705521 709275 714092 719198 724270 729730 736387 744675 753993
51704 753993 762725 769277 773283 775605 777098 777707 776778 773702 767986 759342 748494 737554 728671 722062
51690 722062 716030 709180 702039 696089 691840 688599 685843 683893 683072 683021 683261 683819 684759 685664 686404 688106
51674 688106 692273 698773 705616 711122 715493 719697 723731 727011 729939 733887 739526 746096 752486 758147
51660 758147 762629 765026 764572 761485 756781 751447 746122 741361 737788 735800 735048 734279 732107 728359 724394
51645 724394 721570 719744 718100 717162 718646 722844 727338 729194 727838 725043 722728 721582 721351 721390 720971
51630 720971 719731 717849 715414 711958 707137 701517 696006 690842 685902 681652 678875 677593 677273 678143 681241
51615 681241 686790 693358 699110 703441 707151 711474 717073 723426 729175 733740 738739 746743 758130 769956
51601 769956 778583 782834 783853 782639 778987 772807 765319 758237 752304 747274 743288 741614 743485 748355
51587 748355 753918 758122 760589 761585 760414 756033 749119 742069 736524 731973 727327 722731 718859 715409
51573 715409 711603 707625 704207 700911 696162 689270 681448 674456 669005 664857 661754 659585 657921 655974
51559 655974 653085 649187 644887 641134 638526 636861 635310 633009 629508 625116 621051 618854 619075 620797
51545 620797 622868 625256 628527 632427 636047 639449 643996 650671 658904 667641 676981 688014 701293 715873
51531 715873 729657 740401 746758 748829 747788 744996 741690 739234 738810 740506 743302 746470 750496 756263
51517 756263 763848 772734 782732 793995 806375 819530 833532 848680 864677 880679 896269 911799
51505 911799 927466 942588 956382 969297 983136 999614 1019016 1040519 1063687 1089041 1116767
51494 1116767 1145344 1172259 1195958 1216294 1232989 1244744 1250415 1250223 1245053 1235298 1221285 1204211
51482 1204211 1185542 1165608 1143814 1120108 1095380 1070500 1045959 1022474 1000926 981411 963145
51471 963145 945519 928478 911673 894283 876144 858324 841972 827192 813487 800699 788964
51460 788964 778190 768088 758386 748696 738760 729161 721162 715248 710393 705241 699546 693884 688600 683755
51446 683755 679641 676562 674347 672751 671855 671502 670910 669719 668830 669119 669824 669615 668926 669520 671624 673263
51430 673263 673175 672733 673717 675412 675617 673960 672513 672916 674230 674252 672127 668984 666410 664974 664197 663362 661951
51413 661951 659403 654951 648247 640186 632697 627252 623642 620404 616406 611795 607480 604094 601728 600491
51399 600491 600782 602712 605506 608044 610038 612190 614996 618032 620894 624186 628697 633979 638895 643691
51385 643691 650434 660945 675010 690946 707012 721729 733840 743188 751278 759878 768959 776671 781243
51372 781243 782173 779665 773917 765421 755276 744525 733433 721889 710415 700226 692044 685102 677817
51359 677817 669614 661732 655812 651980 649060 646640 645970 648201 652460 656488 658842 659701 659836 659817 660377 662582
51343 662582 667021 673102 679490 685200 690301 695780 702691 711200 720499 729737 738753 747752 756885 766745
51329 766745 778646 793310 809442 824706 838350 852084 868351 888564 913036 941403 972621
51318 972621 1005584 1040396 1078265 1119553 1162645 1205186 1245424 1281634 1311422 1333071 1347015
51307 1347015 1354641 1355848 1349029 1333322 1309628 1279387 1243622 1203537 1160845 1116842 1071966 1026966
51295 1026966 983847 944832 910615 880189 852282 826553 803495 783599 766729 752192 739323
51284 739323 727872 717777 708790 700608 693158 686332 679638 672755 666364 661711 659012 656882 653682 649009
51270 649009 643518 637780 631898 626042 620697 616200 612361 608803 605605 603422 602789 603364 604121 604425 604664
51255 604664 605492 606703 607324 606774 605498 604437 604231 604968 606335 607952 609699 611580 613023 612865 610671 607699
51239 607699 605618 604462 602920 600559 598449 597339 596637 595853 595715 596873 598592 599959 601490 604193 607765
51224 607765 611148 614410 618469 623127 627109 630264 634117 639585 645424 649821 652569 654762 657041 659118
51210 659118 660730 662200 664002 666224 668515 670401 671760 673018 674619 676207 676653 675054 671497 666941
51196 666941 662669 659611 657509 654788 650055 643921 638558 635233 633121 630862 628252 625695 622952 619621
51182 619621 616431 614873 615446 617040 618166 618315 618103 618572 620329 622957 625282 626467 626663 626352 625525 624039
51166 624039 622380 621297 620829 620453 619999 619644 619088 617736 615918 615055 616175 618921 622421 626400 630812 634926
51150 634926 637707 639061 640004 641502 643612 646017 648988 653368 659501 666454 672567 676764 679150 680389
51136 680389 680911 680955 680903 681069 681241 680884 679723 677813 675252 672297 669568 667548 666034 664666 663857 664344 665854
51119 665854 667283 668368 670079 672747 674931 675080 673460 671302 668634 664463 658996 654262 652003 651916 652573
51104 652573 653350 654757 657236 660325 662989 664425 664507 663701 662626 661689 661047 660635 660084 658897 657132 655740
51088 655740 655769 657227 659092 660362 660672 660029 658660 657257 656673 657027 657581 657776 657891 658400 659255 660264 661634
51071 661634 663522 665392 666507 666876 667130 667537 667772 667717 667985 669447 672525 676944 681895 686461 690125 692933
51055 692933 695112 696837 698532 700872 703936 706757 708491 709810 712235 716080 719945 722468 723678 724311
51041 724311 724730 725220 726606 729641 734003 738564 742485 745533 747630 748737 749135 749321 749662 750479 752177 754758
51025 754758 757406 759220 760273 761376 762880 764369 765539 766666 768083 769846 772140 775334 779265 783029
51011 783029 785911 788182 790668 794030 798840 805850 815494 827256 840039 853119 866448 880323 895347
50998 895347 912579 932867 955601 978439 998707 1015091 1027966 1038424 1047396 1055620 1063772 1071973
50986 1071973 1079278 1084366 1087047 1088599 1090054 1090591 1088393 1082878 1075163 1066366 1056721 1046762 1038060 1031604
50972 1031604 1026139 1019356 1010380 999971 988641 976152 963185 951985 944354 939743 936260 933115 931336
50959 931336 932378 936796 944131 953430 963709 974446 985781 998069 1011251 1024925 1038931 1053415
50947 1053415 1068093 1081706 1092591 1099967 1104699 1108691 1113375 1118803 1124155 1128737 1132141 1133856 1133700
50934 1133700 1132834 1133403 1136583 1141639 1147536 1154732 1164360 1176173 1188741 1201754 1216829 1235600 1258109
50921 1258109 1283631 1311914 1342570 1374045 1404474 1433363 1461505 1489507 1517538 1546523 1578377
50910 1578377 1614549 1655049 1699355 1747555 1800085 1856950 1917918 1983113 2052646 2125709 2200682
50899 2200682 2276303 2352313 2428771 2504994 2579390 2650208 2716271 2777021 2832129 2881369 2924880
50888 2924880 2963088 2995950 3022627 3042584 3057014 3068529 3079253 3089720 3099610 3108438 3115073 3117678
50876 3117678 3115289 3108913 3100023 3088362 3072384 3051586 3027027 2999334 2967494 2930148 2887059 2838770
50864 2838770 2785679 2728165 2666905 2602443 2535092 2465885 2396935 2329980 2265098 2201709 2140398
50853 2140398 2082736 2029517 1980187 1933959 1890560 1849741 1810994 1774190 1739968 1709118 1681829
50842 1681829 1657663 1635833 1615399 1595644 1576572 1558884 1543330 1530133 1518931 1509024 1499893 1491846
50830 1491846 1485959 1482885 1481849 1481379 1480966 1481423 1483671 1487806 1493464 1500389 1508363 1517218 1527283 1539398
50816 1539398 1554187 1571655 1591597 1613881 1638080 1663359 1689157 1715742 1743920 1774609 1808767
50805 1808767 1847003 1888924 1933471 1980369 2030733 2085823 2145813 2210309 2279405 2353501 2432707
50794 2432707 2517405 2608999 2709045 2817867 2935012 3060781 3195943 3339787 3489875 3644390
50784 3644390 3803650 3968441 4137662 4308511 4478321 4645013 4806003 4957970 5098073
50775 5098073 5224649 5336340 5431224 5507447 5564598 5604135 5628627 5640711 5642517 5635721 5622157
50764 5622157 5604485 5586019 5569605 5556700 5547596 5542147 5539621 5537870 5533262 5521875 5500678 5467684
50752 5467684 5421511 5361184 5285955 5194950 5087461 4964194 4827985 4682586 4530790 4374326
50742 4374326 4215440 4057602 3904328 3757976 3620059 3491959 3374643 3268115 3171924 3086139
50732 3086139 3011359 2947847 2895022 2851599 2815868 2786064 2760998 2740323 2723946 2711387 2701797
50721 2701797 2694094 2686649 2677519 2665964 2653445 2642024 2631731 2620328 2605725 2587668 2566932 2544051
50709 2544051 2519412 2493483 2465957 2435411 2400947 2363888 2326783 2290896 2255679 2220677 2186805
50698 2186805 2155297 2126445 2100204 2077470 2059772 2047724 2040526 2037103 2037193 2041086 2048948 2060983 2077931
50685 2077931 2100565 2128485 2159993 2193700 2230154 2271497 2319557 2374476 2434987 2499548 2567197
50674 2567197 2637865 2712198 2790839 2873561 2959146 3046171 3133730 3221347 3308497 3394529 3478832
50663 3478832 3560737 3639292 3713338 3781693 3843031 3895606 3937440 3966866 3982925 3985542 3975769 3955950
50651 3955950 3929177 3898210 3864917 3830919 3798590 3771021 3750643 3737870 3731254 3729015 3730161 3734019
50639 3734019 3739053 3742735 3742639 3737141 3724853 3703958 3672685 3630379 3577810 3516641 3448967 3377152
50627 3377152 3303563 3230349 3159719 3094202 3035941 2985505 2941961 2904484 2873678 2851129 2837991
50616 2837991 2834234 2838904 2850747 2868915 2893626 2926043 2966932 3015194 3067959 3122183 3175967 3228333
50604 3228333 3278352 3325078 3368385 3409417 3449820 3490513 3531228 3571050 3609116 3644810 3677735
50593 3677735 3707821 3735371 3760785 3784453 3807154 3830221 3854657 3880158 3905727 3931465 3959151
50582 3959151 3990709 4026750 4066996 4111437 4160121 4212166 4265928 4320132 4374065 4426594 4475857
50571 4475857 4520271 4559315 4593146 4622064 4646511 4666882 4682860 4693393 4697560 4694768 4683727 4662282
50559 4662282 4629422 4587203 4539817 4490991 4443165 4398832 4361032 4331615 4309746 4292946 4279455
50548 4279455 4269037 4261700 4256198 4249876 4239519 4222191 4195536 4157944 4108864 4048857 3978897 3899457
50536 3899457 3810744 3714079 3612526 3509505 3407078 3306092 3207463 3112239 3020555 2931886
50526 2931886 2846842 2767578 2695613 2630110 2569272 2512929 2462705 2420001 2384856 2356655 2334712
50515 2334712 2317975 2305281 2296493 2292650 2294359 2300589 2309773 2321766 2337943 2359367 2385387 2414191
50503 2414191 2444381 2475876 2509555 2546298 2586443 2630127 2677836 2730124 2786706 2846364 2908202
50492 2908202 2972581 3040203 3110469 3181579 3252392 3323395 3395335 3467600 3538791 3608826 3679736
50481 3679736 3754236 3833995 3919409 4010455 4107102 4209049 4315638 4426487 4542190 4664072
50471 4664072 4792931 4927921 5066996 5208813 5354257 5505883 5665707 5833351 6005888
50462 6005888 6179194 6349808 6515992 6676950 6830636 6972622 7097799 7203061 7287435 7349688
50452 7349688 7387133 7397454 7380613 7338071 7271044 7180806 7070099 6942841 6802651 6653083
50442 6653083 6499321 6348064 6205046 6073541 5955729 5854388 5772484 5711794 5672549 5653721
50432 5653721 5652928 5666585 5690726 5721130 5752117 5776079 5785298 5774118 5739069 5677926 5590049 5477240
50420 5477240 5342888 5190113 5021816 4842556 4658896 4476918 4299850 4128443 3962980
50411 3962980 3804324 3653546 3511364 3378030 3253498 3137803 3031347 2934581 2847195 2768018
50401 2768018 2696022 2631269 2574561 2526312 2486012 2452707 2425857 2405774 2393219 2388237 2389268 2393808
50389 2393808 2400392 2409733 2423467 2441950 2463934 2488487 2516488 2549576 2587840 2629082 2670231 2708770
50377 2708770 2742637 2769675 2788362 2799204 2804712 2807546 2808924 2809055 2808727 2809859 2814397 2822943 2834721
50364 2834721 2848895 2865813 2886909 2913435 2945507 2982427 3023581 3068823 3118353 3172837 3233446
50353 3233446 3301059 3375226 3454409 3537403 3624003 3714106 3806665 3899772 3991350 4079633 4163553
50342 4163553 4242797 4316752 4383139 4438612 4481273 4511695 4530560 4536077 4524880 4495111 4447617
50331 4447617 4384627 4308632 4222488 4129100 4030418 3927647 3822960 3720321 3624195 3537841 3462844
50320 3462844 3399368 3346549 3303435 3270137 3247498 3235207 3230797 3231039 3233829 3238103 3242268 3243389 3237905
50307 3237905 3222798 3196311 3158106 3108870 3049669 2981798 2907409 2830024 2753868 2682201 2616028
50296 2616028 2554293 2495493 2439260 2386235 2336404 2288088 2239109 2188551 2136694 2083649 2029368
50285 2029368 1975259 1924485 1879658 1840761 1806136 1775113 1748714 1727886 1712012 1699506 1689297
50274 1689297 1681260 1675484 1671714 1669566 1668907 1669639 1671266 1673072 1674837 1677116 1680739 1686203 1693558 1702451
50260 1702451 1712251 1722637 1734175 1747508 1761677 1774219 1783689 1791257 1798911 1806991 1814897 1823410 1834292
50247 1834292 1847563 1861105 1873505 1885710 1899183 1913926 1929305 1945562 1963248 1982016 2001280
50236 2001280 2021566 2044061 2069039 2095646 2123210 2152005 2182516 2213995 2243457 2266162 2277940
50225 2277940 2277665 2267291 2249607 2226789 2201001 2174848 2150371 2128561 2110603 2098494 2093553 2095216
50213 2095216 2102226 2114020 2129972 2148440 2168109 2189626 2214473 2242836 2274000 2308278 2346812
50202 2346812 2389657 2435482 2483072 2531728 2580398 2627972 2674338 2719590 2762208 2799819 2832083
50191 2832083 2861070 2888168 2912184 2931265 2945129 2954205 2957634 2953319 2939366 2914674 2879038 2833791
50179 2833791 2781943 2726804 2670684 2615390 2563215 2516322 2475211 2438470 2403799 2368840 2331454
50168 2331454 2290148 2244618 2195748 2145225 2095185 2047624 2003462 1962186 1922627 1884004 1846284
50157 1846284 1810122 1776690 1746936 1720513 1695821 1671618 1648237 1626746 1607261 1588735 1570293
50146 1570293 1552232 1535645 1521322 1508988 1497446 1485684 1474080 1464316 1457700 1453682 1450233 1445622
50134 1445622 1439593 1433039 1426941 1421732 1417482 1414426 1412995 1413117 1413697 1413322 1411638 1409685 1408809 1409562 1411595
50119 1411595 1414118 1416292 1417839 1419620 1423178 1429257 1437116 1445665 1454861 1465463 1477693 1490737 1503563
50106 1503563 1515818 1527946 1540786 1555187 1571749 1590747 1612180 1635815 1661368 1688971 1719465
50095 1719465 1753823 1792298 1834642 1881244 1933303 1991598 2055832 2125753 2202084 2285420 2374694
50084 2374694 2467969 2564561 2665081 2769024 2873486 2975039 3072136 3164895 3253229 3336428
50074 3336428 3414429 3488172 3557991 3622125 3677250 3719934 3747109 3755843 3743887 3710821 3658129
50063 3658129 3587934 3502228 3403643 3296320 3185155 3074008 2964815 2858350 2755586 2658353
50053 2658353 2568756 2487785 2414495 2346875 2283734 2225440 2172713 2125198 2081529 2040376 2001064
50042 2001064 1963703 1929133 1898150 1870128 1842981 1815270 1787884 1762696 1740066 1718947 1699193
50031 1699193 1682254 1669208 1659286 1650801 1642542 1633910 1624900 1616719 1611467 1610188 1611638 1613662 1615283
50018 1615283 1616920 1619193 1622393 1626814 1632725 1639936 1647827 1655727 1663065 1669463 1675018 1680194 1685142 1689507
50004 1689507 1693127 1696399 1699503 1701830 1702724 1702391 1701560 1700655 1699904 1699881 1701167 1703491 1705749 1706953 1707051 1707117 1708941
49987 1708941 1713875 1721643 1730716 1740226 1750976 1764123 1779701 1797367 1817906 1842635 1871440 1902598
49975 1902598 1934794 1968240 2003536 2040484 2078668 2118573 2161391 2208045 2258914 2314159 2373617
49964 2373617 2436375 2500887 2565623 2629351 2690711 2747891 2799046 2843010 2879459 2908616 2931212
49953 2931212 2948700 2962723 2973752 2980426 2980516 2972085 2953279 2921776 2875830 2815925 2744468 2663879
49941 2663879 2576182 2484571 2393759 2307770 2228264 2155595 2090222 2031993 1979235 1930223 1885048
49930 1885048 1844663 1808437 1774137 1740274 1707136 1675416 1644976 1615133 1585140 1554286 1522709
49919 1522709 1492274 1465443 1442703 1422033 1401433 1381111 1362615 1346652 1332568 1319511 1307293
49908 1307293 1296323 1287212 1280249 1274849 1269598 1263183 1255303 1246662 1238342 1231250 1225852 1222251 1220613 1221427
49894 1221427 1224933 1230316 1236044 1241216 1246245 1252060 1258992 1266621 1274252 1281248 1287173 1291927 1295608 1298140
49880 1298140 1299199 1298543 1296200 1292341 1287169 1280818 1272990 1262818 1249782 1234856 1220170 1207163 1195499
49867 1195499 1184105 1172832 1162603 1154182 1147409 1141797 1137452 1135045 1134795 1135825 1136872 1137717 1139446 1143008
49853 1143008 1147876 1152564 1156170 1158870 1161200 1163670 1167121 1172547 1180056 1188425 1196112 1202520 1208144 1213868
49839 1213868 1220500 1228673 1238657 1249937 1261032 1269987 1275469 1277677 1277916 1277001 1274297 1268719 1260334 1250402
49825 1250402 1239910 1228866 1217182 1205566 1195049 1185898 1177441 1168885 1160117 1151612 1143621 1135712 1127543
49812 1127543 1120047 1115059 1113246 1113059 1112614 1112159 1113668 1118140 1124443 1131001 1137565 1144921 1153675 1163849
49798 1163849 1175069 1186634 1197910 1208996 1220526 1232517 1243955 1253943 1262655 1270577 1277312 1281815
49786 1281815 1283745 1283911 1283289 1281915 1278928 1273732 1266999 1260266 1254341 1248362 1240926 1231967 1222979 1215364
49772 1215364 1209199 1203702 1198314 1193080 1188425 1184793 1182256 1180549 1179762 1180687 1183767 1187950 1191602 1194705
49758 1194705 1199120 1206309 1215600 1225031 1233084 1239217 1243642 1247276 1251237 1255757 1259975 1263168 1265528 1267305
49744 1267305 1267942 1266670 1263393 1258490 1252365 1245635 1239005 1232383 1224932 1216640 1208943 1202862 1197296 1190278
49730 1190278 1181335 1171547 1161905 1152902 1145378 1140238 1137186 1134896 1132677 1130989 1130182 1129741 1129179 1128817 1129186
49715 1129186 1130346 1132245 1135338 1140296 1147275 1155655 1164405 1172689 1180285 1187370 1193770 1198737 1201856 1203869
49701 1203869 1206032 1208659 1210825 1211486 1210444 1208199 1205267 1201702 1197087 1191106 1184276 1177818 1172411 1167391
49687 1167391 1161577 1154500 1146403 1137666 1129129 1122560 1119614 1120105 1121963 1123028 1122462 1120766 1119432 1120451
49673 1120451 1125016 1132261 1139998 1146866 1153038 1158752 1163370 1166601 1169763 1174830 1182458 1191605 1200940 1210115
49659 1210115 1219736 1230501 1242368 1254426 1265592 1275389 1283876 1290952 1296130 1298853 1298614 1294949 1288152
49646 1288152 1280047 1273172 1268759 1266104 1264137 1262758 1262217 1262201 1262457 1263576 1266046 1268881 1270409 1270372 1270209 1271067
49630 1271067 1272548 1273895 1275561 1278884 1284713 1292982 1303320 1315298 1328165 1341099 1354087 1368113
49618 1368113 1384170 1402259 1421632 1441756 1462560 1483625 1503544 1520415 1532936 1540940 1545013 1545923
49606 1545923 1544487 1541741 1538868 1536846 1536243 1537404 1540565 1545406 1550520 1553793 1553610 1549464 1541247 1528535
49592 1528535 1511201 1490501 1468768 1448025 1429472 1414100 1402609 1394312 1387232 1380218 1374369 1371451
49580 1371451 1371331 1371945 1371658 1370709 1370245 1370734 1371549 1371477 1369359 1364709 1358048 1350454 1342722 1335187 1328123 1321732
49564 1321732 1315701 1309447 1303122 1297899 1294770 1293266 1291739 1288994 1285524 1283030 1282627 1283499 1283578 1281769 1279296
49549 1279296 1278575 1280978 1285983 1292175 1298385 1303817 1307867 1310374 1311862 1313180 1314818 1316605 1318046 1319012
49535 1319012 1320022 1321696 1323934 1326029 1327687 1329451 1331864 1334720 1337478 1339855 1341545 1342048 1341501 1341087 1341665
49520 1341665 1342503 1342480 1342100 1342949 1345284 1347775 1349985 1353468 1359633 1367750 1376091 1384176 1392740 1402063 1411482
49505 1411482 1420438 1429199 1438519 1448972 1460413 1471715 1481402 1489007 1495474 1501733 1507339 1511125 1512808
49492 1512808 1513105 1512403 1510259 1506497 1502141 1498747 1497031 1496549 1496783 1498170 1501587 1506803 1512023 1515577 1517773
49477 1517773 1520395 1524461 1529448 1534785 1540977 1548646 1557464 1566998 1578046 1592090 1609693 1630272 1653251
49464 1653251 1678568 1706145 1735844 1768030 1803179 1840274 1876022 1906247 1928207 1941716 1948585
49453 1948585 1951402 1952676 1954461 1958119 1963928 1970998 1977924 1983724 1987860 1989370 1986518 1977739 1962760 1942688
49439 1942688 1919390 1894908 1870792 1847367 1823986 1800512 1778113 1758152 1740800 1725513 1712378
49428 1712378 1701913 1693752 1686685 1680145 1674641 1670509 1667265 1664727 1663759 1665062 1667814 1670369 1671908 1672630
49414 1672630 1672638 1671638 1669887 1668510 1668422 1669432 1670875 1672703 1675239 1677967 1679396 1678637 1676684 1675509 1675955 1677275
49398 1677275 1678853 1681509 1686337 1692736 1698641 1702747 1705605 1708172 1710156 1710508 1709120 1707056 1705129 1702992
49384 1702992 1699952 1696178 1692717 1690634 1690562 1692893 1697784 1704695 1712170 1718517 1723044 1726779 1731964 1740509
49370 1740509 1752571 1766624 1781152 1796253 1813271 1832813 1853573 1873436 1891456 1908345 1925148
49359 1925148 1941745 1956494 1967003 1971538 1970377 1965949 1961155 1957330 1954175 1951672 1951463 1955856 1965856
49346 1965856 1980584 1998441 2018369 2040037 2063280 2087746 2113101 2139379 2166788 2194972 2222732
49335 2222732 2248814 2272930 2295615 2317227 2337527 2356157 2372758 2386406 2395749 2400367 2401592 2401361
49323 2401361 2400342 2397580 2391796 2382624 2370768 2357402 2343563 2329920 2317005 2305430 2295568 2287176
49311 2287176 2279891 2274083 2270535 2269076 2268409 2267710 2267560 2268639 2270324 2271454 2271738 2271281 2269271 2264534 2257354
49296 2257354 2249482 2242218 2235461 2228690 2221682 2213993 2204879 2194295 2183169 2172207 2161338 2150705 2141186
49283 2141186 2133190 2125782 2117893 2109766 2102403 2096174 2090770 2085996 2081690 2077419 2073317 2070881 2071683 2075376
49269 2075376 2080099 2084953 2091015 2099766 2111615 2126251 2143169 2161013 2177227 2189179 2195294 2194788 2187377
49256 2187377 2174214 2158305 2142532 2127318 2111148 2093071 2073532 2052906 2030848 2007683 1985239
49245 1985239 1965393 1948578 1934481 1923357 1915511 1909997 1905098 1900098 1895684 1892663 1891266 1891686 1894061
49232 1894061 1897409 1899587 1899108 1896550 1893578 1891029 1888527 1885458 1881436 1876031 1869011 1861168 1854296 1849900
49218 1849900 1848135 1848189 1849485 1852325 1857478 1865313 1875247 1885931 1896010 1904803 1912292 1918548 1923338 1926366
49204 1926366 1927782 1928218 1928269 1928171 1928179 1929043 1931672 1936266 1942188 1948887 1956513 1965404 1975536 1986881 1999610
49189 1999610 2012993 2024523 2031350 2032723 2030064 2024441 2015063 2000795 1982246 1961618 1941160 1922342
49177 1922342 1905857 1891508 1878468 1866461 1856547 1850138 1847451 1847489 1849233 1852298 1856774 1863187 1872395
49164 1872395 1884676 1898832 1912767 1925023 1935486 1944889 1954234 1964512 1976274 1989311 2003052 2017079
49152 2017079 2030943 2044043 2056408 2069203 2083483 2098659 2113290 2127403 2142900 2161335 2182218
49141 2182218 2204016 2226004 2248519 2271837 2295456 2318407 2340061 2360752 2381558 2403107 2424660
49130 2424660 2444845 2463240 2480693 2498179 2516017 2534168 2552487 2570534 2588013 2605781 2625701
49119 2625701 2649044 2675521 2704155 2734478 2766569 2800689 2837391 2877566 2921902 2970584 3023368
49108 3023368 3078987 3134009 3183318 3222748 3251199 3270086 3281574 3287909 3291393 3293634 3294846 3294597
49096 3294597 3293167 3291661 3291093 3291938 3294318 3298109 3303051 3309075 3316201 3323952 3331797 3340669 3353063 3370507
49082 3370507 3391616 3413796 3436334 3460522 3487201 3515711 3545203 3575496 3606493 3638134 3671244
49071 3671244 3707013 3745122 3783721 3821869 3860738 3901532 3943525 3985465 4028107 4073879 4124325
49060 4124325 4179073 4237362 4299650 4367516 4442515 4525106 4614330 4708818 4808683 4916227 5034402
49049 5034402 5165144 5310234 5473361 5659484 5870443 6100590 6336979 6565072 6776713
49040 6776713 6974431 7167062 7357862 7534422 7670717 7741465 7737336 7668756 7556612 7418622
49030 7418622 7261541 7083094 6880183 6655999 6420747 6186845 5964058 5758355 5573096
49021 5573096 5409538 5266656 5141993 5033236 4938663 4856507 4784984 4723031 4669962 4624000
49011 4624000 4582088 4541907 4503525 4468466 4437512 4410075 4385358 4363315 4344356 4328614 4315666
49000 4315666 4304697 4294858 4285671 4277164 4269635 4263371 4258627 4255509 4253651 4252394 4251707 4252748 4256966 4264596
48986 4264596 4274384 4284736 4294733 4303996 4311922 4317315 4318817 4315936 4309989 4303877 4300338 4300092 4301901 4304552
48972 4304552 4308506 4315433 4326362 4340599 4356503 4373020 4390182 4408007 4425295 4440104 4451588 4460932
48960 4460932 4470179 4480463 4491686 4503386 4515198 4526684 4537593 4548579 4561096 4576274 4594018
48949 4594018 4613227 4632567 4651154 4669061 4687268 4706632 4726706 4745983 4763439 4779376 4794607
48938 4794607 4809340 4823248 4836173 4848255 4859498 4869486 4877384 4882248 4883764 4882961 4881631 4880554 4878580
48925 4878580 4874016 4866790 4858830 4852387 4848334 4845910 4843545 4839809 4834038 4826523 4818133 4809676 4801458 4793309
48911 4793309 4785016 4776871 4769741 4764246 4759856 4755270 4750004 4745211 4742580 4742846 4745808 4751381 4759669 4770047
48897 4770047 4781200 4792686 4805905 4822886 4844266 4868973 4895765 4924512 4955845 4990075 5026777
48886 5026777 5065201 5104723 5145107 5186668 5230104 5275774 5323160 5371466 5420899 5472925 5529077
48875 5529077 5589838 5654955 5724272 5797663 5874456 5953725 6035311 6120060 6208798 6301304 6396343
48864 6396343 6492541 6589257 6686847 6786051 6887003 6989049 7091717 7195332 7300240 7405809
48854 7405809 7510960 7615326 7718981 7821269 7920965 8017588 8111411 8202015 8288179 8369668
48844 8369668 8447813 8523482 8595645 8663122 8726734 8788194 8847298 8901796 8950111 8992863 9031397
48833 9031397 9065865 9095348 9119168 9137579 9151522 9161987 9169229 9172309 9169627 9160185 9144298 9123133
48821 9123133 9097752 9068444 9034641 8995481 8950738 8901081 8847103 8788334 8723799 8653502 8578688
48810 8578688 8500478 8418849 8333311 8244178 8152619 8059712 7966053 7872428 7780380 7691476 7605892
48799 7605892 7522153 7438830 7356519 7277687 7204381 7136443 7072213 7010542 6951633 6896128 6844025
48788 6844025 6794821 6748562 6706418 6669902 6639407 6613822 6591976 6574233 6561965 6555517 6553481 6554216
48776 6554216 6557302 6563205 6572366 6585162 6602032 6622959 6647396 6675129 6706348 6740213 6774472 6807761
48764 6807761 6841417 6877508 6915622 6953387 6989978 7027185 7066631 7107674 7148797 7189637 7230521
48753 7230521 7271053 7310389 7348542 7386539 7425467 7465797 7507293 7549117 7590351 7630776 7670913
48742 7670913 7711267 7752127 7794116 7838028 7883657 7929583 7974678 8019152 8063487 8106990 8148131
48731 8148131 8185863 8219942 8250330 8276988 8299971 8319246 8334734 8346938 8356931 8364989 8369636 8368758
48719 8368758 8361399 8347915 8328874 8304583 8275289 8240840 8200354 8153227 8100398 8043695 7983867
48708 7983867 7920152 7851836 7779322 7703486 7625010 7544660 7463232 7380508 7295091 7206174 7115103
48697 7115103 7024448 6935821 6849335 6765016 6683822 6606901 6534325 6464935 6397366 6331089 6266536
48686 6266536 6204428 6145179 6088972 6036142 5987068 5941736 5899870 5861621 5827667 5798323 5773075
48675 5773075 5751365 5733300 5718962 5707420 5697304 5688222 5680799 5675295 5671222 5668570 5668328 5671096 5675891
48662 5675891 5681138 5686358 5692106 5698731 5706031 5713811 5721825 5729367 5735929 5742170 5749265 5757382 5765861 5774798
48648 5774798 5785054 5796494 5807786 5818563 5830179 5843192 5855580 5865035 5872080 5879167 5887318 5895519
48636 5895519 5903205 5911393 5921085 5932250 5944829 5959253 5975196 5991132 6005984 6020276 6034962 6050075
48624 6050075 6065369 6081371 6098702 6116922 6135059 6152955 6171373 6191084 6212646 6236642 6263175
48613 6263175 6291152 6318838 6345374 6371510 6398997 6429455 6463186 6498111 6529798 6553244 6564996
48602 6564996 6563595 6548353 6518315 6472460 6410554 6333759 6244604 6146351 6042311 5935776 5830278
48591 5830278 5729033 5633713 5544355 5460929 5384362 5315360 5252899 5194949 5140418 5089295 5040938
48580 5040938 4993455 4945334 4896919 4849700 4804570 4761214 4718814 4676865 4635433 4595011 4556097
48569 4556097 4518777 4482742 4447770 4413964 4381358 4349494 4317707 4285979 4255355 4227206 4201902
48558 4201902 4178405 4155605 4133982 4115353 4100761 4089175 4078833 4069405 4062020 4057246 4053834 4049783
48546 4049783 4044237 4037998 4032396 4027903 4023872 4019481 4014807 4010730 4007835 4005773 4003819 4001554 3998697 3994865
48532 3994865 3990106 3985194 3980617 3975547 3968656 3959722 3949414 3937461 3922222 3902666 3880031 3856883
48520 3856883 3834980 3814439 3794401 3773858 3752319 3730401 3709629 3691135 3674659 3659170 3644207
48509 3644207 3630076 3617022 3604957 3594080 3585104 3578395 3573089 3567245 3558830 3546664 3530785 3512104
48497 3512104 3491581 3469549 3445779 3420104 3392860 3364871 3337242 3311093 3287149 3265422 3245397
48486 3245397 3226508 3208243 3189853 3170418 3149467 3127307 3104483 3081206 3057706 3034873 3013793
48475 3013793 2994428 2975444 2955843 2936459 2919261 2905410 2894632 2886351 2880566 2877420 2876729 2878585
48463 2878585 2883822 2893008 2905096 2917621 2928121 2934823 2936206 2930938 2918713 2900754 2879256 2856647
48451 2856647 2835351 2817414 2803767 2794105 2787756 2784320 2783397 2784491 2787724 2794068 2804177 2817443 2832855
48438 2832855 2850119 2868763 2886405 2899388 2905450 2904824 2898491 2886633 2869486 2848557 2825837 2802343
48426 2802343 2778405 2754918 2733230 2713916 2696456 2680035 2663996 2647875 2631866 2617072 2604369
48415 2604369 2593098 2581777 2570065 2559071 2549734 2542004 2535694 2530916 2527281 2523856 2520384 2517498 2515203
48402 2515203 2512384 2508598 2505145 2503231 2502065 2500113 2497544 2496005 2496251 2497215 2497270 2495422 2491403 2485507 2478194
48387 2478194 2469204 2457570 2443312 2428367 2414587 2401448 2387249 2372110 2357977 2345672 2333774
48376 2333774 2320673 2306088 2290115 2272503 2253661 2235046 2217696 2201400 2185849 2171389 2157940
48365 2157940 2144467 2130422 2116706 2104369 2093330 2083149 2073991 2066000 2058752 2052186 2046907 2042539
48353 2042539 2037027 2028911 2019349 2010520 2002975 1996149 1990452 1986688 1983662 1978543 1970218 1960791 1953190 1948363
48339 1948363 1945270 1942583 1939643 1936371 1932992 1929768 1926772 1923965 1921320 1918746 1916186 1914013 1912943 1913278
48325 1913278 1914704 1917182 1921303 1927183 1933741 1939947 1946247 1953811 1962778 1972168 1981268 1990278 1999814 2010479
48311 2010479 2022670 2036100 2049934 2064040 2079662 2098055 2118945 2141259 2165047 2191877 2223619
48300 2223619 2261479 2305450 2353611 2402309 2448134 2489817 2528012 2564048 2599599 2636647 2676836
48289 2676836 2721421 2772402 2832283 2901564 2977941 3059553 3147821 3245275 3351880 3465729 3586612
48278 3586612 3716761 3858782 4015083 4188855 4383441 4601038 4843802 5115573 5420583
48269 5420583 5761437 6140484 6561915 7030071 7547242 8116392 8744993 9443212 10220486
48260 10220486 11088382 12065608 13175902 14443300 15895835 17573080 19524081 21797442
48252 21797442 24429018 27406544 30591896 33651132 36096373 37470303 37554446 36439020
48244 36439020 34420712 31843005 28998858 26111077 23339273 20783742 18492721 16477328
48236 16477328 14725489 13211666 11906585 10784822 9824522 9002864 8295949 7682897 7147478
48227 7147478 6676557 6259782 5890366 5563269 5272154 5009584 4769813 4549801 4348029
48218 4348029 4163932 3997841 3849586 3717096 3597610 3489822 3393676 3308572 3233018 3165546
48208 3165546 3104798 3049314 2998480 2953116 2913956 2880139 2850373 2824735 2803795 2786576 2771181
48197 2771181 2757240 2746065 2738176 2731886 2724458 2713635 2698069 2677446 2652618 2625037 2595913 2566197
48185 2566197 2536891 2508664 2481618 2456085 2433081 2413027 2394638 2376183 2357464 2339419 2322286
48174 2322286 2305539 2289456 2275254 2263395 2252908 2242562 2231735 2219894 2206311 2190818 2174186
48163 2174186 2157363 2140675 2123709 2105432 2084554 2060494 2033992 2006179 1977288 1946976 1915584
48152 1915584 1883956 1852114 1819212 1784979 1750233 1715848 1682188 1649805 1619647 1592148 1566885
48141 1566885 1543333 1521075 1499148 1476439 1453377 1432147 1414321 1399031 1384233 1369097 1354232
48130 1354232 1340275 1327432 1316106 1306686 1298551 1290239 1281036 1271786 1263627 1256314 1248375 1239031 1229555
48117 1229555 1222342 1218603 1217299 1216408 1214689 1211778 1207255 1200846 1193682 1188095 1185480 1185052 1185369 1186236 1188085
48102 1188085 1189991 1189785 1186510 1181845 1178485 1177609 1178314 1179024 1178871 1177946 1176901 1176463 1176893 1177664 1177893 1177402 1177178
48085 1177178 1178466 1181350 1184467 1186233 1186197 1185154 1184225 1184164 1185397 1188270 1192940 1199074 1205852 1212395 1218255
48070 1218255 1223507 1228386 1232933 1237071 1240782 1243981 1246364 1247788 1248768 1250134 1252144 1254491 1257252 1261052
48056 1261052 1265945 1270908 1275137 1279225 1284307 1290563 1297469 1304978 1313330 1322003 1330276 1338925 1350005 1364362
48042 1364362 1380375 1395660 1409214 1421452 1433154 1445121 1458119 1472376 1487595 1503999 1522579
48031 1522579 1543601 1565489 1586085 1604587 1621579 1637841 1654121 1671539 1690801 1711069 1730694
48020 1730694 1749213 1767623 1786482 1804672 1820423 1832930 1842795 1851532 1860865 1871696 1883338 1894304
48008 1894304 1904171 1914090 1925101 1936691 1947662 1957939 1968658 1980506 1992693 2003793 2013084 2020621
47996 2020621 2026189 2028879 2028149 2025039 2021513 2018410 2014625 2008680 2000394 1990392 1978730 1965137 1950267
47983 1950267 1935421 1921062 1906708 1892320 1878336 1863943 1846855 1825823 1802313 1778692 1755616
47972 1755616 1732307 1708586 1685111 1661894 1638053 1613315 1588766 1565744 1544579 1524587 1504774
47961 1504774 1484502 1463955 1443967 1425096 1407044 1389352 1372203 1355939 1340323 1325195 1311439
47950 1311439 1300025 1290161 1279705 1267616 1254993 1243335 1232898 1223225 1214207 1205887 1197975 1190282
47938 1190282 1183073 1176479 1170194 1164245 1159373 1155994 1153412 1150674 1147637 1144556 1141275 1137610 1133967 1130798
47924 1130798 1127950 1125292 1123302 1122052 1120280 1116817 1112576 1109661 1108449 1106935 1103373 1098385 1093978 1091389
47910 1091389 1090428 1090193 1089843 1089180 1088836 1089441 1090477 1090694 1089848 1089097 1089133 1088921 1087189 1084528 1082940 1083542 1085640
47893 1085640 1088047 1090463 1093377 1097284 1102440 1108950 1116632 1124828 1132727 1140187 1148140 1157767 1169072 1180617
47879 1180617 1191082 1200781 1211063 1222550 1234747 1247119 1259330 1270266 1278329 1283573 1288485 1295405
47867 1295405 1303829 1311408 1317082 1321898 1326832 1331162 1333374 1332798 1329971 1325944 1321421 1316112 1309063 1300224
47853 1300224 1291387 1284513 1279075 1272270 1262297 1250464 1239649 1231706 1227021 1225293 1225375 1224886 1221562 1215273
47839 1215273 1208006 1201881 1197848 1196135 1196798 1199449 1203220 1207543 1212492 1217997 1223255 1227563 1231424 1236113
47825 1236113 1242044 1248158 1253162 1256969 1260513 1264492 1268878 1273698 1279534 1286737 1294547 1301605 1307186 1311384
47811 1311384 1314246 1315538 1315461 1314755 1313578 1310981 1306077 1299227 1291482 1283346 1274858 1266393 1258323 1249952 1239844
47796 1239844 1227493 1213953 1200604 1188020 1176307 1165705 1156211 1147181 1137953 1128658 1119948 1112191
47784 1112191 1105398 1099704 1095398 1092550 1091066 1091042 1092746 1096237 1101296 1107622 1114819 1122226 1129118 1135170
47770 1135170 1140609 1145856 1151128 1156358 1161496 1166989 1173833 1182787 1193472 1204618 1215287 1225481 1235490
47757 1235490 1245341 1255306 1266286 1278980 1293071 1307927 1323712 1341052 1359921 1379753 1400507 1422650
47745 1422650 1446092 1470054 1494112 1518380 1542446 1565204 1586164 1605907 1624556 1640731 1652890
47734 1652890 1661010 1665990 1667959 1666286 1660960 1652904 1643008 1631910 1620722 1610859 1602706 1595212 1587278
47721 1587278 1578995 1571161 1564132 1557664 1551435 1545206 1538745 1532197 1526432 1522358 1519682 1516722 1511842 1504889
47707 1504889 1496858 1488152 1477781 1464758 1450019 1436079 1424473 1414168 1403097 1390918 1379445 1370334
47695 1370334 1363037 1355484 1346498 1337226 1330155 1326824 1326573 1327604 1329057 1331496 1335276 1339328 1342392 1344993
47681 1344993 1349059 1355599 1363808 1372768 1382929 1395091 1408698 1422220 1435123 1448548 1463780 1480587
47669 1480587 1497373 1512717 1526502 1539592 1552591 1565030 1575752 1583891 1589344 1592540 1594231 1595342
47657 1595342 1596302 1596224 1593285 1586385 1576140 1563954 1550566 1536058 1520900 1506213 1492851 1480629 1468511
47644 1468511 1455365 1440833 1425923 1412484 1401507 1392020 1382393 1372675 1364767 1359983 1357353 1354958 1352353
47631 1352353 1350864 1351847 1355533 1361545 1369655 1379632 1390796 1402228 1413422 1424656 1436784 1450618 1466227
47618 1466227 1482757 1499104 1514808 1530174 1545631 1561222 1576552 1590770 1602597 1611045 1616469 1620529
47606 1620529 1624641 1628632 1631057 1630543 1626651 1620084 1612542 1605811 1600123 1593655 1584373 1572265 1559086 1546281
47592 1546281 1534170 1522909 1512660 1502454 1490386 1475997 1461450 1449417 1440538 1433916 1429094 1426053
47580 1426053 1423945 1421671 1419783 1420178 1423535 1428374 1433263 1438812 1446698 1457553 1470578 1484617 1498873
47567 1498873 1513025 1527402 1542823 1559738 1577664 1595750 1613492 1630622 1646749 1661613 1675369
47556 1675369 1688088 1699146 1707427 1711979 1712305 1708288 1700067 1687712 1670961 1649693 1624632 1596906
47544 1596906 1566768 1533693 1498130 1462157 1427644 1394735 1363026 1333329 1306792 1282718 1258937
47533 1258937 1234618 1211473 1191675 1175385 1160770 1145991 1130929 1117324 1107194 1100708 1095788 1090268
47521 1090268 1084006 1078040 1072302 1065713 1058560 1052922 1049872 1047500 1042939 1035721 1028159 1022803 1020320 1019516
47507 1019516 1018608 1016497 1013317 1009814 1006221 1002271 998256 995047 992474 988786 982832 976138 971522 969828
47493 969828 969141 967107 962884 956828 949557 941959 935278 930409 927265 924982 922374 918315 912473 906023
47479 906023 900977 898369 897413 896666 895449 893944 892601 891947 892352 893320 893442 891815 889300 887675 887721 888732
47463 888732 889763 890533 890955 890623 889330 887789 887279 888542 891130 893817 895507 895841 895151 894033 893015 892450
47447 892450 892317 892065 891044 889369 888095 888175 889503 891288 893040 894613 895501 894956 892984 890627 889000 888511
47431 888511 889178 891109 894287 898294 902674 907236 911675 915235 917263 917923 918092 918751 920631 924034 928625
47416 928625 933787 939502 946359 954191 961379 966396 969683 973073 977674 983391 990215 998420 1007145 1014211
47402 1014211 1018278 1020296 1022107 1024482 1027337 1030928 1035521 1040368 1044348 1047561 1051225 1056031 1061595 1067502
47388 1067502 1073780 1080215 1086437 1093066 1101657 1112806 1125296 1137975 1151594 1167671 1186093 1205168
47376 1205168 1223893 1242893 1262964 1283802 1304716 1325670 1346892 1367989 1388109 1406700 1423497
47365 1423497 1437980 1449442 1457651 1463094 1466516 1468377 1468641 1466877 1462694 1456213 1447950 1438167 1426785
47352 1426785 1414204 1401614 1389886 1378551 1366671 1354398 1342713 1331709 1320175 1307197 1293257
47341 1293257 1279402 1266143 1253704 1242582 1233208 1225514 1219319 1214560 1210668 1206434 1201262 1196085 1192390
47328 1192390 1190818 1191182 1193045 1195361 1196438 1195664 1194923 1197022 1202818 1210984 1220147 1229852 1239596 1248637 1257077
47313 1257077 1265663 1274070 1280727 1284835 1287166 1288326 1287698 1284878 1280727 1275940 1269825 1261758 1252703 1243880
47299 1243880 1234724 1223663 1210378 1195910 1180883 1164907 1147562 1128922 1109362 1089915 1072438
47288 1072438 1058262 1046784 1036242 1025513 1014218 1001891 988684 976495 967541 961660 956669 951542
47276 951542 947416 944967 942793 939611 936598 935926 937746 940027 940974 940411 938996 937390 936493 937548 941238
47261 941238 946787 952307 956255 958576 960375 962582 965256 968155 971211 973887 974902 973685 971654 970711
47247 970711 970581 969099 965348 961039 958219 957068 956822 957550 959729 962958 966426 970118 974223 977725 979052
47232 979052 978335 978015 980885 988073 998857 1011674 1025097 1038513 1052231 1066802 1082346 1098881 1117095
47219 1117095 1138063 1162109 1188399 1215702 1243018 1269246 1292689 1311238 1323128 1327756 1326275 1321354
47207 1321354 1315793 1310856 1305935 1299853 1292273 1283877 1275601 1268070 1261552 1255891 1250288 1243538 1235005 1225351
47193 1225351 1215917 1207314 1199079 1190909 1183562 1177892 1173443 1168850 1163483 1157867 1152560 1147655 1143597 1141409
47179 1141409 1141435 1142615 1143607 1144068 1144332 1144654 1145609 1148593 1154715 1163254 1172051 1179533 1185848 1192247 1200065 1210091
47163 1210091 1222104 1234855 1247200 1259374 1272559 1287074 1301660 1314828 1326348 1336995 1347260
47152 1347260 1356792 1364862 1370852 1374226 1374500 1371715 1366986 1362164 1358455 1355311 1351131 1345201 1338450 1332003
47138 1332003 1325620 1318267 1309976 1302244 1296474 1292736 1290354 1289009 1288685 1288944 1289115 1289437 1291439 1296599 1304698
47123 1304698 1313933 1322843 1331813 1342505 1356114 1372496 1390691 1409665 1428726 1447957 1468409 1491219
47111 1491219 1516154 1541448 1565317 1587214 1607448 1626197 1643343 1658768 1672269 1683508 1692467
47100 1692467 1699599 1705117 1708514 1709192 1707190 1702929 1696766 1689386 1681955 1675012 1667489 1657733 1645432 1631868
47086 1631868 1618536 1606297 1595636 1586557 1577987 1568351 1557440 1547185 1539948 1536208 1534292 1532189 1529314
47073 1529314 1526569 1525015 1524829 1525610 1527333 1530308 1534097 1537311 1539123 1540493 1543095 1547222 1551431 1554154
47059 1554154 1555018 1554526 1553026 1550159 1545013 1536867 1525994 1513539 1500388 1486503 1471722 1456576 1441598
47046 1441598 1426351 1410080 1393101 1376702 1361909 1349132 1338622 1330002 1321442 1310601 1296808 1281494
47034 1281494 1266441 1252557 1240339 1230149 1221594 1213734 1206474 1200829 1197330 1195166 1193421 1192135 1191523
47021 1191523 1191223 1191163 1192165 1194671 1197672 1200062 1202418 1206239 1211835 1218166 1224497 1230955 1237402 1242940 1246956
47006 1246956 1249966 1253053 1256881 1261397 1266082 1270395 1274232 1277913 1281508 1284533 1286731 1288839 1291851 1295690
46992 1295690 1299300 1302105 1304777 1308466 1313749 1320415 1327760 1334939 1341485 1347608 1353695 1359581 1364832 1369801
46978 1369801 1375780 1383759 1393385 1403470 1413176 1422386 1431171 1439441 1447264 1455299 1464625 1475868 1488407
46965 1488407 1500601 1511111 1520065 1528768 1538228 1548172 1557526 1565586 1572500 1578737 1584311 1588579 1590728
46952 1590728 1590474 1588386 1585561 1582884 1580519 1578084 1575254 1572076 1568616 1564530 1559429 1553753 1548862 1545869
46938 1545869 1544611 1544149 1544153 1545218 1547847 1551651 1555847 1560166 1564944 1570468 1576517 1582520 1588184 1594068 1601530
46923 1601530 1611718 1624427 1638138 1651301 1663522 1675452 1687771 1700437 1712895 1724939 1737304
46912 1737304 1751113 1766554 1782450 1797513 1811709 1825772 1839668 1852437 1863687 1874336 1885359
46901 1885359 1896341 1905846 1912952 1918098 1922656 1927812 1933609 1938966 1942963 1946047 1949495 1953799 1958331 1962647
46887 1962647 1967100 1971788 1975930 1979085 1982296 1987096 1993771 2001314 2008757 2015854 2022817 2030073 2038067 2046671
46873 2046671 2055002 2062441 2069565 2077499 2086594 2096360 2106434 2116891 2127773 2138905 2150082 2160844
46861 2160844 2170238 2177422 2182406 2185701 2187442 2187373 2185407 2181483 2174997 2165142 2151897 2136303 2119961 2104540
46847 2104540 2091174 2079541 2067988 2055497 2043260 2033410 2026606 2022023 2019436 2019842 2023916 2031183 2041086
46834 2041086 2053617 2068508 2084987 2102947 2123304 2146578 2172032 2198712 2226294 2254255 2281361
46823 2281361 2306901 2331451 2355429 2377870 2397886 2416532 2435640 2455163 2473119 2488147 2500746
46812 2500746 2511950 2522068 2531195 2539936 2549026 2558812 2569446 2581007 2593215 2605632 2618352 2631841
46800 2631841 2645981 2660108 2674352 2690059 2708159 2727721 2746920 2765007 2782575 2800153 2817423
46789 2817423 2833791 2848884 2862261 2873274 2881626 2887702 2892015 2894524 2894734 2892387 2887910 2882301 2876570
46776 2876570 2871027 2865122 2858275 2850941 2844472 2839813 2836781 2834904 2834389 2835689 2838522 2842135 2846519 2852567
$$ [...]
##END NTUPLES=NMR SPECTRUM
##END=
