
##TITLE=UV1021_M2-1005-1001_6269357_e63KVcrhmi
##JCAMPDX= 6.0         $$ Bruker NMR JCAMP-DX V2.0
##DATA TYPE= NMR SPECTRUM
##DATA CLASS= NTUPLES
##ORIGIN= BRUKER
##OWNER= Administrator
$$ 1.72 TOPSPIN		Version 2.1
$$ 2012-06-02 02:40:24.125 -0500  Administrator@TOPSPIN
$$ Compression mode = diff/dup
##.OBSERVE FREQUENCY= 400.13188235
##.OBSERVE NUCLEUS= ^1H
##.ACQUISITION MODE= SIMULTANEOUS (DQD)
##.ACQUISITION SCHEME= undefined
##.AVERAGES= 8
##.DIGITISER RES= 22
##SPECTROMETER/DATA SYSTEM= spect
##.PULSE SEQUENCE= zg30
##.SOLVENT NAME= COFFEE_calctemp
##.SHIFT REFERENCE= INTERNAL, COFFEE_calctemp, 1, 14.98061
##AUDIT TRAIL= $$ (NUMBER, WHEN, WHO, WHERE, PROCESS, VERSION, WHAT)
$$ ##TITLE= Audit trail, TOPSPIN		Version 2.1
$$ ##JCAMPDX= 5.01
$$ ##ORIGIN= Bruker BioSpin GmbH
$$ ##OWNER= Administrator
$$ $$ C:\Bruker\TOPSPIN/data/COFFEE/nmr/UV1021_M2-1005-1001_6269357_e63KVcrhmi/10/pdata/1/auditp.txt
$$ ##AUDIT TRAIL=  $$ (NUMBER, WHEN, WHO, WHERE, PROCESS, VERSION, WHAT)
(   1,<2012-06-02 02:40:16.046 -0500>,<Administrator>,<TOPSPIN>,<go>,<TOPSPIN 2.1>,
      <created by zg
	started at 2012-06-02 02:39:09.156 -0500,
	POWCHK enabled, PULCHK disabled,
       configuration hash MD5:
       D5 CA 7A 23 FE 6B EE E2 50 67 74 61 24 F7 5E 3B
       data hash MD5: 64K
       4E 69 72 53 E1 54 64 53 14 40 28 1C 0B 42 2D 91>)
(   2,<2012-06-02 02:40:19.781 -0500>,<Administrator>,<TOPSPIN>,<proc1d>,<TOPSPIN 2.1>,
      <Start of raw data processing
       efp LB = 0 FT_mod = 6 PKNL = 1 PHC0 = 0 PHC1 = 0 SI = 32K 
       data hash MD5: 32K
       07 51 0C F3 EB 2E 28 1C 76 68 D2 DD 4F 08 E9 FE>)
(   3,<2012-06-02 02:40:20.125 -0500>,<Administrator>,<TOPSPIN>,<proc1d>,<TOPSPIN 2.1>,
      <pk PHC0 = 207.4988 PHC1 = 0 
       data hash MD5: 32K
       33 2E 94 F1 73 52 E2 55 90 61 99 0B 15 2A 7A 45>)
(   4,<2012-06-02 02:40:20.328 -0500>,<Administrator>,<TOPSPIN>,<proc1d>,<TOPSPIN 2.1>,
      <abs ABSG = 1 
       data hash MD5: 32K
       EC 6E 23 5B A2 46 FD 22 CF 20 9C D9 BC 0D E3 6F>)
(   5,<2012-06-02 02:40:20.453 -0500>,<Administrator>,<TOPSPIN>,<proc1d>,<TOPSPIN 2.1>,
      <abs ABSG = 2 
       data hash MD5: 32K
       DF 08 91 2F DF 3A 06 5C F3 8C 82 E0 4E 67 16 94>)
(   6,<2012-06-02 02:40:20.500 -0500>,<Administrator>,<TOPSPIN>,<proc1d>,<TOPSPIN 2.1>,
      <abs ABSG = 3 
       data hash MD5: 32K
       47 46 0A 5B FA FB F1 33 AF 1C 10 72 BC 7D AE 22>)
(   7,<2012-06-02 02:40:20.546 -0500>,<Administrator>,<TOPSPIN>,<proc1d>,<TOPSPIN 2.1>,
      <abs ABSG = 4 
       data hash MD5: 32K
       29 59 E0 3C 82 94 D7 12 03 E5 FC C2 E4 5A 49 C0>)
(   8,<2012-06-02 02:40:20.593 -0500>,<Administrator>,<TOPSPIN>,<proc1d>,<TOPSPIN 2.1>,
      <abs ABSG = 5 
       data hash MD5: 32K
       8C 3C BD 56 31 AB A4 30 86 9F 9B 75 04 6D 4E 9F>)
$$ ##END=
$$ 
$$ $$ hash MD5
$$ $$ B8 FA EB 79 A9 51 D5 67 EA 84 BF D7 79 93 B6 15
##$RELAX= 
##$RELAX= 
##$RELAX= 
##$RELAX= 
##$RELAX= 
##$RELAX= 
##$RELAX= 
$$ Bruker specific parameters
$$ --------------------------
$$ [...]
##$TP= (0..7)
150 150 150 150 150 150 150 150
##$TP07= 0
##$TPNAME0= <>
##$TPNAME1= <>
##$TPNAME2= <>
##$TPNAME3= <>
##$TPNAME4= <>
##$TPNAME5= <>
##$TPNAME6= <>
##$TPNAME7= <>
##$TPOAL= (0..7)
0.5 0.5 0.5 0.5 0.5 0.5 0.5 0.5
##$TPOFFS= (0..7)
0 0 0 0 0 0 0 0
##$TUNHIN= 0
##$TUNHOUT= 0
##$TUNXOUT= 0
##$USERA1= <user>
##$USERA2= <user>
##$USERA3= <user>
##$USERA4= <user>
##$USERA5= <user>
##$V9= 5
##$VALIST= <valist>
##$VCLIST= <CCCCCCCCCCCCCCC>
##$VD= 0
##$VDLIST= <DDDDDDDDDDDDDDD>
##$VPLIST= <PPPPPPPPPPPPPPP>
##$VTLIST= <TTTTTTTTTTTTTTT>
##$WBST= 2048
##$WBSW= 25
##$XGAIN= (0..3)
0 0 0 0
##$XL= 0
##$YL= 0
##$YMAX_a= 526690
##$YMIN_a= -652527
##$ZGOPTNS= <>
##$ZL1= 120
##$ZL2= 120
##$ZL3= 120
##$ZL4= 120
##$ABSF1= 14.98061
##$ABSF2= -5.57192
##$ABSG= 5
##$ABSL= 3
##$ALPHA= 0
##$AQORDER= 0
##$ASSFAC= 0
##$ASSFACI= 0
##$ASSFACX= 0
##$ASSWID= 0
##$AUNMP= <proc_prof1d_extract_pilot.lims>
##$AXLEFT= 0
##$AXNAME= <>
##$AXNUC= <1H>
##$AXRIGHT= 0
##$AXTYPE= 0
##$AXUNIT= <>
##$AZFE= 0.1
##$AZFW= 0.1
##$BCFW= 0
##$BC_mod= 0
##$BYTORDP= 0
##$COROFFS= 0
##$CY= 15
##$DATMOD= 1
##$DC= 0
##$DFILT= <>
##$DTYPP= 0
##$F1P= 0
##$F2P= 0
##$FCOR= 0.5
##$FTSIZE= 32768
##$FT_mod= 6
##$GAMMA= 0
##$GB= 0
##$INTBC= 1
##$INTSCL= 1
##$ISEN= 128
##$LB= 0
##$LEV0= 0
##$LPBIN= 0
##$MAXI= 10000
##$MC2= 0
##$MEAN= 0
##$ME_mod= 0
##$MI= 0
##$NCOEF= 0
##$NC_proc= -8
##$NLEV= 6
##$NOISF1= 0
##$NOISF2= 0
##$NSP= 0
##$NTH_PI= 0
##$NZP= 0
##$OFFSET= 14.98061
##$PC= 1
##$PHC0= 207.4988
##$PHC1= 0
##$PH_mod= 1
##$PKNL= yes
##$PPARMOD= 0
##$PPDIAG= 0
##$PPIPTYP= 0
##$PPMPNUM= 2147483647
##$PPRESOL= 1
##$PSCAL= 4
##$PSIGN= 0
##$PYNMP= <proc.py>
##$REVERSE= no
##$SF= 400.13
##$SI= 32768
##$SIGF1= 0
##$SIGF2= 0
##$SINO= 400
##$SIOLD= 32768
##$SPECTYP= <>
##$SREGLST= <1H.CDCl3>
##$SSB= 0
##$STSI= 32768
##$STSR= 0
##$SW_p= 8223.68421052632
##$SYMM= 0
##$S_DEV= 0
##$TDeff= 65536
##$TDoff= 0
##$TI= <>
##$TILT= no
##$TM1= 0
##$TM2= 0
##$TOPLEV= 0
##$USERP1= <user>
##$USERP2= <user>
##$USERP3= <user>
##$USERP4= <user>
##$USERP5= <user>
##$WDW= 1
##$XDIM= 32768
##$YMAX_p= 464320576
##$YMIN_p= -654379
##$CURPLOT= <Network HP LaserJet P1505>
##$CURPRIN= <$Network HP LaserJet P1505>
##$DFORMAT= <normdp>
##$LAYOUT= <+/1D_H.xwp>
##$LFORMAT= <normlp>
##$PFORMAT= <normpl>
##$SURQMSG= 1
$$ End of Bruker specific parameters
$$ ---------------------------------
##NTUPLES= NMR SPECTRUM
##VAR_NAME=  FREQUENCY,     SPECTRUM/REAL,   SPECTRUM/IMAG
##SYMBOL=    X,             R,               I
##VAR_TYPE=  INDEPENDENT,   DEPENDENT,       DEPENDENT
##VAR_FORM=  AFFN,          ASDF,            ASDF
##VAR_DIM=   32768,         32768,           32768
##UNITS=     HZ,            ARBITRARY UNITS, ARBITRARY UNITS
##FACTOR=    0.250966925370066, 1,           1
##FIRST=     8223.43324360095, -379427,      102304
##LAST=      0,             22433,           -52733
##MIN=       0,             -654379,         0
##MAX=       8223.43324360095, 464320576,    0
$$ Real data points
##PAGE= N=1
##DATA TABLE= (X++(R..R)), XYDATA
$$ [...]
$$ plain form
19521 -335639 -84350 196542 92930 51195 -25552 -425517 135273 -15106 -217147 -212935 -7677
19509 249438 28224 346441 137324 -250046 -6332 -325884 -133572 84375 -87022 -14542 -281476
19498 -281476 -125496 -405022 13240 270945 177678 -220721 -235000 138750 -256612 -32508
19487 42152 -711 60424 -157061 -42573 -231499 -145465 -192968 48627 18673 100701 -333600
19475 -42112 -78214 8937 -76686 -152184 -258794 67109 -61292 168961 60918 73121 -229654
19463 -42156 -91222 -13470 -44292 -284841 210739 -283765 -186576 -185680 -218448 -139017 66432
19451 88717 -360872 160165 96597 -196839 -48527 79740 -298975 -285801 -22828 -198917 -183767
19440 -183767 -119649 -134021 -48695 -33902 -169452 130013 57049 -146204 -380231 -94731 108385
$$ packed form
19521c35639h4350A96542I2930m1735b5552l99965A35273a5106k02041M212g677
19509B49438B8224L18217A37324b50046f332l19552a33572H4375h7022a4542k66934
19498b81476a25496k79526A3240K57705r3267b20721j4279A38750b56612c2508
19487D2152g11F0424a57061d2573j88926Q6034m7503D8627A8673Q2028c33600
19475d2112l6102H937g6686p5498j06610F7109f1292A68961F0918J2203b29654
19463d2156m9066a3470l0822k40549B10739b83765R7189Q96l2768P9431F6432
19451H8717c60872A60165o3568a96839d8527G9740b98975J3174b2828j76089J5150
19440a83767O4118j4372d8695J4793j35550A30013E7049a46204k34027i4731A08385
$$ plain form
19428 115427 157927 -118681 -81451 254104 -63704 -99399 62970 14725 126954 -115042 181190
19416 -148590 -167604 -67810 -15486 -202728 155697 -202791 36359 -116607 127153 135699 -272504
19404 -81476 35825 -53988 16352 -16380 -71615 -277714 -233934 -169680 106645 -85416 159254
19392 -212477 166903 -164808 -2049 55371 -154910 219774 35849 -13980 22894 407734 -44323
19380 10277 39145 -217711 -176492 29613 -276268 -186788 -191779 -106110 9875 -323742 -241329
19369 -241329 122552 144258 20521 -358437 31519 -25864 -141586 -286714 -409190 -71080
19358 -80566 119602 5907 -238971 -60755 46943 185563 32069 105127 -94690 -136010 129287
19346 -222228 7404 47697 -105057 71537 -239394 -285686 -279027 92516 15450 -106365 -107470
$$ packed form
19428A15427M2500a18681L7230B54104f3704l5695F2970A4725J12229a15042A81190
19416a48590j9014f7810a5486j87242A55697b02791C6359a16607A27153Q546b72504
19404h1476C5825e3988A6352a6380n5235k06099M3780O4254A06645h5416A59254
19392b12477A66903a64808b049E5371a54910B19774C5849a3980B2894L84840d4323
19380A0277K8868b17711M1219B9613b76268Q9480m991Q5669I875c23742Q2413
19369b41329A22552K1706B0521c58437C1519b5864j15722j45128j22476g1080
19358h0566A19602E907b38971f0755D6943J38620C2069P3058i4690m1320A29287
19346b22228G404M0293a05057G1537b39394m6292O659I2516A5450a06365j105
$$ plain form
19335 -107470 -138638 145069 247801 -29712 211316 -143168 346719 169336 -7736 -302868
19325 -302868 -71640 -207264 -447492 -73434 -161369 53250 -38557 -16946 58295 -268428 -34989
19313 -5224 -69846 -399501 -28071 90781 213047 7343 53705 -192063 -177240 278652 -81539
19301 -3444 331208 -2869 -156024 46875 106841 47386 -125648 82590 -36338 -23842 183901
19289 -43602 -103522 -53544 -78047 -183936 -284212 -11059 146913 121862 -79374 196574 -165201
19277 176736 -99021 -1817 24037 -58534 -119487 -9648 -160007 -59998 -113073 864 73046 105525
19265 105525 -337914 33746 -128753 -267475 -159398 -191653 120946 -88067 -204875 -294972
19255 -294972 -171444 -277180 123681 -54686 -72535 -598142 181671 -339118 -52991 208449
$$ packed form
19335a07470l1168A45069J02732b9712B11316a43168C46719A69336g736k95132
19325c02868g1640j35624k40228g3434q7935E3250c8557a6946E8295b68428c4989
19313e224o4622l29655b8071I0781J22266G343M6362a92063J4823B78652h1539
19301c444C31208b869j53155D6875N9966D7386a25648H2590c6338J2496A83901
19289d3602n9920M9978k4503j05889j00276a1059A46913k5051g9374A96574a65201
19277A76736i9021a817B4037e8534o0953i648j50359e9998n3075H64P2182L2479
19265A05525c37914C3746a28753j38722J08077l2255A20946h8067j16808r0097
19255b94972J23528j05736A23681e4686j7849n25607A81671c39118e2991B08449
$$ plain form
19244 150110 -278521 -258160 46497 -73804 -139825 -50404 -73103 112929 -247625 -138618 -205215
19233 -205215 -88386 104103 -125877 -52003 -130514 -329703 41577 108767 -272460 148394
19222 78305 -227470 -42889 -230608 151365 -139570 -142098 -202514 -31116 -238482 -66981 -190719
19211 -190719 -22942 99349 -77575 52675 116129 -224710 63962 -227199 74169 -92872 -86399
19200 -86399 -11732 119333 -188968 -46583 -189261 141785 -11605 -166892 121026 64802
19190 64802 -408632 -115083 -344056 -41790 106773 119018 258561 203651 -317262 41976
19179 235161 203333 -36999 -211708 -62911 -151071 74514 -167248 -177205 6167 -100655 -227252
19168 -227252 -198057 -52091 -336680 335217 66494 77601 206168 -195587 -193756 79241 -81215
$$ packed form
19244A50110b78521K0361D6497g3804o6021e0404k2699A12929b47625J09007o6597
19233b05215h8386A04103a25877e2003p8511j99189D1577O7190b72460A48394
19222G8305b27470d2889j87719A51365a39570k528o0416c1116k07366f6981j23738
19211a90719b2942I9349g7575E2675O3454b24710F3962b27199G4169i2872O473
19200h6399a1732A19333a88968d6583j42678A41785a1605j55287A21026n6224
19190F4802d08632a15083k28973d1790A06773J2245J39543n4910c17262D1976
19179B35161l1828c6999j74709f2911q8160G4514a67248r957F167a00655j26597
19168b27252K9195e2091k84589C35217F6494J1107J28567a95587J831G9241h1215
$$ plain form
19156 106289 7814 234787 -48242 22469 -233032 -240467 179305 102473 -251073 -340839 -291947
19145 -291947 283084 119612 2738 -130816 7474 -148075 -72275 -115127 -309690 19162 -17351
19133 154735 -238595 -115021 -265068 -9802 158184 -21628 39451 -259021 -326022 174649
19122 -5533 -60731 109313 -144859 39410 18468 14559 -82198 -73671 34088 -241053 87711 44848
19110 44848 -261653 205993 200825 45132 -197459 -153233 -122615 -57461 32540 -52189 -218555
19099 -218555 -94796 -394587 -23471 -244156 -139569 250801 -40070 -238386 -462441 155981
19088 114040 -477728 -11634 -317027 -58615 -333246 -88561 -221818 -152029 -54102 9111 75348
19077 75348 -335383 -172670 -369195 -125872 29029 206704 -375397 4630 -129639 85598
$$ packed form
19156A06289G814K26973d8242B2469b33032p435A79305p6832b51073q9766M8892
19145b91947B83084A19612B738a30816G474a48075g2275m2852j94563A9162a7351
19133A54735b38595a15021j50047i802A58184b1628C9451b59021o7001A74649
19122e533n5198A09313a44859C9410A8468l909h2198Q527C4088b41053H7711m2863
19110D4848b61653B05993n168D5132a97459M4226L0618e7461C2540e2189j66366
19099b18555i4796k99791b3471k20685J04587B50801d0070j98316k24055A55981
19088A14040d77728a1634l05393e8615k74631h8561j33257O9789e4102I111O6237
19077G5348c35383J62713j96525a25872B9029J77675c75397D630a29639H5598
$$ plain form
19066 -137651 66297 5834 -292716 -165354 95988 -379859 -204310 266715 -162769 -228038
19056 -228038 -89741 -195031 147942 -202568 245154 46713 -4802 -149493 -35121 -156801
19046 -156801 1587 -361210 -157887 -20869 133211 148034 185147 -83749 104587 158353 4086
19034 -334318 -65087 -11016 201796 -16566 -185994 134305 -185316 -135439 141607 -173514
19023 -192864 -167484 15464 -239974 3568 193013 -163230 -46474 -107545 -65 -157222 -93874
19012 -93874 36623 16107 -134555 -158751 -48587 -243494 237637 -370903 -170955 -204566 -276546
19001 -276546 32679 -95798 -84313 -145575 42898 -63568 -39530 117350 -189147 -67472 177897
18989 134994 136319 24091 95718 -254752 -207201 -102551 23895 -6653 -214356 -78359 119251
$$ packed form
19066a37651F6297E834b92716J27362I5988c79859J75549B66715a62769o5269
19056b28038h9741j05290A47942b02568B45154D6713d802j44691c5121j21680
19046a56801A587c61210a57887b0869A33211J4823L7113h3749A04587N3766D086
19034c34318f5087a1016B01796a6566j69428A34305a85316M9877A41607a73514
19023a92864K5380A5464b39974C568J89445a63230d6474o1071f5j57157O3348
19012i3874C6623A6107a34555k4196d8587j94907B37637c70903a70955l3611p1980
19001b76546C2679i5798J1485o1262D2898f3568K4038A17350a89147f7472A77897
18989A34994J325B4091P1627b54752M7551a02551B3895f653k07703g8359A19251
$$ plain form
18977 -216199 -74750 82913 -56467 -46544 -218337 69298 -21315 93514 -62798 -221305 247361
18965 148009 14586 106667 151602 77308 33578 -161932 -61575 23339 128811 -106207 -223412
18954 -223412 109544 164859 87037 270710 -301609 83894 -104016 107662 38577 -31650
18943 -39310 -159614 -127288 -85073 -187755 163425 -101961 -76237 -107340 74038 114865 -38517
18931 56677 5869 36318 132554 -209394 -138955 34875 -24411 -275909 -103241 143277 214416
18920 214416 -119532 130432 237447 -110189 -245097 -357521 -84278 7630 -57161 118531
18909 39814 -235974 -31131 220265 -110295 113535 -137036 -101817 -14121 -49966 -229104
18899 -229104 -143358 -172198 -200063 89318 315079 -102416 93468 322130 459057 -204407
$$ packed form
18977b16199g4750H2913e6467R923j71793F9298b1315I3514f2798j58507B47361
18965A48009A4586R2081M4935p4294C3578a61932f1575B3339J05472a06207j17205
18954b23412A09544N5315p7822J83673c01609H3894a04016A07662C8577c1650
18943c9310j20304L2326M2215j02682A63425a01961K5724l1103G4038M0827c8517
18931E6677E869L0449R6236b09394P0439C4875b4411k51498a03241A43277P1139
18920B14416a19532A30432J07015a10189j34908j12424h4278G630e7161A18531
18909C9814b35974c1131B20265a10295A13535a37036L5219a4121l5845j79138
18899b29104Q5746k8840k7865H9318K25761a02416I3468K28662J36927b04407
$$ plain form
18888 51458 -224985 -47717 94507 -101633 33921 -241805 -210155 -267248 -9849 47215 189165
18877 189165 65751 -14688 -67243 -28774 -317215 71053 -23325 -113041 -181404 233548 -192562
18865 -255400 168061 282783 72066 190913 247054 -15254 -284819 -460052 460396 -45369
18854 -83067 20126 -201189 -246056 -184875 -91289 321500 -174561 -320209 134930 -212238
18843 57567 -5325 -89493 -269001 106255 73567 13957 189913 -371906 230702 -173897 -173373
18832 -173373 -52897 1133 -297559 18059 -232447 -46223 -261399 -268094 -313516 74877 50234
18821 50234 76669 -50235 142095 -454244 -97931 326637 419382 -81413 -134512 -88444 87530
18809 -112792 -90436 -149995 -90 -168099 -117980 62221 -107546 128288 247 177437 -294092
$$ packed form
18888E1458b24985d7717I4507a01633C3921b41805L1650n7093i849D7215J41950
18877A89165F5751a4688n2555b8774k88441G1053b3325q9716o8363B33548a92562
18865b55400A68061J14722G2066J18847N6141a5254k69565j75233D60396d5369
18854h3067B0126b01189m4867O1181i1289C21500a74561j45648A34930b12238
18843E7567e325q4168j79508A06255l2688A3957J75956c71906B30702a73897N24
18832a73373e2897A133b97559A8059b32447d6223k15176o695m5422G4877k4643
18821E0234K6435e0235A42095d54244i7931C26637R2745h1413n3099M6068H7530
18809a12792K2356n9559i0j68009N0119F2221a07546A28288B47J77190b94092
$$ plain form
18797 25265 17438 109996 -100990 -365269 6734 190591 78607 -168203 -34782 -46064 -224358
18786 -224358 80862 59089 -4730 -272440 55279 -212225 -156673 40959 -253684 144956 57081
18774 -65889 -164065 218506 -262318 -109239 -22675 -180248 -241440 -123034 -109447 -55517 -169661
18763 -169661 -145007 -246438 -53832 -263985 -59275 222092 189153 196345 109498 -223455 201557
18751 175591 -117775 -310249 -151344 -356458 90206 218971 -32480 -97821 -37395 -144189
18741 -144189 -14053 56664 196733 -167157 -203973 -121659 72038 49314 -9989 177247 -155546
18729 28874 76098 -59699 233234 -306105 -290602 132653 -20400 -63203 91134 -9407 134117
18717 102867 -7275 7393 -138434 32624 187836 57058 -46855 134154 22486 57440 5017
$$ packed form
18797B5265p827R2558a00990k64279F734J83857G8607a68203c4782j1282j78294
18786b24358H0862k1773d730k67710E5279b12225N5552D0959b53684A44956E7081
18774f5889r8176B18506b62318a09239b2675j57573o1192J18406J3587N3930j14144
18763a69661K4654j01431e3832k10153e9275B22092l2939P192q6847b23455B01557
18751A75591a17775j92474a51344k05114I0206J28765c2480o5341c7395j06794
18741a44189a4053E6664J40069a67157l6816Q2314G2038k2724i989A77247a55546
18729B8874M7224e9699B33234c06105J5503A32653b0400m2803I1134i407A34117
18717A02867g275G393a38434C2624J55212E7058d6855A34154B2486L4954E017
$$ plain form
18705 -183346 -180639 -7339 -8801 -126257 -222900 -70694 -32330 -90380 -244015 -286744 128551
18693 118988 8743 29697 -261181 28946 35952 -61964 -219748 -309623 -154586 -161047 -270773
18682 -270773 -188462 -180352 80075 -121938 33230 -4204 126193 -27377 -535247 -85599 -74490
18671 -74490 -307697 246394 -105155 -196766 299540 -101593 -192949 -186444 196281 -249186
18660 114041 10347 55192 -91156 6139 -53425 -166694 -168015 -56885 -98632 -49104 -262317
18649 -262317 -88849 -281519 404442 173336 -384279 -279553 -40432 -117577 -208560 -125174
18639 -125174 180698 213539 -141062 -96690 -179377 -208622 -6910 -61318 176211 -112543 -14743
18627 41485 -82775 -364423 -156230 -22496 -212040 -181645 38527 -4617 -25076 -42439 -3490
$$ packed form
18705a83346K707g339j462j17456r6643g0694c2330n8050j53635m2729A28551
18693A18988H743K0954b61181B8946P006f1964j57784q9875a54586o461j09726
18682b70773Q2311Q110H0075a21938C3230d204A26193b7377n07870h5599J1109
18671g4490k33207B46394a05155r1611B99540a01593r1356O505A96281b49186
18660A14041A0347M4845i1156F139e3425j13269j321e6885m1747d9104k13213
18649b62317h8849j92670D04442A73336c84279J04726d0432p7145r0983Q3386
18639a25174A80698L2841a41062M4372q2687k9245f910n4408A76211a12543a4743
18627D1485h2775k81648a56230b2496j89544L0395C8527d617k0459j7363c490
$$ plain form
18615 -125159 12593 -166200 129061 -383017 -32795 -320574 -233926 193981 121904 -2162 159863
18603 -254966 -97838 -196079 150271 43076 38030 65801 -127772 48876 9635 -363222 -379684
18592 -379684 281200 -165839 -169801 166261 -10228 -252700 -205166 154603 -126297 -72979
18582 -72979 210854 -32326 -632191 -16120 168564 -65368 -311037 -267206 140598 7246 4270
18571 4270 -20507 52659 244952 -63037 196447 -86895 46026 112755 -52540 -320624 -129083
18559 79586 -104068 -141945 111118 -4085 -103332 -61872 -237124 -114473 -85 -203803 -311561
18548 -311561 -110301 -88278 -216809 161617 -55410 -248032 -75826 -328087 -228928 -294759
18538 -294759 -373840 -167667 -287862 -172623 -485715 -84017 -86693 -263788 -379965 -126947
$$ packed form
18615a25159A2593a66200A29061c83017c2795k87779Q6648A93981p2077b162A59863
18603b54966i7838r8241A50271D3076n046K7771a27772D8876I635c63222j6462
18592c79684B81200a65839l962A66261a0228k42472M7534A54603a26297N3318
18582g2979B10854c2326n99865a6120A68564f5368k45669M3831A40598G246k976
18571D270b0507E2659J92293f3037A96447h6895D6026O6729e2540k68084a29083
18559G9586a04068l7877A11118d085r9247M1460j75252a14473h5k03718j07758
18548c11561a10301K2023j28531A61617e5410j92622g5826k52261R9159o5831
18538b94759p9081a67667j20195J15239l13092h4017k676j77095j16177a26947
$$ plain form
18527 186845 -71332 -229060 -324969 -73858 151511 69203 194003 -58099 195857 265653 -187625
18515 -87675 -242388 124587 122969 39268 91882 -149753 167135 -260953 -163923 -205893 104775
18503 -278951 124911 -252900 -211002 65946 -36138 29661 -33375 -238882 67974 113903 -105582
18491 -46043 122254 -361633 -79247 130151 -181701 -222864 18412 124205 -154638 235035
18480 1267 182944 139027 -80691 70376 246368 -156935 -140631 149634 -285093 86056 -104035
18468 -49758 -115754 345858 -378 47251 -76282 -20027 -294695 -203308 -12658 -24867 -210910
18457 -210910 98898 -201538 -121670 74316 -36242 -246240 170696 -137099 66521 -135287
18446 -228256 -152987 73513 -120482 122474 -95960 261961 211405 -175510 31250 -44089 229584
$$ packed form
18527A86845g1332j57728r5909g3858A51511F9203J24800e8099A95857O9796a87625
18515h7675j54713A24587j618C9268N2614a49753A67135b60953R7030m1970A04775
18503b78951A24911b52900M1898F5946c6138B9661c3375k05507F7974M5929a05582
18491d6043A22254c61633g9247A30151a81701m1163A8412J05793a54638B35035
18480A267J81677m3917h0691G0376J75992a56935J6304A49634b85093H6056a04035
18468d9758o5996C45858c78D7251g6282b0027k74668R1387a2658j2209j86043
18457b10910I8898b01538P9868G4316c6242k09998A70696a37099F6521a35287
18446b28256P5269G3513a20482A22474i5960B61961n0556a75510C1250d4089B29584
$$ plain form
18434 106138 -315825 4142 -70775 49794 350342 -112843 -166220 -171272 -192930 -12886 -70182
18423 -70182 -89173 -98333 8015 -231295 81970 -74173 193330 288036 -158210 -79319 -162904
18412 -162904 -117588 -71253 38422 172807 -67174 266300 -89398 -76740 -181979 -326626 -152300
18400 -142033 -396479 22653 348965 -147085 -31156 -132625 -111293 -68153 156339 182272
18390 182272 73764 87766 -14109 -145069 -225208 -5589 131143 -90315 -112196 -114089 -216715
18379 -216715 -119678 -221096 -17246 -158186 -110652 125841 241688 -59764 70196 -136797
18368 196899 257382 -317433 -108912 -123798 182362 -268629 -132713 -174420 145287 49275
18357 -69453 -179080 -74492 -8866 -71016 42821 -183580 28316 115649 -72131 415272 -55986
$$ packed form
18434A06138c15825D142g0775D9794L00548a12843n3377n052k1658a2886n7296
18423g0182j8991r160H015b31295H1970g4173A93330R4706a58210P8891q3585
18412a62904M5316M6335C8422J34385f7174B66300h9398J2658j05239j44647a52300
18400a42033k54446B2653L26312a47085c1156j01469K1332M3140A56339K5933
18390A82272G3764J4002a4109j30960q0139e589A31143i0315k1881j893j02626
18379b16715R7037j01418a7246j40940M7534A25841J15847e9764G0196a36797
18368A96899O0483c17433a08912j4886A82362b68629a32713m1707A45287D9275
18357f9453j09627g4492h866o2150D2821a83580B8316Q7333g2131D15272e5986
$$ plain form
18345 81322 -175646 -255794 126590 136603 153335 -45517 -91301 -340129 -55019 -276607 -183686
18334 -183686 -236088 7946 147104 155407 -138594 -158366 -28149 -52915 -73478 -79332 -334900
18323 -334900 -404688 326994 4830 112129 -124014 47500 149446 -27547 -133000 -148406 38041
18311 -334309 -220025 -37546 37657 -149107 -176544 -301332 -16219 204923 -151505 -37651
18300 115819 -218311 -442053 -114512 -5341 -279618 83089 -318255 -47423 -144490 98794 -98025
18288 60608 -153339 -71310 -27039 -326333 -276612 -499131 -182446 5382 -348519 -389695 295436
18276 -72369 176249 116477 -82499 -179803 -157709 200279 -68672 51240 81133 28586 -341606
18264 -84167 -311572 115483 -57545 -186023 112587 50903 -3224 7983 -5132 142899 244752
$$ packed form
18345H1322a75646q0148A26590J0013J6732d5517m5784k48828e5019k21588R2921
18334a83686n2402G946J39158Q303a38594j9772b8149k4766k0563n854k55568
18323c34900o9788C26994D830J07299a24014D7500J01946b7547j05453j5406C8041
18311c34309J14284c7546C7657a49107k7437j24788a6219B04923a51505c7651
18300A15819b18311k23742a14512e341k74277H3089c18255d7423r7067I8794i8025
18288F0608a53339g1310b7039k99294M9721k22519a82446E382c48519m1176B95436
18276g2369A76249n9772h2499r7304K2094B00279f8672E1240K9893B8586c41606
18264h4167k27405A15483e7545j28478A12587E0903c224G983e132A42899J01853
$$ plain form
18253 244752 -153436 -167551 -113118 197532 -81065 185753 -243893 131847 -13669 233061
18242 -150491 -145797 -209997 -27519 -109408 -26100 -117777 -67705 72147 106707 -467951 -259677
18231 -259677 -163703 443543 52729 43391 206302 -113709 -190750 -242094 -29577 114262 176398
18220 176398 297639 43770 157931 80100 129474 58520 -32112 579101 -166073 -83191 67774
18208 -117658 -185360 214479 -230978 -262748 140450 71041 -181758 127067 -342116 -90669
18197 -229004 123032 124213 -320232 -58380 -170933 -279619 -178010 223163 54596 -103599
18186 -53940 -320306 167321 -158730 -313443 -4987 8863 31490 -137481 -17958 -380584 -114798
18174 -32454 19686 -218469 -413321 -184589 153951 -99535 -114192 -166256 156908 -7638 -14097
$$ packed form
18253B44752a53436j4115N4433A97532h1065A85753b43893A31847a3669B33061
18242a50491M694o4200b7519q1889b6100r1677N0072G2147L4560d67951K08274
18231b59677R5974D43543E2729r338J62911a13709p7041n1344b9577A14262O2136
18220A76398J21241D3770J14161p7831M9374E8520c2112E79101a66073Q2882F7774
18208a17658o7702B14479b30978l1770A40450o9409a81758A27067c42116i0669
18197b29004A23032J181c20232e8380j12553j08686J01609B23163E4596a03599
18186e3940k66366A67321a58730j54713d987H863K2627a37481a7958l62626a14798
18174c2454A9686b18469j94852a84589A53951i9535j4657n2064A56908g638o459
$$ plain form
18163 -14097 120048 201829 303765 321578 -103744 211260 41215 39155 -302252 297218 330076
18152 330076 11258 -32698 -271471 -59831 -270202 90766 112435 -53152 -56006 -55585 -55322 -180965
18140 -180965 202873 -50109 -68113 -21118 228589 232366 23047 -66525 20716 207556 -168290
18128 249436 -427071 -106954 -284024 -106288 59649 84152 -96218 16889 -73654 140777
18117 -61138 39797 -87534 303808 -197894 -74989 -152977 123666 3827 -278848 -160857 -84874
18106 -84874 -22489 231672 -258578 -167450 173451 -219894 -31947 -133981 -147717 -430593
18096 -430593 147161 -139687 -3279 336926 228287 41736 -193149 -75345 48635 228839
18086 228839 -111515 -358600 84081 122708 -67182 -72076 -106234 -331884 -158950 -283688 177868
$$ packed form
18163a4097A20048Q1781J01936J7813a03744B11260D1215k060c02252B97218L2858
18152C30076A1258c2698k38773e9831k10371I0766K1669e3152k854M21K63j25643
18140a80965B02873e0109j8004b1118B28589L777B3047f6525B0716J86840a68290
18128B49436d27071a06954j77070a06288E9649K4503i6218A6889g3654A40777
18117f1138C9797h7534C03808a97894g4989p7988A23666C827b78848J17991P5983
18106h4874b2489B31672b58578R1128A73451b19894c1947j02034j3736k82876
18096d30593A47161a39687c279C36926j08639D1736a93149g5345D8635J80204
18086B28839a11515k47085H4081L8627f7182m894l4158k25650a58950j24738A77868
$$ plain form
18074 -31010 50517 -166732 184983 -230015 78992 -118605 51280 -56641 -409440 -21984 -196082
18063 -196082 -79810 100908 -283849 -135411 16590 7430 -217314 -206185 76607 -20557 64015
18051 34325 183242 171495 266704 35612 -85296 -144209 -83862 -9267 178397 -26973 316314
18039 -58309 -207059 -150225 -238332 -254985 -30382 -221728 -106574 -116297 -10713 106599 -168630
18027 -105258 -41782 129666 34479 67827 -62671 -184430 -240881 -7996 -32133 212143 117436
18016 117436 44097 195496 131452 170297 -138234 -161196 294522 198846 -131340 -171103 29566
18004 107468 -30764 107614 12312 -90427 117740 -149806 62156 -124102 -245949 314946
17993 -30522 153381 -133340 253499 -120482 76570 249151 -11924 -6418 -25794 -195357 -41428
$$ packed form
18074c1010E0517a66732A84983b30015G8992a18605E1280e6641l52799b1984j74098
18063a96082g9810A00908b83849a35411A6590G430b17314J1129G6607b0557F4015
18051C4325J48917j1747R5209C5612h5296n8913O0347i267A78397b6973C16314
18039e8309j48750N6834q8107j6653c0382j91346a06574r723a0713A06599a68630
18027a05258d1782A29666C4479L3348f2671j21759n6451g996k4137B12143r4707
18016A17436D4097J51399o4044L8845a38234k2962B94522r5676a31340l9763B9566
18004A07468c0764A07614A2312i0427A17740a49806F2156a24102j21847C14946
17993c0522A53381a33340B53499a20482G6570J72581a1924N506j9376j69563d1428
$$ plain form
17981 -39432 -285742 255795 32957 141189 195111 -196435 44299 91653 267772 -399940
17970 160496 7154 102408 -193256 126164 35091 -44349 -78506 -20171 69220 -147509 -185000
17959 -185000 -146620 165894 -98233 -83750 59736 -68975 133395 -63647 -193021 -315381 -10438
17947 -46364 -88409 50913 195501 -158489 91505 22032 -208358 225560 -335401 -56788 146434
17935 43751 92872 -33816 129923 -57518 -148488 -178712 -44614 -104999 96796 18607 33714
17924 33714 -246589 96006 -1226 -23744 230132 -65360 -271088 -156737 34818 233259 6108
17912 -246624 146047 -104298 119737 294360 -216006 -204444 147010 37575 -99809 -301053
17902 -301053 -5440 -80233 60065 14932 -54754 -150139 -351677 -174087 -513898 283226 -99121
$$ packed form
17981c9432k46310B55795C2957J08232N3922a96435D4299M7354J76119c99940
17970A60496G154R5254a93256A26164C5091d4349l4157b0171F9220a47509l7491
17959a85000L8380A65894i8233J4483E9736f8975A33395f3647j29374j22360a0438
17947d6364m2045E0913J44588a58489I1505B2032b08358B25560c35401e6788A46434
17935D3751M9121c3816A29923e7518r0970l0224d4614o0385I6796A8607J5107
17924C3714b46589I6006a226k2518B30132f5360k05728J14351C4818J98441F108
17912b46624A46047a04298A19737J74623b16006J1562A47010C7575i9809k01244
17902c01053e440p4793F0065A4932e4754r5385k01538a74087l39811B83226i9121
$$ plain form
17890 190899 97688 211993 491555 -128152 29708 -177734 99351 38770 32533 -43476 -84350
17879 -84350 -228411 -26722 -86726 -240049 -31662 218176 -135419 -45570 -90109 -124033 -114578
17868 -114578 -103413 26667 -125570 -29684 -171175 296173 -196225 -179186 -271243 228890
17857 -57198 -171892 -143924 -186952 -130749 -140531 339777 211125 -17895 110604 40839 -56097
17845 58224 -212779 -130055 -192809 37989 -96392 -182030 268943 -257155 -13473 -131260 183553
17833 -292648 5684 -39513 -258906 145991 88072 -62985 134486 44320 -14178 10753 215504
17822 215504 -150003 38059 172377 -36360 51411 61427 -88616 53040 124884 -27098 74544
17810 -295145 -129616 20532 -128305 93467 -79220 -135698 83398 28190 -108474 -169529 329117
$$ packed form
17890A90899r3211J14305K79562a28152B9708a77734I9351C8770o237d3476m0874
17879h4350j44061b6722o0004j53323c1662B18176a35419d5570m4539l3924R455
17868a14578J1165B6667a25570b9684j41491B96173a96225J7039r2057B28890
17857e7198j14694K7968m3028N6203r782C39777j28652a7895A10604D0839e6097
17845E8224b12779Q2724o2754C7989i6392q5638B68943b57155a3473j17787A83553
17833b92648E684c9513k19393A45991n7919f2985A34486D4320a4178A0753K04751
17822B15504a50003C8059J34318c6360E1411J0016h8616E3040P1844b7098G4544
17810b95145a29616B0532a28305I3467g9220n6478H3398B8190a08474o1055C29117
$$ plain form
17798 -178210 195051 -94157 299170 -34020 -243088 -153353 -23922 -24882 175416 -26384 -140947
17787 -140947 118410 -118458 198104 264996 131590 157137 -186919 2944 160819 8054 -172377
17775 -261399 -69487 293762 318033 119938 -293843 124008 172365 -98644 -84945 -53765 182135
17763 26090 146790 64086 134776 -77693 -199634 179504 320448 -156111 -353451 61440
17752 -255119 -117349 -219361 -78586 -124171 134336 43463 -464111 -180221 -24522 354036
17741 -2852 248941 -18626 65401 165325 111548 272345 255770 -258463 -15791 -36398 154842
17729 21603 -172636 -82897 -32735 10003 -77836 -29703 10600 -134494 23534 29749 -17448
17717 -1955 145165 -122173 -303390 -66888 108749 -277340 305069 20325 -300456 201031
$$ packed form
17798a78210A95051i4157B99170c4020k09068Q9735b3922r60A75416b6384j14563
17787a40947A18410a18458A98104O6892A31590K5547a86919B944J57875H054a72377
17775b61399f9487B93762K4271A19938b93843A24008M8357i8644J3699L1180A82135
17763B6090J20700F4086P0690g7693j21941A79504J40944a56111j97340F1440
17752b55119a17349j02012g8586m5585A34336D3463d64111a80221b4522C54036
17741b852B48941a8626F5401R9924n3777J60797j6575b58463a5791k0607A54842
17729B1603a72636h2897c2735A0003g7836b9703A0600a34494B3534O215a7448
17717a955A45165a22173j81217f6888A08749b77340C05069B0325c00456B01031
$$ plain form
17706 -136623 306591 -260891 -157185 -152992 93913 369 188965 259877 276465 -164943 -192788
17695 -192788 241345 -137001 -250456 -80738 -3411 -271046 234785 122517 104555 36144
17684 48133 -312687 -156082 -21741 -21992 -89847 -356656 74286 125486 -192229 -101542 103149
17672 273547 -110881 128273 -161592 155683 -239363 26220 -19430 -59740 -25275 186175
17661 -5784 -436112 -240444 39000 -91183 -15683 -232905 -103745 112173 49469 109149 107203
17650 107203 49859 318226 -388091 353828 272997 -306677 65545 9182 4901 150668 67371
17638 154265 -336563 -201121 116376 -228939 -50642 34605 -267230 -85740 2015 -52595 -56709
17627 -56709 177710 171372 -30241 139417 -229458 509887 -146183 76330 51912 -12435 -96464
$$ packed form
17706a36623C06591b60891J03706M193I3913C69J88596P0912J6588a64943k7845
17695a92788B41345a37001j13455h0738c411k67635B34785j12268j7962C6144
17684D8133c12687a56082b1741k51o7855k66809G4286N1200a92229R0687A03149
17672B73547a10881A28273a61592A55683b39363B6220a9430m0310b5275A86175
17661e784m30328J95668C9000i1183a5683k17222a03745A12173D9469N9680j946
17650A07203D9859K68367c88091C53828q0831c06677F5545I182m281J45767F7371
17638A54265c36563J35442A16376b28939e0642C4605b67230h5740B015e2595m114
17627e6709A77710o338c0241A39417b29458E09887a46183G6330k4418a2435q4029
$$ plain form
17616 -96464 55288 49452 120530 116964 -53730 -163280 -56381 -88881 78701 166564 316443 -73068
17603 70123 -7480 -189942 136706 -114184 -63462 47451 -126655 -97573 -103756 5467 209773
17592 209773 -61764 -37997 -11038 -411407 -149279 -434306 -364942 352699 265475 -84264 155262
17580 269107 -163544 -398626 81312 -39621 18314 -128438 -303251 47236 -368981 -149282
17569 386301 16526 402996 8050 1185 27309 66145 -119325 -189411 -227893 118822 299785
17558 299785 -266900 -56962 -1006 -407940 -260192 54928 182464 57571 170740 174220 -201042
17546 44893 112341 -195644 131774 -62364 217010 117552 -46122 -186201 152749 53591 127484
17535 127484 109852 21058 -40643 83479 123951 -337700 -123434 161547 -207251 468920
$$ packed form
17616i6464E5288n836P1078l566e3730j09550e6381l2500G8701Q7863J49879g3068
17603G0123g480j82462A36706a14184N0722D7451a26655K9082o183E467K04306
17592B09773f1764K3767a1038m00369a49279k85027O9364C52699q7224h4264A55262
17580B69107a63544k35082H1312c9621A8314a28438j74813D7236c68981a49282
17569C86301A6526L86470H050A185K6124L8836a19325p0086l8482A18822J80963
17558B99785b66900e6962a006m06934J47748E4928J27536E7571J13169L480b01042
17546D4893O7448a95644A31774f2364B17010r9458d6122j40079A52749E3591P3893
17535A27484j7632B1058d0643H3479M0472c37700a23434A61547b07251D68920
$$ plain form
17524 70919 143016 134274 16234 177313 -28228 116279 -126925 -99506 145060 432965 390888
17513 390888 37354 84279 -209031 -90262 223330 -37457 244944 83623 263079 142585
17503 142585 253108 4820 115668 -39882 -22167 98769 235425 96173 213903 -16561 167195
17491 57834 -158803 138265 502488 58100 221863 1418 -24855 171174 -163102 51696 42111
17480 42111 150668 -17633 -29113 324557 123958 -70265 295285 139249 102078 64519 41825
17469 41825 -142232 138062 118371 181205 179963 -86627 96992 -49591 31007 150829 313981
17458 313981 264196 117575 23034 14532 42185 149003 88753 83457 68511 78895 -222346
17446 205427 -87027 94294 164639 326883 176558 -23809 2404 28175 488210 52642 272703
$$ packed form
17524G0919P2097q742A6234J61079b8228A16279a26925K7419A45060K87905m2077
17513C90888C7354M6925b09031i0262B23330c7457B44944H3623J79456j20494
17503A42585J10523D820J10848c9882J7715I8769J36656I6173J17730a6561A67195
17491E7834a58803A38265L64223E8100J63763A418b4855A71174a63102E1696r585
17480D2111J08557a7633j1480C24557A23958g0265B95285A39249l7171l7559k2694
17469D1825a42232A38062j9691O2834j242h6627I6992d9591C1007J19822J63152
17458C13981m9785A17575B3034q502K7653J06818o0250n296j4946J0384b22346
17446B05427h7027I4294P0345J62244j50325b3809B404K5771M60035E2642K20061
$$ plain form
17435 272703 247398 3011 277569 262442 161560 445205 264012 57687 388377 134557
17424 327356 151456 551952 100382 222705 217650 -139238 487168 259904 146053 546796
17414 546796 -124548 279475 384398 -97419 397090 543596 484926 174906 175281 12990 -40152
17402 267560 129915 387157 379649 62552 92915 240861 299301 -250573 488854 -238806
17391 -87259 142121 90530 213660 -17243 -136279 249058 518155 198491 194574 8559 151455
17380 151455 7083 64089 81548 144452 22901 -49181 -99390 201185 275564 337436 -110597
17368 180695 468787 -75410 96249 121951 178278 335679 237967 -229252 -145680 271101 -180093
17356 124755 -3919 7823 -211775 351387 7731 79074 14108 95090 142857 195739 -94470 -235013
$$ packed form
17435B72703k5305C011K74558j5127j00882K83645j81193E7687L30690A34557
17424C27356A51456M00496A00382J22323n055a39238D87168k27264j13851M00743
17414E46796a24548B79475J04923i7419C97090J46506n8670A74906L75A2990d0152
17402B67560A29915K57242p508F2552L0363J47946N8440b50573D88854b38806
17391h7259A42121n1591J23130a7243j19036B49058K69097A98491l917H559J42896
17380A51455G083N7006J7459O2904B2901d9181n0209B01185P4379O1872a10597
17368A80695K88092g5410I6249K5702N6327J57401r7712b29252Q3572B71101a80093
17356A24755c919G823b11775C51387G731P1343A4108Q0982M7767N2882i4470j40543
$$ plain form
17344 -235013 174759 291221 -235294 66075 121149 310501 14539 -50569 227605 409020
17334 409020 -24779 154454 109905 163672 -39831 260458 -32415 -109941 196060 196383 -137571
17322 48668 294614 275564 102974 140523 193720 73395 94503 -57577 38284 -7360 101389
17310 189912 198413 236309 87588 93655 14288 196304 389556 -212628 20410 173381 -78585
17298 -71141 430377 241217 212103 107417 -66788 -10290 -210962 19687 22870 73830 55224
17287 55224 332275 -1923 99061 76205 340567 466567 297987 -63583 -156157 233904 435528
17276 435528 148133 -168315 -11706 9704 230109 273290 136187 282153 120735 24856
17265 468885 290974 253094 -44914 -131871 283977 322539 100983 232696 -54881 267709
$$ packed form
17344b35013A74759J16462b35294F6075N5074J89352A4539e0569B27605J81415
17334D09020b4779A54454m4549N3767c9831B60458c2415p7526A96060L23a37571
17322D8668K45946j9050A02974L7549N3197G3395K1108e7577C8284g360A01389
17310A89912Q501L7896H7588O067A4288J82016J93252b12628B0410J52971g8585
17298g1141D30377j89160k9114j04686f6788a0290k00672A9687L183N0960j8606
17287E5224K77051a923I9061k2856K64362J26000j68580f3583r2574B33904K01624
17276D35528A48133a68315a1706I704K20405M3181A36187J45966A20735B4856
17265D68885j77911l7880d4914q6957B83977L8562A00983J31713e4881B67709
$$ plain form
17254 310149 104809 266413 322968 180124 168473 348632 259138 228253 17632 -47938 144882
17242 184244 274498 11076 291601 220300 57564 80269 63606 211877 -67627 337650 319235
17231 319235 208009 185895 26458 319952 19451 208110 155030 344357 117072 155841
17221 155841 404191 269234 15995 253088 38015 316311 32868 131773 154738 363528
17211 363528 395287 347083 393536 323379 184206 171162 445490 88756 16168 193409 28779
17199 236091 455900 418186 348562 203580 273883 102761 373152 -22733 278508 -251355
17188 -21913 -42725 108751 194152 458859 97089 -8503 101746 363399 58838 278675 -219704
17176 153422 122985 53464 106962 507163 297959 225924 349143 -29523 294642 267427 300088
$$ packed form
17254C10149A04809J61604N6555j42844j1651J80159q9494l0885A7632d7938A44882
17242A84244R0254A1076K80525p1301E7564K2705j6663J48271f7627C37650j8415
17231C19235j11226k2114B6458K93494A9451J88659n3080J89327A17072L8769
17221A55841K48350j34957A5995K37093C8015K78296C2868R8905K2965K08790
17211C63528L1759m8204M6453p0157j39173j3044K74328H8756A6168J77241B8779
17199B36091K19809l7714o9624j44982P0303A02761K70391b2733B78508b51355
17188b1913k0812A08751Q5401K64707I7089h503A01746K61653E8838K19837b19704
17176A53422l0437E3464N3498M00201k09204p2035J23219b9523B94642k7215L2661
$$ plain form
17165 300088 -25154 56148 495890 424380 109863 422038 280052 455862 186066 551184
17155 551184 200071 104030 308326 370227 169524 298463 388411 144433 231197 328226
17145 328226 277473 556993 -34221 -76588 79790 223728 469753 197356 232817 90494 486327
17134 486327 455089 449593 192895 227893 293674 355870 277028 441640 131421 264640 3055
17122 -2802 398560 281433 390978 209460 543727 642693 445076 385989 344824 586180
17112 586180 745735 338723 523942 419638 445247 471882 276255 100415 480846 593066
17102 593066 233805 300016 181444 -83958 484675 248255 159005 788386 568613 367463
17092 367463 191282 298815 401925 273914 616636 408118 402032 136806 344848 297858
$$ packed form
17165C00088b5154E6148M39742p1510A09863L12175j41986J75810A86066L65118
17155E51184B00071r6041K04296O1901A69524J28939Q9948A44433Q6764R7029
17145C28226n0753K79520c4221m2367G9790J43938K46025A97356L5461I0494L95833
17134D86327l1238n496A92895L4998O5781O2196p8842J64612A31421J33219C055
17122b802C98560j17127J09545j81518L34267R8966j97617n9087m1165K41356
17112E86180J59555C38723J85219j04304K5609K6635j95627A00415L80431J12220
17102E93066B33805O6211j18572h3958D84675k36420q9250O29381k19773k01150
17092C67463j76181J07533J03110j28011L42722k08518o086A36806K08042m6990
$$ plain form
17082 297858 112909 585123 425603 418995 332632 447273 415557 516442 642955 454872
17072 454872 460795 562573 295507 604747 709116 520630 749685 497205 340345 451870
17062 451870 317960 308920 512873 400969 224705 504792 702501 -141844 368774 519250
17052 519250 608814 622356 547197 206507 661225 463502 332557 609381 396258 609459
17042 609459 332947 655201 634253 432027 502879 462718 503732 525829 526007 371659 537982
17031 537982 676445 259096 269399 335484 671956 327205 598131 918272 515022 318789
17021 318789 638921 776321 811051 217155 422882 648774 96746 804992 646343 510634
17011 510634 832253 633855 654488 589587 876536 923237 525069 415210 760569 658683
$$ packed form
17082B97858A12909M72214j59520o608q6363J14641l1716J00885J26513j88083
17072D54872N923J01778k67066L09240J04369j88486K29055k52480j56860J11525
17062D51870j33910r040K03953j11904j76264K80087J97709a41844C68774J50476
17052E19250Q9564J3542p5159B06507M54718j97723j30945K76824k13123K13201
17042F09459k76512L22254k0948k02226P0852m0161M1014K2097J78j54348J66323
17031E37982J38463B59096J0303O6085L36472C27205K70926L20141m03250j96233
17021C18789L20132J37400L4730B17155K05727K25892I6746P08246j58649j35709
17011E10634L21619j98398K0633o4901K86949M6701l98168j09859L45359j01886
$$ plain form
17001 658683 710341 521238 648693 632061 575287 730235 498777 791766 348111 826255
16991 826255 616578 735451 800722 1111710 608064 894695 921505 774315 677182 515032
16981 515032 659242 549795 750697 841364 882494 952336 520307 644381 844703 1042066
16971 1042066 612226 875257 726085 1133713 1025679 1288670 1013591 1452360 1165355
16962 1165355 995751 952592 763560 1145568 965387 700169 1036458 1041224 866170 724362
16952 724362 1046502 768070 1175673 1066528 995871 1261182 1000660 909073 879452 1376075
16942 1376075 1177168 1087336 1003241 708010 1083914 1329180 1186674 1132035 1265847 1295005
16932 1295005 971053 1276780 1130615 1107448 1195932 1254575 1109825 1117854 1323507 1449452
$$ packed form
17001F58683N1658j89103J27455j6632n6774J54948k31458K92989C48111M78144
16991H26255k09677J18873O5271L10988n03646K86631K6810j47190r7133j62150
16981E15032J44210j09447K00902R0667M1130O9842m32029J24074K00322J97363
16971A042066m29840K63031j49172M07628j08034K62991k75079M38769k87005
16962A165355j69604m3159j89032L82008j80181k65218L36289M766j75054j41808
16952G24362L22140k78432M07603j09145p0657K65311k60522r1587k9621M96623
16942A376075j98907q9832q4095k95231L75904K45266j42506n4639J33812K9158
16932A295005l23952L05727j46165k3167Q8484N8643j44750Q029K05653J25945
$$ plain form
16922 1449452 1365274 910640 989257 1411424 1158340 1412561 1655520 1312042 1553616 1318157
16912 1318157 1740795 1499855 1333907 1405629 1750696 1443738 1212218 1522863 1506917 1732856
16902 1732856 1532789 1519014 1460233 1548229 1508787 1736488 1682022 1723207 1770429 1651093 1435670
16891 1435670 1720037 1860855 1532230 1773033 2169441 1821421 1704886 1813019 1980782
16882 1980782 1778439 2294318 1988698 1935253 1973657 2414681 2191591 1873060 2144732 2203088
16872 2203088 2387162 2123195 2390614 2356131 2457236 2099754 2250711 2503699 2503165 2402133
16862 2402133 2226069 2429249 2402018 2457005 2330549 2468652 2548318 2333291 2902505 2667590
16852 2667590 2838490 2967151 2776604 2970592 2893711 3013355 3030307 3051783 3083520 3137150
$$ packed form
16922A449452q4178m54634P8617M22167k53084K54221K42959l43478K41574k35459
16912A318157M22638k40940j65948P1722L45067l06958k31520L10645j5946K25939
16902A732856k00067j3775n8781Q7996l9442K27701n4466M1185M7222j19336k15423
16891A435670K84367J40818l28625K40803L96408l48020j16535J08133J67763
16882A980782k02343N15879l05620n3445L8404M41024k23090l18531K71672N8356
16872B203088J84074k63967K67419l4483J01105l57482J50957K52988n34j01032
16862B402133j76064K03180k7231N4987j26456J38103P9666k15027N69214k34915
16852B667590J70900J28661j90547J93988p6881J19644J6952K1476L1737N3630
$$ plain form
16842 3137150 3094007 3336390 3284610 3044210 3601130 3361269 3360011 3538833 3244118 3651667
16832 3651667 3784215 3735502 3874706 3957069 3810860 3800267 4031561 4146828 3939069 4478625
16822 4478625 4381979 4525424 4489811 4323447 4629259 4494880 4646532 4748086 4752047 4975236
16812 4975236 4876959 5089534 5393632 5294729 5382479 6020105 5778146 5458966 6212162 6241389
16802 6241389 6179452 6376454 6216670 6669155 6682203 6926068 6871326 6971593 7194532 7623533
16792 7623533 7827086 7433495 7907333 7994164 8124844 8313572 8826994 8972398 9033687 9433096
16782 9433096 9453843 9766625 9998445 10098818 10502655 10461985 11064100 11272855 11898313 12241007
16772 12241007 12610994 12645650 13148829 13385454 14007750 14440560 14704815 15010128 15458188
$$ packed form
16842C137150m3143K42383n1780k40400N56920k39861j258J78822k94715M07549
16832C651667J32548m8713J39204Q2363j46209j0593K31294J15267k07759N39556
16822D478625r6646J43445l5613j66364L05812j34379J51652J01554L961K23189
16812D975236r8277K12575L04098r8903Q7750O37626k41959l19180P53196K9227
16802F241389o1937J97002j59784M52485J3048K43865n4742J00267K22939M29001
16792G623533K03553l93591M73838Q6831J30680J88728N13422J45404O1289L99409
16782I433096K0747L12782K31820J00373M03837m0670O02115K08755O25458L42694
16772A2241007L69987L4656N03179K36625O22296M32810K64255L05313M48060
$$ plain form
16763 15458188 16078232 16623408 16897571 17418216 18458079 18822938 19632485 20235843 20666799
16754 20666799 21880929 22371923 23123502 23859538 25039229 26182584 26883030 28146395 29134694
16745 29134694 30224193 31845900 33318808 34796476 36025462 37771712 39600162 41363230
16737 41363230 42978155 45516471 47640022 50112330 52450928 55232461 58206865 60828668
16729 60828668 64455859 67959919 71873040 75603232 80046896 84776351 89259572 94357625
16721 94357625 99777630 105484605 111433362 117273772 123581892 129966084 136466130 142608070
16713 142608070 148969083 154817119 160148433 165730734 169937174 173766344 176741935 178969803
16705 178969803 180195138 180153031 179675207 177882513 175299059 171934568 167798661 163484851
$$ packed form
16763A5458188O20044N45176K74163N20645J039863L64859Q09547O03358M30956
16754B0666799J214130M90994P51579P36036J179691J143355P00446J263365R88299
16745B9134694J089499J621707J472908J477668J228986J746250J828450J763068
16737D1363230J614925K538316K123551K472308K338598K781533K974404K621803
16729F0828668L627191L504060L913121L730192M443664M729455M483221N098053
16721I4357625N420005N706975N948757N840410O308120O384192O500046O141940
16713A42608070O361013N848036N331314N582301M206440L829170K975591K227868
16705A78969803J225335m2107m77824j792694k583454l364491m135907m313810
$$ plain form
16697 163484851 158184371 152979806 147720147 141967812 136182895 130011121 124257539 118578557
16689 118578557 112905387 107648077 102221381 97054744 92356612 87736642 83393432 78913245
16681 78913245 74840690 71360226 67489189 64198335 61076424 57655453 55272911 52317816
16673 52317816 50151306 47527225 45092837 43005809 40983992 39376388 37284911 35600694
16665 35600694 34367590 32865230 31350425 29982714 28769610 27601377 26564828 25497340
16657 25497340 24263764 23527674 22585673 21833036 21020194 20262609 19914669 18845140 18324827
16648 18324827 17461307 16934839 16366373 15814885 15577456 14980166 14429971 13950673 13735813
16639 13735813 13199417 12544077 12366914 11982699 11530553 11425099 11334177 11081251 10349816
$$ packed form
16697A63484851n300480n204565n259659n752335n784917o171774n753582n678982
16689A18578557n673170n257310n426696n166637m698132m619970m343210m480187
16681G8913245m072555l480464l871037l290854l121911l420971k382542k955095
16673E2317816k166510k624081k434388k087028k021817j607604k091477j684217
16665C5600694j233104j502360j514805j367711j213104j168233j036549j067488
16657B5497340j233576p36090r42001p52637q12842p57585l47940j069529n20313
16648A8324827q63520n26468n68466n51488k37429n97290n50195m79298k14860
16639A3735813n36396o55340j77163l84215m52146j05454r0922k52926p31435
$$ plain form
16630 10349816 10095241 9976971 9657719 9255198 9235033 9074981 8849515 8569597 8485234 8000953
16620 8000953 7924340 7610436 7318054 7359963 7006471 7275192 6924362 6363660 6359531 6403861
16610 6403861 6284608 6212400 5539780 5980666 5955160 5276348 5143690 5590380 5501658 4961859
16600 4961859 4855111 4875285 5396462 5153748 4772130 4524970 4651599 4359930 4291684 4531686
16590 4531686 4641207 4169212 4198832 3803796 4042548 3622448 3682091 3927142 3216297 3443341
16580 3443341 3567272 3484479 3005552 3433345 3194796 3311576 3063162 3131248 3056551 3204613
16570 3204613 2961365 3091403 2891204 3016260 2712299 2987047 2842139 2541235 2302192
16561 2302192 2531569 2301737 2411722 2631190 2624345 2547596 2304414 2208660 2216699 2283548 2073235
$$ packed form
16630A0349816k54575j18270l19252m02521k0165j60052k25466k79918q4363m84281
16620H000953p6613l13904k92382M1909l53492K68721l50830n60702m129M4330
16610F403861j19253p2208o72620M40886k5506o78812j32658M46690q8722n39799
16600D961859j06748K0174N21177k42714l81618k47160J26629k91669o8246K40002
16590D531686J09521m71995K9620l95036K38752m20100N9643K45051p10845K27044
16580C443341J23931q2793m78927M27793k38549J16780k48414O8086p4697J48062
16570C204613k43248J30038k00199J25056l03961K74748j44908l00904k39043
16561B302192K29377k29832J09985K19468o845p6749k43182r5754Q039O6849k10313
$$ plain form
16550 2073235 2613410 2204348 1948369 2214134 1995177 2244974 2043943 1684907 1938351
16541 1938351 1923862 1929730 1708359 1770747 2126738 1755543 2020542 1894130 1632075 1760855
16531 1760855 1561993 1892983 1541190 1768536 1622166 1626052 1704476 1581133 1546991 1541552
16521 1541552 1603040 1608989 1394262 1626066 1416614 1431802 1449151 1235199 1601287 1265653
16511 1265653 1427973 1647041 1291247 1507933 1169592 1323818 1089523 1179440 1445881 1273699
16501 1273699 1115434 1345790 1017825 900875 1041709 1070306 1246441 1433650 1384979 1162632
16491 1162632 982493 1101489 857136 975619 1229368 919376 796040 991253 892972 1131024
16481 1131024 943980 992634 927670 999604 1118528 1115043 976848 877008 937993 847453 1171532
$$ packed form
16550B073235N40175m09062k55979K65765k18957K49797k01031l59036K53444
16541A938351j4489N868k21371O2388L55991l71195K64999j26412k62055J28780
16531A760855j98862L30990l51793K27346j46370L886P8424j23343l4142n439
16521A541552O1488N949k14727K31804k09452J5188J7349k13952L66088l35634
16511A265653J62320K19068l55794K16686l38341J54226k34295Q9917K66441j72182
16501A273699j58265K30356l27965j16950J40834K8597J76135J87209m8671k22347
16491A162632j80139J18996k44353J18483K53749l09992j23336J95213r8281K38052
16481A131024j87044M8654o4964P1934J18924l485j38195r9840O0985r0540L24079
$$ plain form
16470 1171532 1107950 1119266 646657 668234 688130 634836 903118 669633 868826 817394
16460 817394 801765 978978 538796 715444 711998 1027257 870984 957492 633698 607520
16450 607520 845375 754472 829674 518914 522784 750914 698919 851909 433190 674580
16440 674580 608233 872949 314457 313844 510937 604190 360638 572993 724056 649190 223340
16428 689263 778576 552691 803604 435869 530240 262951 468799 634835 470675 620118
16418 620118 800840 323583 668017 352623 671971 613288 240530 484818 813645 644417
16408 644417 768904 410431 445473 391135 656649 736024 404660 394651 564101 295143
16398 295143 708490 76641 343875 536727 313307 604810 248593 605019 209197 565737
$$ packed form
16470A171532o3582J1316m72609K1577J9896n3294K68282k33485J99193n1432
16460H17394j5629J77213m40182J76648l446L15259j56273Q6508l23794k6178
16450F07520K37855r0903P5202l10760L870K28130n1995J52990m18719K41390
16440F74580o6347K64716C14457o13J97093R3253k43552K12355J51063p4866B23340
16428F89263Q9313k25885K50913l67735R4371B62951K05848J66036j64160J49443
16418F20118J80722C23583L44434l15394L19348n8683B40530K44288L28827j69228
16408F44417J24487l58473L5042n4338K65514P9375l31364j0009J69450k68958
16398B95143M13347G6641K67234J92852k23420K91503B48593L56426B09197L56540
$$ plain form
16388 565737 59675 618069 470720 431029 604552 329265 181167 684923 253663 447926
16378 447926 321074 198878 584256 387695 519715 318699 292309 143786 460032 541109
16368 541109 352889 474931 271691 228742 324190 390923 433823 400616 149510 595253
16358 595253 250957 334443 531202 203059 -157033 142472 324068 420593 564017 442694
16348 442694 310646 289550 221791 484690 310716 506146 336274 567375 224819 563145
16338 563145 221579 283830 307057 402654 330101 3346 263620 -59232 396286 438166 284964
16327 284964 209881 101782 315348 400768 329294 406588 -255779 269331 516074 431458
16317 431458 530353 388810 -8723 239261 283264 20293 141107 100836 409785 300509 171230
$$ packed form
16388E65737E9675N58394j47349l9691J73523k75287j48098N03756B53663J94263
16378D47926j26852j22196L85378j96561J32020k01016k6390A43786L16246Q1077
16368E41109j88220J22042k03240m2949R5448O6733M2900l3207A49510M45743
16358E95253B50957Q3486J96759B03059a57033A42472J81596R6525J43424j21323
16348D42694j32048k1096o7759K62899j73974J95430j69872K31101B24819L38326
16338E63145B21579O2251K3227R5597p2553C346K60274e9232C96286M1880j53202
16327B84964p5083A01782K13566Q5420p1474P7294b55779B69331K46743q4616
16317D31458R8895j41543h723B39261M4003B0293J20814m0271L08949j09276j29279
$$ plain form
16306 171230 381943 17126 400003 205852 65352 232186 93103 193892 139344 88631
16296 88631 283242 22810 452067 479313 -96058 22889 133239 416867 404730 164981 519071
16285 519071 229091 186185 197938 252943 403822 175337 27489 385968 214964 298954
16275 298954 114297 401137 314797 280869 264654 -217641 542176 120626 274230 33124
16264 -79431 323321 83722 171507 486888 265267 432724 114321 -76235 271615 77383
16253 211356 327275 229798 73534 133625 -282905 407717 235298 151047 369481 505726
16243 505726 178907 47703 242378 -159960 -8215 151315 273097 146113 -231090 129630
16232 -18008 -50249 170528 170578 -262922 123859 100521 44683 356271 438535 61122 -43109
$$ packed form
16306A71230K10713A7126L82877j94151F5352J66834I3103J00789n4548n0713
16296H8631J94611B2810M29257K7246i6058B2889J10350K83628j2137A64981L54090
16285E19071B29091m2906J1753N5005J50879A75337B7489L58479j71004Q3990
16275B98954A14297K86840q6340l3928j6215b17641E42176A20626J53604C3124
16264g9431C23321H3722Q7785L15381k21621J67457A14321g6235B71615G7383
16253B11356J15919r7477G3534O0091b82905D07717j72419q4251K18434J36245
16243E05726A78907D7703J94675a59960h215A51315J21782j26984b31090A29630
16232a8008l2241A70528N0b62922A23859k3338D4683L11588Q2264F1122d3109
$$ plain form
16220 210601 -249899 226444 181713 229170 67168 -17213 38292 -23352 40922 109153 259187
16209 259187 176001 59092 96167 184387 221162 279453 70322 43077 115918 265679 512667
16198 512667 -31020 188731 -86472 -134367 176018 166481 -17360 -157635 -156230 94353 -14157
16186 281584 42465 -225317 -74626 39558 12888 253028 23901 311298 81213 141417 220447
16175 220447 47350 -48815 -74545 -252353 73697 -341361 147106 358546 -61678 -132673 79641
16163 197037 -58772 292336 -65474 135915 280695 8181 42567 -76125 78954 14921 347789
16152 347789 107460 172981 -149407 -50750 77110 246497 203203 -90510 183668 -205042
16141 -262632 -20389 121587 -40875 -60490 -82983 -46636 -5015 -101225 -31162 -42548 174535
$$ packed form
16220B10601b49899B26444m4731M7457F7168a7213C8292b3352D0922O8231J50034
16209B59187q3186E9092L7075Q8220L6775N8291G0322k7245P2841J49761K46988
16198E12667c1020A88731h6472m7895A76018r537a7360j40275J405I4353a4157
16186B81584D2465b25317g4626C9558A2888K40140B3901K87397H1213O0204P9030
16175B20447D7350d8815k5730j77808G3697c41361A47106K11440f1678p0995G9641
16163A97037e8772B92336f5474A35915J44780H181L4386g6125G8954A4921L32868
16152C47789A07460O5521a49407e0750G7110J69387m3294i0510A83668b05042
16141b62632b0389A21587d0875j9615k2493L6347e015r6210c1162j1386A74535
$$ plain form
16129 52533 86537 85328 169282 -194101 333195 -33839 133507 81483 366727 -35548 -110636
16118 -110636 -18317 -224860 13381 -311083 67657 268676 322961 -92625 33311 91427 -145135
16106 -145252 413053 166680 189610 102556 -198706 -513179 239512 -487317 -151723 -290185
16096 -290185 -180242 -161168 -354116 76958 -155796 -259347 285422 -56323 23497 208964
16086 208964 -49986 250253 216383 242338 -138023 -203938 -117157 29764 63332 439784 53925
16074 12666 80680 -266548 104211 -222257 108036 25981 2037 56219 124336 171686 -262160
16062 208809 -89002 11676 -1842 324425 -25938 -78245 -76459 333730 56346 90378 53443
16051 53443 225277 235584 186181 228360 78838 -64899 2820 -456333 34553 -19024 150401
$$ packed form
16129E2533L4004j209Q3954a94101C33195c3839A33507n2024K85244c5548p5088
16118a10636a8317k06543A3381c11083F7657K01019N4285i2625C3311N8116a45135
16106a45252D13053A66680K2930q7054a98706l14473B39512d87317a51723j38462
16096b90185J09943J9074j92948G6958a55796j03551B85422e6323B3497J85467
16086B08964d9986B50253l3870K5955a38023o5915Q6781B9764L3568L76452E3925
16074A2666O8014b66548A04211b22257A08036B5981B037N4182O8117M7350b62160
16062B08809h9002A1676a842C24425b5938n2307J786C33730E6346L4032l6935
16051E3443J71834J0307m9403M2179G8838f4899B820d56333C4553a9024A50401
$$ plain form
16039 -205160 136645 -68096 -138882 15484 -82654 242340 33446 -115917 10755 12517 -59827
16027 -205004 -117422 -126622 -220077 135124 104676 127653 503688 -181345 -163042 133867 52341
16015 43413 -392350 -59259 91963 131038 -24998 -252731 42939 38338 -256378 226114 185516
16004 185516 -101491 44261 -25650 -217944 70340 -39583 405120 144595 -319680 -250891
15994 -250891 -80137 6675 356727 -119287 -247318 -187116 -163588 -60402 -176178 -91304 -60630
15983 -60630 -29394 -68666 63605 -34744 -239000 -19451 -136030 5260 115242 220921 -74411
15971 -93632 -51222 390681 378384 109679 333776 185735 133898 -74814 25894 338164 54013
15959 -5061 181078 60873 52945 173715 -66336 52193 145530 -27906 212588 281364 -13519
$$ packed form
16039b05160A36645f8096p0786A5484h2654B42340C3446a15917A0755J762e9827
16027b05004Q7582r200r3455A35124l0448K2977L76035a81345J8303A33867E2341
16015D3413c92350e9259I1963L9075b4998k27733D2939m601b56378B26114m0598
16004A85516a01491D4261b5650j92294G0340c9583D05120A44595c19680O8789
15994b50891h0137F675L50052a19287j28031O0202K3528f0402j15776Q4874L0674
15983f0630b9394l9272F3605c4744k04256a9451j16579E260J09982J05679g4411
15971i3632M2410C90681j2297A09679K24097j48041n1837g4814B5894L12270E4013
15959e061A81078F0873p928J20770f6336E2193R3337b7906B12588O8776a3519
$$ plain form
15947 314374 123051 -213152 294628 -259726 -44593 124026 -222327 53284 146604 242157
15937 242157 -437158 355076 106650 124638 20629 -223137 64439 -138141 -13482 -133998
15927 -133998 -134360 -269330 181461 159146 48583 78284 52173 -183396 -54663 84211 -78378
15915 58329 42218 154413 107870 -48769 226691 -147280 -797 109085 -47611 -251818 -183129
15904 -183129 290688 53211 -30064 145855 -91949 -239664 -167132 -42791 185467 30648 -1692
15892 -3463 278022 85623 115994 205250 -144596 -102985 -150876 -93867 -200926 -87717 -73049
15881 -73049 224806 119210 85747 -80230 59234 -363600 -134201 -3207 -406717 -27511 259441
15869 139127 23043 -181638 -365218 100851 -245322 126828 -63257 -248129 15065 -241310
$$ packed form
15947C14374A23051b13152B94628b59726d4593A24026b22327E3284R3320R5553
15937B42157d37158C55076A06650J7988B0629b23137F4439a38141a3482j20516
15927a33998l62j34970A81461k2315D8583K9701k6111a83396e4663H4211g8378
15915E8329j6111J12195m6543d8769B26691a47280g97A09085d7611k04207O8689
15904a83129B90688E3211c0064A45855i1949j47715P2532d2791A85467C0648a692
15892c463B78022H5623L0371Q9256a44596M1611m7891N7009j07059h7717J4668
15881g3049B24806j05596l3463h0230E9234c63600a34201c207m03510b7511B59441
15869A39127B3043a81638j83580A00851b45322A26828f3257j84872A5065b41310
$$ plain form
15858 -368301 116683 -94858 138678 55432 12762 244046 98086 88969 -151987 230970 -222604
15846 38855 -11479 -67432 -17138 153169 -23078 -491928 -116920 -9929 -44807 8993 -42931
15834 -21655 97852 -45290 200318 -69708 179818 119953 -58172 55658 8261 -73331 -1726 150291
15821 121921 -27862 68402 196410 -132735 -104729 106856 153429 8743 322826 -272258 -28520
15809 -224128 29590 50906 -71425 -57489 29104 258827 -104909 -24817 74304 -400302 -279617
15798 -279617 -123595 -6693 -76377 60179 197863 -117387 -58569 -78593 244370 -246379 -26199
15786 -85971 63408 85806 -158699 158576 -48674 -106230 -135208 107142 17403 -23727 -106397
15775 -106397 -179430 -38836 -124428 -209557 -197855 -160015 -24097 -72509 61066 -139088 -96363
$$ packed form
15858c68301A16683i4858A38678E5432A2762K31284I8086r117a51987B30970b22604
15846C8855a1479n5953a7138A53169b3078m68850a16920i929l4878H993d2931
15834b1655I7852d5290B00318f9708A79818n9865e8172E5658H261g3331a726A50291
15821A21921b7862F8402J28008a32735K8006A06856M6573H743L14083b72258b8520
15809b24128B9590K1316g1425J3936B9104K29723a04909b4817G4304d00302J20685
15798b79617a23595f693o9684F0179J37684a17387e8569k0024B44370b46379b6199
15786h5971F3408K2398a58699A58576d8674n7556k8978A07142A7403b3727q2670
15775a06397p3033c8836q5592q5129J1702L7840b4097m8412F1066a39088M2725
$$ plain form
15764 -96363 -149860 27573 64126 -190281 -243241 341419 -167747 50588 -130717 290295 191264
15753 191264 -1111 151901 8973 -99453 236490 -102814 28407 138683 167965 -64565 20631
15741 33971 -24877 32617 95874 -205912 36223 -71766 76581 27845 -93687 -63340 48400
15729 -112840 181215 100844 -221166 -94741 -156365 -52908 -280114 213748 185709 214909 -141305
15717 301616 247117 -438426 -253956 226549 16916 -163594 -257272 -55172 -177465 1727 -127157
15705 -361404 -500794 -7085 156451 181454 91395 58200 -71723 -288142 148007 -109555 51375
15693 -16888 37777 19027 -297375 -57097 -267158 72930 -104716 48392 -191781 143713 -78965
15681 897 227272 -167369 233869 -129473 46012 -104756 70143 -191816 -107617 455803 150496
$$ packed form
15764i6363n3497B7573L6553a90281n2960C41419a67747E0588a30717B90295r9031
15753A91264a111A51901H973i9453B36490a02814B8407J10276K9282f4565B0631
15741C3971b4877C2617O3257b05912C6223g1766G6581B7845i3687L0347D8400
15729a12840A81215q0371b21166i4741o1624e2908k27206B13748k8039K9200a41305
15717C01616n4499d38426J84470B26549A6916a63594r3678e5172j22293A727a27157
15705c61404j39390g085A56451K5003r0059l3195g1723k16419A48007a09555E1375
15693a6888C7777j8750b97375e7097k10061G2930a04716D8392a91781A43713g8965
15681H97K26375a67369B33869a29473D6012a04756G0143a91816Q4199D55803A50496
$$ plain form
15669 199423 118231 91646 -65173 43955 59131 -316227 -194180 68673 -47431 96066 -130699
15657 -76999 33050 -69958 169256 50973 88160 -9923 11176 47513 55909 -320228 -266381 378152
15644 351394 209416 188888 -133685 -19448 161817 -236892 371599 62216 14495 -229051
15633 -249795 30827 -87347 214162 -226301 -117311 -153898 220235 -522820 46261 -171232
15622 -60799 -131167 -72286 -96384 -57911 283600 -94673 117724 -255799 -18247 -98280 220684
15610 13082 -123827 -60537 -1033 -206646 7220 -179239 150696 56980 136694 112264 -344419
15598 -185680 -204392 -186330 283091 64842 -162095 -25275 -23163 -296224 -89244 220661 82020
15586 -196294 106941 -175253 311208 -96215 64492 115562 -33766 -51815 279194 114274
$$ packed form
15669A99423q1192k6585f5173D3955J5176c16227J22047F8673d7431I6066a30699
15657g6999C3050f9958A69256E0973L7187i923A1176L6337Q396c20228N3847C78152
15644C51394j41978k0528a33685a9448A61817b36892C71599F2216A4495b29051
15633b49795C0827h7347B14162b26301J08990l6587B20235e22820D6261a71232
15622f0799p0368N8881k4098L8473B83600i4673A17724b55799a8247q0033B20684
15610A3082a23827f0537a033k05613G220a79239A50696E6980P9714k4430c44419
15598a85680j8712J8062B83091F4842a62095b5275K112k73061h9244B20661H2020
15586a96294A06941a75253C11208i6215F4492N1070c3766j8049B79194A14274
$$ plain form
15575 -60505 16778 -48968 -56531 208898 145864 -75536 23509 -94309 50368 403652 25713
15563 -236259 -118973 13328 297118 -144583 -203604 -126431 4466 -251949 -19236 66171 -27871
15551 4813 -23517 -427196 114351 100971 -33903 -704 -117753 -173028 294226 -439153 -347203
15540 -347203 78479 -75282 -56522 -243121 -19143 -74313 143849 -9648 305042 228313 49156
15528 -393759 89436 -42608 65305 230068 160289 68874 -3654 -90849 226884 -113440 115823
15516 -10869 131963 9678 -223691 240318 386177 164420 212643 64327 25986 -73900 -273486
15505 -273486 91413 -50523 320136 99242 147489 20217 87327 28264 231315 -10382 -322396
15494 -322396 -82962 420731 72934 -180401 -229689 -211292 -31417 -82596 -237510 119876 -67418
$$ packed form
15575f0505A6778d8968p563B08898o3034g5536B3509i4309E0368L53284B5713
15563b36259J17286A3328K83790a44583n9021P7173D466b51949a9236F6171b7871
15551D813b3517m03679A14351j3380c3903g04j17049n5275B94226d39153R1950
15540c47203G8479g5282J8760j86599a9143n5170A43849i648C05042p6729D9156
15528c93759H9436d2608F5305J64763o9779F8874c654q7195B26884a13440A15823
15516a0869A31963I678b23691B40318J45859A64420M8223F4327B5986g3900j99586
15505b73486I1413e0523C20136I9242M8247B0217O7110B8264K03051a0382l12014
15494c22396h2962D20731G2934a80401m9288J8397c1417n1179j54914A19876f7418
$$ plain form
15482 46007 -454783 -68465 -439174 -90762 -274951 -143154 20753 -110140 38855 -39820 -63356
15471 -63356 -119396 -13542 149891 -308364 -248060 52193 268991 -49981 52004 -130905 -48957
15459 224631 -174794 244584 -121510 -24984 7979 208228 196171 72044 76523 194796 -208952
15447 23806 -22404 -147757 118394 135024 -56711 21536 60242 -290344 117450 230219 59729
15435 -175766 -185339 122174 32978 -25245 20867 -124573 73775 16926 -326354 101266 39850
15423 -120625 -259063 179405 -49554 75213 -59608 -547333 -115981 225398 41638 -173478
15412 99736 181348 -531337 -62025 -131567 245677 254940 20695 -47939 253114 -112372 113413
15400 18451 118630 24656 100825 39849 -67830 -184848 -339760 -410673 200293 332001 -99014
$$ packed form
15482D6007d54783f8465l70709i0762j84189J31797B0753a10140C8855c9820k3536
15471f3356n6040a3542A49891c08364O0304E2193K16798d9981E2004a30905d8957
15459B24631a74794B44584a21510b4984G979K00249j2057G2044M479J18273b08952
15447B3806b2404j25353A18394J6630e6711B1536L8706b90344A17450J12769E9729
15435a75766r573A22174C2978b5245B0867a24573G3775A6926c26354A01266C9850
15423a20625j38438A79405d9554G5213e9608m87725a15981B25398D1638a73478
15412I9736Q1612e31337f2025o9542B45677R263B0695d7939B53114a12372A13413
15400A8451J00179B4656P6169C9849f7830j17018j54912p0913B00293J31708i9014
$$ plain form
15388 43985 -117589 8510 228199 -216161 -92793 159751 -54579 -36522 -134472 -102391 214669
15376 15856 -15085 141996 -354708 93971 196072 -19798 340248 -60525 25466 -171620 -120448
15365 -120448 84279 -50140 419434 94320 247191 114664 150437 53068 30299 -95401 -114726
15354 -114726 -243756 -244036 -168867 -229122 199717 355393 -309868 121912 -98142 16648 8913
15343 8913 55951 3803 49252 247974 -153901 1994 -150520 -60482 -170115 -170097 25999 -204204
15330 -32359 92388 253507 -31116 -141894 -64705 417475 -196958 18518 264112 97634 -179293
15318 -222412 -488042 -156325 -38604 -135838 75947 -34299 -368006 340335 55190 -55573 121755
15306 -124550 -230378 -95502 128218 29682 19554 -73547 -93332 -150275 -276932 -102851 94727
$$ packed form
15388D3985a17589H510K19689b16161i2793A59751e4579J8057r7950L2081B14669
15376A5856a5085A41996c54708I3971J02101a9798C40248f0525B5466a71620N1172
15365a20448H4279e0140D19434I4320J52871A14664L5773E3068k2769i5401j9325
15354a14726j29030k80P5169o0255A99717J55676c09868A21912i8142A6648p735
15343H913M7038C803M5449J98722a53901A994a50520f0482j09633J8B5999b04204
15330c2359I2388J61119c1116j10778f4705D17475a96958A8518K45594I7634a79293
15318b22412k65630a56325c8604r7234G5947c4299l33707C40335E5190e5573A21755
15306a24550j05828i5502A28218B9682j0128g3547j9785n6943j26657a02851I4727
$$ plain form
15294 -42179 102353 108979 196330 113153 124194 7931 145032 -48950 -49295 -143429 -184521 102064
15281 -97550 -121304 132552 7632 -195807 -176930 -162738 43383 32330 -42681 -586 -153119 220600
15268 -248476 43547 206057 -100441 249528 146268 -260323 -24805 77056 8487 17896 165556
15257 165556 152237 -195999 164789 -208473 -43131 -64517 53516 -182871 -38328 186475
15246 14014 312790 -5632 240639 49583 21503 44405 -103044 116041 106593 369675 34111
15234 213430 444249 586069 1003810 1473317 1435491 970155 427752 253230 625725 253155
15223 44810 -117032 243788 -242862 82259 -48284 304530 109742 89352 -61522 -163932
15213 -163932 -83913 -266871 -129478 107203 236003 -66538 212370 179470 81268 166157
$$ packed form
15294d2179A02353O626Q7351q3177J1041G931J37101d8950l45r4134m1092A02064
15281i7550k3754A32552G632a95807J8877J4192D3383j1053d2681e86j52533B20600
15268b48476D3547J62510a00441B49528j03260b60323b4805G7056H487R409J47660
15257A65556j3319a95999A64789b08473d3131k1386E3516a82871c8328A86475
15246A4014K98776e632B40639D9583B1503K2902a03044A16041r448K63082C4111
15234B13430K30819J41820M17741M69507l7826m65336D27752j74522L72495B53155
15223D4810a17032B43788b42862H2259d8284C04530A09742k0390f1522j02410
15213a63932Q0019j82958a29478A07203J28800f6538B12370l2900H1268Q4889
$$ plain form
15203 166157 208087 -173515 20864 202568 50259 -134227 333392 16713 -222636 98840
15192 -8997 -171495 246353 -113112 -51896 -229372 28074 263242 256412 152802 26553 255824
15181 255824 136191 -119488 131017 -141500 13758 -29318 -19512 233300 -8619 -44986 -24075
15170 -24075 -69512 105510 86414 -137846 580 201532 -8146 41089 172812 -143653 177431
15158 -34403 172503 211585 184413 386055 -4170 69164 -67794 261807 145567 -245635 -25374
15146 -142110 -56855 -103272 153451 173131 131690 -142233 -159701 -151183 -52834 218039 280519
15135 280519 -226114 258850 -176903 165651 191013 204626 81080 30645 83154 63938 157165
15124 157165 208577 98749 488812 60481 300059 168610 -42409 19841 149723 56550 22164
$$ packed form
15203A66157M1930a73515B0864J81704E0259a34227C33392A6713b22636I8840
15192h997j62498B46353a13112e1896j77476B8074K35168o830j03610B6553K29271
15181B55824j19633a19488A31017a41500A3758b9318R806B33300h619l6367K0911
15170b4075m5437A05510j9096a37846E80K00952h146D1089J31723a43653A77431
15158c4403A72503L9082k7172K01642d170F9164f7794B61807j16240b45635b5374
15146a42110e6855m6417A53451J9680m1441a42233j7468Q518e2834B18039O2480
15135B80519b26114B58850a76903A65651K5362J3613H1080C0645N2509j9216R3227
15124A57165N1412I8749L90063F0481K39578j31449d2409A9841J29882E6550B2164
$$ plain form
15112 242224 237288 2726 371715 35953 213698 304274 41826 210798 86566 93089 380717
15101 380717 -78312 482824 311372 285769 200371 -24561 310180 -156296 -129536 -227741 473053
15089 382105 -10533 133140 -227421 87160 307521 370148 -33880 -244663 122611 220384
15079 220384 443980 125723 265803 -153305 276581 -95907 215853 -107870 247663 328710
15069 328710 505045 -143729 414100 340775 298193 188211 55634 -26015 302234 246023
15059 246023 -26939 181057 -146969 -145542 68547 165181 204549 395793 -72983 -83982 157151
15047 200187 -21871 247418 95462 12654 -31270 -226993 16273 129576 213532 140805 46543
15035 288772 119014 17924 -109636 103851 154235 271695 42788 205322 306341 222571
$$ packed form
15112B42224m936B726L68989C5953J77745R0576D1826J68972H6566O523K87628
15101C80717g8312D82824j71452k5603q5398b4561C10180a56296K6760r8205D73053
15089C82105a0533A33140b27421H7160K20361O2627c3880k10783A22611R7773
15079B20384K23596A25723J40080a53305B76581i5907B15853a07870B47663Q1047
15069C28710J76335a43729D14100p3325m2582j09982E5634b6015C02234n6211
15059B46023b6939A81057a46969J427F8547R6634L9368J91244g2983j0999A57151
15047B00187b1871B47418I5462A2654c1270j95723A6273J13303Q3956p2727D6543
15035B88772A19014A7924a09636A03851N0384J17460D2788J62534J01019q3770
$$ plain form
15025 222571 279772 -201795 -156584 -47303 246445 -45825 330102 437805 208309 133997
15015 133997 179839 185407 433151 203062 155076 208678 69466 243073 331544 1965 222111
15004 222111 127881 273154 208124 180956 256022 53125 34357 531752 -257377 93487 230695
14993 230695 82510 450984 -52886 173292 26908 -59859 244841 93669 -25525 457588 -26660
14981 345476 344275 141992 292404 282722 126008 91335 192911 201664 54696 2841 349189
14970 349189 302613 396544 162587 287084 67161 199023 150914 -221841 233741 393227
14960 393227 283056 217502 199658 258260 424870 67064 176041 -73340 205397 223280 80025
14948 10372 400789 171448 148926 323338 132043 -124193 274452 277373 361637 467377
$$ packed form
15025B22571N7201b01795M5211d7303B46445d5825C30102J07703B08309p4312
15015A33997M5842N568K47744B03062m7986N3602F9466J73607Q8471A965K20146
15004B22111r4230J45273o5030k7168P5066E3125j8768M97395b57377I3487J37208
14993B30695H2510L68474e2886A73292B6908e9859B44841I3669b5525D57588b6660
14981C45476j201A41992J50412r682A26008l4673J01576Q753E4696B841L46348
14970C49189m6576R3931A62587J24497F7161J31862m8109b21841B33741J59486
14960C93227j10171o5554j7844N8602J66610F7064J08977g3340B05397J7883H0025
14948A0372L90417A71448k2522J74412A32043a24193B74452K921Q4264J05740
$$ plain form
14938 467377 277528 257763 380584 354588 158514 428536 24482 210660 298779 271831
14928 271831 354664 277280 170514 36181 522199 274343 492165 460463 263057 9823 325077
14917 325077 337274 394976 144935 209817 111125 165185 72565 259230 -31753 246840 337137
14906 337137 189674 220088 499031 235304 52765 40222 386528 193986 256390 333828
14896 333828 212715 379673 273293 545551 211420 84360 330922 210545 412664 373306
14886 373306 213292 256762 479120 543038 277539 323849 273361 306794 143118 339126
14876 339126 411520 477488 229384 337017 278293 341233 258201 276330 403123 360213 290562
14865 290562 312282 429263 358552 258204 60984 440070 498959 530931 572542 169823 227960
$$ packed form
14938D67377j89849j9765J22821k5996A58514K70022B4482J86178Q8119k6948
14928B71831Q2833p7384j06766C6181M86018k47856K17822l1702j97406I823L15254
14917C25077J2197N7702A44935O4882r8692N4060G2565J86665c1753B46840R0297
14906C37137j47463L0414K78943B35304E2765j2543L46306j92542O2404P7438
14896C33828j21113J66958j06380K72258B11420H4360K46562j20377K02119l9358
14886C73306j60014M3470K22358O3918k65499M6310n0488L3433A43118J96008
14876C39126P2394O5968B29384J07633n8724O2940q3032J8129J26793m2910o9651
14865B90562K1720J16981p0711j00348F0984L79086N8889L1972M1611A69823N8137
$$ plain form
14854 227960 194773 778403 266567 511275 423378 291513 207245 535133 320029 473068
14844 473068 171727 412590 611722 316790 553680 89639 254129 372764 699377 334407
14833 522972 333528 148830 77762 269838 589935 573244 392235 251259 281088 535599
14823 535599 606843 592561 496297 381626 508788 331240 603783 527934 204500 435952
14813 435952 568966 147684 341510 444499 279739 463328 445782 342716 373788 544679
14803 544679 327242 501645 485712 417229 426116 685086 182232 355967 585602 592431 292077
14791 663878 608480 343238 96341 578197 413899 571021 429198 293910 437178 706345
14781 706345 676450 453901 558963 349663 443529 521553 467379 641460 460686 391665
$$ packed form
14854B27960l3187N83630B66567K44708q7897j31865q4268L27888k15104J53039
14844D73068A71727K40863J99132k94932K36890H9639J64490J18635L26613C34407
14833E22972j89444A48830p1068J92076L20097j6691j81009j40976K9829K54511
14823E35599P1244j4282r6264j14671J27162j77548K72543p5849B04500K31452
14813D35952J33014A47684J93826J02989j64760J83589j7546j03066L1072J70891
14803E44679k17437J74403j5933o8483Q887K58970A82232J73735K29635O829B92077
14791F63878n5398k65242I6341M81856j64298J57122j41823j35288J43268K69167
14781G06345k9895k22549J05062k09300R3866P8024n4174J74081j80774o9021
$$ plain form
14771 391665 576293 466429 294278 273761 574981 516877 427037 585979 457276 767529
14761 767529 260908 696508 727866 391082 491817 409075 423649 425300 688615 465633
14751 465633 550576 459922 415719 783230 601823 565187 595729 669205 400404 631830 598164
14740 598164 715368 665392 745488 759949 958460 509717 805973 1208584 747223 751009
14730 751009 531873 979130 616581 464834 614232 617835 955730 491590 582151 771869
14720 771869 1089799 709856 941800 697370 692246 655863 828004 609156 566539 610494
14710 610494 475991 845761 1025093 906533 793638 881969 790012 529380 845648 861861
14700 861861 555999 886054 628953 535667 862266 824298 421615 750333 572195 750609
$$ packed form
14771C91665J84628j09864j72151k0517L01220n8104q9840J58942j28703L10253
14761G67529B60908M35600L1358l36784J00735q2742J4574J651K63315k22982
14751D65633Q4943r0654m4203L67511j81407l6636L0542P3476k68801K31426l3666
14740E98164J17204m9976Q0096J4461J98511m48743K96256M02611m61361L786
14730G51009k19136M47257l62549j51747J49398L603L37895m64140R0561J89718
14720G71869L17930l79943K31944k44430n124l6383J72141k18848m2617M3955
14710F10494j34503L69770J79332j18560j12895Q8331r1957k60632L16268J6213
14700H61861l05862L30055k57101r3286L26599l7968m02683L28718j78138J78414
$$ plain form
14690 750609 986624 976024 977454 702477 662288 897736 592083 832036 1268802 1126468
14680 1126468 530030 971054 1022861 746964 721100 983376 939423 1009706 745724 921725
14670 921725 803938 573157 970098 1096066 880057 786480 737149 1041146 851330 905510
14660 905510 462232 863522 813794 869079 1066198 690194 1114983 935059 650862 932609
14650 932609 1184013 937898 757451 1204290 1079651 780430 1090997 1241737 1133355 1126959
14640 1126959 1073637 1001876 922766 1098361 905611 1374010 719240 1034897 1126859 1091133
14630 1091133 966821 1332041 1145657 1361443 1030437 1275059 1162556 1099678 1376959 993990
14620 993990 1225146 1038063 1317463 1362610 1007609 1417890 1456910 1181245 1207566 1508470
$$ packed form
14690G50609K36015j0600J430k74977m0189K35448l05653K39953M36766j42334
14680A126468E30030M41024N1807k75897k5864K62276m3953P0283k63982J76001
14670I21725j17787k30781L96941J25968k16009r3577m9331L03997j89816N4180
14660I05510m43278M01290m9728N5285J97119l76004M24789j79924k84197K81747
14650I32609K51404k46115j80447M46839j24639k99221L10567J50740j08382o396
14640A126959n3322p1761p9110J75595j92750M68399o54770L15657R1962l5726
14630A091133j24312L65220j86384K15786l31006K44622j12503o2878K77281l82969
14620I93990K31156j87083K79400M5147l55001M10281L9020k75665K6321L00904
$$ plain form
14610 1508470 1154738 1475298 1144082 1302026 1055235 1495601 1505978 1661085 1717082 1718052
14600 1718052 1544814 1178106 1334935 1241702 1113213 1483060 1303121 1352943 1458906 1648810
14590 1648810 1227417 1533723 1540428 1484799 1364572 1315194 1704461 1388109 1844249 1916800
14580 1916800 1288906 1339942 1637049 1947858 1713253 1395341 1792585 1782023 1752865 1862693
14570 1862693 1603271 1641847 2088070 1987096 2117260 2034322 1899482 1813149 1998463 1598772
14560 1598772 2259790 1671480 2077761 1949241 2153419 2331655 2249941 2299496 2040347 2030897
14550 2030897 2547930 2478950 2446692 2280512 2581865 2409846 2628255 3024692 3222443 2965718
14540 2965718 3218837 3486447 4073271 4451902 5145311 6415272 8062065 11027409 16602226
$$ packed form
14610A508470l53732L20560l31216J57944k46791M40366J0377J55107N5997R70
14600A718052j73238l66708J56829r3233j28489L69847j79939M9822J05963J89904
14590A648810m21393L06306O705n5629j20227m9378L89267l16352M56140P2551
14580A916800o27894N1036K97107L10809k34605l17912L97244j0562k9158J09828
14570A862693k59422L8576M46223j00974J30164q2938j34840q6333J85314l99691
14560A598772O61018n88310M06281j28520K04178J78236q1714M9555k59149r450
14550B030897N17033o8980l2258j66180L01353j72019K18409L96437J97751k56725
14540B965718K53119K67610N86824L78631O93409J269961J646793K965344N574817
$$ plain form
14531 16602226 26160042 31512274 21664031 14867231 10951255 7508807 6139700 4857122
14523 4857122 4288288 3813252 3234512 3245458 3203142 2627875 2905978 2571240 2815197 2517531
14513 2517531 2850867 2724380 2648843 2357974 2350097 2434896 2472923 2545349 2679042 2608936 2216757
14502 2216757 2423338 2397088 2753118 3075231 3006932 2695237 2442758 2638403 2916117 2840963
14492 2840963 3061120 2958960 3050660 2919610 3024452 2828872 3095901 3195690 3134859 3195797
14482 3195797 3037012 3096628 3001986 2834019 3249574 3350114 2948241 3542707 3418950 3391368
14472 3391368 3638650 3503418 3662843 3328674 3759664 3724247 3732453 4080336 3889628 3667612
14462 3667612 3748768 3954287 3717211 4265660 3885446 4203750 4233966 4481609 4338561 4642170
$$ packed form
14531A6602226R557816N352232r848243o796800l915976l442448j369107j282578
14523D857122n68834m75036n78740J0946m2316n75267K78103l34738K43957k97666
14513B517531L33336j26487p5537k90869p877Q4799L8027P2426J33693p0106l92179
14502B216757K06581k6250L56030L22113o8299l11695k52479J95645K77714p5154
14492B840963K20157j02160R1700j31050J04842j95580K67029R9789o0831O0938
14482C195797j58785N9616r4642j67967M15555J00540m01873N94466j23757k7582
14472C391368K47282j35232J59425l34169M30990l5417Q206L47883j90708k22016
14462C667612Q1156K05519k37076N48449l80214L18304L0216K47643j43048L03609
$$ plain form
14452 4642170 4423024 4501050 4804456 4597526 4662475 4689317 4605436 4654437 5191620 4869567
14442 4869567 5059624 5120622 5059857 5225982 5390573 5063152 5384907 5504114 5423229 5623880
14432 5623880 5747464 5352626 5639693 6092968 5789490 6050974 5741290 6238928 6521607
14423 6521607 6497907 6373127 6139777 6410847 6515522 6428850 6513700 6506730 6803412 6970692
14413 6970692 6833718 6736083 7425691 7139589 7609720 7554367 7666936 7788815 7914710 8115042
14403 8115042 7980236 8243501 8127560 8521878 8386731 8494159 8908738 9303007 8978719
14394 8978719 8929949 9377053 9334793 9896564 9798331 9948247 10202996 10399334 10206849 10497935
14384 10497935 10774949 10846388 11137191 11200598 11338777 11663168 11905146 12102052 11928968 12269071
$$ packed form
14452D642170k19146P8026L03406k06930O4949K6842q3881M9001N37183l22053
14442D869567J90057O0998o0765J66125J64591l27421L21755J19207q0885K00651
14432E623880J23584l94838K87067M53275l03478K61484l09684M97638K82679
14423F521607k3700j24780k33350K71070J04675q6672Q4850o970K96682J67280
14413F970692j36974r7635O89608k86102M70131n5353J12569J21879J25895K00332
14403H115042j34806K63265j15941L94318j35147J07428M14579L94269l24288
14394H978719m8770M47104m2260N61771r8233J49916K54749J96338j92485K91086
14384A0497935K77014P1439K90803O3407J38179L24391K41978J96906j73084L40103
$$ plain form
14374 12269071 12591111 12716330 13197838 12911128 13439530 13459103 13686595 13838823 14349353
14365 14349353 14840836 14811851 15217899 15731885 15865884 16298257 16337803 16749031 17086048 17312680
14355 17312680 17642610 17687643 18501670 18683169 19123537 19503326 20076950 20396427 21003541
14346 21003541 21323622 21735552 22413583 22770780 23222880 23746133 24243670 24934061 25476213
14337 25476213 26327679 26606534 27731732 28281696 28853932 29649967 30299320 31258107 31926458
14328 31926458 32873076 33943103 34802895 35435426 36663934 37666121 38872902 39818433 40722074
14319 40722074 41657409 43514297 44591743 46268315 47478348 49110696 50847611 52286804
14311 52286804 54208735 55783120 57705470 59712356 61825613 63965725 66056755 68469515
$$ packed form
14374A2269071L22040J25219M81508k86710N28402J9573K27492J52228N10530
14365A4349353M91483k8985M06048N13986J33999M32373L9546M11228L37017K26632
14355A7312680L29930M5033Q14027J81499M40368L79789N73624L19477O07114
14346B1003541L20081M11930O78031L57197M52100N23253M97537O90391N42152
14337B5476213Q51466K78855J125198N49964N72236P96035O49353R58787O68351
14328C1926458R46618J070027Q59792O32531J228508J002187J206781R45531R03641
14319D0722074R35335J856888J077446J676572J210033J632348J736915J439193
14311E2286804J921931J574385J922350K006886K113257K140112K091030K412760
$$ plain form
14303 68469515 70983447 73576954 76654826 79262358 82678302 85843770 89225218 92728258
14295 92728258 97004299 100953060 105380430 109849821 114608408 120207759 125887929 131717493
14287 131717493 137584024 144299879 151524582 159031673 166815648 175182505 183960439 193158256
14279 193158256 203652604 214299775 225511013 237202494 249734914 263172242 276863781
14272 276863781 291360910 306399906 322073017 337896333 354321074 371019450 387399878
14265 387399878 403349009 417213089 428539752 437330567 444601783 451409990 457413568
14258 457413568 462038204 464320576 464079269 462230933 455950665 442277027 433002426 424395175
14250 424395175 415259292 402684374 390503075 379944910 368736202 358336519 346895026
$$ packed form
14303F8469515K513932K593507L077872K607532L415944L165468L381448L503040
14295I2728258M276041L948761M427370M469391M758587N599351N680170N829564
14287A31717493N866531O715855P224703P507091P783975Q366857Q777934R197817
14279A93158256J0494348J0647171J1211238J1691481J2532420J3437328J3691539
14272B76863781J4497129J5038996J5673111J5823316J6424741J6698376J6380428
14265C87399878J5949131J3864080J1326663Q790815P271216O808207O003578
14258D57413568M624636K282372k41307j848336o280268j3673638r274601q607251
14250D24395175r135883j2574918j2181299j0558165j1208708j0399683j1441493
$$ plain form
14243 346895026 336545486 325276708 313239097 300735737 289923039 278579262 266425047
14236 266425047 255513510 244303305 233448671 223552513 213870798 204612478 195099438
14229 195099438 185754240 176609200 168287243 159765386 152164300 145176637 138953980 132769161
14221 132769161 126996071 121618282 116621511 111659437 107211604 102707812 98460487 94692907
14213 94692907 90745219 87104330 83940825 80584785 77541599 74962488 71494483 69254679
14205 69254679 66889546 64776446 62493070 59951909 58336370 56350909 54760647 53075000
14197 53075000 50984855 49810175 48132662 46796427 45291201 44178476 42969533 41806398
14189 41806398 40224088 39088513 38136618 37178726 36367663 35252320 34178461 33284186 32646023
$$ packed form
14243C46895026j0349540j1268778j2037611j2503360j0812698j1343777j2154215
14236B66425047j0911537j1210205j0854634r896158r681715r258320r513040
14229A95099438r345198r145040q321957q521857p601086o987663o222657o184819
14221A32769161n773090n377789m996771m962074m447833m503792m247325l767580
14213I4692907l947688l640889l163505l356040l043186k579111l468005k239804
14205F9254679k365133k113100k283376k541161j615539j985461j590262j685647
14197E3075000k090145j174680j677513j336235j505226j112725j208943j163135
14189D1806398j582310j135575r51895r57892q11063j115343j073859q94275o38163
$$ plain form
14180 32646023 31286316 31128977 30317131 29470108 28643694 28139712 27226370 26989001 26381471
14171 26381471 25305378 24840675 24607498 23859604 23471961 22870561 22041737 21975335 21445453
14162 21445453 20921383 20584622 20038427 19666177 19404921 18963413 18444726 18135796 18023920
14153 18023920 17483932 17172677 17115222 16187479 16245949 15808960 15731459 15414016 15039835 14893663
14143 14893663 14569028 14112593 14058861 13819272 13439242 13546751 13043732 12978302 12624982 12281280
14133 12281280 12165474 12001055 11917345 11595646 11165302 11141420 11159159 10931287 10798021 10731436
14123 10731436 10256204 10247848 10183279 9967048 9882790 9443252 9871508 9202939 9261734 9255358
14113 9255358 8866815 9074382 8562314 8779266 8902452 8552227 8334553 8111242 8243228
$$ packed form
14180C2646023j359707j57339q11846q47023q26414n03982r13342k37369o07530
14171B6381471j076093m64703k33177p47894l87643o01400q28824o6402n29882
14162B1445453n24070l36761n46195l72250k61256m41508n18687l08930j11876
14153A8023920n39988l11255n7455r27743N8470m36989p7501l17443l74181j46172
14143A4893663l24635m56435n3732k39589l80030J07509n03019o5430l53320l43702
14133A2281280j15806j64419q3710l21699m30344k3882J7739k27872j33266o6585
14123A0731436m75232q356o4569k16231q4258m39538M28256o68569N8795o376
14113I255358l88543K07567n12068K16952J23186l50225k17674k23311J31986
$$ plain form
14104 8243228 8081727 7496346 7763162 7642803 7915970 7550503 7234352 7231931 7128236 6719747
14094 6719747 6884113 6800299 6534270 6533056 6603957 6606648 6491953 6211971 6214563 6413966 6172021
14083 6172021 5840311 5986804 5851719 5879667 5570286 5830301 5983535 5569964 5849158 5524966
14073 5524966 5490699 5486667 5245670 5450612 5213419 4968539 5194249 4962259 5088673 5060757
14063 5060757 4930012 4683099 4771780 4839307 4747450 4649438 4389673 4554881 4371012 4336966
14053 4336966 4219864 4607854 4399785 4253099 4237000 4399822 4007632 4144237 4160737 4205480
14043 4205480 4204040 3925883 4099455 4089677 4139160 4076986 3823979 4221217 3771481 3600015
14033 3600015 3902973 3577698 3551499 3771184 3592921 3519615 3402169 3604269 3559108 3311000
$$ packed form
14104H243228j61501n85381K66816j20359K73167l65467l16151k421j03695m08489
14094F719747J64366q3814k66029j214P0901K691j14695k79982K592J99403k41945
14083F172021l31710J46493j35085K7948l09381K60015J53234m13571K79194l24192
14073E524966l4267m032k40997K04942k37193k44880K25710k31990J26414k7916
14063E060757j30745k46913Q8681O7527r1857r8012k59765J65208j83869l4046
14053D336966j17102L87990k08069j46686j6099J62822l92190J36605J6500M4743
14043D205480j440k78157J73572r778M9483o2174k53007L97238m49736j71466
14033C600015L02958l25275k6199K19685j78263p3306j17446K02100m5161k48108
$$ plain form
14023 3311000 3193662 3631184 3712381 3533204 3048302 3324844 3213237 3228283 3158680 3197146
14013 3197146 3068628 3031264 3207331 3111957 2925764 2711999 3187705 3014105 2640620 2683757
14003 2683757 2960863 2508638 2763400 2569784 2633536 2802102 2625641 2422958 2734630 2412937
13993 2412937 2683527 2578324 2652674 2335918 2318063 2721390 2302966 2028313 2116317 2389989
13983 2389989 2371641 2277787 2510365 2528864 2672541 2602210 2806785 3461382 3843079 4829434
13973 4829434 6889139 11546025 20893893 30481691 22756898 16371366 12654312 9470339
13965 9470339 7736241 6690664 5755954 5062172 4787698 4201633 3953028 3538510 3499416
13956 3499416 3494333 3049280 3044425 2871356 2979202 2746029 2729191 2805418 2265894 2430505
$$ packed form
14023C311000j17338M37522Q1197j79177m84902K76542j11607J5046o9603L8466
14013C197146j28518l7364J76067r5374j86193k13765M75706j73600l73485M3137
14003B683757K77106m52225K54762j93616O3752J68566j76461k02683L11672l21693
13993B412937K70590j05203P4350l16756j7855M03327m18424k74653Q8004K73672
13983B389989j8348r3854K32578J8499J43677p0331K04575O54597L81697R86355
13973D829434K059705M656886R347868R587798p724793o385532l717054l183973
13965I470339j734098j045577r34710o93782k74474n86065k48605m14518l9094
13956C499416n083m45053m855j73069J07846k33173j6838P6227n39524J64611
$$ plain form
13946 2430505 2440317 2705898 2521187 2458859 2298927 1910156 2415975 2250396 1906799 2214328
13936 2214328 1913838 2130076 1932711 2174507 2087473 2065168 2364567 2007859 1679911 1951062
13926 1951062 2447757 2027975 1747610 1962128 1884101 1911501 2140690 1948322 1869617 2035391
13916 2035391 1768735 1801371 1980877 1722763 1954595 1731815 1999936 1731904 2202872 1390964
13906 1390964 1617044 1740141 1529228 1691111 1380509 1751660 1657687 1601133 1622086 1584937
13896 1584937 1711637 1464017 1482560 1591595 1586050 1523549 1506677 1596324 1500770 1742647 1530620
13885 1530620 1613071 1019149 1685798 1545295 1535388 1315542 1572926 1337674 1539783 1430203
13875 1430203 1521726 1258187 1285374 1673917 1488237 1043363 1219573 1034373 1286347 1493766
$$ packed form
13946B430505R812K65581j84711o2328j59932l88771N05819j65579l43597L07529
13936B214328l00490K16238j97365K41796q7034k2305K99399l56708l27948K71151
13926A951062M96695m19782k80365K14518p8027K7400K29189j92368p8705J65774
13916B035391k66656L2636J79506k58114K31832k22780K68121k68032M70968q11908
13906A390964K26080J23097k10913J61883l10602L71151r3973n6554K0953l7149
13896A584937J26700k47620J8543J09035n545o2501j6872Q9647r5554K41877k12027
13885A530620Q2451n93922O66649j40503r907k19846K57384k35252K02109j09580
13875A430203R1523k63539K7187L88543j85680m44874J76210j85200K51974K07419
$$ plain form
13865 1493766 1337261 1400940 1236850 983268 1349124 1257579 1299450 1113816 1366930 1200438
13855 1200438 1200644 1001368 1336711 1328238 1205746 1242841 1193976 1140262 1384674 1304445 1108374
13844 1108374 992409 1125752 1241190 1366942 1149416 1281696 1393212 1097630 1029592 988476
13834 988476 956643 1092800 1048126 1289406 1089142 1033879 1252987 999143 1177835 1035932
13824 1035932 1351099 942170 895136 1078571 1007031 1178163 1004994 807212 931187 784902
13814 784902 852114 769740 958433 1003808 642304 926863 1196109 1356460 1048966 915374
13804 915374 985541 757004 885775 1057011 864817 805677 835541 860417 936312 917350 639684
13793 639684 1006504 742564 739633 742193 970440 1065373 974889 1002681 812049 1076294 876019
$$ packed form
13865A493766j56505O3679j64090k53582L65856r1545M1871j85634K53114j66492
13855A200438K06j99276L35343q473j22492L7095m8865n3714K44412q0229j96071
13844A108374j15965J33343J15438J25752k17526J32280J11516k95582o8038m1116
13834I88476l1833J36157m4674K41280k00264n5263K19108k53844J78692j41903
13824A035932L15167m08929m7034J83435p1540J71132j73169j97782J23975j46285
13814G84902O7212q2374J88693M5375l61504K84559K69246J60351l07494j33592
13804I15374P0167k28537J28771J71236j92194n9140K9864K4876P5895j8962k77666
13793F39684L66820k63940k931K560K28247R4933r0484K7792j90632K64245k00275
$$ plain form
13782 876019 680043 908543 547210 858300 913948 537899 690523 789198 754802 681135
13772 681135 905525 908449 1098187 675395 799360 1125400 1075753 711676 736195 991897
13762 991897 812959 511042 560655 742909 883298 849807 639321 612343 696236 973317
13752 973317 948473 750235 858348 803218 847654 682141 802960 649116 388032 706483
13742 706483 728269 919988 668135 1130968 843763 595873 1076837 466447 813795 646504
13732 646504 586246 766593 551401 563136 397735 554410 721533 886849 699785 595535
13722 595535 781064 697053 746512 768015 587184 608761 777439 725508 919582 846992 422279
13710 611752 946203 827079 283750 629955 689492 502584 389271 949196 696298 977261
$$ packed form
13782H76019j95976K28500l61333L11090N5648l76049J52624R8675l4396p3667
13772F81135K24390K924J89738m22792J23965L26040m9647l64077K4519K55702
13762I91897j78938l01917M9613J82254J40389l3491k10486k6978Q3893K77081
13752I73317k4844j98238J08113n5130M4436j65513J20819j53844k61084L18451
13742G06483K1786J91719k51853M62833k87205k47890M80964D66447L47348j67291
13732F46504o0258J80347k15192J1735j65401J56675J67123J65316j87064j04250
13722E95535J85529q4011M9459K1503j80831K1577J68678n1931J94074p2590D22279
13710F11752L34451j19124B83750L46205N9537j86908j13313N59925k52898K80963
$$ plain form
13700 977261 437653 293471 448258 777004 456789 289690 308535 225078 750307 578136
13690 578136 666058 413817 394865 514253 589339 456569 375965 650836 264080 676263
13680 676263 612704 625200 221103 566131 648142 679851 376178 493192 577160 608213 509464
13669 509464 688641 627679 298638 605399 583760 551968 524082 765602 753510 417550
13659 417550 451250 548583 638425 766206 302849 588673 537174 277404 271514 264148 523548
13648 523548 445677 616267 566851 251805 528124 199266 421884 378569 385208 666846
13638 666846 518037 728864 485557 380362 442633 505990 90075 453343 339074 517135
13628 517135 578426 388927 869367 644148 696839 589027 320136 622994 370562 422143
$$ packed form
13700I77261D37653j44182J54787L28746l20215j67099J8845q3457N25229j72171
13690E78136Q7922k52241j8952J19388P5086j32770q0604K74871B64080M12183
13680F76263o3559J2496B21103L45028Q2011L1709l03673J17014Q3968L1053r8749
13669E09464J79177o0962B98638L06761k1639l1792k7886K41520j2092l35960
13659D17550L3700R7333Q9842J27781C02849K85824n1499k59770n890p366K59400
13648E23548p7871J70590m9416B51805K76319A99266K22618m3315O639K81638
13638F66846j48809K10827k43307j05195O2271O3357I0075L63268j14269J78061
13628E17135O1291j89499M80440k25219N2691j07812k68891L02858k52432N1581
$$ plain form
13618 422143 517759 216851 249249 398603 704001 548724 449354 227640 323476 360911
13608 360911 495466 464280 238680 400991 437125 242079 543557 634678 237733 497383
13598 497383 440499 395383 430018 53830 541647 380060 377842 433728 323655 441885 420223
13587 420223 552926 552457 549118 231120 436123 526744 498800 256623 735396 320173 635299
13576 635299 507392 262883 426128 484498 260776 508043 240726 335483 317799 306035
13566 306035 328671 80142 702731 458294 155652 330547 283161 193181 451675 514858
13556 514858 321791 357596 419994 264034 377703 315005 421105 550548 286212 625102
13546 625102 122475 344937 409820 142946 337739 382509 462503 641064 246420 428358
$$ packed form
13618D22143R5616B16851L2398J49354L05398j55277r9370k21714R5836L7435
13608C60911J34555l1186k25600J62311L6134j95046L01478R1121B37733K59650
13598D97383n6884m5116L4635E3830M87817j61587k218N5886j10073J18230k1662
13587D20223J32703m69l339B31120K05003R0621k7944k42177M78773C20173L15126
13576F35299j27907k44509J63245N8370k23722K47267B40726R4757j7684j1764
13566C06035K2636H0142O22589k44437A55652J74895m7386q9980K58494O3183
13556E14858j93067L5805O2398j55960J13669o2698J06100J29443k64336L38890
13546F25102A22475K22462O4883A42946J94793M4770P9994J78561B46420J81938
$$ plain form
13536 428358 600165 478036 517424 288650 187755 536762 35370 129593 184637 416441
13526 416441 293894 231303 637013 211894 460047 238326 554557 277422 184390 421343
13516 421343 690970 165064 312136 139688 191722 157059 472281 231452 632479 10698
13505 142302 373979 459628 288603 237530 266918 352977 401578 235291 449774 379852 540271
13494 540271 356642 -52160 472472 472937 63391 161508 415111 142881 591913 253194 88890
13482 404873 366659 136500 209449 517132 208561 402438 261530 382675 339843 448097
13472 448097 312442 21153 497183 214291 297812 521817 178391 156882 344413 23214
13461 300759 443150 227483 454309 342415 571858 249431 503285 311193 462010 295443
$$ packed form
13536D28358J71807j22129L9388k28774j00895L49007C5370R4223N5044K31804
13526D16441j22547o2591M05710B11894K48153k21721L16231k77135r3032K36953
13516D21343K69627A65064J47072A39688N2034l4663L15222B31452M01027A0698
13505A42302K31677Q5649j71025n1073K9388Q6059M8601j66287K14483o9922J60419
13494E40271j83629e2160D72472M65F3391R8117K53603A42881M49032B53194H8890
13482D04873l8214A36500P2949L07683B08561J93877j40908J21145m2832J08254
13472D48097j35655B1153M76030B14291Q3521K24005A78391k1509J87531B3214
13461C00759J42391k15667K26826j11894K29443B49431K53854j92092J50817j66567
$$ plain form
13451 295443 113476 405565 203927 279154 377681 221396 24665 380235 217721 154404
13441 154404 417480 392632 389414 527063 316494 405971 545974 203310 254712 399136
13431 399136 102995 425272 253030 151206 83305 63909 441965 491078 -105012 232551
13420 -187787 -62976 -31301 372746 437260 342456 193182 -48246 280407 331395 448025 63863
13408 145118 611338 161617 352239 540955 387711 200741 321956 -174648 352352 229996
13398 229996 -3942 68397 210117 328964 -9494 336674 95841 17915 414654 120141 147847
13387 147847 80636 261993 69800 16599 121641 1891 520460 376305 359755 214084 451253
13376 451253 -130505 141225 94660 355770 122155 58726 367057 213572 164050 399815
$$ packed form
13451B95443A13476K92089k01638P5227R8527j56285B4665L55570j62514o3317
13441A54404K63076k4848l218J37649k10569Q9477J40003B03310N1402J44424
13431C99136A02995L22277j72242j01824o7901j9396L78056M9113a05012B32551
13420a87787f2976c1301C72746O4514r4804j49274d8246B80407N0988J16630F3863
13408A45118M66220A61617J90622J88716j53244j86970J21215a74648C52352j22356
13398B29996c942F8397J41720J18847i494C36674I5841A7915L96739A20141K7706
13387A47847o7211J81357F9800A6599J05042A891N18569j44155j6550j45671K37169
13376D51253a30505A41225m6565K61110A22155E8726L08331j53485m9522K35765
$$ plain form
13366 399815 76213 152033 275094 227643 171428 153215 250357 256843 -1160 180368 79230
13354 248824 348337 382616 265453 454064 328048 99031 169675 4971 220817 -123003 132028
13342 36043 75362 185861 384280 -69203 95616 277098 331901 146164 352486 10412 196652
13331 196652 80160 650399 339300 293142 521580 350262 447853 101654 314598 24654
13320 525242 165334 132074 314463 238121 235395 568382 235639 135189 617716 137209
13309 139140 109573 248136 344383 650360 86152 -62315 245083 157587 313807 214787 132213
13298 132213 186148 -114265 346095 464153 -36430 137663 117024 319555 118017 393620
13288 393620 357993 228801 232642 185129 409127 119491 405972 106731 451342 -109550
$$ packed form
13366C99815G6213P5820J23061m7451n6215j8213R7142O486a160A80368G9230
13354B48824R9513L4279j17163J88611j26016I9031P0644D971K15846a23003A32028
13342C6043L9319J10499J98419f9203I5616J81482N4803A46164K06322A0412J86240
13331A96652H0160N70239l11099m6158K28438j71318R7591A01654K12944B4654
13320E25242A65334l3260J82389p6342k726L32987B35639j00450M82527A37209
13309A39140k9567J38563R6247L05977H6152f2315B45083q7496J56220r9020q2574
13298A32213N3935a14265C46095J18058c6430A37663k0639K02531A18017K75603
13288C93620l5627j29192L841m7513K23998A19491K86481A06731L44611a09550
$$ plain form
13277 354550 213311 437086 207973 278480 358842 -50866 -120476 126269 365848 177078
13266 -54481 248187 345574 273168 297922 29266 41234 27616 285198 143236 305498 251683
13255 251683 128848 41996 54439 248609 -120283 202182 276486 192347 458955 46041
13244 -127199 177054 -54513 54865 208624 430455 11597 373987 169895 461907 109410
13233 256408 326199 55808 203773 378431 -44660 77169 73127 255701 56919 -100721 145041
13221 -120306 180378 102260 454017 269800 154394 54367 55435 449635 52166 -63042 151160
13209 -19480 141948 57547 42387 -28018 -203051 111988 255359 211235 324286 -4614 164266
13197 217922 373676 140005 142581 185867 -12131 130285 -170999 135693 324946 93037
$$ packed form
13277C54550j41239K23775B07973P0507Q0362e0866o9610A26269K39579A77078
13266e4481B48187R7387p2406K4754B9266J1968j3618K57582j41962J62262n3815
13255B51683j22835D1996J2443J94170a20283B02182P4304q4139K66608D6041
13244a27199A77054e4513E4865J53759K21831A1597L62390A69895K92012A09410
13233B56408O9791E5808J47965J74658d4660G7169m042J82574E6919a00721A45041
13221a20306A80378p8118L51757j84217j15406E4367J068L94200E2166f3042A51160
13209a9480A41948E7547j5160b8018j75033A11988J43371m4124J13051d614A64266
13197B17922J55754A40005K576M3286a2131A30285a70999A35693J89253I3037
$$ plain form
13186 285377 343483 224690 -268608 -209886 217437 165355 76484 283176 290412 154850 14274
13174 98088 392004 226499 194930 -157919 128891 280422 41661 -268371 -144692 31878
13163 183549 534686 304 -95930 -11581 170568 -54925 86260 139221 -136520 263124 234919
13152 234919 -67952 46127 -54803 -220674 45152 159393 165867 72927 155054 34118 20686
13141 20686 139548 -98640 223157 61272 255055 232609 370593 -194553 54971 106618 93646
13130 93646 -178217 167805 136995 247652 141537 158164 73123 -138281 103400 604235
13120 604235 116698 310 84571 79918 -150906 319503 -91367 -53094 -141412 395187 129056
13108 61364 336037 -71715 -27259 -183258 -62874 346674 -35925 -242131 328288 248693 274849
$$ packed form
13186B85377N8106j18793b68608N8722B17437n2082G6484K06692P236j35562A4274
13174I8088K93916j65505l1569a57919A28891J51531D1661b68371J23679C1878
13163A83549L51137C04i5930a1581A70568e4925H6260N2961a36520B63124k8205
13152B34919f7952D6127e4803j65871D5152J14241O474G2927Q2127C4118j3432
13141B0686J18862i8640B23157F1272J93783k2446J37984a94553E4971N1647j2972
13130I3646a78217A67805l0810J10657j06115J6627G3123a38281A03400N00835
13120F04235A16698C10Q4261m653a50906C19503i1367L8273q8318C95187A29056
13108F1364K74673g1715b7259j55999f2874C46674c5925k06206C28288p9595K6156
$$ plain form
13097 274849 -230802 250750 50278 208206 306614 -33483 -151049 -54625 109713 209663
13087 209663 142720 -210690 116940 505173 70185 26754 233569 85302 -88941 -26459 5816
13075 -73266 229867 -60389 -203377 199432 7734 22336 -141332 62279 228141 -353077 -22057
13063 105665 67736 434812 -12137 42027 -54186 183965 41914 367559 202649 192906 -186853
13051 93114 453744 176748 293571 75005 180258 117214 -119492 238105 -57424 -57749 61757
13039 -73265 459594 51501 -8935 53841 12633 67065 87271 -184177 269863 7386 36855
13028 36855 351267 79896 310666 255594 89027 241760 168303 298345 251441 91732 165075
13017 165075 124375 238334 -74168 -37026 58445 202820 61868 687970 -30830 -8560 233100
$$ packed form
13097B74849b30802B50750E0278J57928R8408c3483j17566e4625A09713R9950
13087B09663o6943b10690A16940L88233G0185B6754K06815H5302h8941b6459E816
13075g3266B29867f0389j42988A99432G734J4602a41332F2279J65862c53077b2057
13063A05665l7929L67076a2137D2027e4186A83965D1914L25645j64910r743a86853
13051I3114L60630A76748J16823G5005J05253o3044a19492B38105e7424l25F1757
13039g3265D59594E1501h935E3841A2633N4432K0206a84177B69863G386K9469
13028C6855L14412G9896K30770n5072H9027J52733p3457J30042m6904I1732P3343
13017A65075m0700J13959g4168c7026E8445J44375F1868O26102c0830h560B33100
$$ plain form
13005 -232836 -202256 97552 15263 63885 247899 -21095 -74997 350496 -6604 81361 191953
12994 191953 -102119 -13501 102502 -168125 18738 90392 -63982 -40469 478731 257445
12984 257445 241192 -88580 235520 244307 -62488 14733 164066 302302 52993 63867 70377
12973 70377 74027 290550 114637 170645 368642 227658 -139912 69548 -142132 458245
12962 301529 185283 70643 341544 -66238 236710 286275 214364 123745 436805 58512 23819
12950 -24908 -34016 203339 89049 204620 -22134 276583 59144 98927 236994 13943 91497
12939 91497 182766 -127798 438699 -228607 -8591 175097 -85431 19718 -223803 431998 -10510
12927 -22915 103374 -118030 184757 -191295 249415 -99346 -37540 -52017 -406894 -148576
$$ packed form
13005b32836L0580I7552A5263M8622J84014b1095n3902C50496f604H1361J10592
12994A91953a02119a3501A02502a68125A8738P1654f3982K3513D78731k21286
12984B57445j6253h8580B35520Q787f2488A4733J49333J38236E2993J0874O510
12973G0377L650K16523A14637N6008J97997j40984a39912F9548a42132D58245
12962C01529j16246G0643K70901f6238B36710M9565p1911r0619L13060E8512B3819
12950b4908r108B03339H9049J15571b2134B76583E9144L9783J38067A3943P7554
12939I1497R1269a27798D38699b28607h591A75097h5431A9718b23803D31998a0510
12927b2915A03374a18030A84757a91295B49415i9346c7540j4477l54877a48576
$$ plain form
12916 168240 -113700 -287491 -145225 32784 418777 178545 296296 -142436 43442 -13414
12905 363727 -55505 31791 233935 200228 282308 -167913 42799 31079 14790 274683 345506
12894 345506 20126 -182780 -91663 271222 -264044 -249313 124894 185600 181996 -349794 -154112
12882 -10137 250631 -121749 -82112 193192 -12784 11272 -39555 -226174 -254614 197 200409
12871 200409 -223570 21958 286108 150907 -178549 97915 174652 -111800 417187 186888
12860 196968 274021 -27599 -44902 99008 -195658 76626 157460 15918 27104 24877 8215 -1531
12847 -114790 140888 -104965 46168 -130283 -171657 -9613 -258379 -46984 -20132 -87535 214064
12835 185613 -240341 57197 -57742 -157695 124015 -53406 40950 -16699 22847 -22465 163911
$$ packed form
12916A68240a13700j73791J42266C2784L85993A78545J17751a42436D3442a3414
12905C63727e5505C1791K02144l3707Q2080a67913D2799j1720A4790K59893P0823
12894C45506B0126a82780R1117B71222b64044J4731A24894O0706l604c49794a54112
12882a0137B50631a21749L9637A93192a2784A1272c9555j86619k8440A97K00212
12871B00409b23570B1958K64150j35201a78549I7915P6737a11800D17187A86888
12860A96968P7053b7599j7303I9008a95658G6626Q0834A5918J1186k227H215a531
12847a14790A40888a04965D6168a30283m1374i613k48766d6984b0132o7403B14064
12835A85613b40341E7197e7742r9953A24015e3406D0950a6699B2847b2465A63911
$$ plain form
12823 -131052 158193 19011 178450 -66521 50121 -124102 -288135 106340 126432 55138
12812 -97499 323638 319213 137891 253375 196169 -242575 -146085 63662 -112848 157776 -71425
12800 -108552 145433 -162104 158549 164188 132557 51173 -24176 -210614 -160098 237775 1312
12788 -237134 189508 -67884 -64017 -17298 577125 67323 -93136 -50690 -126847 114785 5511
12776 23399 123882 -68880 72031 165276 27127 125375 -9638 276672 24100 -42027 -107151
12765 -107151 215992 -374891 -224632 246500 90918 249892 -168853 -242570 64285 80517
12755 80517 242449 -19420 -301196 244633 188344 -92769 91245 112542 1566 -176991 -98337
12744 -98337 139700 337031 -69085 174930 67873 -42008 24936 48940 -249260 31939 -83828
$$ packed form
12823a31052A58193A9011J59439f6521E0121a24102j64033A06340K0092E5138
12812i7499C23638m425A37891J15484n7206b42575R6490F3662a12848A57776g1425
12800a08552A45433a62104A58549N639l1631E1173b4176j86438N0516B37775A312
12788b37134A89508f7884L867a7298E77125F7323i3136M2446p6157A14785E511
12776B3399J00483f8880G2031R3245B7127R8248i638B76672B4100d2027o5124
12765a07151B15992c74891J50259B46500I0918J58974a68853p3717F4285J6232
12755H0517J61932a9420k81776B44633n6289i2769I1245K1297A566a76991P8654
12744i8337A39700J97331f9085A74930F7873d2008B4936K4004b49260C1939h3828
$$ plain form
12732 272888 49069 232803 -295876 212187 -54444 -90069 95788 -118826 -191578 -168980 168808
12720 136280 -129041 158613 128976 -9378 385742 115811 204751 -111788 109004 36918
12709 -205668 256170 101464 53757 117917 -115959 -209293 -82835 117841 32197 150118
12699 150118 202951 -328208 -84890 122548 252528 -84375 10686 -57182 308945 7664 417122
12688 417122 349854 228506 68871 -150793 157425 212029 -121752 371126 40948 -104186
12677 237199 171983 308437 315218 -304481 236153 -88292 396956 269665 129380 -53956
12666 187223 -137520 -63033 -45454 453164 328258 39064 -42617 -164189 125589 -135417
12655 254449 113140 200480 89531 -22686 -53613 71337 -93679 -51713 369629 233867 91936
$$ packed form
12732B72888D9069J83734b95876B12187e4444l5625I5788a18826p2752K2598A68808
12720A36280a29041A58613k9637i378C85742A15811Q8940a11788A09004C6918
12709b05668B56170A01464m7707O4160a15959r3334h2835A17841C2197J17921
12699A50118N2833c28208h4890A22548J29980h4375A0686e7182C08945G664M09458
12688D17122o7268j21348F8871a50793A57425N4604a21752C71126D0948a04186
12677B37199o5216J36454O781c04481B36153h8292C96956j27291A29380e3956
12666A87223a37520f3033J7579D53164j24906C9064d2617j21572A25589a35417
12655B54449A13140Q7340H9531b2686l0927G1337i3679M1966C69629j35762I1936
$$ plain form
12643 -30142 104410 329706 -133066 11056 -50867 94005 166846 118633 20517 -124510 168141
12631 146865 -253487 190411 3265 345437 28715 92035 212029 77385 228986 16463 180468
12620 180468 -131610 67649 324560 -217929 -48184 107414 -97844 141183 378290 263488
12610 263488 140327 198909 63683 -191161 418088 208607 393558 250857 172290 -70832
12599 256303 -227606 221741 149127 -64779 256128 42732 -40417 107821 125404 -339506
12588 291516 375158 165437 143815 269999 158479 81365 154769 288788 -158275 81033
12577 -95840 36566 249348 -55854 168463 88655 -55621 -37504 -44458 -101942 269 -274638 185534
12564 -309169 59739 63135 79873 39177 -163762 -214638 -273166 -338221 -95623 166378 -9280
$$ packed form
12643c0142A04410K25296a33066A1056e0867I4005P2841m8213B0517a24510A68141
12631A46865b53487A90411C265L42172B8715O3320J19994G7385J51601A6463J64005
12620A80468a31610F7649K56911b17929d8184A07414i7844A41183K37107j14802
12610B63488j23161N8582F3683a91161D18088B08607J84951j42701p8567g0832
12599B56303b27606B21741p2614f4779B56128D2732d0417A07821J7583c39506
12588B91516Q3642A65437k1622J26184j11520p7114P3404J34019a58275H1033
12577i5840C6566K12782e5854A68463p9808e5621J8117o954n7484B69b74638A85534
12564c09169E9739L396J6738C9177a63762n0876n8528o5055i5623A66378i280
$$ plain form
12552 -32864 51844 -171354 262928 176232 240917 -26067 -26540 24935 -6832 -192181 -17922 -40801
12540 -40801 -199657 -94016 -62510 -94592 -137260 93998 109033 -123232 132296 -207619 -165181
12529 -165181 127800 278820 -211915 21123 -32975 502499 250793 -2946 128910 -156266
12518 174388 -165886 -16009 284012 84146 204494 178603 188802 111638 -102999 325585
12507 -285958 61858 -347872 -8178 -92070 -28072 10179 426187 29253 344017 161649 189160
12496 189160 -181181 180912 28950 -159573 -213012 -25684 370911 94515 -28120 127707
12485 39715 88966 -87949 103083 -70555 379673 -113952 -71508 -33221 199087 -37210 -165376
12474 -165376 135061 297331 -162171 137078 -292020 37643 -28950 11438 71565 -66161
$$ packed form
12552c2864E1844a71354B62928q6696O4685b6067m73B4935f832j85349a7922k2879
12540d0801j58856i4016L1506l2082m2668I3998J5035a23232A32296b07619M2438
12529a65181A27800J51020b11915B1123c2975E02499B50793b946A28910a56266
12518A74388a65886a6009B84012H4146J20348k5891J0199p7164a02999C25585
12507b85958F1858c47872h178q3892b8072A0179M16008B9253L14764A61649K7511
12496A89160a81181A80912B8950a59573n3439b5684C70911I4515b8120A27707
12485C9715M9251h7949A03083g0555C79673a13952M2444c3221A99087c7210j28166
12474a65376A35061J62270a62171A37078b92020C7643b8950A1438O0127f6161
$$ plain form
12463 106227 -382746 -427260 82701 53540 -8269 -4553 255949 -324519 166755 -26675 -74046
12452 -74046 350126 -113598 -99901 43375 -34388 -65533 22008 151077 54813 -331805 -4488
12440 6196 8749 -357103 226154 -87310 213456 -298561 128104 60221 139201 -6815 -154895
12429 -154895 15678 86940 59314 -52262 -229354 -76976 40968 -77374 -252176 137581 16024
12417 -85470 -164345 231559 19943 -52888 -161903 230172 -121423 -147623 192325 400275
12407 400275 290940 114752 -105390 -186750 -80375 131217 127049 42361 -37419 179181 83316
12395 181284 -165351 101939 -151208 -158093 -47872 180805 -119421 212149 254678 131367
12385 131367 42298 -97552 244843 87447 30254 -131006 -39282 -92127 148992 96892 -109127
$$ packed form
12463A06227c82746m4514H2701k9161h269L716B55949c24519A66755b6675m7371
12452g4046C50126a13598J3697D3375c4388l1145B2008J29069E4813c31805d488
12440F196K553c57103B26154h7310B13456b98561A28104F0221P8980f815j48080
12429a54895A5678P1262k7626e2262j77092g6976D0968g7374j74802A37581A6024
12417h5470p8875B31559A9943e2888j09015B30172a21423k6200A92325K07950
12407D00275j09335A14752a05390q1360h0375A31217m168D2361c7419A79181H3316
12395A81284a65351A01939a51208o885d7872A80805a19421B12149M2529j23311
12385A31367D2298i7552B44843H7447C0254a31006c9282n2845A48992n2100a09127
$$ plain form
12373 -76823 451615 -138557 -18257 311311 -119944 113867 74761 -114495 143903 -94119
12362 178277 94464 214059 -33897 -157487 45222 -119039 -346511 -11268 185588 -282509
12351 -47793 -241863 113997 78176 68313 118134 -3544 103560 -152085 54636 -87050 -478137
12340 -478137 210185 -102637 -250082 -61147 298588 -149926 602888 -32900 236238 8680
12329 54597 32551 -92392 -134522 8284 -141558 34762 -30213 137313 44634 1691 -25080 -809
12316 139929 117267 -26101 -303260 45686 168281 187255 -167831 -179632 -42358 155028 186061
12305 186061 50769 -182649 -136723 53400 176380 -7978 -41517 57347 52078 -61080 177471
12293 -216917 264250 -26461 -114747 308088 2821 -172563 129134 105964 98754 83150 -212427
$$ packed form
12373g6823D51615a38557a8257C11311a19944A13867l9106a14495A43903i4119
12362A78277q3813J19595c3897j23590D5222a19039k27472a1268A85588b82509
12351d7793j94070A13997l5821r863M9821c544A03560a52085E4636h7050l91087
12340d78137B10185a02637j47445f1147B98588a49926F02888c2900B36238H680
12329E4597k2046i2392m2130H284a41558C4762c0213A37313D4634A691b5080h09
12316A39929k2662b6101k77159D5686J22595J8974a67831j1801d2358A55028L1033
12305A86061E0769a82649M5926E3400J22980g978l3539E7347n269f1080A77471
12293b16917B64250b6461q8286C08088B821a72563A29134k3170p210j5604b12427
$$ plain form
12281 23232 -20955 -95055 15196 -133518 83297 118120 141131 272452 154397 -50405 322332
12269 -48090 -25816 -245814 -107507 197555 -145105 788 -101703 582168 -156924 359190
12258 140966 406019 252520 -41149 234131 248306 -235204 182111 127749 -35255 -3468 -20270
12247 -20270 104359 137687 35624 99024 125405 -144268 -39496 258342 -2143 145856 120795
12236 120795 130589 691083 200484 337441 220002 -30863 273261 579278 -56507 234998
12225 120721 237295 124141 125459 104610 105834 254606 500229 272879 -145251 -71860 223047
12213 -23261 379970 -35984 197698 58864 159726 191851 466894 -56918 249454 233119 114497
12201 -131568 -136659 313027 127604 -201231 386858 306295 119271 34742 161037 57447
$$ packed form
12281B3232b0955p4100A5196a33518H3297L4823K3011J31321j18055e0405C22332
12269d8090K2274k19998a07507A97555a45105G88a01703E82168a56924C59190
12258A40966K65053j53499d1149B34131J4175b35204A82111n4362c5255c468j6802
12247b0270A04359L3328C5624O3400K6381a44268c9496B58342b143A45856k5061
12236A20795R794N60494B00484J36957j17439c0863B73261L06017e6507B34998
12225A20721J16574j13154J318k0849J224J48772K45623k27350a45251g1860B23047
12213b3261C79970c5984A97698E8864J00862L2125K75043e6918B49454j6335A14497
12201a31568n091C13027A27604b01231C86858q0563A19271C4742J26295E7447
$$ plain form
12190 93135 119699 -46706 89556 103665 192656 97590 250656 312215 30118 121262 403747
12179 403747 218371 224769 -795 252656 217864 -82001 254719 63913 -47165 89580 -175570
12167 -39770 67962 213298 296268 409800 63631 -161823 290568 -23072 122641 -133172
12156 170577 257782 -74258 -13686 166900 85306 95631 127617 187519 227233 -48225 290959
12144 107108 275630 -69688 -3633 160112 282956 93545 171349 270 276399 -214500 204776
12132 145674 154903 362482 265827 371563 -14939 259278 31764 41686 233191 -113374 50741
12120 9693 10118 70023 -64564 -132594 -17972 239484 136528 -331391 342994 76827 -75751
12108 27152 -108718 -212289 -56798 19852 20142 -21227 190610 123738 -7026 10754 157566
$$ packed form
12190I3135K6564d6706H9556J4109Q8991r5066J53066O1559C0118R1144K82485
12179D03747j85376O398g95B52656l4792h2001B54719F3913d7165H9580a75570
12167c9770F7962J45336Q2970J13532F3631a61823B90568b3072A22641a33172
12156A70577Q7205g4258a3686A66900q1594J0325L1986N9902L9714d8225B90959
12144A07108J68522f9688c633A60112J22844I3545P7804B70K76129b14500B04776
12132A45674R229K07579r6655J05736a4939B59278C1764R922J91505a13374E0741
12120I693M25N9905f4564o8030a7972B39484j02956c31391C42994G6827g5751
12108B7152a08718j03571e6798A9852K90b1227A90610o6872g026A0754J46812
$$ plain form
12097 157566 229976 435555 131306 -1415 -117760 -41630 -132913 177677 286808 273237 -35070
12085 -2718 68957 60364 182736 133899 -57306 157914 -64220 13014 119458 -90136 -33087
12073 -116244 197082 260853 -312363 -55090 88723 189528 -253530 194956 -238977 -119145
12062 -68986 549432 1190299 904817 665873 476504 221353 -88921 -45400 158926 173077
12052 173077 123861 101887 245576 -46213 82037 54878 91247 93869 214468 -84527 133473
12040 229612 -282161 158866 -396255 -79597 263792 148817 -247661 -90410 1192 32792
12030 32792 -12380 11492 -215150 -101576 -35554 -318057 323405 125962 209380 -40348 212393
12018 -111046 -63362 190859 226988 -27802 -434260 39715 13785 -1835 16673 156506 -224934
$$ packed form
12097A57566P2410K05579A31306a415j16345d1630r1283A77677J09131j3571c5070
12085b718F8957q593J22372m8837e7306A57914f4220A3014J06444i0136c3087
12073a16244A97082O3771c12363e5090H8723J00805b53530A94956b38977a19145
12062f8986E49432O40867k85482k38944j89369B21353h8921M3521A58926J4151
12052A73077m9216k1974J43689d6213H2037k7159L6369K622J20599h4527A33473
12040B29612b82161A58866c96255g9597B63792j14975b47661i0410A192L1600
12030C2792a2380A1492b15150a01576c5554k82503C23405A25962Q3418d0348B12393
12018a11046M7684A90859L6129b7802m06458C9715A3785a835A6673J39833b24934
$$ plain form
12006 -96474 -16349 -141892 334159 7854 -7461 -58106 -278034 162133 113179 63163 202660
11995 202660 102097 -76911 78423 77951 -54591 -153708 -251881 -181852 -258867 291430 63576
11983 46878 -315060 78333 -129017 -134035 -173668 -68008 23426 69288 154262 -143791 -152956
11972 -152956 -317086 -119980 314004 280027 159617 -250090 -11820 -7727 -141685 348298
11961 80242 272879 216865 -88771 -116711 172310 -205371 -273642 179968 -197430 81980 -275848
11949 -249489 273798 56984 -11934 260884 3323 458993 -119074 -131582 -45541 12275 -127784
11937 229154 -101774 108741 19836 -177857 -184905 316505 78908 -246587 -123679 -259283
11927 -259283 -111699 -176995 1793 -37403 -267915 221694 267033 -17919 -98246 188360 -73495
$$ packed form
12006i6474a6349j25543C34159G854g461n0645k19928A62133m8954n0016J39497
11995B02660j00563g6911G8423m72e4591r9117r8173P0029p7015B91430F3576
11983D6878c15060G8333a29017n018l9633f8008B3426M5862Q4974a43791r165
11972a52956j64130a19980C14004l3977j20410b50090a1820M093j33958C48298
11961H0242J92637n6014h8771k7940A72310b05371o8271A79968a97430H1980b75848
11949b49489B73798E6984a1934B60884C323M55670a19074j2508d5541A2275a27784
11937B29154a01774A08741A9836a77857p048C16505G8908b46587J22908j35604
11927b59283a11699o5296A793c7403k30512B21694M5339a7919q0327A88360g3495
$$ plain form
11915 -302182 -242108 -132019 15533 -163075 -320853 -179387 -102557 -181597 -140158 -3710 204509
11903 125648 108431 -151488 -196577 -271844 -33284 -165635 374376 73358 111252 -46404 -40878
11892 -40878 233540 162680 -80543 357873 -11387 214891 -123186 68386 48077 -119187 139425
11880 71408 -200178 32793 -133493 26691 62164 -103 -130066 -260615 289730 -326249 -148456
11868 -166014 -83298 161229 235674 23760 103852 -206774 47991 -101442 -13149 -168718 -142381
11857 -142381 45113 328419 277377 -162141 120886 -53419 -4238 58966 268861 -101597 41751
11845 29746 -248271 -112918 -41460 297325 206187 -350481 -31885 -137917 -76703 6017 -117487
11833 -4597 -18482 10879 -107171 156148 142493 -1628 -10842 -257673 147512 -253338 16373
$$ packed form
11915c02182O0074J10089A5533a63075j57778J41466P6830p9040M1439c710B04509
11903A25648j7217a51488m5089p5267c3284j32351C74376G3358L7894d6404N526
11892d0878B33540p0860h0543C57873a1387B14891a23186F8386k0309a19187A39425
11880G1408b00178C2793a33493B6691L5473a03j29963j30549B89730c26249a48456
11868a66014Q2716A61229P4445B3760Q0092b06774D7991a01442a3149j55569K6337
11857a42381D5113K83306n1042a62141A20886e3419d238E8966K09895a01597D1751
11845B9746b48271a12918d1460B97325r1138c50481c1885j06032O1214F017a17487
11833d597j3885A0879a07171A56148j3655a628r214k46831A47512b53338A6373
$$ plain form
11821 243441 -177981 65072 10275 -153224 -352775 -60252 12868 -430119 14984 172835
11811 172835 -70290 -235788 -231904 182790 -323261 202889 96310 -179805 -42282 -62589 -74043
11800 -74043 81565 145491 2598 -3145 110439 -82000 -22621 42172 -211728 113053 21345
11788 -154507 86160 90713 39636 -49438 74883 45194 103279 4359 136151 -38317 -308653
11777 -308653 -16156 -67638 76935 -157241 81823 -214259 73815 -28328 -169157 -10037 -27561
11766 -27561 -107176 231479 -5873 18032 -99093 31736 390027 96140 169224 48976 151251
11755 151251 90179 -169349 165470 162108 -5923 -185210 -225925 215485 -250355 -23102 -227238
11744 -227238 137837 164210 -136379 -228358 -27907 -2477 27634 -292726 139215 -114189 -534086
$$ packed form
11821B43441a77981F5072A0275a53224j99551f0252A2868d30119A4984J57851
11811A72835g0290j65498L884A82790c23261B02889I6310a79805d2282k0307j1454
11800g4043H1565O3926B598c145A10439h2000b2621D2172b11728A13053B1345
11788a54507H6160M553C9636d9438G4883k9689N8085D359J31792c8317k70336
11777c08653a6156n1482G6935a57241H1823b14259G3815b8328j40829a0037j7524
11766b7561p9615B31479e873A8032i9093C1736L58291I6140P3084D8976J02275
11755A51251o1072a69349A65470l362e923j79287m0715B15485b50355b3102k04136
11744b27238A37837K6373a36379r1979b7907b477B7634b92726A39215a14189m19897
$$ plain form
11733 -534086 84456 102638 -188460 -51106 -112274 163064 -6061 266230 211804 254205 -220022
11721 29748 8225 36805 -95555 -182793 -58946 -78948 319702 99731 -18504 -54289 -91012 42674
11708 -290931 -383330 68002 104220 145927 -372729 -103821 -146640 -9055 197578 -497372 -40673
11696 -65111 32113 335444 21033 101470 -140663 420945 -49269 -30979 156444 -21752 -125330
11685 -125330 269133 94093 -67974 -111339 15858 50961 9221 47179 14449 -489083 -115430
11673 121285 -241314 276385 91789 170791 -183074 -159392 84952 218996 47650 175593
11663 175593 -207429 5369 63550 141075 -135362 -25172 92678 -62452 62393 194030 35744
11651 42533 243377 -88259 -224350 50897 -119589 -204947 -224968 -34579 -248507 165250 216751
$$ packed form
11733e34086H4456J8182a88460e1106o1168A63064f061B66230n4426M2401b20022
11721B9748H225K8580i5555q7238e8946k0002C19702I9731a8504l5785l6723D2674
11708b90931r2399F8002L6218M1707c72729a03821m2819i055A97578d97372d0673
11696f5111C2113L03331B1033Q0437a40663D20945d9269J8290A56444b1752j03578
11685a25330B69133I4093f7974m3365A5858L5103I221L7958A4449d89083a15430
11673A21285b41314B76385I1789P9002a83074K3682H4952J34044D7650J27943
11663A75593b07429E369N8181P7525a35362b5172I2678f2452F2393J31637C5744
11651D2533K00844h8259j36091E0897a19589q5358k0021c4579k13928A65250N1501
$$ plain form
11640 216751 17705 -134633 -179135 94693 127744 347514 219417 268468 65800 220729 231259
11629 231259 166988 46419 88069 -18573 -196453 -40631 -74731 24710 120628 5688 -269704
11617 -321369 24541 184222 -28547 -27815 -385805 -40528 21355 -180301 -107236 44563 115875
11606 115875 259252 -55001 37115 -418368 242361 -93247 -149702 81106 154934 169270 -182267
11594 197966 -57085 116220 -228658 154254 108702 2654 -358826 -138947 326630 188967
11584 188967 11195 -68641 -90349 215805 187503 -62515 179048 255139 -47231 77684 -214017
11572 245543 196802 192473 122838 217421 84648 153645 -127808 360928 -16818 -20363 -75775
11561 -75775 -53277 34897 93813 112402 283017 -497799 38671 454687 145160 255104 -61585
$$ packed form
11640B16751A7705a34633m4502I4693L3051K19770j28097M9051F5800J54929J0530
11629B31259o4271D6419M1650a8573j77880d0631l4100B4710R5918E688b69704
11617c21369B4541J59681b8547P32l57990d0528B1355a80301P3065D4563P1312
11606A15875J43377e5001C7115d18368B42361i3247n6455H1106P3828J4336a82267
11594A97966e7085A16220b28658A54254m5552B654c58826a38947C26630j37663
11584A88967A1195f8641k1708B15805k8302f2515A79048P6091d7231G7684b14017
11572B45543m8741m329o9635R4583H4648O8997a27808C60928a6818l545n5412
11561g5775K2498C4897N8916J8589J70615d97799C8671M16016A45160J09944f1585
$$ plain form
11549 -101728 57637 -422412 222340 138984 4029 -7024 235796 68552 111492 -386999 59635
11537 -22498 205225 -142740 -304957 13300 193443 196789 332863 110484 -34532 -129526 10472
11525 -169108 68150 68078 100705 -62945 -42308 -147737 85194 90485 -95508 -57230 95279 11157
11512 140684 -161929 350183 -158694 131104 297364 56608 160399 61834 -128694 188218
11501 -89511 143362 -32526 102944 -24108 200254 230668 77361 337706 10763 -102574 -185175
11490 -185175 113467 323991 299651 212688 79512 112232 189355 159196 105936 272056 165046
11479 165046 91176 -157428 214521 149202 -29349 300804 -23083 158721 -2494 28254 172566
11468 172566 209855 57349 -147094 526467 171361 62395 -78735 -153972 30665 133808 433396
$$ packed form
11549a01728E7637d22412B22340q3356D029g024B35796F8552M2940c86999E9635
11537b2498B05225a42740j62217A3300J80143L346J36074A10484c4532r4994A0472
11525a69108F8150p2L2627f2945K0637j05429H5194N291i5508L8278I5279A1157
11512A40684a61929C50183a58694A31104J66260E6608J03791F1834a28694A88218
11501h9511A43362c2526A02944b4108B00254L0414G7361K60345A0763a02574q2601
11490a85175A13467K10524k4340q6963G9512L2720P7123l0159n3260J66120j07010
11479A65046p3870a57428B14521o5319b9349C00804b3083A58721b494B8254J44312
11468A72566L7289E7349a47094E26467A71361F2395g8735p5237C0665J03143K99588
$$ plain form
11457 433396 -11729 -124399 -30717 154419 229291 187261 33561 95566 222792 43659 283805
11446 283805 20103 284736 -99067 73182 18428 -351883 89637 38013 -190243 -20604 111800
11434 45352 144425 246041 -6825 413687 450276 -129022 -22941 37491 131811 96060 -3131
11422 -15014 -187340 30973 19462 285841 -113568 129886 -306452 -27251 28540 270083
11412 270083 -257752 28331 24253 -256870 -126657 -263419 -153393 -241 -180479 174521 20278
11400 -30755 -245132 -81723 -70400 106662 -49107 72118 -30020 45669 -36345 -45580 -62053
11389 -62053 10036 929 150628 84683 -455046 -299586 99634 -369319 -85837 99854 79219
11378 79219 -318417 -203635 -114205 -173827 -368259 -13917 -154153 17431 -198839 -36283 117860
$$ packed form
11457D33396a1729j12670c0717A54419P4872m2030C3561O2005J27226D3659K40146
11446B83805B0103K64633i9067G3182A8428c51883H9637C8013a90243b0604A11800
11434D5352R9073J01616f825D13687L6589a29022b2941C7491R4320l5751c131
11422a5014j72326C0973j1511K66379a13568A29886c06452b7251B8540K41543
11412B70083b57752B8331m078b56870a26657j36762J10026b41j80238A74521B0278
11400c0755k14377h1723J1323A06662d9107G2118c0020D5669c6345r235j6473
11389f2053A0036I29J49699o5945d55046J55460I9634c69319h5837I9854k0635
11378G9219c18417J14782Q9430n9622j94432a3917j40236A7431a98839c6283A17860
$$ plain form
11366 190416 33505 23415 109328 -423621 167474 -305749 -164219 -147253 -239139 71129 211735
11355 211735 -190926 160806 -87963 106294 56459 300616 181591 -80622 -69508 -207741
11345 -207741 -96197 -103068 -46329 -43535 98791 -198174 -33563 -128008 49451 258643 79947
11333 -125041 -219227 -122153 374063 232300 -94139 133762 -46914 8917 331276 348998 -15960
11321 -162373 64571 141199 -95322 -211183 -77893 41246 -268618 268749 159835 -165279
11310 -11352 -141143 -258033 -75770 -11758 138990 8249 -190472 128608 -89719 -406982 267061
11298 -42401 101742 -99360 31615 -63640 220255 96421 -355419 196889 -8615 -17574 -251791
11287 -251791 -29721 -352242 -11552 424333 -188222 -54800 -171246 -76449 -40110 179716
$$ packed form
11366A90416C3505j0090Q5913d23621A67474c05749J41530J6966r1886G1129J40606
11355B11735a90926A60806h7963A06294m9835K44157j19025h0622J1114j38233
11345b07741i6197o871d6329K794I8791a98174c3563r4445D9451K09192G9947
11333a25041r4186R7074C74063j41763i4139A33762d6914H917L22359J7722a5960
11321a62373F4571P6628i5322j15861g7893D1246b68618B68749j08914a65279
11310a1352j29791j16890g5770a1758A38990H249a90472A28608h9719l17263B67061
11298d2401A01742i9360C1615f3640B20255I6421c55419A96889h615q959k34217
11287b51791b9721l22521a1552D24333a88222e4800j16446g6449L6339A79716
$$ plain form
11276 293223 82571 222419 -273525 165189 -149457 -57314 -310807 -375093 -306229 17460
11265 134869 95210 -67471 -16267 -222807 233921 -236781 4125 -104985 -27580 -271031 -126736
11253 -106278 -260859 -294477 77933 10692 197987 -35926 35046 -42466 -210737 88598 -151482
11241 -298687 -376352 55937 -114199 -43189 -323543 -205027 23972 -29066 308512 90256 276591
11230 276591 28626 -12520 -123966 -83359 -196746 117173 -153626 -69878 27974 9833 169195
11219 169195 -337723 -213446 -186870 -87720 105262 -116938 116573 184146 -11655 -186360
11209 -186360 -120522 -119899 -98741 181899 -8829 -98840 -220822 -420526 -249454 -178287 164567
11197 70915 82003 324160 40078 -188913 -292899 -128780 -76077 63664 89951 -114362 -51058
$$ packed form
11276B93223H2571J39848b73525A65189a49457e7314k53493o4286O8864A7460
11265A34869l9659f7471a6267k06540B33921b36781D125a04985b7580k43451a26736
11253a06278j54581l3618G7933A0692J87295c5926C5046d2466j68271H8598a51482
11241b98687p7665E5937a14199d3189k80354J18516B3972b9066C08512I0256J86335
11230B76591B8626a2520j11446M0607j13387A17173a53626f9878B7974I833J59362
11219A69195c37723J24277K6576h7720A05262a16938A16573O7573a1655j74705
11209a86360O5838O23K1158A81899h829r0011j21982j99704J71072P1167A64567
11197G0915J1088K42157D0078a88913j03986a28780N2703F3664K6287a14362e1058
$$ plain form
11185 -54290 119967 102325 97673 -182600 -49158 -164373 23905 -325060 -134240 77743 -231758
11173 168464 173261 22548 -141317 19584 -307630 50494 -33804 -26275 -78315 -198457 213033
11161 48991 152817 -56727 -283720 -348618 -281742 32555 -309251 21224 -130485 -341053 124937
11149 -457938 129613 171639 191176 109768 -158269 235695 80047 162554 158695 -100477 143402
11137 -36357 -14411 22872 60229 28701 -295925 99527 89989 205271 -178179 71064 128485
11126 128485 54837 173222 112477 132227 53629 308399 -167856 334117 24147 261662
11116 261662 49042 31357 173699 -40054 44352 -210615 200063 331444 158817 291409
11106 291409 9066 348902 -59642 119409 82437 81899 68406 -119749 -2638 101117 75022
$$ packed form
11185e4290A19967j7642m652a82600d9158j15215B3905c25060a34240G7743b31758
11173A68464M797B2548a41317A9584c07630E0494c3804P529n2040j20142B13033
11161D8991J03826e6727k26993o4898O6876C2555c09251B1224a30485k10568A24937
11149d57938A29613M2026J9537q1408a58269B35695H0047Q2507l859a00477A43402
11137c6357a4411B2872L7357B8701b95925I9527r538J15282a78179G1064N7421
11126A28485E4837J18385o0745J9750E3629K54770a67856C34117B4147K37515
11116B61662D9042j7685J42342d0054D4352b10615B00063J31381A58817J32592
11106B91409I066L39836e9642A19409l6972n38j3493a19749b638A01117k6095
$$ plain form
11095 75022 -83135 70238 -61269 123339 -208492 140908 -35120 115618 265654 3422 -19636
11083 -32074 135787 395976 127096 -25021 295888 296533 37815 248178 441261 299422 193388
11072 193388 114254 32051 -153022 409127 51885 255940 393329 269555 387755 349337
11062 349337 718798 151927 563743 347006 390986 -214623 198079 245596 437578 342692
11052 342692 560759 364164 124520 462503 234480 444171 348170 381512 186608 740098
11042 740098 536713 526330 774607 495075 602707 700313 814981 533522 761880 626189
11032 626189 462019 519751 515467 720705 754758 694233 621175 907106 777975 496267 852426
11021 852426 785231 852661 360109 575123 473097 699073 494564 455847 534365 777253
$$ packed form
11095G5022h3135G0238f1269A23339b08492A40908c5120A15618J50036C422a9636
11083c2074A35787K60189A27096b5021B95888O45C7815K10363J93083j41839j06034
11072A93388p9134C2051a53022D09127E1885K04055J37389j23774J18200l8418
11062C49337L69461A51927M11816k16737M3980b14623A98079M7517J91982r4886
11052C42692K18067j96595A24520L37983k28023K09691r6001L3342A86608N53490
11042G40098k03385j0383K48277k79532J07632R7606J14668k81459K28358j35691
11032F26189j64170N7732m284K05238L4053o0525p3058K85931j29131k81708L56159
11021H52426o7195O7430C60109K15014j02026K25976k04509l8717P8518K42888
$$ plain form
11011 777253 469861 734638 948120 467120 600043 320671 698970 697315 609974 990949
11001 990949 587947 420860 924351 434034 667570 614088 726484 777009 539994 734004
10991 734004 651585 304472 715259 764574 661734 496506 438639 513050 302398 566451
10981 566451 503271 623257 584582 697057 728430 680150 736919 827761 853709 711430 581741
10970 581741 812265 834775 771793 1015128 1371653 1223392 1322722 1349953 1286518 1684117
10960 1684117 1750963 2076445 1919946 2208932 2339909 2729935 2608350 2321529 2210175 2361790
10950 2361790 2316206 2302468 1707565 1739485 1802127 1448769 1675911 1672952 1385891 1715519
10940 1715519 1591397 1198799 1491370 1258717 1181401 885112 920414 724717 846081 520086
$$ packed form
11011G77253l07392K64777K13482D67120J32923k79372L78299j655q7341L80975
11001I90949m03002j67087N03491D34034K33536n3482J12396N0525k37015J94010
10991G34004q2419C04472M10787M9315j02840j65228n7867P4411k10652K64053
10981E66451o3180J19986l8675J12475L1373m8280N6769R0842K5948j42279j29689
10970E81741K30524K2510o2982K43335L56525j48261R9330K7231o3435L97599
10960A684117O6846L25482j56499K88986J30977L90026j21585k86821j11354J51615
10950B361790m5584j3738n94903L1920O2642l53358K27142k959k87061L29628
10940A715519j24122l92598K92571k32653p7316k96289L5302j95697J21364l25995
$$ plain form
10930 520086 358959 469218 325345 370323 378365 110898 196981 -226943 343207 61955
10919 121100 309112 -137802 465755 270310 266637 183720 165872 -63070 29576 270057 438474
10908 438474 152032 391190 -36791 299660 -94023 30354 -17991 1856 160686 190296 231854
10897 231854 -15697 -81033 -60527 -106942 83779 199218 201363 -139305 145977 -328636 -4168
10885 366522 -33236 88016 201213 90659 -47122 -95619 100455 7781 -188304 244399 123293
10874 123293 69780 -162404 -78110 -31964 -17106 157637 201685 96830 -125259 78820 -124419
10862 -68785 -36691 83404 79853 181021 64913 -26618 -139614 57922 10914 93633 117246
10851 117246 -237274 -129686 174471 -55161 410339 166003 -163605 48199 -45233 389742
$$ packed form
10930E20086j61127J10259j43873M4978Q042A10898Q6083b26943C43207F1955
10919A21100J88012a37802D65755j95445l673q2917j7848f3070B9576K40481J68417
10908D38474A52032K39158c6791B99660i4023C0354a7991A856J58830K9610M1558
10897B31854a5697o5336K0506m6415H3779J15439K145a39305A45977c28636d168
10885C66522c3236H8016J13197I0659d7122m8497A00455G781a88304B44399j21106
10874A23293n3513a62404g8110c1964J4858A57637M4048I6830a25259G8820a24419
10862f8785L2094H3404l551J01168F4913b6618j12996E7922A0914Q2719K3613
10851A17246b37274J07588A74471e5161D10339A66003a63605D8199d5233C89742
$$ plain form
10840 -248352 -2083 -138783 -160582 268599 -35697 82993 179781 77864 161173 14520 -45880
10828 -109672 -49146 -137871 -97290 -307052 61417 -217372 26279 324458 -118260 -352497
10818 -352497 65508 -34910 -225737 221403 -98257 84406 -269135 -63374 -255616 134665
10807 -89474 -45824 -376508 -333459 -337813 94406 -26627 -238743 63519 201290 114686 113777 139428
10795 139428 307967 -46371 -337627 4074 122282 -57673 -76473 -58523 -127103 -89203 -226700
10784 -226700 -59102 70778 -169596 320272 260033 16973 -158854 -81750 251558 164049 1030
10772 97482 -372533 -112573 32641 -6843 -164933 -228617 17559 -234927 348040 -101246 -158124
10761 -158124 -148545 -100553 221781 130203 -65308 -54618 195021 -68565 245984 -422374 -127421
$$ packed form
10840b48352b083j36700k1799B68599c5697H2993R6788G7864Q3309A4520d5880
10828a09672d9146q8725M0581k09762F1417b17372B6279K98179a18260k34237
10818c52497F5508c4910j90827B21403i8257H4406b69135f3374j92242A34665
10807h9474M3650l30684M3049m354I4406b6627k12116F3519J37771q6604r09K5651
10795A39428J68539d6371k91256D074J18208e7673j8800J7950o8580L7900j37497
10784b26700e9102G0778a69596C20272o0239A6973a58854P7104B51558q7509A030
10772I7482c72533a12573C2641f843j58090o3684A7559b34927C48040a01246n6878
10761a58124R579M7992B21781r1578f5308J0690A95021f8565B45984d22374a27421
$$ plain form
10749 -167858 -338834 47839 144913 -76725 116885 34757 -132732 -289212 71576 46852 -321910
10737 -249484 -81668 17933 -79101 -222905 23108 -47437 -111677 32931 10253 -15397 -74990
10726 -74990 -113200 -70340 -105652 82268 -358179 -160156 15109 -437919 -12543 183516 -73393
10714 -31695 278495 -95450 -83063 -67678 197311 -265610 116791 69400 25446 -343219 -6988
10702 -224602 15335 134873 236661 -122001 -19322 7621 -185991 34566 -18121 -76277 45701
10690 14493 -77667 -268187 6207 12049 238066 59239 -645498 69629 -211195 68753 -303317
10678 84984 -45635 73588 102293 -1619 -204740 -129625 -47075 -30744 -195821 154651 11341
10666 -86292 -266751 165182 -371597 237468 -186206 -58870 158794 -75073 136111 -165361
$$ packed form
10749a67858j70976D7839R7074g6725A16885C4757a32732j56480G1576k4724c21910
10737b49484h1668A7933g9101j43804B3108d7437o4240C2931A0253a5397n9593
10726g4990l8210M2860l5312H2268c58179a60156A5109d37919a2543A83516g3393
10714c1695B78495i5450J2387J5385A97311b65610A16791m7391B5446c43219f988
10702b24602A5335J19538J01788a22001a9322G621a85991C4566a8121n8156D5701
10690A4493g7667j90520F207N842K26017E9239f45498F9629b11195F8753c03317
10678H4984d5635G3588K8705a619k03121P5115d7075J6331j65077A54651A1341
10666h6292j80459A65182c71597B37468a86206e8870A58794g5073A36111a65361
$$ plain form
10655 165785 -92129 64849 -203351 85187 245598 35475 -159827 -10324 123417 -18299 88941
10643 -95402 -306257 109302 46547 -479419 -50702 -406259 -370003 -104 -97573 -120865 -131578
10632 -131578 429044 209693 -8605 79139 20575 -123819 362895 271761 80270 162882 159335
10621 159335 -435688 33421 8879 -748 -31752 -77096 -225752 6678 -33604 -168791 249535
10609 -14686 -81214 42804 -54445 -73595 150483 -392768 -129531 153548 -257157 -111019
10598 -218593 15937 11627 15045 61515 15837 33032 -74260 -107396 -160049 -30291 45808 -2998
10585 -44725 153782 -91083 -370053 -178927 -140900 -90749 -123180 -101957 -13171 -35989 -114452
10574 -114452 -14583 146893 123018 -145341 -278674 172631 -189809 10033 -41861 39357
$$ packed form
10655A65785i2129F4849b03351H5187J60411C5475a59827a0324A23417a8299H8941
10643i5402k10855A09302D6547d79419e0702l55557L6256a04r7469k3292j0713
10632a31578D29044B09693h605G9139B0575a23819C62895r1134H0270Q2612l547
10621A59335d35688C3421H879g48l1004m5344j48656F678c3604j35187B49535
10609a4686o6528D2804e4445j9150A50483c92768a29531A53548b57157a11019
10598b18593A5937m310L418M6470A5837J7195g4260l3136n2653c0291D5808b998
10585d4725A53782i1083k78970a78927L8027N0151l2431K1223a3171k2818p8463
10574a14452a4583A46893k3875a45341j33333A72631a89809A0033d1861C9357
$$ plain form
10563 112675 -13997 -220643 209600 154653 -192747 54334 29826 -129181 -33262 -14586 -204827
10552 -204827 13626 -224889 -124407 -17269 -51660 -202651 -60903 -22005 121745 -248815
10541 -52182 -232062 263753 61602 126281 308849 -128395 -163174 43634 163483 -20829 55222
10529 -300534 139919 -21463 -29487 -55771 138868 -370513 184469 13370 -288650 -403655
10519 -403655 10270 -74592 39918 170269 -174694 -267227 -177078 1426 -153580 133434 440390
10508 440390 296834 25516 113425 -95160 174953 120048 174351 -161681 -60100 -167871 -36655
10496 -123951 -108798 95876 25155 -82943 -343141 47526 130173 -294335 -201424 -299840 -9280
10484 -152363 -9088 26412 -171362 -128201 153954 256595 -211367 40242 -41062 -17205 -148601
$$ packed form
10563A12675a3997k06646B09600n4947a92747E4334k4508a29181c3262a4586j90241
10552b04827A3626b24889J00482a7269l4391j50991f0903b2005A21745b48815
10541e2182j79880B63753F1602O4679J82568a28395l4779D3634J19849b0829E5222
10529c00534A39919b1463q024k6284A38868c70513A84469A3370b88650j15005
10519d03655A0270g4592C9918J30351a74694r2533R0149A426a53580A33434L06956
10508D40390j43556B5516Q7909i5160A74953n4905N4303a61681f0100j07771c6655
10496a23951J5153I5876B5155h2943k60198D7526Q2647b94335R2911r8416i280
10484a52363i088B6412a71362M3161A53954J02641b11367D0242d1062a7205j31396
$$ plain form
10473 -148601 46639 48250 -60287 -137658 261070 -298949 -339109 222143 93478 37768 104975
10462 104975 36320 -19689 -139451 79106 -26813 345789 -8455 -122945 -88805 20892 -29288
10450 -91570 166927 -107200 -85381 -129493 -137072 27868 -127659 250044 183054 -170891 24378
10438 -7115 292001 -197841 -257004 85559 -214726 37664 -111553 -38799 59985 91569 -38643
10426 300 -270209 -26690 -100715 -129666 45269 -157061 -111750 160020 153569 31320 182222
10415 182222 -391269 -57440 -5798 -187998 43198 -170072 -194928 2717 94109 -81766 273693
10403 -90797 -195165 79371 -173679 -143586 81617 125991 55213 168223 95395 140476 144669
10392 144669 95116 79749 -320135 -170217 6534 -119292 -19794 148729 -110438 -176560 -136593
$$ packed form
10473a48601D6639J611f0287p7371B61070b98949m0160B22143I3478C7768O7207
10462A04975C6320a9689j19762G9106b6813C45789h455j14490L4140B0892b9288
10450i1570A66927a07200K1819m4112p579B7868a27659B50044o6990a70891B4378
10438g115B92001a97841n9163H5559b14726C7664a11553c8799E9985L1584c8643
10426C00b70209b6690p4025k8951D5269a57061M5311A60020o451C1320J50902
10415A82222c91269e7440e798j82200D3198a70072k4856B717R1392h1766B73693
10403i0797j04368G9371a73679L0093H1617M4374E5213J13010p2828M5081M193
10392A44669m9553j5367c20135J49918F534a19292a9794A48729a10438o6122L9967
$$ plain form
10381 -136593 -142770 52807 29130 166753 100601 -2448 -38111 109300 -196920 177046 87609
10369 269276 -109498 -3097 166224 346083 83868 -133266 9532 472070 146056 226185 497646
10358 497646 231372 -91951 117619 180302 236066 174825 192197 365552 474856 617220
10348 617220 363458 194925 124556 446309 238343 219922 128681 223797 -124245 160287
10337 95668 574227 70387 402463 279827 626910 505685 266687 221632 39205 321511
10327 321511 143051 -85301 89191 248695 295768 145632 375747 279756 116653 198536
10317 198536 -100177 290837 93264 87250 283010 -103661 180156 49666 262861 85832
10306 1363 46701 97132 -12600 -62779 597925 1125 70880 135219 -171085 -253700 147910
$$ packed form
10381a36593o177E2807k3677J37623o6152b448l5663A09300a96920A77046H7609
10369B69276a09498c097A66224J79859H3868a33266I532M62538A46056Q0129K71461
10358D97646B31372i1951A17619O2683N5764o1241J7372J73355J09304J42364
10348F17220k53762j68533p0369L21753k07966j8421r1241R5116a24245A60287
10337I5668M78559G0387L32076j22636L47083j21225k38998m5055C9205K82306
10327C21511A43051h5301H9191J59504M7073A45632K30115r5991A16653Q1883
10317A98536a00177B90837I3264o014J95760a03661A80156D9666K13195H5832
10306A363M5338N0431a2600n0179E97925A125O9755O4339a71085q2615A47910
$$ plain form
10294 -67160 95277 -29137 -55687 -37414 -146812 -329186 5286 47802 -85398 333813 -105290
10282 -2548 320218 -109304 45971 130861 247082 -4492 -231647 -179368 75128 -114185 -90310
10271 -90310 -149632 103344 -162024 106635 -237932 106661 -134335 -246801 -33277 23552
10260 -6646 13529 -75285 144984 149447 -19926 307110 -428849 143527 35085 -192660 -157742
10249 -157742 98050 -42918 -20111 -43635 465784 -12670 268372 103404 204801 -65903 169576
10237 243452 176312 139171 211082 61987 -68 105349 299499 213067 -56366 60314 -194619
10225 91834 -60144 -14870 7704 170507 148013 -182380 831 -70174 -138403 12200 241055 60498
10212 49086 -312145 -154620 -146199 -291988 196525 -264770 -274648 -208968 -94941 20264 225899
$$ packed form
10294f7160I5277b9137k6550J8273j09398j82374E286M2516h5398C33813a05290
10282b548C20218a09304D5971Q4890J16221d492k27155N2279G5128a14185K3875
10271i0310n9322A03344a62024A06635b37932A06661a34335j12466c3277B3552
10260f646A3529g5285A44984M463a9926C07110d28849A43527C5085a92660L4918
10249a57742I8050d2918b0111k3524D65784a2670B68372A03404J01397f5903A69576
10237B43452o7140l7141P1911F1987f8A05349J94150q6432e6366F0314a94619
10225I1834f0144a4870G704J62803k2494a82380H31g0174o8229A2200K28855F0498
10212D9086c12145a54620Q421j45789A96525b64770r878O5680i4941B0264K05635
$$ plain form
10201 225899 127313 39153 -459443 30846 -97962 162284 266389 -181314 193599 -110405
10190 400198 -332214 -244423 -175237 -148505 -42843 -84574 -101258 -249189 1822 -191997 -283572
10179 -283572 159657 -3633 -21260 -327931 166118 57452 6782 -46133 -180394 -131731 -12602
10167 -125466 -186300 -186197 114188 28600 -177696 -51293 81687 -54478 -105980 -91093 -74213
10156 -74213 -88184 -149318 201671 -64456 -311200 -340042 456883 -153246 -404806 -128069
10145 4393 75757 -32495 -17506 -123142 -32807 -213356 -56773 274248 -73865 -403267 -274334
10134 -274334 -64454 100115 104922 -30311 56717 -124462 43220 -175168 -267048 -212242 133662
10122 -216407 105723 81954 58366 -120620 -36992 -76630 234965 -37940 21560 -430610 -123071
$$ packed form
10201B25899r8586C9153d59443C0846i7962A62284J04105a81314A93599a10405
10190D00198c32214Q7791O9186K6732d2843m1731j6684j47931A822a91997r1575
10179b83572A59657c633j7627l06671A66118E7452F782d6133j34261M8663a2602
10167a25466o0834J03A14188B8600a77696e1293H1687e4478n1502J4887J6880
10156g4213j3971o1134B01671f4456k46744k8842D56883a53246k51560a28069
10145D393P1364c2495J4989j05636c2807j80549e6773B74248g3865l29402J28933
10134b74334f4454A00115M807c0311E6717a24462D3220a75168r1880N4806A33662
10122b16407A05723k3769k3588a20620c6992l9638B34965c7940B1560d30610a23071
$$ plain form
10110 -29273 -193815 279210 -84314 -153358 -354805 208673 92823 162905 215 -225760 -27950
10098 -221588 15516 166978 9923 213646 -96324 95249 -8009 -72621 122449 -170800 -121750
10087 -121750 -199392 -105054 46900 158759 21269 253931 42496 -33885 30644 -255352 -174651
10076 -174651 -324377 351875 -380867 -437712 -151399 184727 -137121 138280 130465 329078
10066 329078 -55379 -112752 268620 -282180 -88657 110792 -166049 279709 -110321 36944
10055 67208 -182743 265508 172663 -84557 -225256 29361 180420 112694 -204298 -3444 196355
10043 -119088 151007 301273 -343240 -94148 68323 -163715 -70435 76232 223372 -257959
10032 192941 188937 -417239 -157864 -337160 136008 94722 139516 -146463 -250702 -81243
$$ packed form
10110b9273j64542B79210h4314o9044k01447B08673I2823P0082B15b25760b7950
10098b21588A5516J51462I923K03723i6324I5249h009o4612A22449a70800M9050
10087a21750p7642R4338D6900J11859B1269K32662D2496c3885C0644b55352Q0701
10076a74651j49726C51875c80867n6845a51399A84727a37121A38280p815J98613
10066C29078e5379n7373B68620b82180h8657A10792a66049B79709a10321C6944
10055F7208a82743B65508r2845h4557j40699B9361J51059o7726b04298c444A96355
10043a19088A51007J50266c43240i4148F8323a63715g0435G6232J47140b57959
10032A92941m004d17239a57864j79296A36008m1286M4794a46463j04239h1243
$$ plain form
10021 -5508 -135212 44848 15016 -451769 152148 -601160 -129987 -17282 120642 -223024
10010 140158 -14860 85743 -326673 59140 -230327 -86906 -81478 -107213 -136826 125478 305256
9999 305256 -285491 15579 -442436 -362373 -125189 132836 124759 -15749 -8437 219402 15580
9987 -87214 -75100 -335799 -22558 -163595 134316 -241293 -246377 -2776 -34591 -32220 92757 907
9974 -115389 -381660 13425 -35933 -281382 -196093 -96156 -358727 158640 195363 223344 93136
9962 -17824 183279 -239698 -74370 141384 -333434 -957 -455935 -104573 -50611 -13056 -312591
9951 -312591 33102 37471 -330902 -153564 3317 -309973 -202984 -222489 -243268 49464 259866
9940 259866 -211870 -265106 -100330 145266 -53616 -7101 33066 -88469 -20655 145755 -20658
$$ packed form
10021e508j29704D4848A5016d51769A52148f01160a29987a7282A20642b23024
10010A40158a4860H5743c26673E9140b30327h6906N428k5735k9613A25478J79778
9999C05256b85491A5579d42436Q0063a25189A32836q077a5749P312B19402A5580
9987h7214J2114k60699b2558j41037A34316b41293n084b776l1815K371I2757I07
9974a15389k66271A3425c5933k45449Q5289i6156k62571A58640L6723K7981I3136
9962a7824A83279b39698g4370A41384c33434i57m54978a04573e0611a3056k99535
9951c12591C3102M369c30902a53564C317c09973J06989j9505k0779D9464K10402
9940B59866b11870n3236a00330A45266e3616g101C3066h8469b0655A45755b0658
$$ plain form
9928 -191336 -105564 -136579 -46407 -198405 29290 148718 -101932 -362281 95295 13944 -271578
9916 47626 -67384 130961 -151555 36953 164289 8060 -56604 6159 -80577 146613 255230
9905 255230 66739 -110093 -75872 -263946 -113008 42868 -275400 -124823 -263053 -212083
9895 -212083 139443 -539888 -83774 -42562 -121585 -78909 -232032 -137761 -80945 390174 22784
9883 72489 28875 -91369 225565 105569 295401 141277 -231020 -21191 -2064 -122522 -86225
9872 -86225 -48848 -174928 -94934 32670 -98631 -57274 -381702 141811 -69580 140818 255955
9861 255955 24189 150876 57970 -321012 185773 76658 62425 -17660 -89991 -21483 -111836
9850 -111836 -79037 191004 176628 -75993 46851 -86995 82360 247632 -163370 -192260 59762
$$ packed form
9928a91336Q5772l1015d6407j51998B9290J19428a01932k60349I5295A3944b71578
9916D7626f7384A30961a51555C6953J27336H060e6604F159h0577A46613J08617
9905B55230F6739a10093L4221j88074a13008D2868b75400a24823j38230N0970
9895b12083A39443e39888h3774M1212p9023M2676j53123R4271N6816C90174B2784
9883G2489B8875i1369B25565A05569J89832A41277b31020b1191b064j20458L6297
9872h6225L7377j26080P9994C2670i8631M1357l24428A41811f9580A40818J15137
9861B55955B4189J26687E7970c21012A85773G6658j4233a7660p2331b1483r0353
9850a11836L2799A91004j4376g5993D6851h6995H2360J65272a63370k8890E9762
$$ plain form
9838 -310332 86159 246116 40601 267401 -32144 -117239 32232 -59321 -56454 -19339 17824
9826 -238874 -170248 -274311 -290737 5750 -443134 77539 30653 -265714 -54961 246668 -149523
9814 105259 147169 -549627 -166414 -265822 -152167 -56330 -116138 -57420 207497 133329 -381760
9802 -391669 -191559 -58339 -165296 161282 -130103 -135715 78741 16019 -84252 34462 -21340
9790 38825 -200037 -328215 -107397 -23165 -13145 66523 -56486 85305 -271109 -11318 -135230
9779 -135230 -38981 -139474 -144757 -223912 -89305 -182916 -5565 -478998 122718 -234346 98732
9767 -203923 -61732 63456 284627 -1290 10162 -16110 -160993 20495 146566 -152217 196106
9755 211445 103144 13195 -252014 28801 40250 359310 -83609 -310166 -103126 93465 -57337
$$ packed form
9838c10332H6159J59957D0601K26800c2144q5095C2232e9321K867a9339A7824
9826b38874O8626j04063j6426E750d43134G7539C0653b65714e4961B46668a49523
9814A05259M1910e49627a66414r9408J13655e6330n9808e7420B07497p4168c81760
9802c91669a91559e8339j06957A61282a30103n612G8741A6019h4252C4462b1340
9790C8825b00037j28178a07397b3165J0020F6523e6486H5305b71109a1318j23912
9779a35230c8981j00493n283p9155h9305r3611e565m73433A22718b34346I8732
9767b03923f1732F3456K21171a290A0162a6110j44883B0495J26071a52217A96106
9755B11445A03144A3195b52014B8801J1449L19060h3609k26557a03126I3465e7337
$$ plain form
9743 -480826 -353635 39739 -100904 -213010 -349931 -181286 57218 55856 38296 -46102 182775
9731 212984 -67987 -269242 -119630 20539 -200229 -189128 -158097 108293 143474 -186952 12288
9719 -203788 122979 -252104 -155880 -74146 -61083 -150045 -185997 -38551 164319 -205653 -212315
9708 -212315 117671 -111237 11139 -37400 -27526 38307 -140590 -47774 -53438 -443924 -82678
9696 99941 22363 23750 -28020 -196197 -15136 -200694 -181735 -350061 -235097 -117714 -65877
9685 -65877 -66624 -50715 -224455 86785 54231 -139604 -81267 -39046 276671 -82670 -129372 -90725
9673 -90725 5825 18733 -311454 -12390 -95876 155121 -236424 -378921 -28954 -246757 -95627
9661 22431 -272589 -269480 383613 91779 -29133 3955 -47236 156302 -272769 -50683 108481
$$ packed form
9743d80826J27191C9739a00904j12106j36921J68645E7218j362j7560d6102A82775
9731B12984f7987k01255a19630B0539b00229J1101L1031A08293L5181a86952A2288
9719b03788A22979b52104R6224g4146J3063q8962l5952c8551A64319b05653o662
9708b12315A17671a11237A1139c7400R874C8307a40590d7774n664l90486h2678
9696I9941B2363J387b8020j68177a5136j85558J8959j68326J14964J17383N1837
9685f5877p47J5909j73740H6785l2554a39604N8337c9046B76671h2670m6702L8647
9673i0725E825J2908c11454a2390q3486A55121b36424j42497b8954k17803i5627
9661B2431b72589L109C83613I1779b9133C955d7236A56302b72769e0683A08481
$$ plain form
9649 1341 -328260 -10825 120081 198278 -345694 125795 -39168 223651 267483 -42727 -215997
9638 -215997 140474 224896 -127608 253768 154454 -290066 202529 -65681 -40236 -60597 -19219
9626 12720 11584 -55147 -49879 65977 -273899 -658 99651 -278239 52111 35205 101092 -279492
9613 -749 -44365 -138482 -132539 -195254 -108913 60090 -267356 7480 -221262 -241326 -80627 48360
9600 -90045 171936 -230492 -2207 -82672 -324192 -40415 -12120 -61855 -526563 -237967 -3144
9588 101752 71248 -35489 -22606 -226674 459892 106854 27973 -64124 -66974 -163868 -43625
9576 124019 -109270 692 209782 -125298 -64131 -331528 117796 16065 24094 -84373 -38708
9564 443988 -199096 281658 4291 -116219 -228738 -266041 203322 -84248 -247247 237116
$$ packed form
9649A341c28260a0825A20081P8197c45694A25795c9168B23651M3832d2727j73270
9638b15997A40474Q4422a27608B53768r9314b90066B02529f5681K5445k0361a9219
9626A2720j136e5147N268F5977b73899f58I9651b78239E2111j6906O5887b79492
9613g49m3616r4117N943o2715Q6341F0090b67356G480b21262k0064h0627D8360
9600i0045A71936b30492b207q0465k41520d0415a2120m9735m64708b37967c144
9588A01752l0504c5489J2883k04068D59892A06854B7973f4124k850r6894d3625
9576A24019a09270F92K09090a25298O1167k67397A17796A6065Q029h4373c8708
9564D43988a99096B81658D291a16219j12519l7303B03322h4248j62999B37116
$$ plain form
9553 -421049 -65288 -278455 184945 38747 -54457 -289351 72274 -118837 -15881 -238390 48911
9541 -298894 -225629 166751 -347109 -36583 185210 276115 202500 100667 -219132 -79019 -255133
9530 -255133 -257581 -114866 -156044 -299643 123196 -174674 -65828 106066 -99308 108444 79394
9519 79394 -78574 -317303 -149471 -256616 -266258 -52353 7731 13765 -93178 -377858 -15056 -46445
9507 -46445 -217488 -277197 -201143 -98474 100745 -31244 -209527 53013 -45791 -171436 -64899
9495 -246292 6324 133600 230327 196227 -59605 55940 -10939 159332 -139520 -191019 -90442
9483 77781 -13764 -75165 -214065 66007 -227678 1379 -202952 -167705 84138 31127 55276
9472 55276 -135820 86905 83334 -106859 244747 -42203 101825 142190 27933 -66114 -208732
$$ packed form
9553d21049f5288k13167A84945C8747e4457k34894G2274a18837a5881k22509D8911
9541b98894P3265A66751c47109c6583A85210R0905p3615A00667b19132g9019j76114
9530b55133k448a14866m1178j43599A23196a74674f5828A06066i9308A08444k9050
9519G9394g8574k38729a49471j07145r642e2353G731O034i3178k84680a5056l1389
9507d6445j71043n9709P6054i8474A00745c1244j78283E3013d5791j25645f4899
9495b46292F324J27276R6727l4100e9605E5940a0939A59332a39520n1499i0442
9483G7781a3764o1401j38900F6007b27678A379b02952L5247H4138C1127K4149
9472E5276a35820H6905l571a06859B44747d2203A01825M0365B7933f6114j42618
$$ plain form
9461 -208732 -456501 -88395 -22050 470250 -88880 299745 -81517 -174418 20667 -37196 138810
9449 -203293 -35179 -215181 -239182 -133145 165640 291112 59343 -62193 261854 -101405
9438 16655 185398 -272283 361846 43236 -180758 -302707 230248 -20277 -140240 -66540
9427 -5718 -158126 -10546 -99454 103125 116933 6939 200522 178694 -218626 -171905 -238690
9416 -238690 -16273 -380981 63287 56621 10138 -262223 -27403 -316662 -389745 -115703 -221768
9405 -221768 -31348 4093 8651 8035 -112783 -6286 -27444 -185631 -5925 164029 71949 152959
9393 152959 -477417 -113554 -106898 -113441 -66128 122994 -392607 -198675 -305051 -62717 -205641
9382 -205641 -57628 -45802 -293744 -88636 -32787 -61774 -113706 -184622 181558 175369 -288163
$$ packed form
9461b08732k47769h8395b2050D70250h8880B99745h1517r2901B0667c7196A38810
9449b03293c5179j80002k4001J06037A65640J25472E9343f2193B61854a01405
9438A6655J68743b72283C61846D3236a80758j21949B30248b0277j19963f6540
9427e718j52408a0546q8908A03125J3808F939J93583k1828b18626M6721o6785
9416b38690a6273l64708F3287o666A0138b62223b7403k89259p3083a15703j06065
9405b21768c1348D093M558o16a12783f286k1158j58187e925A64029G1949Q1010
9393A52959d77417a13554O656o543M7313A22994c92607J93932j06376f2717j42924
9382b05641e7628J1826k47942h8636c2787k8987n1932p0916A81558o189b88163
$$ plain form
9370 -20465 -311026 -222490 -27462 -246264 23387 -121625 112622 -30060 -88127 -140706 47308
9358 40963 -107126 -204852 -294114 -201319 -359240 -99072 186712 -189235 -251355 -123289 56079
9346 -102200 -265586 -350240 240671 -225877 47038 -148071 -2693 -34118 34213 -142662 -177625
9335 -177625 -114314 89926 -210223 259909 -302113 -231459 222705 -232238 -263590 -114372
9324 279168 -192553 274810 257023 155333 -81333 -146740 404348 -225757 27773 288540
9314 288540 -86008 -176109 97614 84150 82229 -44444 -279897 -275941 32131 -175669 -78436 -23459
9301 105549 26239 132420 -253588 -143259 35651 -93706 -193297 50472 63853 -246965 -202236
9290 -202236 94342 284000 -32903 4184 6513 60158 -300218 -12753 110042 19101 61107
$$ packed form
9370b0465k90561Q8536b7462k18802B3387a21625A12622c0060n8067n2579D7308
9358D0963a07126r7726q9262R2795j57921i9072A86712a89235o2120a23289E6079
9346a02200j63386q4654B40671b25877D7038a48071b693l1425C4213a42662l4963
9335a77625O3311H9926b10223B59909c02113P0654B22705b32238l1352a14372
9324B79168a92553B74810j7787j01690h1333o5407D04348b25757B7773K60767
9314B88540h6008r0101I7614j3464j921d4444k35453L956C2131a75669g8436b3459
9301A05549B6239J06181b53588J10329C5651i3706r9591E0472J3381b46965M4729
9290b02236I4342J89658c2903D184K329N3645c00218a2753A10042A9101M2006
$$ plain form
9279 61107 93365 -154034 -432 106233 -147808 -40487 60753 9638 -228652 -163503 -25157 -530289
9267 -530289 -71036 71217 14824 32059 -37717 234965 118396 -25322 217511 -33135 269587
9255 249157 271957 -31032 7086 131383 -17940 -81259 -163614 -249181 139846 -106081 272033
9243 -64596 79374 -166439 -396216 -158064 -321936 -126894 -28890 -248464 255719 107320
9232 -122787 40881 -123762 86389 -179848 2198 142858 -58191 -78354 -173574 -263128 20666
9220 -426972 -132547 -311767 -294205 -350039 148282 -83572 -466774 -140267 26346 -134588
9209 43897 73914 -431100 76974 50781 219232 -139282 -167005 -77960 210438 37252 -108308
9197 -53264 -239216 98734 28097 -182845 78680 -66325 -334583 -9313 143513 -113812 -316533
$$ packed form
9279F1107L2258a54034d32A06233a47808d0487F0753I638b28652O5149b5157n05132
9267e30289g1036G1217A4824J7235c7717B34965j16569b5322B17511c3135B69587
9255B49157K2800c1032G086J24297a7940o3319q2355q5567A39846a06081B72033
9243f4596G9374a66439k29777a58064j63872a26894b8890k19574B55719A07320
9232a22787D0881a23762H6389a79848B198J40660e8191k0163r5220q9554B0666
9220d26972a32547j79220J7562n5834A48282h3572l83202a40267B6346a34588
9209D3897L0017d31100G6974k6193J68451a39282k7723g7960B10438C7252a08308
9197e3264j85952I8734B8097a82845G8680f6325k68258i313A43513a13812k02721
$$ plain form
9186 -316533 290494 -128771 18032 -239108 -165866 105685 -227087 -332337 -324555 -233790 -88327
9174 134333 165941 -88857 -136403 -256745 320234 -399029 -51227 -310019 104153 -152914
9163 -263884 -471456 -52428 54018 47081 65976 -78333 -92399 -159565 -274891 -121608 29200
9151 -172766 50479 75004 77282 -124174 -2839 90013 183255 -246728 -24373 -218222 -112355
9140 -112355 40631 487571 173701 108675 -30650 -88101 -281547 41878 -250664 -166575 -189327
9129 -189327 -23897 6450 153911 39763 29679 309844 128231 52844 83383 -56818 4640
9117 63694 -358610 -55465 71144 -187605 -156267 -79199 83309 -158842 272654 -145173 44630
9105 36123 -53987 -73538 -201170 -186318 100037 -345960 145566 -113623 106056 -90827 225704
$$ packed form
9186c16533B90494a28771A8032b39108P3242A05685b27087j05250P782R0765h8327
9174A34333L1608h8857m7546j20342C20234c99029e1227k58792A04153a52914
9163b63884k07572e2428E4018o937J8895g8333j4066o7166j15326a21608B9200
9151a72766E0479K4525K278a24174b839I0013R3242b46728b4373j93849J05867
9140a12355D0631M46940A73701o5026c0650n7451j93446D1878b50664Q4089k2752
9129a89327b3897F450J47461C9763j0084K80165A28231E2844L0539e6818D640
9117F3694c58610e5465G1144a87605L1338P7068H3309a58842B72654a45173D4630
9105C6123e3987j9551j27632J4852A00037c45960A45566a13623A06056i0827B25704
$$ plain form
9093 211176 -242096 233330 -70631 -47286 -308093 74144 72493 102969 -160911 -19164 144976
9081 -96952 44294 5988 39377 -62052 -156906 37026 124628 5034 -52698 49128 56855 -6786 239653
9067 73069 234681 -70632 -110550 16140 -145491 -52808 200587 104230 -152972 -292560 -60094
9055 -55496 -56750 44133 39525 11625 -288776 -55401 81812 246883 -381830 116347 276734
9044 276734 10848 -4038 -258985 -94272 -286328 -173062 -197649 107646 -389481 -270330 245223
9032 -207721 -67483 -241934 -84824 -222455 -200901 107463 -102380 -411178 -321296 -156661
9021 235715 -219978 20266 -78962 -98554 -94836 -158189 -272922 -14380 -4122 -83429 -121402 39648
9008 106398 -342907 219617 -293643 -306490 107593 221066 34126 -239078 61063 -214683
$$ packed form
9093B11176b42096B33330g0631K3345k60807G4144j651L0476a60911a9164A44976
9081i6952D4294E988L3389f2052r4854C7026Q7602E034e2698D9128P727f786B39653
9067G3069J61612g0632l9918A6140a45491e2808B00587r6357a52972j39588f0094
9055e5496j254D4133m608A1625b88776e5401H1812J65071c81830A16347J60387
9044B76734A0848d038k54947i4272j92056J13266k4587A07646c89481J19151B45223
9032b07721f7483j74451h4824j37631K1554A07463a02380l08798Q9882a56661
9021B35715b19978B0266g8962j9592L718o3353j14733a4380d122p9307l7973C9648
9008A06398c42907B19617b93643j2847A07593J13473C4126b39078F1063b14683
$$ plain form
8997 -103490 -159636 -37798 -103889 -187963 -133853 192705 15523 -72456 -70388 -37010 19629 -47923
8984 -80441 -643 -109435 -170267 -33828 12748 210831 35138 -154990 181371 223962 -156097
8972 -4324 -39833 -54785 -112232 -284947 -198424 308944 -51863 -36540 -101088 -375646 73486
8960 98856 -309786 12468 175345 26365 -248874 -92087 -420053 -244387 -163395 -130747 28778
8948 226080 -180478 61689 235622 304897 -194781 119056 192224 -97942 -75361 11386 -152169
8936 -144130 -40145 -157556 -119520 -280026 239782 133058 81603 81833 94182 9441 106024
8925 106024 -190657 -205882 -127622 115345 -145285 -12068 -239076 1829 260760 -97988 179386
8913 115287 28264 374121 89438 533444 921434 1476461 2162440 4636067 10738266 5441978
$$ packed form
8997a03490n6146c7798o6091q4074N4110A92705A5523g2456K068L3378A9629d7923
8984h0441f43j08792o0832c3828A2748J98083C5138a54990A81371M2591a56097
8972d324l5509j4952n7447j72715Q6523C08944e1863J5323o4548k74558G3486
8960I8856c09786A2468J62877B6365b48874i2087l27966J75666Q0992L2648B8778
8948B26080a80478F1689J73933O9275a94781A19056P3168i7942K2581A1386a52169
8936a44130d0145j17411L8036j60506B39782j06724n1455K30J2349I441R6583
8925A06024a90657j5225P8260A15345a45285a2068k27008A829K58931i7988A79386
8913A15287B8264L45857H9438M44006L87990N55027O85979K473627O102199n296288
$$ plain form
8903 5441978 3365076 2683291 1644736 1293065 769217 718044 620859 624847 286864 628600
8893 628600 95970 621416 374032 64764 268879 -60323 231028 26155 -148192 92525 157891
8882 157891 161013 -115836 -235626 122115 117057 -64091 63431 -135434 26030 -303848 -251261
8871 -251261 5557 72402 172705 18775 -89728 73380 54886 127203 -37420 -343170 -89489
8859 -211635 41705 -191865 -334334 127905 157230 284318 11289 -288507 -308513 -361376 -148415
$$ packed form
8903E441978k076902o81785j038555l51671n23848n1173r7185L988B86864L41736
8893F28600I5970N25446k47384F4764K04115f0323B31028B6155a48192I2525O5366
8882A57891L122a15836j19790A22115n058f4091F3431a35434B6030c03848N2587
8871b51261E557O6845J00303A8775h9728G3380j8494P2317c7420l05750h9489
8859b11635D1705a91865j42469A27905K9325J27088A1289b88507k0006n2863a48415
$$ [...]
##END NTUPLES=NMR SPECTRUM
##END=
