
##TITLE=UV1021_M2-1005-1001_6269357_e63KVcrhmi
##JCAMPDX= 6.0         $$ Bruker NMR JCAMP-DX V2.0
##DATA TYPE= NMR SPECTRUM
##DATA CLASS= NTUPLES
##ORIGIN= BRUKER
##OWNER= Administrator
$$ 1.72 TOPSPIN		Version 2.1
$$ 2012-06-02 02:53:28.375 -0500  Administrator@TOPSPIN
$$ Compression mode = diff/dup
##.OBSERVE FREQUENCY= 400.13188235
##.OBSERVE NUCLEUS= ^1H
##.ACQUISITION MODE= SIMULTANEOUS (DQD)
##.ACQUISITION SCHEME= undefined
##.AVERAGES= 64
##.DIGITISER RES= 22
##SPECTROMETER/DATA SYSTEM= spect
##.PULSE SEQUENCE= noesygpps1d.comp
##.SOLVENT NAME= COFFEE_calctemp
##.SHIFT REFERENCE= INTERNAL, COFFEE_calctemp, 1, 14.96717
##AUDIT TRAIL= $$ (NUMBER, WHEN, WHO, WHERE, PROCESS, VERSION, WHAT)
$$ ##TITLE= Audit trail, TOPSPIN		Version 2.1
$$ ##JCAMPDX= 5.01
$$ ##ORIGIN= Bruker BioSpin GmbH
$$ ##OWNER= Administrator
$$ $$ C:\Bruker\TOPSPIN/data/COFFEE/nmr/UV1021_M2-1005-1001_6269357_e63KVcrhmi/12/pdata/1/auditp.txt
$$ ##AUDIT TRAIL=  $$ (NUMBER, WHEN, WHO, WHERE, PROCESS, VERSION, WHAT)
(   1,<2012-06-02 02:53:22.812 -0500>,<Administrator>,<TOPSPIN>,<go>,<TOPSPIN 2.1>,
      <created by zg
	started at 2012-06-02 02:41:52.500 -0500,
	POWCHK enabled, PULCHK disabled,
       configuration hash MD5:
       D5 CA 7A 23 FE 6B EE E2 50 67 74 61 24 F7 5E 3B
       data hash MD5: 64K
       24 63 0E A9 AA 9A 4B 8D DD EC 59 C6 51 78 54 D7>)
(   2,<2012-06-02 02:53:25.718 -0500>,<Administrator>,<TOPSPIN>,<proc1d>,<TOPSPIN 2.1>,
      <Start of raw data processing
       efp LB = 0.3 FT_mod = 6 PKNL = 1 PHC0 = 0 PHC1 = 0 SI = 128K 
       data hash MD5: 128K
       B0 D0 54 58 35 02 B5 7F 31 9D 04 1F 52 EC 8A F9>)
(   3,<2012-06-02 02:53:26.921 -0500>,<Administrator>,<TOPSPIN>,<proc1d>,<TOPSPIN 2.1>,
      <pk PHC0 = 29.76196 PHC1 = 0 
       data hash MD5: 128K
       02 A3 5F 65 43 7A F1 1A A5 58 CA FA 5B FE 37 60>)
(   4,<2012-06-02 02:53:27.718 -0500>,<Administrator>,<TOPSPIN>,<proc1d>,<TOPSPIN 2.1>,
      <abs ABSG = 1 
       data hash MD5: 128K
       59 E7 D3 69 77 41 A2 B4 AC 83 10 DF 73 E6 AE C1>)
(   5,<2012-06-02 02:53:27.796 -0500>,<Administrator>,<TOPSPIN>,<proc1d>,<TOPSPIN 2.1>,
      <abs ABSG = 2 
       data hash MD5: 128K
       A8 6B A8 F7 A1 94 2B E9 3C 93 76 16 6C 80 EA 5F>)
(   6,<2012-06-02 02:53:27.843 -0500>,<Administrator>,<TOPSPIN>,<proc1d>,<TOPSPIN 2.1>,
      <abs ABSG = 3 
       data hash MD5: 128K
       E8 E8 95 47 AB B8 AF E3 10 EB 73 1F 60 8F 27 F1>)
(   7,<2012-06-02 02:53:27.906 -0500>,<Administrator>,<TOPSPIN>,<proc1d>,<TOPSPIN 2.1>,
      <abs ABSG = 4 
       data hash MD5: 128K
       6C 88 E7 8F 3B 8B CF 69 48 15 F1 AC 7C 96 8E 4A>)
(   8,<2012-06-02 02:53:27.968 -0500>,<Administrator>,<TOPSPIN>,<proc1d>,<TOPSPIN 2.1>,
      <abs ABSG = 5 
       data hash MD5: 128K
       7E D6 AB 4F DC D6 41 FD A0 04 C0 3E 28 B2 C3 80>)
$$ ##END=
$$ 
$$ $$ hash MD5
$$ $$ 79 90 54 D9 D0 7C 85 4B FF 3F 1F 89 D6 21 9B 77
##$RELAX= 
##$RELAX= 
##$RELAX= 
##$RELAX= 
##$RELAX= 
##$RELAX= 
##$RELAX= 
##$RELAX= 
$$ [...]
##$TP07= 0
##$TPNAME0= <>
##$TPNAME1= <>
##$TPNAME2= <>
##$TPNAME3= <>
##$TPNAME4= <>
##$TPNAME5= <>
##$TPNAME6= <>
##$TPNAME7= <>
##$TPOAL= (0..7)
0.5 0.5 0.5 0.5 0.5 0.5 0.5 0.5
##$TPOFFS= (0..7)
0 0 0 0 0 0 0 0
##$TUNHIN= 0
##$TUNHOUT= 0
##$TUNXOUT= 0
##$USERA1= <user>
##$USERA2= <user>
##$USERA3= <user>
##$USERA4= <user>
##$USERA5= <user>
##$V9= 5
##$VALIST= <valist>
##$VCLIST= <CCCCCCCCCCCCCCC>
##$VD= 0
##$VDLIST= <DDDDDDDDDDDDDDD>
##$VPLIST= <PPPPPPPPPPPPPPP>
##$VTLIST= <TTTTTTTTTTTTTTT>
##$WBST= 2048
##$WBSW= 25
##$XGAIN= (0..3)
0 0 0 0
##$XL= 0
##$YL= 0
##$YMAX_a= 11794420
##$YMIN_a= -6498031
##$ZGOPTNS= <>
##$ZL1= 120
##$ZL2= 120
##$ZL3= 120
##$ZL4= 120
##$ABSF1= 14.96717
##$ABSF2= -5.585361
##$ABSG= 5
##$ABSL= 3
##$ALPHA= 0
##$AQORDER= 0
##$ASSFAC= 0
##$ASSFACI= 0
##$ASSFACX= 0
##$ASSWID= 0
##$AUNMP= <proc_prof1d_extract.lims>
##$AXLEFT= 0
##$AXNAME= <>
##$AXNUC= <1H>
##$AXRIGHT= 0
##$AXTYPE= 0
##$AXUNIT= <>
##$AZFE= 0.1
##$AZFW= 0.1
##$BCFW= 0
##$BC_mod= 0
##$BYTORDP= 0
##$COROFFS= 0
##$CY= 15
##$DATMOD= 1
##$DC= 0
##$DFILT= <>
##$DTYPP= 0
##$F1P= 0
##$F2P= 0
##$FCOR= 0.5
##$FTSIZE= 131072
##$FT_mod= 6
##$GAMMA= 0
##$GB= 0
##$INTBC= 1
##$INTSCL= 1
##$ISEN= 128
##$LB= 0.3
##$LEV0= 0
##$LPBIN= 0
##$MAXI= 10000
##$MC2= 0
##$MEAN= 0
##$ME_mod= 0
##$MI= 0
##$NCOEF= 0
##$NC_proc= -3
##$NLEV= 6
##$NOISF1= 0
##$NOISF2= 0
##$NSP= 0
##$NTH_PI= 0
##$NZP= 0
##$OFFSET= 14.96717
##$PC= 1
##$PHC0= 29.76196
##$PHC1= 0
##$PH_mod= 1
##$PKNL= yes
##$PPARMOD= 0
##$PPDIAG= 0
##$PPIPTYP= 0
##$PPMPNUM= 2147483647
##$PPRESOL= 1
##$PSCAL= 4
##$PSIGN= 0
##$PYNMP= <proc.py>
##$REVERSE= no
##$SF= 400.130005378263
##$SI= 131072
##$SIGF1= 0
##$SIGF2= 0
##$SINO= 400
##$SIOLD= 131072
##$SPECTYP= <>
##$SREGLST= <1H.CDCl3>
##$SSB= 0
##$STSI= 131072
##$STSR= 0
##$SW_p= 8223.68421052632
##$SYMM= 0
##$S_DEV= 0
##$TDeff= 65536
##$TDoff= 0
##$TI= <>
##$TILT= no
##$TM1= 0
##$TM2= 0
##$TOPLEV= 0
##$USERP1= <user>
##$USERP2= <user>
##$USERP3= <user>
##$USERP4= <user>
##$USERP5= <user>
##$WDW= 1
##$XDIM= 131072
##$YMAX_p= 395158274
##$YMIN_p= -52538826
##$CURPLOT= <Network HP LaserJet P1505>
##$CURPRIN= <$Network HP LaserJet P1505>
##$DFORMAT= <normdp>
##$LAYOUT= <+/1D_H.xwp>
##$LFORMAT= <normlp>
##$PFORMAT= <normpl>
##$SURQMSG= 1
$$ End of Bruker specific parameters
$$ ---------------------------------
##NTUPLES= NMR SPECTRUM
##VAR_NAME=  FREQUENCY,     SPECTRUM/REAL,   SPECTRUM/IMAG
##SYMBOL=    X,             R,               I
##VAR_TYPE=  INDEPENDENT,   DEPENDENT,       DEPENDENT
##VAR_FORM=  AFFN,          ASDF,            ASDF
##VAR_DIM=   131072,        131072,          131072
##UNITS=     HZ,            ARBITRARY UNITS, ARBITRARY UNITS
##FACTOR=    0.0627417313425165, 1,          1
##FIRST=     8223.62146879498, 853,          -110399
##LAST=      0,             4595,            -110861
##MIN=       0,             -52538826,       0
##MAX=       8223.62146879498, 395158274,    0
$$ Real data points
##PAGE= N=1
##DATA TABLE= (X++(R..R)), XYDATA
$$ [...]
63570E88846R923J0982J1894J2582J3358J4592J6103J7423J8470J9556K0781K1895
63558G76405K2819K4036K6227K9596L3653L7618M0886M3052M3812M3200M1845
63547A163149M0486L9090L6857L3137K7921K1433J4152P422K963R22o43l335o217
63534A377337p435p333q227j1120j4529j7014j9038k1352k3218k3575k2916k2448
63522A179132k2162k1291k0023j9108j8095j5882j2987j1245j0815r542o236k625
63510A009121n66R62L971P796R943J0119J0700J2725J4135J3189J1537J2059J5016
63497A130707J8209K0136K1222K2437K4471K8069L3408L8927M2325M3146M3092
63486A466149M3131M1660L6469K7763J8154J0101M171l47m011o632p754p438o536
$$ y = [588846, 598769, 609751, 621645, 634227, 647585, 662177, 678280, 695703, 714173, 733729, 754510, 776405, 799224, 823260, 849487, 879083, 912736, 950354, 991240, 1034292, 1078104, 1121304, 1163149, 1203635, 1242725, 1279582, 1312719, 1340640, 1362073, 1376225, 1383647, 1386610, 1387532, 1386889, 1383554, 1377337, 1369902, 1362569, 1354342, 1343222, 1328693, 1311679, 1292641, 1271289, 1248071, 1224496, 1201580, 1179132, 1156970, 1135679, 1115656, 1096548, 1078453, 1062571, 1049584, 1038339, 1027524, 1017982, 1011746, 1009121, 1008555, 1009517, 1013488, 1021284, 1031227, 1041346, 1052046, 1064771, 1078906, 1092095, 1103632, 1115691, 1130707, 1148916, 1169052, 1190274, 1212711, 1237182, 1265251, 1298659, 1337586, 1379911, 1423057, 1466149, 1509280, 1550940, 1587409, 1615172, 1633326, 1643427, 1647598, 1647251, 1643240, 1636608, 1628854, 1621416, 1614880]
63473A614880o132o845q749j1784j5809k0376k4894k9044l2608l5093l6108l6162
63461A351276l6341l7033l7500l6919l5263l2917l0137k7325k5264k4462k4423
63450A003692k4010k2454j9897j7138j5033j3883j3239j2496j1671j1224j1193
63439H31454j0979j0059q507o705n054m030l923m330m517m344m236m087l107j171
63425G56405M63M84r17k352k686j708J10J919K973L274L408L350K118p49l957
63410G62135n672n632n139n094n121m775m581n210o129n917m039j709n54n55j1
63395G01997K147M716N761N335N382O894Q587R020Q725R147J0422J1625J2733
63382H02491J4783J8064K1363K3499K4708K6128K8445L1394L4113L5623L5282
$$ y = [1614880, 1608748, 1601903, 1593154, 1581370, 1565561, 1545185, 1520291, 1491247, 1458639, 1423546, 1387438, 1351276, 1314935, 1277902, 1240402, 1203483, 1168220, 1135303, 1105166, 1077841, 1052577, 1028115, 1003692, 979682, 957228, 937331, 920193, 905160, 891277, 878038, 865542, 853871, 842647, 831454, 820475, 810416, 801909, 795204, 790150, 786120, 782197, 777867, 773350, 769006, 764770, 760683, 757576, 756405, 756868, 757352, 756435, 754083, 751397, 749689, 749799, 751718, 754691, 757965, 761373, 764723, 766841, 766092, 762135, 756463, 750831, 745692, 740598, 735477, 730702, 726121, 720911, 714782, 708865, 704826, 703117, 702563, 702008, 701997, 704144, 708860, 714621, 719956, 725338, 732232, 740819, 749839, 758564, 767711, 778133, 789758, 802491, 817274, 835338, 856701, 880200, 904908, 931036, 959481, 990875, 1024988, 1060611, 1095893]
63371A095893L3196L0190K7295K5236K4171K3872K4228K5734K9034L3804L8558
63360A411211M2049M4416M6411M7830M7583M5114M0942L5649K9251K1927J4729
63349A827112Q827M362O02k821n472p119q591j1056j4535j7923k0680k3797k8378
63336A700531l3742l7840l9467l9215l8171l6671l4762l3034l2125l1662l0345
63325A313497k7237k2771j8480j5595j3765j1498q125m749k627j148J287M767
63313A193556P664R035R794J1127J3132J5540J8379K1314K3619K5391K7571L0204
63301A406326L2279L3916L6795M1181M4535M4639M2384L9532L5522K8984K1110
63290A807203J4591R880N236K05l713n930p681r773j1761j3821j7103k1470k5132
$$ y = [1095893, 1129089, 1159279, 1186574, 1211810, 1235981, 1259853, 1284081, 1309815, 1338849, 1372653, 1411211, 1453260, 1497676, 1544087, 1591917, 1639500, 1684614, 1725556, 1761205, 1790456, 1812383, 1827112, 1835939, 1840301, 1840903, 1838082, 1832610, 1825491, 1816900, 1805844, 1791309, 1773386, 1752706, 1728909, 1700531, 1666789, 1628949, 1589482, 1550267, 1512096, 1475425, 1440663, 1407629, 1375504, 1343842, 1313497, 1286260, 1263489, 1245009, 1229414, 1215649, 1204151, 1196026, 1191277, 1188650, 1187502, 1188789, 1193556, 1201220, 1210255, 1220049, 1231176, 1244308, 1259848, 1278227, 1299541, 1323160, 1348551, 1376122, 1406326, 1438605, 1472521, 1509316, 1550497, 1595032, 1639671, 1682055, 1721587, 1757109, 1786093, 1807203, 1821794, 1831674, 1836910, 1837115, 1833402, 1827472, 1819791, 1810018, 1798257, 1784436, 1767333, 1745863, 1720731]
63277A720731k7393k9863l3829l8167m0933m1619m0817l8983l6544l4123l1886
63266A326574k9549k7442k6131k4806k1829j7667j5311j6563j9594k1479k1637
63255A084566k1287k0936k0260j9468j9025j8590j7667j6769j6524j6221j4658
63244H83161j2074j0014r483j0199j1195j1308r770p293o004p167r550j1002j0998
63231G57104j0508j0133r769r465r224q367o543m913m911o114o828o466n838n271
63217F52754m215k836k280k889l518l149k067j090o83j193k706m218m149k291
63203F15470k21P38R92J508K286K851L387M287N096M990M140L670M176M966N099
63188F63435M726M968O526Q797J0678J1926J3097J4228J4624J4352J4835J6915
$$ y = [1720731, 1693338, 1663475, 1629646, 1591479, 1550546, 1508927, 1468110, 1429127, 1392583, 1358460, 1326574, 1297025, 1269583, 1243452, 1218646, 1196817, 1179150, 1163839, 1147276, 1127682, 1106203, 1084566, 1063279, 1042343, 1022083, 1002615, 983590, 965000, 947333, 930564, 914040, 897819, 883161, 871087, 861073, 851590, 841391, 830196, 818888, 809118, 801825, 795821, 788654, 779104, 768102, 757104, 746596, 736463, 726694, 717229, 708005, 699638, 693095, 688182, 683271, 677157, 670329, 663863, 658025, 652754, 648539, 645703, 643423, 640534, 637016, 633867, 631800, 630710, 630027, 628834, 626128, 621910, 617761, 615470, 615249, 615987, 616979, 618487, 620773, 623624, 627011, 631298, 636394, 641384, 645524, 649194, 653370, 658336, 663435, 668161, 673129, 679655, 688452, 699130, 711056, 724153, 738381, 753005, 767357, 782192, 799107]
63176G99107J9255K0021J9561J9824K1352K2684K2922K3027K3887K4727K4542
63165A040909K3858K3821K4375K4536K3931K3038K2344K2134K2676K3721K4268
63154A299611K3586K2016K0007J6979J2383P359L868K149M22k552n928q461j0461
63141A380978j2908j5324j5998j4420j2206j1051j0611r364p072n125m343l701
63129A258855j961L63J975L081N103Q093J0189J0394J0435J2536J6241J9019J9581
63116A373904J9153J9323K0082K0403J9856J8892J8096J7611J7005J5421J2276
63105A572022Q104M148Q90k519o896j1583j5179j7413j9495k2436k5737k8202
63093A435704k9522l0339l0865l0248k7805k4376k1742k0724k0641k0657k0816
$$ y = [799107, 818362, 838383, 857944, 877768, 899120, 921804, 944726, 967753, 991640, 1016367, 1040909, 1064767, 1088588, 1112963, 1137499, 1161430, 1184468, 1206812, 1228946, 1251622, 1275343, 1299611, 1323197, 1345213, 1365220, 1382199, 1394582, 1401941, 1405809, 1407958, 1408380, 1405828, 1399900, 1391439, 1380978, 1368070, 1352746, 1336748, 1322328, 1310122, 1299071, 1288460, 1279096, 1272024, 1266899, 1262556, 1258855, 1256894, 1257257, 1259232, 1262313, 1267416, 1275509, 1285698, 1296092, 1306527, 1319063, 1335304, 1354323, 1373904, 1393057, 1412380, 1432462, 1452865, 1472721, 1491613, 1509709, 1527320, 1544325, 1559746, 1572022, 1580126, 1584274, 1585164, 1582645, 1575749, 1564166, 1548987, 1531574, 1512079, 1489643, 1463906, 1435704, 1406182, 1375843, 1344978, 1314730, 1286925, 1262549, 1240807, 1220083, 1199442, 1178785, 1157969]
63082A157969k1151k0539j7611j2783q347o227o246o899p092o628n644m369l230
63069A031203k450j545K16K753N030O106N981N359M919M920N206N366N133M572
63055A082769L796K618J033j24K53K051L758M258M089M242M401L500J650K86L05
63040A118885J195K261L401M108L127L14k156j975L82K456L221L885N116N503
63026A149723L916J804J474K833L653K805J613J603K430K849K747L097M222N146
63012A189915N026M554N389Q094J1125J2402J1838J1645J3654J7059J9657K0949
63000A331307K2721K6361L0886L4364L6364L7980L9972M2056M3932M6034M8842
62989A740819N2069N4797N6311N6651N6572N6820N7200N6600N4364N1467M9772
$$ y = [1157969, 1136818, 1116279, 1098668, 1085885, 1077538, 1071311, 1065065, 1058166, 1051074, 1044446, 1038802, 1034433, 1031203, 1028753, 1027208, 1027424, 1030177, 1035207, 1041313, 1047294, 1052653, 1057572, 1062492, 1067698, 1073064, 1078197, 1082769, 1086565, 1089183, 1090216, 1090092, 1090345, 1092396, 1096154, 1100412, 1104501, 1108743, 1113144, 1116644, 1118294, 1118580, 1118885, 1120080, 1122341, 1125742, 1129850, 1132977, 1133291, 1131135, 1129160, 1129542, 1131998, 1135219, 1139104, 1144220, 1149723, 1153639, 1155443, 1156917, 1159750, 1163403, 1166208, 1167821, 1169424, 1171854, 1174703, 1177450, 1180547, 1184769, 1189915, 1194941, 1199495, 1204884, 1212978, 1224103, 1236505, 1248343, 1259988, 1273642, 1290701, 1310358, 1331307, 1354028, 1380389, 1411275, 1445639, 1482003, 1519983, 1559955, 1602011, 1645943, 1691977, 1740819, 1792888, 1847685, 1903996, 1960647, 2017219, 2074039, 2131239, 2187839, 2242203, 2293670, 2343442]
62978B343442N0118N1646N2944N3196N2177M9909M6760M3332L9673L4964K8504
62967B846665K0751J2872N366k354j0848j9624k7493l3744l8585m2410m5063m6128
62955B619405m5730m4560m3047m0971l8111l4779l1265k7224k2139j6165r943
62944B265471l840J989P056J0811J3498J6050J9085K2561K6163K9231L0641L0002
62932B468718K8879K9439L1525L2600L1198K8832K7444K6385K3593J8651J2862
62921B760126O875J24p481j5177k2826l1136l9832m7095n1644n4301n6537n8381
62909B382715n8761n7498n5880n5289n5843n6517n6253n4793n2587n0136m7681
62898A781477m5493m3921m2862m1624l9826l7997l6643l5156l2658k9665k7834
$$ y = [2343442, 2393560, 2445206, 2498150, 2551346, 2603523, 2653432, 2700192, 2743524, 2783197, 2818161, 2846665, 2867416, 2880288, 2885654, 2883300, 2872452, 2852828, 2825335, 2791591, 2753006, 2710596, 2665533, 2619405, 2573675, 2529115, 2486068, 2445097, 2406986, 2372207, 2340942, 2313718, 2291579, 2275414, 2265471, 2261631, 2263620, 2270676, 2281487, 2294985, 2311035, 2330120, 2352681, 2378844, 2408075, 2438716, 2468718, 2497597, 2527036, 2558561, 2591161, 2622359, 2651191, 2678635, 2705020, 2728613, 2747264, 2760126, 2767001, 2767125, 2759644, 2744467, 2721641, 2690505, 2650673, 2603578, 2551934, 2497633, 2441096, 2382715, 2323954, 2266456, 2210576, 2155287, 2099444, 2042927, 1986674, 1931881, 1879294, 1829158, 1781477, 1735984, 1692063, 1649201, 1607577, 1567751, 1529754, 1493111, 1457955, 1425297, 1395632, 1367798]
62887A367798k7869k8658k8768k7900k6552k5071k3537k2064k0635j9076j7370
62876A100298j5756j4362j3223j2567j2504j2476j1819j0856j0456j0392r366
62865I66521p080n089m760n289m787k775p09l04k059n092p797q971q842q722r260
62850H84985r471q045n145k288p09l91n32n27n86j496l411m947m344j757O61J485
62834H43482J655K510L363K616N69o25O6J233J082k95j350j123j78K23m60j503
62818H51265j854j514j510k393l476m015m268m585m322k924j474j610l084l973
62804H10263l482k923l357l820k926j094J00J38j01MK7m58r57p78j39N3n14j045
62786G88991o82K84P23J82m97l23N04Q14j82k050l590l910l231k629k683k545
$$ y = [1367798, 1339929, 1311271, 1282503, 1254603, 1228051, 1202980, 1179443, 1157379, 1136744, 1117668, 1100298, 1084542, 1070180, 1056957, 1044390, 1031886, 1019410, 1007591, 996735, 986279, 975887, 966521, 959441, 954352, 949592, 944303, 939516, 936741, 936032, 935728, 933669, 928577, 920780, 911809, 902967, 894245, 884985, 875514, 867469, 862324, 860036, 859327, 858936, 858404, 857877, 857291, 855795, 852384, 847437, 843093, 841336, 841997, 843482, 845137, 847647, 851010, 853626, 854195, 853570, 853636, 854869, 855951, 855656, 854306, 853183, 853005, 853228, 852768, 851265, 849411, 847897, 846387, 843994, 840518, 836503, 832235, 827650, 823328, 820404, 818930, 817320, 814236, 810263, 806781, 803858, 800501, 796681, 793755, 792661, 792761, 792899, 792798, 792802, 792829, 792371, 791414, 790636, 790497, 790550, 790036, 788991, 788309, 788593, 789316, 789498, 789001, 788678, 789182, 789996, 789814, 787764, 784174, 780264, 777033, 774404, 771721, 769176]
62770G69176j060J237K350J450Q7j31K24k29j071n51J728M395O415P925Q842Q448
62754H09235O879N550N295N380N077N006O031P758R119R718R861R885J0170J1109
62740I16073J2342J2702J1721J0606J0972J3021J5714J8105J9868K1130K2608
62729A084862K5375K9620L4077L7531M0297M3303M6369M8740N0996N4792O0517
62718A556479O6444P0722P3173P4684P5720P6215P6150P5385P3201O8658O1444
62707B348275N1967M0818K8569J6051M380n641j4103k1901k9971l8536m6980n4277
62695B278651n9544o2406o3281o3321o3665o4525o5138o4700o2965o0026n6088
62684A592992n1832m8305m5824m3466m0332l6905l4279l2411l0275k7679k5631
$$ y = [769176, 768116, 769353, 771703, 773153, 773240, 773109, 773333, 773104, 772033, 771482, 773210, 777605, 784020, 791945, 800787, 809235, 816114, 821664, 826959, 832339, 837416, 842422, 848453, 856211, 865330, 875048, 884909, 894794, 904964, 916073, 928415, 941117, 952838, 963444, 974416, 987437, 1003151, 1021256, 1041124, 1062254, 1084862, 1110237, 1139857, 1173934, 1211465, 1251762, 1295065, 1341434, 1390174, 1441170, 1495962, 1556479, 1622923, 1693645, 1766818, 1841502, 1917222, 1993437, 2069587, 2144972, 2218173, 2286831, 2348275, 2400242, 2441060, 2469629, 2485680, 2490060, 2484419, 2470316, 2448415, 2418444, 2379908, 2332928, 2278651, 2219107, 2156701, 2093420, 2030099, 1966434, 1901909, 1836771, 1772071, 1709106, 1649080, 1592992, 1541160, 1492855, 1447031, 1403565, 1363233, 1326328, 1292049, 1259638, 1229363, 1201684, 1176053]
62673A176053k4515k3084k0097j6151j2909j0958r419p544n669m454l896l412
62661A033945k526j218J54J193K006L423O258J0203J3848J5996J6686J6874J7579
62648A134421J9546K3132K7930L2807L6946M0715M4990M9761N4117N7593O0760
62637A582718O4170O7383O9675P1262P3027P5018P5783P3594O8183O1037N3926
62626B335776M7215L9656K9823J7570M137q868k0376l0106l8419m5864n2502n7743
62614B220299o1187o3309o4802o5531o4944o3417o2066o1088n9360n6226n2616
62603A545753m9743m7530m5170m2462l9764l7197l4803l2859l1270k9253k6616
62592A129086k4571k4061k3945k2322j9290j6784j5787j5278j4179j2841j2099
$$ y = [1176053, 1151538, 1128454, 1108357, 1092206, 1079297, 1068339, 1058920, 1051376, 1045707, 1041253, 1037357, 1033945, 1031419, 1030201, 1030355, 1031548, 1033554, 1036977, 1043235, 1053438, 1067286, 1083282, 1099968, 1116842, 1134421, 1153967, 1177099, 1205029, 1237836, 1274782, 1315497, 1360487, 1410248, 1464365, 1521958, 1582718, 1646888, 1714271, 1783946, 1855208, 1928235, 2003253, 2079036, 2152630, 2220813, 2281850, 2335776, 2382991, 2422647, 2452470, 2470040, 2474177, 2465309, 2444933, 2414827, 2376408, 2330544, 2278042, 2220299, 2159112, 2095803, 2031001, 1965470, 1900526, 1837109, 1775043, 1713955, 1654595, 1598369, 1545753, 1496010, 1448480, 1403310, 1360848, 1321084, 1283887, 1249084, 1216225, 1184955, 1155702, 1129086, 1104515, 1080454, 1056509, 1034187, 1014897, 998113, 982326, 967048, 952869, 940028, 927929]
62581I27929j2039j2161j1829j0387p899n854n880p449q278p378o126n717n319
62568H21613l933k583k858m251m643l192j239l17m48n79RJ059J798J974K265L256
62552H07931M233M019L019L072M899P083Q359R292J0622J1662J1890J2694J5445
62539I14220J8923K0943K1792K3533K6341K8282K8931L0381L3725L7039L8193
62528A222303L7534L6231L3729K8897K2639J7220J3381R735M975o47o041j0517
62516A409439j4127j7480k1156k4893k7570k8464k8104k7483k6913k6269k5701
62505A141279k5292k4537k3172k2020k1965k2339k1515j9065j6192j3995j2438
62494I18749j1276j0819j1069j1033r706p353n209m159m121m369m040k680o34
$$ y = [927929, 915890, 903729, 891900, 881513, 873614, 867760, 861880, 854431, 846153, 838775, 832649, 826932, 821613, 817680, 815097, 812239, 807988, 803345, 800153, 798914, 798597, 798149, 797570, 797579, 798638, 800436, 802410, 804675, 807931, 812164, 816183, 819202, 822274, 827173, 834256, 842615, 851907, 862529, 874191, 886081, 898775, 914220, 933143, 954086, 975878, 999411, 1025752, 1054034, 1082965, 1113346, 1147071, 1184110, 1222303, 1259837, 1296068, 1329797, 1358694, 1381333, 1398553, 1411934, 1421669, 1426644, 1425997, 1419956, 1409439, 1395312, 1377832, 1356676, 1331783, 1304213, 1275749, 1247645, 1220162, 1193249, 1166980, 1141279, 1115987, 1091450, 1068278, 1046258, 1024293, 1001954, 980439, 961374, 945182, 931187, 918749, 907473, 896654, 885585, 874552, 864846, 857493, 852284, 848125, 844004, 839635, 835595, 832915, 832281]
62481H32281J221K344K760K461J267k99q30M90K679M089M457M913O111P420Q138
62466H79502Q537R292J0711J2983J6437K0759K4553K6596K7414K8775L1638L5294
62454A132491L8644M1489M4200M6682M8447M9452N0250N1095N1413N0459M8269
62443A652891M5470M2278L8270L3378K8554K4829K2032J9207J6259J4342J4307
62432A951817J5616J7303J9312K2203K6022L0306L4836L9521M3847M7308N0332
62421B298423N3555N6107N5729N1208M3798L5674K7637J9106R722j01j0136k0890
62409B619832l2729m4844n5585o3831o9821p4379p7512p8367p6825p4397p2606
62398A898936p0999o7942o3264n8643n4993n1044m5461l9201l4413l1724k9981
$$ y = [832281, 833502, 835846, 838606, 841067, 842334, 842035, 841205, 841695, 844374, 848463, 852920, 857833, 863944, 871364, 879502, 888039, 897331, 908042, 921025, 937462, 958221, 982774, 1009370, 1036784, 1065559, 1097197, 1132491, 1171135, 1212624, 1256824, 1303506, 1351953, 1401405, 1451655, 1502750, 1554163, 1604622, 1652891, 1698361, 1740639, 1778909, 1812287, 1840841, 1865670, 1887702, 1906909, 1923168, 1937510, 1951817, 1967433, 1984736, 2004048, 2026251, 2052273, 2082579, 2117415, 2156936, 2200783, 2248091, 2298423, 2351978, 2408085, 2463814, 2515022, 2558820, 2594494, 2622131, 2641237, 2650959, 2650858, 2640722, 2619832, 2587103, 2542259, 2486674, 2422843, 2353022, 2278643, 2201131, 2122764, 2045939, 1971542, 1898936, 1827937, 1759995, 1696731, 1638088, 1583095, 1532051, 1486590, 1447389, 1412976, 1381252, 1351271]
62387A351271k8139k6042k3591k0630j7716j5688j4223j1994q681n749m652n141
62375A169025n889n982n317m387m276o000r013j1161j1077r962r846j0706j0740
62362A064669r361q232q935j0951j2690j3436j3361j2512j0949r414q720q630
62350I37478q327p821p835q204p556n079j808N09J175P11j38q52r42j98R53J801
62334H93867K060J928J688J617K109L379N153O942Q507R801J0743J1306J1635
62321I70735J1798J1823J2172J3515J5673J7481J8363J9188K0672K1872K1635
62310A154927K0936K1997K5141K8204K9479K9781L1182L4872M0764M7896N4571
62299A519750N9168O1658O3609O6279O9600P3135P6517P8318P6080O8938N9136
$$ y = [1351271, 1323132, 1297090, 1273499, 1252869, 1235153, 1219465, 1205242, 1193248, 1184567, 1178818, 1174166, 1169025, 1163136, 1157154, 1151837, 1147450, 1143174, 1137174, 1128161, 1117000, 1105923, 1095961, 1086115, 1075409, 1064669, 1055308, 1047076, 1038141, 1027190, 1014500, 1001064, 987703, 975191, 964242, 954828, 946108, 937478, 929151, 921330, 913495, 905291, 897735, 892656, 890848, 891357, 892532, 893243, 893105, 892253, 891311, 891113, 892066, 893867, 895927, 897855, 899543, 901160, 903269, 906648, 911801, 918743, 927250, 937051, 947794, 959100, 970735, 982533, 994356, 1006528, 1020043, 1035716, 1053197, 1071560, 1090748, 1111420, 1133292, 1154927, 1175863, 1197860, 1223001, 1251205, 1280684, 1310465, 1341647, 1376519, 1417283, 1465179, 1519750, 1578918, 1640576, 1704185, 1770464, 1840064, 1913199, 1989716, 2068034, 2144114, 2213052, 2272188]
62288B272188M9678M1267L2758K3757J5163P505K77p025j4319k1475k8450l4869
62276B336455m0163m4185m7160m9113m9811m9113m7083m4210m1650m0529m0476
62265A842962l9863l8122l6774l7069l7771l6834l4452l2741l2664l3052l2612
62254A451008l1320k9616k7623k5548k3760k2199k0562j9160j8489j7950j6181
62243A198600j2946r692p834p350p275o660m893k017R38K717L272L723M789O102
62229A161474P198Q319R867J1720J3346J4086J3351J1265R053Q024Q268R016R975
62216A294962J1295J2523J2880J2580J2627J3239J3751J4176J5525J8270K1740
62205A453568K5252K8651L1611L3801L5954L9340M3933M8617N3376N9357O6253
$$ y = [2272188, 2321866, 2363133, 2395891, 2419648, 2434811, 2442316, 2442593, 2435568, 2421249, 2399774, 2371324, 2336455, 2296292, 2252107, 2204947, 2155834, 2106023, 2056910, 2009827, 1965617, 1923967, 1883438, 1842962, 1803099, 1764977, 1728203, 1691134, 1653363, 1616529, 1582077, 1549336, 1516672, 1483620, 1451008, 1419688, 1390072, 1362449, 1336901, 1313141, 1290942, 1270380, 1251220, 1232731, 1214781, 1198600, 1185654, 1175962, 1168128, 1160778, 1153503, 1146843, 1141950, 1139933, 1140871, 1143588, 1146860, 1150583, 1155372, 1161474, 1168672, 1176991, 1186858, 1198578, 1211924, 1226010, 1239361, 1250626, 1259679, 1267703, 1275971, 1284987, 1294962, 1306257, 1318780, 1331660, 1344240, 1356867, 1370106, 1383857, 1398033, 1413558, 1431828, 1453568, 1478820, 1507471, 1539082, 1572883, 1608837, 1648177, 1692110, 1740727, 1794103, 1853460, 1919713]
62194A919713P1762P4482P5332P4865P1421O3689N3419M3493L4626K5884J7294
62183B525980R668K571n344j4330k3631l3055m2555n0694n5729n8200o0370o2845
62171B131466o3710o1537n7431n3381n0051m7076m4273m1608l8843l5993l3484
62160A604079l1348k8970k6211k3873k2558k1715k0495j8827j6984j4729j1743
62149A366626q616o552o113o699p248p005n753l771j624K39J780L158M391N496
62135A328309O811Q697J0775J1979J1804J1229J1715J3297J4492J4433J4179J5167
62123A472887J7027J8103J7714J6655J5556J4293J3280J3768J6038J8520J9723
62112A653564K0140K1272K3612K6703L0443L5089M0299M5181M9149N1929N3181
$$ y = [1919713, 1991475, 2065957, 2141289, 2216154, 2287575, 2351264, 2404683, 2448176, 2482802, 2508686, 2525980, 2535648, 2538219, 2532875, 2518545, 2494914, 2461859, 2419304, 2368610, 2312881, 2254681, 2194311, 2131466, 2067756, 2006219, 1948788, 1895407, 1845356, 1798280, 1754007, 1712399, 1673556, 1637563, 1604079, 1572731, 1543761, 1517550, 1493677, 1471119, 1449404, 1428909, 1410082, 1393098, 1378369, 1366626, 1358010, 1351458, 1345345, 1338646, 1331398, 1324393, 1318640, 1314869, 1313245, 1313484, 1315264, 1318422, 1322813, 1328309, 1335120, 1343817, 1354592, 1366571, 1378375, 1389604, 1401319, 1414616, 1429108, 1443541, 1457720, 1472887, 1489914, 1508017, 1525731, 1542386, 1557942, 1572235, 1585515, 1599283, 1615321, 1633841, 1653564, 1673704, 1694976, 1718588, 1745291, 1775734, 1810823, 1851122, 1896303, 1945452, 1997381, 2050562]
62101B050562N2760N0939M7660M2352L5292K8192K2262J6538R622K171m156r609
62089B344585j5920k3087k8865l2045l4111l6727l9386m0731m0750m0308l9570
62078A973085l8192l6290l4158l1627k8743k6323k4840k3409k1119j8890j8468
62067A671026j9725k0285j8318j4777j2202j1881j2700j2478r955n461l17M005
62055A536932O259N819L242P6k441m363o190p444p090n306l763l770n057o700
62041A500204q373j0084j1468j2080j1879j0987r487p890p017o877o387m867k909
62028A389899j067J356M995Q723J0752J1069J1335J2542J4252J6064J8265K0693
62016A518878K2470K3546K5184K8053L0818L1639L0486K9129K9292L1387L4537
$$ y = [2050562, 2103322, 2154261, 2201921, 2244273, 2279565, 2307757, 2330019, 2346557, 2356179, 2358350, 2354194, 2344585, 2328665, 2305578, 2276713, 2244668, 2210557, 2173830, 2134444, 2093713, 2052963, 2012655, 1973085, 1934893, 1898603, 1864445, 1832818, 1804075, 1777752, 1752912, 1729503, 1708384, 1689494, 1671026, 1651301, 1631016, 1612698, 1597921, 1585719, 1573838, 1561138, 1548660, 1538705, 1533244, 1532927, 1536932, 1543191, 1549010, 1552252, 1552328, 1549887, 1545524, 1539334, 1531890, 1524800, 1519494, 1515731, 1511961, 1506904, 1500204, 1491831, 1481747, 1470279, 1458199, 1446320, 1435333, 1425846, 1417956, 1410939, 1404062, 1397675, 1392808, 1389899, 1388832, 1390188, 1395183, 1403906, 1414658, 1425727, 1437062, 1449604, 1463856, 1479920, 1498185, 1518878, 1541348, 1564894, 1590078, 1618131, 1648949, 1680588, 1711074, 1740203, 1769495, 1800882, 1835419]
62005A835419L7098L7749L6821L6121L6682L7090L4962K9715K2970J6437J0475
61994B171539M745q17o125j1273j6227k0713k4847k9519l5526m2376m8196n1092
61982A889573n0785m8943m7575m7027m6029m3919m1874m1121m0831l9247l6426
61971A405796l4065l2591l0395k6578k2642k0325j9263j8097j6637j5413j4251
61960A155539j2968j2564j3850j5539j5653j4392j3576j3474j2547j0468q978
61949A011530r021r220q285o903n995m829k552j32R77J041J201J338O40l54j86
61934I69250J139J952J206m23j831k710l295l994n445p892j0376j1461j0966j0049
61920I05105r505q970q042p197p010p226p217o886o651o750o913o551n196l037
$$ y = [1835419, 1872517, 1910266, 1947087, 1983208, 2019890, 2056980, 2091942, 2121657, 2144627, 2161064, 2171539, 2176284, 2175467, 2169342, 2158069, 2141842, 2121129, 2096282, 2066763, 2031237, 1988861, 1940665, 1889573, 1838788, 1789845, 1742270, 1695243, 1649214, 1605295, 1563421, 1522300, 1481469, 1442222, 1405796, 1371731, 1339140, 1308745, 1282167, 1259525, 1239200, 1219937, 1201840, 1185203, 1169790, 1155539, 1142571, 1130007, 1116157, 1100618, 1084965, 1070573, 1056997, 1043523, 1030976, 1020508, 1011530, 1002509, 993289, 985004, 978101, 972106, 967277, 964725, 964593, 965570, 966611, 967812, 969150, 969790, 969436, 969250, 970389, 972341, 973547, 973124, 971293, 968583, 965288, 961294, 955849, 947957, 937581, 926120, 915154, 905105, 895600, 886630, 878588, 871391, 864381, 857155, 849938, 843052, 836401, 829651, 822738, 816187, 810991, 807954]
61906H07954j039k67r52k314l214k938j619j30P30J108J813L053M139M717N432
61891H16473O883Q727J0583J2804J5524J7829J8988J9721K0992K2522K3924K6275
61879A021245L0462L4571L5469L3064L0659L0690L2168L3024L2696L1450K9120
61868A374618K5965K3338K2035K1090J9202J6242J2435P539K054k113l689l722
61856A514994l704l120o38L097N832O700P221R238J3027J7398K0596K1216J9331
61843A631188J6623J4643J3097J0556O444J472l363p283r748j1041j2271j3847
61831A636470j4742j4379j4194j5627j7493j7556j6208j6008j7574j8574j7598
61820A456517j6444j7180j9047j9923j9396j8635j8253j7980j7734j7519j6662
$$ y = [807954, 806915, 806648, 805696, 803382, 800168, 797230, 795611, 795481, 796211, 797319, 799132, 802185, 806324, 811041, 816473, 823356, 832083, 842666, 855470, 870994, 888823, 907811, 927532, 948524, 971046, 994970, 1021245, 1051707, 1086278, 1121747, 1154811, 1185470, 1216160, 1248328, 1281352, 1314048, 1345498, 1374618, 1400583, 1423921, 1445956, 1467046, 1486248, 1502490, 1514925, 1522464, 1524518, 1522405, 1518716, 1514994, 1511290, 1508170, 1507532, 1510629, 1516461, 1523161, 1530382, 1539620, 1552647, 1570045, 1590641, 1611857, 1631188, 1647811, 1662454, 1675551, 1686107, 1692551, 1694023, 1690660, 1683377, 1673629, 1662588, 1650317, 1636470, 1621728, 1607349, 1593155, 1577528, 1560035, 1542479, 1526271, 1510263, 1492689, 1474115, 1456517, 1440073, 1422893, 1403846, 1383923, 1364527, 1345892, 1327639, 1309659, 1291925, 1274406, 1257744]
61809A257744j4404j0976p202l461N7K730M187N151O552Q377J0277J2771J6575
61796A288378K1276K5907L0362L4839L8458M0244M1323M4018M8323N1307N0968
61785A715403M8810M7287M6176M3318L7967L1502K5083J8560J1887N976J530j786
61773B031713m290n379m557k611p21J176M040P739J0489J0791R295P980P827P814
61759B081306O106J757m747j1917j7971k1832k3984k6109k9304l2878l5404l6707
61747A848316l7983l9937m1717m2041m0733l8628l6590l5158l4569l4366l3357
61736A433237l0783k7396k4687k3226k2456k1897k1524k0918j9194j6296j3556
61725A191304j2269j2179j1967j0850r235q058p992r014j0221j0204q218n046
$$ y = [1257744, 1243340, 1232364, 1225162, 1221701, 1221758, 1224488, 1228675, 1233826, 1240378, 1248755, 1259032, 1271803, 1288378, 1309654, 1335561, 1365923, 1400762, 1439220, 1479464, 1520787, 1564805, 1613128, 1664435, 1715403, 1764213, 1811500, 1857676, 1900994, 1938961, 1970463, 1995546, 2014106, 2025993, 2031969, 2033499, 2031713, 2027423, 2022044, 2017487, 2014876, 2014155, 2015331, 2019371, 2027110, 2037599, 2048390, 2057685, 2065665, 2073492, 2081306, 2087412, 2089169, 2084422, 2072505, 2054534, 2032702, 2008718, 1982609, 1953305, 1920427, 1885023, 1848316, 1810333, 1770396, 1728679, 1686638, 1645905, 1607277, 1570687, 1535529, 1500960, 1466594, 1433237, 1402454, 1375058, 1350371, 1327145, 1304689, 1282792, 1261268, 1240350, 1221156, 1204860, 1191304, 1179035, 1166856, 1154889, 1144039, 1134804, 1126746, 1118754, 1109740, 1099519, 1089315, 1081097, 1076051]
61713A076051k416j427j613j496k2K372M163M392L888M379O316Q309Q966Q684
61699A120546Q930J0229J1558J1713J0687R549R109Q742O793K493k633o108p323
61686A194285q070r847j1888j2723j2584j2741j3201j2853j1740j1324j2019j2072
61674A053223r869o335m017m178n540n797l956j387m97k003l784l128r6K439K235
61659A007310P1j781k247j844j344j219j819l047m032m075l756m300n861p269
61645I64787p522o892o383o558p084p181o412n269m867n837p576q900r175q616
61631H66515p747o983o581o467o223n662n235n361n585n094m011l376l638l949
61617G90603l433k518k261k766l102k704k071j790j584q33L62J220J296R67Q69
$$ y = [1076051, 1073635, 1072208, 1070595, 1069099, 1069077, 1071449, 1075612, 1080004, 1083892, 1088271, 1094587, 1102896, 1111862, 1120546, 1129476, 1139705, 1151263, 1162976, 1173663, 1183212, 1192321, 1201063, 1207856, 1210349, 1207716, 1201608, 1194285, 1186215, 1176368, 1164480, 1151757, 1139173, 1126432, 1113231, 1100378, 1088638, 1077314, 1065295, 1053223, 1043354, 1037019, 1033002, 1028824, 1023284, 1017487, 1013531, 1012144, 1011647, 1009644, 1005860, 1002732, 1002636, 1005075, 1007310, 1007381, 1005600, 1003353, 1001509, 1000165, 998946, 997127, 994080, 990048, 985973, 982217, 977917, 972056, 964787, 957265, 950373, 943990, 937432, 930348, 923167, 916755, 911486, 906619, 900782, 893206, 884306, 875131, 866515, 858768, 851785, 845204, 838737, 832514, 826852, 821617, 816256, 810671, 805577, 801566, 798190, 794552, 790603, 787170, 784652, 782391, 779625, 776523, 773819, 771748, 769958, 768374, 767541, 767903, 769123, 770419, 771386, 772255]
61602G72255J243J914K506K603K094J497J652K793M252N253N681N782N545M800
61588H19870L735K841K557L132M545O137O788O014M686M004M013L728K535Q05
61574H75390p91j812k024j532j024j183j848k442l082m372o006o703n971n023
61560H31577n258o501p370p008n821m802m593n049n404n018m060l321l297l794
61546G60281m382m815n047n262n770o490o740o194n637n941o566o287n208m745
61532F81197n485o487o881o663n660l523j380j476l934n689m296j301L4q35j731
61517F25890j318l55K93P10Q20J54r62j514j424j602k108j793k22J457K179K228
61501F22433K271K258K034J947K131K055J592J692L072M884N591M750L229K017
$$ y = [772255, 773498, 775412, 777918, 780521, 782615, 784112, 785764, 788557, 792809, 798062, 803743, 809525, 815070, 819870, 823605, 826446, 829003, 832135, 836680, 842817, 849605, 855619, 860305, 864309, 868322, 872050, 874585, 875390, 874599, 872787, 870763, 869231, 868207, 867024, 865176, 862734, 859652, 855280, 849274, 842571, 836600, 831577, 826319, 819818, 812448, 805440, 799619, 794817, 790224, 785175, 779771, 774753, 770693, 767372, 764075, 760281, 755899, 751084, 746037, 740775, 735005, 728515, 721775, 715581, 709944, 704003, 697437, 691150, 685942, 681197, 675712, 669225, 662344, 655681, 650021, 646498, 645118, 643642, 639708, 634019, 629723, 628422, 628456, 627621, 625890, 624572, 624217, 624510, 625220, 626040, 626194, 625232, 623718, 622294, 620692, 618584, 616791, 616569, 618026, 620205, 622433, 624704, 626962, 628996, 630943, 633074, 635129, 636721, 638413, 641485, 646369, 651960, 656710, 659939, 661956]
61487F61956J495J594J921J885J280O91Q82J830K765L102L030L145L718M358M301
61472F97953L074R61j133k201j739k28Q59J70j872l070j931K58Q01r91k968k908
61456F85035j015R43J965K319K353J877P39p28j922k324j790q67n47j171j795
61441F83072j172O69K518L662M641O001P058O790N618N200O185P124O338M247
61427G47951K848L071L767L618K960K941L582L729K767J419P23R48J786K948M073
61412G89131M481L717K347J597J882K113R90j169k647k521j842k081l159l953
61398G88886m199m522m774l828j494P21J404P72j97r98j191j6K300L828L133J581
61382G81406J811M115N949N322L213K043K692L786L577K041R35J725L594M246
$$ y = [661956, 663451, 665045, 666966, 668851, 670131, 670822, 671704, 673534, 676299, 679401, 682431, 685576, 689294, 693652, 697953, 701027, 701988, 700855, 698654, 696915, 696687, 697546, 697716, 695844, 692774, 690843, 691101, 691902, 690911, 687943, 685035, 684020, 684963, 686928, 689247, 691600, 693477, 694216, 693488, 691566, 689242, 687452, 686585, 686038, 684867, 683072, 681900, 682569, 685087, 688749, 693390, 699391, 706449, 713239, 718857, 724057, 730242, 737366, 743704, 747951, 750799, 753870, 757637, 761255, 764215, 767156, 770738, 774467, 777234, 778653, 779376, 780324, 782110, 785058, 789131, 793612, 797329, 799676, 801273, 803155, 805268, 806258, 805089, 802442, 799921, 798079, 795998, 792839, 788886, 784687, 780165, 775391, 771563, 770069, 770790, 772194, 772966, 772769, 771771, 770580, 770564, 772864, 776692, 779825, 781406, 783217, 787332, 793281, 798603, 801816, 803859, 806551, 810337, 813914, 815955, 816890, 818615, 822209, 826455]
61368H26455K905J458J868L512M355L891L348L414L636L880M604N376M862K916
61354H76480J203J008J571J386J77j213k153k620k856l087l216k637j031O24Q20
61339H64456m68j647j716j401j488j326p3J600K309J930J476J358R64No74r0J650
61322H66865L419M231M261M682O404Q937J0674J0429Q514O318N035M716M437L488
61308I52410K543L002M955O521O084M418L475L637L628K794J862J458J507K253
61294A000547M241O856Q490Q713Q732R209R262Q329P269O659N686L942K617K588
61280A093140K841K329J921K657L473K680Q73J02P64J248L36j818m678p412q396
61265A090060o651l702k063j917j221Q37K609K646J611Q61Q29J579L330N586P192
$$ y = [826455, 829360, 830818, 832686, 836198, 840553, 844444, 847792, 851206, 854842, 858722, 863326, 868702, 873564, 876480, 877683, 878691, 880262, 881648, 881825, 880612, 878459, 875839, 872983, 869896, 866680, 864043, 863012, 863636, 864456, 863988, 862341, 860625, 859224, 857736, 856410, 856337, 857937, 860246, 862176, 863652, 865010, 865974, 865979, 865305, 865215, 866865, 870284, 874515, 878776, 883458, 889862, 898799, 909473, 919902, 928416, 934734, 939769, 944485, 948922, 952410, 954953, 957955, 962910, 969431, 975515, 979933, 983408, 987045, 990673, 993467, 995329, 996787, 998294, 1000547, 1004788, 1011644, 1020134, 1028847, 1037579, 1046788, 1056050, 1064379, 1071648, 1078307, 1083993, 1087935, 1090552, 1093140, 1095981, 1098310, 1100231, 1102888, 1106361, 1109041, 1109914, 1110016, 1110780, 1112028, 1112364, 1110546, 1105868, 1098456, 1090060, 1083409, 1079707, 1077644, 1075727, 1074506, 1075343, 1077952, 1080598, 1082209, 1083070, 1083899, 1085478, 1088808, 1094394, 1101586]
61250A101586Q021R276J1337J2875J3145J3557J5548J8040J8576J6243J2137P693
61238A258034M018K151K225K576J200j812m536n874o587p538q301q208p647p595
61224A212106q358r380r860r219p445n334l864l084k109m78J239K533L722M926
61210A165395N242M095K729K963M689O095O398O759Q131R832J1131J2693J5084
61197A261236J6951J6437J3815J1123R382P759N557L334J604j03k083l450l304
61184A338258k248j782k542l834m692m856m816n288o580q219r270r124p938o393
61170A260676n161m470l810k410l67J192J685K161L771N630N783M115K693K860
61156A274348L664L828L708M240N205N645N154L826J804j89q06L79K113L163L952
$$ y = [1101586, 1109607, 1118883, 1130220, 1143095, 1156240, 1169797, 1185345, 1203385, 1221961, 1238204, 1250341, 1258034, 1262052, 1264203, 1266428, 1269004, 1270204, 1268392, 1263856, 1257982, 1251395, 1243857, 1235556, 1227348, 1219701, 1212106, 1203748, 1194368, 1184508, 1175289, 1167844, 1162510, 1158646, 1155562, 1153453, 1152975, 1154214, 1156747, 1160469, 1165395, 1170637, 1174732, 1177461, 1180424, 1185113, 1191208, 1197606, 1204365, 1212496, 1222328, 1233459, 1246152, 1261236, 1278187, 1294624, 1308439, 1319562, 1328944, 1336703, 1342260, 1345594, 1347198, 1347095, 1345012, 1341562, 1338258, 1336010, 1334228, 1331686, 1327852, 1323160, 1318304, 1313488, 1308200, 1301620, 1293401, 1284131, 1275007, 1267069, 1260676, 1255515, 1251045, 1247235, 1244825, 1244458, 1245650, 1247335, 1249496, 1253267, 1258897, 1264680, 1268795, 1271488, 1274348, 1278012, 1281840, 1285548, 1289788, 1294993, 1300638, 1305792, 1309618, 1311422, 1311233, 1310427, 1310806, 1312919, 1316082, 1320034]
61141A320034N478P530R222J0532J1969J3216J3563J3310J3456J4159J4591J4147
61129A461207J2832J0741Q199O127N227N012M408L064J275q36l130n041o414q102
61115A494569j0533j2405j2314j1034j0502j0991j1173j0791j1105j2488j3536
61104A367697j3305j2738j3009j3778j3998j3420j2534j1822j1650j2149j2609
61093A226685j1794r282n968k978p58O97J519J926J789K33l260p491j0371j1141
61079A169806j0613r371p314n032l753l368k258J22K128K423K069K842M691O267
61065A148639P064P650Q479R750J1929J5253J8924K1714K3078K3176K2382K1403
61053A339441K1112K1566K1886K1782K2215K3649K4705K3932K2097K1119K1143
$$ y = [1320034, 1325512, 1333042, 1342264, 1352796, 1364765, 1377981, 1391544, 1404854, 1418310, 1432469, 1447060, 1461207, 1474039, 1484780, 1492979, 1499106, 1504333, 1509345, 1513753, 1516817, 1518092, 1517256, 1514126, 1509085, 1502671, 1494569, 1484036, 1471631, 1459317, 1448283, 1437781, 1426790, 1415617, 1404826, 1393721, 1381233, 1367697, 1354392, 1341654, 1328645, 1314867, 1300869, 1287449, 1274915, 1263093, 1251443, 1239294, 1226685, 1214891, 1205609, 1199641, 1196663, 1195905, 1196602, 1198121, 1200047, 1201836, 1202069, 1198809, 1191318, 1180947, 1169806, 1159193, 1149822, 1142508, 1137476, 1133723, 1130355, 1128097, 1128219, 1130347, 1132770, 1134839, 1137681, 1142372, 1148639, 1155703, 1163353, 1171832, 1181582, 1193511, 1208764, 1227688, 1249402, 1272480, 1295656, 1318038, 1339441, 1360553, 1382119, 1404005, 1425787, 1448002, 1471651, 1496356, 1520288, 1542385, 1563504, 1584647]
61042A584647K0219J7031J2471Q291N196K668j17l544p174r938j1144j1296j1471
61029A595839j1928j1840j0491q283o488o177p311q658q704o907m057j415K38
61016A503818R41J561L319O475R493J0596J0371J1492J5248J9716K2338K3076
61004A638444K3600K4550K5443K6599K9039L2361L4668L5253L5840L8263M1911
60993A985971M4525M5102M5035M6330M9258N2205N3628N3558N2859N1647M9535
60982B529653M7297M6744M8390N0438N1082N0734N0961N2185N3866N6109N9571
60971C097030O4148O9213P4877Q1688Q9297R6798J04103J11768J19699J27513
60961D036134J35912J46211J58660J72730J88743K07442K28091K49006K70063
$$ y = [1584647, 1604866, 1621897, 1634368, 1642659, 1647855, 1650523, 1650406, 1646862, 1639688, 1629750, 1618606, 1607310, 1595839, 1583911, 1572071, 1561580, 1553297, 1546809, 1540632, 1533321, 1524663, 1515959, 1509052, 1504995, 1503580, 1503818, 1504759, 1506320, 1509639, 1516114, 1525607, 1536203, 1546574, 1558066, 1573314, 1593030, 1615368, 1638444, 1662044, 1686594, 1712037, 1738636, 1767675, 1800036, 1834704, 1869957, 1905797, 1944060, 1985971, 2030496, 2075598, 2120633, 2166963, 2216221, 2268426, 2322054, 2375612, 2428471, 2480118, 2529653, 2576950, 2623694, 2672084, 2722522, 2773604, 2824338, 2875299, 2927484, 2981350, 3037459, 3097030, 3161178, 3230391, 3305268, 3386956, 3476253, 3573051, 3677154, 3788922, 3908621, 4036134, 4172046, 4318257, 4476917, 4649647, 4838390, 5045832, 5273923, 5522929, 5792992]
60952E792992K92824L18329L47088L81287M24241M77242N40009O14913P07186
60943I896111Q19822R52495J107521J291559J507917J752787K022756K312216
60935B1663184K582664K736822K655936K295967J750385J200121P91810N66887
60927C6243776M96603N47289O79683P98927P57300M47498j03414p46185j317005
60918C7804472j730674j985341k111201k135016k080815j976742j848716j713101
60910B2222866j579594j455744j344631j242686j144932j050815r62428q79688
60902A2562348q01023p27237o61025o02973n50965n03313m59993m20768l84497
60893G450554l50837l20832k95310k74056k56595k42499k30786k20329k10873
$$ y = [5792992, 6085816, 6404145, 6751233, 7132520, 7556761, 8034003, 8574012, 9188925, 9896111, 10715933, 11668428, 12775949, 14067508, 15575425, 17328212, 19350968, 21663184, 24245848, 26982670, 29638606, 31934573, 33684958, 34885079, 35676889, 36243776, 36740379, 37287668, 37967351, 38766278, 39523578, 39971076, 39867662, 39121477, 37804472, 36073798, 34088457, 31977256, 29842240, 27761425, 25784683, 23935967, 22222866, 20643272, 19187528, 17842897, 16600211, 15455279, 14404464, 13442036, 12562348, 11761325, 11034088, 10373063, 9770090, 9219125, 8715812, 8255819, 7835051, 7450554, 7099717, 6778885, 6483575, 6209519, 5952924, 5710425, 5479639, 5259310, 5048437]
60884E048437k02287j93262j82512j71208j62071j55710j49959j43429j37314
60875C550685j32639j27975j21644j14467j08270j02887r6768q9722q3086p7641
60865B495586p3146o9510o6633o3441n8926n4014n0516m8319m5564m1808l8905
60854A884804l8037l7725l5953l2785k9685k7358k5501k3829k2222k0469j8768
60843A572472j7826j7706j7367j6321j5852j7349j9996k1593k1411k0802k0989
60832A365260k1513k1257j9969j8328j7202j7272j8712k0847k2482k2783k1706
60821A143189j9625j7221j5583j5571j6669j7166j5970j3725j1686j0130q603
60810I81240p268o941p631p953o564l798j258K6N25J225K280K970K763J924J102
$$ y = [5048437, 4846150, 4652888, 4470376, 4299168, 4137097, 3981387, 3831428, 3687999, 3550685, 3418046, 3290071, 3168427, 3053960, 2945690, 2842803, 2746035, 2656313, 2573227, 2495586, 2422440, 2352930, 2286297, 2222856, 2163930, 2109916, 2059400, 2011081, 1965517, 1923709, 1884804, 1846767, 1809042, 1773089, 1740304, 1710619, 1683261, 1657760, 1633931, 1611709, 1591240, 1572472, 1554646, 1536940, 1519573, 1503252, 1487400, 1470051, 1450055, 1428462, 1407051, 1386249, 1365260, 1343747, 1322490, 1302521, 1284193, 1266991, 1249719, 1231007, 1210160, 1187678, 1164895, 1143189, 1123564, 1106343, 1090760, 1075189, 1058520, 1041354, 1025384, 1011659, 999973, 989843, 981240, 973972, 967031, 959400, 951447, 944883, 941085, 939827, 939853, 940378, 941603, 943883, 946853, 949616, 951540, 952642]
60795I52642O58O13R35J578K264K574K336J890J733J891J666K72k143m282m901
60780I59726m187l626m254n444n701m499k868k253l198n188p383r131j0000r800
60766H82194q799p765p531q345r531r876q567o015l700l020m117n947p378q017
60752G83586p978p361o356n434m904m532m142m303n533o963o873m894k672j810
60738G09831j971j804q77J91Q63R43K54q53j139J65J917K293J331P85J424K047
60722G15400J635R87J306K277K559J448o66k875m130l776k329j096m84M22K048
60707G12726L209K815J609Q68K29j472l703m466l125j342p37j017j085p63n12
60692G03234l70lO07J251J836K164J796P68n5O9O39L70j353l852n816o161m556
$$ y = [952642, 953300, 953913, 954848, 956426, 958690, 961264, 963600, 965490, 967223, 969114, 970780, 971052, 968909, 964627, 959726, 955539, 951913, 947659, 942215, 936514, 932015, 929147, 926894, 923696, 918508, 911125, 901994, 891994, 882194, 873395, 865630, 858099, 849754, 840223, 830347, 821780, 815765, 812065, 809045, 804928, 798981, 791603, 783586, 775608, 768247, 761891, 756457, 751553, 747021, 742879, 738576, 733043, 726080, 719207, 714313, 711641, 709831, 707860, 706056, 705179, 705370, 706233, 707176, 707430, 706577, 705438, 705603, 707520, 709813, 711144, 711929, 713353, 715400, 717035, 718022, 719328, 721605, 724164, 725612, 724946, 722071, 717941, 714165, 711836, 710740, 710256, 710678, 712726, 715935, 718750, 720359, 721227, 721456, 719984, 716281, 711815, 708690, 707348, 706611, 705594, 704509, 703746, 703234, 702864, 702861, 703468, 704719, 706555, 708719, 710515, 711283, 711228, 711297, 711936, 712306, 710953, 707101, 701285, 695124, 690568]
60675F90568j742O38J115m41k869m850n723n459m375l008j813p39N15J846K674
60660F66337K705K236J558O00m51q05j2J259K049K348K672K905K684K677L910
60645F92672N635N625L311J025R25K009J890M38l65K16O10n33k538l937m077l027
60629F99879j217J98k4j428j931m88J366J619M42m17j64M38N74K91l3j81l4L89
60611F99279P70Q56P89P52N75J02m48j044k225m233o112o431m850k411m65K51
60595F75155k11j097j332m14J151K564L597M366M659M167L086J912P66m77j625
60580F96267k271k324j992j446r75j129k063l016l066k261j333m94O51K050K838
60565F79436K357J017o2j20O59J411J410P04j13p08j199j546j388p39k06q9J41
$$ y = [690568, 688826, 689464, 690579, 690138, 687269, 682419, 676696, 671237, 666862, 663854, 662041, 661302, 661817, 663663, 666337, 669042, 671278, 672836, 673436, 672985, 672180, 672168, 673427, 675476, 677824, 680496, 683401, 686085, 688762, 692672, 698307, 703932, 707243, 708268, 709193, 711202, 713092, 713530, 713165, 713381, 713991, 713458, 710920, 706983, 702906, 699879, 698662, 698860, 698836, 697408, 695477, 694989, 696355, 697974, 698416, 697999, 697835, 698273, 698847, 699138, 699105, 698924, 698890, 699279, 700049, 700905, 701694, 702446, 703021, 703123, 702675, 701631, 699406, 695173, 689061, 682630, 677780, 675369, 674904, 675155, 674944, 673847, 672515, 672101, 673252, 675816, 679413, 683779, 688438, 692605, 695691, 697603, 698369, 697892, 696267, 693996, 691672, 689680, 688234, 687259, 686130, 684067, 681051, 677985, 675724, 674391, 673897, 674548, 676598, 679436, 681793, 682810, 682748, 682628, 683287, 684698, 686108, 686812, 686699, 685991, 684792, 683246, 681858, 681119, 680913, 680824, 680965]
60548F80965R42J881K337K473K837L420L789L755L258K124O58J3J034L103M868
60533G17457N716N806N240M250L759M482N647N704M269K468J428J412K247L551
60519G73436M497M358L393K579K575L565N627Q260J0067J0179R675J0354J2361
60506H60926J4379J5744J6671J6660J4751J1658R554R140Q766P252N616M970M468
60493A000555K914J074O96K055L797M647M286L293L224N744J0544J5010J7153
60480A074992J7948J9519K2151K4802K7632L1675L6382L9765M1171M1780M1855
60469A419672L9630L4007K6572J9507J2885N682j475o578r010j0364j2139j3964
60457A504425j4651j3999j2721j1281r648p907o303m698k611J19L207O492J0179
$$ y = [680965, 681907, 683788, 686125, 688598, 691435, 694855, 698644, 702399, 705657, 707781, 708439, 708452, 709486, 712589, 717457, 723173, 728979, 734219, 738469, 742228, 746710, 752357, 758061, 762330, 764798, 766226, 767638, 769885, 773436, 777933, 782291, 785684, 788263, 790838, 794403, 800030, 808290, 818357, 828536, 838211, 848565, 860926, 875305, 891049, 907720, 924380, 939131, 950789, 960343, 969483, 978249, 985501, 991117, 996087, 1000555, 1003469, 1004543, 1005239, 1007294, 1011091, 1015738, 1020024, 1023317, 1026541, 1032285, 1042829, 1057839, 1074992, 1092940, 1112459, 1134610, 1159412, 1187044, 1218719, 1255101, 1294866, 1336037, 1377817, 1419672, 1459302, 1493309, 1519881, 1539388, 1552273, 1557955, 1556480, 1549902, 1540892, 1530528, 1518389, 1504425, 1489774, 1475775, 1463054, 1451773, 1442125, 1434218, 1427915, 1423217, 1420606, 1420725, 1423932, 1430424, 1440603]
60444A440603J4394J8921K3524K8176L2895L7727M2983M8887N4888N9936O3729
60433A866663O6819O9009O8675O4716N8569N3055M9505M7127M4971M3073M1443
60422B473625L9190L5257K9302K1296J0952j898j6707l2240m6876n9007o7895
60411B384999p4216p8941q1643q1046p7487p3533p1278o9929o7207o2424n7088
60400A590207n2770m9498m6339m2723l8865l5382l2683l0597k8554k6259k4046
60389A182491k2424k1411k0453j8913j6576j3953j2089j1623j1984j1831j0496
60378A010738q703p768q355r938j1042j0144p062l600k135l335n745p644q451
60365I16816q282p213n676m644m563m751m452l912l641l284k235r16m18r40j491
$$ y = [1440603, 1454997, 1473918, 1497442, 1525618, 1558513, 1596240, 1639223, 1688110, 1742998, 1802934, 1866663, 1933482, 2002491, 2071166, 2135882, 2194451, 2247506, 2297011, 2344138, 2389109, 2432182, 2473625, 2512815, 2548072, 2577374, 2598670, 2609622, 2607724, 2591017, 2558777, 2511901, 2452894, 2384999, 2310783, 2231842, 2150199, 2069153, 1991666, 1918133, 1846855, 1776926, 1709719, 1647295, 1590207, 1537437, 1487939, 1441600, 1398877, 1360012, 1324630, 1291947, 1261350, 1232796, 1206537, 1182491, 1160067, 1138656, 1118203, 1099290, 1082714, 1068761, 1056672, 1045049, 1033065, 1021234, 1010738, 1002035, 994267, 985912, 975974, 964932, 954788, 947726, 944126, 941991, 938656, 932911, 925267, 916816, 908534, 901321, 895645, 891001, 886438, 881687, 877235, 873323, 869682, 866398, 864163, 863247, 862829, 861889, 860398]
60350H60398j142R1J540K436K229J098N4m1L96K67n11p42K90J619J788Q25K57
60333H70852J223L235M894N331M638L356K096J443J588K035K286K824M489O656
60319I16946P165N040K382K131M337O202N802M208L366L451L360K776K383K440
60305I71989K338J702J173J802L906O544Q081P564N688M269M552O312Q569J0704
60291A045193J2623J4143J4695J3678J1190Q225N765L557N47l119n493n327m183
60278A111494m466n952o280m745l320l457m039l673l003l231l883l780l209l346
60264A055110m218m811m729m273l352j708pP71R09J675L453N291O458P400Q910
60249A066879J1064J3284J4882J5499J5466J5707J6889J8659J9841J9261J6415
$$ y = [860398, 859256, 859347, 860887, 863323, 865552, 866650, 866704, 866663, 867059, 867326, 866815, 866073, 866363, 867982, 869770, 870595, 870852, 872075, 875310, 880204, 885535, 890173, 893529, 895625, 897068, 898656, 900691, 902977, 905801, 910290, 916946, 924111, 929151, 931533, 933664, 938001, 944203, 950005, 954213, 957579, 961030, 964390, 967166, 969549, 971989, 974327, 976029, 977202, 979004, 982910, 989454, 997535, 1005099, 1010787, 1015056, 1019608, 1025920, 1034489, 1045193, 1057816, 1071959, 1086654, 1100332, 1111522, 1119747, 1125512, 1129069, 1129616, 1126497, 1121004, 1115677, 1111494, 1107028, 1101076, 1094796, 1090051, 1086731, 1083274, 1079235, 1075562, 1072559, 1069328, 1065445, 1061665, 1058456, 1055110, 1050892, 1046081, 1041352, 1037079, 1033727, 1032019, 1032012, 1032783, 1033692, 1035367, 1038820, 1044111, 1050569, 1057969, 1066879, 1077943, 1091227, 1106109, 1121608, 1137074, 1152781, 1169670, 1188329, 1208170, 1227431, 1243846]
60238A243846J1897P235L520Rm888j0944j5798j7801j7804j7243j6126j4405j3621
60225A137877j4991j6774j6021j2620r432q497r237j0502j2006j3090j2199q905
60213I93603n038k676k000k012k269k868l460l520l277l458m237m995n033m214
60199I44546l048k266k192k453k495k296k148j958j268P1J622K711K729J477k23
60184I32809p30P32K921L884L191J985J209Q51P50Q64P75R9m87O1J350J802J056
60167I53122P03J961L939N175N768O796Q268Q953Q066O303N171N786Q113J0979
60153A039103J2956J3562J3378J2933J2033J0583R463R769J1252J2259J1475R388
60141A178154P700P357P652P428O649O110N862N042L529K513K661K812J690j4
$$ y = [1243846, 1255743, 1262978, 1266498, 1266507, 1261619, 1250675, 1234877, 1217076, 1199272, 1182029, 1165903, 1151498, 1137877, 1122886, 1106112, 1090091, 1077471, 1068039, 1059542, 1050305, 1039803, 1027797, 1014707, 1002508, 993603, 988565, 985889, 983889, 981877, 979608, 976740, 973280, 969760, 966483, 963025, 958788, 953793, 948760, 944546, 941498, 939232, 937040, 934587, 932092, 929796, 927648, 925690, 924422, 924493, 926115, 928826, 931555, 933032, 932809, 932079, 932811, 935732, 939616, 942807, 944792, 946001, 946852, 947602, 948466, 949241, 949340, 948853, 948914, 950264, 952066, 953122, 953825, 955786, 959725, 964900, 970668, 977464, 985732, 994685, 1002751, 1009054, 1014225, 1020011, 1028124, 1039103, 1052059, 1065621, 1078999, 1091932, 1103965, 1114548, 1124011, 1133780, 1145032, 1157291, 1168766, 1178154, 1185854, 1193211, 1200863, 1208291, 1214940, 1221050, 1226912, 1231954, 1235483, 1237996, 1240657, 1243469, 1245159, 1245145]
60127A245145o69k25l7m70n23P5K13o88j640j774j684k214k982l061k319j313
60111A225834n14l02j026k337l123k763j886j411j520k048k957l757l388j720
60097A197082l69q06k151k155k01J986K686K169J807K077K280J815J065P66R36
60082A208987Q66J40p14q51o6J232K742M398N937O930P303P346P211O889O558
60067A264908O372N968M968M001M306O042P787Q205P513O950P351Q740J0734J2671
60053A366516J3722J3492J2561J2056J2572J3506J3459J1599Q751O711O039N249
60041A496233L016M63j51J228K162J143n04q41q6J78n20j165j097r73j801l701
60025A493584n810p234p996r014j0826j2675j3409j3063j2637j2520j2281j2042
$$ y = [1245145, 1244476, 1244251, 1244214, 1243744, 1243221, 1243296, 1243509, 1242821, 1241181, 1239407, 1237723, 1235509, 1232527, 1229466, 1227147, 1225834, 1225320, 1225018, 1223992, 1221655, 1218532, 1215769, 1213883, 1212472, 1210952, 1208904, 1205947, 1202190, 1198802, 1197082, 1196713, 1195907, 1193756, 1191601, 1191400, 1193386, 1196072, 1198241, 1200048, 1202125, 1204405, 1206220, 1207285, 1208051, 1208987, 1209853, 1209993, 1209279, 1208428, 1208362, 1209594, 1212336, 1216734, 1222671, 1229601, 1236904, 1244250, 1251461, 1258350, 1264908, 1271280, 1277248, 1282216, 1286217, 1290523, 1296565, 1304352, 1312557, 1320070, 1327020, 1334371, 1343111, 1353845, 1366516, 1380238, 1393730, 1406291, 1418347, 1430919, 1444425, 1457884, 1469483, 1478234, 1484945, 1490984, 1496233, 1499249, 1499712, 1499561, 1500789, 1502951, 1504094, 1503590, 1502749, 1502663, 1502841, 1502321, 1501156, 1500059, 1499086, 1497285, 1493584, 1487774, 1480540, 1472544, 1463530, 1452704, 1440029, 1426620, 1413557, 1400920, 1388400, 1376119, 1364077]
60013A364077j2657j4150j5288j5267j4623j3978j3198j2401j2383j3047j2946
60002A214139j1528j0523j1461j2920j2073q460m480k503k862m559o442p613p783
59989A110932p378o713n435l511j946j425r94N00K270K565J393N18P82J284J427
59974A094269J808K508K178p8l127n068n260m338l022j775j085j241k119l497
59960A070153n149o505o903o555o440o879o933n772l976k873l012l910m836n407
59946I95003n713o124o635o418m675k141q02j638l496m634m524l553k013l20O95
59931I43012Q25J125K334L473L301K451K431L010K660J503J469L035M052K999
59917I77680J322R99J451R30k70m21N01P15l15j025l97O14J093J651K812L459
$$ y = [1364077, 1351420, 1337270, 1321982, 1306715, 1292092, 1278114, 1264916, 1252515, 1240132, 1227085, 1214139, 1202611, 1192088, 1180627, 1167707, 1155634, 1147174, 1142694, 1140191, 1137329, 1132770, 1126328, 1118715, 1110932, 1103554, 1096841, 1091406, 1087895, 1085949, 1084524, 1083530, 1084030, 1086300, 1088865, 1090258, 1090776, 1091558, 1092842, 1094269, 1096077, 1098585, 1100763, 1100685, 1097558, 1092490, 1087230, 1082892, 1079870, 1078095, 1077010, 1075769, 1073650, 1070153, 1065004, 1058499, 1051596, 1045041, 1038601, 1031722, 1024789, 1019017, 1015041, 1012168, 1009156, 1005246, 1000410, 995003, 989290, 983166, 976531, 970113, 965438, 963297, 962495, 960857, 957361, 952727, 948203, 944650, 942637, 942317, 943012, 943837, 944962, 947296, 950769, 954070, 956521, 958952, 961962, 964622, 966125, 967594, 970629, 974681, 977680, 979002, 980001, 981452, 982382, 982112, 981691, 982192, 982907, 982592, 981567, 981170, 981784, 982877, 984528, 987340, 990799]
59901I90799K439O55k7O95J477J383P92L93M15P24R42N31m75j179r68n89j092
59884I96915k102k256j235k45k87j000j436j114m6J482K822L308K978K529K513
59869A002826L047M184N838P354P984P844P705P750P451O743O342O529O561N756
59855A093914M522L795M088N399P421R351J0078R133P248N589M714M385M084L510
59841A177231K843K430K058Q55j452l613m075k885j410l55P04J856K403K177K055
59826A180822K651L641M887O936R615J1318J0810R004Q015Q823J0603J1863J1633
59813A290621J0014Q093P032O919O918O535N990N320M139K604J511J054N67j23
59799A357194l77k38q00k382l651l547k721k109j403j47R73J358J850L269M682
$$ y = [990799, 993238, 993893, 993866, 994561, 996038, 997421, 998213, 998606, 999021, 999745, 1000687, 1001218, 1000743, 999564, 998596, 998007, 996915, 994813, 992557, 991322, 991077, 990790, 989790, 988354, 987240, 987194, 988676, 991498, 994806, 997784, 1000313, 1002826, 1005873, 1010057, 1015895, 1023249, 1031233, 1039077, 1046782, 1054532, 1061983, 1068726, 1075068, 1081597, 1088158, 1093914, 1098436, 1102231, 1106319, 1111718, 1119139, 1128490, 1138568, 1147701, 1154949, 1160538, 1165252, 1169637, 1173721, 1177231, 1180074, 1182504, 1184562, 1185417, 1183965, 1180352, 1176277, 1173392, 1171982, 1171627, 1172331, 1174187, 1176590, 1178767, 1180822, 1183473, 1187114, 1192001, 1198937, 1208552, 1219870, 1230680, 1239684, 1247699, 1256522, 1267125, 1278988, 1290621, 1300635, 1308728, 1315760, 1322679, 1329597, 1336132, 1342122, 1347442, 1351581, 1354185, 1355696, 1356750, 1357317, 1357194, 1356817, 1356579, 1355779, 1353397, 1349746, 1346199, 1343478, 1341369, 1339966, 1339819, 1340792, 1342150, 1344000, 1347269, 1351951]
59784A351951M756L927L449L114J852N6p98n81n18p62q6J558K112l2l802o617
59768A359579o957n262l103k066k700m023m422l340j688o46o89j691l161m139
59754A315692l734k212j040j421l056m606n166n021n075n745o597p115p462q061
59740A249381q693q759q350q125q111p624o612n874n535m711l275k554l267m217
59726A163674m111l449l238l099k342j745k377l486l485k446j700j428o19Q80
59712A131029K224L309M661N664N042L352K941M747O962P604O932O484P010Q150
59698A206111R270R971J0415J1308J2842J3793J2793J0307Q100O917O156N632
59686A323615N816O351O252N859O550P994P937N633L290K758K803J462n07p33
$$ y = [1351951, 1356707, 1360634, 1364083, 1367197, 1369049, 1369105, 1368307, 1367726, 1367208, 1366446, 1366360, 1367918, 1370030, 1369998, 1366196, 1359579, 1352622, 1347360, 1344257, 1342191, 1339491, 1335468, 1331046, 1327706, 1326018, 1325372, 1324683, 1322992, 1319831, 1315692, 1311958, 1309746, 1308706, 1307285, 1304229, 1299623, 1294457, 1289436, 1284361, 1278616, 1272019, 1264904, 1257442, 1249381, 1240688, 1231929, 1223579, 1215454, 1207343, 1199719, 1193107, 1187233, 1181698, 1176987, 1173712, 1171158, 1167891, 1163674, 1159563, 1156114, 1152876, 1149777, 1147435, 1145690, 1143313, 1139827, 1136342, 1133896, 1132196, 1130768, 1130149, 1131029, 1133253, 1136562, 1141223, 1146887, 1151929, 1155281, 1158222, 1162969, 1169931, 1177535, 1184467, 1190951, 1197961, 1206111, 1215381, 1225352, 1235767, 1247075, 1259917, 1273710, 1286503, 1296810, 1304910, 1311827, 1317983, 1323615, 1329431, 1335782, 1342034, 1347893, 1354443, 1362437, 1370374, 1376007, 1379297, 1382055, 1384858, 1386320, 1385813, 1385080]
59672A385080J166L153L526K384N78j128j840r14J004K318K203J399J073J413
59658A401415J675J325Q04R94J889K258J107p33j272L73L174N636P224Q069Q316
59643A442254Q290Q517R003R061Q419P960Q759J0665J2339J2457J0809Q456O845
59630A563834O307N616L653J225J54O38Q80l61k181l133l192l248l670m376n566
59615A556580p301q818r264q858q522q581q570q120p351o402n168l567j676M39
59601A464821K743N007O676P135O345N229N058O098P359P946Q020P819O647M058
59587A550961J269l47j752n169j0328j4013j4221j2805j2764j4466j6175j6998
59575A433192j7381j7334j6140j3865j1698j0506j0101j0199j1154j3232j5692
$$ y = [1385080, 1386246, 1389399, 1392925, 1395309, 1395887, 1394759, 1392919, 1392005, 1393009, 1395327, 1397530, 1398929, 1400002, 1401415, 1403090, 1404415, 1405219, 1406213, 1408102, 1410360, 1411467, 1410734, 1409462, 1409835, 1413009, 1418645, 1425869, 1433938, 1442254, 1450544, 1459061, 1468064, 1477125, 1485544, 1493504, 1502263, 1512928, 1525267, 1537724, 1548533, 1556989, 1563834, 1570141, 1575757, 1579410, 1580635, 1580789, 1581427, 1582307, 1581946, 1579765, 1576632, 1573440, 1570192, 1566522, 1562146, 1556580, 1549279, 1540461, 1531197, 1522339, 1513817, 1505236, 1496666, 1488546, 1481195, 1474793, 1469625, 1466058, 1464382, 1464821, 1467564, 1472571, 1479247, 1486382, 1492727, 1497956, 1503014, 1509112, 1516471, 1524417, 1532437, 1540256, 1546903, 1550961, 1552230, 1551883, 1550131, 1544962, 1534634, 1520621, 1506400, 1493595, 1480831, 1466365, 1450190, 1433192, 1415811, 1398477, 1382337, 1368472, 1356774, 1346268, 1336167, 1325968, 1314814, 1301582, 1285890]
59564A285890j7122j6722j5128j3902j4096j5254j5993j5434j3788j1754r937
59553A126760q835q712r225r579r190p922n905l728k512k906m060m446l619k339
59539A043782j173k02J10p16j717j183O62J366l87k659k792q96O42L38j099k209
59523A031867k207j203j5K62p70k311l335l695l832l841l513k960k570k495k576
59508I96806k608k449k100j807j706j500r99p76j407k195j866n62K31l4j92N46
59492I77382J368J566K026L725N902P067P023O702O779P542R439J2362J5046J6467
59478A080396J7446J9591K2655K4086K1420J4790P192K434K138M250N118L372
59466A224888R72Q5K70j50j257j592n07J021J696J011q23l115n052o371p433q269
$$ y = [1285890, 1268768, 1252046, 1236918, 1223016, 1208920, 1193666, 1177673, 1162239, 1148451, 1136697, 1126760, 1117925, 1109213, 1099988, 1090409, 1081219, 1073297, 1067392, 1063664, 1061152, 1058246, 1054186, 1049740, 1046121, 1043782, 1042609, 1042407, 1042517, 1041801, 1040084, 1038901, 1039563, 1040929, 1040542, 1037883, 1035091, 1034195, 1034837, 1035175, 1034076, 1031867, 1029660, 1028457, 1028442, 1028704, 1027934, 1025623, 1022288, 1018593, 1014761, 1010920, 1007407, 1004447, 1001877, 999382, 996806, 994198, 991749, 989649, 987842, 986136, 984636, 983637, 982861, 981454, 979259, 977393, 976831, 977062, 977028, 976836, 977382, 978750, 980316, 982342, 986067, 991969, 999036, 1006059, 1012761, 1019540, 1027082, 1036521, 1048883, 1063929, 1080396, 1097842, 1117433, 1140088, 1164174, 1185594, 1200384, 1207576, 1210010, 1212148, 1216398, 1221516, 1224888, 1225860, 1225945, 1226215, 1226065, 1224808, 1223216, 1222709, 1223730, 1225426, 1226437, 1225614, 1222499, 1217447, 1211076, 1203643, 1195374]
59450A195374q349p850q106r813j1666j1968j0891r816r080p830n875m291m022
59437A085817m816n646n540m128j975k22N83R37J387J811K086K595L302L369K614
59422A082174K371L751N864O974O733N993N062L579J765M75R4L09P44J042R02
59407A127832P18J433K876L352J969K56PP05R17J116K787N372O660O179N826O737
59391A174742P737P611O955O877P331P631P426O415M201J173j358k554k896l252
59377A228039l753l955l467k195n67M50K41n12o47j42qn56p56N09L345P082J0696
59360A233804J3162J4242J5025J6759J9292K1630K3865K7209L1804L5602L5906
59349A488300L1488K3287J3949O585K769J493P81L24J594N505J0943J5554J6965
$$ y = [1195374, 1187025, 1179175, 1171069, 1161256, 1149590, 1137622, 1126731, 1116915, 1107835, 1100005, 1094130, 1089839, 1085817, 1081001, 1075355, 1069815, 1065687, 1063712, 1063490, 1064073, 1065010, 1066397, 1068208, 1070294, 1072889, 1076191, 1079560, 1082174, 1084545, 1088296, 1094160, 1101134, 1107867, 1113860, 1118922, 1122501, 1124266, 1124741, 1124835, 1125144, 1125888, 1126930, 1127832, 1128550, 1129983, 1132859, 1136211, 1138180, 1138436, 1138443, 1139148, 1140065, 1141181, 1143968, 1149340, 1156000, 1162179, 1168005, 1174742, 1182479, 1190090, 1197045, 1203922, 1211253, 1218884, 1226310, 1232725, 1236926, 1238099, 1236741, 1234187, 1231291, 1228039, 1224286, 1220331, 1216864, 1214669, 1214102, 1214552, 1214793, 1214281, 1213634, 1213492, 1213484, 1212928, 1212172, 1212681, 1216026, 1223108, 1233804, 1246966, 1261208, 1276233, 1292992, 1312284, 1333914, 1357779, 1384988, 1416792, 1452394, 1488300, 1519788, 1543075, 1557024, 1563609, 1566378, 1567871, 1568652, 1568976, 1570570, 1576075, 1587018, 1602572, 1619537]
59336A619537J3630O052k671r016j2241j4323j6620j8124j7519j5343j3142j1530
59324A508690j0122q602p000n460m367m201m763n080m556l653l103l052l311l745
59310A437675l958l254j600j27kr48j373J1K869N527O591O357O400P666R475J0750
59294A482059J1465J2164J2767J2923J3155J4396J6460J8239J9438K0842K2623
59283A656531K3569K2601K0270J8075J6800J5977J4738J2859J0907R261P147L384
59271A832119j615n697p604q711j0963j4034j6142j7013j8014j9589k0600k0542
59259A671595k0465k1062k1433k0615j9138j8199j8228j8881j9542j9319j7612
59248A457101j5224j3973j4397j4683j2748q787m942k679j283J001M771Q738J1186
$$ y = [1619537, 1633167, 1639219, 1636548, 1627532, 1615291, 1600968, 1584348, 1566224, 1548705, 1533362, 1520220, 1508690, 1498568, 1489966, 1482966, 1477506, 1473139, 1468938, 1464175, 1459095, 1454539, 1450886, 1447783, 1444731, 1441420, 1437675, 1433717, 1430463, 1428863, 1428736, 1428734, 1427786, 1426413, 1426424, 1429293, 1434820, 1441411, 1447768, 1454168, 1461834, 1471309, 1482059, 1493524, 1505688, 1518455, 1531378, 1544533, 1558929, 1575389, 1593628, 1613066, 1633908, 1656531, 1680100, 1702701, 1722971, 1741046, 1757846, 1773823, 1788561, 1801420, 1812327, 1821588, 1828735, 1832119, 1830504, 1824807, 1817203, 1808492, 1797529, 1783495, 1767353, 1750340, 1732326, 1712737, 1692137, 1671595, 1651130, 1630068, 1608635, 1588020, 1568882, 1550683, 1532455, 1513574, 1494032, 1474713, 1457101, 1441877, 1427904, 1413507, 1398824, 1386076, 1377289, 1372347, 1369668, 1368385, 1369386, 1374157, 1382895, 1394081]
59235A394081J1747J1143R294M988j951r240j4057j5744j5646j4940j3898j2641
59223A333136j1139q883n791l025j614p88Q53L095M696N673P103Q935J0026J0355
59209A352632J1206J2954J4512J5195J5355J4906J3208J0720R040Q801Q955Q423
59197A495907O927M257N70k590l592l173l430m330l750j411J08p43k249k418j775
59182A478308j531j178J79J734K068J132k61j675k729k860k461k806m008m716
59168A459196m673n477p725r640j0053j0382j1746j2436j0655p964p210q421r421
59155A343393r480r647r978r148o872m658l976m917o504p156n547k235L49P84
59141A264408N02J410L085M152M969O574P971P303N321M939P128R663J0441R861
$$ y = [1394081, 1405828, 1416971, 1426265, 1431253, 1429302, 1420062, 1406005, 1390261, 1374615, 1359675, 1345777, 1333136, 1321997, 1313114, 1307323, 1304298, 1302684, 1301896, 1302749, 1305844, 1310540, 1316213, 1323316, 1332251, 1342277, 1352632, 1363838, 1376792, 1391304, 1406499, 1421854, 1436760, 1449968, 1460688, 1469728, 1478529, 1487484, 1495907, 1502834, 1507091, 1507661, 1505071, 1501479, 1498306, 1494876, 1490546, 1486796, 1485385, 1485493, 1484750, 1482501, 1480083, 1478308, 1476777, 1475599, 1475778, 1477512, 1479580, 1480712, 1480451, 1478776, 1476047, 1473187, 1470726, 1467920, 1463912, 1459196, 1454523, 1449046, 1441321, 1431681, 1421628, 1411246, 1399500, 1387064, 1376409, 1368445, 1361235, 1352814, 1343393, 1333913, 1324266, 1314288, 1305140, 1298268, 1293610, 1289634, 1284717, 1278213, 1271057, 1265510, 1263275, 1263624, 1264408, 1264910, 1266320, 1269405, 1273557, 1278526, 1285100, 1293071, 1300374, 1305695, 1310634, 1317762, 1327425, 1337866, 1347727]
59127A347727R320R115Q772Q108P243O264N307M297K690L45j705k454k629l899
59113A398501o432q571r128q762q749r295r587q859p170n333m047l142k200j885
59099A305341l472o508q415p581n705n570p484r433j0019r571q818q181q140q790
59085A197654r266q810q026p844p863p227o503o830p709p621o620o142o237n162
59071A095794k324M17J286Q73Q75J805K950L789M549N795P966J0812J3145J3774
59057A161506J2870J1842J1763J2588J3801J5059J6042J6365J5915J4871J3579
59046A316201J2651J2661J3120J2448R920P026N690N602M728K154r42l055l717
59033A394487l198k158j725k552l673l542k286j645k446l633m168m548n595o955
$$ y = [1347727, 1357047, 1366162, 1374934, 1383042, 1390285, 1396549, 1401856, 1406153, 1408843, 1409188, 1407483, 1405029, 1402400, 1398501, 1392069, 1383498, 1374370, 1365608, 1356859, 1347564, 1337977, 1329118, 1321948, 1316615, 1312568, 1309426, 1307226, 1305341, 1301869, 1295361, 1286946, 1279365, 1273660, 1268090, 1260606, 1251173, 1241154, 1231583, 1222765, 1214584, 1206444, 1197654, 1188388, 1179578, 1171552, 1163708, 1155845, 1148618, 1142115, 1135285, 1127576, 1119955, 1113335, 1107193, 1100956, 1095794, 1093470, 1093887, 1095173, 1096046, 1096921, 1098726, 1101676, 1105465, 1110014, 1115809, 1123775, 1134587, 1147732, 1161506, 1174376, 1186218, 1197981, 1210569, 1224370, 1239429, 1255471, 1271836, 1287751, 1302622, 1316201, 1328852, 1341513, 1354633, 1367081, 1377001, 1384027, 1389717, 1395319, 1400047, 1402201, 1401259, 1398204, 1394487, 1391289, 1389131, 1387406, 1384854, 1381181, 1377639, 1375353, 1373708, 1371262, 1367629, 1363461, 1358913, 1353318, 1346363]
59019A346363p707p815q036q761r507r495q479p105o460p008q051q524q071p096
59005A234248o204o034o989q484r054q020o486n824n873n692n304n314n323m437
58991A145210l051k522k916k737j194O15J216M13j008k168k368j359K89J633K293
58976A132346K363J832R84R03K329M274N123M999N530P284R111J0301J1681J3893
58962A212953J6021J6918J6866J7056J8062J9382J9844J8146J3861Q346L855J388
58950A382698J13r38j627j586j216j132j257j090k91J315L635N744O216M542J804
58935A396930m27j489j752k051l215n435p665q248o651m193k699k740l488l904
58921A342973l747l490l414k918j036K193N412P319P956Q116Q265Q702J0043J2339
$$ y = [1346363, 1338656, 1330841, 1322805, 1314044, 1304537, 1295042, 1286563, 1279458, 1272998, 1265990, 1257939, 1249415, 1241344, 1234248, 1228044, 1222010, 1215021, 1206537, 1197483, 1189463, 1182977, 1177153, 1171280, 1165588, 1160284, 1154970, 1149647, 1145210, 1142159, 1139637, 1136721, 1133984, 1132790, 1133405, 1134621, 1135034, 1134026, 1131858, 1129490, 1128131, 1128420, 1130053, 1132346, 1134709, 1136541, 1137525, 1138428, 1140757, 1145031, 1150154, 1155153, 1160683, 1167967, 1177078, 1187379, 1199060, 1212953, 1228974, 1245892, 1262758, 1279814, 1297876, 1317258, 1337102, 1355248, 1369109, 1377455, 1381310, 1382698, 1382811, 1381873, 1380246, 1378660, 1377444, 1376312, 1375055, 1373965, 1373674, 1374989, 1378624, 1384368, 1390584, 1395126, 1396930, 1396503, 1395014, 1393262, 1391211, 1387996, 1382561, 1374896, 1366648, 1359997, 1355804, 1353105, 1350365, 1346877, 1342973, 1339226, 1335736, 1332322, 1329404, 1328368, 1330561, 1335973, 1343292, 1351248, 1359364, 1367629, 1376331, 1386374, 1398713]
58907A398713J4207J4150J2559J1204J0873J0709R838Q290O298M018K101J242
58895A504202Q48n51l176n556o765p831j0080j3049j5072j5307j4319j3062j2044
58882A388238j1376j1017j0833j0619j0071q887p169n557m632m236l759k920j917
58869A295245j054o09q33j651k628l493m190m251l085j434j302l333n323m820
58855A257239k338l62J76M36J151J646J647K108L650N636P282Q553R604J0439
58841A306867J1359J2592J3478J3217J2493J2821J4209J5116J5048J5339J6757
58830A459296J8115J8301J8171J9096K0766K1746K1534K0786K0021J9131J7938
58819A674901J6427J4560J2409J0311Q586P332O601O462O658O616N925M583K796
$$ y = [1398713, 1412920, 1427070, 1439629, 1450833, 1461706, 1472415, 1482253, 1490543, 1496841, 1500859, 1502960, 1504202, 1505050, 1504499, 1501323, 1495767, 1489002, 1481171, 1471091, 1458042, 1442970, 1427663, 1413344, 1400282, 1388238, 1376862, 1365845, 1355012, 1344393, 1334322, 1325435, 1318266, 1312709, 1308077, 1303841, 1300082, 1297162, 1295245, 1294191, 1293582, 1292749, 1291098, 1288470, 1284977, 1280787, 1276536, 1273451, 1272017, 1270715, 1267382, 1262059, 1257239, 1254901, 1254539, 1254715, 1255151, 1256302, 1257948, 1259595, 1261703, 1265353, 1270989, 1278271, 1286824, 1296428, 1306867, 1318226, 1330818, 1344296, 1357513, 1370006, 1382827, 1397036, 1412152, 1427200, 1442539, 1459296, 1477411, 1495712, 1513883, 1532979, 1553745, 1575491, 1597025, 1617811, 1637832, 1656963, 1674901, 1691328, 1705888, 1718297, 1728608, 1737194, 1744526, 1751127, 1757589, 1764247, 1770863, 1776788, 1781371, 1784167]
58806A784167Q86p73k143l637n366o682p143p513q992j1725j4910j7924k0296
58793A677949k1066j9611j7110j5828j6629j8252j9155j9051j8433j7607j6736
58782A478471j6136j6085j6604j7357j7657j7009j5989j5773j6267j5688j3061
58771A300845j0084r058r750r877q181n515l274k161k175k532k005n81m1j564
58757A234047l678m141k858j191N53K628L848K771L70r83r29j008j595j696j477
58742A224661k060k919k494j462k275n090p246p368o837o574n692m271m140n430
58728A160803n512l014j03J087J559L056N033O181O899Q174R669J0750J1696J2385
58714A228663J1494Q626N509L633K399R02m54j546l564o690q817q470p163o919
$$ y = [1784167, 1785053, 1784280, 1782137, 1778500, 1773134, 1766452, 1759309, 1751796, 1742804, 1731079, 1716169, 1698245, 1677949, 1656883, 1637272, 1620162, 1604334, 1587705, 1569453, 1550298, 1531247, 1512814, 1495207, 1478471, 1462335, 1446250, 1429646, 1412289, 1394632, 1377623, 1361634, 1345861, 1329594, 1313906, 1300845, 1290761, 1281703, 1271953, 1262076, 1253895, 1248380, 1245106, 1242945, 1240770, 1238238, 1236233, 1235652, 1235611, 1234047, 1230369, 1226228, 1223370, 1222179, 1222732, 1225360, 1229208, 1231979, 1232349, 1231366, 1230437, 1229429, 1227834, 1226138, 1224661, 1222601, 1219682, 1217188, 1215726, 1213451, 1208361, 1201115, 1193747, 1186910, 1180336, 1174644, 1170373, 1166233, 1160803, 1155291, 1152277, 1152174, 1153261, 1154820, 1157876, 1162909, 1169090, 1175989, 1184163, 1193832, 1204582, 1216278, 1228663, 1240157, 1248783, 1254292, 1257925, 1260324, 1261226, 1260772, 1259226, 1255662, 1248972, 1240155, 1231685, 1224522, 1217603]
58700A217603p281o809n829n511n621n273m692m423l975k977k361k762l155k610
58686A154324j972k072j901m33J354K168K625L758M850M843M537N227O435P116
58672A190859P857R556J1102J0846R499R167J0091J0558R601P811N973M672M814
58659A302406O737R234J0864J1631J2085J1825J0494R190Q958Q766O860L400j7
58646A412433k911o160j0121j3974j6678j7585j6928j6507j8498k2365k4620k3127
58634A222959k0070j8801j9508k0164k0116k0077j9686j7924j5379j3662j3004
58623A024568j2455j1837j1405j0287p606m641l576m408n177m965m619m705m676
58610I34211l961k285P22M624P483P840O914P111Q830J0383J0516R199O605L117
$$ y = [1217603, 1210322, 1203513, 1197684, 1192173, 1186552, 1181279, 1176587, 1172164, 1168189, 1165212, 1162851, 1160089, 1156934, 1154324, 1152352, 1150280, 1148379, 1147946, 1149300, 1151468, 1154093, 1157851, 1162701, 1167544, 1172081, 1177308, 1183743, 1190859, 1198716, 1208272, 1219374, 1230220, 1239719, 1248886, 1258977, 1269535, 1279136, 1286947, 1292920, 1297592, 1302406, 1309143, 1318377, 1329241, 1340872, 1352957, 1364782, 1375276, 1384466, 1393424, 1402190, 1409050, 1412450, 1412433, 1409522, 1403362, 1393241, 1379267, 1362589, 1345004, 1328076, 1311569, 1293071, 1270706, 1246086, 1222959, 1202889, 1184088, 1164580, 1144416, 1124300, 1104223, 1084537, 1066613, 1051234, 1037572, 1024568, 1012113, 1000276, 988871, 978584, 970978, 966337, 962761, 958353, 953176, 948211, 943592, 938887, 934211, 930250, 927965, 928687, 933311, 940794, 948634, 955548, 962659, 971489, 981872, 992388, 1001587, 1008192, 1011309]
58596A011309n8k031l531n568p478p930p186o554o378o150n982o177o185n588
58582I34513n187n504n450m318l626m700n851m627j837m38j177k218k533k769
58568H84278k993k466j656j926l131l781l565l432l360k420r58l79o78l83J030
58553H54180K686M129N517O287N759M817M774N017M073K605K683M355N614N784
58539I18280O114O869O623M935L216K360J850J632K518M224N330N762P143R945
58525I86801J2421J3203J3051J3236J3835J4427J5004J5480J5452J4909J4278
58514A142097J3836J3901J4998J6626J6860J4976J3459J5207J9486K3103K4864
58503A329413K6094K7365K7871K8057K9515L1813L2382L0337K7616K5404K2164
$$ y = [1011309, 1011251, 1009220, 1005689, 1000121, 992643, 984713, 977527, 970973, 964595, 958445, 952463, 946286, 940101, 934513, 929326, 923822, 918372, 914054, 910428, 905728, 899877, 895250, 893413, 892975, 891798, 889580, 887047, 884278, 881285, 878819, 877163, 875237, 872106, 868325, 864760, 861328, 857968, 855548, 854590, 854211, 853533, 853150, 854180, 856866, 860995, 866512, 872799, 878558, 883375, 888149, 893166, 897239, 899844, 902527, 906882, 912496, 918280, 924394, 931263, 937886, 942821, 946037, 948397, 950247, 951879, 954397, 958621, 963951, 969713, 976856, 986801, 999222, 1012425, 1025476, 1038712, 1052547, 1066974, 1081978, 1097458, 1112910, 1127819, 1142097, 1155933, 1169834, 1184832, 1201458, 1218318, 1233294, 1246753, 1261960, 1281446, 1304549, 1329413, 1355507, 1382872, 1410743, 1438800, 1468315, 1500128, 1532510, 1562847, 1590463, 1615867, 1638031]
58492A638031J6561J0027M942J910M7j426k937m779o814q806j1199j4474j7854
58479A603229k0077k1295k2699k4406k5404k5475k5434k5459k4899k3760k2692
58468A341629k1596j9832j7665j5955j4726j3548j2820j2878j2617j0898q723
58457A180371p893q161p968p340p572q511q610p496o166n042l914l318l659l750
58443A090971k611j701k710m114l142l02J417J293J188J562R50m74n64J107K514
58428A085384K764L245M810O700Q638J1107J3292J3741J3293J4385J7233J9579
58416A214171K0254K0098J9367J7380J4614J2112R029M060j112l486l421l829
58404A319237n053m867l311k847l432k303N98J886N15l31J422L906N309O399P451
$$ y = [1638031, 1654592, 1664619, 1669561, 1671471, 1671518, 1670092, 1667155, 1662376, 1655562, 1646756, 1635557, 1621083, 1603229, 1583152, 1561857, 1539158, 1514752, 1489348, 1463873, 1438439, 1412980, 1388081, 1364321, 1341629, 1320033, 1300201, 1282536, 1266581, 1251855, 1238307, 1225487, 1212609, 1199992, 1189094, 1180371, 1172478, 1164317, 1156349, 1149009, 1141437, 1132926, 1124316, 1116820, 1110654, 1105612, 1101698, 1098380, 1094721, 1090971, 1088360, 1086659, 1083949, 1079835, 1076693, 1076391, 1077808, 1079101, 1080289, 1081851, 1082801, 1082327, 1081763, 1082870, 1085384, 1088148, 1091393, 1096203, 1102903, 1111541, 1122648, 1135940, 1149681, 1162974, 1177359, 1194592, 1214171, 1234425, 1254523, 1273890, 1291270, 1305884, 1317996, 1327025, 1331085, 1329973, 1326487, 1323066, 1319237, 1314184, 1309317, 1306006, 1303159, 1299727, 1297424, 1298022, 1299908, 1300423, 1300092, 1301514, 1305420, 1310729, 1317128, 1324579]
58389A324579O780M166J951J169J47j734k795k825m010o715q423q345q812j0493
58375A284640j0622p961n177m207l462j729n71n66N75L588N574M923M253N602
58361A274860O708N251L009K411K270M41k209l644m045m469m548m011m085n141
58347A262798n462m420m062n517o680n642l625k509k094j746j874j983k19L344
58333A220309N832N546L978K659J378O75K291N571P064N358K833J493R13J244
58319A267144L705O945P659O201O573R471J0865R202Q080R488J0426R087Q391
58306A373237J0082J1208R942R256J1089J2490J1427J0819J2721J4076J2508J0878
58294A509733J1618J1896R084N949N696O838P275Q353J0452J0127O363M079O440
$$ y = [1324579, 1331359, 1335525, 1337476, 1338645, 1338792, 1337058, 1334263, 1331438, 1327428, 1320713, 1312290, 1303945, 1295133, 1284640, 1274018, 1266057, 1260880, 1256673, 1253211, 1251482, 1250911, 1250345, 1250920, 1254508, 1260082, 1265005, 1269258, 1274860, 1281568, 1286819, 1289828, 1292239, 1294509, 1294950, 1292741, 1289097, 1285052, 1280583, 1276035, 1272024, 1267939, 1262798, 1257336, 1252916, 1248854, 1243337, 1236657, 1231015, 1227390, 1224881, 1222787, 1221041, 1219167, 1217184, 1216965, 1220309, 1226141, 1231687, 1235665, 1238324, 1239702, 1240377, 1242668, 1248239, 1255303, 1260661, 1263494, 1264987, 1265900, 1267144, 1270849, 1277794, 1285453, 1291654, 1298227, 1307698, 1318563, 1327765, 1335845, 1345333, 1355759, 1364846, 1373237, 1383319, 1394527, 1404469, 1413725, 1424814, 1437304, 1448731, 1459550, 1472271, 1486347, 1498855, 1509733, 1521351, 1533247, 1542331, 1548280, 1553976, 1560814, 1568089, 1576442, 1586894, 1597021, 1603384, 1607463, 1613903]
58281A613903R451R342R170J2307J5486J4915J3605J5676J8535J7916J5927J6797
58269A783030J9009J8879J7803J8680J9181J5887J1474J0530J1560J0312P640
58258A943985P130Q112P968Q141J1001J3994J3641J2141J3375J5906J6536J6907
58246B088837J9557K1504J9349J6903J9680K5223K7102K5412K5054K6367K5876
58235B340864K4083K4362K5939K5646K4859K7378L2087L4621L4546L4456L4371
58224B663212L3226L3170L6145L9205L9369L9457M2958M7396M9255N0863N5423
58213C129679O0079O1275O1793O5090O8149O7830O8214P3238P8320P8430P7998
58202C890095Q3046R0035R2853R4170R8933J03442J02742J02136J08605J17072
$$ y = [1613903, 1623354, 1632696, 1641866, 1654173, 1669659, 1684574, 1698179, 1713855, 1732390, 1750306, 1766233, 1783030, 1802039, 1820918, 1838721, 1857401, 1876582, 1892469, 1903943, 1914473, 1926033, 1936345, 1943985, 1951115, 1959227, 1967195, 1975336, 1986337, 2000331, 2013972, 2026113, 2039488, 2055394, 2071930, 2088837, 2108394, 2129898, 2149247, 2166150, 2185830, 2211053, 2238155, 2263567, 2288621, 2314988, 2340864, 2364947, 2389309, 2415248, 2440894, 2465753, 2493131, 2525218, 2559839, 2594385, 2628841, 2663212, 2696438, 2729608, 2765753, 2804958, 2844327, 2883784, 2926742, 2974138, 3023393, 3074256, 3129679, 3189758, 3251033, 3312826, 3377916, 3446065, 3513895, 3582109, 3655347, 3733667, 3812097, 3890095, 3973141, 4063176, 4156029, 4250199, 4349132, 4452574, 4555316, 4657452, 4766057, 4883129]
58192D883129J18574J16192J19147J26561J31228J34318J41905J51744J57905
58183F080703J63796J76049J90517J99231K06110K20341K39451K54858K68839
58174G999895K89466L14140L35140L56114L85864M21753M57055M97948N53973
58165A1611348O18970O81872P49031Q33734R31072J026589J122297J229247J341820
58156B0145980J446306J547990J661745J782921J897012K010715K141988K287540
58148C4922197K434333K594823K793527L027084L277946L558731L898631M295318
58140F0802590M730344N224675N826718O557343P428404Q502553R861391J1525948
58132A20459966J3489774J5805444J8521955K1555597K4768212K8112408L1353633
$$ y = [4883129, 5001703, 5117895, 5237042, 5363603, 5494831, 5629149, 5771054, 5922798, 6080703, 6244499, 6420548, 6611065, 6810296, 7016406, 7236747, 7476198, 7731056, 7999895, 8289361, 8603501, 8938641, 9294755, 9680619, 10102372, 10559427, 11057375, 11611348, 12230318, 12912190, 13661221, 14494955, 15426027, 16452616, 17574913, 18804160, 20145980, 21592286, 23140276, 24802021, 26584942, 28481954, 30492669, 32634657, 34922197, 37356530, 39951353, 42744880, 45771964, 49049910, 52608641, 56507272, 60802590, 65532934, 70757609, 76584327, 83141670, 90570074, 99072627, 108934018, 120459966, 133949740, 149755184, 168277139, 189832736, 214600948, 242713356, 274066989]
58125B74066989L3474421L2707423K7706267J8868561Q334613j419749q969973
58118C84768552j4159511j7438257j9272482k0001046j9890706j9182929j8135886
58111B56687735j7025081j6046390j5229417j4495933j3784181j3073722j2332077
58104A54700934j1517782j0635227r732645q847563p995131p198940o485649n851037
58096H6436960n270925m744248m291553l915784l598418l330288l112725k930550
58088E5242469k756343k582574k422401k279685k144648k017821j911374j825379
58080C7302244j746135j668539j598136j531697j458016j378422j305479j240727
58072B5375093j173609j102782j038765r84677r33093q82901q40905q05459p66316
$$ y = [274066989, 307541410, 340248833, 367955100, 386823661, 395158274, 393738525, 384768552, 370609041, 353170784, 333898302, 313897256, 294006550, 274823621, 256687735, 239662654, 223616264, 208386847, 193890914, 180106733, 167033011, 154700934, 143183152, 132547925, 122815280, 113967717, 105972586, 98773646, 92287997, 86436960, 81166035, 76421787, 72130234, 68214450, 64616032, 61285744, 58173019, 55242469, 52486126, 49903552, 47481151, 45201466, 43056818, 41038997, 39127623, 37302244, 35556109, 33887570, 32289434, 30757737, 29299721, 27921299, 26615820, 25375093, 24201484, 23098702, 22059937, 21075260, 20142167, 19259266, 18418361, 17612902, 16846586]
58063A6846586p22426o83088o50019o14859n76261n43165n18459m94618m68302
58054A1575389m44943m26173m06345l84303l65762l51608l35998l18082l03574
58045H238601k92914k79833k63461k50168k41591k32369k21492k14312k11243
58036F031218k05714j95843j87511j83478j79554j73779j69478j67150j62734
58027D405977j55818j50398j46225j38895j29541j24492j23926j20880j13259
58018C202543j06650j03263r8326r0168q3937q2031p9905p4810o9988o7054o2594
58007B283817n5666n0696m9558m8390m5261m3461m4200m3457l9347l5616l4662
57996A793503l3750l1141k9461l0085l0334k8928k8282k9120k8840k7190k7390
$$ y = [16846586, 16124160, 15441072, 14791053, 14176194, 13599933, 13056768, 12538309, 12043691, 11575389, 11130446, 10704273, 10297928, 9913625, 9547863, 9196255, 8860257, 8542175, 8238601, 7945687, 7665854, 7402393, 7152225, 6910634, 6678265, 6456773, 6242461, 6031218, 5825504, 5629661, 5442150, 5258672, 5079118, 4905339, 4735861, 4568711, 4405977, 4250159, 4099761, 3953536, 3814641, 3685100, 3560608, 3436682, 3315802, 3202543, 3095893, 2992630, 2894304, 2804136, 2720199, 2638168, 2558263, 2483453, 2413465, 2346411, 2283817, 2228151, 2177455, 2127897, 2079507, 2034246, 1990785, 1946585, 1903128, 1863781, 1828165, 1793503, 1759753, 1728612, 1699151, 1669066, 1638732, 1609804, 1581522, 1552402, 1523562, 1496372, 1468982]
57985A468982k9659k9933k7065k4948k5467k5798k4585k4380k5679k5105k1753
57974A184610j9175j8840j7905j5502j4707j6092j5990j3580j2998j5653j7260
57963A006908j5528j4147j5825j7716j7368j7015j8141j7737j3964j0115r004
57952H40348q585o927o261q087r260p282m977n632p483p189n194l796l133k507
57938G54035k667l682l589j750m01o81n24J312K836K602K099K204J168j632l759
57923G47571l812l586m245m342l546l981n784n896l466j800k620l273k199j979
57909F97042l951n020l296j912l263m287j915J175R82j358k237j525j394k015
57895F67026k628m199p084q574o689l951l733n275n890n587n791n814m294k216
$$ y = [1468982, 1439323, 1409390, 1382325, 1357377, 1331910, 1306112, 1281527, 1257147, 1231468, 1206363, 1184610, 1165435, 1146595, 1128690, 1113188, 1098481, 1082389, 1066399, 1052819, 1039821, 1024168, 1006908, 991380, 977233, 961408, 943692, 926324, 909309, 891168, 873431, 859467, 849352, 840348, 831763, 824836, 818575, 810488, 801228, 793946, 788969, 783337, 775854, 768665, 763471, 759675, 756542, 754035, 751368, 747686, 744097, 742347, 741946, 741265, 740741, 742053, 744889, 747491, 749590, 751794, 752962, 751330, 747571, 743759, 740173, 735928, 731586, 728040, 724059, 718275, 712379, 708913, 707113, 704493, 701220, 699021, 697042, 693091, 688071, 684775, 682863, 679600, 675313, 673398, 674573, 675555, 674197, 671960, 670435, 669041, 667026, 664398, 660199, 653115, 644541, 637852, 633901, 630168, 624893, 619003, 613416, 607625, 601811, 597517, 595301]
57881E95301j067k5J978L606L606L558M904N756M123K052K805N867Q296R173R214
57866F59147P699L708p97k732k221k176m107o868q977r979j0066r915j0193j0232
57852E92291q621n837m185m191l655j499L59L93k39m94j286k741k977j675j275
57837E54368k395k008J169L684K963J737K866L921J733j229m88L047M871M104
57823E78343L530L781K947J277J137K434K668J591J598L095L509J502j223k928
57809F03261l704l826k924j514j114k251l803m351l124k93K409K694P08m89Q51
57794E82530K565K245J259K202M380N154M301L582L218K173J059J312K171J637
57780F19788k6q27m76l06k85Q57K775L625K846J296p58l194m292k400R94K734
$$ y = [595301, 594234, 594209, 596187, 599793, 603399, 606957, 611861, 617617, 621740, 623792, 626597, 632464, 640760, 649933, 659147, 666846, 670554, 669757, 667025, 664804, 662628, 658521, 651653, 642676, 632697, 622631, 612716, 602523, 592291, 583670, 577833, 573648, 569457, 565802, 564303, 564662, 565055, 564816, 564322, 563036, 560295, 557318, 555643, 554368, 551973, 549965, 551134, 554818, 557781, 559518, 562384, 566305, 568038, 566809, 566321, 569368, 574239, 578343, 581873, 585654, 588601, 589878, 591015, 593449, 596117, 597708, 599306, 602401, 605910, 607412, 606189, 603261, 599557, 595731, 592807, 591293, 590179, 587928, 584125, 579774, 576650, 576357, 578766, 581460, 582168, 581679, 582530, 585095, 587340, 588599, 590801, 595181, 600335, 604636, 608218, 611436, 613609, 614668, 615980, 618151, 619788, 619762, 618935, 618459, 618153, 617868, 618725, 621500, 625125, 627971, 629267, 628509, 625315, 621023, 618623, 619617, 622351]
57764F22351K175J206N41q34k703l262k155j211j652k809l826m564m658l773k833
57749E91993l186m536n582o266p412q607q596p602p080p360p484p043o326n113
57735D99800l417k728m173n973n166j720J450K422K038J797K161L005L870L744
57721D97110K273R02J180K467K994K523K148K290K907M729P890J0197R272N893
57707E54775K845J061n91k289k836j971o87N44J669J779M31m63J128L855M664
57692E63914L391K461K424J436n71j036R78K952K726J434J172J948K379J724J97
57677E87529j432k010j089pl42j505j754j265j747l089l145j334K53J28m89J07
57661E68809J782L354M035L300J035j503k330r66J169K709L289K682Q87q60j020
$$ y = [622351, 624526, 625732, 626273, 625439, 622736, 619474, 617319, 616108, 614456, 611647, 607821, 603257, 598599, 594826, 591993, 588807, 584271, 578689, 572423, 565011, 556404, 547808, 540206, 533126, 525766, 518282, 511239, 504913, 499800, 496383, 493655, 489482, 483509, 478343, 476623, 478073, 480495, 482533, 484330, 486491, 489496, 493366, 497110, 499383, 500285, 501465, 503932, 506926, 509449, 511597, 513887, 516794, 521523, 529413, 539610, 548882, 554775, 557620, 558681, 558090, 555801, 552965, 550994, 550307, 550851, 552520, 554299, 554730, 554267, 555395, 559250, 563914, 567305, 569766, 572190, 573626, 573055, 572019, 572997, 575949, 578675, 580109, 581281, 583229, 585608, 587332, 587529, 586097, 584087, 582998, 582991, 582649, 581144, 579390, 578125, 576378, 573289, 570144, 568810, 569063, 569191, 568702, 568809, 570591, 573945, 577980, 581280, 582315, 580812, 578482, 577516, 578685, 581394, 584683, 587365, 588252, 587392, 586372]
57646E86372K0M44j71m38L35J207J378J017K02j095j901j158J63j3j649k565j842
57629E80306r66j124j722k145k783l524l319k106j205r96m8K555N715Q013R499
57614E86150J1055J3256J6343K0156K3820K6863L0500L6299M3403M8588M8978
57603I05411M3370L1704J5551j101j3940k1665k5603k6692k5274k3350k3687k6110
57591H08614k7399k5682k2609k0460j9385j8288j6456j3733j0738r035r255r458
57579F06116p634n180n027o766p115n056k811j509Q6J803J309j525l564l402l495
57564E56230n333o410m630k199k023l260l615l393m073n014m867m585n706p073
57550D94049o266l486j326j226k363l390l528k565j393j616l351m580m020l101
$$ y = [586372, 586392, 586836, 586665, 586227, 586562, 587769, 589147, 590164, 590366, 589271, 587370, 586212, 586375, 586362, 584713, 582148, 580306, 579340, 578216, 576494, 574349, 571566, 568042, 564723, 562617, 561412, 560416, 560368, 562923, 568638, 576651, 586150, 597205, 610461, 626804, 646960, 670780, 697643, 728143, 764442, 807845, 856433, 905411, 948781, 980485, 996036, 994935, 980995, 959330, 933727, 907035, 881761, 858411, 834724, 808614, 781215, 755533, 732924, 712464, 693079, 674791, 658335, 644602, 633864, 624829, 615574, 606116, 598482, 593302, 588275, 581509, 574394, 569338, 566527, 565018, 565104, 566907, 568216, 566691, 563127, 559725, 556230, 550897, 544487, 539857, 537658, 535635, 532375, 528760, 525367, 521294, 516280, 511413, 506828, 501122, 494049, 487783, 484297, 482971, 481745, 479382, 475992, 472464, 469899, 468506, 466890, 463539, 458959, 454939, 451838]
57536D51838l562m694m723l561k250j046R0L10q82k146j891o14o1q55k162k916
57520D20875k399o87O03n24l589n560m719k827k286l119m093m792m920l586j131
57505C77246J75q75k498k753k277k322k222j257r20k594m634m583k953j960j789
57490C43784r55N79J501J613J672J443L98m40K25J558J916J729K528L890M086
57475C65527L243L064L710L642K553J818J925J815R37j42j220k525l288k413n93
57460C78053K36l34r57j058j544k835m197n354o840q321q328o299l525j660j315
57445C25722k184l311l237j260J368K559J700o4j430j736p29J105K359K166J476
57430C24504J638K422K740K586K622K601K010J609K422L677L690K430J242M64
$$ y = [451838, 448276, 443582, 438859, 435298, 433048, 432002, 432092, 432402, 431520, 429374, 427483, 426869, 426808, 425953, 423791, 420875, 418476, 417789, 418392, 417868, 414279, 408719, 404000, 401173, 398887, 395768, 391675, 386883, 381963, 378377, 377246, 377421, 376546, 374048, 371295, 369018, 366696, 364474, 363217, 362297, 359703, 355069, 350486, 347533, 345573, 343784, 342829, 343408, 344909, 346522, 348194, 349637, 350035, 349595, 349820, 351378, 353294, 355023, 357551, 361441, 365527, 368770, 371834, 375544, 379186, 381739, 383557, 385482, 387297, 388234, 388092, 386872, 384347, 381059, 378646, 378053, 378289, 377955, 376998, 375940, 374396, 371561, 367364, 362010, 355170, 346849, 338521, 332222, 328697, 327037, 325722, 323538, 320227, 316990, 315730, 317098, 319657, 321357, 321293, 319863, 318127, 317398, 318503, 320862, 323028, 324504, 326142, 328564, 331304, 333890, 336512, 339113, 341123, 342732, 345154, 348831, 352521, 354951, 356193, 356657]
57416C56657o73k052k673k513k356j929k91J942K901K140R97J90q49k015k203
57401C47273j522j698l362m692l801j155J301K346K089J318Q72J032J287J219
57387C42507J314K074K730K121N88k62L70J824L100L476K506O55m19L20J723K093
57371C66720J710J915K471J992O69J84R35J620J678J960K613K571J718J451K343
57356C92550L052K338N94j194k544l025k223p15L23Q09J631K693K854K040J626
57341D00809K193K711K432J877J385N44l55k19Q50J281O73P49K641M951N771M917
57325D33210L069M62k006k120J120N228O526M338J339J31Q96K343L469L923L633
57310D65561K778J996K154L542N256N771M591K926K249K624L114L287L346L320
$$ y = [356657, 355984, 353932, 351259, 348746, 346390, 344461, 344170, 346112, 349013, 351153, 352150, 352340, 351491, 349476, 347273, 345751, 344053, 340691, 335999, 332198, 331043, 332344, 334690, 336779, 338097, 338969, 340001, 341288, 342507, 343821, 345895, 348625, 350746, 351334, 351072, 351442, 353266, 356366, 359842, 362348, 363003, 362584, 362904, 364627, 366720, 368430, 370345, 372816, 374808, 375477, 375661, 376596, 378216, 379894, 381854, 384467, 387038, 388756, 390207, 392550, 395602, 397940, 398534, 397340, 394796, 391771, 389548, 388833, 389156, 389965, 391596, 394289, 397143, 399183, 400809, 403002, 405713, 408145, 410022, 411407, 411951, 411596, 411377, 412227, 413508, 414181, 414930, 417571, 422522, 428293, 433210, 436279, 436741, 434735, 432615, 433735, 438963, 445489, 449827, 451166, 451297, 452193, 454536, 458005, 461928, 465561, 468339, 470335, 472489, 476031, 481287, 487058, 491649, 494575, 496824, 499448, 502562, 505849, 509195, 512515]
57296E12515L339M173O120P812P739O643O510P394P398O083N469O764Q405Q777
57282F05141Q915J0511J2589J2411R405O107M939N541O041N896O228P482Q173
57269G09379O889M771M409O279P991P710O574O398O679N820M209L701M485M788
57255G90082L739K657L055M942P304R049R346Q378P618Q161R082Q814P816Q092
57241H88135J0260J2768J4093J4120J3392J2479J2078J2386J2534J1960J1784
57230A025989J3238J5361J6221J5775J5381J5050J3716J1991J1879J3628J5271
57219A183500J5674J5648J5829J5738J5318J5107J4664J3099J1306J1258J2791
57208A339932J3659J3068J2423J2305J1604J0392J0636J2943J5159J5440J4437
$$ y = [512515, 515854, 520027, 526147, 533959, 541698, 548341, 554851, 562245, 569643, 575726, 581195, 587959, 596364, 605141, 614056, 624567, 637156, 649567, 658972, 665079, 670018, 675559, 681600, 687496, 693724, 701206, 709379, 716268, 721039, 725448, 731727, 739718, 747428, 754002, 760400, 767079, 772899, 777108, 780809, 785294, 790082, 793821, 796478, 799533, 804475, 811779, 820828, 830174, 838552, 846170, 854331, 863413, 872227, 880043, 888135, 898395, 911163, 925256, 939376, 952768, 965247, 977325, 989711, 1002245, 1014205, 1025989, 1039227, 1054588, 1070809, 1086584, 1101965, 1117015, 1130731, 1142722, 1154601, 1168229, 1183500, 1199174, 1214822, 1230651, 1246389, 1261707, 1276814, 1291478, 1304577, 1315883, 1327141, 1339932, 1353591, 1366659, 1379082, 1391387, 1402991, 1413383, 1424019, 1436962, 1452121, 1467561, 1481998]
57197A481998J3435J2592J2005J2307J3279J3847J4000J4627J5353J5073J4738
57186A633254J6492J9698K1201K0198J9278J9707J9666J8402J8077J9546K0265
57175A845784J8764J7539J8836K0897K1251K0624K0607K0394J8931J7716J8267
57164B059610J9147J8639J8167J9902K2977K5087K6020K6662K6413K4608K2723
57153B309955K2177K1544J8849J4891J1499Q307M339Q90n17j423m208p818r183
57140B389302p756n330k215K863R583J5979K1433K7051L3223L9177M4497M9028
57128B616835N1893N2596N2175N1418M9212M4787L9879L6267L2777K7650K2302
57117C077791J9433J8623J7165J4460J2249J0948Q977N518J039m751j2773k2207
$$ y = [1481998, 1495433, 1508025, 1520030, 1532337, 1545616, 1559463, 1573463, 1588090, 1603443, 1618516, 1633254, 1649746, 1669444, 1690645, 1710843, 1730121, 1749828, 1769494, 1787896, 1805973, 1825519, 1845784, 1864548, 1882087, 1900923, 1921820, 1943071, 1963695, 1984302, 2004696, 2023627, 2041343, 2059610, 2078757, 2097396, 2115563, 2135465, 2158442, 2183529, 2209549, 2236211, 2262624, 2287232, 2309955, 2332132, 2353676, 2372525, 2387416, 2398915, 2407222, 2411561, 2412451, 2411934, 2410511, 2406303, 2398485, 2389302, 2381546, 2376216, 2374001, 2376864, 2386447, 2402426, 2423859, 2450910, 2484133, 2523310, 2567807, 2616835, 2668728, 2721324, 2773499, 2824917, 2874129, 2918916, 2958795, 2995062, 3027839, 3055489, 3077791, 3097224, 3115847, 3133012, 3147472, 3159721, 3170669, 3179646, 3185164, 3186203, 3181452, 3168679, 3146472]
57105C146472l0498l5836l8166l8434l8397m0053m3329m5358m3992m0793l8761
57094B712855l8659l9636m1577m4282m6114m6177m6268m7994m9663m8857m6294
57083B217334m4104m2049l8624l4325l0605k7177k3381k0542j9736j9027j6342
57072A901422j3286j2602j3744j4572j5531j8236k1738k4101k6045k9272l3038
57061A679257l6279m1060m9884o1573p3755q7145j03467j21965j42292j67674
57051G94163k00335k37029H2609b31435l60247m11131m63152n16422n70338o18294
57041c171019o53808o76607o84311o63325n96123m70808k73400K0560M31207R54146
57031e783488J564484a987811I27629L572731M181697M754459N282499N682726
$$ y = [3146472, 3115974, 3080138, 3041972, 3003538, 2965141, 2925088, 2881759, 2836401, 2792409, 2751616, 2712855, 2674196, 2634560, 2592983, 2548701, 2502587, 2456410, 2410142, 2362148, 2312485, 2263628, 2217334, 2173230, 2131181, 2092557, 2058232, 2027627, 2000450, 1977069, 1956527, 1936791, 1917764, 1901422, 1888136, 1875534, 1861790, 1847218, 1831687, 1813451, 1791713, 1767612, 1741567, 1712295, 1679257, 1642978, 1601918, 1552034, 1490461, 1416706, 1329561, 1226094, 1104129, 961837, 794163, 593828, 356799, 82609, -231435, -591682, -1002813, -1465965, -1982387, -2552725, -3171019, -3824827, -4501434, -5185745, -5849070, -6445193, -6916001, -7189401, -7168841, -6737634, -5783488, -4219004, -1987811, 927629, 4500360, 8682057, 13436516, 18719015, 24401741]
57023B4401741N834453N637875M936278L364528M38738l981322r233904j3942034
57015A7456353G54603a6077890j4622270j1000249o999064l370265m69088J664435
57007e0874391L149943M133374M719160M960383M883323M530211L994895L415214
56999a7087888K918431K567670K355420K235771K156918K078397g94501A073636
56990B830525J658881J574328J495080J409309J306537J185341J056495R34921
56982A3451417Q29206P40600O68026O08751N56271N02968M44814L80935L11169
56973A8494157K38376J71216J19363Q5803O6977N9081N9902O5636P1678P7924
56963A9510113Q8378J02285J08268R1069M4825k0998q8270j41911j76000j91442
$$ y = [24401741, 30236194, 35874069, 40810347, 44174875, 44613613, 40632291, 31398387, 17456353, 754603, -16077890, -30700160, -41700409, -48699473, -52069738, -52538826, -50874391, -47724448, -43591074, -38871914, -33911531, -29028208, -24497997, -20503102, -17087888, -14169457, -11601787, -9246367, -7010596, -4853678, -2775281, -794501, 1073636, 2830525, 4489406, 6063734, 7558814, 8968123, 10274660, 11460001, 12516496, 13451417, 14280623, 15021223, 15689249, 16298000, 16854271, 17357239, 17802053, 18182988, 18494157, 18732533, 18903749, 19023112, 19108915, 19175892, 19234973, 19294875, 19360511, 19432189, 19510113, 19598491, 19700776, 19809044, 19900113, 19944938, 19923940, 19835670, 19693759, 19517759, 19326317]
56953A9326317j91256j79618j63101j48810j40109j35904j34362j35152j37620
56944A7960385j39611j39686j38555j36912j33967j29732j26844j27991j32719
56935A6754368j38474j43698j48341j52730j57711j65086j76238j90873k07989
56926A5273228k26854k46028k62962k76304k87484k98371l08380l15414l18652
56917A2732779l18647l15436l08408k97602k83592k66424k46066k23682k01224
56908A0271698j79909j59927j41206j23710j07490r3287q2362p4952o9700o5378
56898I173777o2259o0728n9728n8067n6526n7060o0170o4453o8482p1863p4748
56887H479693p7531q1084q6207r2634r9208j04869j08979j11147j11545j10982
$$ y = [19326317, 19135061, 18955443, 18792342, 18643532, 18503423, 18367519, 18233157, 18098005, 17960385, 17820774, 17681088, 17542533, 17405621, 17271654, 17141922, 17015078, 16887087, 16754368, 16615894, 16472196, 16323855, 16171125, 16013414, 15848328, 15672090, 15481217, 15273228, 15046374, 14800346, 14537384, 14261080, 13973596, 13675225, 13366845, 13051431, 12732779, 12414132, 12098696, 11790288, 11492686, 11209094, 10942670, 10696604, 10472922, 10271698, 10091789, 9931862, 9790656, 9666946, 9559456, 9466169, 9383807, 9308855, 9239155, 9173777, 9111518, 9050790, 8991062, 8932995, 8876469, 8819409, 8759239, 8694786, 8626304, 8554441, 8479693, 8402162, 8321078, 8234871, 8142237, 8043029, 7938160, 7829181, 7718034, 7606489, 7495507]
56877G495507j09935j07887j04387j00282r6794r3782r0149q5977q3217q4037
56867F539060q9099r7505j07577j17537j26132j33045j38420j41918j42690j40346
56857E304791j35634j29944j24337j19089j13913j08420j02545r6762r1961q8918
56847D193268q7611q7052q6150q4695q3091q1104p7805p3260o9323o7533o6775
56836C328869o4452n9988n5708n3787n3512n2342m8866m3913l9247l5990l4224
56825B786840l3594l4013l5844l9396m4255m9166n2586n3637n3004n2707n4113
56814B284525n5907n5145n0903m5669m2252m0494l8347l5147l1868k8853k5329
56803A834611k1037j6481j1501n448Q90N272O177L603k369j1783k3052l2921l9291
$$ y = [7495507, 7385572, 7277685, 7173298, 7073016, 6976222, 6882440, 6792291, 6706314, 6623097, 6539060, 6449961, 6352456, 6244879, 6127342, 6001210, 5868165, 5729745, 5587827, 5445137, 5304791, 5169157, 5039213, 4914876, 4795787, 4681874, 4573454, 4470909, 4374147, 4282186, 4193268, 4105657, 4018605, 3932455, 3847760, 3764669, 3683565, 3605760, 3532500, 3463177, 3395644, 3328869, 3264417, 3204429, 3148721, 3094934, 3041422, 2989080, 2940214, 2896301, 2857054, 2821064, 2786840, 2753246, 2719233, 2683389, 2643993, 2599738, 2550572, 2497986, 2444349, 2391345, 2338638, 2284525, 2228618, 2173473, 2122570, 2076901, 2034649, 1994155, 1955808, 1920661, 1888793, 1859940, 1834611, 1813574, 1797093, 1785592, 1780144, 1781034, 1786306, 1792483, 1796086, 1793717, 1781934, 1758882, 1725961, 1686670]
56790A686670m2753m4615m4956m3604m1499l9577l7257l3390k8033k2141j6100
56779A292745r617k644M561J2045K0077K8585L6948M3861M7011M3769L3193J7276
56767A567810k92j6406k9522l9109m5039m7572m7469m5777m3241l9914l5625l0877
56755A146967k6633k2906j8469j2679o658j552L465R872J7064K2566K4592K2644
56743A158273J6168M976q581k0294k7863l2429l5743l7654l7372l5477l3169l0702
56731H80133k7868k5130k3053k1230j8822j5654j2063q097l695P10M374O816P959
56718G44380P804N947J399o392j5670k2573k4651k3578k2811k3259k3197k1908
56706E75491k0733k0373j9801j8512j7496j7150j6515j5454j5268j6021j5640
$$ y = [1686670, 1643917, 1599302, 1554346, 1510742, 1469243, 1429666, 1392409, 1359019, 1330986, 1308845, 1292745, 1283128, 1280484, 1285045, 1297090, 1317167, 1345752, 1382700, 1426561, 1473572, 1517341, 1550534, 1567810, 1567518, 1551112, 1521590, 1482481, 1437442, 1389870, 1342401, 1296624, 1253383, 1213469, 1177844, 1146967, 1120334, 1097428, 1078959, 1066280, 1059622, 1058070, 1061535, 1071407, 1088471, 1111037, 1135629, 1158273, 1174441, 1179417, 1170836, 1150542, 1122679, 1090250, 1054507, 1016853, 979481, 944004, 910835, 880133, 852265, 827135, 804082, 782852, 764030, 748376, 736313, 728216, 724521, 725231, 729605, 736421, 744380, 752184, 758131, 759530, 753138, 737468, 714895, 690244, 666666, 643855, 620596, 597399, 575491, 554758, 534385, 514584, 496072, 478576, 461426, 444911, 429457, 414189, 398168, 382528]
56695C82528j3089j0210q743p851o446n784p228r116q728o359m843n514o927p397
56681B74293o581m757k466j086j932m346n937n178k937j267j361k743m015m194
56667B25493l482k567j457J59J601J688P06M40J557K505J846K00j109j863k312
56652B23405k125j348j112k009k947k939k807l561m361l850k557k063k563k955
56638A86208k835k669k481j899j180p47j29J355L311M895O036O827O490M476J912
56623B09570M31J07MQ0Q06J561J357R10K001M670O741O443M194J547l02q24j97
56606B39099N93M95n34j765k793l614m005l714l158l081l644m488n300n823n756
56591A92512n219m750m350l383j839o07J59J474L516M877M998N519P438Q780P359
$$ y = [382528, 369439, 359229, 350486, 342635, 336189, 330405, 323177, 314061, 305333, 298974, 294131, 288617, 281690, 274293, 267712, 262955, 260489, 259403, 257471, 253125, 247188, 242010, 239073, 237806, 236445, 233702, 229687, 225493, 222011, 219444, 217987, 218146, 219747, 221435, 222141, 222581, 224138, 226643, 228489, 228689, 227580, 225717, 223405, 221280, 219932, 218820, 216811, 213864, 210925, 208118, 204557, 200196, 196346, 193789, 191726, 189163, 186208, 183373, 180704, 178223, 176324, 175144, 174397, 174268, 175623, 178934, 183829, 189865, 196692, 203182, 207658, 209570, 210001, 210108, 210112, 210192, 210998, 212559, 213916, 214826, 216827, 221497, 228238, 234681, 238875, 240422, 240120, 239296, 239099, 239692, 240187, 239653, 237888, 235095, 231481, 227476, 223762, 220604, 217523, 213879, 209391, 204091, 198268, 192512, 187293, 182543, 178193, 174810, 172971, 172364, 172523, 173997, 177513, 182390, 187388, 192907, 200345, 209125, 216484]
56576B16484M465L110L656L977L365L244M007M130K860J436R34J001J293K229
56562B56191L545L906K712R69k36p69o83P8P86K29j512k886k898k128j408q16
56546B55080m06n41r46p27J11M46r8l24O82J954J810k2k158l006k024m1J405J360
56528B52555K88o85j008p04L07J865K939K513J058K9P7P21J559K511L047K610
56512B69682J840K030L220M151M221M097M201M122L981M773O672Q272Q481Q133
56498C37876Q711J0242J1293J0713Q671O260M520L643K994K127J635K352L850
56485D14887M590L728K087J083J278K186K932K922K204J331O12l06j784l498m894
56470D29358n921o755p107o599n486m383l504k724k073j521q68m52j265l449n419
$$ y = [216484, 220949, 224059, 227715, 231692, 235057, 238301, 242308, 246438, 249298, 250734, 251668, 252669, 253962, 256191, 259736, 263642, 266354, 267323, 267087, 266318, 265635, 265713, 266499, 266728, 265216, 262330, 259432, 257304, 255896, 255080, 254674, 254133, 253187, 252460, 252571, 253017, 252919, 252595, 253277, 255231, 257041, 257019, 254861, 251855, 249831, 249790, 251195, 252555, 252843, 252158, 251150, 250446, 250753, 252618, 255557, 258070, 259128, 259157, 259234, 259955, 261514, 264025, 267072, 269682, 271522, 273552, 276772, 280923, 285144, 289241, 293442, 297564, 301545, 306318, 312990, 321262, 329743, 337876, 346587, 356829, 368122, 378835, 387506, 393766, 398286, 401929, 404923, 407050, 408685, 411037, 414887, 419477, 423205, 425292, 426375, 427653, 429839, 432771, 435693, 437897, 439228, 439840, 439534, 437750, 434252, 429358, 423437, 416682, 409575, 402976, 397490, 393107, 389603, 386879, 384806, 383285, 382417, 381965, 380700, 377251, 371832]
56455C71832n600m515l950m513n358n852o129n991m787k690j059j078k572m240
56441C13498m729l739k385k051k609k538j265o9Rj78L96R86M41n48m48N98J089
56424B96458M77n00j265j598r48N94J366P5j766j453J051K936K301J59j465j714
56408B94708q98K05P51O15O19J115R99m83j837j126J067K482K417K002J773J367
56392C05776J202J929K330N49k350k889Q0L652M829L907K793K029R91m00j550
56377C22878k022j745r98m31m00m69m05r39k256k609n09K432L249J888J088K049
56361C20801K961K328J078N64P97J478K656L501K526qj775j408o7P22R60J112
56345C38226R48M02J54M57P10O51O28M91k26q70k42J175J425r1j846k446j919
$$ y = [371832, 366232, 361717, 357767, 353254, 347896, 342044, 335915, 329924, 325137, 322447, 321388, 320310, 317738, 313498, 308769, 305030, 302645, 300594, 297985, 295447, 294182, 294113, 294122, 293944, 294340, 295326, 295767, 295219, 294771, 295369, 296458, 296935, 296435, 295170, 293572, 292624, 293218, 294584, 294659, 292893, 291440, 292491, 295427, 297728, 297887, 296422, 294708, 293810, 294015, 294766, 295381, 296000, 297115, 298114, 297631, 295794, 294668, 295735, 298217, 300634, 302636, 304409, 305776, 306978, 308907, 311237, 311786, 309436, 306547, 306627, 310279, 315108, 319015, 321808, 323837, 324828, 324428, 322878, 320856, 319111, 318113, 317682, 317282, 316813, 316408, 315469, 313213, 310604, 310095, 312527, 315776, 317664, 318752, 320801, 323762, 326090, 327168, 327732, 328529, 330007, 332663, 336164, 338690, 338682, 336907, 335499, 335432, 336154, 337114, 338226, 339174, 339576, 339730, 340187, 340897, 341548, 342176, 342667, 342441, 341571, 341329, 342504, 343929, 343838, 341992, 339546, 337627]
56328C37627o44Q97J357j69j979j444R71K185J286O49J535J993P12j97J455M305
56312C50539N392M123K220J065Q12J187J771K189K611L190L010J247q00r97K62
56297C77821N16p14j227m7J128J385K228M183M956L051N96K30J380J873J360R64
56281C99683J025J252J821K711L070K509J795J454J241J538L151M978M504J695
56267D32427j94Q43K837L281K652K555K812K632K656L547M271L692K419J467P65
56252D68662M61J643M185N862N238L615K775K829L486M989O393N673L214K366
56238E21391M612P120P258O472P044P981P262N673N213N757O329P650J0364J2670
56224F22796J2780J2007J2410J3211J2676J1774J2571J4439J5260J5222J6144
$$ y = [337627, 336983, 337880, 339237, 339068, 337089, 335645, 336616, 338801, 340087, 340736, 342271, 344264, 344976, 344779, 346234, 350539, 355931, 360054, 362274, 363339, 364151, 365338, 367109, 369298, 371909, 375099, 378109, 379356, 378556, 377559, 377821, 378337, 377623, 376396, 376349, 377477, 378862, 381090, 385273, 390229, 393280, 393876, 394106, 395486, 397359, 398719, 399683, 400708, 401960, 403781, 406492, 409562, 412071, 413866, 415320, 416561, 418099, 421250, 426228, 430732, 432427, 432233, 433076, 435913, 439194, 441846, 444401, 447213, 449845, 452501, 456048, 460319, 464011, 466430, 467897, 468662, 469123, 470766, 474951, 480813, 486051, 489666, 492441, 495270, 498756, 503745, 510138, 515811, 519025, 521391, 526003, 533123, 540381, 546853, 553897, 561878, 569140, 574813, 580026, 585783, 592112, 599762, 610126, 622796, 635576, 647583, 659993, 673204, 685880, 697654, 710225, 724664, 739924, 755146, 771290]
56213G71290J8013J9303J9993K1270K2944K3903K4470K5790K7559K8729K9646
56202A032910L1254L3165L4785L7162M1474M6794N1715N6881O3431P0309P5900
56191A575780Q1090Q7878R5926J03351J10140J17854J26372J33548J37977J40019
56181B709935J40461J39883J38673J36072J30013J19400J05464Q9665P1984N2723
56171C834273L3785J6216j334j9516l5993m8853n9842p1263q1868q9282r4456
56160C381867r9983j05447j08236j07963j06568j04779j01820r7975r4325r0487
56150B364284q5527q0428p6957p4716p1900o8247o4764o1396n7430n3307m9840
56139A619772m6689m3656m1871m1375l9494l4365k8336k4958k4241k3885k3322
$$ y = [771290, 789303, 808606, 828599, 849869, 872813, 896716, 921186, 946976, 974535, 1003264, 1032910, 1064164, 1097329, 1132114, 1169276, 1210750, 1257544, 1309259, 1366140, 1429571, 1499880, 1575780, 1656870, 1744748, 1840674, 1944025, 2054165, 2172019, 2298391, 2431939, 2569916, 2709935, 2850396, 2990279, 3128952, 3265024, 3395037, 3514437, 3619901, 3709566, 3781550, 3834273, 3868058, 3884274, 3882940, 3863424, 3827431, 3778578, 3718736, 3647473, 3565605, 3476323, 3381867, 3281884, 3176437, 3068201, 2960238, 2853670, 2748891, 2647071, 2549096, 2454771, 2364284, 2278757, 2198329, 2121372, 2046656, 1974756, 1906509, 1841745, 1780349, 1722919, 1669612, 1619772, 1573083, 1529427, 1487556, 1446181, 1406687, 1372322, 1343986, 1319028, 1294787, 1270902, 1247580]
56128A247580k3239k2738k0494j7531j5734j4810j3583j2721j3034j2902j0662
56117A070132p920p044p111n776l515k279j714m27O28l5q43N85L082L906L573
56102A045242M591O769Q095R057J1656J5053J6539J6120J6178J7424J9007K1536
56090A207267K5985L0681L3386L5201L8647M3219M7047N1293N8506O7987P7310
56079A716529Q6882R8254J09362J16438J19411J20505J18931J12372J02619R4319
56069B795622Q8829Q4481Q1621Q1565Q1403P5928O4787N2274M0407K7748J4778
56058C489443M298l850j3064k4507l6374m8524o2503p6843q7627r4015r8258j00512
56046B847664r8894r4490r0696q7518q1993p4331o8087o3968n9012n2323m6275
$$ y = [1247580, 1224341, 1201603, 1181109, 1163578, 1147844, 1133034, 1119451, 1106730, 1093696, 1080794, 1070132, 1062212, 1055168, 1048057, 1042281, 1038766, 1036487, 1034773, 1034346, 1034974, 1034939, 1034096, 1034681, 1037763, 1041669, 1045242, 1049833, 1056602, 1064697, 1073754, 1085410, 1100463, 1117002, 1133122, 1149300, 1166724, 1185731, 1207267, 1233252, 1263933, 1297319, 1332520, 1371167, 1414386, 1461433, 1512726, 1571232, 1639219, 1716529, 1803411, 1901665, 2011027, 2127465, 2246876, 2367381, 2486312, 2598684, 2701303, 2795622, 2884451, 2968932, 3050553, 3132118, 3213521, 3289449, 3354236, 3406510, 3446917, 3474665, 3489443, 3493741, 3489891, 3476827, 3452320, 3415946, 3367422, 3304919, 3228076, 3140449, 3046434, 2948176, 2847664, 2748770, 2654280, 2563584, 2476066, 2394073, 2319742, 2251655, 2187687, 2128675, 2076352, 2030077]
56035B030077m1723l7146l2633k9661k7144k2857j8340j6857j7218j5449j1881
56024A759168j0298j0607r067n525l597l617k230P55K123K128M617R584J2566
56011A746000J2235J1947J3054J3453J3347J5560J9278K0435J9071J9406K1918
56000A925704K2551K0655K0418K3188K5333K5074K4766K5310K4822K3514K3579
55989B184914K4114K2657K1263K3761K7872K8041K5353K6008L0592L3920L5077
55978B483572L8050M2606M4447M4487M7773N3149N4588N2910N4983O0813O3131
55967C040509O0837O0774O4724O6950O6490O9281P5713P8806P7647P9983Q8290
55956C830004R5736R9208J03781J10983J15472J16802J21681J31085J37953J40813
$$ y = [2030077, 1988354, 1951208, 1918575, 1888914, 1861770, 1838913, 1820573, 1803716, 1786498, 1771049, 1759168, 1748870, 1738263, 1729196, 1723671, 1720074, 1716457, 1714227, 1714982, 1717105, 1719233, 1723850, 1733434, 1746000, 1758235, 1770182, 1783236, 1796689, 1810036, 1825596, 1844874, 1865309, 1884380, 1903786, 1925704, 1948255, 1968910, 1989328, 2012516, 2037849, 2062923, 2087689, 2112999, 2137821, 2161335, 2184914, 2209028, 2231685, 2252948, 2276709, 2304581, 2332622, 2357975, 2383983, 2414575, 2448495, 2483572, 2521622, 2564228, 2608675, 2653162, 2700935, 2754084, 2808672, 2861582, 2916565, 2977378, 3040509, 3101346, 3162120, 3226844, 3293794, 3360284, 3429565, 3505278, 3584084, 3661731, 3741714, 3830004, 3925740, 4024948, 4128729, 4239712, 4355184, 4471986, 4593667, 4724752, 4862705, 5003518]
55946E003518J46365J55738J62314J66103J75288J90233K01587K07863K18690
55937F627699K36703K53114K65536K82605L06254L27651L45899L71847M07852
55928I425160M43555M77562N22608N82653O46316P10167P85962Q76739R69072
55919A5439794J057536J152946J257714J358640J453630J558476J677055J793130
55911B6748921J902446K022575K160068K301455K449567K632395K860986L116791
55903D6195204L396347L726260M116821M548499N026331N598341O299447P135532
55895H6042782Q145931R410121J0959809J2762979J4827887J7219085J9924077
55888A79292671K2832333K5874233K8878308L1004976L0563017K6002295J7412515
$$ y = [5003518, 5149883, 5305621, 5467935, 5634038, 5809326, 5999559, 6201146, 6409009, 6627699, 6864402, 7117516, 7383052, 7665657, 7971911, 8299562, 8645461, 9017308, 9425160, 9868715, 10346277, 10868885, 11451538, 12097854, 12808021, 13593983, 14470722, 15439794, 16497330, 17650276, 18907990, 20266630, 21720260, 23278736, 24955791, 26748921, 28651367, 30673942, 32834010, 35135465, 37585032, 40217427, 43078413, 46195204, 49591551, 53317811, 57434632, 61983131, 67009462, 72607803, 78907250, 86042782, 94188713, 103598834, 114558643, 127321622, 142149509, 159368594, 179292671, 202125004, 227999237, 256877545, 287882521, 318445538, 344447833, 361860348]
55881C61860348O864429k941878j0339171j5116002j7783852j8873192j8833996
55874B84836686j8132754j7163986j6140684j5156697j4277846j3521095j2833236
55867A77610388j2161207j1501395j0849720j0162794r409483q617081p833832
55860A07074876p084160o385389n765737n234011m762969m328843l940610l611466
55852F5961691l331409l088195k886640k725912k582744k437505k295687k167192
55844D4446407k046545j929815j829168j752879j689315j625866j565645j511419
55836C0495755j451739j378239j300295j228347j158166j084422j014314r54515
55828B0925718q99321q44225p96850p61871p29009o88600o46111o09056n72593
$$ y = [361860348, 368724777, 365782899, 355443728, 340327726, 322543874, 303670682, 284836686, 266703932, 249539946, 233399262, 218242565, 203964719, 190443624, 177610388, 165449181, 153947786, 143098066, 132935272, 123525789, 114908708, 107074876, 99990716, 93605327, 87839590, 82605579, 77842610, 73513767, 69573157, 65961691, 62630282, 59542087, 56655447, 53929535, 51346791, 48909286, 46613599, 44446407, 42399862, 40470047, 38640879, 36888000, 35198685, 33572819, 32007174, 30495755, 29044016, 27665777, 26365482, 25137135, 23978969, 22894547, 21880233, 20925718, 20026397, 19182172, 18385322, 17623451, 16894442, 16205842, 15559731, 14950675, 14378082]
55819A4378082n30878m90992m62497m43072m26000m12283m04295l96828l85179
55810A0426058l73589l65880l56500l40373l22982l11071l01633k89234k76317
55801G488479k67170k59272k49221k40024k34413k28372k19015k11147k08273
55792E371572k04848j95579j84867j78754j74759j68101j61008j57390j54576
55783C791690j48710j42335j38606j33797j23710j12214j05333j01614r5971q8652
55773B600748q3005p8443p2606o6925o3781o1588n8097n4756n2921n0215m5400
55762A913011m2088m2585m3103m0118l6367l5294l4720l1612k8195k7716k8558
55751A522655k7897k6819k6796k5770k2581k0544k1632k2065j8656j4472j3045
$$ y = [14378082, 13847204, 13356212, 12893715, 12450643, 12024643, 11612360, 11208065, 10811237, 10426058, 10052469, 9686589, 9330089, 8989716, 8666734, 8355663, 8054030, 7764796, 7488479, 7221309, 6962037, 6712816, 6472792, 6238379, 6010007, 5790992, 5579845, 5371572, 5166724, 4971145, 4786278, 4607524, 4432765, 4264664, 4103656, 3946266, 3791690, 3642980, 3500645, 3362039, 3228242, 3104532, 2992318, 2886985, 2785371, 2689400, 2600748, 2517743, 2439300, 2366694, 2299769, 2235988, 2174400, 2116303, 2061547, 2008626, 1958411, 1913011, 1870923, 1828338, 1785235, 1745117, 1708750, 1673456, 1638736, 1607124, 1578929, 1551213, 1522655, 1494758, 1467939, 1441143, 1415373, 1392792, 1372248, 1350616, 1328551, 1309895, 1295423, 1282378]
55740A282378j2153q961o126o765q111o404l824m362o736p478p534r765j3056
55727A181103j4589j5096j6695j8296j7975j7015j7277j7530j6419j5635j6302
55716I98274j6053j3446j1076j0393q194k491K977M628M418M591K473l971j0695
55703I41042j3716j5798k0619k5051k4227k0118j7969j7693j5951j3618j3899
55692G42383j5564j5012j2989j2718j3446j2301j0486j1186j2978j1816q129n919
55680E99839n961n743m885n049n601m812m132n981q567q344o225n972p532p544
55666E13491n641m810n887o738o564o569o697n910m953n097n146l465j446j052
55652D43516p86J663M757N559M797M697L933P6m809o606n825o218p969p984o181
$$ y = [1282378, 1270225, 1261264, 1255138, 1248373, 1240262, 1233858, 1230034, 1225672, 1218936, 1211458, 1203924, 1194159, 1181103, 1166514, 1151418, 1134723, 1116427, 1098452, 1081437, 1064160, 1046630, 1030211, 1014576, 998274, 982221, 968775, 957699, 947306, 939112, 936621, 939598, 944226, 948644, 953235, 955708, 951737, 941042, 927326, 911528, 890909, 865858, 841631, 821513, 803544, 785851, 769900, 756282, 742383, 726819, 711807, 698818, 686100, 672654, 660353, 649867, 638681, 625703, 613887, 605758, 599839, 593878, 588135, 583250, 578201, 572600, 567788, 563656, 557675, 549108, 540764, 534539, 528567, 521035, 513491, 507850, 503040, 497153, 490415, 483851, 477282, 470585, 464675, 459722, 454625, 449479, 446014, 444568, 443516, 442730, 444393, 449150, 454709, 459506, 464203, 468136, 468212, 463403, 456797, 450972, 444754, 436785, 428801, 422620]
55637D22620n610o635o617n391n641p612q510p494o504n821l648m74Q14j59n53
55622C52765P70J711J020J22R1K15J54N21R86N90k79p70j661l561m353j996J331
55605C47656J879K1q30k3J91l05P55L280M457L555K895L544L945L358K941L050
55589C80369K746K285K806L662L228J997J481P69k065n781p252o485o199o874
55575C64687o626n655o181p885q029o420n626n931m856k302j367k954m213l643
55561B92999l229m034m044k222p10r83j588j552k454m981o742n784l519k081j331
55546B47745m57k16j605l949n856o536n453k551O18J892J191K93o8p21j745k286
55530B20296k554l377l837k413k62nj320j359K52Q53k41m07J408K652J719Q05
$$ y = [422620, 417010, 410375, 403758, 398367, 392726, 385114, 376604, 369110, 362606, 356785, 353137, 352663, 353477, 353318, 352765, 353535, 355246, 356266, 356388, 356479, 356694, 356848, 357369, 358355, 358945, 358666, 357896, 356235, 352674, 348321, 346325, 347656, 349535, 349556, 348726, 348703, 348894, 348589, 349344, 352624, 357081, 360636, 363531, 367075, 371020, 374378, 377319, 380369, 383115, 385400, 388206, 391868, 395096, 397093, 398574, 399343, 397278, 391497, 384245, 377760, 371561, 364687, 358061, 352406, 346225, 338340, 330311, 323891, 318265, 312334, 307478, 305176, 303809, 300855, 296642, 292999, 289770, 285736, 281692, 279470, 278760, 277777, 276189, 274637, 272183, 267202, 260460, 254676, 251157, 249076, 247745, 247288, 247072, 245467, 241518, 235662, 229126, 223673, 221122, 221740, 223632, 224823, 225116, 225048, 224327, 222582, 220296, 217742, 214365, 210528, 208115, 207853, 207848, 206528, 205169, 205421, 206274, 206033, 205626, 207034, 209686, 211405, 212210]
55514B12210K033M059M796M709N059N255M180K429J372J394K219L457M081L103
55500B60356J292K82j63j694m099n366n195n346n963n023k334n98j157k071j855
55485B21066j791k841l482k633j754j953j875n79K43p37j854j290k31n99j663
55470A98027j544m18K82M98J003J442J057L98L76N00j82j199j352n93J41L38R8
55453A98872l65o81n86p23k043m006m762l721k328j736j327l19Q76J693K214K110
55437A83168N64j873l112k278j092j400k781l658l456k646j761j213j180j182
55423A56100o47K1J39J50P39R55n84k789k986r38O15j04j902l070l254k366k00
55406A39879K009K308J082Q30K140K688J157p63j526j858k338j775K11J747J677
$$ y = [212210, 214243, 218302, 223098, 227807, 232866, 238121, 242301, 244730, 246102, 247496, 249715, 253172, 257253, 260356, 261648, 261930, 261767, 260073, 255974, 250608, 245413, 240067, 234104, 229081, 226747, 226149, 224992, 222921, 221066, 219275, 216434, 212952, 210319, 208565, 206612, 204737, 204158, 204401, 203664, 201810, 200520, 200289, 199690, 198027, 196483, 196065, 196347, 196845, 197848, 199290, 200347, 200745, 201121, 201621, 201439, 200240, 198888, 198295, 198436, 198774, 198872, 198507, 197826, 197240, 196517, 194474, 190468, 185706, 181985, 179657, 177921, 176594, 176275, 177151, 178844, 181058, 183168, 183732, 181859, 178747, 176469, 175377, 173977, 171196, 167538, 164082, 161436, 159675, 158462, 157282, 156100, 155453, 155474, 155613, 155763, 156502, 157457, 156873, 154084, 151098, 150160, 150775, 150671, 148769, 145699, 142445, 140079, 139879, 141888, 144196, 145278, 146108, 148248, 150936, 152093, 151330, 149804, 147946, 145608, 143833, 144044, 145791, 147468]
55391A47468J448K137K201L50j744j910o63K75P12J097P40q48k373k483j778j294
55375A43335o39O78J693J547J027Q32N6j819l118k228j34J302K124L423M904N345
55359A58328M475K843Q75o03k69J836L670L734K871K271J482q3j414j413o74k89
55343A77640l10o84j872l220k763l66J157j31k361k816j716q58n39k99q81k719
55327A57262m057l168j141k3L63J244K100J693O67L65K83o53j474o58P18L29j652
55310A52198k958k822k397k075j171l1J22o45j167j270j521j446k87J035J162
55295A36727R15K028L664L222N99j301q04M49M26n97j247j035k32P35J096K19
55279A44864j238j833j252m61M3P27J644J960J196j59j439k187j869l79J206J481
$$ y = [147468, 148916, 151053, 153254, 153604, 151860, 149950, 149287, 149562, 150274, 151371, 152111, 151263, 148890, 146407, 144629, 143335, 142696, 143374, 145067, 146614, 147641, 148473, 148529, 146710, 143592, 141364, 141230, 142532, 144656, 148079, 152983, 158328, 162803, 165646, 166521, 165918, 165649, 167485, 171155, 174889, 177760, 180031, 181513, 181430, 180016, 178603, 177929, 177640, 177330, 176646, 174774, 171554, 168791, 168425, 169582, 169451, 167090, 164274, 162558, 161700, 161161, 160862, 159981, 157262, 153205, 150037, 148896, 148873, 149236, 150480, 152580, 154273, 154940, 155305, 155588, 154935, 153461, 152803, 153521, 153850, 152198, 149240, 146418, 144021, 141946, 140775, 140744, 140866, 140221, 139054, 137784, 136263, 134817, 134530, 135565, 136727, 137642, 139670, 143334, 146556, 147155, 145854, 145050, 145499, 145925, 145328, 144081, 143046, 142814, 143549, 144645, 144864, 143626, 141793, 140541, 140080, 140123, 140850, 142494, 144454, 145650, 145491, 144052, 141865, 139996, 139617, 140823, 142304]
55263A42304L34j129k023k133j487n88m85j410j952r61M20K39j384k568k521k114
55247A22542j786q66Q08K264K848K954L010K881K556K389K404K183J555P55O6
55232A46563k18K03R70J139N80M42J309J927R58r33k089k066j508p97l23j003
55216A45154k741l420j417J692K971J974O23L4j07L71J842K848J300j972l575
55201A45577k239n07p08j683j173M86J089l8j204p55R23J954J118p14j454l45
55185A40327R33M14j465k480j620n6R11J398K080K870L143K642J703Q94N30L42
55169A52566j64q50j026o33m82q80j020m48P4N8K02O14j73k665m459l222m44M91
55151A37539p56j380m2J526J856J733J939J541j41j792j843n28R30K000K549K006
$$ y = [142304, 142638, 141509, 139486, 137353, 135866, 135278, 134793, 133383, 131431, 130470, 130890, 131129, 129745, 127177, 124656, 122542, 120756, 119890, 120698, 122962, 125810, 128764, 131774, 134655, 137211, 139600, 142004, 144187, 145742, 146497, 146563, 146345, 146548, 147518, 148657, 149237, 149679, 150988, 152915, 153873, 152940, 150851, 148785, 147277, 146480, 146157, 145154, 142413, 138993, 137576, 139268, 142239, 144213, 144836, 144870, 144763, 145134, 146976, 149824, 151124, 149152, 145577, 143338, 142831, 142123, 140440, 139267, 139753, 140842, 140804, 139600, 138845, 139768, 141722, 142840, 142126, 140672, 140327, 141260, 141674, 140209, 137729, 136109, 136053, 136964, 138362, 140442, 143312, 146455, 149097, 150800, 151694, 152224, 152566, 152402, 151552, 150526, 149893, 149411, 148531, 147511, 147063, 147137, 147195, 147397, 148011, 147838, 145173, 140714, 137492, 137048, 137539, 136783, 135403, 135361, 136887, 138743, 140476, 142415, 143956, 143815, 142023, 140180, 139652, 140582, 142582, 145131, 147137]
55135A47137K17j589j851o12N42M57j60L88K454M026K837n50l013k705j144n01
55119A45933n81j31L21n53k014k027n42N20N17P24J451J311L4n17N66J460M82
55102A46954j046o87J454K865J954k05j448q36P43J762J597R04N62P23J060J307
55086A57663J038k58k089k901k144j432k254l564l375j834o32l4J090K630L210
55071A45114K763K572K541J174j171j929l24R60k53k322k447p24O16O57L46L73
55055A47946M67N34Q24J173J117P19M47N19Q51J297J471J046N64J087K443L013
55039A65518J982P14P39J427J030n87j769j460l52M48P32Q15P15K86k74n66m96
55022A68902l50l30k72K6L34K07k88m79p0K74k42j317j755q52P86J857J590M81
$$ y = [147137, 147354, 145765, 143914, 143302, 143844, 144301, 144141, 144529, 146983, 151009, 153846, 153296, 150283, 147578, 146434, 145933, 145352, 145221, 145542, 144989, 142975, 140948, 140406, 140926, 141443, 142167, 143618, 144929, 144963, 144446, 145012, 146472, 146954, 145908, 145221, 146675, 149540, 151494, 151289, 149841, 149005, 149748, 151510, 153107, 154011, 154573, 155296, 156356, 157663, 158701, 158443, 156354, 153453, 151309, 149877, 147623, 144059, 140684, 138850, 138218, 138184, 139274, 141904, 145114, 147877, 150449, 152990, 154164, 152993, 151064, 150740, 151700, 151447, 149125, 146678, 145954, 146570, 147227, 147573, 147946, 148413, 148947, 149771, 150944, 152061, 152780, 153227, 153746, 154597, 155894, 157365, 158411, 158975, 160062, 162505, 165518, 167500, 168214, 168953, 170380, 171410, 170823, 169054, 167594, 167242, 167690, 168422, 169237, 169952, 170238, 169964, 169398, 168902, 168552, 168222, 167950, 167976, 168310, 168517, 168229, 167750, 167680, 167954, 167712, 166395, 164640, 163788, 164574, 166431, 168021, 168502]
55004A68502j24M93J477J488O11K09P18R37J9j122j281o36J58J246K612K954J205
54987A79466j535l121k903j788n56L88L54q99k261k616k343k060r70J640M228
54972A65024M631L164J817J073K8r41o30J30q31l217m197k690p95j61J13Q86J130
54955A64534K39l56L95J191O70j9J085L748N831N778L649N79j855k622k262k044
54939A78541j969j010N71J128L58J2J023K045J859J172P38k01k038l210k282k13
54923A76524J148J596K044K645K916K737J999M03j376j712m41K91r41k552k336
54908A82945o04Q31J515K072K203J158l79r42l74L31Q29J470K099K309K457K867
54892B00787K608P52j618k442j489m07j23J38R98J774J688J005L38k39q16r72
$$ y = [168502, 168378, 168871, 170348, 171836, 172447, 172656, 173374, 174311, 174330, 173208, 171927, 171291, 171449, 172695, 175307, 178261, 179466, 177931, 174810, 171907, 170119, 169563, 169951, 170305, 169406, 167145, 164529, 162186, 160126, 159156, 160796, 165024, 169655, 172819, 174636, 175709, 175737, 174796, 174166, 174296, 173465, 170248, 166051, 163361, 162566, 162405, 162518, 163404, 164534, 164773, 164417, 164812, 166003, 166673, 166654, 167739, 171487, 177318, 183096, 186745, 187324, 185469, 182847, 180585, 178541, 176572, 175562, 176133, 177261, 177619, 177631, 178654, 180699, 182558, 183730, 184468, 184267, 182229, 179019, 176737, 176524, 177672, 179268, 181312, 183957, 186873, 189610, 191609, 192012, 190636, 188924, 188483, 188774, 187833, 185281, 182945, 182341, 183172, 184687, 186759, 188962, 190120, 189741, 188799, 188425, 188756, 189585, 191055, 193154, 195463, 197920, 200787, 203395, 204147, 202529, 200087, 198598, 198191, 198068, 198206, 199204, 200978, 202666, 203671, 204009, 203770, 202954, 201982]
54876B01982j58J350K269J430p74k312j523R85L128L902L992M008L658L127L593
54861B28657N424P247P902Q055Q590Q625O800L744J642J456J899J221q93l280
54847B87089m575m591m470n024n236l575q01K91j506m122n174m884m662m446l317
54832B30997j721j013j320j640j692j962k052p28K120M811N633M581L182L001
54818B42197M325O020O785O620O495O720O618N935N289M790L592J450n64j766
54804C04506k816m122m823m473m243m929n225l786j841j773l755n663o026n354
54790B45677m753m644m842m887m373l550l142l032k268r71q61k667m519m488l368
54775A93312k932k732j041J691K946J747r5o84j41M67P41P75N04j66j094k015
$$ y = [201982, 201824, 203174, 205443, 206873, 206099, 203787, 202264, 203249, 206377, 210279, 214271, 218279, 221937, 225064, 228657, 234081, 241328, 249230, 257285, 265875, 274500, 281300, 285044, 286686, 288142, 290041, 291262, 290369, 287089, 282514, 277923, 273453, 268429, 263193, 259618, 258817, 259108, 257602, 253480, 248306, 243422, 238760, 234314, 230997, 229276, 228263, 226943, 225303, 223611, 221649, 219597, 218869, 220989, 225800, 231433, 236014, 239196, 242197, 246522, 252542, 259327, 265947, 272442, 279162, 285780, 291715, 297004, 301794, 305386, 306836, 306272, 304506, 301690, 297568, 292745, 288272, 284029, 279100, 273875, 270089, 268248, 266475, 262720, 257057, 251031, 245677, 240924, 236280, 231438, 226551, 222178, 218628, 215486, 212454, 210186, 209215, 208354, 205687, 201168, 196680, 193312, 190380, 187648, 186607, 188298, 191244, 192991, 192896, 192212, 192071, 192538, 193279, 194054, 194558, 194392, 193298, 191283]
54759A91283k452j773PJ820K516J973P69n58j345q86M66J184M59o57q53k68L91
54742A92076J096J713J456N75J005L431N232L813O54p18Q5L44q75j289M49K276
54726B11323J841k19j697j941j947k253k219j134P71K447L013K756K847L808M823
54711B22219N194N538O576P546P319O393O241P069P860Q322R047R774R202O850
54697C25150L734R37j349l219m617n624o253o126n197m504n044o241o683n953
54683B69011m661l162j606p41j152k043k229j886j897j957j099L89J279J329J207
54668B50782R76N09Q37K908N334N815M687M612O491Q255Q140O813N418L821J790
54653C17188L7r94j895l024l918m451n065n441m682l268k965m128n034m624m011
$$ y = [191283, 188831, 187058, 187065, 188885, 191401, 193374, 194143, 193585, 192240, 191354, 191820, 193004, 193463, 192806, 191953, 191685, 192076, 193172, 194885, 196341, 196916, 197921, 201352, 206584, 210397, 211051, 210333, 210418, 210762, 209887, 208598, 209047, 211323, 213164, 212945, 211248, 209307, 207360, 205107, 202888, 201754, 202525, 204972, 207985, 210741, 213588, 217396, 222219, 227413, 232951, 239527, 247073, 254392, 260785, 267026, 274095, 281955, 290277, 299324, 309098, 318300, 325150, 328884, 329821, 328472, 325253, 320636, 315012, 308759, 302633, 297436, 292932, 287888, 281647, 274964, 269011, 264350, 261188, 259582, 258841, 257689, 255646, 253417, 251531, 249634, 247677, 246578, 246967, 248246, 249575, 250782, 251758, 252267, 253104, 256012, 261346, 267161, 271848, 276460, 282951, 291206, 299346, 306159, 311577, 315398, 317188, 317225, 316231, 314336, 311312, 307394, 302943, 297878, 292437, 287755, 284487, 281522, 277394, 272360, 267736, 263725]
54638B63725m299m827m685m253m011l486k597k484l555m277l370j910j595k050
54624B16326j650k96M43l33j826k751k506j225M51J654J894J381M75p00j879k364
54608B07094j638L6J794K669K059L41j142j475j394k164l442l559k020l10K47
54593A97096O8J91O54Q61P08N50M70J68n42j311j305q0J431J647O49N12K225L696
54575B07688K623J42r21m70r03k678l426j948p2N59P60J502J832P22r65j946k275
54558B00224k283j456J89J307J297J497K819L845L011J232L88L67k98j693k333
54543B08113j446J49J253J363P81L83P73J247M96j262k097j043N26J098J091J475
54527B12900J771J037k28p47l68J33M07N49M03JJ1Q36J915K678L212L266J938
$$ y = [263725, 259426, 254599, 249914, 245661, 241650, 238164, 235567, 233083, 229528, 225251, 221881, 219971, 218376, 216326, 214676, 214380, 214823, 214490, 212664, 209913, 207407, 206182, 206633, 208287, 210181, 211562, 212037, 211337, 209458, 207094, 205456, 205492, 207286, 209955, 212014, 212355, 211213, 209738, 208344, 206180, 202738, 199179, 197159, 196849, 197096, 197164, 197355, 198009, 198870, 199578, 200128, 200598, 200766, 200224, 198913, 197608, 197528, 198959, 200606, 201255, 201767, 203992, 207688, 210311, 210453, 209532, 209062, 208159, 205481, 202055, 200107, 200035, 200594, 201354, 202856, 204688, 205410, 204445, 202499, 200224, 197941, 196485, 196674, 197981, 199278, 200775, 203594, 207439, 210450, 211682, 212070, 212437, 212139, 210446, 208113, 206667, 206816, 208069, 209432, 210213, 210596, 211369, 212616, 213112, 211850, 209753, 208710, 209236, 210334, 211425, 212900, 214671, 215708, 215480, 214733, 214365, 214498, 214905, 215454, 215857, 215858, 215869, 216705, 218620, 221298, 224510, 227776, 229714]
54510B29714n95k429k183p82K42Q46J519J707R15R7K45N78K1o61r1J217J657J139
54492B33156Q50R78O96J26K64J107J701J919K415K864K107K49j119j081l43K53
54476B46142P89J445J872J871J858K235K851L123K253k99l817o250o141m326k835
54461B40771k446k234j271K49J410J413K59q48m73J146K087J373L71M61P22l47
54445B42643j992k225r43J66M73R35J865K277J670O58m15j635k302j369N31J467
54429B41804J008P92J743K654K424J808J732J534M14n73K58K621M411M246K654
54414B69530R67Q2L88J702K954K724Q05j108r86J175L188L202J825J010J300J395
54398B90153M61n45n69j66m22j086j124n99n96j404j995j397J84J695K076R90
$$ y = [229714, 229119, 226690, 224507, 223725, 223967, 224813, 226332, 228039, 228954, 229051, 229296, 229874, 229895, 229234, 229143, 230360, 232017, 233156, 234006, 234984, 235680, 235806, 236070, 237177, 238878, 240797, 243212, 246076, 248183, 248432, 247313, 246232, 245889, 246142, 246931, 248376, 250248, 252119, 253977, 256212, 259063, 262186, 264439, 264140, 260323, 254073, 247932, 243606, 240771, 238325, 236091, 234820, 235069, 236479, 237892, 238151, 237303, 236830, 237976, 240063, 241436, 241807, 242268, 242990, 242643, 240651, 238426, 237483, 237649, 238122, 239057, 240922, 243199, 244869, 245527, 245112, 243477, 241175, 239806, 240337, 241804, 242812, 243604, 245347, 248001, 250425, 252233, 253965, 255499, 255913, 255340, 255598, 258219, 262630, 266876, 269530, 270497, 270579, 270967, 272669, 275623, 278347, 279152, 278044, 277058, 278233, 281421, 284623, 286448, 287458, 288758, 290153, 290614, 290069, 289500, 289334, 288912, 287826, 286702, 286103, 285507, 284103, 282108, 280711, 280895, 282590, 284666, 285656]
54382B85656p93j971k197k434l300l829k839q05P41J147Q40J97m99m79P40K169
54366B72344K314J162L7l41k93J55J481L351M426L864K088m9j895k794k405j366
54350B82079p01n30j88M14O67L80K2j56j86L08J621K951L069K058J129P53K73
54333B93963n61j140j255j483j942j963j290m42L41J285J995J596K30p94p38m6
54317B87756Q49J849K167Q81q99n16K519N119M445J613j27K98J230J323J025J039
54301C10571J063N96p9l72k24j27m89j236j870j982j703j524j635j714j384o12
54285B97279K29M61n11k402l925m184l849m152n019n245m343k920j276Q23K703
54270B63669K753O02j926k879k118n33J432L400M263L176Q94r12j471j341j400
$$ y = [285656, 284863, 282892, 280695, 278261, 274961, 271132, 268293, 267488, 268229, 269376, 270216, 270413, 269914, 269435, 270175, 272344, 274658, 275820, 275857, 275516, 275223, 275378, 276859, 280210, 284636, 288500, 290588, 290539, 288644, 285850, 283445, 282079, 281378, 280848, 280660, 281074, 281741, 282121, 282143, 281987, 281801, 282109, 283730, 286681, 289750, 291808, 292937, 293690, 293963, 293402, 292262, 291007, 289524, 287582, 285619, 284329, 283887, 284228, 285513, 287508, 289104, 289334, 288540, 287802, 287756, 288605, 290454, 292621, 293502, 292603, 292087, 294606, 299725, 304170, 305783, 305656, 305954, 307184, 308507, 309532, 310571, 311634, 312230, 312151, 311779, 311555, 311428, 310939, 309703, 307833, 305851, 304148, 302624, 300989, 299275, 297891, 297279, 297508, 297969, 297458, 295056, 291131, 286947, 283098, 278946, 273927, 268682, 264339, 261419, 260143, 260966, 263669, 266422, 267024, 265098, 262219, 260101, 259568, 261000, 264400, 268663, 271839, 272733, 271821, 270350, 269009, 267609]
54255B67609j998k815l086k381j371j161j719j883j190m02K35J643L898N175M168
54240B64722K272J535J559N35j433k399j817j283j693j929j176n02r28j518r04
54225B55041M16Q93L28m2M23R99R01K85k86n23m11j60k94j142k112k123r87L17
54207B51523R58J195J571J859J633J361J904L067L614K960J988J729J970J837
54193B79169J295J132J535J540L21j449k127j015O80J167R8j254j792j799j944
54178B75557j910j091j22k81j332j444K15K084K342J271L72J6n44j241r15P92
54162B73769K519K692J267n31j778k649l697m592m103j706J099J993N46j367k039
54147B61423j709j196l27J016J573K19j859k442j352l69k16L19J905L210K866
$$ y = [267609, 265611, 262796, 259710, 257329, 255958, 254797, 253078, 251195, 250005, 249603, 249838, 251481, 255379, 260554, 264722, 266994, 268529, 270088, 270623, 269190, 266791, 264974, 263691, 261998, 260069, 258893, 258391, 257463, 255945, 255041, 255457, 256350, 256678, 256636, 257059, 258058, 258959, 259244, 258958, 258435, 258024, 257864, 257570, 256428, 254316, 252193, 251206, 251523, 252481, 253676, 255247, 257106, 258739, 260100, 262004, 265071, 268685, 271645, 273633, 275362, 277332, 279169, 280464, 281596, 283131, 284671, 284992, 283543, 281416, 280401, 281081, 282248, 282346, 281092, 279300, 277501, 275557, 273647, 272556, 272434, 272153, 270821, 269377, 269592, 271676, 274018, 275289, 275661, 275677, 275133, 273892, 272977, 273769, 276288, 278980, 280247, 279716, 277938, 275289, 271592, 267000, 262897, 261191, 262290, 264283, 264829, 263462, 261423, 259714, 258518, 258191, 259207, 260780, 260999, 259140, 256698, 255346, 254977, 254761, 255080, 256985, 260195, 263061]
54132B63061J369J47k05J06Q98J842K186J496K77o64j009p64Q0J249K018J954
54116B74041J460J268J572J824J228l76j938j915k05J267Q42o30j202q51j241
54101B75144k544k845j307K40N2j042j480j734l166n102n205k633R22L424M259
54086B56983L689J998j99j800k112j544r24n14O8J084K173K533J678K1j397j827
54070B59910j282j46J182K093J774J05j727k147q80O42P59o44k009j700K97K413
54054B58640L256K977K725K996L167K573J521R98J631L124M553N151M928M459
54040C02699M032L338K184J017K83k51r70j611j677j294q69k46Q83J961J943O89
54024C12111q91k029k584k453j496o9J133J836K028J397%r48k43J406K157J712
$$ y = [263061, 264430, 264577, 264372, 264478, 265376, 267218, 269404, 270900, 271177, 270513, 269504, 268740, 268820, 270069, 272087, 274041, 275501, 276769, 278341, 280165, 281393, 281017, 279079, 277164, 276959, 278226, 279068, 278438, 277236, 276385, 275144, 272600, 269755, 268448, 268688, 268740, 267698, 266218, 264484, 261318, 256216, 251011, 248378, 249300, 252724, 256983, 260672, 262670, 262471, 260671, 258559, 257015, 256091, 255577, 255645, 256729, 258902, 261435, 263113, 263134, 261737, 259910, 258628, 258482, 259664, 261757, 263531, 263636, 261909, 259762, 258882, 259524, 260283, 259639, 257630, 255930, 256227, 258640, 261896, 264873, 267598, 270594, 273761, 276334, 277855, 278853, 280484, 283608, 288161, 293312, 298240, 302699, 306731, 310069, 312253, 313270, 313553, 313302, 312332, 310721, 309044, 307750, 306881, 306635, 307518, 309479, 311422, 312111, 311220, 309191, 306607, 304154, 302658, 302589, 303722, 305558, 307586, 308983, 308983, 308035, 307792, 309198, 311355, 313067]
54008C13067J504K070K177J208M80J062J845J349K20K67J712L024L147K512J846
53993C37490J175K92m51k95J203L478N096M968L624K820L614N333O497O288N073
53978C86205M116M811P336J0012J0837R884R102R615J0440J0315R435Q720Q422
53965D99250Q340Q391Q336P733O786O241N948M756K561J012J121J526M70j548
53951E60923k691k480j969j884k107k718m038n735p113q112r019r464q839p514
53937D87240o506o069n730n530n981o742o524m657j987l0K02j361l758n357n100
53922D22110l598k397k157k171j624n92L42Q45R88J092J441J853J679O88j20P51
53906D19130L512O522P883P421O784P433Q816Q944O844L737J343k50k049m012
$$ y = [313067, 314571, 316641, 318818, 320026, 320506, 321568, 323413, 324762, 324982, 325249, 326961, 329985, 333132, 335644, 337490, 338665, 338957, 338506, 338211, 339414, 342892, 347988, 352956, 356580, 359400, 363014, 368347, 374844, 381132, 386205, 390321, 395132, 402468, 412480, 423317, 433201, 442303, 451918, 462358, 472673, 482108, 490828, 499250, 507590, 515981, 524317, 532050, 538836, 545077, 551025, 555781, 558342, 559354, 560475, 562001, 562471, 560923, 558232, 555752, 553783, 551899, 549792, 547074, 543036, 537301, 530188, 522076, 513057, 503593, 494754, 487240, 480734, 474665, 468935, 463405, 457424, 450682, 444158, 439501, 437514, 437484, 437686, 436325, 432567, 427210, 422110, 418512, 416115, 413958, 411787, 410163, 409571, 409913, 410758, 411746, 412838, 414279, 416132, 417811, 418499, 418379, 419130, 422642, 429164, 437047, 444468, 451252, 458685, 467501, 476445, 483289, 487026, 488369, 488119, 486070, 482058]
53892D82058m905m211k870j870j387j484k195k514r80K014M098M143L961N476
53878D79334P700Q268O885N412N195N965O937P400O642M739L138L102L999M397
53864E59113M367N119O728P960Q270Q421Q894R255R275R509J0375J1749J3509
53851F72544J5340J6060J4566J1762J0213J1265J3453J4229J2410Q667M578J745
53839H06832Q71J043M66j577l899m914m387l416l149l985n632p499r068j0160
53825G51526j0946j1700j2592j3525j4115j4010j3324j2432j1368j0006q829q621
53813F10058r075q812p400o315o939q509r207q636p919p854q212q547q501p571
53799D96561n736m158l994m719m855m226m122n029n650m736k879j728k099l362
$$ y = [482058, 477153, 472942, 470072, 468202, 466815, 465331, 463136, 460622, 459642, 461656, 465754, 469897, 473858, 479334, 487034, 495302, 502187, 507599, 512794, 518759, 525696, 533096, 539738, 544477, 547615, 550717, 554716, 559113, 563480, 568599, 575327, 583287, 591557, 599978, 608872, 618127, 627402, 636911, 647286, 659035, 672544, 687884, 703944, 718510, 730272, 740485, 751750, 765203, 779432, 791842, 800509, 805087, 806832, 807703, 808746, 809212, 807635, 803736, 798822, 794435, 791019, 787870, 783885, 778253, 770754, 761686, 751526, 740580, 728880, 716288, 702763, 688648, 674638, 661314, 648882, 637514, 627508, 618679, 610058, 600983, 592171, 584771, 578456, 571517, 563008, 553801, 545165, 537246, 529392, 521180, 512633, 504132, 496561, 490825, 486667, 482673, 477954, 473099, 468873, 464751, 459722, 454072, 449336, 446457, 444729, 442630, 439268]
53785D39268m318m282l495k711k344k159j835j430j040n27m1j63j011j832k086
53770D09994k189k534k606k000j468j749k146j474j0R22Q66N10L51M01Q57J798
53754C99523K540K565K702L998N672N844M196K487K322L750N994Q094Q844P608
53740D66139N527M599N394O824Q153R762J1657J2770J2263J0510Q442O818O204
53727E75062O475O364M721K294R69J171J477R68K86m2o88k258m130n338n657n343
53711E76331m861n090o591q330q441o743n202n305o353p002p169p479p847p686
53697D82232o931o042n373n024m864m541l913l415l359l189k375j734k407l788
53683D25277m025k676j285j079j679k391l065l195j944J67J226M15q77j070k49
$$ y = [439268, 434950, 430668, 427173, 424462, 422118, 419959, 418124, 416694, 415654, 415127, 415086, 414923, 413912, 412080, 409994, 407805, 405271, 402665, 400665, 399197, 397448, 395302, 393828, 393818, 394740, 395606, 396116, 396467, 396868, 397725, 399523, 402063, 404628, 407330, 411328, 417000, 422844, 427040, 429527, 431849, 435599, 441593, 449687, 458531, 466139, 471666, 476265, 481659, 488483, 496636, 506398, 518055, 530825, 543088, 553598, 562040, 568858, 575062, 581537, 587901, 592622, 594916, 595885, 597056, 598533, 599501, 599787, 599745, 599057, 596799, 592669, 587331, 581674, 576331, 571470, 566380, 559789, 551459, 543018, 536275, 531073, 525768, 519415, 512413, 505244, 497765, 489918, 482232, 475301, 469259, 463886, 458862, 453998, 449457, 445544, 442129, 438770, 435581, 433206, 431472, 429065, 425277, 421252, 418576, 417291, 416212, 414533, 412142, 409077, 405882, 403938, 404105, 405331, 405746, 404869, 403799, 403550]
53668D03550O84J211R42l03j464r35R63J948J090K57J111K607L045K747K847K891
53652D23191J840M25L91J931L580M237L859K805J829K098L805N344N235M197L914
53637D68681M474M621M032L651M020M661M959M478K851N69o19M88K719L898L581
53622E17064K948K453J417j12r93p95l78k99j13K69l6j383k597k342p23J089K203
53605E17672K326J441j49j713k519k277j051Q40K673L527L044J819P36J26k47
53590E26248n63o77m53j54k13o38r32p88n10m83m93j33M80J067J979L718N640
53573E33095O309N372M053L435L237K812K430K704L553M395M894M937M481L939
53559E89646M041M753N104M626M211M805N989O713O760O581O245N497M526L831
$$ y = [403550, 404234, 405445, 406387, 406084, 404620, 403685, 404648, 406596, 407686, 407943, 409054, 411661, 414706, 417453, 420300, 423191, 425031, 425456, 425847, 427778, 431358, 435595, 439454, 442259, 444088, 446186, 449991, 455335, 460570, 464767, 468681, 473155, 477776, 481808, 485459, 489479, 494140, 499099, 503577, 506428, 506997, 506378, 506866, 509585, 513483, 517064, 520012, 522465, 523882, 523770, 522777, 521982, 521604, 521305, 521192, 521461, 521425, 520042, 517445, 515103, 514380, 515469, 517672, 519998, 521439, 521290, 519577, 517058, 514781, 513730, 514570, 517243, 520770, 523814, 525633, 526369, 526495, 526248, 525685, 525008, 524555, 524401, 524188, 523550, 522618, 521830, 521320, 520837, 520344, 520211, 520691, 521758, 523737, 527455, 533095, 539404, 544776, 548829, 552264, 555501, 558313, 560743, 563447, 567000, 571395, 576289, 581226, 585707, 589646, 593687, 598440, 603544, 608170, 612381, 617186, 623175, 629888, 636648, 643229, 649474, 654971, 659497, 663328]
53545F63328L566L644M157N065N806N885N642N832O651P469P317N547K507l04
53531G32112j498j313j145j524j733j586k016l199l649k315m03J40q77k104k556
53516G06334k219j441q05r16j515j622j252j736l353m134k573k15M32m63o06P27
53500F84643J784J118o25j914j884o69P09Q76j93n44J309L823M115J889k97o36
53484F93504J67R90K079L868N710O791P160P053O406N680O129Q360J1416J3786
53470G79099J4680J4035J2401J1294J2474J6021J9806K1618K1243K0066J9437
53459I62174J9995K1687K3652K4666K4447K4146K5079K7375L0303L3206L5593
53448A252323L6972L7483L8193L9808M1374M1288L9566L8025L7961L8650L8860
$$ y = [663328, 666894, 670538, 674695, 679760, 685566, 691451, 697093, 702925, 709576, 717045, 724362, 729909, 732416, 732112, 730614, 729301, 728156, 726632, 724899, 723313, 721297, 718098, 714449, 712134, 711731, 711871, 710994, 708890, 706334, 704115, 702674, 701869, 700953, 699438, 697816, 696564, 694828, 691475, 687341, 684768, 684553, 684985, 684522, 683916, 684643, 686427, 687545, 686920, 685006, 683122, 682453, 683162, 684038, 683845, 683301, 684610, 688433, 692548, 694437, 694140, 693504, 693671, 694661, 696740, 700608, 706318, 713109, 720269, 727322, 733728, 739408, 745537, 753897, 765313, 779099, 793779, 807814, 820215, 831509, 843983, 860004, 879810, 901428, 922671, 942737, 962174, 982169, 1003856, 1027508, 1052174, 1076621, 1100767, 1125846, 1153221, 1183524, 1216730, 1252323, 1289295, 1326778, 1364971, 1404779, 1446153, 1487441, 1527007, 1565032, 1602993, 1641643, 1680503]
53437A680503L8916M0068M2128M3193M2118M0031L8584L7693L6171L3978L2420
53426B105803L2208L2680L2978L2888L2386L1549L1026L1341L1663L0601K8394
53415B453517K6598K5301K2730J8474J4895J3866J3899J2395R239O131L539N74
53403B621158k844n904q605j1572j4361j5872j6401j7657k0533k4159k7158k8742
53391B427350k8874k8490k9132l1125l2681l2203l0698l0211l0646l0175k8428
53380B094687k6857k6021k4748k2396j9867j7855j5859j3575j1567j0063q473
53369A897406o499m349j636K259O494R175R916J0317J1589J3463J5867J9501K3915
53356B007418K7196K8780L0750L4803L9484M2113M2314M2056M3068M5675M9472
$$ y = [1680503, 1719419, 1759487, 1801615, 1844808, 1886926, 1926957, 1965541, 2003234, 2039405, 2073383, 2105803, 2138011, 2170691, 2203669, 2236557, 2268943, 2300492, 2331518, 2362859, 2394522, 2425123, 2453517, 2480115, 2505416, 2528146, 2546620, 2561515, 2575381, 2589280, 2601675, 2610914, 2617045, 2620584, 2621158, 2618314, 2612410, 2603805, 2592233, 2577872, 2562000, 2545599, 2527942, 2507409, 2483250, 2456092, 2427350, 2398476, 2369986, 2340854, 2309729, 2277048, 2244845, 2214147, 2183936, 2153290, 2123115, 2094687, 2067830, 2041809, 2017061, 1994665, 1974798, 1956943, 1941084, 1927509, 1915942, 1905879, 1897406, 1890907, 1886558, 1884922, 1887181, 1893675, 1902850, 1912766, 1923083, 1934672, 1948135, 1964002, 1983503, 2007418, 2034614, 2063394, 2094144, 2128947, 2168431, 2210544, 2252858, 2294914, 2337982, 2383657, 2433129]
53345B433129N3618N6928N8894O0403O2526O5023O7087O9043P2154P6676Q1122
53334C156603Q3774Q4473Q4625Q5614Q7459Q9150R0138R0863R1588R1568R0140
53323D125995Q7925Q5839Q3568Q0282P6399P3021O9900O5643O0001N4233M9010
53312D911816M3652L7823L2248K7162K1579J4715O723k394j2944k4065l3812m1498
53300D981005m8369n5146o0721o4306o7075p0309p3610p6353p9247q2677q4867
53289D218325q3857q0502p7586p6426p6174p6038p6346p7256p7918p7376p5395
53278C363451p2373o9031o6198o4220o2629o0714n8182n4971n1073m6964m3467
53267B713629m0694l7832l4638l2261l1805l2669l3195l2462l0750k8684k6594
$$ y = [2433129, 2486747, 2543675, 2602569, 2662972, 2725498, 2790521, 2857608, 2926651, 2998805, 3075481, 3156603, 3240377, 3324850, 3409475, 3495089, 3582548, 3671698, 3761836, 3852699, 3944287, 4035855, 4125995, 4213920, 4299759, 4383327, 4463609, 4540008, 4613029, 4682929, 4748572, 4808573, 4862806, 4911816, 4955468, 4993291, 5025539, 5052701, 5074280, 5088995, 5095718, 5093324, 5080380, 5056315, 5022503, 4981005, 4932636, 4877490, 4816769, 4752463, 4685388, 4615079, 4541469, 4465116, 4385869, 4303192, 4218325, 4134468, 4053966, 3976380, 3899954, 3823780, 3747742, 3671396, 3594140, 3516222, 3438846, 3363451, 3291078, 3222047, 3155849, 3091629, 3029000, 2968286, 2910104, 2855133, 2804060, 2757096, 2713629, 2672935, 2635103, 2600465, 2568204, 2536399, 2503730, 2470535, 2438073, 2407323, 2378639, 2352045]
53256B352045k4395k1681j8477j5870j4947j4927j3622j0295o588l938j627J379
53244B207057M221N498N877P515J1227J5610J8748J9794J9306J8984K0558K3959
53232B378354K7151K8689K9592L1631L4611L6780L7279L6726L5739L4355L2791
53221B743698L1463L0287K8856K7081K4767K1146J5947J0539O767M809L197O71
53209B949228k944p270j1678j5484j8860k3021k8235l2494l3771l3200l4090l7785
53197B670396m2370m5697m7871m9878n1357n1063m8916m6511m5655m6831m8964
53186B145283n0566n1005n0630m9747m8243m6493m5597m5802m5640m3796m1219
53175A626545l9927m0122m0003l8357l5853l3568l1669k9882k8186k6525k4737
$$ y = [2352045, 2327650, 2305969, 2287492, 2271622, 2256675, 2241748, 2228126, 2217831, 2211243, 2207305, 2205678, 2207057, 2211278, 2216776, 2222653, 2230168, 2241395, 2257005, 2275753, 2295547, 2314853, 2333837, 2354395, 2378354, 2405505, 2434194, 2463786, 2495417, 2530028, 2566808, 2604087, 2640813, 2676552, 2710907, 2743698, 2775161, 2805448, 2834304, 2861385, 2886152, 2907298, 2923245, 2933784, 2940551, 2945360, 2948557, 2949228, 2946284, 2939014, 2927336, 2911852, 2892992, 2869971, 2841736, 2809242, 2775471, 2742271, 2708181, 2670396, 2628026, 2582329, 2534458, 2484580, 2433223, 2382160, 2333244, 2286733, 2241078, 2194247, 2145283, 2094717, 2043712, 1993082, 1943335, 1895092, 1848599, 1803002, 1757200, 1711560, 1667764, 1626545, 1586618, 1546496, 1506493, 1468136, 1432283, 1398715, 1367046, 1337164, 1308978, 1282453, 1257716]
53164A257716k3072k2062k1743k1700k1905k2571k3158k2632k1025j9747j9878
53153A018223k0878k1356k0627j9166j8050j8057j8888j9349j8673j7501j6832
53142H08846j6416j5218j3274j1939j2070j2967j3414j2951j1846j0678j0163
53131F67910j0629j1390j1296j0227r258r125r342r166q731q584q676q389p437
53118E45660o359o061o786p504o708m223j758j016j736k405k513k889l915m773
53104D87014m769m285l897l492k831k202j912j675j143o23p63j676k715k971k095
53089D49965q33n57j673k770k139p2J418J330Q66J314J925J065j139k665k132
53074D43903m12P01O79M27P10J183J160O29J06k01m07m51k16m6k89l61P42K783
$$ y = [1257716, 1234644, 1212582, 1190839, 1169139, 1147234, 1124663, 1101505, 1078873, 1057848, 1038101, 1018223, 997345, 975989, 955362, 936196, 918146, 900089, 881201, 861852, 843179, 825678, 808846, 792430, 777212, 763938, 751999, 739929, 726962, 713548, 700597, 688751, 678073, 667910, 657281, 645891, 634595, 624368, 615110, 605985, 596643, 587477, 578746, 570162, 561486, 553097, 545660, 539301, 533240, 526454, 518950, 512242, 508019, 506261, 505245, 503509, 501104, 498591, 495702, 491787, 487014, 482245, 477960, 474063, 470571, 467740, 465538, 463626, 461951, 460808, 460185, 459422, 457746, 455031, 452060, 449965, 449132, 448575, 446902, 444132, 441993, 441921, 443339, 444669, 445535, 446849, 448774, 449839, 448700, 446035, 443903, 443491, 444192, 444871, 445298, 446008, 447191, 448351, 448980, 449086, 448885, 448478, 448027, 447811, 447765, 447476, 447115, 447857, 450640]
53056D50640M175L930K735J632P72J60K85J020J028m40k108k399j617r90n78J0
53040D58255j35j949l892l416r12M29q19k441k232j105j092k235l292m026m908
53025D26230n489m839l162j547l78O97J580J621O95m87j090o42Q95K864M006L477
53009D24431J603o96k823m358m625l221q38J050J327j06k353l876l413j239Q25
52994D01688J151q7j383j609r14k04j77p03q77N3J693K811K687J604L8j857l619
52977D00295m298l460j786k01Q62J096K16j071j146M95K115J947P55O89J972K435
52961D00915N46k551m639m915m212l413k485q50J632M086N074M112K514K077K765
52946D00656K690P76j409j534L23J594M04k223l836l336j434Q63K892L688K291
$$ y = [450640, 454815, 458745, 461480, 463112, 463884, 464044, 464329, 465349, 466377, 465937, 463829, 461430, 459813, 458823, 458245, 458255, 458120, 456171, 452279, 448863, 447951, 448380, 447561, 445120, 442888, 441783, 440691, 438456, 435164, 431138, 426230, 420741, 415902, 412740, 411193, 410815, 411512, 413092, 414713, 415408, 414921, 413831, 413189, 414084, 416948, 420954, 424431, 426034, 425338, 422515, 418157, 413532, 410311, 409473, 410523, 411850, 411744, 409391, 405515, 402102, 400863, 401688, 402839, 402752, 401369, 399760, 398846, 398642, 398465, 397762, 396885, 396938, 398631, 401442, 404129, 405733, 405771, 403914, 400295, 395997, 392537, 390751, 390550, 391412, 392508, 392724, 391653, 390507, 391002, 393117, 395064, 395819, 396508, 398480, 400915, 401461, 398910, 394271, 389356, 385144, 381731, 379246, 378396, 380028, 384114, 389188, 393300, 395814, 397891, 400656, 403346, 404122, 402713, 401179, 401502, 403096, 403500, 401277, 397441, 394105, 392671, 393534, 396426, 400114, 402405]
52931D02405o17k624k120j61J249J891K974M583N350M712L771L322K681J364L89
52916D29169P19J530J521J043J261J775R59j308l126l226k615k656k851j696Q51
52901D21350L030L242J584n72j901k030j629j699k411k721j638K66J164Jk289
52886D13747l739l245j227J037K306J998N21r61j515j246r57j185j854k555k680
52871C98445j675J79J486J092l25j015m91j6n50j489j981k188k365j838j98J388
52855C88459J420J63q09q01m84m54n67n50j28J061K556K607K76k359k179O64K658
52838C91533J715k11m55N85Q42O2l53o3j2k24L95J780K226R07o39n77P55J570
52820C99836J185O44R78J831K158J558N19l26o73m70K44J290K471L644M480M369
$$ y = [402405, 401788, 399164, 397044, 396883, 398132, 400023, 402997, 407580, 412930, 417642, 421413, 424735, 427416, 428780, 429169, 429888, 431418, 432939, 433982, 435243, 437018, 437977, 436669, 433543, 430317, 427702, 425046, 422195, 420499, 421350, 424380, 427622, 429206, 428634, 426733, 424703, 423074, 421375, 418964, 416243, 414605, 414871, 416035, 416036, 413747, 410008, 406763, 405536, 406573, 408879, 410877, 411398, 410437, 408922, 407676, 406719, 405534, 403680, 401125, 398445, 396770, 396949, 398435, 399527, 399202, 398187, 397696, 397680, 397130, 395641, 393660, 391472, 389107, 387269, 387071, 388459, 389879, 390042, 389233, 388432, 387948, 387494, 386927, 386377, 386249, 387310, 389866, 392473, 392749, 390390, 388211, 388875, 391533, 393248, 393037, 392582, 393167, 394009, 394071, 393718, 393655, 393643, 393419, 393814, 395594, 397820, 398727, 398088, 397511, 398266, 399836, 401021, 401665, 402643, 404474, 406632, 408190, 408709, 408383, 407710, 407240, 407484, 408774, 411245, 414889, 419369, 423738]
52804D23738L206K199K919N083O240M442O27k572l842l899l734l618l820m770
52790D22199o070o497n572m256l506l064k236j090k61j54p98j910k751k684k211
52775C79139k632m071m745l069K02K793L332K198N01q45j257o53L84J071J063
52760C73411N33mJ93J468K935L019J387m21r42n37l38l20L30J403J716Q80j92
52743C84521o70p19q34j173j707k204k015p61O68Q15l71j294r27k16n01j421j489
52726C69702k77J145J828J880J601P18q57k200k161q32M79P99N17O02J197J489
52710C75630R30R0K9Q92J581J087j30o43j6M95l00j770k334j702r44m76M82J965
52692C74866K468J202j23N75K656L507K150L90J97J455K707K920K032P54J71Q11
$$ y = [423738, 426944, 429143, 432062, 437145, 443385, 447827, 448454, 445882, 442040, 438141, 434407, 430789, 426969, 422199, 416129, 409632, 404060, 399804, 396298, 393234, 390998, 389908, 389647, 389493, 388695, 386785, 384034, 381350, 379139, 376507, 372436, 367691, 364622, 364824, 367617, 370949, 373147, 373648, 372803, 371546, 370893, 371277, 372348, 373411, 373944, 373940, 374133, 375601, 378536, 381555, 382942, 382521, 381579, 381042, 380704, 380384, 380714, 382117, 383833, 384713, 384521, 383851, 383132, 382298, 381125, 379418, 377214, 375199, 374438, 375106, 375921, 375550, 374256, 373329, 373113, 372612, 371191, 369702, 369425, 370570, 372398, 374278, 375879, 376597, 375740, 373540, 371379, 370547, 371026, 371825, 372342, 372944, 374141, 375630, 376560, 376650, 376679, 377571, 379152, 380239, 380109, 379466, 379450, 379945, 379645, 377875, 375541, 373839, 372895, 372419, 372901, 374866, 377334, 378536, 378413, 378988, 381644, 385151, 387301, 387691, 387888, 389343, 392050, 394970, 397002, 397756, 397927, 398738]
52676C98738J709J443J82l22P38K075K352K171K783L695L118O10j993k717j633
52661D12949n20p14j876k718k521j671r52q02j230j823j726m36J006O42j814l945
52645C91849l382p71J338J879J818J822J440O68L45N39L29l73m55L80R55O84M86
52628C99551Q58Q52O6k23O84J243j0j862k134r21j74p07j522j779j727j696j553
52611C88946j170m64P56K143K562J477J4m67k26l13n22K58J961L205L288K961
52595D04409L083L589L994L976L373K301J309P42K12o54j287r14J94J059J259
52580D26645R10j13j748k921k490j040m25j324k272j618M48K227K525J862J707
52565D22373K557L138K117K88k16R28J493k2k026k145o14M45J97m27p92j152j375
$$ y = [398738, 400447, 401890, 402072, 401750, 402488, 404563, 406915, 409086, 411869, 415564, 418682, 419292, 417299, 414582, 412949, 412429, 411715, 409839, 407121, 404600, 402929, 401977, 401175, 399945, 398122, 396396, 395960, 396966, 397608, 395794, 391849, 388467, 387696, 389034, 390913, 392731, 394553, 395993, 396661, 397006, 397545, 397874, 397501, 397046, 397426, 398381, 399065, 399551, 400409, 401261, 401327, 401104, 401788, 403031, 403021, 401159, 399025, 398104, 397930, 397223, 395701, 393922, 392195, 390499, 388946, 387776, 387312, 388068, 390211, 392773, 394250, 394264, 393797, 393571, 393258, 392736, 392994, 394955, 398160, 401448, 404409, 407492, 411081, 415075, 419051, 422424, 424725, 426034, 426776, 426988, 426334, 425047, 424133, 424327, 425386, 426645, 427555, 427442, 425694, 422773, 420283, 419243, 418818, 417494, 415222, 413604, 414052, 416279, 418804, 420666, 422373, 424930, 428068, 430185, 430473, 430257, 431185, 432678, 432656, 430630, 428485, 427871, 428316, 428513, 428086, 427294, 426142, 424767]
52548D24767r48l61p78k158l067k573j187Q6N73mj020q58J278L737M103K337O31
52531D24558K80N54O61R14J473J690J385J216J234N05j124k317k045r37j04K45
52515D28188M04M22N05J115K007K108R84l92r65q77q55j100j366j489j325p08
52499D26656J68P74Q07L30n09j275j229m11k63j852l850l907j874Q2P00J000K016
52482D17363L125L429L100K500J460K91QO39P90j64r99q04n23j039j306j11J576
52465D29335J966J139N41N26L58J89R90K370K498O86j302j292Q39L289M306L553
52449D49991J987Q48O97J175J600J567J016R6q58j488j804k084k372k430k156
52434D45785j594o06Q12J911J774O01m19o68o88j033j481j676j599j134r6J050
$$ y = [424767, 423819, 423458, 422680, 420522, 417455, 414882, 413695, 413781, 414354, 414350, 413330, 412472, 413750, 417487, 421590, 423927, 424558, 424838, 425392, 426053, 426967, 428440, 430130, 431515, 432731, 433965, 434470, 433346, 431029, 428984, 428047, 427943, 428188, 428592, 429014, 429519, 430634, 432641, 434749, 435733, 435341, 434376, 433499, 432644, 431544, 430178, 428689, 427364, 426656, 426824, 427598, 428405, 428735, 428226, 426951, 425722, 425311, 425048, 423196, 419346, 415439, 413565, 413647, 414347, 415347, 417363, 420488, 423917, 427017, 429517, 430977, 431268, 431276, 431915, 432705, 432541, 431542, 430738, 430215, 429176, 427870, 427759, 429335, 431301, 432440, 432981, 433507, 433865, 434054, 435044, 437414, 439912, 440598, 439296, 438004, 438843, 442132, 446438, 449991, 451978, 452826, 453523, 454698, 456298, 457865, 458881, 458977, 458119, 456631, 454827, 452743, 450371, 447941, 445785, 444191, 443585, 444397, 446308, 448082, 448683, 448264, 447596, 446908, 445875, 444394, 442718, 441119, 439985, 439889, 440939]
52418D40939J559J608J996K384J426q69k431j768J37J534K217K904L509L426K747
52403D61318J979J200N08M41R69R77j37j273j146j02P39J145J264M99j367k853
52387D64161k389p47r6j027k285l057l499l223j358J393K739J655j73n90M41J316
$$ y = [440939, 442498, 444106, 446102, 448486, 449912, 449043, 446612, 444844, 444981, 446515, 448732, 451636, 455145, 458571, 461318, 463297, 464497, 465005, 465446, 466415, 467392, 467255, 465982, 464836, 464734, 465473, 466618, 467882, 468381, 467014, 464161, 461772, 461025, 460929, 459902, 457617, 454560, 451061, 447838, 446480, 447873, 450612, 452267, 452094, 451504, 451945, 453261]
$$ [...]
##END NTUPLES=NMR SPECTRUM
##END=
