
##TITLE=UV1022_M2-1005-1001_6269760_26eSw2VOLz
##JCAMPDX= 6.0         $$ Bruker NMR JCAMP-DX V2.0
##DATA TYPE= NMR SPECTRUM
##DATA CLASS= NTUPLES
##ORIGIN= BRUKER
##OWNER= Administrator
$$ 1.72 TOPSPIN		Version 2.1
$$ 2012-06-02 06:26:04.265 -0500  Administrator@TOPSPIN
$$ Compression mode = diff/dup
##.OBSERVE FREQUENCY= 400.13188235
##.OBSERVE NUCLEUS= ^1H
##.ACQUISITION MODE= SIMULTANEOUS (DQD)
##.ACQUISITION SCHEME= undefined
##.AVERAGES= 8
##.DIGITISER RES= 22
##SPECTROMETER/DATA SYSTEM= spect
##.PULSE SEQUENCE= zg30
##.SOLVENT NAME= COFFEE_calctemp
##.SHIFT REFERENCE= INTERNAL, COFFEE_calctemp, 1, 14.98061
##AUDIT TRAIL= $$ (NUMBER, WHEN, WHO, WHERE, PROCESS, VERSION, WHAT)
$$ ##TITLE= Audit trail, TOPSPIN		Version 2.1
$$ ##JCAMPDX= 5.01
$$ ##ORIGIN= Bruker BioSpin GmbH
$$ ##OWNER= Administrator
$$ $$ C:\Bruker\TOPSPIN/data/COFFEE/nmr/UV1022_M2-1005-1001_6269760_26eSw2VOLz/20/pdata/1/auditp.txt
$$ ##AUDIT TRAIL=  $$ (NUMBER, WHEN, WHO, WHERE, PROCESS, VERSION, WHAT)
(   1,<2012-06-02 06:25:57.093 -0500>,<Administrator>,<TOPSPIN>,<go>,<TOPSPIN 2.1>,
      <created by zg
	started at 2012-06-02 06:24:50.500 -0500,
	POWCHK enabled, PULCHK disabled,
       configuration hash MD5:
       D5 CA 7A 23 FE 6B EE E2 50 67 74 61 24 F7 5E 3B
       data hash MD5: 64K
       6F 75 01 D7 FF 07 7B 5B 21 07 8D 0C 4E 0C 65 DA>)
(   2,<2012-06-02 06:26:00.078 -0500>,<Administrator>,<TOPSPIN>,<proc1d>,<TOPSPIN 2.1>,
      <Start of raw data processing
       efp LB = 0 FT_mod = 6 PKNL = 1 PHC0 = 0 PHC1 = 0 SI = 32K 
       data hash MD5: 32K
       C3 A7 6D EC E4 0C DE CC 3E FE 55 47 43 54 F6 FF>)
(   3,<2012-06-02 06:26:00.421 -0500>,<Administrator>,<TOPSPIN>,<proc1d>,<TOPSPIN 2.1>,
      <pk PHC0 = 208.515 PHC1 = 0 
       data hash MD5: 32K
       5F 71 DB 02 55 77 1F 4F 2D E6 ED 3D 84 49 87 2F>)
(   4,<2012-06-02 06:26:00.484 -0500>,<Administrator>,<TOPSPIN>,<proc1d>,<TOPSPIN 2.1>,
      <abs ABSG = 1 
       data hash MD5: 32K
       B7 BB 64 A3 38 A5 08 50 74 C4 5E D6 D1 FB D8 32>)
(   5,<2012-06-02 06:26:00.515 -0500>,<Administrator>,<TOPSPIN>,<proc1d>,<TOPSPIN 2.1>,
      <abs ABSG = 2 
       data hash MD5: 32K
       72 BE AA 48 DE 9F A3 09 27 A6 CF 02 C0 9A 4F 35>)
(   6,<2012-06-02 06:26:00.546 -0500>,<Administrator>,<TOPSPIN>,<proc1d>,<TOPSPIN 2.1>,
      <abs ABSG = 3 
       data hash MD5: 32K
       5E 72 10 92 EE F4 95 EF BB 86 D5 EB 2C 25 14 04>)
(   7,<2012-06-02 06:26:00.578 -0500>,<Administrator>,<TOPSPIN>,<proc1d>,<TOPSPIN 2.1>,
      <abs ABSG = 4 
       data hash MD5: 32K
       F0 00 9A EA AC CA 5E 60 63 33 E0 5E 40 5D A6 D8>)
(   8,<2012-06-02 06:26:00.609 -0500>,<Administrator>,<TOPSPIN>,<proc1d>,<TOPSPIN 2.1>,
      <abs ABSG = 5 
       data hash MD5: 32K
       F7 F6 0E BF 01 51 96 32 29 71 E2 ED C8 21 08 6A>)
$$ ##END=
$$ 
$$ $$ hash MD5
$$ $$ 3A 23 3D 10 48 48 40 23 58 FC D7 70 51 B0 47 2E
##$RELAX= 
##$RELAX= 
##$RELAX= 
##$RELAX= 
##$RELAX= 
##$RELAX= 
##$RELAX= 
$$ Bruker specific parameters
$$ --------------------------
$$ [...]
##$TP= (0..7)
150 150 150 150 150 150 150 150
##$TP07= 0
##$TPNAME0= <>
##$TPNAME1= <>
##$TPNAME2= <>
##$TPNAME3= <>
##$TPNAME4= <>
##$TPNAME5= <>
##$TPNAME6= <>
##$TPNAME7= <>
##$TPOAL= (0..7)
0.5 0.5 0.5 0.5 0.5 0.5 0.5 0.5
##$TPOFFS= (0..7)
0 0 0 0 0 0 0 0
##$TUNHIN= 0
##$TUNHOUT= 0
##$TUNXOUT= 0
##$USERA1= <user>
##$USERA2= <user>
##$USERA3= <user>
##$USERA4= <user>
##$USERA5= <user>
##$V9= 5
##$VALIST= <valist>
##$VCLIST= <CCCCCCCCCCCCCCC>
##$VD= 0
##$VDLIST= <DDDDDDDDDDDDDDD>
##$VPLIST= <PPPPPPPPPPPPPPP>
##$VTLIST= <TTTTTTTTTTTTTTT>
##$WBST= 2048
##$WBSW= 25
##$XGAIN= (0..3)
0 0 0 0
##$XL= 0
##$YL= 0
##$YMAX_a= 534724
##$YMIN_a= -658461
##$ZGOPTNS= <>
##$ZL1= 120
##$ZL2= 120
##$ZL3= 120
##$ZL4= 120
##$ABSF1= 14.98061
##$ABSF2= -5.57192
##$ABSG= 5
##$ABSL= 3
##$ALPHA= 0
##$AQORDER= 0
##$ASSFAC= 0
##$ASSFACI= 0
##$ASSFACX= 0
##$ASSWID= 0
##$AUNMP= <proc_prof1d_extract_pilot.lims>
##$AXLEFT= 0
##$AXNAME= <>
##$AXNUC= <1H>
##$AXRIGHT= 0
##$AXTYPE= 0
##$AXUNIT= <>
##$AZFE= 0.1
##$AZFW= 0.1
##$BCFW= 0
##$BC_mod= 0
##$BYTORDP= 0
##$COROFFS= 0
##$CY= 15
##$DATMOD= 1
##$DC= 0
##$DFILT= <>
##$DTYPP= 0
##$F1P= 0
##$F2P= 0
##$FCOR= 0.5
##$FTSIZE= 32768
##$FT_mod= 6
##$GAMMA= 0
##$GB= 0
##$INTBC= 1
##$INTSCL= 1
##$ISEN= 128
##$LB= 0
##$LEV0= 0
##$LPBIN= 0
##$MAXI= 10000
##$MC2= 0
##$MEAN= 0
##$ME_mod= 0
##$MI= 0
##$NCOEF= 0
##$NC_proc= -8
##$NLEV= 6
##$NOISF1= 0
##$NOISF2= 0
##$NSP= 0
##$NTH_PI= 0
##$NZP= 0
##$OFFSET= 14.98061
##$PC= 1
##$PHC0= 208.515
##$PHC1= 0
##$PH_mod= 1
##$PKNL= yes
##$PPARMOD= 0
##$PPDIAG= 0
##$PPIPTYP= 0
##$PPMPNUM= 2147483647
##$PPRESOL= 1
##$PSCAL= 4
##$PSIGN= 0
##$PYNMP= <proc.py>
##$REVERSE= no
##$SF= 400.13
##$SI= 32768
##$SIGF1= 0
##$SIGF2= 0
##$SINO= 400
##$SIOLD= 32768
##$SPECTYP= <>
##$SREGLST= <1H.CDCl3>
##$SSB= 0
##$STSI= 32768
##$STSR= 0
##$SW_p= 8223.68421052632
##$SYMM= 0
##$S_DEV= 0
##$TDeff= 65536
##$TDoff= 0
##$TI= <>
##$TILT= no
##$TM1= 0
##$TM2= 0
##$TOPLEV= 0
##$USERP1= <user>
##$USERP2= <user>
##$USERP3= <user>
##$USERP4= <user>
##$USERP5= <user>
##$WDW= 1
##$XDIM= 32768
##$YMAX_p= 463820891
##$YMIN_p= -682579
##$CURPLOT= <Network HP LaserJet P1505>
##$CURPRIN= <$Network HP LaserJet P1505>
##$DFORMAT= <normdp>
##$LAYOUT= <+/1D_H.xwp>
##$LFORMAT= <normlp>
##$PFORMAT= <normpl>
##$SURQMSG= 1
$$ End of Bruker specific parameters
$$ ---------------------------------
##NTUPLES= NMR SPECTRUM
##VAR_NAME=  FREQUENCY,     SPECTRUM/REAL,   SPECTRUM/IMAG
##SYMBOL=    X,             R,               I
##VAR_TYPE=  INDEPENDENT,   DEPENDENT,       DEPENDENT
##VAR_FORM=  AFFN,          ASDF,            ASDF
##VAR_DIM=   32768,         32768,           32768
##UNITS=     HZ,            ARBITRARY UNITS, ARBITRARY UNITS
##FACTOR=    0.250966925370066, 1,           1
##FIRST=     8223.43324360095, -23072,       -109317
##LAST=      0,             -179795,         -26412
##MIN=       0,             -682579,         0
##MAX=       8223.43324360095, 463820891,    0
$$ Real data points
##PAGE= N=1
##DATA TABLE= (X++(R..R)), XYDATA
$$ [...]
19528b55183c3283j76777G7889a40877l8666A25159C1729b65539B6543J12874
19518A39417a42427L4511D4679J38973a15902j3794Q148c3531P903A9369c74030
19506a45352A15967k308l93a09766l46268d3192j23443J5491c4090A99557C2256
19494c80898F7934g7992q8621g0464A66278a14218F771f3479k15656J26849D4280
19482c467B04967a56896M8421N271A34968b40818C21918m4028A14206a60066k4706
19471a84772q2463C13952H3807c14516A46730e9777k38159B45727p3612a11378
19460d6725r7380l3507B11891b33994P6901B1213K63736b2690A37251k0551a37704
19448d4645j11640E3864d98587a50675J7160B47751e2415B29716a84641A7981
$$ y = [-255183, -33283, -210060, 77889, -140877, -179543, 125159, 31729, -265539, 26543, 139417, -142427, -107916, 44679, 183652, -115902, -129696, -121548, -33531, -25628, 19369, -374030, -145352, 115967, 113659, 113266, -109766, -456034, -43192, -166635, -151144, -34090, 199557, 32256, -380898, 67934, -77992, -166613, -70464, 166278, -114218, 6771, -63479, -279135, -152286, 44280, -3467, 204967, -156896, -108475, -103204, 134968, -240818, 321918, 277890, 114206, -160066, -184772, -267235, 313952, 83807, -314516, 146730, -59777, -297936, 245727, 172115, -111378, -46725, -144105, -177612, 211891, -233994, -157093, 21213, 284949, -22690, 137251, 116700, -137704, -44645, -156285, 53864, -498587, -150675, -133515, 247751, -52415, 229716, -184641, 17981]
19437a07066j37385D6759b68157a20500k13870I6517a73016J518P3750O710A55303
19425b59725R5235E5224b02889B0911f2493p6650j23058a29932G6641O4568P6698
19414B17907b4673j71357B42907a53051A2285g8910r6470A42083a22502N3901
19404f8601k01274B6024P1173a66798j36317D3433J78379a32905j89508N8752
19394b63661a22949l0901q2609c4103B5321J88363D5863R7093J36332I8345K2045
19383A20390f7886A66410a62537O0957k20405D6297M66062A6635b19554n6164
19373b75718B24664a79046b5491k12119J02068k18838A54196b30464R5272C92251
19362a11954r9141A50718k6330e7579l33606a84513n7956J16925j77632Q6658
$$ y = [-107066, -244451, 46759, -268157, -120500, -334370, 96517, -173016, -171498, -97748, -91038, 155303, -259725, -164490, 55224, -202889, 20911, -62493, -139143, -262201, -129932, 76641, 141209, 217907, -24673, -196030, 242907, -153051, 12285, -78910, -175380, 142083, -122502, -68601, -269875, 26024, 97197, -166798, -303115, 43433, 221812, -132905, -322413, -263661, -122949, -153850, -236459, -34103, 25321, 213684, 45863, 142956, 279288, 98345, 120390, -67886, 166410, -162537, -101580, -321985, 46297, 512359, 16635, -219554, -275718, 224664, -179046, -25491, -237610, -135542, -354380, 154196, -230464, -135192, 392251, -111954, -211095, 150718, 124388, -57579, -391185, -184513, -242469, -125544, -303176, -216518]
19352b16518A24932b44887M9569M5043J3620j37496A2262N9333b42119L78c7803
19340d872k73742A05661b2883n4130q1074C5099J42116n1955f1603A50644n7276
19329I3368b80663a19941l6605A5200K44281c74392A86365J53516a1935k58490
19319b70425b3307j95381C3401K13406h0594B48833b30578A30756M8093a11197
19308F6647a03458A11492J8796a05446B95693a29284j22683A17384a49117p6380
19298b25497k5005m0241H6528b06573A84112d37107e3754K4728F8689O2051D9617
19286C5297M0361c90716G6473e1195B8649d070l47578A58067b31185C27806a9133
19274B81627a34246B25615a81370r4463A82553a22366a5286k38513a22456A3323
$$ y = [-216518, 124932, -244887, -195318, -150275, -136655, -274151, 12262, 71595, -242119, -241741, -37803, -4872, -278614, 105661, -22883, -77013, -158087, 35099, 177215, 125260, -61603, 150644, 93368, -280663, -119941, -156546, 15200, 259481, -374392, 186365, 339881, -11935, -270425, -23307, -218688, 33401, 246807, -80594, 248833, -230578, 130756, 178849, -111197, 66647, -103458, 111492, 130288, -105446, 295693, -129284, -251967, 117384, -149117, -225497, -250502, -290743, 86528, -206573, 184112, -437107, -53754, -29026, 68689, 130740, 49617, 35297, 75658, -390716, 76473, -51195, 28649, -4070, -351648, 158067, -231185, 327806, -19133, 281627, -134246, 225615, -181370, -275833, 182553, -122366, -15286, -253799, -122456, 13323]
19263c47847a28346A15676j8732e7915G4322b98576A73539L3800a47480o732I7171
19251g6513k1354m2086N448A47622b54683R1608c6142j84235p0067J13171B37465
19239a0634p0600L6008e649l19795N0416q421K053a08721k8597a7852q8168e2263
19226g8365n6549j13170G9114a54820I2144c15784J49317I1397O1743F7677J4406
19215H2083K7321a81278h5137j72579R6059q1787c0405C26159f1470j4987A21183
19203C21710a70801A73129J8291c81139c392l6782D4826K94575g9580E8686a59623
19191a03606k54767B16680a22766D165a44474A30731b10223F6847A4242a70813
19180a09215N0262l6186L4313C9147a23993I4985f487j07464k87464d1093a6188
$$ y = [-347847, -128346, 115676, 96944, -57915, 74322, -298576, 173539, 207339, -147480, -154212, 97171, -76513, -97867, -139953, -134505, 147622, -254683, -163075, -36142, -220377, -290444, -177273, 237465, -10634, -81234, -45226, -5649, -325444, -275028, -283449, -281396, -108721, -137318, -17852, -106020, -52263, -78365, -134914, -248084, 79114, -154820, 92144, -315784, -166467, 91397, 153140, 67677, 82083, 109404, -181278, -85137, -257716, -161657, -243444, -30405, 326159, -61470, -76457, 121183, 321710, -170801, 173129, 191420, -381139, -3392, -40174, 44826, 339401, -79580, 58686, -159623, -103606, -358373, 216680, -122766, 4165, -144474, 130731, -210223, 66847, 14242, -170813, -109215, -58953, -95139, -60826, 39147, -123993, 94985, -6487, -113951, -401415, -41093, -16188]
19168B26870b25939E7486e5848H6295K58297e5163l51374F5613j4202b14431i1268
19156A63402a77929l03074K12984a19030a5842A73883N6813B8552a45199I7446
19145a23344k2056j66743A66980C952i5277j45713A47452K1769a5199j38573r5156
19134b48928d7694j59657k26765a61026o877B18490b87A90646a51927l3104b3239
19122b03683l6607R0605k27915g9922j90012j11683a71791L6134J0182B7654g3491
19110A34446B2126c283j28343A9188E581K53396A7703L13563e351k32316D4917
19098a08048b798A83334L5571d2300j4482k52823h8831b6189F1147L2201d4772
19086a36312m5738j0470h5011B29540d96512A79770g4242k21660F4333h7021A44271
$$ y = [226870, -225939, 57486, -55848, 86295, 344592, -55163, -406537, 65613, 51411, -214431, -91268, 163402, -177929, -481003, -268019, -119030, -15842, 173883, 230696, 28552, -145199, 97446, -123344, -145400, -312143, 166980, 3952, -95277, -240990, 147452, 169221, -15199, -153772, -248928, -47694, -207351, -434116, -161026, -167903, 218490, -287, 190646, -151927, -185031, -23239, -203683, -240290, -149685, -377600, -79922, -269934, -381617, -171791, -135657, -125475, 27654, -73491, 134446, 22126, -3283, -131626, 19188, 5581, 258977, 17703, 331266, -5351, -237667, 44917, -108048, -2798, 183334, 218905, -42300, -56782, -309605, -88831, -26189, 61147, 93348, -44772, -136312, -182050, -192520, -85011, 229540, -496512, 179770, -74242, -295902, 64333, -87021, 144271]
19074b18984L5433k3020E5301b94532J00819j65924A45547o6399b27708B22675
19063b94266a02261k71631b4747E7385N9396A9968b38132A89709b25107A6340
19052a21850A58316F8678J53426e2909D1233M2457b16940i8343m9262G658a27060
19040H0272K50955a88270f9266J1251r3498D02261D4282c03319k4637B04928p6448
19029A28480B2982b35049i6531C5306N3798b02722B4424a06882E3600J12858b85683
19017C41624A02709l1493e5743A06700J9650N5550c42009G8906a3076k93803p3233
19006c80112A1848a48968A76216H4800e5324a8414B94827c58834g8191n5782A89317
18994a8693r7640D3918Q1679b6528H6620K9036e5159B20123b72631g6967A36601
$$ y = [-218984, -183551, -206571, 55301, -294532, -193713, -359637, 145547, 79148, -227708, 222675, -294266, -102261, -373892, -24747, 57385, 116781, 19968, -238132, 189709, -225107, 16340, -121850, 158316, 68678, 222104, -52909, 41233, 83690, -216940, -98343, -147605, 7658, -127060, 80272, 331227, -188270, -69266, -58015, -151513, 402261, 44282, -303319, -327956, 204928, 128480, 22982, -235049, -96531, 35306, 89104, -202722, 24424, -106882, 53600, 166458, -285683, 341624, 102709, 71216, -55743, 106700, 126350, 181900, -342009, 78906, -13076, -306879, -380112, 11848, -148968, 176216, 84800, -55324, -18414, 294827, -358834, -78191, -133973, 189317, -18693, -116333, 43918, 125597, -26528, 86620, 115656, -55159, 220123, -272631, -76967, 136601]
18982i2534I1957b38924A23673b09264F8853J1733a15438j4294p026f0360A0304
18970b10676K7123F981a12512j821n698a7927j92337J02418A31425b09264c3246
18958A60125P6757C4426l499N6593d31901a88317F441i5240G1998Q248Q2232b75805
18945A12047b3404E4293O0444c3983j82427F9938J9247J12a83017e2039k40343
18934b92382c8847H6603C5517a59110d0082E6929e79l25857B09400l4589l9885
18923A34926d1353a442F3526a89070a1038A13634A4384b7974M455j10777j84915
18912c19211C14521j56683O4076c2805A57526c26821B9162b83385c2816C7023
18901A16598c42521A86581H2467d3054A06357O8177j2247C5455J5615c03734b7742
$$ y = [-92534, 91957, -238924, 123673, -209264, 68853, 80586, -115438, -129732, -136758, -60360, 10304, -210676, -183553, 6981, -112512, -114333, -120031, -17927, -210264, -107846, 131425, -209264, -33246, 160125, 236882, 34426, 30927, 87520, -431901, -188317, 6441, -95240, 71998, 80246, 162478, -275805, 112047, -23404, 54293, 114737, -33983, -216410, 69938, 89185, 89297, -183017, -52039, -292382, -38847, 86603, 35517, -159110, -40082, 56929, -579, -326436, 209400, 174811, 134926, -41353, -1442, 63526, -189070, -11038, 113634, 14384, -27974, -23519, -134296, -319211, 314521, 157838, 221914, -32805, 157526, -326821, 29162, -283385, -32816, 37023, 116598, -342521, 186581, 82467, -43054, 106357, 174534, 162287, 35455, 51070, -303734, -27742]
18889a86286e7847b2044j89351a891F2286a79132c7300A8841a41814A07115M24412
18878E31527F1655b40314Q4112j48131g8065J7467A22672h9225D6238K10932O152
18867B63322B7096a64986A4157M2995E719a19421A87663d1850E750d9959r8678
18856a48637q3983e263G8858A0557h8115C77616e2702l9874r3019j244L3246H0171
18843B26303f6328a0479j16843j67096J05585j82093i1513o4234c557k85779B97772
18831b26478l0431I497b7552C2419a09127H7482a25678k7974e4024q8901A36805
18819A27932o2287A6335g0209k2616B75871c55103J19482A63555a34712O5628
18809f9084j22848f4584F6879a30776G220J41779f5620j21227c5765p0269A17478
$$ y = [-186286, -57847, -22044, -211395, -1891, 62286, -179132, -37300, 18841, -141814, 107115, 531527, 61655, -240314, -156202, -304333, -78065, -60598, 122672, -89225, 46238, 257170, 263322, 27096, -164986, 14157, 57152, 5719, -119421, 187663, -41850, 5750, -49959, -148637, -232620, -5263, 78858, 10557, -88115, 377616, -52702, -92576, -185595, -186839, -153593, 80171, 226303, -66328, -10479, -127322, -294418, -188833, -370926, -91513, -155747, -3557, -289336, 297772, -226478, -256909, 9497, -27552, 32419, -109127, 87482, -125678, -153652, -54024, -142925, 136805, 127932, 65645, 16335, -70209, -92825, 275871, -355103, -235621, 163555, -134712, -69084, -191932, -64584, 66879, -130776, 7220, 148999, -65620, -186847, -35765, -106034, 117478]
18797A02867k1361K5164D2306j4709J57002c03007C26329a08322F8297N199f5112
18785B86048a51751N948N5514j3656d357l12380d4234j00266j32782g7797A16827
18773B20795j0244d37229A12901A4308b05296i1044j45254C4733a17788o7546
18763a85334l61891a33977B68733p5487g779j24613m2622j5876f9276k71468J34086
18752b06658f6134j27460C91454i2759k34686D0966O8781b13023k53334g9774
18741A19444K14008A17186g394I7676d1114A8765f7583b0913j94877a5458q556
18730b4014H7697B3007a12171B87919B7960i369M622j10558F175b7981j60030
18719a88011L0777G4753f6569a014j1168A6774M5511B1057a32139L323d5362j51699
$$ y = [102867, 81506, 106670, 42306, 27597, 184599, -303007, 326329, -108322, 68297, 73496, -65112, 286048, -151751, -145803, -90289, -103945, -4357, -316737, -44234, -144500, -277282, -77797, 116827, 220795, 210551, -437229, 112901, 14308, -205296, -91044, -236298, 34733, -117788, -185334, -547225, -133977, 268733, 193246, -7779, -132392, -175014, -190890, -69276, -340744, -206658, -66134, -193594, 391454, -92759, -327445, 40966, 109747, -213023, -466357, -79774, 119444, 333452, 117186, -7394, 97676, -41114, 18765, -67583, -20913, -215790, -15458, -24014, 87697, 23007, -112171, 287919, 27960, -9369, -4747, -115305, 6175, -27981, -188011, -157234, 74753, -66569, -1014, -12182, 16774, 62285, 21057, -132139, -128816, -45362, -197061]
18707a97061Q2696m532a4589E5524b20521i7826M1823l4797h241k16793A31662
18695A20606a72627O8549j78175l4443a53790J58j72083B04809d00664f6838K8553
18684c8285B32847a28430D7867a1741B1796K32235B9148d2211j4558C5439c3092
18672a73234A53897a06816B3729b80772A06022a45963a7398j11928A19108j2456
18662A06652e65018A77626a25332C82593c26338Q3707F1374b45766B35436A13876
18651F9502f5867D4180a08525A41286b13212a4131I9355b50334O8257E0403a05336
18639a60649p4025N3352L3055O9912j99769C5567a72304A66153J2035n3298b33685
18627c3232A49500b54825p4932a53325A3866a81147A59208b37280j91005e5858
$$ y = [-197061, -114365, -118897, -14589, 55524, -220521, -97826, -56003, -90800, -8241, -225034, 131662, 120606, -172627, -104078, -282253, -316696, -153790, -153632, -325715, 204809, -400664, -66838, -38285, 232847, -128430, 47867, -11741, 21796, 254031, 29148, -42211, -56769, 35439, -33092, -173234, 153897, -106816, 23729, -280772, 106022, -145963, -17398, -129326, 119108, 106652, -565018, 177626, -125332, 382593, -326338, -242631, 61374, -245766, 235436, 113876, 69502, -65867, 44180, -108525, 141286, -213212, -14131, 99355, -250334, -182077, 50403, -105336, -160649, -234674, -181322, -148267, -78355, -278124, 35567, -172304, 166153, 178188, 124890, -233685, -33232, 149500, -254825, -329757, -153325, 13866, -181147, 159208, -237280, -428285, -55858]
18616A05773J35657G1412K8950Q094E776P5571e5754A23807b32815D03641a06914
18604b13027B2167a76391j98679A3654K41858A06769A6153K15810a81061F5499
18593A2392L09139b09737P8162j8862M2143q303M2935L2287B04506b30489j6002
18582b46491a6612B1232k157M3005I304a59492g2432A75583F9607P408P0053e35330
18569B91557D0894L69030b49350G1458c7673A40603a00688k9628j81672M5A38537
18557E9688f9469o2361A55796b1666k41312B9387c74125B26040g9668I8116c47114
18545a52321A53953F3718b11190D9114g4474o6985N9760A58152F3841b2364A66276
18533a58514A06719O4065h6752k32180D51500h9985F5921K9849G337a1249C1505
$$ y = [105773, 241430, 71412, 100362, 108456, 5776, 81347, -55754, 123807, -232815, 403641, -106914, -213027, 22167, -176391, -375070, 13654, 255512, 106769, 16153, 231963, -181061, 65499, 12392, 321531, -209737, -131575, -150437, -108294, -116597, -73662, -41375, 204506, -230489, -246491, -16612, 21232, 19075, 62080, 9304, -159492, -72432, 175583, 69607, 77015, 147068, -535330, 291557, 40894, 409924, -249350, 71458, -37673, 140603, -100688, -130316, -311988, -311943, 138537, 59688, -69469, -131830, 155796, -21666, -262978, 29387, -374125, 226040, -79668, 98116, -347114, -152321, 153953, 63718, -211190, 49114, -74474, -141459, -81699, 158152, 63841, -22364, 166276, -158514, 106719, 170784, -86752, -318932, 451500, -89985, 65921, 95770, 7337, -11249, 31505]
18521a81400f0564m3394k7824A06954B7625M4885a36319j28488Q5670A38302a69429
18509I3430j3135B2774J32709n6155a41225l2501j19609p940j24934F8120a13737
18497g4383K9111j37473k5894j0023m356F1653b8528F8352a17478b1597o4750
18486h6347B65069D4297e2772J1374p6426M9841j99966A38946G350h9439I8978
18474b41268a12072A84764a40762o4794j04756a35666A34296j3107C3318a55935
18463G530M0181b41635c6214A18592b3105p2122j53278I4426f8166G8661l251
18452G5410A3082P8468a1124I7745D1597a91873O8967k7061C8308R4530a98110
18440A20279J14698q9225K627b5702m3330A05790d4505A25612d24015J9041G3044
$$ y = [-181400, -60564, -103958, -131782, 106954, 27625, 72510, -136319, -264807, -179137, 138302, -169429, 93430, 80295, 22774, 155483, 99328, -141225, -173726, -293335, -301275, -426209, 68120, -113737, -74383, -45272, -182745, -208639, -218662, -223018, 61653, -28528, 68352, -117478, -21597, -86347, 265069, 44297, -52772, -41398, -117824, -67983, -267949, 138946, 7350, -89439, 98978, -241268, -112072, 184764, -140762, -205556, -310312, -135666, 134296, 121189, 33318, -155935, 7530, 47711, -241635, -36214, 118592, -23105, -95227, -248505, 94426, -68166, 78661, 75410, 13082, 91550, -11124, 97745, 41597, -191873, -122906, -149967, 38308, 132838, -198110, 120279, 234977, 145752, 148379, -25702, -69032, 105790, -44505, 125612, -424015, -404974, 73044]
18428i870p5348N708B8920J38164A1405c23370K8115a4292p4525L0453j45864
18417b04228R0929j7801M2694B53512e0234j78798R9991K8690K8E4924J42311
18406A97235a25703n8455B07718a59973C0968B276J45119M4280F7342n542a15465
18394a55430F5439e0050A1817f3519j65811f7890A44897b71590A0458a09176A95688
18382H4465a63256q4580j25725A84295I803a86473h2382j79383J24238d5087k04375
18371b49462d956D6776M9434J30396a6504k62748A52798B5804K32410k1648a32327
18359C3993h5965E0897P974c7789I0567c7748A83267R2874a72785C16938b98768
18347b73092R8051A44339O1727c61243F713L6121i707j6773j52868j97202d4553
$$ y = [-9870, -85218, -79510, 28920, 167084, 11405, -323370, -295255, -14292, -88817, -58364, -204228, -113299, -131100, -88406, 253512, -50234, -229032, -129041, -100351, -100323, 54924, 197235, -125703, -184158, 207718, -159973, 30968, 2276, 147395, 191675, 67342, 61800, -115465, -155430, 65439, -50050, 11817, -63519, -229330, -67890, 144897, -271590, 10458, -109176, 195688, 84465, -163256, -247836, -373561, 184295, 9803, -186473, -82382, -261765, -137527, -45087, -249462, -4956, 46776, 96210, 226606, -16504, -279252, 152798, 25804, 258214, 236566, -132327, 33993, -85965, 50897, 58871, -37789, 90567, -37748, 183267, 276141, -172785, 316938, -298768, -273092, -175041, 144339, 206066, -361243, 6713, 42834, -9707, -26480, -179348, -376550, -44553]
18335b4249j40551H5388O5033a03419k46898B716a3175j17175N5963j11608j75996
18324c61991e4649k89577a58667B19464b21433N5420G8792a39368e0861j90907
18314b41768F913a38879C00920a57846B37660A05354a5981B81582g4424j0454
18304h4878l70060B7255a3279A6960a4123k44529k1927B00398I5715a04278j5597
18293a19875K9819A06202a7215j16885q8538f1146H0766a32096A86463b570k76650
18282b79220A98188a33792A36447A9158h2826o5288q3948j39939g8289b9763D46685
18270B9305a3619d726B6931K97207d1203j28110n0365j66682a67845b0749A6350
18258I2872a953p1283E1264Q5030b1612D4637J25374b5781J1549j09845m04648
$$ y = [-24249, -164800, 85388, 150421, -103419, -350317, 2716, -13175, -130350, -74387, -185995, -361991, -54649, -344226, -158667, 219464, -221433, -166013, 78792, -139368, -50861, -241768, 6913, -138879, 300920, -157846, 237660, 105354, -15981, 281582, -74424, -84878, -454938, 27255, -13279, 16960, -14123, -258652, -280579, 200398, 95715, -104278, -119875, -90056, 106202, -17215, -134100, -222638, -61146, 80766, -132096, 186463, -2570, -279220, 198188, -133792, 136447, 19158, -82826, -148114, -232062, -372001, -78289, -29763, 446685, 29305, -13619, -4726, 26931, 324138, -41203, -169313, -219678, -386360, -167845, -20749, 16350, 92872, -1953, -73236, 51264, 136294, -21612, 44637, 170011, -25781, -14232, -124077, -528725]
18247e28725K45786A05729f7747E7085e2423B52551b59764I7391a63816N7023
18237a06793B5734b14712A31526b4829C334J25213h6300A48483a54478G5618c5202
18225a75168e3576h206k57164C91222E9435b94014i225p2870q604c3659j73544
18214b07203p859K9905C7289Q0876a4538B16886b83159h2563B30206b70717D8102
18202a87043A39775g137q9365q0393j23242A13501m3139k6159G181b84614q4143
18191c68757B52854i2383K1411o1390A6705e7286A18908J0805a10846A01659b1667
18179C25277a13373j35445A77772d48078h7636q0478p9420A67582c12166C2528
18168a17939C15498D4507g9934G415i1260I2025l7273k6658h1891j7908r05B50491
$$ y = [-528725, -282939, 105729, -67747, 57085, -52423, 252551, -259764, 97391, -163816, -106793, 25734, -214712, 131526, -24829, 3334, 128547, -86300, 148483, -154478, 75618, -35202, -175168, -53576, -8206, -265370, 391222, 59435, -294014, -9225, -82095, -90699, -33659, -207203, -215062, -185157, 37289, 118165, -14538, 216886, -283159, -82563, 230206, -270717, 48102, -187043, 139775, -7137, -96502, -176895, -300137, 113501, 70362, 44203, 7181, -284614, -368757, 252854, -92383, -70972, -132362, 16705, -57286, 118908, 129713, -110846, 101659, -21667, 325277, -113373, -248818, 177772, -448078, -87636, -168114, -247534, 167582, -312166, 32528, -117939, 315498, 44507, -79934, 7415, -91260, 92025, 54752, 28094, -81891, -99799, -100704, 250491]
18155e9020j71242C87993a98307F212J64626A491J25287l5818g7543p9652e4620
18143E9580K85614F8947a7432C9970c3779J359C20936A38900a77652a450j14111
18132a15561A26696E9444B8238b9037F1664Q1599G1212b87362A29659a32200n6315
18121a88515E5107l782k2444b09251A39783p676m4957a27093N2043B28249a29734
18109F9204J28250D0437J30413k3250L0690b48397J6301e6292B24137D8782L9650
18098H8432Q284E43J07257m5366d63147h2953r135I4622b12429B01241e1283A7146
18085i3541K324D8106a62628D1078b15486J04577E1913a54413j00543C72566A60763
18073I5350i849k41276C05613c96620A5745c35060D7068K18821A00514b44085
$$ y = [-59020, -230262, 387993, -198307, 6212, 170838, 1491, 126778, 90960, -77543, -157195, -54620, 59580, 345194, 68947, -17432, 39970, -33779, -32420, 320936, 138900, -177652, -1450, -115561, 126696, 59444, 28238, -29037, 61664, 143263, 71212, -287362, 129659, -132200, -188515, 55107, 51325, 28881, -209251, 139783, 132107, 87150, -127093, -75050, 228249, -129734, 69204, 197454, 40437, 170850, 147600, 178290, -248397, -232096, -56292, 224137, 48782, 88432, 96716, 543, 107800, 62434, -463147, -82953, -92088, 94622, -212429, 201241, -51283, 17146, -93541, -91217, 48106, -162628, 41078, -215486, -110909, 51913, -154413, -254956, 372566, 160763, 95350, -9849, -251125, 305613, -396620, 15745, -335060, 47068, 265889, 100514, -244085]
18062a56379C0731J53456i9678A35524b6342k6423A19510B0482a28707j11613
18052b40320a9350B32613i2361B2782Q2321b40449f9011k230A50644G2095r558
18041F2537J5918O7745b6853j02254A45279a28397B19209c12836E6636a3752B0811
18029f7476p4205c6601C9707J83454b6664B093N1279a5359j64877F2120B4279
18017A35077m33i3581D1422i1640A27424a12478P204A39446a38109H0356c29140
18005D42676F8102f9516b2983G9435b23051Q3895j89258i578j06871k43988C34318
17993A0857J37076K9780c6199n1817l9673A47142b72484m8840a21178C4492a8703
17981A44441a25816C5456c81345A70883b67248B40602r0976O531a49392m4027
$$ y = [-156379, 30731, 184187, -99678, 135524, -26342, -52765, 119510, 20482, -128707, -240320, -19350, 232613, -92361, 22782, 105103, -240449, -69011, -71241, 150644, 72095, 62537, 78455, 146200, -26853, -129107, 145279, -128397, 219209, -312836, 56636, -13752, 20811, -67476, -141681, -36601, 39707, 223161, -26664, 2093, 53372, -15359, -180236, 62120, 24279, 135077, 134644, -93581, 41422, -91640, 127424, -112478, -105274, 139446, -138109, 80356, -329140, 442676, 68102, -69516, -22983, 79435, -223051, -139156, -328414, -9578, -116449, -360437, 334318, 10857, 147933, 177713, -36199, -88016, -127689, 147142, -272484, -321324, -121178, 34492, -18703, 144441, -125816, 35456, -381345, 170883, -267248, 240602, 149626, 156157, -149392, -193419]
17971a93419j93136h4765A67403O7029a08833A47466a23381h280A76265q533c20739
17959B1528b8842A01847J31928E9926K33233c25883B46336E0664g7500m22285
17949d99785a34677A17783J72007a16665J6862K6485j08868b8308D88565d75932
17938c8654B19275B0822J55788F5890b53696I6277i8258o8609m8476h0379G6833
17926g9370A04173M390b18613A86668e1944C8386a84582B6045J12967o8711b04376
17914A43677d2738j62515i8533A63366a0069k1848j57665l2259R0872B4390Q0879
17903A05269b13099D8672P8746g3868K9059q7484H5138a80161B11861a70445D9682
17891A18317c72807I1437K53206r3644b78912i0273j38321E6075a59143P3526
$$ y = [-193419, -386555, -84765, 167403, 234432, -108833, 147466, -123381, -8280, 176265, 167732, -320739, 21528, -28842, 101847, 233775, 59926, 293159, -325883, 246336, 50664, -77500, -499785, -134677, 117783, 289790, -116665, -99803, -73318, -182186, -28308, 488565, -475932, -38654, 219275, 20822, 176610, 65890, -253696, 96277, -98258, -166867, -215343, -80379, 76833, -79370, 104173, 108563, -218613, 186668, -51944, 38386, -184582, 26045, 139012, 70301, -204376, 143677, -42738, -205253, -98533, 163366, -10069, -31917, -189582, -221841, -130969, 24390, 105269, -213099, 48672, 127418, -73868, -44809, -132293, 85138, -180161, 211861, -170445, 49682, 118317, -372807, 91437, 344643, 250999, -278912, -90273, -228594, 56075, -159143, -85617]
17881h5617q8801A22579c95484C19348A02191D1979b34262i3769A10588a62100
17870a72636C1581i0755r4720K7023F7021a85663A8155b29103J08909c1724l12362
17859c44086a18229D84122j25975n8772b19077a6809A67367a8183I9807J04286
17849B04093e2804g516B49196c08897A148g5795A39887a88400c2202B10161A4514
17837D1096r867D007d2561j41456G5086L12568J03809i0241j89000A16154a3763
17825a11575b1786q4869B28919a55028E6912e2489A18793c4462C68641a27405
17814I3080a4215j32186J010D4226M5161d8861K0003k7750a5778H5169l3565a07133
17801e0771Q674G2991q275a434k71045J9573h6782a1976A5731O6713K99624j81121
$$ y = [-85617, -174418, 122579, -395484, 319348, 102191, 41979, -234262, -93769, 110588, -162100, -172636, 31581, -90755, -185475, -158452, 67021, -185663, 18155, -229103, -120194, -31724, -344086, -118229, 484122, 358147, 299375, -219077, -16809, 167367, -18183, 99807, 204093, -52804, -7516, 249196, -308897, 1148, -75795, 139887, -188400, -32202, 210161, 14514, 41096, 31229, 4007, -42561, -184017, 75086, 387654, 491463, -90241, -279241, 116154, -13763, -111575, -21786, -106655, 228919, -155028, 56912, -52489, 118793, -34462, 368641, -127405, 93080, -14215, -146401, -145391, 44226, 89387, -48861, -28858, -56608, -15778, 85169, 51604, -107133, -50771, -42097, 72991, 64716, -1434, -272479, -252906, -86782, -11976, 15731, 82444, 382068, 200947]
17789B00947N4965q3587q3950H312a91727A38528b69367F958c71163a67325g711
17777a83649e4815j61485A55182f9063A19002J41016F8044J66892K71278B00014
17766C33496A18804L1949a79793f9211j69357l0468B204a75610L0308A63651G6493
17754A35129R3847F4730a35588a7985k3802D2198L7627a40651A92036a4951n2184
17743f7135j24678Q6148F2051a41128F5118J9292M5562g5157G7669j7091c16951
17731a95374j40L8940A61716a52713A65354c12602J34913f2347k6981k4237A1822
17719b64203i8954B04098R5076c6904A64064J04065k7865c10684B55131c57529
17708B801Q6545M4776m4281J36577a63977g7225L4739H4378c3812C19842i418
$$ y = [200947, 255912, 172325, 88375, 8312, -191727, 138528, -269367, 6958, -371163, -167325, -7711, -183649, -54815, -216300, 155182, -69063, 119002, 260018, 68044, 234936, 506214, 200014, 333496, 118804, 150753, -179793, -69211, -238568, -269036, 2204, -175610, -145302, 163651, 76493, 135129, 228976, 64730, -135588, -17985, -41787, 42198, 79825, -140651, 192036, -14951, -67135, -191813, -105665, 62051, -141128, 65118, 84410, 129972, -75157, 77669, 60578, -316951, -195374, -195514, -156574, 161716, -152713, 165354, -312602, -177689, -62347, -89328, -113565, 11822, -264203, -98954, 204098, 299174, -36904, 164064, 268129, 240264, -310684, 255131, -357529, 2801, 89346, 134122, 89841, 226418, -163977, -77225, -42486, 84378, -33812, 319842, -9418]
17696A08685K64186A52156J23356j03151Q1052q9141E0859i535F1004J88382k74
17685B49112a76359b763A72745O1588G9284a32900A57872l6451g7084A64295e3175
17673E6582h7195B0610Q1979j5449a15815M6723J7620j81906r4337R1676d4670
17661d1483j19738A28995i5549J8609E8686h4974B1350a94878R5342c7529n0773
17650h8302A43021h776B4731b9572A49701e9937A68707a78275l9989F1073a39038
17638G7153p609h1187A29456M3849c7231A08816a2026B26160c67926A51585n4959
17627I6626D5906b40088g2591o3901d8101C97543G1950O2764J17067a0223P56
17616i467B67236a30911O3430n3289D0635O7027a16507E3915h761j73501I0932
$$ y = [108685, 372871, 152156, 275512, 172361, 253413, 164272, 50859, -9535, 61004, 249386, 249112, -176359, -2763, 172745, 234333, 79284, -132900, 157872, 121421, -77084, 164295, -53175, 56582, -87195, 20610, 102589, 87140, -115815, -69092, -51472, -233378, -327715, -236039, -44670, -41483, -161221, 128995, -95549, -76940, 58686, -84974, 21350, -194878, -99536, -37529, -88302, 143021, -8776, 24731, -29572, 149701, -59937, 168707, -178275, -218264, 61073, -139038, 77153, 69544, -81187, 129456, 173305, -37231, 108816, -12026, 226160, -367926, 151585, 96626, 45906, -240088, -72591, -136492, -48101, 397543, 71950, 134714, 251781, -10223, -9467, 267236, -130911, -67481, -120770, 40635, 107662, -116507, 53915, -8761, -182262, 90932]
17604i702D7854J23791C1180J41502a36010B38031B3312j904K49533F7162Q7975
17593A55137b9381j02016C27335D6574J52295B6899J94203b58590G9329A4712
17582a30999A26968a04835j95202E9359P9136j5796Q1657b44905C48690a50091
17571e8826A49817N803K13900j56322b31790d2348j27666K8764E0579d93839A19200
17559B14022b66813A43376Q856m6624K5420h8506j55729J01884C81515a75501
17548h7548a3823B43187A02563m0558d6634k9599D07134A49989c0763q5517B80681
17536F5293a07333C07039b28201B82267r3965a25007G2868J7146K0352f7715C25494
17524i2933F5468a86026q1594g0045j47705a9543A67484f3605K8478A85645k4974
$$ y = [-9702, 47854, 171645, 31180, 172682, -136010, 238031, 23312, 21408, 270941, 67162, 155137, -29381, -131397, 327335, 46574, 198869, 26899, 221102, -258590, 79329, 14712, -130999, 126968, -104835, -300037, 59359, 138495, 122699, 204356, -244905, 348690, -150091, -58826, 149817, 155620, 369520, 213198, -231790, -42348, -170014, -141250, 50579, -493839, 119200, 214022, -266813, 143376, 152232, 105608, 131028, -88506, -244235, -142351, 381515, -175501, -87548, -13823, 243187, 102563, 62005, -46634, -76233, 407134, 149989, -30763, -116280, 280681, 65293, -107333, 307039, -228201, 282267, 188302, -125007, 72868, 90014, 110366, -67715, 325494, -92933, 65468, -186026, -267620, -70045, -217750, -19543, 167484, -63605, -35127, 185645, 160671]
17513A60671f5770F3320i4996B25511r1242A4166g5629p2754A7115J03446J0949
17502A31510K20225g6628A51825O4158l5171p4304l5944K56478I3457N1196L3937
17491A78590H7515c0795B85631c08129C39037o6148q0081o6167D6384a17503n0123
17480a67626F7209M1984m1987J63718L5840J0043l5838D00L781J53348C0717J72014
17468B02731R4414r2542D8346O6454B1349L49610e134C71377q6123j37187h595
17456D99038A25022R2805i8456J4582D9868J95410I3608a14300a2940A37042E9702
17444A2564J22465n1295M7232j9088J41107j5673J95371k5875G5450K63607N509
17433C44566K07561A76926R9270k2784I3302b5847A97689O4901b7971i129C01238
$$ y = [160671, -65770, 63320, -94996, 225511, 134269, 14166, -75629, -148383, 17115, 120561, 131510, 351735, -76628, 151825, 215983, 180812, 106508, 70564, 327042, 93457, 144653, 178590, 87515, -30795, 285631, -308129, 339037, 272889, 192808, 126641, 46384, -117503, -167626, 67209, 109193, 67206, 230924, 266764, 276807, 240969, 400, 4181, 157529, 30717, 202731, 297145, 204603, 48346, 114800, 21349, 370959, -5134, 371377, 285254, 148067, -8595, 499038, 125022, 217827, -98456, -83874, 49868, 245278, 93608, -114300, -12940, 137042, 59702, 12564, 135029, 83734, 130966, 111878, 252985, 237312, 432683, 406808, 75450, 339057, 344566, 552127, 176926, 276196, 253412, 93302, -25847, 197689, 262590, -27971, -9129, 301238]
17421E6535K30256I0567a2203C03002K11023j22246K7642F9448K8243M24570A0877
17409D21488A26041R2003M3508J59967J40960E5512M8519R0992K14643j87184
17399B22482K47692n2869n8606K5610j04536j8444g233j13006A63392K10246A24776
17387C86549G2739K30157e8328B74029B2429a8371H8950o813L2283B0368J43796
17376A64164C8267K73624a08051A86040o562K90528k29355m3598E1734L11556
17366C63290H9179m1133j7534K11349J29l3740Q3535F7493L8635k3722m0598J44466
17354A86274m0578K01310J19873E5592J05808c68657a24337C53356j72779F5693
17343B48139J68809B06329J40048O3352B8875L91027r2742K97104G3921a05514
$$ y = [56535, 286791, 90567, -12203, 303002, 514025, 391779, 419421, 69448, 97691, 522261, 10877, 421488, 126041, 218044, 261552, 421519, 562479, 55512, 104031, 195023, 409666, 222482, 470174, 417305, 358699, 384309, 279773, 261329, -7233, -120239, 163392, 373638, 124776, 386549, 72739, 302896, -58328, 274029, 22429, -18371, 88950, 82137, 114420, 20368, 164164, 38267, 311891, -108051, 186040, 179478, 470006, 240651, 197053, 51734, 363290, 89179, 48046, 30512, 241861, 241990, 208250, 291785, 67493, 106128, 82406, 41808, 186274, 145696, 347006, 466879, 55592, 161400, -368657, -124337, 353356, 180577, 65693, 248139, 416948, 206329, 346377, 409729, 28875, 419902, 327160, 624264, 73921, -105514]
17332C15715A46888g5778D13708a00575F5370J73350p6663n7455L7929i0520F6966
17320B35594A15003K2579a84585E01034a4942C42016a72345B31350A09187n2173
17310E7014L50166r4740H6146L28849k04047k1670J21581a26709H386J33997P2064
17299B14447l5563K85322a54300D0222J69105E3253a58929A24727J6004E5036
17288A62336K07159j45007A7756M1477a32886D55149j93354M7728j06046B6392
17277A85685M7054b7701n8010B71290F2105K44945j27470b7131P622B37503j6715
17266B20788J8929K45222j83822k1972j27998o2760J21359G4405b1665A83976
17255B74594J48687H2541a11842C42137A34406K14170c9572E3751L85939k02433
$$ y = [315715, 146888, -75778, 413708, -100575, 65370, 238720, 162057, 104602, 142531, -90520, 66966, 235594, 115003, 137582, -184585, 501034, -14942, 342016, -172345, 231350, 109187, 57014, 407180, 312440, 86146, 414995, 210948, 189278, 310859, -126709, 8386, 142383, 214447, 178884, 464206, -154300, 40222, 209327, 53253, -158929, 124727, 140731, 55036, 162336, 369495, 224488, 17756, 59233, -132886, 455149, 261795, 309523, 203477, 26392, 185685, 232739, -27701, -85711, 271290, 62105, 307050, 179580, -27131, -19509, 237503, 220788, 239717, 484939, 301117, 279145, 151147, 88387, 209746, 74405, -21665, 183976, 274594, 423281, 82541, -111842, 342137, 134406, 348576, -39572, 53751, 439690, 237257]
17245B37257F9736Q6254N2945N6698B179J78454k530J26781A38535J59363A19187
17233C66104E9719N21298A4827K82032M0425j25550J60408K3011m2727K8446A58345
17221A86353o22Q9685I3087K62022K9178L731L0048j93389f46B40400j10182l1978
17209I8240K82874h6568A64203a25021B16941I3875j4173C1284L79969j11j80244
17198B30898a86427D13838c8222C25641E5382J8283J57578K21558j77820n3769
17188B21212n5490G0869P3842L63131A69474N7791K69685G2277L85022j58426
17178B98873K55340C5441J62970L28900k05914J44892J95371k35880J02090j88969
17168C38901A54999K57040j67291j6815J64619l4061M3061I1620K10848J09214
$$ y = [237257, 69736, 155990, 208935, 265633, 2179, 180633, 178103, 304884, 138535, 297898, 119187, 366104, 59719, 581017, 14827, 296859, 337284, 211734, 372142, 395153, 352426, 380872, 158345, 186353, 185731, 275416, 93087, 355109, 384287, 388018, 418066, 224677, -646, 240400, 130218, 98240, 381114, -86568, 164203, -125021, 216941, 93875, 79702, 31284, 411253, 411142, 230898, -186427, 413838, -38222, 325641, 55382, 73665, 231243, 452801, 274981, 221212, 165722, 70869, 144711, 507842, 169474, 227265, 496950, 72277, 457299, 298873, 554213, 35441, 198411, 527311, 321397, 466289, 661660, 425780, 527870, 338901, 154999, 412039, 244748, 227933, 392552, 358491, 401552, 91620, 302468, 411682]
17158D11682A34122k6636K85240p1680J25344k17880M35192a8230C37885A20671
17147F3873i4289D15261j29521J14238n863B542L14504J58091B645J34004J27592
17136B64241J28412i6800C75252j69048K04003A08998J64940J97516r6576j37540
17126B37338L22186k01690G3979O61141C34849I1772K91711n2349j32437I7269
17115A19203K92308n7488M7020K02996k97365k9054K87466A91687M21268o4760
17105E48195k16797J06049j3924o458q205K21014B20297O0864K75341p8119j04606
17094C73777q3464M7391J64646j35254j17491O8693J70580j05515K82296j65012
17084E00647k32619l5502L13519k13182J63153K2074j2084M6687B48474L93133
$$ y = [411682, 134122, 107486, 392726, 321046, 446390, 228510, 663702, -18230, 337885, 120671, 63873, -94289, 415261, 285740, 399978, 394115, 2542, 317046, 475137, 2645, 136649, 264241, 392653, -96800, 375252, 206204, 410207, 108998, 273938, 471454, 374878, 237338, 559524, 357834, 73979, 735120, 334849, 91772, 383483, 331134, 198697, 97269, 119203, 411511, 354023, 401043, 604039, 306674, 277620, 565086, 191687, 612955, 548195, 331398, 437447, 423523, 417065, 408860, 629874, 220297, 281161, 556502, 478383, 373777, 290313, 337704, 502350, 367096, 249605, 318298, 488878, 383363, 665659, 500647, 268028, 232526, 546045, 332863, 496016, 518090, 506006, 552693, 248474, 641607]
17074F41607P1184q1794o3138k05198L24690j68813q937Q1166M0957P5267k27971
17063D79020O7555B55016L5999R8580J51177A92928K78334m8595n2832J2769J47324
17052E29928A66390L54552J42019o2416j13813L98609q6913r417C69309K98247
17042F67556P884r2899J2631B42553O11296j93146j99360J57436P5806n6075k7335
17031F11175J22785B68086M03000K00450j39692j41165J10011Q2559A30502M74632
17021F05134j77267J73982J89186l39829M72804j85625L28287E22013J69555j95616
17011D95952K33958j26342j12525K42300r7893J2848j89688K43972P9261j56958
17001F24885J7835P0813r0054j3102l3082p3185K24815K2566q0385M17927l71544
$$ y = [641607, 712791, 630997, 567859, 362661, 687351, 518538, 509601, 590767, 631724, 706991, 479020, 546575, 255016, 291015, 389595, 540772, 192928, 471262, 422667, 369835, 382604, 529928, 166390, 520942, 662961, 600545, 486732, 885341, 798428, 789011, 369309, 667556, 675440, 582541, 595172, 242553, 853849, 660703, 461343, 618779, 694585, 638510, 611175, 733960, 268086, 671086, 871536, 731844, 590679, 700690, 783249, 130502, 605134, 427867, 601849, 791035, 451206, 924010, 738385, 1066672, 522013, 691568, 495952, 729910, 603568, 491043, 733343, 635450, 648298, 458610, 702582, 781843, 624885, 642720, 713533, 623479, 610377, 577295, 504110, 728925, 751491, 671106, 1089033, 717489]
16990G17489K42590p9193P0370L2507k95422M915K15695j11084J69134j02736
16980H64265k7235q1299J40611L80460m16662j46817M03683j35275k14767K93364
16970A060328m89835K20997J07647r8443m7378K44280M5015j29727P7789O3029
16960A053702j75126J62003p7871K30329n991k78111R8084M0992P8212n3596J55317
16949A227944n3021N2304q2923K73996m05898J31913N9234j66530Q8770O2170
16939A187959j42309l1134O1538M67265l08268L73278l07391j60845M32978j46810
16929A426261j37637K14091j98753j26878M31120l06822J8674k8868K13717r346
16919A495559j2909R5120K11822m91109N30463k59256j76233O0598K05762k89219
$$ y = [717489, 960079, 880886, 951256, 983763, 688341, 693256, 908951, 797867, 967001, 864265, 837030, 755731, 896342, 1276802, 860140, 713323, 1117006, 981731, 766964, 1060328, 570493, 791490, 899137, 800694, 753316, 997596, 1042611, 912884, 990673, 1053702, 878576, 1040579, 962708, 1193037, 1187046, 908935, 1007019, 1048011, 1126223, 1072627, 1227944, 1174923, 1227227, 1144304, 1418300, 1012402, 1144315, 1203549, 1037019, 1125789, 1187959, 1045650, 1014516, 1076054, 1543319, 1235051, 1608329, 1300938, 1140093, 1573071, 1426261, 1288624, 1502715, 1303962, 1177084, 1608204, 1301382, 1320056, 1291188, 1504905, 1495559, 1482650, 1577770, 1789592, 1298483, 1828946, 1569690, 1393457, 1454055, 1659817, 1370598]
16909A370598N9169j0897r6583M42189j40851L516R7793j4890k53077L99673J13172
16898A969812K42939n48510j65243K71883L38877l25280J47085k3790N4791n8088
16888A904476q9843J08506n6610K91733m22233K89170J03432j95661r1149J87929
16878B029750K24282k98554P1817J30777j04393M05949L5520N8297l75896O935
16868B184484P6870R3099m4344J59053K28229j20096K37338q0912k3294K29573
16858B940000o9831j71383J04738l09417J71045R7928J08069L84552n4802k45984
16848B954915J44220L4013K64671j10163L33972o17043J91611M72816m69831M36303
16838C635484m2490k20697N95140n36097N44493k60185N12888P3049q1295J46102
$$ y = [1370598, 1429767, 1418870, 1322287, 1764476, 1623625, 1627141, 1724934, 1710044, 1456967, 1856640, 1969812, 2212751, 1664241, 1498998, 1770881, 2109758, 1784478, 1931563, 1907773, 1962564, 1904476, 1814633, 1923139, 1866529, 2158262, 1736029, 2025199, 2128631, 1932970, 1841821, 2029750, 2254032, 1955478, 2027295, 2158072, 2053679, 2459628, 2495148, 2553445, 2177549, 2184484, 2261354, 2354453, 2310109, 2469162, 2697391, 2577295, 2814633, 2733721, 2710427, 2940000, 2870169, 2698786, 2803524, 2494107, 2665152, 2763080, 2871149, 3255701, 3200899, 2954915, 3099135, 3133148, 3397819, 3287656, 3621628, 3004585, 3196196, 3669012, 3199181, 3635484, 3592994, 3372297, 3967437, 3431340, 3975833, 3715648, 4228536, 4301585, 4220290, 4366392]
16828D366392J0862q7776J27931k7953R7615J65788M96233l24095J1244J57050
16818D993291J32373j92020M03061k6469p9381K68666J38796J43763J08458N392
16808E895930J00280j73837M44452o707L29635l5606J14383Q1080K01522K17407
16798G168539K17981N1020O10287p7665K05344L7108M86070J89969j3128J34128
16788I009653O6758Q7643N34586m7128O94661o2104J84950M80655K7391K54079
16778A1231144J74083P08748K01535L35620K92852M87811N79603n4194P93902
16769A4751104J30190L42055Q35058L05617M41793O62130N36354N75426K39547
16760A8819274R58215L32884J271675N34587P44178Q28151M09456J186400R81737
$$ y = [4366392, 4377254, 4289478, 4417409, 4389456, 4487071, 4652859, 5149092, 4824997, 4836241, 4993291, 5125664, 4933644, 5336705, 5310236, 5230855, 5499521, 5638317, 5782080, 5890538, 5895930, 5996210, 5822373, 6266825, 6260118, 6589753, 6554147, 6668530, 6749610, 6951132, 7168539, 7386520, 7437540, 8047827, 7970162, 8175506, 8212614, 8698684, 8888653, 8875525, 9009653, 9076411, 9164054, 9698640, 9651512, 10346173, 10284069, 10469019, 10949674, 10977065, 11231144, 11405227, 12113975, 12315510, 12651130, 12943982, 13431793, 14011396, 13957202, 14751104, 14881294, 15223349, 16058407, 16364024, 16805817, 17467947, 18004301, 18579727, 18819274, 19777489, 20110373, 21382048, 21916635, 22660813, 23488964, 23898420, 25084820, 26066557]
16751B6066557Q92941J075047J221734J215221J150935J350132J038625J603335
16743C5614527J302108J840955J608592K052157J813960J825452K366103K249143
16735E0672997K673990K508149L149362K418022L390681L405263L523258L730513
16727G5472235L941513M514370M343845M920157N269612M878393N627966N836034
16719A14804125N727935N936905O516376O242907O244345N959179N638614N485612
16711A62555998M776402M616440L494802L126542K146349R32630M60834j358877
16703A80751120j388513k714352l528461m713049m490104n667931n661377o109847
16695A46477486o268190o219100n978557o285953n982677n746642n756181n379205
$$ y = [26066557, 26959498, 28034545, 29256279, 30471500, 31622435, 32972567, 34011192, 35614527, 36916635, 38757590, 40366182, 42418339, 44232299, 46057751, 48423854, 50672997, 53346987, 55855136, 59004498, 61422520, 64813201, 68218464, 71741722, 75472235, 79413748, 83928118, 88271963, 93192120, 98461732, 103340125, 108968091, 114804125, 120532060, 126468965, 132985341, 139228248, 145472593, 151431772, 157070386, 162555998, 167332400, 171948840, 175443642, 178570184, 180716533, 181649163, 182109997, 180751120, 179362607, 176648255, 173119794, 168406745, 163916641, 158248710, 152587333, 146477486, 140209296, 133990196, 128011639, 121725686, 115743009, 109996367, 104240186, 98860981]
16687I8860981n150752m971394m483603m808895l585665l878774l982834l151107
16679F4847957l357646l221964k736033k856620k626287k033114k163304k357686
16671D3495303j919157k062582j680954j539335j494709j275767j281306j663557
16663C0577936j764330r63597p54096j017913j062525p53570j068091p49288q13426
16654B1631100r37496o38704p36659o22421o93344m51766o03753p99268l69890
16645A5777799n88424l22159o85984l88616l27591l81712l82954l31231m89759
16636A1879369k69872k36235l23510m47189j46269l84184j92560l87010k02193
16627I290347p4164j89532r6914n94360j07026k38796j00469j98477l40033j02592
$$ y = [98860981, 93710229, 88738835, 84255232, 79446337, 75860672, 71981898, 67999064, 64847957, 61490311, 58268347, 55532314, 52675694, 50049407, 48016293, 45852989, 43495303, 41576146, 39513564, 37832610, 36293275, 34798566, 33522799, 32241493, 30577936, 28813606, 27850009, 27095913, 26078000, 25015475, 24261905, 23193814, 22444526, 21631100, 20693604, 20054900, 19318241, 18695820, 18002476, 17550710, 16946957, 16147689, 15777799, 15189375, 14867216, 14181232, 13792616, 13465025, 13083313, 12700359, 12369128, 11879369, 11609497, 11373262, 11049752, 10602563, 10456294, 10072110, 9879550, 9492540, 9290347, 9216183, 9026651, 8929737, 8335377, 8228351, 7989555, 7889086, 7690609, 7350576, 7247984]
16617G247984j72284M06777n83340k62950j57123q9652p4187m81700p3230N84959
16607F345254n10057k4057l27312m72737L51037L3995j71902j92928k30379O6243
16597D867157k33682J67258j18898k97240n3970j04934P1656o3779l16102J93871
16587D111337j47336l7746j29095R6327q92N224k14914J12694k52303j38676k91417
16576C113203K91282j79627j39347K5827r516m6622P3718l12426K88577l45276
16566B759793L16620n45845J03766J31028j00049j66701K3367L26498l75065k32432
16556B240980K86069n3715j30442J02575j32820k31271L10086k27880Q050k1218
16546B150414k10960J88645j2413J86044o50187L2274O51763l44071J05566k90039
$$ y = [7247984, 7075700, 7482477, 6899137, 6636187, 6479064, 6389412, 6315225, 5833525, 5760295, 6345254, 5835197, 5811140, 5483828, 5011091, 5362128, 5396123, 5224221, 5031293, 4800914, 4867157, 4633475, 4800733, 4681835, 4384595, 4330625, 4225691, 4297347, 4233568, 3917466, 4111337, 3964001, 3926255, 3797160, 3893487, 3892595, 3897819, 3682905, 3795599, 3543296, 3404620, 3113203, 3404485, 3224858, 3085511, 3111338, 3101822, 3055200, 3128918, 2816492, 3105069, 2759793, 3076413, 2530568, 2634334, 2765362, 2665313, 2498612, 2521979, 2848477, 2473412, 2240980, 2527049, 2473334, 2342892, 2445467, 2312647, 2081376, 2391462, 2163582, 2171632, 2150414, 1939454, 2128099, 2115686, 2301730, 1651543, 1683817, 2335580, 1991509, 2097075, 1807036]
16536A807036M72716m13522L1936J85483l18704j0326m44887L49437r3520J88070
16526A753719l37673J59346N9242q4233j79081J0157J86723o2611R9239j68603
16516A436225j08364j05095L14683k00903R800r8942p0079O9097o917j72631K82703
16505A349577j04672n9006q6689J25185l6764j03577r5487N7155j66067L35132
16495A214787K41759N0977o3342j21948n00449K24825j72518K12306R5470P9637
16485A261504k48507J9474j90616L3127j8457K91445j59515j13955q1315K77067
16475A070252j5798m39943N81612j97439l49973P1543q6159M5792j99555K77084
16465G57416J73120p0598k50461O5615J72425R2414p1905j76507n4140K83885
$$ y = [1807036, 2279752, 1866230, 1898166, 2083649, 1764945, 1754619, 1309732, 1659169, 1565649, 1753719, 1416046, 1575392, 1634634, 1550401, 1371320, 1381477, 1568200, 1505589, 1604828, 1436225, 1327861, 1222766, 1537449, 1336546, 1346346, 1247404, 1177325, 1246422, 1239505, 1066874, 1349577, 1244905, 1185899, 1099210, 1224395, 1187631, 1084054, 988567, 1045722, 879655, 1214787, 1456546, 1507523, 1444181, 1322233, 821784, 1046609, 874091, 1086397, 1181867, 1261504, 1012997, 1032471, 841855, 874982, 856525, 1147970, 988455, 874500, 793185, 1070252, 1054454, 614511, 1196123, 998684, 648711, 720254, 634095, 679887, 480332, 757416, 930536, 859938, 609477, 675092, 847517, 939931, 868026, 691519, 637379, 921264]
16455I21264k51297K03825r6777m5681J58019l77296L5098M8054L17788K7633
16445I40630C29730L17510l18084M42109r4869J34868J53846D82527K61114k31820
16435E11821L27749j46581k06446j02263J45617L27127n2327C98091J3776m947
16425D06920L35030j05084C16415J76824J27347B69158R7391L14368k53055q9879
16415C37983p060O9529j4564L32476j23181J75965C19736L03672N6852B66221
16404G97744k83185l1525N1298r17k40391K30989k28117J86148K5349r8664J38526
16393E47255K10797B21742K71130R6090j51787o461J82933A85226M81651J11008
16383G77885j92836j14394E1684K96748J44369r1858A96191l6119K42559O3106
$$ y = [921264, 669967, 873792, 777015, 731334, 889353, 512057, 547155, 595209, 912997, 940630, 329730, 647240, 329156, 771265, 676396, 811264, 965110, 482527, 743641, 511821, 839570, 692989, 486543, 384280, 529897, 857024, 804697, 398091, 411867, 406920, 741950, 636866, 316415, 493239, 620586, 269158, 366549, 680917, 427862, 337983, 330923, 400452, 385888, 718364, 595183, 771148, 319736, 623408, 680260, 266221, 797744, 514559, 483034, 534332, 533415, 293024, 524013, 295896, 482044, 507393, 408729, 547255, 758052, 221742, 492872, 588962, 437175, 430714, 613647, 185226, 666877, 777885, 585049, 470655, 51684, 348432, 492801, 400943, 196191, 160072, 402631, 465737]
16373D65737A65224J17066K28934m0133J41835k38407k3116A68887L15786k28437
16363B56236K46919m8378B7337M09177A45274L27192q7537e8056C86460q4854
16353C01606A11750K30557K42721B12214A1168K75860K87783j91522q2417q3224
16343B17648m5200L8452K63562B8008J56663L6465L16612B60812G6914L14016
16333C90930A71482L43293A86533n7611M7368J08570G6499J15689K36669A37814
16322D09906j59418J26271b652D18665j59688P6976J7823j59244M0202j12336
16312A22398n7425L40601m7706j8888A49290B8455M29656A23846J33696K17879
16302D75421k29624L7012K5216P890p5494J36366Q5398d3856p7723C5035P5314
$$ y = [465737, 165224, 282290, 511224, 471091, 612926, 374519, 351403, 168887, 484673, 256236, 503155, 454777, 27337, 436514, 145274, 472466, 384929, -58056, 386460, 301606, 111750, 342307, 585028, 212214, 11168, 287028, 574811, 383289, 300872, 217648, 172448, 210900, 474462, 28008, 184671, 221136, 537748, 260812, 76914, 390930, 171482, 514775, 186533, 128922, 176290, 284860, 76499, 192188, 428857, 137814, 409906, 250488, 376759, -2652, 418665, 258977, 335953, 353776, 194532, 234734, 122398, 64973, 405574, 357868, 338980, 149290, 28455, 458111, 123846, 257542, 475421, 245797, 282809, 308025, 315915, 240421, 376787, 462185, -43856, -121579, 35035, 110349]
16291A10349j7136l0750J20119L15321A38528K94070j40368A19125K18302L8525
16281C75952L7699a2345j2013A20382K29009A991P9882J15878Q945I5740J500
16270I7240L50042A73675K5168J53126j20364E5382J04412N7073a36239M1458
16260i4781E03364j81910b8956d928C07191A51631J44490E9294j0366K01765I6706
16248B2199K02482D2617o247J80534f4013A56726K04088q5964Q7067A26491J22351
16237B48842O9003C681L49453H2036J0568K67428A04776R8739J09395A04972m739
16226A00233A3825K18835b2521A59441J54733a44766a5347B93621E6344M2247
16216I8591L5316M317o6566J80597D6569M1035D1190F151g5085A79425n6279N6288
$$ y = [110349, 93213, 62463, 182582, 497903, 138528, 432598, 292230, 119125, 337427, 375952, 413651, -12345, -24358, 120382, 349391, 1991, 81873, 197751, 206696, 95740, 97240, 447282, 173675, 198843, 351969, 231605, 55382, 159794, 216867, -136239, -94781, 503364, 321454, -28956, -4928, 307191, 151631, 296121, 59294, 48928, 250693, 96706, 22199, 224681, 42617, 36370, 216904, -64013, 156726, 360814, 274850, 361917, 126491, 248842, 317845, 3681, 353134, 82036, 92604, 360032, 104776, 203515, 312910, 104972, 100233, 13825, 232660, -22521, 159441, 314174, -144766, -15347, 293621, 56344, 98591, 133907, 138224, 71658, 252255, 46569, 87604, 41190, 6151, -75085, 179425, 123146, 179434]
16204A79434J51833A59220b1315q4952m012A50489l4528b040k0173A99321J23901
16193C23222E7962O7056l4549C2664J34120J23261j6552G8673A9554a58044f2083
16181E8507b68893E9822O6767N2029E268h3834A3490J74274a74220F4476K14447
16170B78923a78976A64172B2030a66231a6776C1934J77982J16285f3491A04634
16159D1515O5873J26565d2312B84536a09711K4427A09691J10198f1934I5364B8335
16147D3195O2550k1017b8401B3274b30880D34868a05172C02073O0614a06079r531
16136a15610G0017K61651a15536D50452H0436J77193A25431C2230b06882Q1203
16126a25679E6535a17760F2438i892A60732K2449A0532C997h6143I6903a80039
$$ y = [179434, 331267, 159220, -21315, -106267, -110279, 150489, 115961, -2040, -22213, 199321, 323222, 57962, 125018, 90469, 32664, 166784, 290045, 273493, 78673, 19554, -158044, -62083, 58507, -268893, 59822, 126589, 178618, 5268, -83834, 13490, 187764, -174220, 64476, 278923, -178976, 164172, 22030, -166231, -16776, 31934, 209916, 326201, -63491, 104634, 41515, 107388, 233953, -42312, 284536, -109711, -85284, 109691, 219889, -61934, 95364, 28335, 43195, 105745, 84728, -28401, 23274, -230880, 434868, -105172, 302073, 362687, -106079, -115610, 70017, 331668, -115536, 450452, 80436, 257629, 125431, 32230, -206882, -125679, 56535, -117760, 62438, -9892, 160732, 183181, 10532, 3997, -86143, 96903, -180039]
16114B6892b44226D9990A4815R3068A9667J57480r377f5969G287a22941k57290
16103c80231E362J44334d9832A1356R8048B940g6191K8178b920H2322f7628a3959
16090E0368d0370j75050i6355l3374A39132n0864n001a07244B7367J47541g951
16078A32330B2357J32383f9584B91031A27184m9140b03988Q982O7204H9930O4342
16067A54272J92804i6856A4548J80158c21292A60484a82848a4255q1670l4880
16057a30805E0441a4159d12l32439e3314j06431k26426c7991M659k81685D63543
16045B21307b9026j17079M3781K3713k5820j78192P8631a8989C84916B3614h570
16033a89007K3377B02936p3922L6672p0297J61977c02327c715A69099c63901A59679
$$ y = [26892, -244226, 49990, 14815, 107883, 19667, 177147, 167770, -65969, 7287, -122941, -380231, 5362, 149696, -49832, 11356, 109404, 2940, -76191, -48013, -2920, 82322, -67628, -13959, 50368, -40370, -215420, -96355, -129729, 139132, 88268, 83267, -107244, 27367, 174908, -7951, 132330, 22357, 154740, -69584, 291031, 127184, 78044, -203988, -195006, -127802, 89930, 154272, 347076, -96856, 14548, 194706, -321292, 160484, -182848, -14255, -95925, -130805, 50441, -14159, -412, -332851, -53314, -159745, -386171, -37991, -33332, -315017, 463543, 221307, -29026, -146105, -102324, -78611, -104431, -282623, -203992, -18989, 384916, 23614, -8570, -189007, -165630, 202936, 129014, 165686, 95389, 257366, -302327, -3715, 169099, -363901, 159679]
16021h057A1537J7428a80657P0782e1827B23458f5844k79879B19613g2603A01857
16009b06610R1660A73150d6196P103k39135i8066k74082B88337a09934L7981F1670
15997a22860h430j86366R0192k3268L6294d3354I7355a49184B25754a03231m2867
15986a46098C29719c23214d4612q5276B1701L55242d6564j38177A9773J86692
15976B06465a3182F2708C0218b6584H0022a6843B35881M3493L32901P8650B19408
15964A73216J91599j44419m8748j6798o9191J034f6663B05634a8886j19507A94702
15952H80N3475J5022b24617B0164J29179b24561n6734F8080a25790H0229N5569
15941A35798K8040I57J19439c41968P3123Q3121A02914a71225G9932D188d0853
$$ y = [-8057, 11537, 28965, -180657, -109875, -51827, 223458, -65844, -345723, 219613, -72603, 101857, -206610, -114950, 173150, -46196, -39093, -278228, -98066, -372148, 288337, -109934, -71953, 61670, -122860, -8430, -194796, -104604, -127872, -91578, -43354, 97355, -149184, 225754, -103231, -146098, 329719, -323214, -44612, -129888, 21701, 376943, -46564, -184741, 19773, 206465, -13182, 62708, 30218, -26584, 80022, -16843, 235881, 279374, 612275, 690925, 219408, 173216, 364815, 220396, 171648, 154850, 85659, 86693, -66663, 205634, -18886, -138393, 194702, 880, 54355, 69377, -224617, 20164, 149343, -224561, -281295, 68080, -125790, 80229, 135798, 163838, 957, 120396, -341968, -268845, -185724, 102914, -171225, 79932, 4188, -40853]
15929F9774a80896j37746A27373o1212a1372k57092N2360L9473O9897l08054D8546
15917B16470C2151a93532C67325G6362b47703j47792a45554B31500b8485B5920
15906A36958a66156D72819k17101h5019b3609r6848j37018f4485l31231a2479
15895A83979F399J1779d86795E640a01260A55248c51154a67232D9185a50093F3557
15883a81416d4708J3401E5641L7881a39576I1738k529C9483J95524F3936i4954
15871A06217P122R6098C1628J16371Q893n170a52800j32822A35468a36066o7770
15860b03836f6560n4654A57026b89461A08699e8993L887o1604D723L77271F8897
15848D8779O930J46120b5585k36050P3613F2606b68940A9322i4694A66190o3180
$$ y = [69774, -180896, -318642, 127373, 66161, -11372, -268464, -216104, -176631, -106734, -414788, 48546, 216470, 32151, -193532, 367325, 76362, -247703, -395495, -145554, 231500, -28485, 25920, 136958, -166156, 472819, 255718, -85019, -23609, -120457, -257475, -64485, -395716, -12479, 183979, 6399, 18178, -486795, 5640, -101260, 155248, -351154, -167232, 49185, -150093, 63557, -181416, -44708, -31307, 55641, 93522, -139576, 91738, 89209, 39483, 235007, 63936, -94954, 106217, 113339, 209437, 31628, 147999, 156892, 151722, -152800, -285622, 135468, -136066, -203836, -66560, -121214, 157026, -289461, 108699, -58993, -55106, -116710, 4723, 381994, 68897, 48779, 55709, 201829, -25585, -261635, -188022, 62606, -268940, 19322, -94694, 166190, 103010]
15837A03010h9858r9075B38613c74663B21261F3404h2413j14917G9742a666A52518
15825a71816j28913c2183H0922j5410f3263p2751F29b64681d8193b2510A21995
15813A40484B1421a78877Q0958B64883b9435C6256J74699d80303P4681D6024J19686
15802A65710b10570C9300K29472A6954K36531E9587e6310B19821r0725i8434r0393
15791a88827f102F5306L5579h4886H0009K33683B4968e4379K5760j21598e8708
15779a06787I4944J18292G3694b37920h3510D0854J03615b15470q8069A55340
15768b22775A67457p0996h204j37423B4792P4016c20216A42109h8390J4801F8263
15756c6777E6503a39598A92560B1978J58994q2309e8071n2208j67687H2429a68872
$$ y = [103010, -89858, -188933, 238613, -374663, 221261, 63404, -82413, -197330, 79742, -1666, 152518, -171816, -300729, -32183, 80922, 65512, -63263, -136014, 629, -264681, -48193, -22510, 121995, 140484, 21421, -178877, -97919, 264883, -29435, 36256, 210955, -480303, -405622, 46024, 165710, -210570, 39300, 268772, 16954, 253485, 59587, -56310, 219821, 129096, -98434, -188827, -6102, 65306, 100885, -84886, 80009, 313692, 24968, -54379, -28619, -150217, -58708, -106787, 94944, 213236, 73694, -237920, -83510, 40854, 144469, -215470, -303539, 155340, -222775, 167457, 96461, -8204, -145627, 24792, 98808, -320216, 142109, -88390, -73589, 68263, -36777, 56503, -139598, 192560, 21978, 180972, 98663, -58071, -110279, -277966, 82429, -168872]
15744A54932O9890d2622G3212l6007a44870b6276B4654e1033C853J70728a15811
15732A7451K26335G5957O83O0187a49363q4295A13478b1454l10089Q4610K5948
15721b20985F2097a41652a8595k15496B12045q9515A4434j78O5044b59481J3768
15710b45713Q6014C59337G7377l391a20870M867A35263d01818J64315a07714N494
15699a02220o9070k909F4607a59785A12085a24752B54564d8508C63393c30835
15688b57426F192Q230h2762C33590b02790j2344R0675M2166A7348J82610a25081
15676A59879k5223a89207I121i5512g458m21901A38619c55992a24848I9273a42909
15664e831l7786k07192B12020c39831i9807J9331G3867h3003j38188M576A24607
$$ y = [154932, 224822, -42622, 73212, 37205, -144870, -26276, 24654, -51033, 3853, 174581, -115811, 17451, 243786, 75957, 76640, 136827, -149363, -233658, 113478, -21454, -331543, -246933, -220985, 62097, -141652, -18595, -234091, 212045, 122530, 14434, 14256, 79300, -259481, -245713, -159699, 359337, 77377, 73986, -120870, -116003, 135263, -401818, -237503, -107714, -102220, -171290, -174199, 64607, -159785, 112085, -124752, 254564, -48508, 363393, -330835, -257426, 6192, 14422, -82762, 333590, -202790, -215134, -124459, -82293, 17348, 199958, -125081, 159879, 134656, -189207, 9121, -95512, -7458, -429359, 138619, -355992, -124848, 99273, -142909, -5831, -43617, -250809, 212020, -339831, -99807, -80476, 73867, -83003, -221191, -216615, 124607]
15652A5754N8041N787b37989I737d2110j8080m6724l5640r0927B90016a33614
15640c2840k85957h2607C8787L3378f0912C13066I7940l9736O2596O3782b64591
15628B57621F8888c5851H8618e3446l6830j43227F1899b50342A45079E5131g2130
15616B74287c07293g4978C74809a41817B33519h6960L1520F515a54214H8073D0872
15604A27747g1780H3513c27839d3239l07332a65037P1042C96895e9814A58116
15593g9012H0874a42720A02459f3694E8483K1957a35102k0693A54536b03013l4538
15582b37551A79727e0819o3828j32662P2163O0379G4945l7261J62029l9600N5957
15571B16070q6167a49840P1220C1805M684K89010q9644a61099j87833A32817d3278
$$ y = [15754, 73795, 79582, -237989, 9737, -42110, -60190, -106914, -142554, -233481, 290016, -133614, -32840, -318797, -82607, 38787, 72165, -60912, 313066, 97940, 58204, 120800, 184582, -264591, 257621, 68888, -35851, 88618, -53446, -90276, -233503, 61899, -250342, 145079, 55131, -72130, 274287, -307293, -74978, 374809, -141817, 233519, -86960, -55440, 6515, -154214, 88073, 40872, 127747, -71780, 83513, -327839, -43239, -350571, -165037, -93995, 396895, -59814, 158116, -79012, 80874, -142720, 102459, -63694, 58483, 80440, -135102, -155795, 154536, -203013, -237551, 179727, -50819, -114647, -247309, -175146, -114767, 74945, 37684, 199713, 160113, 216070, 129903, -149840, -78620, 31805, 36489, 325499, 235855, -161099, -348932, 132817, -43278]
15559F3148i5723E5354a17256B90633b80588L1906A4433o087J6822c3528L084
15548c0444m1752b7530k13650g8863l2054A84466G7513M3152B8954K26692a16882
15536A869J27048a61149e2589D5174A2860J33876b47929a6795D10900A6187h9616
15524B82055a09194n2205j73518a64183k11998a58527l384j8187A38656J04821
15514B43477k703c81482E8024J11920b03087F9501d7535H18i1781a0531l29523
15503c40054b2672A00204J10399b05915B70395B7524a37599H0383i2580M1969
15493e0611j7872k05505q2381A07179M9047a97435J2975K2580J1502A18134f0807
15481g3607B11309a40509B9531P9650a44889j47794B65457j09491a28373A87835
$$ y = [63148, -95723, 55354, -117256, 290633, -280588, -248682, 14433, 8346, 25168, -33528, -30444, -72196, -27530, -241180, -78863, -110917, 184466, 77513, 120665, 28954, 255646, -116882, 1869, 128917, -161149, -52589, 45174, 12860, 146736, -247929, -16795, 410900, 16187, -89616, 282055, -109194, -161399, -334917, -164183, -376181, -158527, -161911, -180098, 138656, 243477, 240774, -381482, 58024, 169944, -203087, 69501, -47535, 818, -91781, -10531, -340054, -22672, 100204, 210603, -205915, 270395, 27524, -137599, 80383, -92580, -50611, -68483, -273988, -356369, 107179, 156226, -197435, -184460, -161880, -150378, 118134, -60807, -73607, 211309, -140509, 29531, 109181, -144889, -292683, 265457, 155966, -128373, 187835]
15470b7733m1417C3149O4076j8806g3813l3772b6529D20660d2936D18302D0595
15458A5553g7130k5684d7060j23105B38530M4175b56248D4005P8105e4129m4672
15447i8801E9663J36492G2306j4047c16477A55925N9864B4132K54799a20423j28819
15436b49242B83102a73421A8342J07301E6666a39676B25735G0143g6669M802B65405
15424a0396A49707G247b27947e6522a9698k14076A62065h1808c4199I9010b55481
15412B81229B3736J20039c88381a8765l582A96681a73599f9724j44729A70626
15401c1080j99365D8629K1718C4391j2791b5054j5744k32388B93401r3548J39041
15390C38894p2388F6829b0745j69037m8450e5083E9669b14189j21811e392A55141
$$ y = [-27733, -69150, 33149, 97225, 78419, -73813, -107585, -26529, 420660, -42936, 418302, 40595, 15553, -77130, -102814, -47060, -170165, 238530, 282705, -256248, 44005, 122110, -54129, -98801, 59663, 196155, 72306, 58259, -316477, 155925, 215789, 24132, 278931, -120423, -249242, 283102, -173421, 18342, 125643, 56666, -139676, 225735, 70143, -76669, -71867, 265405, -10396, 149707, 7247, -227947, -56522, -19698, -233774, 162065, -81808, -34199, 99010, -255481, 281229, 23736, 143775, -388381, -18765, -22347, 196681, -173599, -69724, -214453, 170626, -31080, -230445, 48629, 70347, 34391, 21600, -25054, -40798, -273186, 293401, 199853, 338894, 266506, 66829, -20745, -189782, -238232, -55083, 59669, -214189, -336000, -5392, 155141]
15378G1001e4490J1662j80109K2055N0107I1966D1234A828b16513q0980A21743
15366B06637F9488C2925L46878a67743C8942e5293n1699k02225C0551b71208R2422
15355a78786C4545J36915a2552A96380a24022B04725A4952e050q5115k41710A53357
15343H2244e9711a2494l57615A83749Q54a35288B48954H0918l7726f6921C17851
15331a17571k11918D9720A5589R0749E0697G198L05852g5561B31573q1556B6578
15319d008A54447A2249J29678Q8479j10982a56387J2355B29974e552j99989A17819
15307H5377d3452D6963f5060k38024B38429j15939c4051p3130d2061a8659I7964
15295b7827r7885G1008c2616B29721a6339I5565M3914C8521J615L7419O3600h5251
$$ y = [71001, -54490, -42828, -222937, -200882, -150775, 91966, 41234, 1828, -216513, -297493, 121743, 206637, 69488, 32925, 379803, -167743, 38942, -55293, -106992, -309217, 30551, -271208, -178786, 34545, 171460, -12552, 196380, -124022, 204725, 14952, -5050, -90165, -331875, 153357, 82244, -59711, -12494, -370109, 183749, 184603, -135288, 248954, 80918, 43192, -66921, 317851, -117571, -329489, 49720, 15589, 106338, 50697, 7198, 313050, -75561, 231573, 150017, 26578, -4008, 154447, 12249, 141927, 230406, 119424, -156387, -144032, 229974, -5552, -205541, 117819, 85377, -43452, 46963, -65060, -303084, 238429, 122490, -34051, -107181, -42061, -18659, 97964, -27827, -125712, 71008, -32616, 229721, -16339, 95565, 139479, 38521, 40136, 77555, 141155, -85251]
15282D0106a6097A66581K59665a52879e9004A43605f056n1490A92425a45694A45770
15270a92076D7942K31699b8148A45465a96853K0836g5049j59800P1894j892N9274
15259a05573C42195A35960J83055I3475D5754a16213d3712A83045K21944A84220
15248A92502J27812j05362G3186B5929a22103A46950J17701E9421M85485B01235
15237C26500m7919K40093r2331J56762O56634N98005o25449K02465m00977l04535
15227G09248l20290O0080a4743B80905F6719M8632a05065C13313h9162A42696
15216a02885j18944E7134J69505m4318q0096j8815g967G1040P4173a49058C37154
15204a92428j0245E5423Q8064a88999b9863k60279A4640P0231b41684A02230c0990
$$ y = [40106, -16097, 166581, 426246, -152879, -59004, 143605, -6056, -57546, 192425, -145694, 145770, -192076, 47942, 279641, -28148, 145465, -196853, -176017, -75049, -234849, -162955, -164847, -105573, 342195, 135960, 319015, 93475, 45754, -116213, -43712, 183045, 404989, 184220, 192502, 320314, 214952, 73186, 25929, -122103, 146950, 264651, 59421, 544906, 201235, 326500, 278581, 518674, 426343, 583105, 1239739, 1837744, 1212295, 1414760, 1013783, 709248, 388958, 449038, -14743, 280905, 66719, 115351, -105065, 313313, -89162, 142696, -102885, -221829, 57134, 226639, 182321, 102225, 83410, -7967, 71040, 145213, -149058, 337154, -192428, -202673, 55423, 143487, -188999, -29863, -290142, 14640, 84871, -241684, 102230, -30990]
15192b34687A08589g2022A21158R8114a69346g9999A19828d6403J4279k3357B67377
15180a78395A14719O3240b4879D2735M6233c29307A79481J62895b317A57428J46722
15169C04150j12433a82042B227K50841J4152o9478C6104K37827A31095G858L67908
15158C75766c172k83670A4874K35072H5152R4277H2641k2067K87953o3326l4464
15147B50737G7819J4018a48442B8303M4863L8098b3834G5222a70638A60739J4243
15136A74982G7278l369K557h9802A99793L8567p6894J04435a89183d6817A66087
15124A58305k1566K08201A59293J95274A7783L30822a19695C11102J2144p1713
15114B51533E0981P0895g9669B74534p7518H7299L31129E7126K562Q5713m5530
$$ y = [-234687, 108589, -72022, 121158, 219272, -169346, -79999, 119828, -46403, -32124, -55481, 267377, -178395, 114719, 177959, -24879, 42735, 88968, -329307, 179481, 342376, -2317, 157428, 304150, 191717, -182042, 2227, 253068, 267220, 197742, 36104, 273931, 131095, 7858, 375766, -3172, -286842, 14874, 249946, 85152, 179429, 82641, 60574, 348527, 285201, 250737, 77819, 91837, -148442, 28303, 73166, 111264, -23834, 75222, -170638, 160739, 174982, 77278, 73909, 76466, -89802, 199793, 238360, 161466, 265901, -189183, -46817, 166087, 158305, 136739, 344940, 159293, 354567, 17783, 348605, -119695, 311102, 323246, 251533, 50981, 121876, -79669, 274534, 197016, 87299, 418428, 57126, 59688, 145401, 99871]
15103I9871K53798A11718J87473I495O6016P8292A8109J25230J44982j39543Q608
15092A57386D4889J2605J33025a52326D4550A3886a37952E9610a2034A49989n0159
15081I9830l1288K46801A44795C1675a39058C33957A19933e0045b4515G6061J55190
15070B31251a0982j27268A71155h4045b4614B25067a25372C44630j52276o5419
15060A26935a06830C51321E9015a24374A06537h7851A99261J78736j73303r4806
15050A09888M46231A40636m3178j2232P3001F4724R6196L63377B28000j12432
15040A15568P4570J13755O6089A48055K04811g8979A75220q2731L88K97372D5806
15028A02992J06677l382G6993M7088J2906m0643R3046R0082a02359B67290j14136
$$ y = [99871, 353669, 111718, 299191, 9495, 75511, 153803, 18109, 143339, 288321, 148778, 157386, 44889, 57494, 190519, -152326, 44550, 13886, -137952, 59610, -12034, 149989, 99830, 68542, 315343, 144795, 31675, -139058, 333957, 119933, -50045, -24515, 76061, 231251, -10982, -138250, 171155, -84045, -24614, 225067, -125372, 344630, 192354, 126935, -106830, 351321, 59015, -124374, 106537, -87851, 199261, 377997, 204694, 109888, 556119, 140636, 97458, 85226, 158227, 64724, 160920, 524297, 228000, 115568, 190138, 303893, 369982, 148055, 352866, -78979, 175220, 92489, 92877, 390249, 45806, 102992, 209669, 206287, 76993, 124081, 136987, 96344, 189390, 279472, -102359, 267290, 153154]
15017A53154L66225k33086p8012J10436G1233L28032p9530G0603K00608K9112
15007C00323r3179k1526J28498C404K75115k336J34562b01368A84166p8736J45336
14996B50766r4969a62419A23026N71166C43361j30594J42660A51285K74398j26173
14986B99510E7750J20124M08338A81306K57692n9719m4213j2989A2831g3525C18105
14974b02430C09544j28985m0000K03583I7187M61466K0499j46525a5881A95932
14963C2195C40L80544Q894j01207K9934m1597q0514K44114j34774L24506I8235
14951G5211B4242L20210G1505J91851m8201a21747A59062N7464K25459j250a10916
14939C28104A21671k1528J82147M37444B69147a58018B31972K69395J01523A71797
$$ y = [153154, 519379, 286293, 208281, 318717, 71233, 399265, 319735, 70603, 271211, 300323, 207144, 185618, 314116, 3404, 278519, 276183, 410745, -201368, 184166, 105430, 250766, 155797, -162419, 123026, 694192, 343361, 212767, 355427, 151285, 425683, 299510, 57750, 177874, 586212, 181306, 438998, 379279, 335066, 322077, 12831, -73525, 318105, -202430, 309544, 180559, 140559, 344142, 97187, 558653, 579152, 432627, -15881, 195932, 32195, 340, 380884, 389778, 288571, 318505, 276908, 196394, 440508, 305734, 630240, 98235, 75211, 24242, 344452, 71505, 263356, 215155, -121747, 159062, 216526, 441985, 440735, -110916, 328104, 121671, 100143, 282290, 719734, 269147, -158018, 231972, 501367, 602890, 171797]
14928A45892K12049H6895L48238r9200J53400j90450j35034m192J75156q5231
14918B49582N1945R7699I7556K05862G168K73935n7631L74755B83002j5225D005
14906A10873D2550K12602J83153k14380J98441J15330O5465k49182R441r2005
14896B71415J74718j11330j59602K14926j16220j473M178K6650N2526A18921L48868
14885D67789j02159o2924H9262R0469J91204A48023M3449m7050L26599J59874
14875F30895r3963j19250R3799k41085l8727J2193L40664n3493a74312A19404
14864D32274A45413K05027J7588K39458c337G1124K77319J03803j80518m9661
14854B22067J4742r8034K52827A2977M07596A98335L29767k50146K21012L2969
$$ y = [145892, 357941, 86895, 435133, 335933, 489333, 298883, 163849, 159657, 334813, 249582, 301527, 399226, 97556, 303418, 7168, 281103, 223472, 598227, 283002, 267777, 4005, 110873, 42550, 255152, 438305, 223925, 422366, 537696, 603161, 353979, 363420, 271415, 446133, 334803, 175201, 390127, 273907, 272434, 276612, 303262, 355788, 118921, 467789, 365630, 302706, 89262, 179731, 370935, 148023, 191472, 144422, 471021, 630895, 536932, 417682, 511481, 270396, 231669, 243862, 584526, 531033, -174312, 119404, 432274, 145413, 350440, 368028, 607486, -3337, 71124, 348443, 452246, 271728, 222067, 236809, 138775, 391602, 12977, 420573, 198335, 528102, 277956, 498968, 531937]
14844E31937A24057M04007A64267K84560J09227J71364A92728L63472A91286l2090
14834A59196J11750K45743A16461K05426J69378R2701k4532l9947N4137j49985
14824D23639J39714B52737J67448K7621K7154j31777M82661B65777L40727J1881
14814F18385K0254n65l1093k54626J70355B56501K66712j43830O5352p9391L02967
14803F68311j51981L186j86374L28156p4318j65093O0643K36567k050j91978r7350
14792D27719J98887k02383K86055l54058K62032J85370l14100o0304A50237N59972
14782G10209j28363J34202j9583j03924k5296B56491j17871M54094m1820J8970
14772E69864j23777n0888M33261k47800j6821p1105M19007D00627J26212K86228
$$ y = [531937, 124057, 528064, 164267, 448827, 558054, 729418, 192728, 556200, 191286, 159196, 270946, 516689, 116461, 321887, 491265, 583966, 559434, 519487, 573624, 423639, 563353, 252737, 420185, 447806, 474960, 343183, 825844, 265777, 606504, 618385, 638639, 638074, 606981, 352355, 522710, 256501, 523213, 379383, 444735, 365344, 668311, 516330, 519516, 333142, 661298, 586980, 421887, 482530, 719097, 717047, 525069, 427719, 626606, 424223, 710278, 356220, 618252, 803622, 489522, 429218, 150237, 710209, 581846, 716048, 696465, 592541, 567245, 256491, 138620, 592714, 550894, 569864, 446087, 395199, 828460, 580660, 563839, 492734, 911741, 400627, 526839, 813067]
14762H13067k53243n8716J08087j18155O3318r9131K54271k19033K00963j30096
14752E61332J15952K3968j70670p3599J37453M754k35701K20245K8361P2441K11521
14741H96057j66690k13395M59917k60158n7629J82552l49945L12723o6100j53971
14731E83361J1713J37004j38128L83793n2579k40419K3933R5848k01910j5325
14721E87291J09286L9847r295p2091L82096m74452L7315K64641k99137M76494
14711A041995l67759M25640l50069R2053P8059p3316P7394j18448l6j14443P2753
14700G63823J14408j07145J76739N2134D13510M25459m8933J91751j53192J48566
14690I77161J3772q6819k70055J40163K18184P9446n2546j22817J5453R8116j93249
$$ y = [813067, 559824, 501108, 609195, 491040, 554358, 455227, 709498, 490465, 691428, 561332, 677284, 701252, 530582, 456983, 594436, 599190, 363489, 583734, 612095, 684536, 896057, 729367, 515972, 975889, 715731, 658102, 840654, 490709, 803432, 737332, 583361, 595074, 732078, 593950, 977743, 925164, 684745, 708678, 804526, 602616, 587291, 696577, 736424, 727129, 655038, 1037134, 562682, 599997, 864638, 565501, 1041995, 674236, 1099876, 749807, 841860, 919919, 846603, 923997, 805549, 805513, 691070, 763823, 878231, 771086, 947825, 999959, 413510, 838969, 790036, 981787, 828595, 977161, 990933, 904114, 634059, 774222, 992406, 1071852, 1019306, 896489, 911942, 1010058, 816809]
14679H16809q457K30310j32150q4034K28830k9298j07441N2732k8119K93653k58300
14668I74535n8499J80607J20033k69555L42319J04631n20650N7318r0749J76166
14658A016156o3402J28680R2876q9143n7690J16807j93291j48663r970L77249
14648A169609n680M27694o99033M09769R2878m80572q7831L34500j42033M40040
14638A459341l38859l0553R1653M12973o93218L59488m3498L9774k12454N501
14628A050148L28954q0112J51934O9310k88979j01390K72257O6424l35080J02505
14618A235971J50766k99613K39876P2584O0370n2282j3249K17864n7244L8386
14608A593429J00822O4062m46051m2355J14069L242j30634J73222K58040r451
$$ y = [816809, 808352, 1038662, 906512, 822478, 1051308, 1022010, 914569, 967301, 939182, 1232835, 974535, 916036, 1096643, 1216676, 947121, 1289440, 1394071, 873421, 930739, 839990, 1016156, 952754, 1081434, 1174310, 1085167, 1027477, 1144284, 950993, 802330, 792360, 1169609, 1163929, 1591623, 892590, 1302359, 1395237, 914665, 826834, 1161334, 1019301, 1459341, 1120482, 1089929, 1181582, 1594555, 901337, 1260825, 1217327, 1257101, 1044647, 1050148, 1379102, 1298990, 1450924, 1520234, 1231255, 1129865, 1402122, 1468546, 1133466, 1235971, 1386737, 1087124, 1327000, 1399584, 1459954, 1407672, 1394423, 1612287, 1555043, 1593429, 1694251, 1758313, 1312262, 1269907, 1383976, 1387218, 1256584, 1429806, 1687846, 1678395]
14598A678395k16182M21878L9396l62842K82765m95080L59517k53937L19844k0738
14588A753016j34837K56401l31421K02001j22243k24240M30576q4910j4065J40439
14578A870717J25503J30593n7047l48733J81488M2547n9022r1998M65394l51680
14568A907762k03295N43646j58250M1483m4130k28538J16242J65307K82247m86125
14558A936349N50270m12122m0599J10816L3980J19075k53951N80049m23722N23105
14548B723250P0320N2388K21915R2269K86519j22326J9685M82853j98528P83881
14538D412226M62645N66466P36935J434673K077261L389201O208214J0204383
14530B9492004K834933j1536632p464906m721989k608357j426240o60368m76832
$$ y = [1678395, 1462213, 1884091, 1923487, 1560645, 1843410, 1348330, 1707847, 1453910, 1773754, 1753016, 1618179, 1874580, 1543159, 1745160, 1622917, 1398677, 1829253, 1744343, 1730278, 1870717, 1996220, 2126813, 2069766, 1721033, 1902521, 1945068, 1886046, 1794048, 2259442, 1907762, 1704467, 2248113, 2089863, 2131346, 2087216, 1858678, 1974920, 2140227, 2422474, 1936349, 2486619, 2074497, 2033898, 2144714, 2178694, 2297769, 2043818, 2623867, 2200145, 2723250, 2793570, 2845958, 3067873, 3160142, 3446661, 3324335, 3344020, 3826873, 3628345, 4412226, 4874871, 5441337, 6178272, 7612945, 9690206, 13079407, 19287621, 29492004, 32326937, 20790305, 13325399, 8603410, 5995053, 4568813, 3908445, 3431613]
14522C431613m08095m2536p0687j84910k06j43320k15293L59899k10368j43543
14512B372554N02518k40985p5977J45626K1700R8689j48983J37852k73944J96854
14502B735904j63507J35816J73351L00423j12953k89752J20719K22753p0749O9292
14492C121297k37932L46743q7214j00667k1389J54163K80179m8924j4710M8618
14482C440164j5160K03221J5085N4332r2990L9419P0113j19463j92836L80678
14472C782563P9640N2823j76932J49390k90804M07441K12242j98315p1286P0031
14462D016793K62241M179P6173J08493k92010M02756k9066P3560k59645L9876
14452D403350K38811K07857L8552K3725j99834J84772L00550K65136l36350j73159
$$ y = [3431613, 3023518, 2980982, 2910295, 2725385, 2725179, 2581859, 2366566, 2726465, 2516097, 2372554, 2875072, 2634087, 2558110, 2703736, 2725436, 2824125, 2675142, 2812994, 2539050, 2735904, 2572397, 2708213, 2881564, 3181987, 3069034, 2779282, 2900001, 3122754, 3052005, 3121297, 2883365, 3230108, 3142894, 3042227, 3020838, 3175001, 3455180, 3406256, 3391546, 3440164, 3425004, 3628225, 3643310, 3697642, 3604652, 3644071, 3714184, 3594721, 3401885, 3782563, 3862203, 3915026, 3738094, 3887484, 3596680, 4004121, 4216363, 4018048, 3946762, 4016793, 4279034, 4283213, 4359386, 4467879, 4175869, 4578625, 4549559, 4623119, 4363474, 4403350, 4642161, 4850018, 4888570, 4912295, 4712461, 4897233, 5197783, 5462919, 5126569, 4953410]
14442D953410L46128n2518J34565j28018K39825K32307j6409J34420j42994K28459
14432E929175R802p4638J49392K0663o5317L78921J63657P149K53336j29424k01947
14421F440769M04701j52997K72907o1583K14187L5897M3245K28360J87276n0420
14411G562342J21598L55034o6807J81248j52949L39014p4510Q5736K71660M47240
14401I069606k78874K3615O50125j57745O5922j3121N29841K60373j25527J36707
14391A0160922K56123R5507r8906L70947J13001M06900p5169O36160l3846j61194
14381A1670445P01443j25127J59496M64819m2719K65638J57541K15337L82273
14372A3849146J00477K94044N96651P2877J98433J98980J01203N29842K92391
$$ y = [4953410, 5299538, 5247020, 5381585, 5253567, 5493392, 5725699, 5709290, 5843710, 5700716, 5929175, 5938977, 5864339, 6013731, 6034394, 5969077, 6347998, 6511655, 6518804, 6772140, 6642716, 6440769, 6845470, 6692473, 6965380, 6903797, 7117984, 7153881, 7197126, 7425486, 7612762, 7562342, 7683940, 8038974, 7972167, 8153415, 8000466, 8339480, 8264970, 8350706, 8622366, 9069606, 8790732, 8814347, 9464472, 9306727, 9372649, 9359528, 9889369, 10149742, 10024215, 10160922, 10417045, 10512552, 10413646, 10784593, 10897594, 11304494, 11229325, 11865485, 11831639, 11670445, 12371888, 12246761, 12406257, 12871076, 12828357, 13093995, 13251536, 13466873, 13849146, 13949623, 14243667, 14840318, 14913195, 15111628, 15310608, 15411811, 15941653, 16234044]
14363A6234044L48558M30991L09911J01206K92290L20309L97505M37807M23981
14354A9296602M28561K6168R65477O51600J75005J52824Q46293L84202Q98796
14345B3825528J56780P5228P83554O60782R01135L09599Q89007M29090N82685
14336B8613388M51984J240742O39246O23406J158697M89893Q61410P70863J372106
14327C6221735Q16520Q55983J030957J161106J236859J005199J401569J480651
14319D5210579J408085J002859J536162J711735J702010J572234J741368K146999
14311E8032031J392568J950687K207924K021093K106343K344827K899948K807164
14303G5762585K487651K884375K843605L447081L062148L592572L494280M314147
$$ y = [16234044, 16582602, 17013593, 17323504, 17424710, 17717000, 18037309, 18434814, 18872621, 19296602, 19725163, 19751331, 20716808, 21368408, 21543413, 21696237, 22542530, 22926732, 23825528, 23982308, 24057536, 24841090, 25501872, 26403007, 26712606, 27601613, 28030703, 28613388, 29065372, 30306114, 30945360, 31568766, 32727463, 33217356, 34078766, 34849629, 36221735, 37038255, 37894238, 38925195, 40086301, 41323160, 42328359, 43729928, 45210579, 46618664, 47621523, 49157685, 50869420, 52571430, 54143664, 55885032, 58032031, 59424599, 61375286, 63583210, 65604303, 67710646, 70055473, 72955421, 75762585, 78250236, 81134611, 83978216, 87425297, 90487445, 94080017, 97574297, 101888444]
14295A01888444M005769M236493M773103M959094N340265N127097O076691O030635
14287A42437591O166352P285671P081912P655933Q172971Q351842R099943R663814
14279B05916029R957781J0663600J1325964J1685075J2373346J3109395J3094019
14272B88125209J3701648J4078683J4951090J4703294J5383655J5464673J4184981
14265C90593233J3746395J1344083J0519328R162010P994060P235815O436841
14258D57031765M042380J766496R25519N4731k233398r682189r112604j0463485
14250D32329215j0904136j0982751j2176403j1825211j2958394j3116472j4141858
14243C46223990j4378511j4501568j4139005j4221571j3039643j2602910j2104680
$$ y = [101888444, 105894213, 110130706, 114903809, 119862903, 125203168, 130330265, 136406956, 142437591, 148603943, 155889614, 162971526, 170627459, 178800430, 187152272, 196252215, 205916029, 215873810, 226537410, 237863374, 249548449, 261921795, 275031190, 288125209, 301826857, 315905540, 330856630, 345559924, 360943579, 376408252, 390593233, 404339628, 415683711, 426203039, 435365049, 443359109, 450594924, 457031765, 461074145, 462840641, 463766160, 463820891, 461587493, 451905304, 442792700, 432329215, 421425079, 410442328, 398265925, 386440714, 373482320, 360365848, 346223990, 331845479, 317343911, 303204906, 288983335, 275943692, 263340782, 251236102]
14236B51236102j1835740j1152478j0705242j0179273r384559r100197q460350
14229A80418263q144940p322717p563318o942304o449609o378832n591299n583674
14221A26441570m849491n302192m771532m493997m235514l701731l971592l604845
14213I1510676l265929l809082l104721k766636k830711k791001k535819k456229
14205F7950548k403747k066808k352986j742534k251788j261399j784584j645714
14197E2440988j706328j727436j578146j061923j330783j037386j324269j176989
14189D1497728j494459j287499q80654q65291n72861j324368j137309o14842r62494
14180C2357951p85895o67082o56143q28392p56058j046211n66877l69119j080064
$$ y = [251236102, 239400362, 228247884, 217542642, 207363369, 197978810, 188878613, 180418263, 172273323, 164950606, 157387288, 150444984, 143995375, 137616543, 132025244, 126441570, 121592079, 116289887, 111518355, 107024358, 102788844, 99087113, 95115521, 91510676, 88244747, 84435665, 81330944, 78564308, 75733597, 72942596, 70406777, 67950548, 65546801, 63479993, 61127007, 59384473, 57132685, 55871286, 54086702, 52440988, 50734660, 49007224, 47429078, 46367155, 45036372, 43998986, 42674717, 41497728, 40003269, 38715770, 37835116, 36969825, 36396964, 35072596, 33935287, 33320445, 32357951, 31572056, 30904974, 30248831, 29420439, 28664381, 27618170, 27051293, 26682174, 25602110]
14171B5602110k45607m82031n32392p35352j82932r11906k22748n78404l41259
14162B1369479n73126n08662n23346k38599l90621m33829o03043J41553p85038
14153A7454768q0421l90323k64740M1245o62557n0223m61624j90856k33809l86293
14143A4775167m86989n4925r0198n61714l9467J40698n64323m05525n6707j89523
14133A2466494j48348j58917k2510m41414N3884m44113l97473n137J70996l89341
14123A0684121l15812j00317J8758k88696k59938J24267m41623K48763m02316
14114I267207P7163k00626j21553n7055l85811P8022k77702K26617p1698l68023
14104H166541j3836n0747j31422l92874J17491l20246R0550J21211m13816r5660
$$ y = [25602110, 25356503, 24874472, 24342080, 23606728, 23423796, 22511890, 22289142, 21710738, 21369479, 20796353, 20287691, 19764345, 19525746, 19135125, 18701296, 18098253, 18239806, 17454768, 17374347, 16984024, 16719284, 16760529, 16097972, 16047749, 15586125, 15395269, 15161460, 14775167, 14288178, 14233253, 14143055, 13581341, 13541874, 13682572, 13118249, 12712724, 12656017, 12466494, 12318146, 12159229, 12136719, 11695305, 11749189, 11305076, 10907603, 10902466, 11073462, 10684121, 10368309, 10267992, 10286750, 9998054, 9738116, 9862383, 9420760, 9669523, 9267207, 9344370, 9143744, 9022191, 8965136, 8579325, 8657347, 8379645, 8606262, 8534564, 8166541, 8152705, 8101958, 7970536, 7577662, 7695153, 7374907, 7465457, 7586668, 7172852, 7077192]
14094G077192J19964l02428P6134l03134K12840Q5044l96584j48149K9191l28258
14084F121812M01779k09456J29446m96516o1329J61017j45301n28477M04947J42001
14074E919923l30382k07973n5729M59254n94508L13118K1609l86509M1055J87187
14064E367045j88089n01854M61487j04715o28295M80723l74102Q3850J11643J06646
14054D814339o77497K16072J34495m06531K31876J7100j43816k94679N08995j39190
14044D261164j14663k37602K95420J16596l50523J47963k12662q660r0218J53923
14034C960738j82504N094j76623p3548J41737l97850J79142j27704K02646l02077
14024C229051k06841L61873k86428L23750l15342K0060L18283l51053K40481l95559
$$ y = [7077192, 7197156, 6894728, 6970862, 6667728, 6880568, 6965612, 6569028, 6420879, 6450070, 6121812, 6523591, 6314135, 6443581, 5947065, 5885736, 6046753, 5901452, 5372975, 5777922, 5919923, 5589541, 5381568, 5325839, 5785093, 5190585, 5503703, 5525312, 5138803, 5179858, 5367045, 5178956, 4677102, 5138589, 5033874, 4405579, 4886302, 4512200, 4596050, 4707693, 4814339, 4136842, 4352914, 4487409, 4080878, 4312754, 4329854, 4186038, 3891359, 4400354, 4261164, 4146501, 3908899, 4204319, 4320915, 3970392, 4118355, 3905693, 3897033, 3806815, 3960738, 3778234, 3783328, 3606705, 3533157, 3674894, 3277044, 3456186, 3328482, 3531128, 3229051, 3022210, 3384083, 3097655, 3421405, 3106063, 3126123, 3444406, 3093353, 3333834, 2938275]
14014B938275M13994k61434K06566k47835j92454K08169j98182M2327L5567n4775
14004B890218J31013l16612m94980P24914j46386O2936n1113l67846K53265k10230
13994B475179R724l9863R898K96451j23279j39928P9663q5249k51734J84797J24407
13983B540066l90510R9141L37377M29931m2808p307K42216M66804R72031J013275
13973E660216K949435N490299J0235413Q163017r501974q157152m498313k582212
13965G758729j532814m92985j228311k28440k96700j87012m31223o0266k867l49958
13955B948153m9761q8070o428k22182j65917L54211n44120J33970K73601j24736
13945B508721q1710Q512Q8204J58893n14702k03207N8362R0638L08694m40066
$$ y = [2938275, 3352269, 3090835, 3297401, 3049566, 2857112, 3065281, 2867099, 2909426, 2944993, 2890218, 3021231, 2704619, 2209639, 2934553, 2788167, 2851103, 2799990, 2432144, 2685409, 2475179, 2484903, 2445040, 2454938, 2751389, 2628110, 2488182, 2567845, 2482596, 2230862, 2415659, 2540066, 2149556, 2248697, 2586074, 3016005, 2973197, 2965890, 3208106, 3674910, 4646941, 5660216, 8609651, 14099950, 24335363, 32498380, 22996406, 14839254, 10340941, 7758729, 6225915, 5732930, 4504619, 4276179, 3979479, 3792467, 3361244, 3300978, 3298111, 2948153, 2898392, 2810322, 2803894, 2581712, 2415795, 2770006, 2225886, 2359856, 2633457, 2508721, 2427011, 2435523, 2523727, 2682620, 2167918, 1964711, 2023073, 2113711, 2422405, 1982339]
13935A982339k4714K59731j68274J82375m51590L04490J37290l98793J18764J19650
13925B061268J0593j77522k47843l2384L07892K32551k91511L3230J39063p4698
13915A960639l10151L64024k22224j88878J66138j68320Q9490k4622j96563J11519
13905A581052j2120J31948K08371o2218l83801J15994J34021L8737r8096p7876
13895A576012j56140l5098J47253k0620J44800l61379J26317J51324l2329J23600
13885A663740k78245J01971k75406L56495m56677Q8033K98149o1151J48920j74989
13875A410840l2786J95636m66482L09897K13791j45452l24345q8522N6306L36103
13865A464986k73966j76522P3180J31795K82178k72364J06920j94135l8911K4001
$$ y = [1982339, 1957625, 2217356, 2049082, 2231457, 1779867, 2084357, 2221647, 1822854, 1941618, 2061268, 2071861, 1894339, 1646496, 1614112, 1922004, 2154555, 1863044, 1896274, 2035337, 1960639, 1650488, 2014512, 1792288, 1603410, 1769548, 1601228, 1690718, 1666096, 1469533, 1581052, 1568932, 1700880, 1909251, 1847033, 1463232, 1579226, 1713247, 1751984, 1653888, 1576012, 1419872, 1384774, 1532027, 1511407, 1656207, 1294828, 1421145, 1572469, 1540140, 1663740, 1385495, 1487466, 1212060, 1568555, 1111878, 1199911, 1498060, 1436909, 1585829, 1410840, 1378054, 1573690, 1107208, 1417105, 1630896, 1485444, 1161099, 1072577, 1128883, 1464986, 1191020, 1014498, 1087678, 1219473, 1501651, 1229287, 1336207, 1142072, 1103161, 1127162]
13855A127162R9983N8091j35232J63217J50221l27350K33081N2052p1606k44912
13845A104707k18355M00584p3753k24804K83172J6717j44445o0866j5305J84149
13835A251801k91115M02840m21189K03036K7833k15992J26083j65901K02912k96293
13825H24015K18680k17376p5137M24150n09515L8412K19084L60062l22922j08147
13815H51306k4697j66265L66080k5852J34674k98458J51530J72598k99950J3020
13805H73986J32711l52420L04074R085j88475J17780N510J46174j69674J57451
13795A036202m20865L04362j57025J00833k04643K14991L6089l55926L85012m28509
13785E10521L20571J48169j71316J54871j20289r7432q5521r0570M16621k62403
$$ y = [1127162, 1227145, 1285236, 1150004, 1313221, 1463442, 1136092, 1369173, 1421225, 1349619, 1104707, 886352, 1286936, 1213183, 988379, 1271551, 1288268, 1143823, 1082957, 1067652, 1251801, 960686, 1363526, 942337, 1145373, 1173206, 957214, 1083297, 917396, 1120308, 824015, 1042695, 825319, 750182, 1174332, 664817, 703229, 922313, 1282375, 959453, 851306, 826609, 660344, 1026424, 1000572, 1135246, 836788, 988318, 1160916, 860966, 873986, 1006697, 654277, 958351, 967436, 778961, 896741, 902251, 1048425, 878751, 1036202, 615337, 919699, 762674, 863507, 658864, 873855, 909944, 554018, 939030, 510521, 831092, 979261, 807945, 962816, 842527, 745095, 659574, 569004, 985625, 723222]
13775G23222J8683J79021K26237l40904j72134L26692k89090j0649Q1880L04808
13765A047766j40418k77171O1475j50172K19445j63816Q5046L5144K45908l43091
13755F20116K080L97291l14492R5716j36670N415J39788n7404o1601j96575K06304
13744F99968C37599M45914k20707K33102l92260K62187k0350p737J32980j56508
13734F14220K8325Q5435m3550n8792J65229k89881Q7263K61645q2388j00724P4701
13723G41483C55694N02876j8224k57033o9808p829O190R4502C03105L99049J00765
13712H02919L15733m77228L9218K13671k04558R8751l02005M84229l48529p496
13702F14705K79947m18229K66669k82304k11794M63601Q907k3903k00289B25842
$$ y = [723222, 741905, 920926, 1147163, 806259, 634125, 960817, 671727, 661078, 742958, 1047766, 907348, 630177, 691652, 541480, 760925, 597109, 682155, 717299, 963207, 620116, 622196, 1019487, 704995, 800711, 664041, 669456, 809244, 751840, 690239, 493664, 699968, 337599, 783513, 562806, 795908, 403648, 665835, 645485, 637748, 770728, 614220, 642545, 727980, 684430, 625638, 790867, 500986, 588249, 849894, 767506, 666782, 741483, 355694, 858570, 840346, 583313, 513505, 505676, 511866, 606368, 303105, 702154, 802919, 1118652, 641424, 680642, 894313, 689755, 788506, 486501, 970730, 622201, 614705, 894652, 476423, 743092, 460788, 248994, 712595, 721502, 697599, 497310, 225842]
13691G53682J55044k94888j29167k924K73347C57659M7967M50295j87596k11986
13681D56339K38777N2261K29694l07166r5608K3929J60060l41383K83194J24232
13671H24329j49378j7510J30760C65971J77454K00864o3166k24816k13277l8410
13661B04620M04468j32384o9477J33117j72441o3409J80429p5154J66733J68974
13651G45476j49256r3245j04226M22170k87314J21551A17482N09100A85601Q2292
13641B67893K10356J24270r2555j06044o9618q5882J72634A38776N89583l15839
13631D12520J26070J70233j68234K2242F3805N23199o207A73195L14409A80286
13620D96977j18494j03781P3803R3448J59830B54671L13420k53722r7839N91815
$$ y = [753682, 908726, 613838, 484671, 481747, 755094, 357659, 405626, 855921, 668325, 456339, 695116, 747377, 977071, 669905, 574297, 598226, 758286, 416903, 700097, 824329, 674951, 657441, 788201, 365971, 543425, 744289, 681123, 456307, 243030, 204620, 609088, 476704, 407227, 540344, 367903, 304494, 484923, 409769, 576502, 745476, 596220, 502975, 398749, 820919, 533605, 655156, 117482, 626582, 185601, 267893, 478249, 602519, 509964, 403920, 334302, 248420, 421054, 138776, 728359, 412520, 538590, 708823, 540589, 562831, 63805, 587004, 580797, 173195, 487604, 180286, 496977, 378483, 274702, 348505, 441953, 601783, 254671, 568091, 314369, 216530, 808345]
13610H08345G1468K61853J54224l029N5837B59600J38479J07665J2372j47108
13600C71008L84946p9276N7216k40635M8475k69072J7087j20836L746K2614L49458
13589E44731B37024M73401l11691A94974P9236K47720j15474J00834j66169r3057
13579B48064m2066K69349q9708R0096M1558k34725j01045L16950B36370J75637
13569D12007b5825B07649K65983J56603j36216q6365m6033o2130J47429B0894
13558B99113J93751B20689K54078n6716j8064K45918l12667M5211A31300J11748
13548B43048J4962J76941l8133j18608O8409b2742B10843Q0424L53837B00971
13537E61860B80768j0551j2664o9186N0206j07573l3591N18700k10971A00712
$$ y = [808345, 71468, 333321, 487545, 484516, 540353, 259600, 398079, 505744, 518116, 371008, 755954, 676678, 733894, 493259, 541734, 272662, 289749, 168913, 172659, 195273, 544731, 237024, 710425, 398734, 194974, 274210, 521930, 406456, 507290, 341121, 248064, 205998, 475347, 385639, 475735, 517293, 282568, 181523, 498473, 236370, 412007, -25825, 207649, 473632, 630235, 494019, 407654, 361621, 299491, 446920, 20894, 299113, 492864, 220689, 474767, 418051, 399987, 645905, 333238, 378449, 131300, 243048, 258010, 434951, 396818, 278210, 346619, -22742, 210843, 291267, 645104, 200971, 561860, 280768, 270217, 257553, 188367, 238573, 131000, 97409, 616109, 405138, 100712]
13526C43530o0644J81832G2077K75046K8194k3468j70310L443K86078j81469M39996
13515G29587k33947A58098Q5874K04520j39320j39531C8832L42080Q9669k12035
13505B58546p3693L43042k39007j15555J49389A23497O1009j528l9667Q2271k7520
13494A98062G0886N5372J92569j46950N8384l9722K18974J2483A89358p0731J01249
13483B19876J08561A33202L06800A33137K90601j67670J18447j13839k6219D2323
13472D69751A99422k6963N3797J80981j7696G1361J45061L80224B37494J22267
13462C59761k7188A32548K85842j04486j9679J1136n3219q2535J22352K21665
13452E13624h6095C90210K4591j03640K03785G6781K91550m5276P5318j74645
$$ y = [343530, 282886, 464718, 72077, 347123, 375317, 351849, 181539, 184982, 471060, 289591, 729587, 495640, 158098, 243972, 448492, 309172, 169641, 38832, 380912, 470581, 258546, 184853, 527895, 288888, 173333, 322722, 123497, 184506, 182978, 143311, 225582, 198062, 70886, 126258, 318827, 171877, 230261, 190539, 409513, 421996, 189358, 118627, 219876, 328437, 133202, 440002, 133137, 423738, 256068, 374515, 260676, 234457, 42323, 469751, 199422, 172459, 226256, 407237, 389541, 71361, 216422, 596646, 237494, 359761, 332573, 132548, 418390, 313904, 294225, 305361, 252142, 169607, 291959, 513624, -86095, 390210, 414801, 311161, 514946, 76781, 368331, 323055, 398373, 223728]
13442B23728b8252B43191J25936j49788L8808a18127D17338D1678K45153a17351
13431A30227L43373E1862N5801a25271C63800O1635A46547K34478j68293m7583
13421A65149J7389b9369A46796K33629A4228J76440K44317j87349o1533L90712
13411E76815j27242j13964A03079K962L0437M62447F355J86887K5384P1237G8206
13399B67182a959E51667A24240J54753J66357a02839D08675j88093J01119A36688
13388b43477G1906J91576L0691J9131r0592O2535j20989K06192R1306A44004K5601
13377A69605K96161k15191K0447I7572O7933m636J62549m7443O5292j47245P3622
13366B67644I5061L7504J59464j26487K35759a14527C13999J04482F1001P8494
$$ y = [223728, -28252, 243191, 369127, 219339, 258147, -118127, 417338, 41678, 286831, -117351, 130227, 473600, 51862, 107663, -125271, 363800, 425435, 146547, 381025, 212732, 165149, 182538, -29369, 146796, 380425, 14228, 190668, 434985, 247636, 186103, 576815, 449573, 335609, 103079, 106041, 136478, 598925, 6355, 193242, 218626, 289863, 78206, 267182, -1959, 551667, 124240, 278993, 445350, -102839, 408675, 220582, 321701, 136688, -243477, 71906, 263482, 294173, 313304, 222712, 285247, 164258, 370450, 461756, 144004, 169605, 465766, 250575, 271022, 97572, 165505, 160869, 323418, 275975, 341267, 194022, 267644, 95061, 132565, 292029, 165542, 401301, -114527, 313999, 418481, 61001, 139495]
13356A39495J49142j13478P44K12506j32247O7962J22738L461A66372G0914L86992
13345D57906j23071C5809J90451M14457A58001o0708a76092C22509j07843F2203
13334C34932k747L3055P1998K8704j95586J89891N8807A34479K45154P1330e8812
13322A9460M31704A97991G9406O3732J42695M0855I3987K3104L75751c2299I6681
13310A39579a3308j56983D09986A55057J295G8025Q0089K91660A88520M11369
13300E99889A39321e7334D10289P63B3510P5437J81181i677n1184B38219a29394
13288C4970P3611L9114M2210O8055n2540G6791J27745J28035j53105K01582j04597
13277B76451b3591C66712C1599d5980n801F9861K81051j45799g8282A98261m2182
$$ y = [139495, 288637, 175159, 175903, 388409, 256162, 324124, 446862, 450323, 166372, 70914, 457906, 334835, 35809, 226260, 640717, 158001, 97293, -176092, 322509, 214666, 62203, 334932, 332185, 365240, 437238, 465942, 270356, 460247, 519054, 134479, 379633, 450963, -58812, 19460, 451164, 197991, 79406, 143138, 285833, 326688, 93987, 117091, 492842, -32299, 96681, 139579, -13308, -170291, 409986, 155057, 156352, 78025, 158114, 449774, 188520, 599889, 139321, -57334, 410289, 411052, 23510, 98947, 280128, -9677, -60861, 238219, -129394, 34970, 108581, 147695, 189905, 257960, 205420, 76791, 204536, 332571, 179466, 381048, 276451, -23591, 366712, 31599, -45980, -51781, 69861, 350912, 205113, -78282, 198261, 156079]
13266A56079E4126k3013M52333r4126A10348C662J46034g0420A75853b5121A65687
13254A64610J41387a66367B3595R7388M6202n5235k2702J98567A05823f71H8031
13242C20122j49113b29423B77271Q0606j68719J67250h8320C8666J44050J37958
13232C20674E8451a91491C24838A7400J44512D2870M15071J028h1730C32892A13445
13220D0199K41967H7441M16212B31047b5462D7903k0935K83881p2931c24300A45214
13208a39172b4971A33945K8272J03943a97705C11785j39914a35530A05596f5874
13197F6644a29029A89187D7039J21157a38397C96242r1068j09163b1412D8409
13186A838J87625e3745b6365B68143k7868d8244E068K88548o7792l5344C4943
$$ y = [156079, 54126, 31113, 483446, 389320, 110348, 3662, 149696, -70420, 175853, -25121, 165687, 164610, 305997, -166367, 23595, 120983, 167185, 111950, 89248, 287815, 105823, -671, 88031, 320122, 171009, -229423, 277271, 357877, 189158, 356408, -88320, 38666, 182716, 320674, 58451, -191491, 324838, 17400, 161912, 42870, 457941, 458969, -81730, 332892, 113445, 40199, 282166, 87441, 503653, 231047, -25462, 47903, 26968, 310849, 237918, -324300, 145214, -139172, -24971, 133945, 162217, 266160, -197705, 311785, 171871, -135530, 105596, -65874, 66644, -129029, 189187, 47039, 168196, -138397, 396242, 305174, 196011, -21412, 48409, 1838, 189463, -53745, -26365, 268143, 240275, -48244, 5068, 293616, 225824, 190480, 34943]
13174D3246b9341r2075B33724M9879E4350c9343P788B43816c4408A62689E658
13162e1132C73841j69179M1092j05355B9561K21353C1836J09832B3419b81212
13151a30861M8716d0880A94848J81289J0577f3921K2337B72880g7948B22649A7617
13139C77749A3037L4927F274J7439J07903k1076D4233N7087j1899L288J95242
13128B87951Q8617C2660n320M926e1126A9961J96402J255C1273a55090d8279B51241
13115A61211P3196K67010A02296L4503f9452B3427K0619b47101A8396K5970M6783
13104I1149A9282e0339C02216j8146B8675a8688A42160o1111L0310L1685e2234
13092c0175B6622J6329h6378A35853J74301j49545p9253C0777L28255H1888d3613
$$ y = [43246, -29341, -121416, 233724, 283603, 54350, -39343, -31555, 243816, -34408, 162689, 5658, -51132, 373841, 204662, 245754, 140399, 29561, 250914, 31836, 141668, 23419, -281212, -130861, -82145, -40880, 194848, 376137, 386714, -63921, -41584, 272880, -77948, 222649, 17617, 377749, 13037, 47964, 6274, 23713, 131616, 110540, 44233, 101320, 89421, 92709, 287951, 376568, 32660, 27340, 32266, -51126, 19961, 216363, 217618, 31273, -155090, -48279, 251241, 161211, 234407, 501417, 102296, 136799, -69452, 23427, 44046, -247101, 18396, 44366, 91149, 19282, -50339, 302216, 284070, 28675, -18688, 142160, 81049, 111359, 143044, -52234, -30175, 26622, 42951, -86378, 135853, 310154, 160609, 81356, 30777, 359032, 81888, -43613]
13080B72415C5610L53162G1300A5833M91A165J44736k6152l986R8847P7082C8861
13067D4718n439a15835e2956A38773i6559J4969C11844L4630o4973a41749C08313
13055a59805D11297a04250A42700J53863A0188J57857o3356b00549A58750m7604
13045A11146N5661N7497D829L12624H9224J89234A34980B6975K36519l3337d2812
13033B8899a76600A24213a50847H1481K68703D8077J20141b8498o5702G629R8579
13022A06208b3986j94736A34977j7629E2931A3678i3410a6521I4500M9718A8120
13010B95271c9484I55a14297H0950a20962B73062G8415M08119a36018B65724j2442
12999B53282K0334j22807J49423k0520j29394i2880A2959g6474B3229c17590K2328
$$ y = [272415, 35610, 388772, 71300, 15833, 16324, 1165, 145901, 119749, 115763, 214610, 291692, 38861, 44718, 39279, -115835, -52956, 138773, -96559, -81590, 311844, 346474, 281501, -141749, 308313, -159805, 411297, -104250, 142700, 296563, 10188, 168045, 104689, -200549, 158750, 111146, 166807, 224304, 4829, 317453, 89224, 278458, 134980, 26975, 263494, 230157, -42812, 28899, -176600, 124213, -150847, 81481, 350184, 48077, 168218, -28498, -94200, 7629, 106208, -23986, -218722, 134977, 117348, 52931, 13678, -93410, -16521, 94500, 144218, 18120, 295271, -39484, 955, -114297, 80950, -120962, 273062, 78415, 486534, -136018, 265724, 253282, 273616, 150809, 300232, 279712, 150318, -92880, 12959, -76474, 23229, -317590, -295262]
12988b95262B38205a34742A09515O947J5146b57732C29227I9236K04688A40564
12977B50654C437J08094K3886e8008A94164a44697C16775P1197a4653k01671B80388
12965b0595p897n3234A46084d5191A17935b4001A56280b96867h953A43124L37519
12954D80643d5321C16169a23076a4867A97660h265D2635J07836d8569q8103R025
12943a27647R046a2438B79014a32334L5866j60839C6958k184j29O5930a14750
12931a90321C8607J14453l7478c18292G8818g3008o5633K6488a1063j7554j29125
12920a57742H2760c65391A04756J9602R4420p8138A4715J95633b11585A27258
12909a98320b3228G3956b04817F6014c5697C94850j06971j37740C3436N2856a0589
$$ y = [-295262, 238205, -134742, 109515, 116462, 131608, -257732, 329227, 99236, 303924, 140564, 250654, 3437, 111531, 135417, -58008, 194164, -144697, 316775, 387972, -14653, -216324, 280388, -20595, -28492, -81726, 146084, -45191, 117935, -24001, 156280, -296867, -8953, 143124, 480643, -45321, 316169, -123076, -14867, 197660, -8265, 42635, 150471, -48569, -136672, -127647, -118601, -12438, 279014, -132334, -96468, -257307, 36958, 34774, 34645, 100575, -114750, -190321, 38607, 153060, 115582, -318292, 78818, -73008, -138641, -112153, -11063, -28617, -157742, 82760, -365391, 104756, 124358, 218778, 140640, 14715, 210348, -211585, 127258, -198320, -23228, 73956, -204817, 66014, -35697, 394850, 287879, 150139, 33436, 86292, -10589]
12897C89328E8631a3663C79936j40899a73822B31990i9269j35135g0047k88729
12887c58776F1218c1010r1741N2562H8740K2259J53486a71342A22613K58507B1827
12875b26849A40511d5427B77958a5785B90097k2707E4658L00421A03502J0477
12865A13979e9143H8522L1471j0842b37318G0618E633Q8176L7537d2769G5325
12853G9947J04610E151a2121j38004B66154A11527d5870A78354c50623A75569
12842d6796A06789K14378j16524n9983e259j14114F6732B5038h4388c0503F1624
12830B83495b46761O4555F6458O9873g8397C63942D3837P6304n2392K2868C1079
12818C41418A19092a13871C68032A920K68013A28353d09806B38348a98106F3777
$$ y = [389328, 58631, -13663, 379936, 239037, -173822, 231990, -99269, -234404, -70047, -358776, 61218, -31010, -122751, -70189, 88740, 110999, 264485, -171342, 122613, 381120, 21827, -226849, 140511, -45427, 277958, -15785, 290097, 267390, 54658, 355079, 103502, 113979, -59143, 88522, 119993, 109151, -237318, 70618, 5633, 93809, 131346, -42769, 75325, 79947, 184557, 5151, -12121, -150125, 266154, 111527, -45870, 178354, -350623, 175569, -46796, 106789, 321167, 204643, 144660, -5259, -119373, 66732, 25038, -84388, -30503, 61624, 283495, -246761, -182206, 66458, 136331, -78397, 363942, 43837, 120141, 67749, 90617, 31079, 341418, 119092, -113871, 368032, 1920, 269933, 128353, -409806, 238348, -198106, 63777]
12807a56689d2075D00960E0731c95874B682a89226K8014k9492P4683e3938D35685
12795c34093J28306A55789B3473J43742p6433c90322J79628A07303m6316B7798
12784b81487J35110B55150a9611C81562A01295d7062I0360b18671D8725a30216
12773D1460J3589a21742A32425f1034A3721a51473A21096g8710A81204e0277A62543
12761B85214j06871i0695I9742A3860M5464b74564i7338B83136E4933a46485A9222
12749c28941i8603B00280e3094F4354a86877N0407C29419A05186a06714C2655
12738A5934a12552b8374B26095a0200E813h8572D6322J45003b3059A52626b5285
12726A23216N0796M7822a13683G8349b56506D71811b02662A44933D7062Q1146
$$ y = [-156689, -42075, 400960, 50731, -395874, 2682, -189226, -161212, -190704, -116021, -53938, 435685, -334093, -205787, 155789, 23473, 167215, 90782, -390322, -210694, 107303, 60987, 27798, -281487, -146377, 255150, -19611, 381562, 101295, -47062, 90360, -218671, 48725, -130216, 41460, 55049, -121742, 132425, -61034, 13721, -151473, 121096, -78710, 181204, -50277, 162543, 285214, 178343, -90695, 99742, 13860, 59324, -274564, -97338, 283136, 54933, -146485, 19222, -328941, -98603, 200280, -53094, 64354, -186877, -136470, 329419, 105186, -106714, 32655, 15934, -112552, -28374, 226095, -10200, 5813, -88572, 46322, 191325, -23059, 152626, -25285, 123216, 174012, 221834, -113683, 78349, -256506, 471811, -202662, 144933, 47062, 128208]
12716A28208l1497b70519F5051a82660a9037j22735e8661A45550m6769A8821J1919
12705C0740A879b9680q4361q8689j02925B5111b4218B6172J31951K4699g8891
12693E2824N6689M8430D4932a24438C2427f7785B80146C2652K52581a29878a5670
12681e58398E0227j5963F159L05774a62774q9357C31079F3029k7899K9275h2638
12669d61355e909K559m4614G5776J00911O6424o3557p6926C0603d9890B39188
12657A84987R0423B5497M1414a00208E27796d6522A2018J62392O7956b5786B05008
12645A10880K07360J88902a5505B25698A02664Q3344G3011K30280m9455J03872
12635C57708A30482K23336G383c1496E6307K11817n9581c120r5069A61266J8059
$$ y = [128208, 96711, -270519, 65051, -182660, -19037, -141772, -58661, 145550, 98781, 18821, 30740, 1879, -29680, -114041, -202730, -305655, 25111, -24218, 26172, 158123, 182822, -78891, 52824, 109513, 157943, 44932, -124438, 32427, -67785, 280146, 32652, 285233, -129878, -15670, -558398, 50227, 34264, 6159, 311933, -162774, -252131, 331079, 63029, 35130, 64405, -82638, -461355, -5909, -3350, -47964, 75776, 176687, 243111, 179554, 102628, 30603, -49890, 239188, 184987, 275410, 25497, 66911, -100208, 527796, -46522, 12018, 174410, 242366, -25786, 205008, 110880, 318240, 507142, -15505, 225698, 102664, 186008, 73011, 303291, 253836, 357708, 130482, 353818, 7383, -31496, 56307, 268124, 208543, -3120, -98189, 161266, 179325]
12624A79325J72002I4929B546Q7316J74197A11997N752K59926c516B27313n6643
12613A70670l293E8468d2347j46092B51146k7288L05567h4834C62702A19452q031
12602A11421a3251j48140A70269B8163h3173B2547J81655b5706H7278i9501C7502
12590C98760A52013c8185B13469k6189a8512o3595A40797R1678i1222C23455G0041
12578C3339P8120J0955e5371A37816l6108J0472D1635K5721N5061D7230p033e8254
12565b53297A72270m7490a68320b1499B41929d04792J59806A110L32499a85854
12554a2867B8762a41986B92887H1608J34387d2810D1494a15052B29227a07001
12543A13729D187J64763i5813J7280C50745g1081a9886j48032A18505R1976a82579
$$ y = [179325, 351327, 94929, 2546, 89862, 264059, 111997, 117749, 377675, -3516, 227313, 170670, 167377, 58468, -42347, -188439, 251146, 223858, 529425, -84834, 362702, 119452, 111421, -13251, -161391, 170269, 28163, -83173, 22547, 204202, -25706, 87278, -99501, 37502, 398760, 152013, -38185, 213469, 187280, -18512, -82107, 140797, 232475, -91222, 323455, 70041, 33339, 111459, 122414, -55371, 137816, 101708, 112180, 41635, 67356, 122417, 47230, 40197, -58254, -253297, 172270, 124780, -168320, -21499, 241929, -404792, -244986, 1110, 333609, -185854, -12867, 28762, -141986, 292887, 81608, 215995, -42810, 41494, -115052, 229227, -107001, 113729, 4187, 168950, -95813, -78533, 350745, -71081, -19886, -167918, 118505, 210481, -182579]
12531B00659o5287m3458M3824a67933B92613A8515J03672K29617C588O3794J51344
12520B18726B4700d05435a23993r4989e1806B11168G7468Q877b35q794m0263B7685
12507A43428a14354q0732A48718D7612a9644D44652h2120o4082C680b0995l17200
12496c38195a29592o038b3892j35162C05475O4041j76908H5587b0515E6447L34343
12485C90790Q8442a16246d9811A5379R3396a18263m9999K6833N0375F8980a5674
12473B10921g8722J1947j66104D1823g1420k01696R7601k33673a30291A13498
12462C89562j38105c8429F8950R7787b09077H6266g6488G5741c11255a14933F7545
12450A31158e2452A18018J1147a28965E0278j0006J21598a9735k06519j89897
$$ y = [200659, 135372, 91914, 135738, -167933, 292613, 18515, 122187, 351804, 3588, 67382, 218726, 24700, -405435, -123993, -218982, -51806, 211168, 77468, 86345, -235, -9029, -49292, 27685, 143428, -114354, -195086, 148718, 47612, -19644, 444652, -82120, -146202, 3680, -20995, -338195, -129592, -135630, -23892, -159054, 305475, 369516, 192608, 85587, -20515, 56447, 390790, 479232, -116246, -49811, 15379, 108775, -118263, -168262, -141429, -91054, 68980, -15674, 210921, -78722, -66775, -232879, 41823, -71420, -273116, -175515, -409188, -130291, 113498, 389562, 251457, -38429, 68950, 166737, -209077, 86266, -76488, 75741, -311255, -114933, 67545, 131158, -52452, 118018, 129165, -128965, 50278, 40272, 161870, -19735, -226254, -416151]
12440d16151h00A21341A3714a52450j89561E9599K30669e2744B08810a51426c838
12428a80131l8586L3190j40782C24632a11404H1036k9141j2388a68042b6433A45575
12416g7859E1457K4183a6293A30975n5190a52582A0342a33604D0615K08546b22853
12404A17939A4559R9089a53443L0072k34668Q8562C4200a41480l54541c9787B76854
12392C27646a08258C3020J43285J57830a31973B19236L9036H0659O4463a68053
12381A31690c6557k18761d2588j21300l2207c808C77547d4117B51692a27879n4040
12370a81919n2288N3848a5933k27667b2293E240a23895F8569a94969A52870a55493
12358d0137j06206B43475i3362B0120I556O8519A5620a42799j81527B56362g104
$$ y = [-416151, -800, 121341, 13714, -152450, -342011, 59599, 290268, -52744, 208810, -151426, -3838, -180131, -218717, -185527, -326309, 324632, -111404, 81036, 51895, 39507, -168042, -26433, 145575, -77859, 51457, 75640, -16293, 130975, 75785, -152582, 10342, -133604, 40615, 249161, -222853, 117939, 14559, 113648, -153443, -123371, -358039, -269477, 34200, -141480, -496021, -39787, 276854, 327646, -108258, 33020, 176305, 334135, -131973, 219236, 258272, 80659, 145122, -168053, 131690, -36557, -255318, -42588, -163888, -196095, -3808, 377547, -44117, 251692, -127879, -181919, -234207, -180359, -15933, -243600, -22293, 5240, -123895, 68569, -194969, 152870, -155493, -40137, -146343, 243475, -93362, 20120, 9556, 78075, 15620, -142799, -324326, 256362, -7104]
12346g295B53154M6777D7978c33812p5951a87265B05726J33426b07673O5852A4009
12334A32641N2310a06902o9506K7281O8112B83316c58181C5420J93766m8482J41841
12323C22545o0891G6254J76646b4171B40461o6952m6958b19147A38338b78489
12312H5916a31855A482K08117B6668a58561P4945K6047H1359a36920A273i1973
12300b7779e826j4709A83459c8197j37027O1249a8035B78008a49436M1272a4044
12288C46975d2382B2622a86150F5151b09497b8360n0030q0398B46699b4234j4603
12277c8837o064J7673K051A23306a53490B8315d14989e1907b5269D9219b1079
12265A04104J2035J4658L3099D87L34272j23461M8197N01K42430I8875a65960
$$ y = [-7295, 253154, 299931, 47978, -333812, -409763, -187265, 205726, 339152, -207673, -141821, 14009, 132641, 184951, -106902, -176408, -149127, -81015, 283316, -358181, 35420, 229186, 180704, 322545, 261654, 76254, 252900, -24171, 240461, 173509, 126551, -219147, 138338, -278489, 85916, -131855, 1482, 209599, 26668, -158561, -83616, -57569, 81359, -136920, 1273, -91973, -27779, -5826, -20535, 183459, -38197, -175224, -113975, -18035, 278008, -149436, -108164, -14044, 346975, -42382, 22622, -186150, 65151, -209497, -28360, -78390, -158788, 246699, -24234, -38837, -44901, -27228, -25177, 123306, -153490, 28315, -414989, -51907, -25269, 49219, -21079, 104104, 116139, 130797, 163896, 487, 334759, 211298, 259495, 259996, 502426, 98875, -165960]
12253c44522A58994j0121C3802M0470a68830B5668K14069q8753e6051A11918a20748
12241C11142j24749G4058J91551p9693a08388K2738D1300M3905h0146A21403a57228
12229E9385J49905M4023o0602a06436D15728j05993K24646i7627H2036O9284J75892
12218C27212b21507B55505J5970J76821j26069C9445Q8553O3160M9066L0760j07543
12207A63441D9142a07610D94881B19982H0308R947P6720a58916a5497B77445F9253
12195E27796A99399J76566q0027f6938o4554A21163J52023H3004J11700J25221
12185C19925N3511A02232P8461A7734K27032C9054M61266A5553c9706I5679k9303
12174F6376J21864l9515b5614r992A52512q683a79565C96580A04632J14199k9880
$$ y = [-344522, 158994, 148873, 33802, 74272, -168830, 25668, 239737, 150984, -56051, 111918, -120748, 311142, 186393, 74058, 265609, 185916, -108388, -85650, 41300, 85205, -80146, 121403, -157228, 59385, 209290, 253313, 192711, -106436, 415728, 309735, 534381, -97627, 82036, 151320, 327212, -221507, 255505, 271475, 448296, 322227, 39445, 127998, 191158, 240224, 270984, 163441, 49142, -107610, 494881, 219982, 80308, 90255, 166975, -158916, -15497, 277445, 69253, 527796, 199399, 375965, 295938, -66938, -131492, 121163, 273186, 83004, 194704, 319925, 373436, 102232, 180693, 17734, 244766, 39054, 500320, 15553, -39706, 95679, 66376, 188240, 148725, -25614, -35606, 152512, 143829, -179565, 396580, 104632, 218831, 188951]
12163A88951a83919c41B65373J48905a02299D8634d17533B23285Q59n1914i8050
12151B04486i5686A20282a91461J133B28835A6714M1576L9322P6998K4853l925
12140A95538a46253D004b1740A12677e6863p0312H4421f6967b9325o7960B09199
12128C57790a96049D9358R0666A5684a01098D1961b262r7368C25674J09171A4998
12116a42913e0557q9021M1641D4130a16901j1887r6377O2022A68755o9120b80361
12104C9633Q4317J36777K33854G0294k5428J04836e1886B58829a77415l4898e2286
12092b7307A84950a56108A6158a50947F0738K494P3947a02704C56931e2414r5476
12081a47890A4584b04589l4280p7859F9848J36455g4361A64213J95586a9667n7756
$$ y = [188951, -183919, -341, 265373, 414278, -102299, 48634, -417533, 223285, 224144, 172230, -98050, 204486, -95686, 120282, -191461, -190328, 228835, 16714, 58290, 97612, 174610, 199463, 195538, -146253, 4004, -21740, 112677, -56863, -127175, 84421, -66967, -29325, -97285, 209199, 357790, -196049, 49358, 140024, 15684, -101098, 41961, -2262, -99630, 325674, 434845, 14998, -142913, -50557, -139578, -97937, 44130, -116901, -128788, -225165, -163143, 168755, 99635, -280361, 39633, 123950, 260727, 494581, 70294, 44866, 149702, -51886, 258829, -177415, -212313, -52286, -27307, 184950, -156108, 16158, -150947, 60738, 63232, 137179, -102704, 356931, -52414, -147890, 14584, -204589, -238869, -316728, 69848, 206303, -74361, 164213, 359799, -19667, -77423]
12070g7423A45908b10068G5103b0437H0753l4697d4489J6439B18723M86550L55436
12059A060709K58276E92619a1868A55171i358E1722b46199e9020G914d4466F3062
12047b53028a23516l22009g637k36497O4201b4085A08682a99296O0344r2439A74621
12035a41275d3095j66789B14696F7767O7720b27140d6226G8774A25K94826E6825
12023C528d07656d2232k4786k14457B8516K84508a4277C72287a42278f2725A88882
12011h0997C32362c26324H0750J03660l9158o9402R6254b27142J12903B519i1451
11999b0345q9147D38694d1870q34b0309m434A89514a47626d4544k02657G3210
11987a98477b5606A25749b4774j65709D5816g0004B2500J48893A9984P4951b75213
$$ y = [-77423, 145908, -210068, 75103, -20437, 80753, 46056, -44489, -28050, 218723, 705273, 1060709, 1318985, 592619, -11868, 155171, -9358, 51722, -246199, -59020, 7914, -44466, 63062, -253028, -123516, -445525, -7637, -244134, -179933, -24085, 108682, -199296, -138952, -231391, 174621, -141275, -43095, -209884, 214696, 67767, 135487, -227140, -46226, 78774, 125, 294951, 56825, 3528, -407656, -42232, -67018, -281475, 28516, 313024, -14277, 372287, -142278, -62725, 188882, -80997, 332362, -326324, 80750, 184410, 145252, 75850, 172104, -227142, -114239, 2519, -91451, -20345, -109492, 438694, -41870, -42704, -20309, -24743, 189514, -147626, -44544, -247201, 73210, -198477, -25606, 125749, -24774, -190483, 45816, -70004, 22500, 171393, 19984, 94935, -275213]
11975E59711B11269h086G5837M4670c70670A46762C8244J18876h2752J7217o2267
11964a27802I4368C5667M45854j89137j08950g9587k77493d2085B90581j30150
11954A60431a23131I5649a19948N5990j89052O4857B11054m7472B0647g1304J7162
11943e4142M181j98798C6358a8115k2788I7660b31547I2980m0506b1714k52224
11932b73938I7903a67364B8680a78751h1040f740A23076i0212A40744i3606a8688
11920a82044d4740A95750F8527a81394A20960n1283K889d27547J88957f8644K9243
11909c9401C8901J66728b3039G554f7321A1228b58745O3464c5857A55360f9434
11897a18600C2992J34269b78984A74722b95775A42410C79f5801a5571j75479C37081
$$ y = [559711, 211269, -8086, 75837, 120507, -370670, 146762, 38244, 157120, -82752, -65535, -127802, 94368, 35667, 481521, 292384, 183434, -79587, -357080, -42085, 290581, 160431, -123131, 95649, -119948, -63958, -253010, -188153, 211054, 163582, 20647, -71304, -54142, -49961, -248759, 36358, -18115, -40903, 97660, -231547, 92980, 52474, -21714, -273938, 97903, -167364, 28680, -178751, -81040, -6740, 123076, -90212, 140744, -93606, -18688, -182044, -44740, 195750, 68527, -181394, 120960, 69677, 72566, -427547, -238590, -68644, -39401, 38901, 205629, -23039, 7554, -67321, 11228, -258745, -195281, -35857, 155360, -69434, -118600, 32992, 167261, -278984, 174722, -295775, 142410, 379, -65801, -15571, -191050, 337081]
11885A7149a13143q7582J7323M2640L329a6057q4388C7175J05727l5679f2551
11873A67200J17831H9128c64609A15523J02634r6929c01942j25952C52592c2780
11862C9863N4381m1383j5446B880h5697j31281m9886a18704k4645A71447B5747
11850b32958A29089J77432C3287M11278a0894k60140b5758B10479a07682q7402
11840a95084O997O0942K4628B77678A5741L8057b32035J09568j67195J27191G9181
11828e1746D31543B0944M67954H6967M3603b6161n391B5470Q426a77824G3486
11816A06280d0397D951J58793p8439J93653n8325g0842C1820h3906A3507c2708
11804a23054b7930a1249A2621K58666e6040k06544L7745C61560b50732J09212
$$ y = [17149, -113143, -200725, -183402, -140762, -137433, -16057, -100445, 37175, 142902, 107223, -62551, 167200, 285031, 89128, -364609, 115523, 218157, 121228, -301942, -427894, 352592, -32780, 39863, 94244, 52861, 37415, 2880, -85697, -216978, -266864, -118704, -143349, 171447, 25747, -232958, 129089, 306521, 33287, 444565, -10894, -271034, -25758, 210479, -107682, -195084, -188087, -127145, -102517, 277678, 15741, 53798, -232035, -122467, -289662, -162471, 79181, -51746, 431543, 20944, 488898, 86967, 130570, -26161, -31552, 25470, 33896, -177824, 73486, 106280, -40397, 4951, 163744, 85305, 278958, 220633, -70842, 31820, -83906, 13507, -32708, -123054, -27930, -11249, 12621, 271287, -56040, -262584, -224839, 361560, -250732, -141520]
11794a41520O8244A16258J6605e0980l3803b9882j29084F8166b42215i5941k15569
11783c11510M9358B13737H6752j0125c88045J59404J2235k19734A53768B3292
11772A37414n5792J34161a68487O8133n033l24077J72026A31902o0919f6566C48
11760A0114b08419A31194a8791k42757C80549b45360H2360j077J19897c06508
11749c2275o1697q4558C1479K39164C6404M4002M2445a28346N3788A77628c43038
11737E1418J14137a04490j46535B27916C8445L7037b9806D8702a99354Q3156k07002
11726c23200D7244a79472B27062Q8057A29057N2507a39460i688A3615c5405E4658
11714b52820A58080c0536r220a7887j05137B1736f3048F4044P3901R4821f1270
$$ y = [-141520, -73276, 116258, 132863, -50980, -84783, -29882, -158966, 68166, -242215, -95941, -311510, -262152, 213737, 86752, 76627, -388045, -228641, -216406, -436140, 153768, 23292, 137414, 81622, 215783, -168487, -100354, -105387, -429464, -257438, 131902, 70983, -66566, 348, 10114, -208419, 131194, -18791, -261548, 380549, -245360, 82360, 81283, 201180, -306508, -32275, -93972, -178530, 31479, 270643, 36404, 80406, 122851, -128346, -74558, 177628, -343038, 51418, 165555, -104490, -251025, 227916, 38445, 75482, -29806, 48702, -199354, -116198, -323200, 47244, -179472, 227062, 315119, 129057, 181564, -139460, -9688, 13615, -35405, 54658, -252820, 158080, -30536, -39756, -17887, -123024, 21736, -63048, 64044, 137945, 232766, -61270]
11702I4753O6861P452b4038F8840L40128a00007j28158B57525b03867e4997j04636
11691a59633a5863C8621N5817g946o2740A07399a0507B25194C5961d26665E4230
11679b20602O3909A53792Q0027c6273b991B68769A2583O9218L9144a46283A42938
11667a4210p9203I3136e1348f825A31115Q7095I7666b1935l14419A0031c50487
11655i6095k4257l64C8409J59578n4345G0975a2081N481A40877J18815e7252k9178
11643h6430B02973J8112b97142B9118M3285a2520A50696c6818q7515N4733A44306
11631e1236j76798H7853N7857L33405b11045f1902k66672M9041A471P1566J1429
11620H4466N1449a37751A16112a14770h902C50359g7798C28477n371a34836O2031
$$ y = [94753, 161614, 169066, -24038, 68840, 408968, -100007, -228165, 257525, -203867, -54997, -159633, -15863, 38621, 94438, -7946, -70686, 107399, -10507, 225194, 35961, -426665, 54230, -220602, -156693, 153792, 233819, -36273, -2991, 268769, 12583, 81801, 120945, -146283, 142938, -14210, -93413, 93136, -51348, -6825, 131115, 218210, 97666, -21935, -336354, 10031, -350487, -96095, -120352, -120716, 38409, 197987, 143642, 70975, -12081, -6600, 140877, 259692, -57252, -86430, 202973, 221085, -297142, 29118, 72403, -12520, 150696, -36818, -124333, -69600, 144306, -51236, -228034, 87853, 145710, 479115, -211045, -61902, -328574, -279533, 1471, 73037, 84466, 135915, -137751, 116112, -114770, -8902, 350359, -77798, 328477, 323106, -134836, -72805]
11609g2805l2631L5888l4567g269A9273e9826B73423c8079B04589a8867A76420
11597g6113j85220A43648E1458c24660C67225A70055B41O0355L4514A4143N0353
11586F4496Q1826Q0489d0309o6131d5830A59361a52077e2460D05818b8381j54885
11575a83266j26445A0058f4007p6675B9216b89413a38115A2122L17627i1664H9194
11563a11801A9214g8153D1588a45025K9450E9477O4941a66235B2252a18208A67391
11551F288N2125c1102m5583j05813P2434G2727E916K84697a883I2915K3524C7229
11538I9847K0513E1045r812a06441L7868o867B1299a31563B19570k5144o6924
11527A27502a28156M6673C18832h8539L5622j52297A56459E459M2273J36450K38731
$$ y = [-72805, -105436, -69548, -104115, -7269, 19273, -59826, 273423, -38079, 204589, -18867, 176420, -76113, -261333, 143648, 51458, -324660, 367225, 170055, 241, 60596, 95110, 14143, 64496, 146322, 226811, -40309, -106440, -45830, 159361, -152077, -52460, 405818, -28381, -183266, -309711, 10058, -64007, -140682, 29216, -289413, -138115, 12122, 329749, -91664, 89194, -111801, 19214, -78153, 41588, -145025, -115575, 59477, 124418, -166235, 22252, -118208, 167391, 6288, 58413, -31102, -76685, -182498, -110064, 72727, 5916, 290613, -1883, 92915, 116439, 37229, 99847, 120360, 51045, 41233, -106441, -68573, -75440, 21299, -131563, 219570, 194426, 127502, -128156, -81483, 318832, -88539, -52917, -205214, 156459, 5459, 47732, 184182, 422913]
11516D22913j18810h0609A45754J2256d1034c793j20186G923J79584b00210F8842
11504A04366d1131J0396E03291B370a65457A79850C2272N9947a0278D6255L1515
11493G7770j1673L04511D6221K34558j37704b24560P3304B18864K5981b420I883
11481a36768A03800g7999B4949e4264C89561C9352J87036J00778d2617O441B39943
11469B28945j06756J8772E1887a32298l9719A90342G4317L6870K10967o4624a93037
11457C37174g6571J3906H8578l7195O5502b4046C09151c573H3896a36391g294
11445A88067a82956h2592E165J59641K2510K30235n0344n9846a10819A52326N0272
11434B02598B5556m878f6968j01866A66703a62377f9372A87053R0648j18603J56551
$$ y = [422913, 304103, -80609, 145754, 158010, -41034, -3793, -123979, 7923, 187507, -200210, 68842, 104366, -41131, -30735, 503291, 2370, -165457, 179850, 32272, 92219, -10278, 46255, 77770, 66097, 370608, 46221, 280779, 143075, -224560, -151256, 218864, 244845, -2420, 9883, -136768, 103800, -77999, 24949, -54264, 389561, 39352, 226388, 327166, -42617, -36176, 239943, 228945, 122189, 140961, 51887, -132298, -172017, 190342, 74317, 111187, 322154, 257530, -193037, 337174, -76571, -62665, 88578, 51383, 116885, -24046, 309151, -3573, 83896, -136391, -7294, 188067, -182956, -82592, 5165, 164806, 187316, 417551, 367207, 307361, -110819, 152326, 202598, 25556, 20678, -66968, -168834, 166703, -162377, -69372, 187053, 277701, 159098, 315649]
11423C15649f0386l2396q5892C5400J60137J5105E6188e9647J5883B22105K57107
11412D79212A33887J1797L5644g3667F6929J61256i8614B58463a51310c7491Q945
11401b8546k9703j77204K2506R5299E3074K1280P1754D4444h9195D77107a79375
11389b59672e0728p0796A03688c39142C7430a79687A62529h3007H9513e7429A5556
11377a46345j60787J18414R4238L4849C53880A63155k891j8757b497C2058b86628
11365c6137A3754J49588e9490m3413D9878O0571B0661J17006A4577d3628A28253
11353f7846a5530q387j50640a648C89244a34879O3306j68345C483d76675a49669
11341a70024k5404A686a53739L394A16074b39776b5868k31556c6166C65229h9253
$$ y = [315649, -60386, -92782, -178674, 35400, 195537, 210642, 56188, -59647, -43764, 222105, 479212, 133887, 145684, 181328, -73667, 66929, 228185, -98614, 258463, -151310, -37491, -28546, -58249, -235453, -212947, -117648, 53074, 74354, 146108, 44444, -89195, 477107, -179375, -259672, -50728, -121524, 103688, -339142, 37430, -179687, 162529, -83007, 89513, -57429, 15556, -146345, -307132, -188718, -94480, -59631, 353880, 163155, 160264, 141507, -2497, 32058, -286628, -36137, 13754, 163342, -59490, -102903, 49878, 110449, 20661, 137667, 14577, -43628, 128253, -67846, -15530, -23917, -174557, -1648, 389244, -134879, -71573, -239918, 3483, -476675, -149669, -170024, -195428, 1686, -153739, -150345, 116074, -239776, -25868, -257424, -36166, 365229, -89253]
11329i8708l06476A30047C2839b94847B34824a04591m6815L2602C4979K8386a56955
11317e4797K0522C5872J45594a61448b6369q5416K8093k3638B92022a70663J221
11306a69442A04369b52323B8638J29482i7450G2961O0011Q4718F6008L5887f4794
11294a76525E6963J22390J56844A18451a76157A07638b88748f5089C19567H1799
11283h1121A36781N703i7599j50547g1323I9245K87994j35794d01032k19991A16359
11271f8962A25767C1922J99310e32457B20824a38216i799B36726d4936d944B32467
11259a90209A20998D6062J37244c02746A5626i1162d1780I9944J4606D4288a537
11247b5242B77134M4348G117c75545E8249j5985O8909B6801p952R4943Q9338a58727
$$ y = [-98708, -405184, 130047, 32839, -294847, 234824, -104591, -151406, -118804, 34979, 63365, -156955, -54797, -34275, 35872, 181466, -161448, -26369, -111785, -83692, -107330, 292022, -170663, -169442, 104369, -252323, 28638, 158120, -97450, 72961, 132972, 217690, 66008, 101895, -64794, -176525, 56963, 179353, 336197, 118451, -176157, 107638, -288748, -65089, 319567, 81799, -81121, 136781, 142484, -97599, -248146, -71323, 99245, 387239, 251445, -401032, -621023, 116359, -68962, 125767, 31922, 231232, -532457, 220824, -138216, -9799, 236726, -44936, -4944, 232467, -190209, 120998, 46062, 183306, -302746, 15626, -91162, -41780, 99944, 114550, 44288, -1537, -25242, 277134, 321482, 7117, -375545, 58249, 42264, 111173, 26801, 18849, 113792, 203130, -158727]
11234A49049n0919D121L1913j6926g9915j6990J7552I6643B6122J74740i4866
11222c38105a20143E2762a79966C0597a25630B65026j18000a16273k59660B83149
11211F1744J15312a41513D4832K690e4326J7813A77559e30734b10491A33462a69686
11199d6155K0738k50111A79447a91995Q9178o8910A91113h2376a7642A00127C5365
11187A75383a85878K7945e8807q2721A55817C2205b88620A26985a70044P50e7491
11175f7728k74852A46202J58497e6526j0904J644A05915K1551h9315j11816G9677
11163a660A81160L0327c38401g8951m4545A05279J35440c2882j38341f2787A68296
11151D7974A0910L457b00044e3222I5506b7503F962J13114m4424l4600a72814
$$ y = [149049, 98130, 4121, 36034, 19108, -79915, -96905, -79353, 96643, 26122, 200862, -94866, -338105, -120143, 52762, -179966, 30597, -125630, 265026, 147026, -116273, -375933, 283149, 61744, 177056, -141513, 44832, 47522, -54326, -36513, 177559, -530734, -210491, 133462, -169686, -46155, -25417, -275528, 179447, -191995, -102817, -171727, 191113, -82376, -17642, 100127, 35365, 175383, -185878, -157933, -58807, -141528, 155817, 32205, -288620, 126985, -170044, -169294, -57491, -67728, -342580, 146202, 304699, -56526, -67430, -65786, 105915, 127466, -89315, -201131, 79677, -1660, 181160, 211487, -338401, -78951, -123496, 105279, 240719, -32882, -171223, -62787, 168296, 47974, 10910, 14367, -200044, -53222, 95506, -27503, 6962, 120076, 75652, 41052, -172814]
11139i3631E7988a28419n7507N4063d9897m76684a26994q4901B70240b56596a08358
11127c63044K6493A44574B2043N10768H860b07825N3113j74925I8999a04414b4492
11115A57672l9439a53468A70856G7740J25957F4161a2158A66117J87280a65180
11104A53745Q3903a9562k72077A18079J77869C0800a63080B85467A09888L04153
11094D14041A46742J76720o5507B3380K00855J58858b89226A69968J53629b5302
11083a6035H2903l226c11217A28320J9924J35242I3170J97703b2329J0931A18400
11071B55738I6006J15202q4608J47558F3425K91154j44937L6018a21930B17986
11060B59920o292K03763h5321C76033j68683K7672E3110J84428P1209J10426J85159
$$ y = [-93631, 57988, -128419, -185926, -131863, -49897, -526581, -126994, -211895, 270240, -256596, -108358, -363044, -336551, 144574, 22043, 532811, 8860, -207825, -154712, -329637, 98999, -104414, -24492, 157672, 118233, -153468, 170856, 77740, 203697, 64161, -12158, 166117, 353397, -165180, 153745, 237648, -19562, -291639, 118079, 295948, 30800, -163080, 285467, 109888, 414041, 146742, 323462, 257955, 23380, 224235, 383093, -289226, 169968, 323597, -25302, -16035, 82903, 79677, -311217, 128320, 148244, 283486, 93170, 290873, -22329, -11398, 118400, 255738, 96006, 211208, 126600, 274158, 63425, 354579, 209642, 245660, -121930, 217986, 259920, 253628, 457391, -85321, 376033, 207350, 235022, 53110, 237538, 308747, 419173, 604332]
11049F04332B84358m3964K71762B43086K28816H3125M52687K99430k35124L23361
11039I23479l4535D20642Q0112M75210J2511m77895j34238p834M79025M4892O2334
11028I54759j27484l55411L36547k110p3752o8391L79545l63754j6442L1892J33868
11017H29267j8322k69644M4483N7836r6654M74712k11296l28635L46842j17418
11007G11171L40171m27700K2852J50201k41137L18661k00802j96779P3387M91109
10997A041134m23944J4745P7946k98355j739K96536o9330C10073L24457j55420
10987D79110J05937R0209k41562L55804l9294N9562j78284J45277m4138k42575
10977D90046J90373M1093O4587m8629J44925k79947M80159l09850m1392O69005
$$ y = [604332, 284358, 240394, 512156, 243086, 471902, 83125, 535812, 835242, 600118, 923479, 888944, 420642, 500754, 975964, 988475, 510580, 376342, 368508, 847533, 892425, 954759, 827275, 471864, 808411, 806301, 732549, 664158, 1043703, 679949, 663507, 695399, 829267, 810945, 541301, 585784, 643620, 546966, 1021678, 810382, 481747, 828589, 711171, 1051342, 623642, 646494, 796695, 555558, 874219, 673417, 476638, 550025, 1041134, 617190, 631935, 709881, 411526, 409787, 706323, 636993, 310073, 634530, 479110, 585047, 675256, 433694, 789498, 750204, 809766, 631482, 776759, 732621, 490046, 680419, 721512, 786099, 737470, 882395, 602448, 1082607, 772757, 731365, 1400370]
10967A400370l73155J15196l8844O3361L73283l18317M40732r2022O68302J09811
10957B348717j02749Q25594j76851m80065K98353l07594j3384n43346M604j52120
10947A701159p7813m13313J82422J89677p6432n9290J65968m64062L17112N9576
10937A525004m70804M4914j77689j17237J18431B64486P73566n14840j03351N5867
10927D75728j21737E8624L52478k04561r4219N0224L8535j5249J17170j22335
10917A80667E8520B5329L08336q4652d13859n2943E36934A27820i8128p8643P8608
10906i8163m888A2420J03807h2221r378E8141J12810b8632D2777J17860A994b8988
10893I6991o959f774j25788A06510a94396C06994G9901K6525Q967I681f66283
$$ y = [1400370, 1027215, 1142411, 1103567, 1166928, 1540211, 1221894, 1662626, 1570604, 2238906, 2348717, 2245968, 3071562, 2894711, 2414646, 2712999, 2405405, 2392021, 1848675, 1853279, 1701159, 1623346, 1210033, 1392455, 1582132, 1505700, 1446410, 1612378, 1148316, 1465428, 1525004, 1054200, 1099114, 921425, 804188, 922619, 264486, 1038052, 523212, 419861, 475728, 353991, 58624, 411102, 206541, 112322, 162546, 201081, 185832, 303002, 180667, 58520, 25329, 333665, 249013, -413859, -466802, 536934, 127820, -98128, -176771, -98163, -103051, 12420, 116227, -82221, -91599, 58141, 170951, -28632, 42777, 160637, 1994, -28988, 96991, 90032, -6774, -132562, 106510, -194396, 306994, 79901, 106426, 115393, 9681, -666283]
10881I3895b48989d4913A73875B3757A870a31598B61392q4059M5040E0639f0808
10869a86786A98820e9063D1152a13929B91583j28286e6560r9043A8981i3968A46389
10857a96580F3885K08158C9331M6272b68622P3269B87153b24228D0406a85252
10846i0281A87438J11154I0058c4234l2752A69523a86151n3832a5888A2007L05471
10835C17478e35189A12388N49A0521b22930A30212g8500A27720c14478A65918
10824a13491q2580h5730j26156C29777H2308c17663a3575k089A03932K6750n2382
10813G8300a57638B08539b15089B60836H6872D1640b9255k03298h2682A01029
10802b4342k30962D4175a22174C20452a1384A17904h4367A1759i7094a5019r690
$$ y = [93895, -248989, -44913, 173875, 23757, 1870, -131598, 261392, 177333, 222373, 50639, -60808, -186786, 198820, -59063, 41152, -113929, 291583, 163297, -56560, -155603, 18981, -93968, 146389, -196580, 63885, 272043, 39331, 85603, -268622, -195353, 287153, -224228, 40406, -185252, -90281, 187438, 298592, 90058, -34234, -66986, 169523, -186151, -239983, -15888, 12007, 317478, -535189, 112388, 112937, 10521, -222930, 130212, -78500, 127720, -314478, 165918, -113491, -196071, -85730, -211886, 329777, 82308, -317663, -13575, -15664, 103932, 130682, 78300, -157638, 208539, -215089, 260836, 86872, 41640, -29255, -232553, -82682, 101029, -24342, -255304, 44175, -122174, 320452, -11384, 117904, -84367, 11759, -97094, -15019, -24709]
10791b4709H794d3194j5736a1559H9428b45249k722J17382m4476B5425a0314G512
10778b61823B23189d18716C42509c86889A26480O0971a80203B26614B7289O6065
10768I3354a8508j5667I7218J37260c9587A16860l2969a65378m3019J02738A1793
10756a19149L8434c6798m9006k6193D871g4033F0712d2337C24380n8627g6406
10744f3908o5338M7852A88229G2859i6662k14242l3178Q9775A55282b78434A393
10732F2005O7858c1153J1797J203o2028k46496K1581f6259j2974j89684F587a57333
10719a22673p4552f2789L0078j66880A06432b04091e1831j62589b9960B24496
10708b31183a03986k8879j515e328o6749E891a24892A17489D5585i8193A24432
$$ y = [-24709, 8794, -43194, -58930, -11559, 89428, -245249, -247971, -130589, -175065, 25425, -10314, 7512, -261823, 223189, -418716, 342509, -386889, 126480, 187451, -180203, 226614, 27289, 93354, -18508, -34175, 97218, 234478, -39587, 116860, 83891, -165378, -208397, -105659, 11793, -119149, -80715, -36798, -85804, -111997, 4871, -74033, 60712, -42337, 324380, 265753, -76406, -63908, -129246, -81394, 188229, 72859, -96662, -310904, -344082, -254307, 155282, -278434, 1393, 62005, 129863, -31153, -19356, -18153, -80181, -326677, -305096, -66259, -79233, -268917, 6587, -157333, -122673, -197225, -62789, -32711, -199591, 106432, -204091, -51831, -214420, -29960, 224496, -231183, -103986, -132865, -134380, -5328, -72077, 5891, -124892, 117489, 45585, -98193, 124432]
10696a05849H5713b0796j93478k11212D0800b1696B9063K084J30973a01043A15525
10684a61289M187A18174a80743I8200q805g0406A4679J50983a58114n6927q7375
10673c02416R5042L0444j48845D1410a56297j09638A34473n8190a1783j10017
10663a21800D2476f2749k06207J28860A57142a14019a1681j47305n0586f582j52015
10652a58597F2909g5224L4633l2176C13255e2413o1436L866d8099j51622A77159
10640b11653o7410A22942l1052i7487m2394C19426m9166e87459B26747b58536
10629A80490b13404F1329k2484N3624a70247B58266A26381K2536a8121E6940d6833
10617c3095l7060j72488K7849A48493C3382K9449a22702j94066K5485c2332l40786
$$ y = [-105849, 85713, -20796, -214274, -425486, 40800, -21696, 29063, 31147, 162120, -101043, 115525, -161289, -157102, 118174, -180743, 98200, 89395, -70406, 14679, 165662, -158114, -215041, -302416, -207374, -176930, -325775, 41410, -156297, -265935, 134473, 76283, -11783, -121800, 42476, -62749, -268956, -140096, 157142, -114019, -11681, -158986, -209572, -6582, -158597, 62909, -75224, -40591, -72767, 313255, -52413, -113849, -109983, -48099, -199721, 177159, -211653, -279063, 122942, 91890, -97487, -139881, 319426, 270260, -587459, 226747, -258536, 180490, -213404, 61329, 38845, 92469, -170247, 258266, 126381, 148917, -18121, 56940, -46833, -33095, -70155, -242643, -214794, 148493, 33382, 62831, -122702, -316768, -291283, -32332, -373118]
10606c73118K7403J30041d2671j32675J3053D20577G8291J21119a83114N2686
10596a30428C97985f8523A27534A6293a79084C4037O6246c05012A05417l6208
10586F9209J45549c53881P5618I8058b02112J5342B38610J9034b81758a31426
10575b375m26807E2736B39J96032a08261c6364I5596J4511l9530A6013L7874J82087
10563B35974a67803A807L5431d29843A11939m0578b51264a07920J5222C91631
10552A86344b29673i7287b6332j06229D5633r750d855k06167B72401G9710J86747
10541B66457J13596a53133B79023F9938b85585E0607K23294b18033A24589b96208
10530a46256k0819P5629p2658f9276L2086C0878a5147j43188d964j6270A18491
$$ y = [-373118, -345715, -215674, -42671, -175346, -162293, 420577, 78291, 199410, -183114, -130428, 397985, -68523, 127534, 16293, -179084, 34037, 100283, -305012, 105417, 69209, 214758, -353881, -278263, 98058, -202112, -186770, 238610, 257644, -281758, -131426, -2375, -429182, 52736, 239, 196271, -108261, -36364, 95596, 110107, 70577, 16013, 53887, 235974, -167803, 1807, 37238, -429843, 111939, 71361, -251264, -107920, -92698, 391631, 186344, -229673, -97287, -26332, -132561, 45633, 35883, -4855, -211022, 272401, 79710, 266457, 380053, -153133, 279023, 69938, -285585, 50607, 273901, -218033, 124589, -296208, -146256, -167075, -91446, -164104, -69276, -37190, 30878, -15147, -158335, -4964, -21234, 118491]
10518B66325b56717q8977A44910a12796A23313K210j4250a31360H557a67438l4211
10507b01649e5952H5265Q1065h7474n9397j80916a39206F4627a13899A74715E0068
10495b00278A5800i3354A96612f1916Q145H3553b06138A95839f1973C5334j3878
10484B1456R806d36767B81225e5095E8425b79936A27146a5777m13568a42130A90728
10472a86247l523A25897F1254c16268G0885l1604J83064P042a72032l7476B24303
10460C29270B5030K5268L3185Q8202F9835R2584a25151N4003j88465l3398d7820
10448c17426H6299b41278O5224f0719A22605f2612l31945A22615C7201b05446
10437H0907a60072A01419c61915B13029c2813j5102n3345o2277a9763j58113B5685
$$ y = [266325, -256717, -345694, 144910, -112796, 123313, 125523, 111273, -131360, 8557, -167438, -201649, -55952, 85265, 166330, -87474, -146871, -327787, -139206, 64627, -113899, 174715, 50068, -200278, 15800, -93354, 196612, -61916, -53771, 83553, -206138, 195839, -61973, 35334, 21456, 31262, -436767, 281225, -55095, 58425, -279936, 127146, -15777, -429345, -142130, 190728, -186247, -189770, 125897, 61254, -316268, 70885, 39281, 222345, 229387, -172032, -209508, 224303, 329270, 25030, 50298, 83483, 171685, 69835, 162419, -125151, -71148, -259613, -293011, -47820, -317426, 86299, -241278, -176054, -60719, 122605, -62612, -394557, 122615, 37201, -205446, 80907, -160072, 101419, -361915, 213029, -32813, -47915, -101260, -163537, -19763, -177876, 25685]
10425A16125i0175B81434a83793a6363j66024j5131A88279a96704N0734e6488
10414h7611l2669G9792R915a03677n5084O125A98106r3371b59459a7119b652j16639
10402a19291j52818H984O0589a15979n4546B6013K9505b6917A72967D2260a39335
10390a25679A60919F9066c02933m9965E957f5001D68599b5464k40083A13670l4002
10379G9668a63607A91896j8341I325L69377b06494B96697a52833E20541d5874
10368H2446R4268f5715A72249q4278a5833k4529A20045a6064D08054J943k150
10357D07847j51526h3901B05965N2441l9554R3770j51481m3901J24363J6179O6487
10346C24269g4110D29066j76630d8797A59876L47542j26714j72521N4758K32151
$$ y = [116125, -90175, 281434, -183793, -16363, -182387, -197518, 188279, -196704, -145970, -56488, -87611, -120280, 79792, 89707, -103677, -158761, -152636, 198106, 104735, -259459, -17119, -2652, -119291, -272109, 8984, 69573, -115979, -170525, 26013, 55518, -26917, 172967, 42260, -139335, -125679, 160919, 69066, -302933, -352898, 5957, -65001, 468599, -25464, -265547, 113670, 79668, -163607, 191896, 173555, 9325, 378702, -206494, 296697, -152833, 520541, -45874, 82446, 176714, -65715, 172249, 87971, -15833, -40362, 120045, -16064, 408054, 409997, 407847, 256321, -83901, 205965, 258406, 218852, 312622, 161141, 117240, 241603, 257782, 324269, -74110, 429066, 252436, -48797, 159876, 507418, 380704, 208183, 262941, 495092]
10336D95092K07298k87766J03873R2944p4942A98514G0067B7015b7696E94468
10325B06763l277K72883m3343A72744J06250O0782K9343D2792N3275P2343l5352
10314A33058l0295i9996A39619K94551d134A91695h4478C39450J02817H6185B5511
10302A54494a62537C92914j11525G8153f4333r5064n133A59338a24005B37851
10291b8134A03230C2624J73973J5194a08320C87066B8873K05920D1031c02033
10280e0929k7796I2121d6618H5310Q715P412m3111a14330G852c29889J00962C615
10267b8091j05940A69105C6034R8778o5856J5149a03440m5529n747B13698l9353
10256A74345e0916r7819j91558C34720a8017j6706I7828N9894n6310g0885A03922
$$ y = [495092, 702390, 414624, 518497, 611441, 536499, 198514, 70067, 27015, -27696, 594468, 206763, 203486, 476369, 433026, 172744, 278994, 339776, 369119, 42792, 96067, 168410, 133058, 102763, -99996, 139619, 434170, -4134, 191695, -84478, 339450, 442267, 86185, 25511, 154494, -162537, 392914, 281389, 78153, -64333, -159397, -164530, 159338, -124005, 237851, -28134, 103230, 32624, 206597, 221791, -108320, 387066, 28873, 234793, 41031, -302033, -50929, -78725, 92121, -46618, 85310, 94025, 101437, 58326, -114330, 7852, -329889, -228927, 3615, -28091, -134031, 169105, 36034, 134812, 68956, 84105, -103440, -148969, -154716, 213698, 174345, -50916, -148735, -340293, 334720, -18017, -34723, 97828, 157722, 101412, -70885, 103922]
10244B11775b36066E7942J91234L400a39648C99134G5660a1137j84373A32340
10233g6091F8443B4337Q7654C0186K051J25699A0385P1812f954k437D1335N6235
10221I7570k2957a61872e9962F5926g3888A64421P1115b77232H4162a70883A14149
10209a90589m50590h6833l71249a50686D07067a98886D92536f9014K2977r5807
10199a41844A1782a43051j09483j89051C245a29721n0403A64456b71567J26791
10189a44776A9618i5337a5299m68219D0709R6992b20333d4106J6882A31192B1362
10177b56318A86341a59291j8699a7846E6782c76648J60383K5893A24176b0564
10166b28824J09773R083r061j08654J11909p9219B50476b09004f3866B65187c1962
$$ y = [211775, -236066, 57942, 249176, 252576, -139648, 399134, 75660, -11137, -195510, 132340, -76091, 68443, 24337, 111991, 30186, 32237, 157936, 10385, 82197, -6954, -9391, 41335, 97570, 74613, -161872, -59962, 65926, -73888, 164421, 235536, -277232, 84162, -170883, 114149, -190589, -641179, -86833, -458082, -150686, 407067, -198886, 492536, -69014, -46037, -141844, 11782, -143051, -252534, -441585, 3245, -129721, -180124, 164456, -271567, -144776, 19618, -95337, -15299, -483518, 40709, 137701, -220333, -44106, -27224, 131192, 21362, -256318, 186341, -159291, -177990, -17846, 56782, -376648, -216265, -190372, 124176, -20564, -228824, -119051, -109968, -119029, -227683, -115774, -194993, 250476, -209004, -63866, 265187, -31962]
10154b99930D6268M756f796j75970a1263k38514a11899h986F4456a63617j51099
10143c14716A14366i4233l17086a60826A13196a29149C7512H215J1174g6162k84057
10132c60219G7714h8823c7142B2134O9004M7982E9570r668e4985G4764K4826l2852
10120F6738J10111b19757Q4391A20905i0625l32788F9448j013a62786A79976C3049
10108D8844e4098k09675c2178k14736D8836J29491a53827r7329O3576g5127f503
10096a3374k95493a36249j73400F4992J15383b98039I8351f7961D5956I466K25652
10085B35118a45432B45410a58389A41882c11566a138B0254b31832E6551b54357
10074d2084n1374A39173d34585C4270d54454i2857q3200A0031a92006q1946c7165
$$ y = [-299930, 46268, 51024, -6796, -182766, -11263, -249777, -111899, -8986, 64456, -163617, -314716, 114366, -94233, -411319, -160826, 113196, -129149, 37512, 8215, 19389, -76162, -360219, 77714, -88823, -37142, 22134, 91138, 139120, 59570, 49902, -54985, 74764, 99590, 66738, 176849, -219757, -135366, 120905, -90625, -423413, 69448, 68435, -162786, 179976, 33049, 48844, -54098, -263773, -32178, -246914, 48836, 178327, -153827, -251156, -187580, -75127, -6503, -13374, -308867, -136249, -309649, 64992, 180375, -298039, 98351, -67961, 45956, 9466, 235118, -145432, 245410, -158389, 141882, -311566, -1138, 20254, -231832, 56551, -254357, -42084, -93458, 139173, -434585, 34270, -454454, -92857, -176057, 10031, -192006, -273952, -37165]
10062a94273A57879a25916O0705H8875a11656o803B59785a57983j56116i4496
10051a27940J1324A51055G3219a87879e1851j29178C6576b71786f1504p6595A19921
10039b20872F0711e282k01457B79101d3727j70017A86736f3176A84612a90808
10028A06783b08917A83769c0319A99288a46564j80053J19479l66827C60903j23428
10018B37475m7819A7401a03034B81877A1167a08298M6630J7367C2673J69543J13374
10007C15590A2610Q8970B0640L0812J1961k3205f3871l1941J0984E8110i6455
9995C2796b39214q5973J08528A1456e8837l2355A9445a36788A3338a52726n7675
9984b10401q8262a41455k09179A68347i0586b3452C9396e531j96854c8927m5203
$$ y = [-194273, 157879, -125916, -65211, 88875, -111656, -118459, 259785, -157983, -314099, -94496, -127940, -116616, 151055, 73219, -187879, -51851, -181029, 36576, -271786, -61504, -138099, 119921, -220872, 60711, -5282, -206739, 279101, -43727, -213744, 186736, -63176, 184612, -190808, 106783, -208917, 183769, -30319, 199288, -146564, -326617, -207138, -573965, 360903, 237475, 189656, 17401, -103034, 281877, 11167, -108298, -61668, -44301, 32673, 202216, 315590, 12610, 101580, 20640, 51452, 63413, 40208, -63871, -95812, -84828, 58110, -96455, 32796, -239214, -325187, -216659, 11456, -58837, -91192, 19445, -136788, 13338, -152726, -210401, -298663, -141455, -350634, 168347, -90586, -23452, 39396, -5531, -202385, -38927, -84130]
9973h4130k9035I6730B1129c8518j98565M7080f1933j6752A2110B558a26047M7622
9961g8425c7739j41977a6506E7633k4276F348L1292f3226n9822N1235L4834E3041
9948d17559a4802E5862a28243B0627f2894A16438b24040A58671o6096m1605J19694
9937A70664b15970A06777d7793F8405R604r742J52198a38626m5206F4806c61962
9925a07621k9607j37474q7597B2209J03280g726o0483o6333O3182A72973g9352
9913A93738b55321I5556C4653a17826n4360a6796H5225e082k2269l8211j42531
9902b08093A22195i6966j3707i819m06070a63571d5804j00778r0753N4597B49437
9890b04953f5508G243g5782l4380K1989j08224j91969R0337R9950b7498q194A24234
$$ y = [-84130, -113165, 96730, 21129, -38518, -237083, -190003, -61933, -78685, 12110, 2558, -126047, -78425, -37739, -179716, -16506, 57633, 33357, 6348, 37640, -63226, -123048, -71813, -36979, 53041, -417559, -14802, 55862, -128243, 20627, -62894, 116438, -224040, 158671, 92575, 50970, 170664, -215970, 106777, -47793, 68405, 78009, 68267, 220465, -138626, -183832, 64806, -361962, -107621, -137228, -274702, -362299, 22209, 125489, -7726, -68209, -134542, -71360, 172973, -79352, 193738, -255321, 95556, 34653, -117826, -172186, -16796, 85225, -5082, -27351, -65562, -208093, 122195, -96966, -110673, -9819, -415889, -163571, -45804, -146582, -237335, -182738, 249437, -204953, -65508, 7243, -75782, -110162, -88173, -196397, -388366, -298029, -198079, -27498, -35692, 124234]
9877h5182L0644q2224M5504C0977d1182j97265B5601n913a15342C2369a46095
9865b6873f135j41983F3877f6741n9113j22504j6413i3479L0809o2307A17153
9853B65268c64320c1958n264G9238L3215K375a30814A50617A4835g2566B2421
9841a90024k6631I6695a22188B9543R4130b0782l96415a62023N4145F1834c68706
9829a99184B0733c37752j35203g1942A38625k0731a63608k35603F0146d9993k71792
9818c21785j3833Q155J52769B89721a89468H0618i347k8067A44311e0837n115
9807e5952k94496A17938c0607o1732E6960J04627J26135j22094b91677r0327F8976
9795b69684o3973a0911j18447B76070L9021a03860I7939k9484g4102k16619B02190
$$ y = [-85182, -54538, -136762, -91258, 30977, -41182, -238447, 25601, 19688, -115342, 32369, -146095, -26873, -6135, -148118, 63877, -66741, -125854, -248358, -264771, -93479, -62670, -124977, 117153, 265268, -364320, -31958, -37222, 79238, 112453, 114828, -130814, 150617, 14835, -72566, 22421, -190024, -216655, 96695, -122188, 29543, 123673, -20782, -417197, -162023, -107878, 61834, -368706, -199184, 20733, -337752, -472955, -71942, 138625, 117894, -163608, -399211, 60146, -49993, -321785, -335618, -327463, -174694, 289721, -189468, 80618, -9347, -37414, 144311, -50837, -55952, -350448, 117938, -30607, -92339, 56960, 161587, 287722, 165628, -291677, -382004, 68976, -269684, -333657, -10911, -129358, 276070, 315091, -103860, 97939, 68455, -74102, -290721, 202190]
9783a09380q3810o618k00099a42667j12215a23799K0625c1818r5245F6879a94238
9771b44642J8662Q8025M2186E566N2806j1646F377b9260j88765i6999d6970C27274
9758a03625k55056C1982a9095I7033d7929d239m01605A85264a44160l5787k5567
9747b05514B27511J0289b05976J5824j18655f5902m9461e1302I7475a1890j0482
9736b2372A74170c92774g7602k27233m9035a11766j58487a08901l63211H4837
9725E4296j2372K38278F4677c59636B6767F778a70058n835j15577B569P2780N4958
9713A30307o1634L79486a90922C85802C9466I517a6586A38916k0165n9234b0115
9701D4833a40656M7807i511D0009c20362j14427e3112j14972e2904k65466O8876
$$ y = [-109380, -193190, -199808, -399907, -142667, -254882, -123799, -103174, -31818, -127063, 66879, -194238, -244642, -225980, -137955, -95769, 5566, 58372, 46726, 6377, -29260, -218025, -96999, -46970, 327274, -103625, -358681, 31982, -19095, 97033, -47929, -4239, -405844, 185264, -144160, -179947, -205514, 227511, 237800, -205976, -190152, -308807, -65902, -115363, -51302, 97475, -11890, -22372, 174170, -392774, -77602, -304835, -353870, -111766, -270253, -108901, -472112, 84837, 54296, 41924, 280202, 64677, -359636, 26767, 6778, -170058, -175893, -291470, 2569, 75349, 130307, 68673, 448159, -190922, 385802, 39466, 9517, -16586, 138916, 118751, 59517, -20115, 44833, -140656, -92849, -9511, 40009, -320362, -434789, -53112, -168084, -52904, -318370, -249494]
9690b49494j6589b1337A28784a86413d4858n9941a2088A57985a90879j64790e5129
9678a0378k5265m8014A55401j5174o0966Q5453b29409E605b5912k56431j91401
9667d73744a46693f9106B47173b97954f1492A47603d2375B9149J83613a44820
9656a33004G163c35390i4142m3496k1982q5359h6522E9142i290B5124J78243q0185
9644A23182J58449H2968N5154h8438A52150Q2894a77942E458L2813h8913B20944
9632d736j95j26514b3712B3091a19693j46751a03401m3027B7902N5257b69736
9620a8955F29J88145c195F3398e004q9291d3872l24875I0062J03209e214A42335
9607A28064h9291N492H3047b09553B70844a14361B82476a49552e327K554j78942
$$ y = [-249494, -266083, -21337, 128784, -186413, -44858, -104799, -12088, 157985, -190879, -355669, -55129, -10378, -35643, -83657, 155401, 140227, 79261, 164714, -229409, 5605, -25912, -282343, -473744, -146693, -69106, 247173, -297954, -61492, 147603, -42375, 29149, 212762, -144820, -133004, 7163, -335390, -94142, -137638, -159620, -244979, -86522, 59142, -9290, 25124, 203367, 123182, 281631, 82968, 138122, -88438, 152150, 235044, -177942, 5458, 38271, -88913, 220944, -4736, -4931, -131445, -23712, 23091, -119693, -266444, -103401, -146428, 27902, 83159, -269736, -18955, 629, 188774, -3195, 63398, -5004, -94295, -43872, -368747, 90062, 193271, -5214, 142335, 128064, -89291, -83799, 83047, -209553, 270844, -114361, 282476, -149552, -5327, -2773, -181715]
9596a81715D3247b15965A6716a4675j62351g3572j02037A91941C3678a8041p6338
9585i4379j69196i5971A08413a99885I1660d3905K1086E7950L0398a57523d9822
9573H1759O510a33204B3009a55784d9391m0893c29H2185a46507q3373A9280a93932
9560A30747j380b78778H3805f5290r721q8155C02098c05603R6544a02021L3027
9549f8994k08664J37886k02710c1952m49317b3915q2080k44294c6482q0506c6172
9537b57813i2983B72470e2307l40948E5988a20424j9067j17188A34907h3332B12137
9525B34482F1640J48561H0635b32508c7014H9832g4083G5500F351d1910A08282
9513b15773j83677a21142A35355g9037B1265R4853a9325r9945d1244o236q447
$$ y = [-181715, 43247, -215965, 16716, -14675, -177026, -73572, -175609, 191941, 33678, -18041, -94379, -263575, -95971, 108413, -199885, 91660, -43905, -22819, 57950, 88348, -157523, -49822, 81759, 88269, -133204, 23009, -155784, -49391, -90284, -329, 82185, -146507, -229880, 19280, -193932, 130747, 129367, -278778, 83805, -65290, -75011, -163166, 302098, -305603, -209059, -102021, -68994, -277658, -139772, -342482, -31952, -481269, -23915, -105995, -350289, -36482, -116988, -36172, -257813, -92983, 272470, -52307, -393255, 55988, -120424, -139491, -256679, 134907, -83332, 212137, 234482, 61640, 210201, 80635, -232508, -37014, 89832, -74083, 75500, 6351, -41910, 108282, -215773, -399450, -121142, 135355, -79037, 21265, 116118, -19325, -119270, -41244, -47480, -55927]
9502e5927C19162c3464r8172F5511i7644A8785m209a44374I4205b34679F1879
9490F7500K99609A61800d5317k03517K8831A20904J58572c78557b323k76F3665
9478e558m411C3910J4566b22351C3487a40155D4970J70849C3456J00178D023J11809
9466A15832a85469A01198m2830c0732l7641j4812l84365B93535a22135C1233a05085
9454I0035C9066b19052j67028d5570j15133K3303A26800c57164I1951l685a77970
9442a08195a1068k50115N6203M353D8468a7828O403D9529a27714m8552p3925K4254
9430b25937c2826l41515d6825j66648d5701j22670l5124p3401O0776j26159d2087
9418A96643b81716Q0201E319b2573n8491A02651C189K27578a4467E8712a41159
$$ y = [-55927, 319162, -33464, -131636, 65511, -97644, 18785, 14576, -144374, 94205, -234679, 61879, 67500, 367109, 161800, -45317, -248834, -220003, 120904, 279476, -378557, -2323, -2599, 63665, -5558, -9969, 33910, 48476, -222351, 33487, -140155, 44970, 215819, 33456, 133634, 4023, 115832, -185469, 101198, 58368, -30732, -68373, -83185, -467550, 293535, -122135, 31233, -105085, 90035, 39066, -219052, -386080, -45570, -160703, -137400, 126800, -357164, 91951, 88266, -177970, -108195, -11068, -261183, -204980, -200627, 48468, -17828, -11425, 49529, -127714, -176266, -250191, -225937, -32826, -374341, -46825, -213473, -45701, -168371, -203495, -276896, -216120, -342279, -42087, 196643, -281716, -201515, 5319, -22573, -81064, 102651, 3189, 230767, -14467, 58712, -141159]
9406A1320a34129j79965F0709a79017A65192g5854G7047M919a54375A19889a6649
9394c30966h1641C7274A3494b12348A18915a12575A32078a2256l7367C7041M4590
9383H1631a57439p085j9028G4041e58477G3124J13915n5487c01172E3040K13781
9372B66821b6824I7427c5159k7943C4108a71231A63805k6285a91501L1451A20572
9360E3273L58459a09248C5021J25020D9277d2668k96576h6696a7109D75425b5195
9348A7901K6287c36482G4085A751b52242j1782B109P1787b6797j24783q0874J4813
9336b17641O5096A0845c79942A1049b18572i4861k657L7962o4268G9745a2019
9324c3989C42415A5554N8354O1740d6750B31513d27420i0238r2177h7002H5146
$$ y = [11320, -134129, -314094, 60709, -179017, 165192, -75854, 77047, 81966, -154375, 119889, -16649, -330966, -81641, 37274, 13494, -212348, 118915, -112575, 132078, -12256, -49623, 37041, 81631, -157439, -164524, -183552, 74041, -558477, 73124, 187039, 131552, -301172, 53040, 266821, -26824, 97427, -35159, -63102, 34108, -171231, 163805, 137520, -191501, -160050, 120572, 53273, 411732, -109248, 35021, 160041, 49277, -42668, -339244, -86696, -17109, 475425, -25195, 17901, 44188, -336482, 74085, 1751, -252242, -264024, 2109, 73896, -26797, -151580, -232454, -217641, -152545, 10845, -379942, 11049, -218572, -94861, -97518, -59556, -123824, 79745, -12019, -33989, 342415, 15554, 73908, 135648, -46750, 231513, -427420, -90238, -182415, -87002, 85146]
9312c01545b2282j13051G5062b14120l5432b6548k57309I4774m4085O1781J54060
9301B66530G8024h2695j71836B41536b3059j33777o7404a00780L9600j45902A38601
9289a68818f5216j31029A39042k1567b02243c0585j24529I649J56787J00913a37190
9277a8173j14283D4687b3672A05590a40255j56434j75984c2949k7421b2102j19097
9266a41199L882R852m1820F8368i6003a5377A85801F4871g8549j76709a02212
9254a75941G2768b67945b6740A9748r591b36255D0349b37422p1284I3198a91588
9242a6035A7052a68816k73234J80957A8568J74496c1510G8728C2821M7791J26408
9231B07020b92p8623q6014i804j95263A80413l8634F3502b0455j67007j8826m3785
$$ y = [-301545, -22282, -135333, 75062, -214120, -249552, -26548, -283857, 94774, 50689, 112470, 266530, 78024, -82695, -254531, 241536, -23059, -156836, -224240, -100780, -61180, -207082, 138601, -168818, -65216, -196245, 139042, 117475, -202243, -30585, -155114, 9649, 166436, 267349, -137190, -18173, -132456, 44687, -23672, 105590, -140255, -296689, -472673, -32949, -60370, -22102, -141199, -137317, -127465, -169285, 68368, -96003, -15377, 185801, 64871, -78549, -255258, -102212, -175941, 72768, -267945, -26740, 19748, 10157, -236255, 40349, -237422, -308706, 93198, -191588, -16035, 17052, -168816, -442050, -261093, 18568, 193064, -31510, 78728, 32821, 80612, 207020, -292, -78915, -164929, -9804, -205067, 180413, 141779, 63502, -20455, -187462, -206288, -250073]
9219b50073c6892l27586C31258A15479a88245j4933o9747G302d9642m0311k01212
9208b91165P006l6740C67619A32986c6676n8519B754J12800a35258A19308g7940
9196A06111j898k118a12486j7667A7442J23158c07731e5973D8342b88820d8522
9184C37242I4333P7323F0523P0090L1672a64669l4146j75897c5008A57144a84918
9172C56305d16121H6387c08011A09098d73478B2899K82129b30805a0745r3786
9162a04531r405l16445A15800c28269B3678b24658A5744b30521j24862C3152R289
9151D2441J9706f9658m9351k19191J31633N53b6794j99308g1537k76107D9990
9139c86819D9195a87873F0441J98904a77107D5135b29449d1303l6622B25598l5617
$$ y = [-250073, -36892, -364478, 331258, 115479, -188245, -203178, -272925, 7302, -49642, -89953, -291165, -284159, -320899, 367619, 132986, -36676, -95195, 2754, 115554, -135258, 119308, -77940, 106111, 104213, 102095, -112486, -130153, 17442, 140600, -307731, -55973, 48342, -288820, -48522, 337242, 94333, 171656, 60523, 130613, 162285, -164669, -198815, -374712, -35008, 157144, -184918, 356305, -416121, 86387, -308011, 109098, -473478, 22899, 305028, -230805, -10745, -104531, -113936, -430381, 115800, -328269, 23678, -224658, 15744, -230521, -355383, 33152, 42441, 62147, -69658, -119009, -338200, -206567, -206014, -26794, -226102, -71537, -347644, 49990, -386819, 49195, -187873, 60441, 259345, -177107, 45135, -229449, -41303, -77925, 225598, 189981]
9128A89981d04301A36968P6550b88692I8377a245k00649C7109h8597p8400j77216
9117c44213D6378c51735c8292F6983O8595J53274B2611c86324A51571b54270K2392
9106b31878J1498i7584j70693P0080p5520J6830R0460j25501B39742c91835a37559
9094B08673b5039A1211P9622K0898K8373P8293E6813j9279c8762A02451O1504
9083A63955a91383d3856A9800a07358q2144Q4925B55752a97144I3194a4994j38998
9072a53992h092l63370C79343a96967K4600F3095c53622g2982k58501d9466j33868
9061a83334e3466C2622J19927c00030a41717A37992B1559a21241A755a28719G3187
9049a24261l6898e982E6435b15251A7744O9254e8577k77694I370L33307A14481
$$ y = [189981, -404301, 136968, 213518, -288692, 98377, -1245, -201894, 37109, -88597, -166997, -344213, 46378, -351735, -38292, 66983, 135578, 288852, 22611, -386324, 151571, -254270, -231878, -220380, -97584, -268277, -198197, -273717, -256887, -166427, -291928, 239742, -391835, -137559, 208673, -25039, 11211, 90833, 111731, 140104, 218397, 56813, 37534, -38762, 102451, 163955, -191383, -43856, 19800, -107358, -189502, -104577, 255752, -197144, 93194, -14994, -153992, -8092, -371462, 379343, -196967, -172367, 63095, -353622, -72982, -331483, -49466, -183334, -53466, 32622, 152549, -300030, -141717, 137992, 21559, -121241, 1755, -128719, 73187, -124261, -161159, -5982, 56435, -215251, 17744, 86998, -58577, -336271, 9370, 342677, 114481]
9037f2254j47821A30918c0072j90173J09227A89766l8377B1474b10018A46052
9026B14022a62239k2707A96110H5506J67128b12424R1772r3832j06622C0537f1279
9014C7099a72366J6208H5242b15375i1834B7887b2787A02164h5840C289J2965
9003A6254J56217c9870C1140J71112c4498G2766K0830c22502B6974Q5846j5511
8992I7309c8135D8206a52143K4372J5393F2887c8637j77535d0927k47140H7979
8980a46469L0058j62441C3452a05062A80200a9714A58517E2662J63590b24275
8969h9917G0974g887A04617r438b54239P5974g3080D2397M07843a9384j04196
8958a23580j3037r772J2980B28903g3725j32158M9561c5780A59932O4336f6872
$$ y = [-62254, -210075, 130918, -30072, -220245, -111018, 189766, 151389, 21474, -210018, 146052, 214022, -162239, -184946, 196110, 85506, 252634, -212424, -120652, -214484, -321106, 30537, -61279, 37099, -172366, -156158, 85242, -215375, -91834, 27887, -22787, 102164, -85840, 3289, 16254, 172471, -39870, 31140, 202252, -34498, 72766, 93596, -322502, 26974, 112820, 97309, -38135, 48206, -152143, -127771, -112378, 62887, -38637, -216172, -40927, -288067, 87979, -146469, -116411, -278852, 33452, -105062, 180200, -19714, 158517, 52662, 216252, -224275, -89917, 70974, -7887, 104617, 95179, -254239, -178265, -73080, 42397, 450240, -19384, -123580, -136617, -146389, -133409, 228903, -73725, -205883, -156322, -35780, 159932, 224268, -66872]
8946b62050d2930m52826A28423m6358L0998d6641j81413k86811a81174F1205a12759
8934b7983r230B06678a91969I5465F644K01704f383j68908r7334a34790k0006
8923a54796B24482b44720i1165n0008B48700l1860Q4341o2005A19125B5129K39562
8912B64691R5208L0040r404L60855P43460J175933K452278N893428m928137B925803
8901A869333p85986l07143j90612J7386j34233i6310A67277O7961I5707a123C08260
8889B06254r0148J08863d6351B79870b22993J07774B09376F1657b91966A35147
8878A39027J8470h2463j4753A35288f6244h485o8070A32048J58140C3704e1165
8866D0491J27783b19499D7309K3137j4325e8893b7384l4707B7458J75374r0219
$$ y = [-262050, -42930, -495756, 128423, 82065, 113063, -46641, -228054, -514865, -181174, 61205, -112759, -27983, -37213, 206678, -191969, 95465, 6644, 208348, -6383, -175291, -272625, -134790, -154796, 224482, -244720, -91165, -141173, 248700, 216840, 301181, 239176, 119125, 25129, 264691, 359899, 389939, 380535, 741390, 1484850, 2660783, 5113061, 11006489, 6078352, 2925803, 1869333, 1083347, 776204, 585592, 602978, 468745, -96310, 167277, 235238, 95707, -1123, 308260, 206254, 116106, 224969, -46351, 279870, -222993, -115219, 209376, 61657, -291966, 135147, 139027, 157497, -82463, -97216, 135288, -66244, -8485, -76555, 132048, 290188, 33704, -51165, 40491, 168274, -219499, 47309, 70446, 56121, -58893, -27384, -62091, 27458, 202832, 112613]
8855A12613f0745L979D6272f5510l37540a79647G123L85017o1719A27235a02409
8843b18821d7804B55826b49582j3014J07658F004J47395L2312p2479h1120B09521
8831h8797A48761a91945P8475J6462j57825A15807k0119b86932E5233b13184B6944
$$ y = [112613, -60745, -56766, 46272, -65510, -403050, -179647, 7123, 392140, 330421, 127235, -102409, -218821, -47804, 255826, -249582, -262596, -154938, 6004, 153399, 185711, 113232, -81120, 209521, -88797, 148761, -191945, -113470, -97008, -254833, 115807, 95688, -286932, 55233, -213184, 26944]
$$ [...]
##END NTUPLES=NMR SPECTRUM
##END=
