
##TITLE=UV1022_M2-1005-1001_6269760_26eSw2VOLz
##JCAMPDX= 6.0         $$ Bruker NMR JCAMP-DX V2.0
##DATA TYPE= NMR SPECTRUM
##DATA CLASS= NTUPLES
##ORIGIN= BRUKER
##OWNER= Administrator
$$ 1.72 TOPSPIN		Version 2.1
$$ 2012-06-02 06:39:22.093 -0500  Administrator@TOPSPIN
$$ Compression mode = diff/dup
##.OBSERVE FREQUENCY= 400.13188235
##.OBSERVE NUCLEUS= ^1H
##.ACQUISITION MODE= SIMULTANEOUS (DQD)
##.ACQUISITION SCHEME= undefined
##.AVERAGES= 64
##.DIGITISER RES= 22
##SPECTROMETER/DATA SYSTEM= spect
##.PULSE SEQUENCE= noesygpps1d.comp
##.SOLVENT NAME= COFFEE_calctemp
##.SHIFT REFERENCE= INTERNAL, COFFEE_calctemp, 1, 14.96721
##AUDIT TRAIL= $$ (NUMBER, WHEN, WHO, WHERE, PROCESS, VERSION, WHAT)
$$ ##TITLE= Audit trail, TOPSPIN		Version 2.1
$$ ##JCAMPDX= 5.01
$$ ##ORIGIN= Bruker BioSpin GmbH
$$ ##OWNER= Administrator
$$ $$ C:\Bruker\TOPSPIN/data/COFFEE/nmr/UV1022_M2-1005-1001_6269760_26eSw2VOLz/22/pdata/1/auditp.txt
$$ ##AUDIT TRAIL=  $$ (NUMBER, WHEN, WHO, WHERE, PROCESS, VERSION, WHAT)
(   1,<2012-06-02 06:39:16.859 -0500>,<Administrator>,<TOPSPIN>,<go>,<TOPSPIN 2.1>,
      <created by zg
	started at 2012-06-02 06:27:46.531 -0500,
	POWCHK enabled, PULCHK disabled,
       configuration hash MD5:
       D5 CA 7A 23 FE 6B EE E2 50 67 74 61 24 F7 5E 3B
       data hash MD5: 64K
       00 BC 64 D4 86 C2 D5 D0 84 5A 3A 30 BB 2B 33 AC>)
(   2,<2012-06-02 06:39:19.890 -0500>,<Administrator>,<TOPSPIN>,<proc1d>,<TOPSPIN 2.1>,
      <Start of raw data processing
       efp LB = 0.3 FT_mod = 6 PKNL = 1 PHC0 = 0 PHC1 = 0 SI = 128K 
       data hash MD5: 128K
       4D A9 2A B5 51 CF F5 00 AA D1 5A 66 91 2B 51 DC>)
(   3,<2012-06-02 06:39:21.062 -0500>,<Administrator>,<TOPSPIN>,<proc1d>,<TOPSPIN 2.1>,
      <pk PHC0 = 30.44312 PHC1 = 0 
       data hash MD5: 128K
       E4 F5 F6 0D FF 2A 59 17 62 4A 3D D4 F4 27 70 5D>)
(   4,<2012-06-02 06:39:21.750 -0500>,<Administrator>,<TOPSPIN>,<proc1d>,<TOPSPIN 2.1>,
      <abs ABSG = 1 
       data hash MD5: 128K
       CA 7A B4 46 82 AA 3A 09 34 AC AA 5B 65 D6 4C 01>)
(   5,<2012-06-02 06:39:21.812 -0500>,<Administrator>,<TOPSPIN>,<proc1d>,<TOPSPIN 2.1>,
      <abs ABSG = 2 
       data hash MD5: 128K
       6A 6D EE F3 2D 81 AB FE 66 0B FC 3F 8D BA 2D 5F>)
(   6,<2012-06-02 06:39:21.859 -0500>,<Administrator>,<TOPSPIN>,<proc1d>,<TOPSPIN 2.1>,
      <abs ABSG = 3 
       data hash MD5: 128K
       3A C1 D9 74 7C EB 0D EC 9A 03 BB 34 2B B3 35 D0>)
(   7,<2012-06-02 06:39:21.937 -0500>,<Administrator>,<TOPSPIN>,<proc1d>,<TOPSPIN 2.1>,
      <abs ABSG = 4 
       data hash MD5: 128K
       A7 CB D7 0A 8E 5A 8B A2 79 D1 FD FE 5D D0 D6 B0>)
(   8,<2012-06-02 06:39:22.000 -0500>,<Administrator>,<TOPSPIN>,<proc1d>,<TOPSPIN 2.1>,
      <abs ABSG = 5 
       data hash MD5: 128K
       92 C2 22 78 AC 79 37 D0 FE B3 18 CB 3D 52 CF 0D>)
$$ ##END=
$$ 
$$ $$ hash MD5
$$ $$ 22 C4 38 18 A3 4C 49 C4 FB 49 50 00 D1 C6 01 E3
##$RELAX= 
##$RELAX= 
##$RELAX= 
##$RELAX= 
##$RELAX= 
##$RELAX= 
##$RELAX= 
##$RELAX= 
$$ [...]
##$TP07= 0
##$TPNAME0= <>
##$TPNAME1= <>
##$TPNAME2= <>
##$TPNAME3= <>
##$TPNAME4= <>
##$TPNAME5= <>
##$TPNAME6= <>
##$TPNAME7= <>
##$TPOAL= (0..7)
0.5 0.5 0.5 0.5 0.5 0.5 0.5 0.5
##$TPOFFS= (0..7)
0 0 0 0 0 0 0 0
##$TUNHIN= 0
##$TUNHOUT= 0
##$TUNXOUT= 0
##$USERA1= <user>
##$USERA2= <user>
##$USERA3= <user>
##$USERA4= <user>
##$USERA5= <user>
##$V9= 5
##$VALIST= <valist>
##$VCLIST= <CCCCCCCCCCCCCCC>
##$VD= 0
##$VDLIST= <DDDDDDDDDDDDDDD>
##$VPLIST= <PPPPPPPPPPPPPPP>
##$VTLIST= <TTTTTTTTTTTTTTT>
##$WBST= 2048
##$WBSW= 25
##$XGAIN= (0..3)
0 0 0 0
##$XL= 0
##$YL= 0
##$YMAX_a= 11779563
##$YMIN_a= -6391370
##$ZGOPTNS= <>
##$ZL1= 120
##$ZL2= 120
##$ZL3= 120
##$ZL4= 120
##$ABSF1= 14.96721
##$ABSF2= -5.58532
##$ABSG= 5
##$ABSL= 3
##$ALPHA= 0
##$AQORDER= 0
##$ASSFAC= 0
##$ASSFACI= 0
##$ASSFACX= 0
##$ASSWID= 0
##$AUNMP= <proc_prof1d_extract.lims>
##$AXLEFT= 0
##$AXNAME= <>
##$AXNUC= <1H>
##$AXRIGHT= 0
##$AXTYPE= 0
##$AXUNIT= <>
##$AZFE= 0.1
##$AZFW= 0.1
##$BCFW= 0
##$BC_mod= 0
##$BYTORDP= 0
##$COROFFS= 0
##$CY= 15
##$DATMOD= 1
##$DC= 0
##$DFILT= <>
##$DTYPP= 0
##$F1P= 0
##$F2P= 0
##$FCOR= 0.5
##$FTSIZE= 131072
##$FT_mod= 6
##$GAMMA= 0
##$GB= 0
##$INTBC= 1
##$INTSCL= 1
##$ISEN= 128
##$LB= 0.3
##$LEV0= 0
##$LPBIN= 0
##$MAXI= 10000
##$MC2= 0
##$MEAN= 0
##$ME_mod= 0
##$MI= 0
##$NCOEF= 0
##$NC_proc= -3
##$NLEV= 6
##$NOISF1= 0
##$NOISF2= 0
##$NSP= 0
##$NTH_PI= 0
##$NZP= 0
##$OFFSET= 14.96721
##$PC= 1
##$PHC0= 30.44312
##$PHC1= 0
##$PH_mod= 1
##$PKNL= yes
##$PPARMOD= 0
##$PPDIAG= 0
##$PPIPTYP= 0
##$PPMPNUM= 2147483647
##$PPRESOL= 1
##$PSCAL= 4
##$PSIGN= 0
##$PYNMP= <proc.py>
##$REVERSE= no
##$SF= 400.130005360617
##$SI= 131072
##$SIGF1= 0
##$SIGF2= 0
##$SINO= 400
##$SIOLD= 131072
##$SPECTYP= <>
##$SREGLST= <1H.CDCl3>
##$SSB= 0
##$STSI= 131072
##$STSR= 0
##$SW_p= 8223.68421052632
##$SYMM= 0
##$S_DEV= 0
##$TDeff= 65536
##$TDoff= 0
##$TI= <>
##$TILT= no
##$TM1= 0
##$TM2= 0
##$TOPLEV= 0
##$USERP1= <user>
##$USERP2= <user>
##$USERP3= <user>
##$USERP4= <user>
##$USERP5= <user>
##$WDW= 1
##$XDIM= 131072
##$YMAX_p= 477889542
##$YMIN_p= -99690375
##$CURPLOT= <Network HP LaserJet P1505>
##$CURPRIN= <$Network HP LaserJet P1505>
##$DFORMAT= <normdp>
##$LAYOUT= <+/1D_H.xwp>
##$LFORMAT= <normlp>
##$PFORMAT= <normpl>
##$SURQMSG= 1
$$ End of Bruker specific parameters
$$ ---------------------------------
##NTUPLES= NMR SPECTRUM
##VAR_NAME=  FREQUENCY,     SPECTRUM/REAL,   SPECTRUM/IMAG
##SYMBOL=    X,             R,               I
##VAR_TYPE=  INDEPENDENT,   DEPENDENT,       DEPENDENT
##VAR_FORM=  AFFN,          ASDF,            ASDF
##VAR_DIM=   131072,        131072,          131072
##UNITS=     HZ,            ARBITRARY UNITS, ARBITRARY UNITS
##FACTOR=    0.0627417313425165, 1,          1
##FIRST=     8223.62146879498, 7624,         -106689
##LAST=      0,             9020,            -107021
##MIN=       0,             -99690375,       0
##MAX=       8223.62146879498, 477889542,    0
$$ Real data points
##PAGE= N=1
##DATA TABLE= (X++(R..R)), XYDATA
$$ [...]
63517A045595j4163j2041r136n222j406J160K835M679O673Q065R132J0836J2873
63504A059880J3811J3455J3354J4466J5993J7178J8531K0461K2251K3586K5636
63493A258602K9222L3091L5539L6889L8742M1450M3825M4917M4338M1126L4038
63482A681779K3421J1581Q55p797j4195j8009j9044j7901j5846j4274j4196j5824
63470A580550j8550k1704k5129k8724l1852l4018l5788l8022m0298m1122l9939
63459A225404l7909l6354l5226l3579l0836k7210k3458k0600j9341j9324j9367
63448I22200j8719j7550j6109j4296j2384j1198j0865j0232q459o389n339n115
63436G85545m515l396k860l424m327m815m820m196k634q07k62j242j845l72K359
$$ plain form
63517 1045595 1031432 1019391 1010255 1005033 1003627 1004787 1007622 1012301 1018974 1027039 1036171 1047007 1059880
63504 1059880 1073691 1087146 1100500 1114966 1130959 1148137 1166668 1187129 1209380 1232966 1258602
63493 1258602 1287824 1320915 1356454 1393343 1432085 1473535 1517360 1562277 1606615 1647741 1681779
63482 1681779 1705200 1716781 1717636 1709839 1695644 1677635 1658591 1640690 1624844 1610570 1596374 1580550
63470 1580550 1562000 1540296 1515167 1486443 1454591 1420573 1384785 1346763 1306465 1265343 1225404
63459 1225404 1187495 1151141 1115915 1082336 1051500 1024290 1000832 980232 960891 941567 922200
63448 922200 903481 885931 869822 855526 843142 831944 821079 810847 802388 795999 790660 785545
63436 785545 781030 777634 774774 771350 767023 762208 757388 753192 750558 749751 749489 748247 746402 746030 748389
63421G48389M256M722M826N227N410M947M100L031J608J88n25p21j469l049m417
63406G76523m895n219o157p066o894n888n047m357k844l10K065L133L040K972
63392G39056M082O638R731J1943J2746J3082J4074J5587J6802J7756J9188K0960
63380I01645K2057K2441K3681K7027L1738L6035L8931M0259L9570L6284L0991
63369A250659K5698K2443K1850K3068K4799K6421K8444L1837L6775M2050M5920
63358A579964M7439M6941M5406M3446M0690L6075K8979K0094J0874K197n803j2605
63346A883697j6966j8315j7840j7412j7937j9402k1974k5908l0678l5207l9023
63335A623035m2191m4127m3683m0893l7553l5264l3608l1115k7508k4040k1700
$$ plain form
63421 748389 752645 757367 762193 767420 772830 777777 781877 784908 786516 786704 786179 785458 783989 780940 776523
63406 776523 771628 766409 760252 753186 746292 740404 735357 731000 728156 727846 729911 733044 736084 739056
63392 739056 743138 749776 759507 771450 784196 797278 811352 826939 843741 861497 880685 901645
63380 901645 923702 946143 969824 996851 1028589 1064624 1103555 1143814 1183384 1219668 1250659
63369 1250659 1276357 1298800 1320650 1343718 1368517 1394938 1423382 1455219 1491994 1534044 1579964
63358 1579964 1627403 1674344 1719750 1763196 1803886 1839961 1868940 1889034 1899908 1902105 1896302 1883697
63346 1883697 1866731 1848416 1830576 1813164 1795227 1775825 1753851 1727943 1697265 1662058 1623035
63335 1623035 1580844 1536717 1493034 1452141 1414588 1379324 1345716 1314601 1287093 1263053 1241353
63324A241353k0001j7748j4350j0149n907k393j34R31J704L467O764J0750J3928
63311A208215J5706J6942J8797K1369K3958K6317K8872L1694L4024L5253L5779
63300A496926L6565L8144M0351M2502M3508M2378L9084L4489K9002K1956J3014
63289A877919L536m461j0248j4302j6720j7252j6950j8105k1725k6138k9035l0186
63277A676333l1293l3718l7283m0912m3546m4422m3346m0997l8626l7062l5903
63266A249225l3721k9414k3612j8469j5478j3888j2215j0928j2118j6233k0743
63255A042406k2936k2682k1492k0207j8967j8301j8462j8412j7152j5412j4404
63244H33979j3524j1328q358o720o796o714n552m745n488o799p347p353p443p263
$$ plain form
63324 1241353 1221352 1203604 1189254 1179105 1173198 1170805 1170671 1171602 1173306 1176773 1183537 1194287 1208215
63311 1208215 1223921 1240863 1259660 1281029 1304987 1331304 1360176 1391870 1425894 1461147 1496926
63300 1496926 1533491 1571635 1611986 1654488 1697996 1740374 1779458 1813947 1842949 1864905 1877919
63289 1877919 1881455 1876994 1866746 1852444 1835724 1818472 1801522 1783417 1761692 1735554 1706519 1676333
63277 1676333 1645040 1611322 1574039 1533127 1489581 1445159 1401813 1360816 1322190 1285128 1249225
63266 1249225 1215504 1186090 1162478 1144009 1128531 1114643 1102428 1091500 1079382 1063149 1042406
63255 1042406 1019470 996788 975296 955089 936122 917821 899359 880947 863795 848383 833979
63244 833979 820455 809127 800769 794049 787253 780539 774987 770242 764754 757955 750608 743255 735812 728549
63230G28549o704o961q659j0144r514p472o341o715o971n906m238l274l303l519
63216F38828k910j227L78K54j511k510p32K699M756M004J628o35k079k569j942
63201F36432k91J921M093N429N069L260J795K158L645M538M676N360O995Q526
63187F93606R194R334R324R317R998J1900J3869J4015J2640J2248J3995J6174
63175H35614J7230J8265K0990K4667K6869K6478K4419K2226K1112K1713K3307
63164A082890K3881K2391K0424K0264K1778K2674K1706K0057J9352J9615J9698
63153A314730J8717J6548J3490J0021O635L572O67k520o319j0492j4052j5958
63141A335039j6212j5791j5404j4837j3738j2362j1063r701q059o284m394j988
$$ plain form
63230 728549 721845 714884 706225 696081 686567 679095 672754 666039 659068 653162 648924 645650 642347 638828
63216 638828 635918 634691 635069 635323 633812 631302 630570 633269 638025 642029 643657 643022 640943 638374 636432
63201 636432 636141 638062 642155 647584 652653 655913 657708 659866 663511 668049 672725 678085 685080 693606
63187 693606 702800 712134 721458 730775 740773 752673 766542 780557 793197 805445 819440 835614
63175 835614 852844 871109 892099 916766 943635 970113 994532 1016758 1037870 1059583 1082890
63164 1082890 1106771 1129162 1149586 1169850 1191628 1214302 1236008 1256065 1275417 1295032 1314730
63153 1314730 1333447 1349995 1363485 1373506 1380141 1383713 1384380 1381860 1375541 1365049 1350997 1335039
63141 1335039 1318827 1303036 1287632 1272795 1259057 1246695 1235632 1225931 1217872 1211588 1207194 1205206
63129A205206R34L504N064O209Q097J1102J4640J7738J9270J8576J6736J6274
63117A343350J8406K1207K1847K0152J8563J8815K0103K0514J8933J5348J0516
63106A547754N763K142o68l941q246j2858j6735j9358k0719k1442k2774k5390
63094A403528k8110k9073k8196k7339k7735k8578k8570k7528k5742k3083j9700
63083A109874j6612j4558j3056j1488j0288r875r254p079l793j282l85l4R75K455
63069A015600L446L553L198L183M250O438Q634R377Q481P228O682O601O477O633
63055A099781P313P433N796L417K955N343Q230Q709O515L570J224n75j830j888
63041A155993n77J269K790L792M266M182M043M595N571N736M703L607L307L112
$$ plain form
63129 1205206 1206140 1209644 1214708 1220917 1229014 1240116 1254756 1272494 1291764 1310340 1327076 1343350
63117 1343350 1361756 1382963 1404810 1424962 1443525 1462340 1482443 1502957 1521890 1537238 1547754
63106 1547754 1553517 1555659 1554991 1551050 1542804 1529946 1513211 1493853 1473134 1451692 1428918 1403528
63094 1403528 1375418 1346345 1318149 1290810 1263075 1234497 1205927 1178399 1152657 1129574 1109874
63083 1109874 1093262 1078704 1065648 1054160 1043872 1033997 1024743 1017664 1013871 1012589 1012204 1012170 1013145 1015600
63069 1015600 1019046 1022599 1025797 1028980 1033230 1039668 1048302 1057679 1066160 1073388 1080070 1086671 1093148 1099781
63055 1099781 1107094 1114527 1120323 1123740 1126695 1132038 1140268 1148977 1155492 1159062 1160286 1159711 1157881 1155993
63041 1155993 1155416 1156685 1159475 1163267 1167533 1171715 1175758 1180353 1185924 1191660 1196363 1199970 1203277 1206389
63027A206389K221J299J297J622J000l11q01P1J322K172K946M001M954N356N303
63012A238841N132N205O002P699R656J1161J2492J4371J6580J8294J9640K1627
63000A386700K4456K7257K9738L2636L6148L9308M1472M3134M4654M5577M5955
62989A797035M7003M9390N1973N3325N3535N3501N3387N2884N2169N1451N0244
62978B365897M8234M6130M4644M3276M1292L9167L7681L6121L2767K6900J9198
62967B781307J0518J540o811j4009k0872k8604l6904m4111m9202n2493n4522n5303
62955B430534n4618n2036m6978l9866l2769k7436k3054j7599j1053n384j322K575
62943B120994P258J1865J5789J9931K4609K8220K9573K9949L1123L2680L3113
$$ plain form
63027 1206389 1208610 1209909 1211206 1212828 1213828 1213517 1212716 1212787 1214109 1216281 1219227 1223228 1228182 1233538 1238841
63012 1238841 1243973 1249178 1255180 1262879 1272535 1283696 1296188 1310559 1327139 1345433 1365073 1386700
63000 1386700 1411156 1438413 1468151 1500787 1536935 1576243 1617715 1660849 1705503 1751080 1797035
62989 1797035 1844038 1893428 1945401 1998726 2052261 2105762 2159149 2212033 2264202 2315653 2365897
62978 2365897 2414131 2460261 2504905 2548181 2589473 2628640 2666321 2702442 2735209 2762109 2781307
62967 2781307 2791825 2793365 2786554 2772545 2751673 2723069 2686165 2642054 2592852 2540359 2485837 2430534
62955 2430534 2375916 2323880 2276902 2237036 2204267 2176831 2153777 2136178 2125125 2119741 2118419 2120994
62943 2120994 2128252 2140117 2155906 2175837 2200446 2228666 2258239 2288188 2319311 2351991 2385104
62932B385104L2534L2267L2477L2096L0767K9079K7004K3738J9064J3481P014
62921B664625p01r099j6845k3521l0024l7116m4599n1947n8584o3460o5681o5830
62909B197218o5601o5807o5713o4490o2167n8881n4470m9301m4475m0741l8161
62898A587411l7011l7621l8920l8711l6313l3507l1887l0705k8674k6465k5572
62887A222025k5701k5313k4228k3612k3469k2312j9675j7084j5772j4996j3570
62876I96293j1807j0780j0533j0099r006p759p005o755o404n343l732k684l127
62863I01259m460n066m396l654m016n116n959o366o560o096m552k902k681l728
62849H35707m051k417p6Q19k33j729j988o79J303K896L753M261M817N228N081
$$ plain form
62932 2385104 2417638 2449905 2482382 2514478 2545245 2574324 2601328 2625066 2644130 2657611 2664625
62921 2664625 2663924 2654825 2637980 2614459 2584435 2547319 2502720 2450773 2392189 2328729 2263048 2197218
62909 2197218 2131617 2065810 2000097 1935607 1873440 1814559 1760089 1710788 1666313 1625572 1587411
62898 1587411 1550400 1512779 1473859 1435148 1398835 1365328 1333441 1302736 1274062 1247597 1222025
62887 1222025 1196324 1171011 1146783 1123171 1099702 1077390 1057715 1040631 1024859 1009863 996293
62876 996293 984486 973706 963173 953074 944068 936309 929304 922549 916145 910802 907070 904386 901259
62863 901259 896799 891733 887337 883683 879667 874551 868592 862226 855666 849570 845018 842116 839435 835707
62849 835707 831656 829239 829163 829982 829749 828020 826032 825353 826656 829552 833305 837566 842383 847611 852692
62834H52692M557M236M059L207J442j51m56O9L8q45j345n31Q56J305K32j669l345
62817H64351m156m136l946m369n385o114n974n445n140m760l875l190l678m675
62803G99508m358k444p82n76n91O78K381K510R28o43j285j663k098j729k59R98
62787G90575P72m22j140r50o39r77j923k817k933k068q69k38l12n32o87j120j759
62770G71961j913j407r17p10k6J575L257M139M579N191N540N053M477M980O187
62755H11966O592N804N033N249O122O868P085O672N991O098P650R556J0113R641
62741I10440J0374J3165J5892J6237J4696J3528J3786J4852J6325J8588K1577
62730A079460K4412K6665K8974L1954L5283L8342M1281M4906M9591N4673N8990
$$ plain form
62834 852692 857249 861485 865544 868751 870193 870042 869586 869655 869693 868848 867503 866972 867828 869133 869365 867696 864351
62817 864351 860195 856059 852113 847744 842359 836245 830271 824826 819686 814926 811051 807861 804183 799508
62803 799508 795150 792706 791924 791348 790757 791435 793816 796326 797254 796611 795326 793663 791565 789836 789577 790575
62787 790575 791347 790925 789785 788835 788196 787219 785296 782479 779546 777478 776609 776371 776059 775527 774840 773720 771961
62770 771961 770048 768641 767724 767014 766988 768563 771820 775959 780538 785729 791269 796322 800799 805779 811966
62755 811966 818558 824362 829395 834644 840766 847634 854719 861391 867382 873480 881130 890686 900799 910440
62741 910440 920814 933979 949871 966108 980804 994332 1008118 1022970 1039295 1057883 1079460
62730 1079460 1103872 1130537 1159511 1191465 1226748 1265090 1306371 1351277 1400868 1455541 1514531
62719A514531O2018O4368O6924O9578P1226P1219P0098O8391O5366O0018N2963
62708B236700M6009L9585L1835K1056Q089m703j6230k7197l8012m7576n4664n9563
62696B135329o3546o7205o9973p0997o9960o7325o4218o1781o0018n7685n3933
62685A428688m9653m6211m3325l9572l5002l1556l0215k9275k6645k2789j9850
62674A054595j8514j7330j5039j2153r874q476p211n232k363O51K631L170L156
62661I68011L675M752N907P334R498J1881J3496J4601J6429J9030K0972K1731
62649A117317K2910K5971L0020L3115L5077L7642M2037M7504N2258N5312N7332
62638A556495O0038O4522O9838P3665P4754P4144P3468P2710P0486O5951N9410
$$ plain form
62719 1514531 1576549 1640917 1707841 1777419 1848645 1919864 1989962 2058353 2123719 2183737 2236700
62708 2236700 2282709 2322294 2354129 2375185 2383274 2378571 2362341 2335144 2297132 2249556 2194892 2135329
62696 2135329 2071783 2004578 1934605 1863608 1793648 1726323 1662105 1600324 1540306 1482621 1428688
62685 1428688 1379035 1332824 1289499 1249927 1214925 1183369 1153154 1123879 1097234 1074445 1054595
62674 1054595 1036081 1018751 1003712 991559 981685 973209 965998 960766 958403 959054 961685 964855 968011
62661 968011 971686 976438 982345 989679 999177 1011058 1024554 1039155 1055584 1074614 1095586 1117317
62649 1117317 1140227 1166198 1196218 1229333 1264410 1302052 1344089 1391593 1443851 1499163 1556495
62638 1556495 1616533 1681055 1750893 1824558 1899312 1973456 2046924 2119634 2190120 2256071 2315481
62627B315481N1178M1020K8931J5795K818r313k0642l1587m2474n3015o2198o8884
62615B167110p2651p4032p4110p3914p3783p3070p0727o6494o1315n6399n2314
62604A418301m9117m6709m4624m2088l8885l5650l2758k9631k6011k3112k2242
62593A027474k2593k1878j9250j6288j4747j4544j4535j4156j3554j2798j1738
62582H51393j0247q057n007j907m41j333l143l800l023k206k176k311j989j699
62568H04054k043k615k773k855l537m185l146m5L164M298L493K802L459M527M592
62553H09190L839L658M583N646N941N935O591P797Q554Q684R344J1418J4219J6508
62539I21907J8229K0262K2739K4809K6201K7840L0382L3086L4829L5444L5193
$$ plain form
62627 2315481 2366659 2407679 2436610 2452405 2455223 2445910 2425268 2393681 2351207 2298192 2235994 2167110
62615 2167110 2094459 2020427 1946317 1872403 1798620 1725550 1654823 1588329 1527014 1470615 1418301
62604 1418301 1369184 1322475 1277851 1235763 1196878 1161228 1128470 1098839 1072828 1049716 1027474
62593 1027474 1004881 983003 963753 947465 932718 918174 903639 889483 875929 863131 851393
62582 851393 841146 833089 828082 826175 825734 824401 821258 817458 814435 812229 810053 807742 805753 804054
62568 804054 802011 799396 796623 793768 790231 786046 782900 782855 786019 790317 793810 796612 800071 804598 809190
62553 809190 813029 816687 821270 826916 832857 838792 845383 853180 861734 870418 879762 891180 905399 921907
62539 921907 940136 960398 983137 1007946 1034147 1061987 1092369 1125455 1160284 1195728 1230921
62528A230921L3722L0668K6732K3049J9674J5778J1079N931K16o401j3081j8047
62516A360241k0725k2409k4373k6505k8355l0159l1908l2474l0934k8102k5624
62505A058673k4049k2706k1144j9714j8899j8767j8777j7746j4645j0204p017
62494H65005o929q767r750q749o877n094k881J58K715K922P79j437j345J176M006
62479H24932N148M720M189M053L418K069J536L131N930P897Q404Q491R210J0955
62465I04083J3911J7674K0737K1977K2505K4478K8029L1185L3084L5221L8687
62454A191571M2100M3764M4489M6530N0417N4422N6765N7025N5507N2584M8789
62443A743963M4627M0013L4620K8797K3431J8814J4489J0517Q081Q218J0314J2718
$$ plain form
62528 1230921 1264643 1295311 1322043 1345092 1364766 1380544 1391623 1397554 1397770 1391369 1378288 1360241
62516 1360241 1339516 1317107 1292734 1266229 1237874 1207715 1175807 1143333 1112399 1084297 1058673
62505 1058673 1034624 1011918 990774 971060 952161 933394 914617 896871 882226 872022 865005
62494 865005 858076 849309 839559 830810 823933 818839 815958 816116 818831 821753 822532 821095 819750 820926 824932
62479 824932 830080 834800 838989 843042 846460 848529 850065 853196 859126 867023 875427 883918 893128 904083
62465 904083 917994 935668 956405 978382 1000887 1025365 1053394 1084579 1117663 1152884 1191571
62454 1191571 1233671 1277435 1321924 1368454 1418871 1473293 1530058 1587083 1642590 1695174 1743963
62443 1743963 1788590 1828603 1863223 1892020 1915451 1934265 1948754 1959271 1967352 1975570 1985884 1998602
62431A998602J4820J7782K2848K9459L5773M0802M5184M9613N3585N6260N7641
62420B422369N7731N5181M8323L7629K5816J5090N280n028j6680k9771m3924n7773
62408B514243o9115p6753q1754q5857q9159r0409q9170q6360q2668p7735p1367
62397A613896o4605n8829n4267m9924m4884l9254l3875k9361k5574k2129j9165
62386A172029j7249j6274j5013j2323q646n680m459m236l512j767N8O26n00k530
62372A080524m268n244o017p294q940j0127j0471j0545j1023j1635j1483j0388
62360I73089r411r685j0933j1624j0617q432o614o126o587o920o446n276l921
62347H70497k738j749q04J71J160K116K887L231L210L437M493N960O646O056N178
$$ plain form
62431 1998602 2013422 2031204 2054052 2083511 2119284 2160086 2205270 2254883 2308468 2364728 2422369
62420 2422369 2480100 2535281 2583604 2621233 2647049 2662139 2667419 2662391 2645711 2615940 2572016 2514243
62408 2514243 2445128 2368375 2286621 2200764 2111605 2021196 1932026 1845666 1762998 1685263 1613896
62397 1613896 1549291 1490462 1436195 1386271 1341387 1302133 1268258 1238897 1213323 1191194 1172029
62386 1172029 1154780 1138506 1123493 1111170 1102524 1096844 1092385 1088149 1084637 1082870 1082928 1083554 1083054 1080524
62372 1080524 1076256 1071012 1064995 1057701 1048761 1038634 1028163 1017618 1006595 994960 983477 973089
62360 973089 963678 953993 943060 931436 920819 912387 905773 899647 893060 886140 879694 874418 870497
62347 870497 867759 866010 865206 865377 866537 868653 871540 874771 877981 881418 885911 891871 898517 904573 909751
62332I09751N344O653Q126R125R972J1168J2530J3317J2996J1875J1045J1528
62320A033430J3298J5435J7331J9121K0681K1118K0107J8996J9490K1645K4255
62309A244907K6867K9946L3220L5459L6531L8152M1843M7091N2329N6991O1671
62298A705007O6877P2340P7302Q0912Q2518Q1954P9316P4385O6789N6788M5331
62287B489519L3329K1527J0895J955o335j5599k5544l3950l9824m4916n0842n6167
62275B284048n8198n6753n4297n2719n1692n0160m7863m5192m2743m1217m0754
62264A742460m0439l9416l8268l8128l8596l8042l6137l4567l4601l5243l4573
62253A334450l1998k8393k4756k1628j9265j7593j6145j4460j2468j0346q403
$$ plain form
62332 909751 915095 921748 929874 938999 948971 960139 972669 985986 998982 1010857 1021902 1033430
62320 1033430 1046728 1062163 1079494 1098615 1119296 1140414 1160521 1179517 1199007 1220652 1244907
62309 1244907 1271774 1301720 1334940 1370399 1406930 1445082 1486925 1534016 1586345 1643336 1705007
62298 1705007 1771884 1844224 1921526 2002438 2084956 2166910 2246226 2320611 2387400 2444188 2489519
62287 2489519 2522848 2544375 2555270 2557225 2550890 2535291 2509747 2475797 2435973 2391057 2340215 2284048
62275 2284048 2225850 2169097 2114800 2062081 2010389 1960229 1912366 1867174 1824431 1783214 1742460
62264 1742460 1702021 1662605 1624337 1586209 1547613 1509571 1473434 1438867 1404266 1369023 1334450
62253 1334450 1302452 1274059 1249303 1227675 1208410 1190817 1174672 1160212 1147744 1137398 1128995
62242A128995p127o833p011o497m610j720J316L842N452O113O362O813P326P416
62228A139837P533Q862J1458J3672J4206J3855J4338J6128J8326K0073K1004K0897
62216A320189K0018J9530K0418K2057K3011K3155K3770K5425K7082K7905K8622
62205A581182L0287L2597L4643L6711M0092M5191N0868N5871O0090O4168O8484
62194B100184P2761P6114P7135P4507O8014N8744M7990L6304K3922J1551J21j0084
62182B637263j9380k7880l5441m2540n0352n9393o8387p5099p8238p8210p6152
62171B026191p2776o8257o2805n6927n1231m6212m2166l9020l6264l3386l0459
62160A486688k7981k5963k3650k0568j7406j5112j3426j1346q973p655p852q110
$$ plain form
62242 1128995 1121868 1115035 1108024 1101527 1096917 1095197 1096513 1100355 1105807 1111920 1118282 1125095 1132421 1139837
62228 1139837 1147370 1156232 1167690 1181362 1195568 1209423 1223761 1239889 1258215 1278288 1299292 1320189
62216 1320189 1340207 1359737 1380155 1402212 1425223 1448378 1472148 1497573 1524655 1552560 1581182
62205 1581182 1611469 1644066 1678709 1715420 1755512 1800703 1851571 1907442 1967532 2031700 2100184
62194 2100184 2172945 2249059 2326194 2400701 2468715 2527459 2575449 2611753 2635675 2647226 2647347 2637263
62182 2637263 2617883 2590003 2554562 2512022 2461670 2402277 2333890 2258791 2180553 2102343 2026191
62171 2026191 1953415 1885158 1822353 1765426 1714195 1667983 1625817 1586797 1550533 1517147 1486688
62160 1486688 1458707 1432744 1409094 1388526 1371120 1356008 1342582 1331236 1322263 1314608 1306756 1298646
62148A298646p061n319m098k962o50K330L955L710L542N108P717R792J1076J2289
62134A338075J3671J4999J6342J7688J8447J8262J7729J7459J7165J6734J7295
62123A523866J9737K2642K3320K0924J7279J4624J3764J4500J6378J8542K0041
62112A725617K0938K2399K5322K9586L4722M0285M5324M8756N0976N3851N7982
62101B155758O0823N8819N1251M1003L1566K4102J7383R814J042p994j6208k3359
62089B404000k9836l5575l9892m2602m4675m7028m9049m9135m6792m3464m0998
62078A934954l9736l8478l5954l1974k7416k3451k0769j9131j7606j5535j3394
62067A651510j2342j2677j3127j2213j0129q477q031p535n341j601J986M382O197
$$ plain form
62148 1298646 1291585 1286266 1282168 1279206 1278556 1280886 1284841 1288551 1292093 1297201 1304918 1314710 1325786 1338075
62134 1338075 1351746 1366745 1383087 1400775 1419222 1437484 1455213 1472672 1489837 1506571 1523866
62123 1523866 1543603 1566245 1589565 1610489 1627768 1642392 1656156 1670656 1687034 1705576 1725617
62112 1725617 1746555 1768954 1794276 1823862 1858584 1898869 1944193 1992949 2043925 2097776 2155758
62101 2155758 2216581 2275400 2326651 2367654 2399220 2423322 2440705 2450519 2451561 2443567 2427359 2404000
62089 2404000 2374164 2338589 2298697 2256095 2211420 2164392 2115343 2066208 2019416 1975952 1934954
62078 1934954 1895218 1856740 1820786 1788812 1761396 1737945 1717176 1698045 1680439 1664904 1651510
62067 1651510 1639168 1626491 1613364 1601151 1591022 1582545 1574514 1566979 1561638 1560037 1562023 1566405 1572602
62054A572602Q300J0231J0537Q352M217m54m339o704p486p162o467n943n658n558
62040A564468o109q161j1731j5281j6884j6132j4163j1806q685m492j03L358N819
62027A460098P781R287J0372J1841J4321J6969J8555J9574K1676K4902K7218K7407
62015A670001K6998K8302L1500L4731L6426L6659L6491L6835L7782L8692L9129
62004B053546L9641M1012M2603M2356L8910L2863K5535J7505R097J173n753j2403
61992B326085j9546k6469l1968l6477m1602m7625n2959n6410n8589o0426o1460
61981A832554o0557n7758n4494n2138n0801m9445m6893m2903l8391l4331l0603
61970A314240k6532k2505j9984j9373j8936j6887j3925j2398j3088j4246j4167
$$ plain form
62054 1572602 1580902 1591133 1601670 1610022 1614239 1613785 1609446 1602742 1595256 1588094 1581627 1575684 1570026 1564468
62040 1564468 1558359 1550198 1538467 1523186 1506302 1490170 1476007 1464201 1455516 1451024 1450921 1454279 1460098
62027 1460098 1467879 1477166 1487538 1499379 1513700 1530669 1549224 1568798 1590474 1615376 1642594 1670001
62015 1670001 1696999 1725301 1756801 1791532 1827958 1864617 1901108 1937943 1975725 2014417 2053546
62004 2053546 2093187 2134199 2176802 2219158 2258068 2290931 2316466 2333971 2343068 2344241 2338488 2326085
61992 2326085 2306539 2280070 2248102 2211625 2170023 2122398 2069439 2013029 1954440 1894014 1832554
61981 1832554 1771997 1714239 1659745 1607607 1556806 1507361 1460468 1417565 1379174 1344843 1314240
61970 1314240 1287708 1265203 1245219 1225846 1206910 1190023 1176098 1163700 1150612 1136366 1122199
61959A122199j3388j3401j4034j3540j1096q060o380o645q068r552j0137q992
61947I98906o000k265O98K297K915K886K341K079L287N823P638O865L914O63j884
61932A030163l983n596o061n612n737p180q659q753q270r213j1663j3311j2488
61919I23637j0336r018q874q455o862m753l179k536k828l855m719m076j698Q27
61905H53275J792J513J856L728N851O409N313M186M273N122N648N959P240R725
61891I21890J1908J2508J2484J3887J7055K0379K2976K5827K9565L2718L3609
61880A154806L2962L2966L4353L6074L7525L9254M1231M2235M1612M0293L9108
61869A572419L7297L3788K9147K4983K1701J7975J2557N860m79n140p929r374
$$ plain form
61959 1122199 1108811 1095410 1081376 1067836 1056740 1048680 1042300 1035655 1027587 1018035 1007898 998906
61947 998906 992906 990641 991339 993636 996551 999437 1001778 1003857 1007144 1012967 1020605 1027470 1031384 1032047 1030163
61932 1030163 1026180 1020584 1014523 1008911 1003174 995994 987335 978582 970312 961099 949436 936125 923637
61919 923637 913301 904283 895409 886954 880092 875339 872160 869624 866796 862941 858222 854146 852448 853275
61905 853275 855067 856580 858436 862164 868015 874424 879737 883923 888196 893318 898966 904925 912165 921890
61891 921890 933798 946306 958790 972677 989732 1010111 1033087 1058914 1088479 1121197 1154806
61880 1154806 1187768 1220734 1255087 1291161 1328686 1367940 1409171 1451406 1493018 1533311 1572419
61869 1572419 1609716 1643504 1672651 1697634 1719335 1737310 1749867 1755727 1755248 1750108 1742179 1732805
61857A732805r839r202p333m581j565J450M718Q605J3153J7793K1301K2477K1430
61844A811212J9868J9395J9570J8265J3924P023m84o583j0368j2674j5405j9494
61832A844249k3713k6320k7364k8146k8739k7892k5601k3791k3664k4023k3445
61821A561551k2588k2871k3963k4244k3290k2234k1890k1799k1176j9756j7574
61810A320166j4741j1542q242m799j197K213N136P846J0810J4164J7792K1499
61798A359105K4802K7396L0227L4972M1657M7913N1728N3904N6391N9228O0994
61787A848317O1566O2082O2276O0099N4710M7830M1277L4726K7012J8356R934
61776B328185K197n067j1474j5975j7991j7720j5451j1273n601O12O322J0925
$$ plain form
61857 1732805 1722966 1713764 1706431 1701850 1700285 1701735 1706453 1715058 1728211 1746004 1767305 1789782 1811212
61844 1811212 1831080 1850475 1870045 1888310 1902234 1909257 1908773 1902190 1891822 1879148 1863743 1844249
61832 1844249 1820536 1794216 1766852 1738706 1709967 1682075 1656474 1632683 1609019 1584996 1561551
61821 1561551 1538963 1516092 1492129 1467885 1444595 1422361 1400471 1378672 1357496 1337740 1320166
61810 1320166 1305425 1293883 1285641 1280842 1279645 1281858 1286994 1294840 1305650 1319814 1337606 1359105
61798 1359105 1383907 1411303 1441530 1476502 1518159 1566072 1617800 1671704 1728095 1787323 1848317
61787 1848317 1909883 1971965 2034241 2094340 2149050 2196880 2238157 2272883 2299895 2318251 2328185
61776 2328185 2330382 2325315 2313841 2297866 2279875 2262155 2246704 2235431 2229830 2230442 2236764 2247689
61764B247689J4245J6163J6150J3372P487n76r018j6526k3108k9610l6578m3538
61752B156152m9149n2241n3000n2929n3259n3692n3114n1276m9043m7200m5720
61741A595529m4124m1960l9026l5756l3198l1833l0645k8189k4436k0640j7599
61730A248123j5232j3714j3445j3600j2418r678p509p696r359j0394j0157r385
61718A115536q301o442m102k425j903j813j320k96J030K504L930N142O325P781
61704A115646R448J1080J2733J4530J6027J6543J5988J4737J2756R781O380L750
61692A259399K066N7l174o652q835r790j0936j2875j4662j5486j5827j6345j6490
61679A130450j5281j2997j0976r810q822p556o718o982p637p223n174k280J14
$$ plain form
61764 2247689 2261934 2278097 2294247 2307619 2315106 2314530 2305512 2288986 2265878 2236268 2199690 2156152
61752 2156152 2107003 2054762 2001762 1948833 1895574 1841882 1788768 1737492 1688449 1641249 1595529
61741 1595529 1551405 1509445 1470419 1434663 1401465 1369632 1338987 1310798 1286362 1265722 1248123
61730 1248123 1232891 1219177 1205732 1192132 1179714 1170036 1162527 1154831 1145472 1135078 1124921 1115536
61718 1115536 1107235 1100793 1096691 1094266 1092363 1090550 1089230 1088934 1089964 1092468 1096398 1101540 1107865 1115646
61704 1115646 1125094 1136174 1148907 1163437 1179464 1196007 1211995 1226732 1239488 1249269 1255649 1259399
61692 1259399 1261465 1261522 1258348 1251696 1242861 1233071 1222135 1209260 1194598 1179112 1163285 1146940 1130450
61679 1130450 1115169 1102172 1091196 1081386 1072564 1065008 1058290 1051308 1043671 1036448 1031274 1028994 1029108
61666A029108Q85k70k186k643m94K758M448L680J873N33k33q65j389j904k913
61651A030388m321n036m397l379l466m876o676q143r081r273q653p885p781q130
61637I39291p870o604n193m687n204o138o978p600q065q392q530q382p840o750
61623H41058m989k842j192r09j898l231m280n038n230m110j804P5K20n47l69J054
61607H05968K265K240J545J092R27Q03R71J748K904M044N141O190O787O603N977
61592H55205N600N707N866N448M191K630K023L314N922P968Q053O549M835L649
61578I26960K713J714J002J048J455R03j525m987p261p008n406m852o156p793
61564H90807q050o974n830n504o106p353q526q546p064n227m522n107o050o849
$$ plain form
61666 1029108 1029993 1029723 1027537 1024894 1024400 1027158 1031606 1035286 1037159 1037692 1037459 1036594 1035205 1033301 1030388
61651 1030388 1026067 1021031 1016634 1013255 1009789 1004913 998237 990094 981013 971740 963087 955202 947421 939291
61637 939291 931421 924817 919624 914937 909733 903595 896617 889017 880952 872560 864030 855648 847808 841058
61623 841058 836069 833227 832035 831126 829228 825997 821717 816679 811449 807339 805535 805610 805830 805283 804914 805968
61607 805968 808233 810473 812018 813110 814037 814840 815811 817559 820463 824507 829648 835838 842625 849228 855205
61592 855205 860805 866512 872378 877826 882017 884647 886670 889984 895906 903874 911927 918476 923311 926960
61578 926960 929673 931387 932389 933437 934892 935795 934270 929283 922022 915014 909608 904756 898600 890807
61564 890807 882757 875783 869953 864449 858343 850990 842464 833918 826854 821627 817105 811998 805948 799099
61550G99099p635q075p430n999n217n747o513o467o301p333r284j0426r801q168
61536F94703o718n855n438n338n333n119m850n057n663n647m228j932P8J341K161
61521F37105K648K483J515j1j789l409m075l172j211N17J450K181L108L526K725
61506F43591J284M23M81R28J546K537L553L728K997K417K622K738J636k69j279
61491F68933m44J425K906L580M130N031N636M856K722O47k38m79j169j756m41
61476F95339K886N688N881M716M825O182O170L702R66K11O77K27j299k129j358
61461G32684o5K93o05k084l179l255k704k762l793m270k707r7J228R53J041K233
61445G12911K654J033o23M91M016O959P541O611N499M466L615L564M448N263M971
$$ plain form
61550 799099 791464 783389 775959 769960 764743 758996 752483 746016 739715 732382 723098 712672 702871 694703
61536 694703 687985 682130 676692 671354 666021 660902 656052 650995 645332 639685 635457 633525 633603 634944 637105
61521 637105 639753 642236 643751 643740 641951 638542 634467 631295 630084 630601 632051 634232 637340 640866 643591
61506 643591 644875 645298 645779 646707 648253 650790 654343 658071 661068 663485 666107 668845 670481 670212 668933
61491 668933 668489 669914 672820 676400 680530 685561 691197 696053 698775 699422 699184 698705 697536 695780 695339
61476 695339 698225 703913 709794 714510 719335 725517 731687 735389 736355 736566 737243 737470 736171 734042 732684
61461 732684 732619 732912 732307 730223 727044 723789 721085 718323 714530 710260 707553 707456 708684 709637 710678 712911
61445 712911 715565 716598 715975 716466 720482 727441 734982 741593 747092 751558 755173 758737 763185 768448 773419
61430G73419L624K017Q69O13J312K435L259L677M051M281L859L010K708L160L317
61415H15611K466J401J169J426J015k74j479j737r25O83K563L817L736K544J026
61400H33042m85k050l271l426k579j709j371j041j97O51P43L68O00J768K960L120
61384H27123K191R63K46M65J724L658N284N554M417L084K773L304L449K654J848
61369H68737K176L425M279L994L158K766L056L565L907M104M220M092L575K946
61355I18000K803L349L833L027O42k050l497l589l542l950l982k980j937k168
61341I03959l054k556k28J836J725J45r89j241j411j301J85K672M063L345J987
61326I09137J507J309L95k56R90L486M913M707M665N877P124P185O864P405Q357
$$ plain form
61430 773419 777043 779060 779929 780542 781854 784289 787548 791225 795276 799557 803416 806426 809134 812294 815611
61415 815611 818077 819478 820647 822073 823088 822814 821335 819598 818673 819356 821919 825736 829472 832016 833042
61400 833042 832557 830507 827236 823810 821231 819522 818151 817110 816913 817564 818307 818675 819275 821043 824003 827123
61384 827123 829314 830277 830523 830988 832712 836370 841654 847208 851625 854709 857482 860786 864235 866889 868737
61369 868737 870913 874338 878617 882611 885769 888535 891591 895156 899063 903167 907387 911479 915054 918000
61355 918000 920803 924152 927985 931012 931654 929604 926107 922518 918976 915026 911044 908064 906127 903959
61341 903959 900905 898349 898121 899957 901682 901827 900838 899597 898186 896885 897070 899742 903805 907150 909137
61326 909137 910644 911953 912348 912092 913082 916568 921481 926188 930853 936730 943854 951039 957903 965308 973665
61311I73665Q449P773P485P825P871P125O127N429M981M674M683N072N662O380
61297A063201P163P578P071N779M645M564N755P776R856J1396J2420J3333J3866
61284A174403J2844R810O316M514M622M932M327L413K773J601r36l908n471n219
61270A214021m607n084o497p584p478o575o037o534p411p340n795l536j549m3
61256A137951J250K349L126L714M355N128O221Q062J0624J3131J5045J6781J8614
61243A246351J9408J7784J4386J1472R918Q029M175n53l643m480n008o998r808
61230A301033j1284j0290p860n981n562n745n269m222l840m561n106m092j892
61217A225329MJ043J962L164L997M017L938M667O010P091P640Q253R498J1315
$$ plain form
61311 973665 982114 989887 997372 1005197 1013068 1020193 1026320 1031749 1036730 1041404 1046087 1051159 1056821 1063201
61297 1063201 1070364 1077942 1085013 1090792 1095437 1100001 1105756 1113532 1123388 1134784 1147204 1160537 1174403
61284 1174403 1187247 1197057 1203373 1207887 1212509 1217441 1221768 1225181 1227954 1229555 1228619 1224711 1219240 1214021
61270 1214021 1209414 1204330 1197833 1190249 1182771 1176196 1170159 1163625 1156214 1148874 1143079 1139543 1137994 1137951
61256 1137951 1139201 1141550 1144676 1148390 1152745 1157873 1164094 1172156 1182780 1195911 1210956 1227737 1246351
61243 1246351 1265759 1283543 1297929 1309401 1319319 1327348 1331523 1330970 1327327 1322847 1317839 1310841 1301033
61230 1301033 1289749 1279459 1271599 1265618 1260056 1254311 1249042 1244820 1240980 1236419 1231313 1227221 1225329
61217 1225329 1225333 1226376 1228338 1231502 1235499 1239516 1243454 1248121 1254131 1261222 1268862 1277115 1286613 1297928
61203A297928J3152J4420J4997J5529J6881J8938K0323J9764J7515J4865J2559
61192A476871J0313P784N181K708N4l110o449r113j0545j0973j1157j1721j2620
61179A427223j3254j3109j2204j0863r339p899p049p161p845q046o996m976l046
61166A315436k017j699j156J70J675K208J474L83j00J14P22J689K914L779L942
61151A329534M066M867N660N010K812O81l5M00J154K243M132O597Q828J0576J2462
61136A398987J5086J8148K0612K1736K1794K1551K0981J9036J5199J0726P452
61125A591308N608L765R86k037m131m992m973m520m321n197p303r978j2661j5131
61111A526423j6695j6335j4317j2593j2690j4095j5378j5982j6048j5539j4708
$$ plain form
61203 1297928 1311080 1325500 1340497 1356026 1372907 1391845 1412168 1431932 1449447 1464312 1476871
61192 1476871 1487184 1494968 1500149 1502857 1502911 1499801 1493352 1484239 1473694 1462721 1451564 1439843 1427223
61179 1427223 1413969 1400860 1388656 1377793 1368454 1360555 1353506 1346345 1338500 1330454 1323458 1318482 1315436
61166 1315436 1313419 1311720 1310564 1310734 1312409 1314617 1316091 1316474 1316374 1316488 1317210 1318899 1321813 1325592 1329534
61151 1329534 1333600 1338467 1344127 1349137 1351949 1352630 1352595 1352995 1354149 1356392 1360524 1367121 1375949 1386525 1398987
61136 1398987 1414073 1432221 1452833 1474569 1496363 1517914 1538895 1557931 1573130 1583856 1591308
61125 1591308 1596916 1600681 1601667 1599630 1595499 1590507 1585534 1581014 1576693 1571496 1564193 1554215 1541554 1526423
61111 1526423 1509728 1493393 1479076 1466483 1453793 1439698 1424320 1408338 1392290 1376751 1362043
61100A362043j4499j5158j5308j3801j1748j0991j1149j0070p027l561r64J144
61088A248911L225M554M323K756M29k429n313p351q499r660j0861j0594q035m787
61074A196669l033k720j978M9K261L538M338N858Q325J0705J2039J2753J4299
61061A263103J7258K0172K1161K0581K0850K3241K6092K7128K6342K5377K4949
61050A516254K4487K3838K3673K4205K4836K5153K4958K3366J9415J3884R004
61039A753073N738K639j837p202j1983j5717j8665k0524k0808k0008j9086j8193
61027A607427j6949j5579j4492j3133j0724p952o310n715m455j946K97J238K080
61014A513787M108O232O666O193P542J1553J6006J8696J9853K0686K1121K0526
$$ plain form
61100 1362043 1347544 1332386 1317078 1303277 1291529 1280538 1269389 1259319 1252292 1248731 1247767 1248911
61088 1248911 1252136 1256690 1261013 1263769 1264198 1261769 1256456 1249105 1240606 1230946 1220085 1209491 1201456 1196669
61074 1196669 1193636 1190916 1188938 1188987 1191248 1194786 1199124 1204982 1213307 1224012 1236051 1248804 1263103
61061 1263103 1280361 1300533 1321694 1342275 1363125 1386366 1412458 1439586 1465928 1491305 1516254
61050 1516254 1540741 1564579 1588252 1612457 1637293 1662446 1687404 1710770 1730185 1744069 1753073
61039 1753073 1758811 1761450 1759613 1752411 1740428 1724711 1706046 1685522 1664714 1644706 1625620 1607427
61027 1607427 1590478 1574899 1560407 1547274 1536550 1528598 1522288 1516573 1512118 1510172 1510469 1511707 1513787
61014 1513787 1517895 1524127 1530793 1536986 1544528 1556081 1572087 1590783 1610636 1631322 1652443 1672969
61002A672969J9701K0482K3442K7308L0782L3831L6774L9245M0783M1904M3578
60991B030799M5911M8208N0280N2813N6221N9894O3090O5914O8879P2066P5441
60980B689516P9521Q4782R0697R6240J01243J06292J11560J16823J22583J29667
60970C728924J37553J44585J50398J56655J64599J73364J81676J89653J97701
60961E225108K05182K11875K19467K29592K41656K54767K70763K92559L19862
60952G470831L49390L79515M12362M51197M98200N55034O23173P03298P96615
60943A2239615R06556J036625J187718J361652J565674J806290K078603K370862
60935B4553595K678403K989878L238508L282358K979818K319281J470155O84744
$$ plain form
61002 1672969 1692670 1713152 1736594 1763902 1794684 1828515 1865289 1904534 1945317 1987221 2030799
60991 2030799 2076710 2124918 2175198 2228011 2284232 2344126 2407216 2473130 2542009 2614075 2689516
60980 2689516 2769037 2853819 2944516 3040756 3141999 3248291 3359851 3476674 3599257 3728924
60970 3728924 3866477 4011062 4161460 4318115 4482714 4656078 4837754 5027407 5225108
60961 5225108 5430290 5642165 5861632 6091224 6332880 6587647 6858410 7150969 7470831
60952 7470831 7820221 8199736 8612098 9063295 9561495 10116529 10739702 11443000 12239615
60943 12239615 13146171 14182796 15370514 16732166 18297840 20104130 22182733 24553595
60935 24553595 27231998 30221876 33460384 36742742 39722560 42041841 43511996 44196740
60927D4196740J41412j20706j45286P665K47336M09007K95236j94552r72950j814674
60917D2049228k501713k929317l104096l082152k924040k685119k413992k144908
60909B0263891j894686j669355j470511j295918j140913j003244q84365p84657
60901A0120242p00338o26927n63188n09581m64741m25645l89974l56671l25199
60892E757978k95669k68892k45095k23480k03791j87251j74844j65747j58406
60883C834803j52130j46593j40868j34304j27416j20683j13412j05218r7673r2615
60873B603891q9258q4924p8737p2720o8639o5280o0156n3068m6649m3268m2379
60862A898813m1429l8902l5540l2669l0323k7746k4943k2563k0583j8405j6247
$$ plain form
60927 44196740 44338152 44217446 44072160 44079825 44327161 44736168 45031404 44836852 43863902 42049228
60917 42049228 39547515 36618198 33514102 30431950 27507910 24822791 22408799 20263891
60909 20263891 18369205 16699850 15229339 13933421 12792508 11789264 10904899 10120242
60901 10120242 9419904 8792977 8229789 7720208 7255467 6829822 6439848 6083177 5757978
60892 5757978 5462309 5193417 4948322 4724842 4521051 4333800 4158956 3993209 3834803
60883 3834803 3682673 3536080 3395212 3260908 3133492 3012809 2899397 2794179 2696506 2603891
60873 2603891 2514633 2429709 2350972 2278252 2209613 2144333 2084177 2031109 1984460 1941192 1898813
60862 1898813 1857384 1818482 1782942 1750273 1719950 1692204 1667261 1644698 1624115 1605710 1589463
60851A589463j5135j5131j4847j3299j1209r827r393r511j0095j1012j1512j1009
60839A447483j0026r541r852j0696j1988j3662j5185j6034j6387j6803j7573j8720
60827A281016j9997k0432j8845j5727j3768j5124j8636k1058k0787j9039j7416
60816A080187j5943j4093j2392j1872j2392j2479j0949q207n755m659m663m801
60804I61982m440l491j898L42K588L794L797L718M527N751O186N511M463L693
60790I96523L200K734K210J664J232J096J136Q86J86n20r43j557k856m398n412
60775I95181o009o918q079q499p787o922p087q281r506r943r503q569p593o978
60761H83507o927p364p979q409q389p884p198o806o977p455p635p142o267n708
$$ plain form
60851 1589463 1574328 1559197 1544350 1531051 1519842 1510015 1500622 1491111 1481016 1470004 1458492 1447483
60839 1447483 1437457 1427916 1418064 1407368 1395380 1381718 1366533 1350499 1334112 1317309 1299736 1281016
60827 1281016 1261019 1240587 1221742 1206015 1192247 1177123 1158487 1137429 1116642 1097603 1080187
60816 1080187 1064244 1050151 1037759 1025887 1013495 1001016 990067 981860 976105 971446 966783 961982
60804 961982 957542 954051 952153 952495 955083 958877 962674 966392 970919 976670 982856 988367 992830 996523
60790 996523 999723 1002457 1004667 1006331 1007563 1008659 1009795 1010681 1010867 1010347 1009404 1007847 1004991 1000593 995181
60775 995181 989172 982254 974175 965676 957889 950967 943880 935599 926093 916150 906647 898078 890485 883507
60761 883507 876580 869216 861237 852828 844439 836555 829357 822551 815574 808119 800484 793342 787075 781367
60747G81367n835o351o784p104p590q206q396p541n488k812n92K98k5o01o94m06
60731G13240l0M84R75P70k47r22k62R58J304R52J404L001M312M251L294K226J120
60714G36830J06k35J53O34J180K457M073M392K942J378Q88L42j423l078k641q29
60698G47169k26j485k511j616L28J344O50r63k110j810k09J454K073J774J360
60683G45222J043M18o51j919l268m557n308n255m849m566m110l231k726l577n331
60668F97335o482o332n450m500l463k062j90J964L713M192L469K776K877K947
60654F90794J986N22k38k46j63L05K009M624O824P957Q121P003M366J561O48J763
60638G37836L008L089K498J846Q89k11m38L83R34L11n48l61O43J218O74p56k370
$$ plain form
60747 781367 775532 769181 762397 755293 747703 739497 731101 723560 718072 715260 714668 714966 714941 714340 713646 713240
60731 713240 713210 713694 714669 715439 715192 714270 714008 714966 716270 717222 718626 721627 725939 730190 733484 735710 736830
60714 736830 736936 736701 736854 737488 738668 741125 745198 749590 752532 753910 754798 755140 753717 750639 747998 747169
60698 747169 746943 745458 742947 741331 741659 743003 743653 742690 740580 738770 738561 740015 742088 743862 745222
60683 745222 746265 746683 746032 744113 740845 736288 730980 725725 720876 716310 712200 708969 706243 702666 697335
60668 697335 690853 684521 679071 674571 671108 669046 668856 670820 674533 678725 682194 684970 687847 690794
60654 690794 692780 693302 693064 692818 692655 692960 694969 699593 706417 714374 722495 729498 733864 735425 736073 737836
60638 737836 740844 743933 746431 748277 749166 748955 748517 748900 749834 750145 749597 749236 749879 751097 751771 751015 748645
60621G48645l155k284j46J738K332K049J801J837J893J734J128q7j566k722l580
60606G49617m682o114p308p883p687o232l311k22J101N33k1O63J684J834J321
60591G13293Q40L07l31k51J022K439K650J773Q54K29o01j839l141m108m432l939
60575G04765l054k611k724k458j325k17j74q67j136m62P71K018K907L283L285
60560G02001K936J656p97k875k426J00J494J02j546k42L314N777N973N741O205
60545G27413O070M272K068J224J665K145K217K352K721K934K792K608K811L555
60531G66847M631N656O515P480Q551Q852P374M412J632M71Q91J946K966L868M658
60516H36750N267N813O617P787R038J0111J1296J3167J5662J7791J8665J8546
$$ plain form
60621 748645 745490 743206 743060 744798 747130 749179 750980 752817 754710 756444 757572 757485 755919 753197 749617
60606 749617 744935 738821 731513 723630 715943 709711 706400 706178 707279 707812 707791 708454 710138 711972 713293
60591 713293 714133 714440 714109 713858 714880 717319 719969 721742 722596 722825 722224 720385 717244 713136 708704 704765
60575 704765 701711 699100 696376 693918 692593 692376 692202 691335 690199 689737 690508 692526 695433 698716 702001
60560 702001 704937 706593 705796 702921 700495 700595 702089 702191 700645 700403 703717 709494 715467 721208 727413
60545 727413 733483 737755 739823 741047 742712 744857 747074 749426 752147 755081 757873 760481 763292 766847
60531 766847 771478 777134 783649 791129 799680 808532 815906 820318 821950 822421 823312 825258 828224 832092 836750
60516 836750 842017 847830 854447 862234 871272 881383 892679 905846 921508 939299 957964 976510
60504I76510J8346J8364J8148J7573J7051J6472J4901J1819P972M406J372j234
60492A121700l031l578l137k218o97J880N424R313J2991J5983J7832J8796K0225
60479A211483K3344K7948L3005L8240M4047M9996N4452N5976N4310M9968M3521
60468A686290L5490K6284J6095N406m500j2284j7884k2313k5898k7630k6700k3962
60456A608394k1144j9028j6994j4185j0459o249j999K021N653Q933J2124J5552
60444A562619J9338K3453K8043L3583M0510M8756N7703O6466P4061P9652Q3032
60433B117216Q4743Q5197Q3769P9442P2456O4580N7461N1324M5798M1181L7984
60422B821151L5467L1543K4380J3663K34j5050l1849m9953o8591q6145j00500
$$ plain form
60504 976510 994856 1013220 1031368 1048941 1065992 1082464 1097365 1109184 1117156 1121562 1122934 1121700
60492 1121700 1118669 1115091 1111954 1109736 1109039 1110919 1116343 1125656 1138647 1154630 1172462 1191258 1211483
60479 1211483 1234827 1262775 1295780 1334020 1378067 1428063 1482515 1538491 1592801 1642769 1686290
60468 1686290 1721780 1748064 1764159 1769565 1765065 1752781 1734897 1712584 1686686 1659056 1632356 1608394
60456 1608394 1587250 1568222 1551228 1537043 1526584 1520335 1518336 1520357 1526010 1534943 1547067 1562619
60444 1562619 1581957 1605410 1633453 1667036 1707546 1756302 1814005 1880471 1954532 2034184 2117216
60433 2117216 2201959 2287156 2370925 2450367 2522823 2587403 2644864 2696188 2741986 2783167 2821151
60422 2821151 2856618 2888161 2912541 2926204 2926438 2911388 2879539 2829586 2760995 2674850 2574350
60411B574350j09837j13472j12313j08518j04086r9385r3433q5900p8125p1437
60401A597844o5246n8160n0570m4453m0546l7317l3332k9070k5624k3041k0958
60390A169527j9569j8769j7507j5376j3798j4017j4849j4218j2311j1114j1094
60379A006905j0584q770p132o969p317o670n459n253o170o734o184n465n595o091
60365I12512n781m560l393k767k061q58q3q94k791l855l073j414k08O35J980L634
60349H87023M200K773R6k058k487j515n32k78J30J965M739O397N870M291L107
60334I13721K326J659J995M083O560P238N963M430L369J976L80M91L251O630P799
60319I71871O438M616L993M318M504M075L391L126L635M572N119M751L676K363
$$ plain form
60411 2574350 2464513 2351041 2238728 2130210 2026124 1926739 1833306 1747406 1669281 1597844
60401 1597844 1532598 1474438 1423868 1379415 1338869 1301552 1268220 1239150 1213526 1190485 1169527
60390 1169527 1149958 1131189 1113682 1098306 1084508 1070491 1055642 1041424 1029113 1017999 1006905
60379 1006905 996321 987551 980419 973450 966133 959463 954004 948751 942581 935847 929663 924198 918603 912512
60365 912512 906731 902171 898778 896011 893950 893092 893009 892115 889324 885469 882396 880982 880774 881409 883389 887023
60349 887023 891223 893996 894092 892034 889547 888032 887500 887222 887352 889317 894056 900453 906323 910614 913721
60334 913721 916047 917706 919701 923784 930344 937582 943545 947975 951344 953320 953700 954191 957442 964072 971871
60319 971871 978309 982925 986918 991236 995740 999815 1003206 1006332 1009967 1014539 1019658 1024409 1028085 1030448
60305A030448J051P6J60J673L714M747M391M028N100P331R139R663R551R739J0280
60290A111091J0785J1120J1035R862P618N789N561N550L002k413p638r793r302
60277A152267q403p974p274o046n067m779m727m486m221m240m607n166n447m855
60263A074975l542k563k516k558j599J36J692K965M484O106P301Q423J0262J2393
60249A115959J3550J3732J4481J6675J9437K1719K3593K5212K5744K4361K1465
60238A335928J7888J3477P403l68q742j6468k2818k7379k9768k9698k7254k3151
60226A189050j8813j5747j4559j4618j4731j4095j2698j1138j0144r915r819q926
60214A033847o963m622l021k931m245n880o476n674m551m370n004n110l853j924
$$ plain form
60305 1030448 1031499 1031575 1031735 1033408 1037122 1041869 1046260 1050288 1055388 1062719 1071858 1081521 1091072 1100811 1111091
60290 1111091 1121876 1132996 1144031 1153893 1161511 1167300 1172861 1178411 1181413 1179000 1171362 1161569 1152267
60277 1152267 1143864 1135890 1128616 1122570 1117503 1112724 1107997 1103511 1099290 1095050 1090443 1085277 1079830 1074975
60263 1074975 1071433 1068870 1066354 1063796 1062197 1062333 1064025 1066990 1071474 1077580 1084881 1093304 1103566 1115959
60249 1115959 1129509 1143241 1157722 1174397 1193834 1215553 1239146 1264358 1290102 1314463 1335928
60238 1335928 1353816 1367293 1374696 1374328 1365586 1349118 1326300 1298921 1269153 1239455 1212201 1189050
60226 1189050 1170237 1154490 1139931 1125313 1110582 1096487 1083789 1072651 1062507 1052592 1042773 1033847
60214 1033847 1026884 1022262 1019241 1016310 1012065 1006185 999709 994035 989484 985114 980110 975000 971147 969223
60200I69223q02j242k549l243k498r98l6J77O50J840K665K038O46J49J029K261
60184I69310K929L068K916K367J495R19J206K200L073K994J930R75J361K897M003
60169A003643L796L421M399O346P428O790N386M569M760N498O005N836N594O756
60155A080227R981J3906J6362J6482J4942J2783J0953J0333J0919J1380J0673
60144A218941R615R467R593Q373O150N118N991O780N637L310J786J778K494K963
60130A297996K657J441l36k021l181l660l320k397j944k865m592n638n358m166
60116A262616k303J45K087K016J64j312r00O81J877K052J366N5j529k938m129
60101A259948n252n936n709n022m687m371k998o48J386K522L301L821L540K929
$$ plain form
60200 969223 968421 967179 964630 961387 958889 957891 957855 958032 958682 960522 963187 965225 965871 966020 967049 969310
60184 969310 972239 975307 978223 980590 982085 983004 984210 986410 989483 992477 994407 995382 996743 999640 1003643
60169 1003643 1007439 1010860 1015259 1021605 1029033 1035823 1041209 1045778 1050538 1056036 1062041 1067877 1073471 1080227
60155 1080227 1090208 1104114 1120476 1136958 1151900 1164683 1175636 1185969 1196888 1208268 1218941
60144 1218941 1228556 1238023 1247616 1255989 1262139 1267257 1273248 1280028 1285665 1288975 1290761 1292539 1295033 1297996
60130 1297996 1300653 1302094 1301758 1299737 1296556 1292896 1289576 1287179 1285235 1282370 1277778 1272140 1266782 1262616
60116 1262616 1260313 1260458 1262545 1264561 1264725 1263413 1262513 1263194 1265071 1267123 1268489 1268544 1267015 1264077 1259948
60101 1259948 1254696 1248760 1243051 1238029 1233342 1228971 1225973 1225325 1226711 1229233 1232534 1236355 1239895 1242824
60087A242824L444N253O720O786O142N466M362K863K182K914M087M924N825O774
60073A310566O798O093O567Q664R737P657M346L332N026O830P177P024P521Q417
60059A405755R050R450J0024J1062J2665J4522J5974J6656J6749J6252J4845J2813
60047A565817J1022R529P454M786K791J858O74j386k899k805k421l150l882k786
60033A584602m76Q33L95r74k884n285p142p475p237q084r850j1254j2458j4504
60019A498207j6740j7388j6590j6357j7301j7903j7425j7138j7830j8255j7153
60008A308127j5178j3824j3624j4072j4324j3500j1457r460q949r513r475q465
59996A166286p787p975p896o800n557m968m480l504k627k393k118r66O09J630
$$ plain form
60087 1242824 1246268 1251521 1258241 1265027 1271169 1276635 1280997 1283860 1286042 1288956 1293043 1297967 1303792 1310566
60073 1310566 1317364 1323457 1330024 1338688 1348425 1356082 1360428 1363760 1368786 1375616 1382793 1389817 1397338 1405755
60059 1405755 1414805 1424255 1434279 1445341 1458006 1472528 1488502 1505158 1521907 1538159 1553004 1565817
60047 1565817 1576839 1586368 1593822 1598608 1601399 1603257 1603931 1602545 1599646 1596841 1594420 1591270 1587388 1584602
60033 1584602 1584126 1584959 1585354 1584380 1581496 1576211 1569069 1561594 1554357 1546273 1536423 1525169 1512711 1498207
60019 1498207 1481467 1464079 1447489 1431132 1413831 1395928 1378503 1361365 1343535 1325280 1308127
60008 1308127 1292949 1279125 1265501 1251429 1237105 1223605 1212148 1202688 1193739 1184226 1174751 1166286
59996 1166286 1158499 1150524 1142628 1135828 1130271 1125303 1120823 1117319 1114692 1112299 1110181 1109215 1109824 1111454
59982A111454K002K275K612K828K901K809K301J373M19m25j432k427k610j824
59968A122256j251k068l936n481n903n476m874m577m855n807p297q944j0134j0189
59954A041464q880o765m714l133j880q09K1M99M92r4r67j594k043l048m703n849
59938I97997n556m482l701l020j757m72r8P7J614M160N637N457N328O107O085
59923A013376L818R54L13K170M237M862M499M086L510K294Q03m0M3L43J74j63
59907A045279J51J100J633J192O68J138K262K903K890K931K987K195N68o76r21
59892A066300r84j607k278k308k058k094j975r99L52Q19M3j011j355r70l29M26
59876A049972J491K802L811M026L610L180L068L198L733N140P300R184R982J0102
$$ plain form
59982 1111454 1113456 1115731 1118343 1121171 1124072 1126881 1129182 1130555 1130974 1130549 1129117 1126690 1124080 1122256
59968 1122256 1121005 1118937 1115001 1109520 1103617 1098141 1093267 1088690 1083835 1078028 1070731 1061787 1051653 1041464
59954 1041464 1032584 1025819 1021105 1017972 1016092 1015283 1015304 1015803 1016295 1016201 1015234 1013640 1011597 1008549 1003846 997997
59938 997997 992441 987959 984258 981238 979481 979009 978911 978988 980602 984762 990399 995856 1001184 1007291 1013376
59923 1013376 1017194 1018148 1018461 1020631 1024868 1029730 1034229 1038315 1041825 1044119 1044922 1044882 1044925 1045268 1045442 1045279
59907 1045279 1045430 1046530 1048163 1049355 1050023 1051161 1053423 1056326 1059216 1062147 1065134 1067329 1067897 1067221 1066300
59892 1066300 1065316 1063709 1061431 1059123 1057065 1054971 1052996 1051997 1052349 1053168 1053211 1052200 1050845 1049875 1049546 1049972
59876 1049972 1051463 1054265 1058076 1062102 1065712 1068892 1071960 1075158 1078891 1084031 1091331 1100515 1110497 1120599
59862A120599J0359J0679J0450R714R093Q784Q458P931P160N964M664M490O189
59849A224534Q588R860R890R891R924Q540N228J524q70j846k154k245k392k822
59835A275650l089k278m15J298K186L007M559O384P567P979Q061Q164Q607R634
59821A337314J0812J1268J0905J0558J0604J0548J0277J0402J0658R478O299L086
59809A452209K039K561K073m62l319m341l421k321k672m441o170o545n692m710
59795A414788m173l764l258k891k522j474K68J707K363L297N717R130J1667J1855
59781A442710R576N871K354L28j24J59Q71K520M794N833M087K99l494o389r027
59766A460368j1839j4094j4791j3764j1744r770q525p902p223o036m507l072k146
$$ plain form
59862 1120599 1130958 1141637 1152087 1161801 1170894 1179678 1188136 1196067 1203227 1209191 1213855 1218345 1224534
59849 1224534 1233122 1242982 1252872 1262763 1272687 1281227 1286455 1287979 1287109 1285263 1283109 1280864 1278472 1275650
59835 1275650 1272561 1270283 1269868 1271166 1273352 1276359 1280918 1287302 1294869 1302848 1310909 1319073 1327680 1337314
59821 1337314 1348126 1359394 1370299 1380857 1391461 1402009 1412286 1422688 1433346 1442824 1449123 1452209
59809 1452209 1454248 1456809 1458882 1458420 1455101 1450760 1447339 1445018 1442346 1437905 1431735 1425190 1419498 1414788
59795 1414788 1410615 1406851 1403593 1400702 1398180 1396706 1396974 1398681 1401044 1404341 1410058 1419188 1430855 1442710
59781 1442710 1452286 1458157 1460511 1460839 1460715 1460874 1461745 1464265 1469059 1474892 1478979 1479278 1475784 1469395 1460368
59766 1460368 1448529 1434435 1419644 1405880 1394136 1384366 1375841 1367939 1360716 1354680 1350173 1347101 1344955
59753A344955k228l588n505o634o477n893n772o060o531p489q801r214p787n552
59739A257424m491n081n895n615m459l443l056k990k715k056j346j045j168j259
59725A212805r84n25k99o37j705l190m066l395j565%P09J397K642L523K974J602
59709A209286J072K030L623M870N636O216O719O982O824O408O365P228Q637R739
59695A291635J0482J1654J3217J3747J2433J0731J0723J2383J3687J3319J1969
59684A425980J0856J0091Q945O989M543K344J010N57M42L28N73J470K244J633
59670A478005m15k341k757k136k121l346m617m529l241k050j565j287j033j531
59656A445036k981m075l606k213j170j47K053M893O297N775N279O306Q053R528
$$ plain form
59753 1344955 1342727 1339139 1333634 1327000 1320523 1314630 1308858 1302798 1296267 1288778 1279977 1270763 1262976 1257424
59739 1257424 1252933 1247852 1241957 1236342 1231883 1228440 1225384 1222394 1219679 1217623 1216277 1215232 1214064 1212805
59725 1212805 1211821 1211296 1210997 1210360 1208655 1205465 1201399 1198004 1196439 1196439 1197148 1198545 1201187 1204710 1207684 1209286
59709 1209286 1210358 1212388 1216011 1220881 1226517 1232733 1239452 1246434 1253258 1259666 1266031 1273259 1281896 1291635
59695 1291635 1302117 1313771 1326988 1340735 1353168 1363899 1374622 1387005 1400692 1414011 1425980
59684 1425980 1436836 1446927 1455872 1462861 1467404 1469748 1470758 1471315 1471757 1472085 1472658 1474128 1476372 1478005
59670 1478005 1477590 1475249 1472492 1470356 1468235 1464889 1460272 1455743 1452502 1450452 1448887 1447600 1446567 1445036
59656 1445036 1442055 1437980 1434374 1432161 1430991 1430844 1432897 1437790 1444087 1449862 1455141 1461447 1469500 1479028
59642A479028J1434J4337J6600J6238J3989J2356J2096J1723J0507R742J0355
59631A618405J1007R805O932M327L044K006l69l885o531o719n149m080m953p251
59617A616589r553j0977j1367j0840r783q871q589q743q666p806o102m096k509
59604A508687j454j98J759L861N492P200R606J1521J0975Q286O186O262P090O880
59590A592153O093N948N739L710k28m464q082j1670j5825k0044k3317k4993k5170
59577A479850k4668k4321k3726k1476j7245j2872j0328r429q780q224q853j0913
59565A299015j3268j5005j6269j7291j7706j7173j5887j4165j2204j0417r404
59554A140226r350r849j0401j0733j0602r694p800n123k420p21m42p44l75P47
$$ plain form
59642 1479028 1490462 1504799 1521399 1537637 1551626 1563982 1576078 1587801 1598308 1608050 1618405
59631 1618405 1629412 1639217 1646149 1650476 1653520 1655526 1655157 1651272 1644741 1638022 1632873 1628793 1623840 1616589
59617 1616589 1607036 1596059 1584692 1573852 1564069 1555198 1546609 1537866 1529200 1521394 1515292 1511196 1508687
59604 1508687 1507233 1507035 1508794 1512655 1518147 1525347 1534953 1546474 1557449 1565735 1571921 1578183 1585273 1592153
59590 1592153 1598246 1604194 1609933 1613643 1613415 1608951 1600869 1589199 1573374 1553330 1530013 1505020 1479850
59577 1479850 1455182 1430861 1407135 1385659 1368414 1355542 1345214 1335785 1327005 1318781 1309928 1299015
59565 1299015 1285747 1270742 1254473 1237182 1219476 1202303 1186416 1172251 1160047 1149630 1140226
59554 1140226 1130876 1121027 1110626 1099893 1089291 1079597 1071797 1066674 1064254 1063533 1063091 1062347 1061972 1062719
59540A062719J472J027n8q85j144q38O3J212J913K055K197K454K172J042m85k102
59524A072814l740m602l717j921j550l260m974n005m314m268m117k642p58l51
59510A027595j500k792l477l583k832j310k43l74n44L45J155L86r89j002mK26
59494A011057p7R97L555N637O430P055P968Q274P995Q437R717J0466J0572J1774
59480A109857J4698J7695J9706K1960K5313K7880K7005K2324J5598Q701K914r36
59468A312715k959m116m860m533k675p1K037K960K557J098n51j653k628m345o461
59453A286515p790q337r364j1230j2811j3356j3343j3181j2653j2008j1828j1464
59441A149150r506o372m440m802n802n644m483l006j009J257K293J487M35O69
$$ plain form
59540 1062719 1064191 1065218 1065160 1064275 1063131 1062293 1062356 1063568 1065481 1067536 1069733 1072187 1074359 1075401 1074916 1072814
59524 1072814 1069074 1064472 1060755 1058834 1057284 1054024 1049050 1044045 1039731 1035463 1031346 1028704 1027946 1027595
59510 1027595 1026095 1023303 1019826 1016243 1013411 1012101 1011858 1011484 1010940 1011285 1012440 1012826 1011837 1010835 1010831 1011057
59494 1011057 1010980 1011977 1015532 1021169 1027599 1034654 1042622 1050896 1058891 1067328 1077045 1087511 1098083 1109857
59480 1109857 1124555 1142250 1161956 1183916 1209229 1237109 1264114 1286438 1302036 1310737 1313651 1312715
59468 1312715 1309756 1305640 1300780 1296247 1293572 1293501 1295538 1298498 1301055 1302153 1301602 1299949 1297321 1292976 1286515
59453 1286515 1278725 1270388 1261024 1249794 1236983 1223627 1210284 1197103 1184450 1172442 1160614 1149150
59441 1149150 1139644 1133272 1128832 1124030 1118228 1112584 1108101 1105095 1104086 1105343 1107636 1109123 1109558 1110227
59427A110227J602K180K822M070M945M704M767O725R559J1004J0884J0856J1385
59414A195730J1198R420O403K672j108l456l354k112k148l767m894m110k163k66
59400A198045J404K907L849M229M839O148P687Q953R986J0667J0504R607Q867
59387A287692Q653Q170O687M473J998p82l650n606o132o144o642p021o071m120
59373A271505k786k607k419j471p88j521k902k951p59K744O149Q859J1155J3561
59359A295769J6289J8956K0952K2303K3923K6719L0849L5958M1199M4353M2056
59348A619326L2573J8113L380p909j4130j4808j0818n067k54M276J0880J8254
59336A653816K0776J4790L115q399j6568k1229k2507k0833j8283j6751j5414j2456
$$ plain form
59427 1110227 1111829 1114009 1116831 1120901 1125846 1130550 1135317 1142042 1151601 1162605 1173489 1184345 1195730
59414 1195730 1206928 1216348 1222751 1225423 1224315 1220859 1217505 1215393 1213245 1209478 1204584 1200474 1198311 1198045
59400 1198045 1199449 1202356 1206205 1210434 1215273 1221421 1229108 1238061 1248047 1258714 1269218 1278825 1287692
59387 1287692 1296345 1304515 1311202 1315675 1317673 1316891 1313241 1307635 1301503 1295359 1288717 1281696 1275625 1271505
59373 1271505 1268719 1266112 1263693 1262222 1261434 1259913 1257011 1254060 1253301 1256045 1262194 1271053 1282208 1295769
59359 1295769 1312058 1331014 1351966 1374269 1398192 1424911 1455760 1491718 1532917 1577270 1619326
59348 1619326 1651899 1670012 1673392 1665483 1651353 1636545 1625727 1620660 1620406 1624682 1635562 1653816
59336 1653816 1674592 1689382 1692497 1684098 1667530 1646301 1623794 1602961 1584678 1567927 1552513 1540057
59324A540057q503n695m145k234o4L56j367k950k490l90K054L959M347K617L7
59309A525589j078j59J247K051K650L223L184K707K787L302L170K794L983O832
59295A562282R091R631J0161J2213J4650J5795J6199J7518J9907K2197K3670K4372
59283A757686K4456K4222K4130K4076K3438K2038J9934J6408J0844M791R39m81
59271A952481k093n379q722j0517j1866j4508j8073k1162k3470k5146k5641k4932
59259A760972k4427k4997k5453k4577k3152k2386k1771k0366j8790j7974j7247
59248A519832j5762j4545j4859j5482j4046j0606p473n719m016j148K284N210
59236A423670P853J1311J5751J9275J8778J2687L055o029j2400j6872k0267k1567
$$ plain form
59324 1540057 1531554 1525859 1521714 1519480 1519416 1519772 1518405 1515455 1512965 1512575 1514629 1518588 1522935 1525552 1525589
59309 1525589 1524511 1524352 1525599 1527650 1530300 1533523 1536707 1539414 1542201 1545503 1548673 1551467 1555450 1562282
59295 1562282 1571373 1581004 1591165 1603378 1618028 1633823 1650022 1667540 1687447 1709644 1733314 1757686
59283 1757686 1782142 1806364 1830494 1854570 1878008 1900046 1919980 1936388 1947232 1952023 1952962 1952481
59271 1952481 1950388 1945009 1936287 1925770 1913904 1899396 1881323 1860161 1836691 1811545 1785904 1760972
59259 1760972 1736545 1711548 1686095 1661518 1638366 1615980 1594209 1573843 1555053 1537079 1519832
59248 1519832 1504070 1489525 1474666 1459184 1445138 1434532 1427059 1421340 1417324 1416176 1418460 1423670
59236 1423670 1431523 1442834 1458585 1477860 1496638 1509325 1512380 1506351 1493951 1477079 1456812 1435245
59224A435245k0169j7763j6079j4278j0711o024k341j77J831M528P490J0188J2422
59211A384162J3915J4769J5728J6815J6715J4835J2907J2808J3741J3419J1224
59200A541038Q286N237J977p61j806j463j335k250l788n466o915p300o178m600
59186A514676l816l334j883J93J326J226J093J489J751J521J225R33L40j33L18
59171A516925J389J916J532P54n13k959o302r134j0645j1317j1848j2369j2733
59158A444696j2582j1385r340p849p951q691q383o990n858n451m969m131l659
59145A347457l836l895l098j466O03K585L882M465N184O571P895Q214P796P453
59131A389810P296P259P966R720J1502J2363J2888J3772J4047J2528J0026Q103
$$ plain form
59224 1435245 1415076 1397313 1381234 1366956 1356245 1350221 1347880 1347703 1349534 1354062 1361552 1371740 1384162
59211 1384162 1398077 1412846 1428574 1445389 1462104 1476939 1489846 1502654 1516395 1529814 1541038
59200 1541038 1549324 1554561 1556538 1555777 1553971 1552508 1551173 1548923 1545135 1539669 1532754 1525454 1519276 1514676
59186 1514676 1510860 1507526 1505643 1505836 1507162 1508388 1509481 1510970 1512721 1514242 1515467 1516400 1516740 1516607 1516925
59171 1516925 1518314 1520230 1521762 1522516 1522003 1519044 1512742 1503608 1492963 1481646 1469798 1457429 1444696
59158 1444696 1432114 1420729 1411389 1403540 1395589 1386898 1378515 1371525 1365667 1360216 1355247 1351116 1347457
59145 1347457 1343621 1339726 1336628 1335162 1335765 1338350 1342232 1346697 1351881 1358452 1366347 1374561 1382357 1389810
59131 1389810 1397106 1404365 1412331 1422051 1433553 1445916 1458804 1472576 1486623 1499151 1509177 1517280
59119A517280O511M134J577L20j68j789m452o097o240o810q868j0885j1150r976
59105A463387q589p465o590o146o232o759p752r010r824j0009j0562j1981j2800
59092A349668j1577r440q620r307j0215j1239j2788j3210j0447o153m599o872
59080A235201r418r296p618o660o615o842p566q390p426l869L24K985M363N753
59066A174926P210Q247R262J0698J1943J2348J2247J2005J1530J1507J3357J6864
59054A312144J9598J9981J9279J9217J9452J8909J7946J7247J5990J3185R833
59043A502781P838P379O923N324K590p14l596m854m343l500l557m051m055l868
59029A500297m364n509o733p942q995r090p961o967p613r595j1501j2748j3650
$$ plain form
59119 1517280 1523791 1527925 1529502 1529822 1529654 1527865 1523413 1517316 1511076 1504266 1495398 1484513 1473363 1463387
59105 1463387 1454798 1447333 1440743 1434597 1428365 1421606 1413854 1404844 1395020 1385011 1374449 1362468 1349668
59092 1349668 1338091 1328651 1320031 1310724 1300509 1289270 1276482 1263272 1252825 1246672 1242073 1235201
59080 1235201 1225783 1216487 1208869 1202209 1195594 1188752 1181186 1172796 1165370 1161501 1161825 1164810 1169173 1174926
59066 1174926 1182136 1190383 1199645 1210343 1222286 1234634 1246881 1258886 1270416 1281923 1295280 1312144
59054 1312144 1331742 1351723 1371002 1390219 1409671 1428580 1446526 1463773 1479763 1492948 1502781
59043 1502781 1510619 1517998 1524921 1530245 1532835 1532121 1528525 1523671 1519328 1515828 1512271 1508220 1504165 1500297
59029 1500297 1495933 1490424 1483691 1475749 1466754 1457664 1449703 1442736 1435123 1425528 1414027 1401279 1387629
59016A387629j4150j3938j3395j3111j2676j1222r014p401p099p487p625p170
59004A263341o227n008l977l863n117p314r125r261p724n788m448l407k309k083
58990A187690l593n432m946j712J672K827K147J557K161L760N425N838M317K175
58976A203886J828L832O072O639O039N718N884O171P199R820J3446J6483J8238
58963A311255J9359K0694K2349K3688K3897K2776K1079J9426J7078J2805O979
58952A521385J544k152m213m988m702m463n529p017o446l398m94L60N22J822L429
58937A485660L532K390J418M63j617m491o715q070r451j0717j0659r098p293o119
58923A419233n213m169l273k763k230j155N58K607M564O250Q022J0207J2173J2714
$$ plain form
59016 1387629 1373479 1359541 1346146 1333035 1320359 1309137 1300123 1292722 1285623 1278136 1270511 1263341
59004 1263341 1257114 1252106 1248129 1244266 1239149 1231835 1222710 1213449 1205725 1199937 1195489 1192082 1189773 1187690
58990 1187690 1184097 1178665 1173719 1172007 1173679 1176506 1178653 1180210 1182371 1186131 1191556 1197394 1201711 1203886
58976 1203886 1205714 1209546 1215618 1222257 1228296 1234014 1239898 1246069 1253268 1263088 1276534 1293017 1311255
58963 1311255 1330614 1351308 1373657 1397345 1421242 1444018 1465097 1484523 1501601 1514406 1521385
58952 1521385 1522929 1520777 1516564 1511576 1506874 1502411 1496882 1489865 1483419 1480021 1479527 1479887 1480409 1482231 1485660
58937 1485660 1489192 1491582 1493000 1493463 1491846 1487355 1480640 1472570 1463119 1452402 1441743 1432645 1425352 1419233
58923 1419233 1414020 1409851 1406578 1403815 1401585 1400430 1400988 1403595 1408159 1414409 1422431 1432638 1444811 1457525
58909A457525J1768J0755J0685J0959J0710J0271J0369J0754J0575R399P135L771
58897A574676K3k713l947m791o353q401j0389j2624j5296j7403j7890j7014j5516
58884A442362j3515j1320j0205j0784j1564j0595p959n227l138j330J56P45M60
58871A358086j42r06j871k512k372k160k976m698o096o361n576m072k241o84K96
58856A315715J009J529J246J84j63J464M093N623N550N360O380Q473J0825J2932
58842A380220J4606J5790J6587J7064J7107J6717J6177J5772J5731J6440J8016
58831A560227J9594K0100J9927K0516K1975K2693K1982K1329K1874K2261K0577
58820A793055J7272J4457J3094J2324J0959Q416M885J628K55O74Q54m03j743j660
$$ plain form
58909 1457525 1469293 1480048 1490733 1501692 1512402 1522673 1533042 1543796 1554371 1563770 1570905 1574676
58897 1574676 1574699 1571986 1568039 1563248 1556895 1548494 1538105 1525481 1510185 1492782 1474892 1457878 1442362
58884 1442362 1428847 1417527 1407322 1396538 1384974 1374379 1366420 1361193 1358055 1356725 1356881 1357626 1358086
58871 1358086 1357944 1357038 1355167 1352655 1350283 1348123 1345147 1340449 1334353 1327992 1322416 1318344 1316103 1315419 1315715
58856 1315715 1316724 1318253 1319499 1319683 1319520 1320984 1325077 1330700 1336250 1341610 1347990 1356463 1367288 1380220
58842 1380220 1394826 1410616 1427203 1444267 1461374 1478091 1494268 1510040 1525771 1542211 1560227
58831 1560227 1579821 1599921 1619848 1640364 1662339 1685032 1707014 1728343 1750217 1772478 1793055
58820 1793055 1810327 1824784 1837878 1850202 1861161 1869577 1874462 1876090 1876345 1877019 1877873 1877470 1875727 1874067
58806A874067j106j908l828n420o791r209j2510j5207j6960j8783k0837k2078
58794A739430k2310k2694k3747k4472k3972k2590k1034j9455j7888j6607j5762
58783A508899j5372j5744j7078j8654j9356j9039j8549j8310j7689j6022j3627
58772A319459j1515j0332r655q404o241m296l775m044l348j535m20r24j614j057
58758A252299L6M16M47R81J505J201Q47J607K757K540R67j76R5R42J095p4k515
58741A264970n310o837o379n167m715m785m254l236k696k504j660k53M97K20J3
58726A217904J024L417O645R736J1488J1442J0635J0564J1547J2672J2958J2098
58714A332130J0561R362Q969Q188N289O57l288n380p016r273j0880j0630r785
$$ plain form
58806 1874067 1872961 1871053 1867225 1861805 1855014 1845805 1833295 1818088 1801128 1782345 1761508 1739430
58794 1739430 1717120 1694426 1670679 1646207 1622235 1599645 1578611 1559156 1541268 1524661 1508899
58783 1508899 1493527 1477783 1460705 1442051 1422695 1403656 1385107 1366797 1349108 1333086 1319459
58772 1319459 1307944 1297612 1287957 1279553 1273312 1269016 1265241 1261197 1257849 1256314 1255894 1254970 1253356 1252299
58758 1252299 1252335 1252751 1253198 1254179 1255684 1256885 1257732 1259339 1262096 1264636 1265603 1265427 1265522 1266464 1267559 1267485 1264970
58741 1264970 1259660 1252823 1246444 1241277 1236562 1231777 1227523 1224287 1221591 1219087 1217427 1217174 1217671 1217891 1217904
58726 1217904 1218928 1222345 1228990 1238726 1250214 1261656 1272291 1282855 1294402 1307074 1320032 1332130
58714 1332130 1342691 1352053 1361022 1369210 1374499 1375156 1371868 1366488 1359472 1350199 1339319 1328689 1318904
58701A318904j0052j0869j0755r845q953p615n381l686l979n095m929l564k396
58688A231785j309N92K481K926K623L209M173L914L153M086O463P909Q013Q854
58674A288872J1113J2866J2867J2228J2086J2102J2021J2373J2843J2104J0029
58663A421504Q143P371P217P455Q573J0196J1133J1410J2204J3368J3123J0757
58651A542454P621M971K634J88k385n632j0226j5310j9084k1385k3779k6814k9188
58638A404065l0079l0295l0692l1272l1974l2555l1556k7622k2045j7754j5546
58627A102675j3649j1283r940j0447j1366j1280j0403q998o563l633k052k159
58615A000902j919j44J521J394N30R00K433L726M567N874P814R480J0175R993
$$ plain form
58701 1318904 1308852 1297983 1287228 1277383 1268430 1260815 1255434 1251748 1247769 1242674 1237745 1234181 1231785
58688 1231785 1230476 1231068 1233549 1236475 1239098 1242307 1246480 1250394 1253547 1257633 1264096 1272005 1280018 1288872
58674 1288872 1299985 1312851 1325718 1337946 1350032 1362134 1374155 1386528 1399371 1411475 1421504
58663 1421504 1429647 1437018 1444235 1451690 1460263 1470459 1481592 1493002 1505206 1518574 1531697 1542454
58651 1542454 1550075 1555046 1557680 1557868 1555483 1549851 1539625 1524315 1505231 1483846 1460067 1433253 1404065
58638 1404065 1373986 1343691 1312999 1281727 1249753 1217198 1185642 1158020 1135975 1118221 1102675
58627 1102675 1089026 1077743 1067803 1057356 1045990 1034710 1024307 1015309 1008746 1005113 1003061 1000902
58615 1000902 998983 998839 1000360 1001754 1002284 1003184 1005617 1009343 1013910 1019784 1027598 1037078 1047253 1057246
58601A057246R432Q907Q238O446K855j482m546n670o095o954p930q224p710o780
58587A037733n845n283n247n509n904o447o443m735j849m59j942l859l131m57
58573I80623J009M23m18q02j737k938k584o28P33N89M22R55Q22n96j661j064L89
58556I73537J705L213N022N914N127L589K509K069K019K163K043J663K256M487
58542A017316O417N732L588L184M671M860K328n70j565r54O99L904P886J0128
58528A067624J0042J0307J2912J6366J8454J9135J9046J7750J5359J3775J4292
58517A235062J5820J6945J7830J8682J8483J6855J5420J5768J7581J9864K2339
58506A430649K4735K6616K8694L2250L6422L8439L7378L5338L3950L2288K9320
$$ plain form
58601 1057246 1066678 1075585 1083823 1090269 1093124 1091642 1087096 1081426 1075331 1068377 1060447 1052223 1044513 1037733
58587 1037733 1031888 1026605 1021358 1015849 1009945 1003498 997055 992320 990471 990012 988070 984211 981080 980623
58573 980623 981632 982055 981637 980835 979098 976160 973576 972948 973681 974270 974692 975647 976469 975873 974212 973148 973537
58556 973537 975242 978455 983477 989391 994518 998107 1000616 1002685 1004704 1006867 1008910 1010573 1012829 1017316
58542 1017316 1023733 1029465 1033053 1036237 1040908 1045768 1048096 1047526 1045961 1045007 1045706 1049610 1057496 1067624
58528 1067624 1077666 1087973 1100885 1117251 1135705 1154840 1173886 1191636 1206995 1220770 1235062
58517 1235062 1250882 1267827 1285657 1304339 1322822 1339677 1355097 1370865 1388446 1408310 1430649
58506 1430649 1455384 1482000 1510694 1542944 1579366 1617805 1655183 1690521 1724471 1756759 1786079
58495A786079K5701K1892J7037J1072N552J136l295p906j1057j2409j4003j6810
58483A802989j9065j9682k0409k2794k5735k7947l0062l2392l3282l1885l0085
58472A509651k9481k8868k6689k3626k0757j7596j4083j2015j2285j2985j2325
58461A298941j1187j0717r918p969o485o880p682o967n557n302n958o030n141
58448A203148l595j361P78J127j67m32J628L721L533J946O93n32k176k651p50
58433A204910J868L191L875N395P252Q372R306J0799J2113J2785J4018J6375J8360
58420A328619J9252K0657K3188K4471K2855K0259J8812J7513J4961J2309J0478
58409A533374P376J430m775p865q375q685q738p423n967o039o229m200p17J840
$$ plain form
58495 1786079 1811780 1833672 1850709 1861781 1867333 1868469 1865174 1857268 1846211 1833802 1819799 1802989
58483 1802989 1783924 1764242 1743833 1721039 1695304 1667357 1637295 1604903 1571621 1539736 1509651
58472 1509651 1480170 1451302 1424613 1400987 1380230 1362634 1348551 1336536 1324251 1311266 1298941
58461 1298941 1287754 1277037 1267119 1259150 1252665 1245785 1238103 1231136 1225579 1220277 1214319 1208289 1203148
58448 1203148 1199553 1198192 1198970 1200097 1199930 1199498 1201126 1204847 1208380 1210326 1211019 1210487 1208311 1205660 1204910
58433 1204910 1206778 1209969 1213844 1219239 1226491 1234863 1244169 1254968 1267081 1279866 1293884 1310259 1328619
58420 1328619 1347871 1368528 1391716 1416187 1439042 1459301 1478113 1495626 1510587 1522896 1533374
58409 1533374 1540750 1542180 1537405 1529540 1521165 1512480 1503742 1496319 1490352 1484313 1478084 1473884 1473167 1475007
58395A475007L450N550P779Q832R140R519Q815N977K754J158p2l152p102r312
58381A518343r767j0355j1182j0825r098o708l516J43K068J000o45J56K852M852
58367A467318N599O230O898P331Q357J0217J1097R914Q494Q435Q181N895K689
58354A566655O6k992p083r457p848m700l730m664n064m796m725l507l1L228L640
58339A514992L091M807P610P935N957N040O379Q321R904J1187J1304R745Q288
58326A614560Q421Q697P602O704P596Q493P575O807Q333J0065R242P591Q303J0620
58312A730609J2065J3274J5779J7747J6989J5518J6153J7298J6201J4504J5136
58301A901273J6709J6581J6466J8896K1175J9356J5593J4744J6060J5206J2489
$$ plain form
58395 1475007 1478457 1484007 1491786 1500618 1509758 1519277 1528092 1534069 1536823 1537981 1537909 1534757 1527655 1518343
58381 1518343 1508576 1498221 1487039 1476214 1467116 1460408 1456892 1457035 1459103 1460103 1459458 1459614 1462466 1467318
58367 1467318 1472917 1479147 1486045 1493376 1501733 1511950 1523047 1532961 1541455 1549890 1558071 1563966 1566655
58354 1566655 1566721 1563729 1556646 1547189 1539341 1534641 1530911 1526247 1521183 1516387 1511662 1508155 1508124 1511352 1514992
58339 1514992 1518083 1522890 1530500 1538435 1544392 1549432 1555811 1564132 1574036 1585223 1596527 1606272 1614560
58326 1614560 1622981 1631678 1639280 1645984 1653580 1662073 1669648 1676455 1684788 1694853 1704095 1711686 1719989 1730609
58312 1730609 1742674 1755948 1771727 1789474 1806463 1821981 1838134 1855432 1871633 1886137 1901273
58301 1901273 1917982 1934563 1951029 1969925 1991100 2010456 2026049 2040793 2056853 2072059 2084548
58290B084548J1868J3363J3550J2460J3159J5511J6722J6954J8184J9101J7559
58279B252979J6366J9833K6078K9664L0191L1292L2815L1602K8733K8210K9410
58268B557173K8316K5331K4329K4821K2905J9270J8375K0169K0501J9274K0274
58257B800738K3158K3777K2521K4195K9216L2754L3231L4066L6426L7569L7020
58246C134671L7286L8177L7331L6259L8719M3289M4871M3310M3173M5449M6960
58235C589495M7493M9819N3124N4070N3664N5552N8637N9264N9041O2129O6569
58224D208857O7380O6392O9348P5003P7384P7321Q1082Q8592R3990R6990J02602
58213E104941J10255J14457J15685J19352J24740J26677J27236J33398J43747
$$ plain form
58290 2084548 2096416 2109779 2123329 2135789 2148948 2164459 2181181 2198135 2216319 2235420 2252979
58279 2252979 2269345 2289178 2315256 2344920 2375111 2406403 2439218 2470820 2499553 2527763 2557173
58268 2557173 2585489 2610820 2635149 2659970 2682875 2702145 2720520 2740689 2761190 2780464 2800738
58257 2800738 2823896 2847673 2870194 2894389 2923605 2956359 2989590 3023656 3060082 3097651 3134671
58246 3134671 3171957 3210134 3247465 3283724 3322443 3365732 3410603 3453913 3497086 3542535 3589495
58235 3589495 3636988 3686807 3739931 3794001 3847665 3903217 3961854 4021118 4080159 4142288 4208857
58224 4208857 4276237 4342629 4411977 4486980 4564364 4641685 4722767 4811359 4905349 5002339 5104941
58213 5104941 5215196 5329653 5445338 5564690 5689430 5816107 5943343 6076741 6220488
58204F220488J50217J52501J57635J65664J69367J68157J68516J70755J69493
58195G692793J67016J71213J80313J85155J86585J94249K07979K17912K24046
58186I427261K37205K58491K76520K88337L04417L29090L54308L76832M03206
58177A2255667M33612M59475M81255N09907N46989N82759O17336O62844P20819
58168A7270663P79345Q36761R05246R86216J065954J140815J222036J310417J392716
58159B6910169J469171J557216J661499J769005J879943K011517K163215K312508
58151D1734243K455245K615930K807820L019696L252813L530394L857662M215892
58143F7489695M611543N086001N660346O318846P063426P931161Q942822J0098639
$$ plain form
58204 6220488 6370705 6523206 6680841 6846505 7015872 7184029 7352545 7523300 7692793
58195 7692793 7859809 8031022 8211335 8396490 8583075 8777324 8985303 9203215 9427261
58186 9427261 9664466 9922957 10199477 10487814 10792231 11121321 11475629 11852461 12255667
58177 12255667 12689279 13148754 13630009 14139916 14686905 15269664 15887000 16549844 17270663
58168 17270663 18050008 18886769 19792015 20778231 21844185 22985000 24207036 25517453 26910169
58159 26910169 28379340 29936556 31598055 33367060 35247003 37258520 39421735 41734243
58151 41734243 44189488 46805418 49613238 52632934 55885747 59416141 63273803 67489695
58143 67489695 72101238 77187239 82847585 89166431 96229857 104161018 113103840 123202479
58135A23202479J1444720J3069625J5008646J7228675J9722680K2512594K5549879
58128B47739298K8775011L2261655L5896031L8562638L7929450L1769393J9944296
58121D72877772N011770r289419k0192432k6845329k9823756l0260530k9301980
58114C32176096k7816293k6228302k4601195k2907569k1182005j9460660j7730050
58107A72250022j5998063j4334624j2799227j1391501j0104115q963183p983517
58100I0675792p135311o386324n735091n178341m687047m240297l847743l516000
58092D9949638l224498k954487k712333k505340k321691k151328k000970j872483
58084C0206508j750065j623666j502985j395541j292832j190191j098262j022353
$$ plain form
58135 123202479 134647199 147716824 162725470 179954145 199676825 222189419 247739298
58128 247739298 276514309 308775964 344671995 383234633 421164083 452933476 472877772
58121 472877772 477889542 468600123 448407691 421562362 391738606 361478076 332176096
58114 332176096 304359803 278131501 253530306 230622737 209440732 189980072 172250022
58107 172250022 156251959 141917335 129118108 117726607 107622492 98659309 90675792
58100 90675792 83540481 77154157 71419066 66240725 61553678 57313381 53465638 49949638
58092 49949638 46725140 43770653 41058320 38552980 36231289 34079961 32078991 30206508
58084 30206508 28456443 26832777 25329792 23934251 22641419 21451228 20352966 19330613
58076A9330613r51252q78426q14337p66215p24904o82819o45933o16903n85143
58067A2664681n45248n07766m80173m54017m22034l91545l69370l49073l24826
58058H820629l03332k90375k79180k63235k47999k39182k31591k19931k08945
58049F536859k03018j96959j86525j77088j72681j67393j56681j46530j42419
58040D987565j39465j32325j24765j20701j15733j06321r7877r5045r3155q7615
58030C874563q2588q2087q1613p7166p3613p5248p6705p2161o5742o3857o4636
58019C059147o3583o2580o4646o6408o4037o0515n9454n8016n3493n0222n2141
58008B404052n4714n2209m7127m4727m3929m1345l8758l8894l8739l4717k9864
$$ plain form
58076 19330613 18379361 17500935 16686598 15920383 15195479 14512660 13866727 13249824 12664681
58067 12664681 12119433 11611667 11131494 10677477 10255443 9863898 9494528 9145455 8820629
58058 8820629 8517297 8226922 7947742 7684507 7436508 7197326 6965735 6745804 6536859
58049 6536859 6333841 6136882 5950357 5773269 5600588 5433195 5276514 5129984 4987565
58040 4987565 4848100 4715775 4591010 4470309 4354576 4248255 4150378 4055333 3962178 3874563
58030 3874563 3791975 3709888 3628275 3551109 3477496 3402248 3325543 3253382 3187640 3123783 3059147
58019 3059147 2995564 2932984 2868338 2801930 2737893 2677378 2617924 2559908 2506415 2456193 2404052
58008 2404052 2349338 2297129 2250002 2205275 2161346 2120001 2081243 2042349 2003610 1968893 1939029
57997A939029k8768k9859k9479k8922l0641l2104l0266k7756k8039k8689k6081
57986A618425k2519k2181k3942k4445k4365k5415k5248k1764j8611k0058k3729
57975A366148k4565k2656k1290k0584j8870j7360j7795j8463j7581j7342j9645
57964A149997k1533k0027j7666j7743j7983j4797j0303q992j0471j1254j1051
57953I88177j1679j2387j1575j0623j1066j0840q119n665o314p517n712k702k066
57940H81912k547j028Q79l95l352l586j269n52k738n489p564r343r858q097o000
57925H20973n855o280m860k834k775l802l566k831l541m504l596k183k684l820
57911G67842l043j500j761k655j433Q53J122l96j300j670k733l012q53J170k86
$$ plain form
57997 1939029 1910261 1880402 1850923 1822001 1791360 1759256 1728990 1701234 1673195 1644506 1618425
57986 1618425 1595906 1573725 1549783 1525338 1500973 1475558 1450310 1428546 1409935 1389877 1366148
57975 1366148 1341583 1318927 1297637 1277053 1258183 1240823 1223028 1204565 1186984 1169642 1149997
57964 1149997 1128464 1108437 1090771 1073028 1055045 1040248 1029945 1020953 1010482 999228 988177
57953 988177 976498 964111 952536 941913 930847 920007 911888 906223 899909 892392 886680 883978 881912
57940 881912 879365 878337 879216 878821 875469 871883 870614 870062 867324 861835 854271 844928 835070 826973 820973
57925 820973 815118 808838 803978 801144 798369 794567 791001 788170 784629 780125 776529 774346 771662 767842
57911 767842 764799 763299 761538 758883 757450 758303 759425 759029 757729 756059 753326 750314 749461 750631 750345
57896G50345l366l871k308k385m101m250k721k411l540l721l090l828n041l709
57882G02003m62J114P11J395L537M279L348L849O553Q606Q857R394J0700J0240
57868G74124P286M634L943L464J806J29r93l138o861j0130j1503j1929j2164j1182
57854G27486q460n489l791l361l619l988l411j368P82J543J839L402N365N387
57840G12317L565K104J518M80r23j053K15J528K919N339P579P205M635K822K746
57825G52996K686K023K151L123L073J610M78J63r08l042m459m518m661n370n285
57810G40060m185l744m362m240k671j341j221r57M50J923K439K575K845K825K835
57795G33231M071O169P027O021N159N968P433Q054P746O708M569J909O38J470
$$ plain form
57896 750345 746979 743108 740800 738415 734314 730064 727343 724932 721392 717671 714581 710753 705712 702003
57882 702003 701541 702655 703366 704761 708298 712577 715925 719774 726327 734933 743790 753184 763884 774124
57868 774124 781410 786044 789987 793451 795257 795386 794393 791255 784394 774264 762761 750832 738668 727486
57854 727486 719026 713537 709746 706385 702766 698778 695367 693999 694781 696324 698163 701565 706930 712317
57840 712317 715882 717986 719504 719984 719061 718008 718223 719751 722670 728009 735588 742793 747428 750250 752996
57825 752996 755682 757705 759856 762979 766052 767662 768140 768303 767395 764353 759894 755376 750715 745345 740060
57810 740060 735875 732131 727769 723529 720858 719517 718296 717339 717789 719712 722151 724726 727571 730396 733231
57795 733231 737302 743471 750498 756519 761678 767646 775079 783133 790879 797587 802156 804065 804703 806173
57781H06173K625K142K10j673k455j772J21K013K522J671N88l06j432k560k853
57766H05014k413k086j869j184m44n07q15k73M48k53j924k514j785j582k521l071
57750G82221k555k425l745n592o763p150o812n735m931n714p365p550n573l113
57736G07198j345L62K247L006J844o6j204j170p4J886L716M224L819M101N362
57721G33906O160N752N131N333O375Q022R870J0697R642Q015P835Q717Q451O576
57707H40482M741L483J583q89j859n70J001J085J60r02k285l806m380m100m596
57692H29148o187o896n545l609k544j440R61L688M894M365L196J991Q85L54P08
57677H23969J438J990K513L266M035M513M538L930K985K940M605O770P509O752
$$ plain form
57781 806173 808798 810940 811150 809477 807022 805250 805371 807384 809906 811577 812165 811859 810427 807867 805014
57766 805014 802601 800515 798646 797462 797018 796511 795696 795423 795871 795618 793694 791180 789395 787813 785292 782221
57750 782221 779666 777241 773496 767904 761141 753991 747179 741444 736513 730799 723434 715884 710311 707198
57736 707198 705853 706215 708462 711468 713312 713246 712042 710872 710798 712684 716400 720624 724443 728544 733906
57721 733906 740066 745818 750949 756282 762657 770679 780549 791246 800888 808903 816738 825455 833906 840482
57707 840482 845223 848706 850289 849400 847541 846971 847972 849057 849217 848315 846030 842224 837844 833744 829148
57692 829148 822961 816065 810520 806911 804367 802927 803888 807576 812470 816835 820031 822022 822907 823261 823969
57677 823969 825407 827397 829910 833176 837211 841724 846262 850192 853177 856117 860722 867492 875001 881753
57663H81753N855N138M018L302M613P325Q678P595N949N363N083L928K250R61
57649I51811L86O76J719K367J716J096K356M271L537j68l307l415j829m55Q78
57634I61639K388K768J657R76J779K312J187J22J206L540M935N216N583O165O395
57619A007868O656P618R012J0608J3166J7057K1169K4635K8374L3559L9811M6126
57607A265659N2300N8115O2230O2871N8481M7507K9664Q179j1435k6135l6922
57596A570514m4964m8960m7949m3992l9786l5586l0549k5203k0518j6310j2500
57585A204197j0109r115p373l863r46r30k166j387J448L443K953J034n99r13M09
57570A176083K349K756Q80j129q56J332L325M004L335J329j134j887L4K667L659
$$ plain form
57663 881753 887608 892746 896764 900066 904679 912004 920682 928277 934226 939589 944672 948600 950850 951811
57649 951811 952197 952873 954592 956959 958675 959771 962127 966398 969935 969767 966460 963045 961216 960761 961639
57634 961639 964027 966795 968452 969428 971207 973519 974706 974828 976034 979574 984509 989725 995308 1001473 1007868
57619 1007868 1014524 1022142 1031154 1041762 1054928 1071985 1093154 1117789 1146163 1179722 1219533 1265659
57607 1265659 1317959 1376074 1438304 1501175 1559656 1607163 1636827 1645006 1633571 1607436 1570514
57596 1570514 1525550 1476590 1428641 1384649 1344863 1309277 1278728 1253525 1233007 1216697 1204197
57585 1204197 1194088 1184973 1177600 1173737 1172791 1171861 1169695 1168308 1169756 1173199 1176152 1177186 1176587 1175674 1176083
57570 1176083 1178432 1181188 1182068 1180939 1180083 1181415 1184740 1188744 1192079 1193408 1192274 1190387 1190421 1193088 1196747
57555A196747L249K966L030L024L458M411M332K511J093K072L993M393L796M139
57541A243214M820L863K017J929L754N123N206N379N898N349L760L054L776M187
57527A301329L400K737L232M061M269M043L724L358L644N368P618Q390P291N760
57513A368224M622L375K094J800K543L125L196L724N021O192O883P716Q593Q521
57499A435629P624P448Q582R784J0022R748R588R397R227R626J0401J0565J0037
57486A557678R853J0319J0530J0209J0369J1471J2498J2586J2187J1878J1371
57475A680949J0476R786R692R796R884J0391J1306J1801J1556J1390J1896J2415
57463A811338J2062J1018J0238J0405J1538J3104J4445J5515J7054J9402K1570
$$ plain form
57555 1196747 1199996 1202962 1205992 1209016 1212474 1216885 1221217 1223728 1224821 1226893 1230886 1235279 1239075 1243214
57541 1243214 1248034 1251897 1253914 1255843 1259597 1264720 1269926 1275305 1281203 1286552 1290312 1293366 1297142 1301329
57527 1301329 1304729 1307466 1310698 1314759 1319028 1323071 1326795 1330153 1333797 1339165 1346783 1355173 1362464 1368224
57513 1368224 1372846 1376221 1378315 1380115 1382658 1385783 1388979 1392703 1397724 1403916 1410799 1418515 1427108 1435629
57499 1435629 1443253 1450701 1459283 1469067 1479089 1488837 1498425 1507822 1517049 1526675 1537076 1547641 1557678
57486 1557678 1567531 1577850 1588380 1598589 1608958 1620429 1632927 1645513 1657700 1669578 1680949
57475 1680949 1691425 1701211 1710903 1720699 1730583 1740974 1752280 1764081 1775637 1787027 1798923 1811338
57463 1811338 1823400 1834418 1844656 1855061 1866599 1879703 1894148 1909663 1926717 1946119 1967689
57452A967689K2388K2100K1880K2165K2620K3159K3600K2946K0599J7802J6203
57441B203151J5479J4225J2688J2268J2560J1530Q936P078P502R185J0837J2707
57429B338146J5014J6581J6519J5856J6100J7254J8225J8350J7733J6900J6651
57418B523329J7346J8061J7493J5853J4705J4908J6015J7592J9474K0833K0825
57407B716434K0224K0418K0841J9692J7322J6228J7162J8157J8200J8913K1243
57396B924834K3417K3922K3878K4436K4459K3076K2024K2845K3892K3042K1489
57385C181314K1700K3167K3622K3314K4435K6739K7413K5553K3578K3495K4569
57374C448899K5457K6172K6826K6663K5579K4884K5373K6095K6059K5823K6405
$$ plain form
57452 1967689 1990077 2012177 2034057 2056222 2078842 2102001 2125601 2148547 2169146 2186948 2203151
57441 2203151 2218630 2232855 2245543 2257811 2270371 2281901 2290837 2297915 2305417 2314602 2325439 2338146
57429 2338146 2353160 2369741 2386260 2402116 2418216 2435470 2453695 2472045 2489778 2506678 2523329
57418 2523329 2540675 2558736 2576229 2592082 2606787 2621695 2637710 2655302 2674776 2695609 2716434
57407 2716434 2736658 2757076 2777917 2797609 2814931 2831159 2848321 2866478 2884678 2903591 2924834
57396 2924834 2948251 2972173 2996051 3020487 3044946 3068022 3090046 3112891 3136783 3159825 3181314
57385 3181314 3203014 3226181 3249803 3273117 3297552 3324291 3351704 3377257 3400835 3424330 3448899
57374 3448899 3474356 3500528 3527354 3554017 3579596 3604480 3629853 3655948 3682007 3707830 3734235
57363C734235K7682K8936K9878L0179K9031K6415K4157K4362K7017L0029L1467
57352D043388L1042K9568K8004K7160K7551K8975L0455L1050L0659K9847K9117
57341D366816K8685K8809K9607L0460L0348K9348K9026L0565L3039L4674L5281
57330D706658L6045L7138L7298L6108L4906L4621L4309L2909L1263L0960L2110
57319E084325L3547L4611L5446L6018L6067L5782L5603L5540L5447L5516L5785
57308E473687L5697L4897L3905L3192L2415L1431L1266L2777L5090L6705L7536
57297E848598L8381L8964L8283L6638L5431L4853L3689L1784L0866L2119L4426
57286F234032L5949L6247L5879L5003L3627L2516L2490L3051L2818L1494L0537
$$ plain form
57363 3734235 3761917 3790853 3820731 3850910 3879941 3906356 3930513 3954875 3981892 4011921 4043388
57352 4043388 4074430 4103998 4132002 4159162 4186713 4215688 4246143 4277193 4307852 4337699 4366816
57341 4366816 4395501 4424310 4453917 4484377 4514725 4544073 4573099 4603664 4636703 4671377 4706658
57330 4706658 4742703 4779841 4817139 4853247 4888153 4922774 4957083 4989992 5021255 5052215 5084325
57319 5084325 5117872 5152483 5187929 5223947 5260014 5295796 5331399 5366939 5402386 5437902 5473687
57308 5473687 5509384 5544281 5578186 5611378 5643793 5675224 5706490 5739267 5774357 5811062 5848598
57297 5848598 5886979 5925943 5964226 6000864 6036295 6071148 6104837 6136621 6167487 6199606 6234032
57286 6234032 6269981 6306228 6342107 6377110 6410737 6443253 6475743 6508794 6541612 6573106 6603643
57275F603643L1489L4049L6296L6742L5827L5130L5473L6246L6566L6364L5978
57264F993803L5443L4741L4173L3786L2892L0990K8761K7304K6694K6180K5574
57253G330341K5254K4976K3840K1677J9561J8539J8688J9585K0923K2344K3327
57242G569055K3707K3755K3625K3139K2269K1321K0579K0190K0246K0410J9705
57231G808001J7546J4932J3642J4195J5525J6760J8271K0689K3894K7454L1156
57220H022065L4717L7642L9777M1382M2329M1999M0226L7593L4612L1364K8137
57209H431843K5358K2525J8330J2378N931M57l673o605q330r118r529r251p061
57196H463255k694K424P272J2768J9946K7705L3913L8033M1126M3924M6405M8802
$$ plain form
57275 6603643 6635132 6669181 6705477 6742219 6778046 6813176 6848649 6884895 6921461 6957825 6993803
57264 6993803 7029246 7063987 7098160 7131946 7164838 7195828 7224589 7251893 7278587 7304767 7330341
57253 7330341 7355595 7380571 7404411 7426088 7445649 7464188 7482876 7502461 7523384 7545728 7569055
57242 7569055 7592762 7616517 7640142 7663281 7685550 7706871 7727450 7747640 7767886 7788296 7808001
57231 7808001 7825547 7840479 7854121 7868316 7883841 7900601 7918872 7939561 7963455 7990909 8022065
57220 8022065 8056782 8094424 8134201 8175583 8217912 8259911 8300137 8337730 8372342 8403706 8431843
57209 8431843 8457201 8479726 8498056 8510434 8516365 8516822 8513149 8506544 8498214 8489096 8479567 8470316 8463255
57196 8463255 8460561 8462985 8470257 8483025 8502971 8530676 8564589 8602622 8643748 8687672 8734077 8782879
57184H782879N1462N3826N4969N4988N4708N4275N3201N1569M9868M8072M6203
57173I356020M5296M6101M7152M6154M3224M0560L8539L4663K7409J8966J2316
57162I756400P351J944m096q498r860r549r772j1150j2992j4926j7071j8937j9431
57149I629413j8452j7678j8767k1159k2756k2953k3608k6393l0432l3719l5877
57138I357619l8030m0663m3202m5415m7724n0264n2935n5899n8640n9139n6050
57127H809658n1356m8510m7840m6291m2207l7711l5338l4915l5384l7570m2886
57116H349650n0673n8903o6796p5156q4741r5537j06918j17393j24979j28911
57106G439643j30237j29835j26732j19549j08797r6750q5705p7045p1188o7746
$$ plain form
57184 8782879 8834341 8888167 8943136 8998124 9052832 9107107 9160308 9211877 9261745 9309817 9356020
57173 9356020 9401316 9447417 9494569 9540723 9583947 9624507 9663046 9697709 9725118 9744084 9756400
57162 9756400 9763751 9765695 9761599 9753101 9743241 9733692 9723920 9712770 9699778 9684852 9667781 9648844 9629413
57149 9629413 9610961 9593283 9574516 9553357 9530601 9507648 9484040 9457647 9427215 9393496 9357619
57138 9357619 9319589 9278926 9235724 9190309 9142585 9092321 9039386 8983487 8924847 8865708 8809658
57127 8809658 8758302 8709792 8661952 8615661 8573454 8535743 8500405 8465490 8430106 8392536 8349650
57116 8349650 8298977 8240074 8173278 8098122 8013381 7917844 7810926 7693533 7568554 7439643
57106 7439643 7309406 7179571 7052839 6933290 6824493 6727743 6642038 6564993 6493805 6426059
57096F426059o6484o8329p4170q2451q9833r4849r8935j03215j06545j08076j09328
57085E423844j11877j14886j16671j17058j16594j15299j13806j13721j15049
57076D388883j15428j13697j11998j12396j14008j15936j20226j28853j39993
57067C316348j50453j59644j68106j74583j78450j83138j93274k09759k31187
57058A667754k58432k94391l40816C75204i6067n59618o62283p77225r04761j043949
57048d043903j189432j336343j485450j639320j797233j958413k125174k296049
57040a7871317k459821k602948k718869k804218k852946k863016k841493k791202
57032c9805830k697453k538415k301334j978248j559869j054272n05914P875L55895
$$ plain form
57096 6426059 6359575 6291246 6217076 6134625 6044792 5949943 5851008 5747793 5641248 5533172 5423844
57085 5423844 5311967 5197081 5080410 4963352 4846758 4731459 4617653 4503932 4388883
57076 4388883 4273455 4159758 4047760 3935364 3821356 3705420 3585194 3456341 3316348
57067 3316348 3165895 3006251 2838145 2663562 2485112 2301974 2108700 1898941 1667754
57058 1667754 1409322 1114931 774115 375204 -96067 -655685 -1317968 -2095193 -2999954 -4043903
57048 -4043903 -5233335 -6569678 -8055128 -9694448 -11491681 -13450094 -15575268 -17871317
57040 -17871317 -20331138 -22934086 -25652955 -28457173 -31310119 -34173135 -37014628 -39805830
57032 -39805830 -42503283 -45041698 -47343032 -49321280 -50881149 -51935421 -52441335 -52433460 -52077565
57023e2077565K89264n28265k258220m563379o630654p670443p462080o404346
57015h7305688n066318l749932k453675j114762K20718J429948K419960L178584
57007i2441165L760465M244082M683634N084134N418369N659658N791639N800642
56999e1998542N680901N449115N140674M789027M415323M034134L657182L290821
56991a5541365K938764K608138K306588K034925J789458J570043i14355B99968
56982A369518R41292Q28344P26692O32021N45948M72988M12485L59955L14952
56973F604195K80529K55655K35080K16543K01826J91075J82330J76515J76815
56964H520563J83456J94920K12685K36483K54443K47082K05407J40194P1446J3887
$$ plain form
57023 -52077565 -51788301 -52316566 -54574786 -59138165 -65768819 -73439262 -80901342 -87305688
57015 -87305688 -92372006 -96121938 -98575613 -99690375 -99469657 -98039709 -95619749 -92441165
57007 -92441165 -88680700 -84436618 -79752984 -74668850 -69250481 -63590823 -57799184 -51998542
56999 -51998542 -46317641 -40868526 -35727852 -30938825 -26523502 -22489368 -18832186 -15541365
56991 -15541365 -12602601 -9994463 -7687875 -5652950 -3863492 -2293449 -914355 299968
56982 1369518 2310810 3139154 3865846 4497867 5043815 5516803 5929288 6289243 6604195
56973 6604195 6884724 7140379 7375459 7592002 7793828 7984903 8167233 8343748 8520563
56964 8520563 8704019 8898939 9111624 9348107 9602550 9849632 10055039 10195233 10266679 10280566
56954A0280566k5935m6028m8407l9036k3974o484J1119K5863L6153M2862M7052
56943A0253751M8929M9688N1279N3345N3394N0956M8480M7186M5258M1395L6988
56932A0780649L3343K9712K5712K2914K2295K2294K1005J8501J5843J3503J1493
56921A1017264R312N399j337r233j5474j9967k4946l0632l4464l5154l4285l3071
56909A0793412l0915k8276k7576k9463l1057k9822k6770k4156k2362k0854k0063
56898A0502098k0366k1042k1893k4475l0225l8755m8901n9785p0043p7967q3476
56887A0005170q8108r2215r4260r3877r3289r4218r5431r4809r2046q7997q3183
56876H995737p8440p5265p4123p3845p3731p4568p6613p8688q0780q5443r4755
$$ plain form
56954 10280566 10254631 10208603 10160196 10121160 10097186 10090702 10101821 10127684 10163837 10206699 10253751
56943 10253751 10302680 10352368 10403647 10456992 10510386 10561342 10609822 10657008 10702266 10743661 10780649
56932 10780649 10813992 10843704 10869416 10892330 10914625 10936919 10957924 10976425 10992268 11005771 11017264
56921 11017264 11026576 11031975 11030638 11021405 11005931 10985964 10961018 10930386 10895922 10860768 10826483 10793412
56909 10793412 10762497 10734221 10706645 10677182 10646125 10616303 10589533 10565377 10543015 10522161 10502098
56898 10502098 10481732 10460690 10438797 10414322 10384097 10345342 10296441 10236656 10166613 10088646 10005170
56887 10005170 9917062 9824847 9730587 9636710 9543421 9449203 9353772 9258963 9166917 9078920 8995737
56876 8995737 8917297 8842032 8767909 8694064 8620333 8545765 8469152 8390464 8309684 8224241 8129486
56865H129486j07326j19828j30212j37934j42614j44106j42949j39612j34261
56856F930644j27940j22407j17908j12938j07197j02771j00973j00051r7779r4647
56846E846033r2580r1883r1333r0176q8303q5416q1628p8097p5858p4776p4525
56835D921458p5173p5748p3967o9026o3297n9549n7662n5786n3523n1944n1169
56824D234614n0082m8390m7408m8531n1777n5845n9047o0332n9704n7511n3761
56813C642226m8807m4185m1273l9499l7588l5977l5739l5443l2264k6494k1651
56802C243306j9187j6532j1872p504o408q708j3913k3336l7048n0958o0580o5949
56790B921311o9645p1828p0766o6870o2329n7505n1150m3776l7441l2301k6435
$$ plain form
56865 8129486 8022160 7902332 7772120 7634186 7491572 7347466 7204517 7064905 6930644
56856 6930644 6802704 6680297 6562389 6449451 6342254 6239483 6138510 6038459 5940680 5846033
56846 5846033 5753453 5661570 5570237 5480061 5391758 5306342 5224714 5146617 5070759 4995983 4921458
56835 4921458 4846285 4770537 4696570 4627544 4564247 4504698 4447036 4391250 4337727 4285783 4234614
56824 4234614 4184532 4136142 4088734 4040203 3988426 3932581 3873534 3813202 3753498 3695987 3642226
56813 3642226 3593419 3549234 3507961 3468462 3430874 3394897 3359158 3323715 3291451 3264957 3243306
56802 3243306 3224119 3207587 3195715 3188211 3181803 3173095 3159182 3135846 3098798 3047840 2987260 2921311
56790 2921311 2851666 2779838 2709072 2642202 2579873 2522368 2471218 2427442 2390001 2357700 2331265
56779B331265j9124j1601m580K354Q912J4098J8080K1374K2100J6633L650j4411
56767B388750l3926n2010o5990p3772p5701p4219p1048o6285o0381n4738m9743
56756A710937m4067l6875k9208k2494j7070j2741r337o045j547M323R831J2716
56744A558423J1591O012l632j5814k8255l9044m7001n1337n1896m9616m5881m1500
56732A202050l6899l2685k9041k5249k0973j7279j5001j2922r298m695j439m22
56720I96147l53j72n30k619o943j3312k0773k7551l2236l4938l6255l5889l3682
56707G50894l1180l0089k9653k7727k4154k0837j8638j6649j4723j4172j5304
56696E07768j6504j6463j5420j3601j0614p153n250n686o934p540p834q343q413
$$ plain form
56779 2331265 2312141 2300540 2295960 2298314 2307226 2321324 2339404 2360778 2382878 2399511 2403161 2388750
56767 2388750 2354824 2302814 2236824 2163052 2087351 2013132 1942084 1875799 1815418 1760680 1710937
56756 1710937 1666870 1629995 1600787 1578293 1561223 1548482 1539145 1533100 1531553 1535876 1545707 1558423
56744 1558423 1570014 1576026 1572394 1556580 1528325 1489281 1442280 1390943 1339047 1289431 1243550 1202050
56732 1202050 1165151 1132466 1103425 1078176 1057203 1039924 1024923 1012001 1002703 998008 996569 996147
56720 996147 995794 995622 995092 992473 985530 972218 951445 923894 891658 856720 820465 784576 750894
56707 750894 719714 689625 659972 632245 608091 587254 568616 551967 537244 523072 507768
56696 507768 491264 474801 459381 445780 435166 428013 422763 417077 410143 402603 394769 386426 378013
56683C78013p557o441n457l993k364k427m630o235m630j187M29q87k801l196k553
56668C24084k278k525k562k279k228k545k612j952j059q79j548k113j816j050
56654B96638m79J12J129J780P96j451k963k603j376p88j047j480j724j766j429
56639B83349n76M80J266J488R44l90k008l043l067k354j325j64J093K462L855
56624B82010M599L646J031j423j831m03J187K091K759L412L552L085K617K441
56610C08773K270K046K082K403K957M129N882O854N808L819L249M595O053O292
56596C67212N812N317M501L032J178r92l528n536n888n433o525r735j2758j3432
56582C23225j2167j0540r083p600o232n107l923k702j919j412m66O56P58k34r19
$$ plain form
56683 378013 370456 364015 358558 354565 352201 349774 345144 338909 334279 333092 333521 332634 329833 326637 324084
56668 324084 321806 319281 316719 314440 312212 309667 307055 305103 304044 303165 301617 299504 297688 296638
56654 296638 296159 296271 297400 299180 299976 298525 295562 292959 291583 290795 289748 288268 286544 284778 283349
56639 283349 282773 283253 284519 286007 286951 286561 284553 281510 278443 276089 274764 274600 275693 278155 282010
56624 282010 286609 290255 291286 289863 288032 287629 288816 290907 293666 297078 300630 303715 306332 308773
56610 308773 311043 313089 315171 317574 320531 324660 330542 337396 343204 347023 350272 354867 360920 367212
56596 367212 373024 378341 382842 385874 387052 386060 382532 376996 371108 365675 359150 349415 336657 323225
56582 323225 311058 300518 291435 283835 277603 272496 268573 265871 263952 262540 262074 262730 263488 263254 262335
56567B62335o61m21o94n83K13N18q9j58J092K140J616N07J29l34k066l835l408
56550B56301r08J294J585K76j594k920k585n02J736K603K411K197J654k21k980
56535B58347m882m905l364r82J391K665K429J593J115P30l8n50n0Q86J417K040
56519B57842L487M768M275K419J265J723K807L642M354M868M592L712L432M399
56505C07585N958P299Q357R301J0006J0400J0686J1024J1419J1821J1865J0823
56493D26544Q409N434L173K423L424N735P648O947L420k60j427m61L09j72j156
56478D69990k030k886l431l194k819l498m987n783n450n218n847o356n576l871
56464D09044k471j927j857j871k178l284n201o937p209n929m458l910l946l867
$$ plain form
56567 262335 261674 261253 260559 259976 260189 260707 260618 260460 261552 263692 265308 265815 265944 265610 263544 259709 256301
56550 256301 255393 256687 258272 258548 256954 254034 251449 250947 252683 255286 257697 259894 261548 261327 258347
56535 258347 253465 248560 245196 244214 245605 248270 250699 252292 253407 254137 254099 253549 253499 254385 255802 257842
56519 257842 261329 266097 270372 272791 274056 275779 278586 282228 286582 291450 296042 299754 303186 307585
56505 307585 313543 320842 329199 338500 348506 358906 369592 380616 392035 403856 415721 426544
56493 426544 434953 440387 443560 445983 449407 455142 462790 469737 473157 472897 471470 471009 471318 471146 469990
56478 469990 467960 465074 461643 458449 455630 452132 447145 441362 435912 430694 424847 418491 412915 409044
56464 409044 406573 404646 402789 400918 398740 395456 390255 383318 376109 370180 365722 361812 357866 353999
56450C53999l989m827n581m911k904j079m48p49j452k346l096l184k539j496k81
56435C15117Q13J079J77r65j041mJ084J690K197K740K751J928Q19N6l72q59j517
56418C25693j867j144Q20K897L484K344R54N88Q65P54P1p61j588k197k010j019
56402C27884k47l55n77p6O16O42L89O87J286J439J291J326J256Q11Q41K055L431
56385C42699L472K404J576J353J299J629K668L477K959J878J854K773L204K845
56371C76090K483J898K17j734j907j87J177Q16q7n0P17J299J418J033o9j487k116
56354C79511j445o9J283K349K918K772K063R38p94k756l563k689j770k370l397
56339C72981k845j260q49j649j444M81K337K925K961K859J950O55Q32K817M426
$$ plain form
56450 353999 350010 345183 339602 334691 331787 330708 330260 329511 328059 325713 322617 319433 316894 315398 315117
56435 315117 315930 317009 317186 316221 315180 315176 316260 317950 320147 322887 325638 327566 328385 328441 328069 327210 325693
56418 325693 323826 322682 323502 326399 329883 332227 333181 333769 334634 335388 335459 334698 333110 330913 328903 327884
56402 327884 327637 327282 326705 326629 327245 327887 328276 328963 330249 331688 332979 334305 335561 336372 337213 339268 342699
56385 342699 346171 348575 350151 351504 352803 354432 357100 360577 363536 365414 367268 370041 373245 376090
56371 376090 378573 380471 380688 378954 377047 376860 378037 378853 378766 378716 379433 380732 382150 383183 383114 381627 379511
56354 379511 378066 377997 379280 381629 384547 387319 389382 390320 389526 386770 383207 380518 378748 376378 372981
56339 372981 370136 368876 368027 366378 364934 365415 367752 370677 373638 376497 378447 379102 379934 382751 387177
56324C87177M034K554J417P57N60J388K708K646P41r73j061q24j815l096k783
56309C93430r74P52J609J882J866J862K406L306L352K027M91k6K11M54Q40J689
56293D15177K512K865L299M294N153M885L598K139J054N55P66J384J876K326L156
56278D55039L814L075J122j21N24J995K696K460J994J621J481J989L224M575N568
56263D91056O232O392N662M395L451K779J625K33j35P48J679K039K511L257L242
56248E35166K172J439K257M187O204P838Q816Q995R051R709J0135Q956O967O491
56234F28383P766Q465P549O815P444P806O435M870N483Q193J1133J3145J4104
56221G37591J4121J3867J4491J6111J7547J8121J8245J7811J6180J4420J5066
$$ plain form
56324 387177 391211 393765 395182 395939 396499 397887 400595 403241 403982 403009 401948 401124 399309 396213 393430
56309 393430 392456 393208 394817 396699 398565 400427 402833 406139 409491 411518 412009 411983 412194 412648 413488 415177
56293 415177 417689 420554 423853 428147 433300 438185 441783 443922 444976 445531 446297 447681 449557 451883 455039
56278 455039 458853 461928 463050 462929 463453 465448 468144 470604 472598 474219 475700 477689 480913 485488 491056
56263 491056 497288 503680 509342 513737 517188 519967 521592 521825 521690 522438 524117 526156 528667 531924 535166
56248 535166 537338 538777 541034 545221 551425 559263 568079 577074 586125 595834 605969 614925 621892 628383
56234 628383 636149 644614 652163 658978 666422 674228 680663 685533 691016 699209 710342 723487 737591
56221 737591 751712 765579 780070 796181 813728 831849 850094 867905 884085 898505 913571
56210I13571J8510K1998K3380K3604K4260K5231K6260K8302L1573L4487L6271
56199A207447L8368M1723M5082M7693N1068N6178O1588O6506P2861Q1845R0968
56188A861327R7416J02067J07384J13385J18591J22851J26239J27020J23878J18670
56178C018828J13852J08414R9299Q5628O8962N0613L1359J2500n411k3554m2156
56167C518334n8402o9782p7833q5660r3244r8379j00862j02412j03415j02864
56157B625481j00816r8058r4180q8709q3253p9714p7305p4038p0013o6463o2702
56146A730230n7176n0695m5505m1932l8768l6130l4907l4219l2384k9734k7525
56135A301255k5028k0888j6461j4328j4008j2550r217o345n626o424p665q633
$$ plain form
56210 913571 932081 954079 977459 1001063 1025323 1050554 1076814 1105116 1136689 1171176 1207447
56199 1207447 1245815 1287538 1332620 1380313 1431381 1487559 1549147 1615653 1688514 1770359 1861327
56188 1861327 1958743 2060810 2168194 2281579 2400170 2523021 2649260 2776280 2900158 3018828
56178 3018828 3132680 3241094 3340393 3426021 3494983 3545596 3576955 3589455 3584044 3560490 3518334
56167 3518334 3459932 3390150 3312317 3226657 3133413 3035034 2934172 2831760 2728345 2625481
56157 2625481 2524665 2426607 2332427 2243718 2160465 2080751 2003446 1929408 1859395 1792932 1730230
56146 1730230 1673054 1622359 1576854 1534922 1496154 1460024 1425117 1390898 1358514 1328780 1301255
56135 1301255 1276227 1255339 1238878 1224550 1210542 1197992 1188775 1182430 1176804 1170380 1162715 1154082
56123A154082q115n465k400j196j432j046J38O68O71J656L544M808N551P445J0550
56108A169459J2840J3148J2431J2017J2422J3707J5404J6599J7276J8424J9698
56097A333425J9144J6968J6808K0695K5485K7497K8007L0370L4330L7570M0745
56086A631044M6143N2890N8320O2883O8998P6219Q2367Q8480R7590J09148J19549
56075B493631J27601J34453J38502J35925J26703J15249J04433R3513Q2360P3033
56065C625403O6179N9809N2351M3380L1413J5173k751j7527k7625l5233m1704
56054C768868m6861n2420o1351p3449q5600r6313j05871j12600j13734j09949
56044B910720j04477r7981q8901p8259o8974o0835n1425m1772l5388l1780k6784
$$ plain form
56123 1154082 1145967 1140502 1138102 1136906 1135474 1134428 1134566 1135234 1135905 1137561 1141105 1145913 1151464 1158909 1169459
56108 1169459 1182299 1195447 1207878 1219895 1232317 1246024 1261428 1278027 1295303 1313727 1333425
56097 1333425 1352569 1369537 1386345 1407040 1432525 1460022 1488029 1518399 1552729 1590299 1631044
56086 1631044 1677187 1730077 1788397 1851280 1920278 1996497 2078864 2167344 2264934 2374082 2493631
56075 2493631 2621232 2755685 2894187 3030112 3156815 3272064 3376497 3470010 3552370 3625403
56065 3625403 3691582 3751391 3803742 3847122 3878535 3893708 3890957 3873430 3845805 3810572 3768868
56054 3768868 3722007 3669587 3608236 3534787 3449187 3352874 3247003 3134403 3020669 2910720
56044 2910720 2806243 2708262 2619361 2541102 2472128 2411293 2359868 2318096 2282708 2250928 2224144
56033B224144j9680j4162j1604r218n647k865j498L77L004M654N907R013J2864
56020B195289J4215J3812J5267J8045J8314J6761J8355K3555K7186K7225K7362
56009B415386K9465L0837L0782L2389L5779L6764L4570L3742L6122L7905L7016
55998B790757L6419L7704L8382L7950L9564M3388M5422M5039M6172M8954M8412
55987C258163M4030M2159M5761N0049N1670N3756N8108O1004O1050O2957O9055
55976C857762P4949P7958Q1801Q8631R4420R6774R9246J03679J06457J06659J09240
55965D897576J15691J20463J21215J23335J29366J33689J33215J33689J39374
55956F047613J45972J49725J53997J60804J65724J67531J72778J84362J95702
$$ plain form
56033 2224144 2204464 2190302 2178698 2169480 2163833 2160968 2159470 2159847 2162851 2167505 2173412 2182425 2195289
56020 2195289 2209504 2223316 2238583 2256628 2274942 2291703 2310058 2333613 2360799 2388024 2415386
56009 2415386 2444851 2475688 2506470 2538859 2574638 2611402 2645972 2679714 2715836 2753741 2790757
55998 2790757 2827176 2864880 2903262 2941212 2980776 3024164 3069586 3114625 3160797 3209751 3258163
55987 3258163 3302193 3344352 3390113 3440162 3491832 3545588 3603696 3664700 3725750 3788707 3857762
55976 3857762 3932711 4010669 4092470 4181101 4275521 4372295 4471541 4575220 4681677 4788336 4897576
55965 4897576 5013267 5133730 5254945 5378280 5507646 5641335 5774550 5908239 6047613
55956 6047613 6193585 6343310 6497307 6658111 6823835 6991366 7164144 7348506 7544208
55947G544208K02789K11350K25260K39193K50106K64454K86092L08631L27885
55938I859968L49813L77492M02930M21244M40373M66996M95777N22691N55383
55929A3892667N99194O46633O92337P44464Q09060Q77344R41195J006504J078164
55920B1287562J147730J210471J278828J363802J458929J557489J667532J793432
55912C2765775J921858K044710K177117K334192K510817K704322K933753L214006
55904E2606550L535257L892677M310500M809860N381417O019682O754103P615738
55896I4925784Q611085R766243J1155333J2843277J4848430J7202001J9965481
55889A89317634K3116863K6503708K9970344L3301667L5712133L5476824L0640147
$$ plain form
55947 7544208 7746997 7958347 8183607 8422800 8672906 8937360 9223452 9532083 9859968
55938 9859968 10209781 10587273 10990203 11411447 11851820 12318816 12814593 13337284 13892667
55929 13892667 14491861 15138494 15830831 16575295 17384355 18261699 19202894 20209398 21287562
55920 21287562 22435292 23645763 24924591 26288393 27747322 29304811 30972343 32765775
55912 32765775 34687633 36732343 38909460 41243652 43754469 46458791 49392544 52606550
55904 52606550 56141807 60034484 64344984 69154844 74536261 80555943 87310046 94925784
55896 94925784 103536869 113303112 124458445 137301722 152150152 169352153 189317634
55889 189317634 212434497 238938205 268908549 302210216 337922349 373399173 404039320
55882D04039320K0598520P025956o949609j8562831k6548947l0964658l2451023
55875C16186728l1782212k9738943k7000559k4037945k1134712j8469410j6130225
55868A47892722j4108520j2357861j0855546r583912q494040p534664o693907
55861G8264272n977126n366096m831878m366172l968613l621128l303207l016732
55853D3813320k770390k554193k352320k166713k005864j863527j729017j605677
55845B6765619j499391j401049j299541j200766j115618j040006r64464q92957
55837A7351827q34169p83437p30770o78939o36948o02546n66784n29647m96616
55828A1491971m65735m31955l98744l72067l48137l19586k88720k62619k40102
$$ plain form
55882 404039320 424637840 431663796 424714187 406151356 379602409 348637751 316186728
55875 316186728 284404516 254665573 227665014 203627069 182492357 164022947 147892722
55868 147892722 133784202 121426341 110570795 100986883 92492843 84958179 78264272
55861 78264272 72287146 66921050 62089172 57723000 53754387 50133259 46830052 43813320
55853 43813320 41042930 38488737 36136417 33969704 31963840 30100313 28371296 26765619
55845 26765619 25266228 23865179 22565638 21364872 20249254 19209248 18244784 17351827
55837 17351827 16517658 15734221 15003451 14324512 13687564 13085018 12518234 11988587 11491971
55828 11491971 11026236 10594281 10195537 9823470 9475333 9155747 8867027 8604408 8364306
55819H364306k15468j90686j72591j61916j55486j55056j63744j77391j89040
55810F782928j98280k07617k14091k13400k08200k03550j98160j88367j76544
55801D974719j67334j59650j50332j41377j35843j31002j23328j15658j11657
55792C738538j08047j00439r2162q8879q8799q6606q2899q1308q0303p6484p2250
55781B780362p1634p1937o8026o1759n8664n8273n6189n3015n2628n3864n2294
55770B122079m8512m6683m6448m3978l9570l6930l6268l5016l3821l4983l6606
55759A683264l5045l1614l0305l0571k8906k5748k4219k3809k1845j9359j8873
55748A392970j8467j4880j0498r937j1529r766m826j942k173j721K9n20l874o470
$$ plain form
55819 8364306 8148838 7958152 7785561 7623645 7468159 7313103 7149359 6971968 6782928
55810 6782928 6584648 6377031 6162940 5949540 5741340 5537790 5339630 5151263 4974719
55801 4974719 4807385 4647735 4497403 4356026 4220183 4089181 3965853 3850195 3738538
55792 3738538 3630491 3530052 3437890 3349011 3260212 3173606 3090707 3009399 2929096 2852612 2780362
55781 2780362 2708728 2636791 2568765 2507006 2448342 2390069 2333880 2280865 2228237 2174373 2122079
55770 2122079 2073567 2026884 1980436 1936458 1896888 1859958 1823690 1788674 1754853 1719870 1683264
55759 1683264 1648219 1616605 1586300 1555729 1526823 1501075 1476856 1453047 1431202 1411843 1392970
55748 1392970 1374503 1359623 1349125 1339188 1327659 1317893 1313067 1311125 1308952 1307231 1307260 1306740 1302866 1296396
55734A296396p571j0163j4278j6195j5378j5802j8940k1388k0977j9864j9898
55723A115942j9786j8466j6989j5851j4255j2756j2860j3769j3245j1512j0358
55712I56095q865m574J354M903M971L797J723l359j0979j7387k0840k3242k5724
55699H57873k6681k5225k2777k0389j7875j6085j6594j8620j9488j8488j7261
55688F38390j6554j5628j4599j4115j3193j0591p645o424o063m668l495m884p198
55675E13333o793m378m166o765q167o374m066l667m293m844n935p524q106p422
55661D30833o751o021l965j348m05q60j96J933L493M441O982J0789J2324J0138
55647D61387O830M472J818k373o696r550j1379j2927j3698j3321j2381j1168r522
$$ plain form
55734 1296396 1288825 1278662 1264384 1248189 1232811 1217009 1198069 1176681 1155704 1135840 1115942
55723 1115942 1096156 1077690 1060701 1044850 1030595 1017839 1004979 991210 977965 966453 956095
55712 956095 947230 942656 944010 948913 953884 957681 959404 956045 945066 927679 906839 883597 857873
55699 857873 831192 805967 783190 762801 744926 728841 712247 693627 674139 655651 638390
55688 638390 621836 606208 591609 577494 564301 553710 546065 539641 533578 528910 525415 520531 513333
55675 513333 506540 502162 497996 491231 483064 476690 472624 468957 464664 459820 453885 446361 438255 430833
55661 430833 424082 418061 414096 412748 412343 411483 411287 413220 416713 421154 428136 438925 451249 461387
55647 461387 468217 472689 474507 472134 465438 455888 444509 431582 417884 404563 392182 381014 371492
55634C71492q057p415o701n084m052n136o424m981j939r22j999j799L77J617J052
55619C20029J432L748N106L882K602L477M691L692J145o98j184j016p87j125k349
55604C42645l297k507p76j10k56O88K363K420R81J018L439N541N452M553M295
55589C66449M014L225K862K915J839n37k442l317m454n809n684m430m818p573
55575C42240j0153j1084j1719j2464j1385q323o282o623o615m186j498j103j982
55562B48823k096j978k791l469k766j928k646m147m760m544m220l268j234O24
55548B09600R29N9r70j891k409j854p38o48j649j890o67N10O37L76j79j806l406
55531A94004k454N99K002K72j597j306n90j097j031J071K917K258Q79J245K174
$$ plain form
55634 371492 363435 356020 349319 344235 340183 335047 328623 323642 321703 320781 318782 316983 317360 318977 320029
55619 320029 321461 325209 330315 334197 336799 340276 344967 348659 349804 349106 347922 346906 346119 344994 342645
55604 342645 339348 336841 336065 335955 335699 336387 338750 341170 342151 343169 346608 352149 357601 362154 366449
55589 366449 370463 373688 376550 379465 381304 380767 378325 375008 370554 364745 359061 354631 349813 342240
55575 342240 332087 321003 309284 296820 285435 277112 270830 264207 257592 253406 251908 250805 248823
55562 248823 246727 244749 241958 238489 235723 233795 231149 227002 222242 217698 213478 210210 208976 209600
55548 209600 210529 210588 209618 207727 205318 203464 202726 202078 200429 198539 197872 198382 199019 199395 199216 197410 194004
55531 194004 191550 192149 194151 194423 192826 191520 190930 189833 188802 189873 192790 195048 195927 197172 199346
55516A99346J584Q49K252M423M627L860N184Q142R164P163M810M113M124L425
55502B63066K026K42k024m320n534n183l798k354k018l608o242p647o895n601
55488B10110n278n054l548j330J85R00J320J064n5p58LJ264J592J271J268J341
55472B04295Q78L51J45o60k616m244l912k302j261j371k200l621n096n053k955
55457A70378q70j067l105n002o104o862o998n943m322l109k088o57O75J130J090
55442A27146J248J281P44J29j80p67j716j749k91J106R66P6k8O38J237J619J619
55425A33078N21j332k104j202m34q83r01P32K152J351m28j026r41j611j975k20
55409A24777K465L336K378J874K472K731K079J305N24o56j415p87J62k47j349
$$ plain form
55516 199346 200930 201779 204031 208454 213081 216941 222125 230267 239431 246594 251404 255517 259641 263066
55502 263066 265092 265334 263310 258990 253456 248273 244475 242121 240103 236495 230253 222606 215711 210110
55488 210110 204832 199778 196230 194900 195085 195985 197305 198369 198314 197556 197559 198823 200415 201686 202954 204295
55472 204295 205173 205524 205669 205009 202393 198149 194237 191935 190674 189303 187103 183482 178386 173333 170378
55457 170378 169508 168441 165336 160334 154230 147368 140370 134427 130105 126996 124908 124251 124926 126056 127146
55442 127146 128394 129675 130419 130548 130368 129601 127885 126136 125845 126951 127917 127993 127965 128603 129840 131459 133078
55425 133078 133599 132267 130163 128961 128527 127644 126743 127475 129627 130978 130550 129524 128583 126972 124997 124777
55409 124777 127242 130578 132956 134830 137302 140033 142112 143417 143941 143285 141870 141083 141245 140998 139649
55394A39649j280l53m10j326j166K90J124M94m00p63j195j922k265k164k191j934
55378A24188l65K080L610L474K554J679R66P17J250J953J953J483J237R99M01
55363A48179K50J355K750K913K065J524J543J631K094L302M311M202L829M232
55349A84180M456L179J268K07o65k622m438m074k552k703m601n618m858m060m028
55334A53071l568k347j696k009k104j662j594j736r19L90L72q16r42N58J696J468
55318A38162J230J659J244q41k871l057j849o16J25L16j04n13k03R2q73k337k270
55301A27294o74L80K80N37J503J600N81L50J389J479m40k206k027j306j803k560
55285A24377j953o06J68Q39K195L096K223P02N68J599J950J142K74j02l62n14
$$ plain form
55394 139649 138369 138016 137606 136280 135114 135404 136528 137022 136622 135859 134664 132742 130477 128313 126122 124188
55378 124188 123823 125903 129513 132987 135541 137220 138186 138903 140153 142106 144059 145542 146779 147778 148179
55363 148179 148429 149784 152534 155447 157512 159036 160579 162210 164304 167606 171917 176119 179948 184180
55349 184180 188636 191815 193083 193290 192625 190003 185565 181491 178939 176236 171635 166017 161159 157099 153071
55334 153071 149503 147156 145460 143451 141347 139685 138091 136355 135436 135826 136198 135382 134440 134998 136694 138162
55318 138162 139392 141051 142295 141454 138583 135526 133677 133061 133186 133502 133398 132885 132682 132774 131901 129564 127294
55301 127294 126620 127000 127280 127817 129320 130920 131501 131851 133240 134719 134279 132073 130046 128740 126937 124377
55285 124377 122424 121818 121986 122825 125020 128116 130339 131041 131609 133208 135158 136300 136574 136472 136110 135596
55269A35596k43Rm42j206j263n76n9k09o78r77q30j22P87J082M19n02p69k69M38
55250A30186P49L72m17p98l35K56J40j38M96J539J428K70P2J587K808J750p72
55233A39193k370j956l54J116J593R17k14p65n05j71k63m99n78o19o89o58n65
55216A32613l19O17K104K495N52k241l215k113r30m17O27K249K485O66j055q56
55200A33262K27M36j31n42p95r58k82J187J743M27j163j165j22L64K89O37J197
55183A34611R81P1o78j179j773j961j110P4K71n24j041n58M23J141J427J655K258
55166A34088K983K634M42k221k882j115Q09R97N0p33j392k241k354q91J110J899
55150A31183J219P9p92j068l72J084K180K339K294K457J848o8j810j838q75n00
$$ plain form
55269 135596 135353 135362 134920 133714 132451 131875 131816 131607 130929 129952 129122 129000 129787 130869 131288 130786 130017 129748 130186
55250 130186 130935 131307 130890 130092 129757 130013 130153 130015 130511 132050 133478 133748 133820 135407 138215 139965 139193
55233 139193 136823 134867 134513 135629 137222 138139 137925 137160 136655 136484 136221 135722 135144 134525 133836 133178 132613
55216 132613 132294 132911 135015 137510 138062 135821 132606 130493 129563 129146 129773 132022 134507 135173 134118 133262
55200 133262 133489 133925 133794 133252 132457 131499 131217 132404 134147 134574 133411 132246 132124 132488 132777 133414 134611
55183 134611 135592 135663 134985 133806 132033 130072 128962 129036 129307 128783 127742 127184 127607 128748 130175 131830 134088
55166 134088 137071 139705 140147 137926 135044 133929 134738 135735 135785 135052 133660 131419 129065 128174 129284 131183
55150 131183 132402 132481 131689 130621 130249 131333 133513 135852 138146 140603 142451 142383 140573 138735 137860 137360
55134A37360m80M88K078K572J475R3n28o28p82j163j695j910j007R12K269J893
55118A40947P64N23R33O13k86k22R45J357j04k145k911k290j483j152q45P0J463
55101A36177K452K300J326O77J031J937K574K590J938O99m36m32O61J352O53n48
55085A54951r88r69j486k147j591K65J842J869O44p59j609j641j030l85k52m59
55069A46255l45L46J149J411R28K38K26J074J669R10m58m89J154K460J773q3j337
55052A56881j637j656j500r85n95o91m40R11K331K113M78n64K06J972L209L057
55036A63090J599j25n76O08J647N73j982l337k144J74J605J822J655J415P02n74
55020A66152j778k147j490k76Q64J617J869J402K81n78j49J142J538K34j315j172
$$ plain form
55134 137360 136880 137368 139446 142018 143493 143586 143058 142430 141648 140485 138790 136880 135873 136785 139054 140947
55118 140947 141711 142234 143167 143780 143494 143272 144217 145574 145470 143325 140414 138124 136641 135489 134644 134714 136177
55101 136177 138629 140929 142255 142932 143963 145900 148474 151064 153002 153701 153265 152833 153494 154846 155499 154951
55085 154951 153963 152994 151508 149361 147770 148035 149877 151746 152390 151631 150022 148381 147351 146966 146714 146255
55069 146255 145910 146256 147405 148816 149744 149982 150208 151282 152951 153861 153403 152914 154068 156528 158301 158218 156881
55052 156881 155244 153588 152088 151103 150508 149817 149377 150288 152619 154732 155210 154646 154852 156824 160033 163090
55036 163090 164689 164564 163988 164596 166243 166816 164834 161497 159353 159527 161132 162954 164609 166024 166726 166152
55020 166152 164374 162227 160737 160461 161325 162942 164811 166213 166494 165916 165767 166909 168447 168681 167366 166194
55004A66194O88K584L092K035J22j538j972j227m37m41q38r69j023j443j953k152
54988A60722k320k626k213l43K002K979K133O87k33n18l36L73J411K095J860P68
54972A66441n19j029k06J168J401j11j799j651K50J813J391n46k145k070o95M23
54956A62116L30j92K20J460K093J537Q10Q09J241J755K589L352K763P44p17j48
54940A80762J287J655R52M00K21j22m75m71o77j528k032j282l85q82k019j766
54924A73638n6J285J525J584J672Q49p18j295k75O87J71r22q94L51J530J750J134
54907A82016K17m40l35P01K263L512L592K262M07n50j99L63jj127k142k576k182
54890A85781o50J534K806K225P58j49m38p98j117r21n04k58L40J639K650K476
$$ plain form
55004 166194 166882 169466 172558 174593 174715 173177 171205 169978 169541 169100 168262 167293 166270 164827 162874 160722
54988 160722 158402 155776 153563 153220 155222 158201 160334 161021 160788 160270 159934 160307 161718 163813 165673 166441
54972 166441 165922 164893 164687 165855 167256 167145 165346 163695 163945 165758 167149 166603 164458 162388 161693 162116
54956 162116 162446 162254 162474 163934 166027 167564 168374 169183 170424 172179 174768 178120 180883 181627 180910 180762
54940 180762 182049 183704 184656 185056 185277 185155 184680 184209 183532 182004 179972 178690 178305 177423 175404 173638
54924 173638 173582 174867 176392 177976 179648 180497 179779 178484 178209 178896 179067 178145 177251 177602 179132 180882 182016
54907 182016 182233 181793 181458 182159 184422 187934 191526 193788 194195 193645 193446 193809 193808 192681 190539 187963 185781
54890 185781 185131 186665 189471 191696 192454 192305 191867 191069 189952 189031 188527 188269 188609 190248 192898 195374
54874A95374J987K385L058K797K189K651L798M121L709L872M473M272L752M881
54860B43319P776J0230J0909J0576R648P251L628J004N24L80j623n076p839q567
54846B82140p303m865k688k230l460m771m953m402l932l601l187k685j815k08
54832B32040J493J931R70J25N13J460J721R90j13n89O35L677O782P756O612N386
54816B71389N232N317M925M712N060M925L491J593M55m9q86k461m303n614n838
54801B87948n462o002q068r836r097o477m547l899k707m68P10m14k196k961l332
54786B23192m012l768j832k29j133l364m077k867j667j356r80l6P60J029J183
54771B00843J198N40n11r60p76j203k900m741m900k814K45K289K384J362O11L62
$$ plain form
54874 195374 197361 199746 202804 205601 207790 210441 214239 218360 222069 225941 230414 234686 238438 243319
54860 243319 251095 261325 272234 282810 292458 299709 303337 304341 304865 305245 303622 298546 290707 282140
54846 282140 274837 269972 267284 265054 261594 256823 251870 247468 243536 239935 236748 234063 232248 232040
54832 232040 233533 235464 236434 236559 237072 238532 240253 241243 241130 240541 241176 244853 251635 259391 266003 271389
54816 271389 276621 281938 286863 291575 296635 301560 305051 306644 307099 307050 306164 303703 299400 293786 287948
54801 287948 282486 276484 268416 258580 249483 243006 238459 234560 231853 231385 232095 231681 229485 226524 223192
54786 223192 219180 215412 213580 213351 212218 208854 204777 201910 200243 198887 197907 197871 198631 199660 200843
54771 200843 202041 202581 202070 201110 200334 199131 196231 191490 186590 183776 184021 186310 188694 190056 190667 191029
54755A91029o8o25m19M40M76q89k079j524KO45J82J42J456L326M319L799K257
54738B02469Q59M75Q62J083Q15O56J008J510J792J829J349K4j322r99J229L315
54722B16954L223J230p39j231j23J637K615K157J514K614N344P420P360O068M966
54707B61009M435M798O742R549J0863R762Q235P993P787N820K993J246O3k596
54693C38699o683r921j0882j0077q333o183m615m437m960m932m417m127l560j857
54679B53715rJ11j282k018j188p5L49O28J110R89j08j199j332n42R58L218N623
54662B58948O960P053P107P818Q396Q021P003N659L309n22m649p099p240o290
54648B94474n891o586p635p980p327o208n096l880k485j307o22j43J78k98j711
$$ plain form
54755 191029 190961 190336 189917 190357 190833 189944 187865 186341 186343 186988 187170 187312 188768 192094 196413 200212 202469
54738 202469 203328 203803 204665 205748 206563 207219 208227 209737 211529 213358 214707 214731 213409 212410 213639 216954
54722 216954 220177 221407 220668 219437 219314 220951 223566 225723 227237 229851 235195 242615 249975 256043 261009
54707 261009 265444 270242 276984 286533 297396 307158 315393 323386 331173 336993 339986 341232 341295 338699
54693 338699 332016 322095 311213 301136 292803 286620 282005 277568 272608 267676 263259 259132 255572 253715
54679 253715 253706 253817 252535 250517 249329 249254 249603 250231 251341 252330 252222 251023 249691 249149 250107 253325 258948
54662 258948 265908 272961 280068 287886 296282 304303 311306 316965 320274 319752 315103 308004 300764 294474
54648 294474 288583 281997 274362 266382 259055 252847 247751 243871 241386 240079 239457 239314 239492 239194 237483
54633B37483k837k630j946k371l719m227l095j331q4M84M98p2q80j331j587k335
54617B10020l312l222j475R53K715L247K560Q69j126k470k807k390j339K00J272
54602B03695P27j111k577k738k202j535l31J476K567J667o31k387k270n16J484
54587A95318K109P38j343j907l04J662K081J434J637L088L994K863M90j160j359
54572B09341j017j048j292j313j392k009k705k406r41N50R82M79j64n34o46m83
54556A95402l7M75P97Q49N63k9m54j28P54J440J867K730L909M098K679Q33j57
54539B15591o10j373k117j984j171m58J06P14P75j31r73n54M71N96n8j30M97O38
54521B09829K03N01J791K521J656Q5r20j151o83P87K960M451M196K598P10p63
$$ plain form
54633 237483 234646 232016 230070 227699 223980 219753 216658 215327 215243 215727 216225 216153 215273 213942 212355 210020
54617 210020 206708 203486 202011 202964 205679 208926 211486 212355 211229 208759 205952 203562 202223 202423 203695
54602 203695 204422 203311 200734 197996 195794 194259 193928 195404 197971 199638 199007 196620 194350 193834 195318
54587 195318 197427 198165 196822 194915 194611 196273 198354 199788 201425 204513 208507 211370 211860 210700 209341
54572 209341 208324 207276 205984 204671 203279 201270 198565 196159 195218 195768 196750 197229 197065 196531 195885 195402
54556 195402 195365 195840 196637 197486 198049 198020 197566 197438 198192 199632 201499 204229 208138 212236 214915 215748 215591
54539 215591 214981 213608 211491 209507 208336 207878 207984 208698 209473 209342 208369 207815 208286 208882 208824 208694 209191 209829
54521 209829 210032 210533 212324 214845 216501 216586 215666 214515 213832 214619 217579 222030 226226 228824 229534 228771
54505B28771j376r72k93m11j053n99J609M033M699L363J338qp8Q15J613J488Q95
54488B43834Q19J035L72j096j747q69J39J3l81M57K249L429L338K638K044J728
54472B58002J695J800J623R56J56n13j360k540l402l239k246j135k97J70J01m17
54456B49354q08o81k62J64O53J043P93p4o43m05j16o04j472j800j493r84k26J017
54438B43456K246K577J775L87q31j123j41J243J384J51k99J652M333M703K518
54423B64031N73P49J897K272K095K471L141K919J687N76L55O85R51J033J146J474
54407B88055K049K668K966K796K420K012J357L96k67j61K6q39k519l364k509j138
54391B93948p84j151p84N05J237M22j100j980k023j894j901j863j725j561j259
$$ plain form
54505 228771 227395 226423 226130 225719 224666 224067 225676 229709 234408 237771 239109 239101 239023 239838 241451 242939 243834
54488 243834 244653 245688 246060 244964 243217 242348 242487 242500 242119 242576 244825 248254 251592 254230 256274 258002
54472 258002 259697 261497 263120 264076 264232 263719 262359 259819 256417 253178 250932 249797 249500 249670 249771 249354
54456 249354 248546 247865 247603 247767 248420 249463 250256 250182 249539 249134 249018 248414 246942 245142 243649 242665 242439 243456
54438 243456 245702 248279 250054 250441 249610 248487 248346 249589 250973 251124 250825 252477 256810 261513 264031
54423 264031 264604 265353 267250 269522 271617 274088 277229 280148 281835 282411 282766 283451 284402 285435 286581 288055
54407 288055 290104 292772 295738 298534 300954 302966 304323 304719 304452 304291 304317 303478 300959 297595 295086 293948
54391 293948 293164 292013 291229 291734 292971 293393 292293 290313 288290 286396 284495 282632 280907 279346 278087
54376B78087q14o25q59q92j17R63J331R81R35J563J817O44j421k727k404j239
54360B75223n64o66p21k40J20l26j012r30m15p89k087k641j562j37K66K83J068
54343B64870J977J577K80r6R40K102K575K738K548J263o94j470l01J294J719J354
54327B82676J322J495J050J00n00m33j2N79J158J159L18n82m68O15J566J547P32
54310B92322q1j71O27J752K346K202K004K358K875K699J782J151J746L155L842
54295C20609K811Q40m89r88k071m332o056n361l009j516j821k485k185j338r36
54280B91673j250k188l576m605m233k664j323r18p80l88p0K76J450L096L279J061
54264B78840j863l300l046k140j056J4L77l5O6J343K253J215p40j497j138j343
$$ plain form
54376 278087 277273 276648 275789 274897 274780 275743 277074 278055 278990 280553 282370 283014 281593 278866 276462 275223
54360 275223 274659 273993 273272 273032 273152 272826 271814 270884 270469 269680 267593 264952 263390 263253 263519 263802 264870
54343 264870 266847 268424 268704 268608 269548 271650 274225 276963 279511 280774 280080 278610 278309 279603 281322 282676
54327 282676 283998 285493 286543 286643 286143 285710 285698 286277 287435 288594 288912 288330 287862 288477 290043 291590 292322
54310 292322 292241 292070 292697 294449 296795 298997 301001 303359 306234 308933 310715 311866 313612 316767 320609
54295 320609 323420 324260 323771 322783 320712 316380 310324 304963 301954 300438 298617 296132 293947 292609 291673
54280 291673 290423 288235 284659 280054 275821 273157 271834 270916 270136 269748 269678 269954 271404 274500 277779 278840
54264 278840 276977 273677 270631 268491 267435 267449 267826 267791 267857 269200 271453 272668 271928 270431 269293 267950
54248B67950k056j404R87K986K886J342l17j848l237l632k350l7K053L149K851
54233B69323R90j584l089k623j279o64r35j176j043j059j424j526p26Q41K317
54218B56343K735J833N26K30J262K350K199J149N56Q51J191J007P63Q43O54l54
54202B74138j560j999j811j805j869j099M55J536J551J386J662J502J76j188j077
54187B69998l9P4j044j890j734j506j690j184P40K779L183K043Q05K56R4M0J99
54170B71124M62M26o0p25j242j374j027l86J81M92M66k35j713k973k595p12P60
54153B60869M93o46j107p75n81q47j170j388j459q93M96J650J415M20M67J985
54137B58929L424L421K422J576J090M51m31j181j701k144k233j356M08J863J896
$$ plain form
54248 267950 265894 264490 265477 268463 271349 272691 272374 270526 267289 263657 261307 261270 263323 266472 269323
54233 269323 270313 268729 265640 263017 261738 261074 260139 258963 257920 256861 255437 253911 253185 254026 256343
54218 256343 259078 260911 261437 261667 262929 265279 267478 268627 269183 270034 271225 272232 272995 273838 274492 274138
54202 274138 272578 270579 268768 266963 265094 263995 264450 265986 267537 268923 270585 272087 272263 271075 269998
54187 269998 269959 270033 268989 267099 265365 263859 262169 260985 261725 264504 267687 269730 270535 270791 270885 270925 271124
54170 271124 271586 272012 271952 271227 269985 268611 267584 267198 267379 267871 268337 268102 266389 263416 260821 260109 260869
54153 260869 261362 260716 259609 258834 258253 257406 256236 254848 253389 252496 252992 254642 256057 256477 256944 258929
54137 258929 262353 265774 268196 269772 270862 271313 270882 269701 268000 265856 263623 262267 262675 264538 266434
54122B66434Q80K83Q08J589J619J294J599K353K413J577R51J132J212K92j065
54107B83371j702j458j003o84m38l99p40j170j270j147j169j305j315j296j479
54092B66796j729j813j874k043j895r53L49Q95K47p29q43J7P10J00j473k343j242
54075B52177J335L773M928M590K953N90j398k255k417k527j992J9K474L267K275
54060B67792J638K454L216K520J344J184J649J539J047J097J480J347Q36O66P83
54045B90592P33P77J272J723J714J933K851L389K623J910L111N309N612L188L45
54030C27082p90o19n46q72j169j512k229l061l242k267m22J241J641Q49J07L23
54014C14514J083J772K726M187N056M139K153R16Q69R08N38N07J206J899J874
$$ plain form
54122 266434 267314 267597 268405 269994 271613 272907 274506 276859 279272 280849 281800 282932 284144 284436 283371
54107 283371 281669 280211 279208 278524 278086 277687 276947 275777 274507 273360 272191 270886 269571 268275 266796
54092 266796 265067 263254 261380 259337 257442 256489 256838 257733 257980 257251 256408 256425 257135 257235 255762 253419 252177
54075 252177 253512 257285 262213 266803 269756 270346 268948 266693 264276 261749 259757 259776 262250 265517 267792
54060 267792 269430 271884 275100 277620 278964 280148 281797 283336 284383 285480 286960 288307 289143 289809 290592
54045 290592 291325 292102 293374 295097 296811 298744 301595 304984 307607 309517 312628 317937 323549 326737 327082
54030 327082 326292 325673 325127 324255 323086 321574 319345 316284 313042 310775 310353 311594 313235 314084 314191 314514
54014 314514 315597 317369 320095 324282 329338 333477 335630 336546 337415 338323 338861 339368 340574 342473 344347
53999C44347J248L13q37j858k197j808j127l60N28J444K491M179O407P842P373
53984C67985N740M572M385M653N171N944O408O297O652Q299J0087J0494J0212
53971D56899J0840J1656J0429P384N436O059P594Q327Q555Q590P360M627K370
53958E56126K212L101L149K249J237l9k021l889m551m472n004o317p398p690p561
53943E19132p402p201o827o128n093m341m814o528q337r286r402q715o776l837
53929D24445j485j015j956k999l598l818l578l041l000l696l912k466j95Q62J84
53914C90732m83N51K696L710K362j06j385o66Q23J894K889M401N645N654N362
53899D24079O493Q603R386Q307P786R744J2718J3681J1374O742J399l014n103
$$ plain form
53999 344347 345595 345908 345071 343213 341016 339208 338081 337721 338249 339693 342184 346363 352770 360612 367985
53984 367985 373725 378297 382682 387335 392506 398450 404858 411155 417807 426106 436193 446687 456899
53971 456899 467739 479395 489824 497208 502644 508703 516297 524624 533179 541769 549129 553756 556126
53958 556126 558338 561439 564588 566837 568074 568035 566014 562125 557574 553102 548098 541781 534383 526693 519132
53943 519132 511730 504529 497702 491574 486481 482140 477326 470798 462461 453175 443773 435058 428282 424445
53929 424445 422960 421945 419989 416990 413392 409574 405996 402955 399955 396259 392347 389881 389686 390548 390732
53914 390732 390249 390800 393496 397206 399568 399462 398077 397411 398234 400128 403017 407418 413063 418717 424079
53899 424079 430572 439175 448561 456868 464654 474398 487116 500797 512171 518913 520312 517298 512195
53886E12195m841l884l614l458k157J57K256L565M420M949M941M671M816N489
53872E29505N999N687M728M083M696O307P313O458M667M122N468P120P661P572
53858F11386P961Q882R854J0890J2007J2535J2004J1024J0528J0637J0986J1398
53846G40092J1636J1181J0001Q708P378N158J842j112k167j634j175j909l704
53833G84295n730p064p331p226p749q717r066q853r405j0919j1654j0652r620
53820F70309j0510j2527j3239j1905r926q649q292q748r961j1409j2289j2259
53808E40595j1502j0344r250q499p594n853m054m019n889p281o360m315l418l960
53794D48257m660m950n008m472k980j446j111j778k483l125l979m351l536k479
$$ plain form
53886 512195 507354 503470 499856 496398 494241 494398 496654 500219 504639 509588 514529 519200 524016 529505
53872 529505 535504 541191 545919 550002 554698 561005 568318 574776 579443 583565 589033 596153 603814 611386
53858 611386 619347 628229 638083 648973 660980 673515 685519 696543 707071 717708 728694 740092
53846 740092 751728 762909 772910 781618 788996 794154 795996 794884 792717 791083 789908 787999 784295
53833 784295 778565 771501 764170 756944 749195 740478 731412 722559 713154 702235 690581 679929 670309
53820 670309 659799 647272 634033 622128 612202 603553 595261 586513 576552 565143 552854 540595
53808 540595 529093 518749 509499 501000 493406 487553 483499 479480 473591 466310 459950 455635 452217 448257
53794 448257 443597 438647 433639 429167 426187 424741 423630 421852 419369 416244 412265 407914 404378 401899
53780D01899k622l579l732k719j512l22J513L642M560L686K071Q45K48J23J79
53765D04280j86j208k090k047j424p16N91K671L900K812P24J08R51J290R74J933
53749D12563M463O171N632M478M762O358Q172R933J1388J1543J0201Q895Q888
53736E13447R448R299Q629Q336Q242P551O382N626N565N591N029L638J698K1o23
53721E97879m49n01j302k394l443m824o700q404r296r457r237q762q198p657o696
53706E10559m863k978k701m388o478p424p263o777o224n473m469l071j412o31
53692D46407j906m320n338m166k984l664m906m339k117m58l87j023j731k872m252
53677D01944m629l475j918j221j251j038j67J048K227L137L515L243K610K066
$$ plain form
53780 401899 399277 395698 391966 389247 387735 387413 388926 392568 397128 400814 402885 403730 403978 404101 404280
53765 404280 404094 402886 400796 398749 397325 396609 397200 399871 403771 406583 407307 407415 408366 409656 410630 412563
53749 412563 417026 423197 428829 433307 438069 444427 452599 462532 473920 485463 495664 504559 513447
53736 513447 522895 532194 540823 549159 557401 564952 571334 576960 582525 588116 593145 596783 598481 598502 597879
53721 597879 597430 596929 595627 593233 589790 584966 578266 569862 560566 551109 541872 533110 524912 517255 510559
53706 510559 505696 502718 500017 495629 489151 481727 474464 467687 461463 455990 451521 448450 447038 446407
53692 446407 444501 440181 434843 430677 427693 424029 419123 414784 412667 412209 411822 410799 409068 406196 401944
53677 401944 397315 393840 391922 390701 389450 388412 388245 389293 391520 394657 398172 401415 404025 406091
53663D06091J719J337R15Q97J649K768L281K681J563R74J288J972K362K332K221
53648D34050K338K599K662K458K480L125L851L637K563K041K960M428N070M834
53634D79096M574M558M514M559M885M866L730J927N95L7j39K17J358K319J784
53619E18880J84p33m78j52j57L40J140N93j580l061k026J72J026K49n16m65l46
53602E13070q79j879k772k967k026k49J189J482J140J181J807K537L021L129K704
53587E20488J818Q32l8n93j29J799L918M108K271O75O04O14o25j650m11K335M145
53570E40161M416M369M261L128J257M14J291K721L834M973O053N997M751M091
53556E91717N239P039P541O463N025M260M443N445O671P184O685N890N390M849
$$ plain form
53663 406091 407810 409147 410062 410959 412608 415376 418657 421338 422901 423875 425163 427135 429497 431829 434050
53648 434050 436388 438987 441649 444107 446587 449712 453563 457200 459763 461804 464764 469192 474262 479096
53634 479096 483670 488228 492742 497301 502186 507052 510782 512709 513304 513341 513202 513419 514777 517096 518880
53619 518880 519064 518331 517853 517701 517544 517884 519024 519617 518037 514976 512950 513122 514148 514397 513881 513416 513070
53602 513070 512191 510312 507540 504573 502547 502298 503487 504969 506109 507290 509097 511634 514655 517784 520488
53587 520488 522306 523138 523100 522507 522378 524177 528095 532203 534474 535149 535753 536367 535742 534092 533681 536016 540161
53570 540161 544577 548946 553207 556335 557592 558006 559297 562018 565852 570825 576878 582875 587626 591717
53556 591717 596956 603995 611536 617999 623024 627284 631727 637172 643843 651027 657712 663602 668992 673841
53542F73841L977L461M018N142N819N875N681M977L334J530J008J840K403J491
53528G24397k88j762k755l593l882k901q68J036J809J171o13k684l701l092k099
53513G00175k384l591l612j633N00P47n54j691k047k106j751l92J375J987J080
53498F86103O7N4M25K03j97M40K271L943M083K803J647J962L358M279M176M330
53482G19947N781P381P270N767N036O017P391Q003Q465R705J1414J2914J4229
53469H29320J5340J5534J4757J4568J6318J9050K0619K0544K0410K1576K3689
53458A031725K5654K7081K8376K9895L1448L2618L3425L4432L5988L7509L8101
53447A386252L7787L7450L7625L8131L8841L9857M0753M0828M0259L9974M0103
$$ plain form
53542 673841 677818 681279 685297 690439 696258 702133 707814 712791 716125 717655 718663 720503 722906 724397
53528 724397 724109 722347 719592 715999 712117 709216 708348 709384 711193 712364 711751 709067 705366 702274 700175
53513 700175 697791 694200 690588 688955 689455 690202 689648 687957 685910 683804 682053 681661 683036 685023 686103
53498 686103 686170 686224 686649 686852 686655 687095 689366 693309 697392 700195 701842 703804 707162 711441 715617 719947
53482 719947 725728 733109 740379 746146 751182 757199 764590 772593 781058 790763 802177 815091 829320
53469 829320 844660 860194 874951 889519 905837 924887 945506 966050 986460 1008036 1031725
53458 1031725 1057379 1084460 1112836 1142731 1174179 1206797 1240222 1274654 1310642 1348151 1386252
53447 1386252 1424039 1461489 1499114 1537245 1576086 1615943 1656696 1697524 1737783 1777757 1817860
53436A817860L9895L9382L9421L9649L8315L5292L3184L3823L5322L4775L2370
53425B219288L0470K9565K8110K6020K5363K6932K8664K8611K7466K6750K6094
53414B523333K4016K0572J7443J5524J3672J0303N539J211j193k238l913p441
53402B616828j2125j6472j9748k2015k3338k3790k3919k4383k5274k6383k7868
53391B371513k9964l2227l3800l4370l4250l3737l2962l2218l1674l0962k9586
53380B015763k7641k5524k3217k0474j7516j4809j2411j0154q253o945n745l823
53368A839251j017K189N447Q653J1585J4104J6469J8826K0820K2461K4769K8537
53356B012094L3008L6838L9871M2714M5118M6426M7323M9286N2102N3822N3740
$$ plain form
53436 1817860 1857755 1897137 1936558 1976207 2014522 2049814 2082998 2116821 2152143 2186918 2219288
53425 2219288 2249758 2279323 2307433 2333453 2358816 2385748 2414412 2443023 2470489 2497239 2523333
53414 2523333 2547349 2567921 2585364 2600888 2614560 2624863 2630402 2631613 2630420 2628182 2624269 2616828
53402 2616828 2604703 2588231 2568483 2546468 2523130 2499340 2475421 2451038 2425764 2399381 2371513
53391 2371513 2341549 2309322 2275522 2241152 2206902 2173165 2140203 2107985 2076311 2045349 2015763
53380 2015763 1988122 1962598 1939381 1918907 1901391 1886582 1874171 1864017 1855764 1848819 1843074 1839251
53368 1839251 1838234 1840423 1845870 1854523 1866108 1880212 1896681 1915507 1936327 1958788 1983557 2012094
53356 2012094 2045102 2081940 2121811 2164525 2209643 2256069 2303392 2352678 2404780 2458602 2512342
53345B512342N3713N5618N8886O1667O3593O6139P0571P6302Q1268Q3770Q4240
53334C268109Q4940Q7344R0152R1010Q9832Q8875Q9406R0142Q9703Q8715Q8135
53323D246363Q6944Q3339P7560P1841O7720O4700O1602N7962N3844M9146M3672
53312D964693L7499L0965K4411J7864J0777K369p483j7899k7890l7456m7280n7349
53300D893221o6401p3108p7612q1417q5533q9081r0368q9343q8112q8440q9674
53289C974132q9876q8468q6528q4899q3448q2151q1423q1052q0138p8584p7268
53278C060297p6147p3605o8751o3212n9263n7061n5019n2236m9024m5425m0958
53267B419596l6063l2317l0480k9342k7314k4520k2411k1573k0819j8823j6023
$$ plain form
53345 2512342 2566055 2621673 2680559 2742226 2805819 2871958 2942529 3018831 3100099 3183869 3268109
53334 3268109 3353049 3440393 3530545 3621555 3711387 3800262 3889668 3979810 4069513 4158228 4246363
53323 4246363 4333307 4416646 4494206 4566047 4633767 4698467 4760069 4818031 4871875 4921021 4964693
53312 4964693 5002192 5033157 5057568 5075432 5086209 5088578 5081095 5063196 5035306 4997850 4950570 4893221
53300 4893221 4826820 4753712 4676100 4594683 4509150 4420069 4329701 4240358 4152246 4063806 3974132
53289 3974132 3884256 3795788 3709260 3624361 3540913 3458762 3377339 3296287 3216149 3137565 3060297
53278 3060297 2984150 2910545 2841794 2778582 2719319 2662258 2607239 2555003 2505979 2460554 2419596
53267 2419596 2383533 2351216 2320736 2291394 2264080 2239560 2217149 2195576 2174757 2155934 2139911
53256B139911j4084j3517j2836j0675p956o664o772n927k633J759N042O843Q244
53243B080735R772J1359J3542J6950K0733K3175K4107K5194K7436K9872L1388
53232B314263L2462L4117L6135L7601L8466L9367M0219M0102L8536L5950L2949
53221B720167K9993K7644K6131K4550K1566J7249J3218J0402P687L500j926o932
53209B893249j0585j3428j6358j9829k4120k9266l4484l8574m1222m3218m5153
53198B577012m6789m8065m9722n2149n4361n5088n4428n3547n3012n2307n0959
53187B006585m9343m8198m7863m8207m8892m9634n0226n0288m9066m6084m2207
53176A476577l9374l8646l9011l8696l7133l4866l2193k9095k6203k4475k3754
$$ plain form
53256 2139911 2125827 2112310 2099474 2088799 2080843 2074179 2067407 2061480 2058847 2060606 2065648 2072491 2080735
53243 2080735 2090507 2101866 2115408 2132358 2153091 2176266 2200373 2225567 2253003 2282875 2314263
53232 2314263 2346725 2380842 2416977 2454578 2493044 2532411 2572630 2612732 2651268 2687218 2720167
53221 2720167 2750160 2777804 2803935 2828485 2850051 2867300 2880518 2890920 2898607 2902107 2900181 2893249
53209 2893249 2882664 2869236 2852878 2833049 2808929 2779663 2745179 2706605 2665383 2622165 2577012
53198 2577012 2530223 2482158 2432436 2380287 2325926 2270838 2216410 2162863 2109851 2057544 2006585
53187 2006585 1957242 1909044 1861181 1812974 1764082 1714448 1664222 1613934 1564868 1518784 1476577
53176 1476577 1437203 1398557 1359546 1320850 1283717 1248851 1216658 1187563 1161360 1136885 1113131
53165A113131k2794k1008j9294j8658j8817j8800j8226j7547j7391j8014j9083
53154I03499j9805j9619j8838j8170j7653j6770j5580j4826j4687j4341j3239
53143G19971j1938j1034j0142q783p609p661q784r805j0190j0522j1204j1630
53131F00669j1081r760q467p645p233p187p516p880p682o811n947n792o150o136
53117D95382n190l641k246j514j540k059k564k695k740l354m623n671n511l993
53103D48041j799O3O07o26k866m442m368l248k195j467p20N1O56J305K055K119
53087D33166P73j313k709k910k404j313O56K858L731K558L26j488k088j290N38
53072D29091K211K514J633Q83Q16P97N73P92J447J351Q6r37m15J058K231L057
$$ plain form
53165 1113131 1090337 1069329 1050035 1031377 1012560 993760 975534 957987 940596 922582 903499
53154 903499 883694 864075 845237 827067 809414 792644 777064 762238 747551 733210 719971
53143 719971 708033 696999 686857 678074 670465 662804 654020 644215 634025 623503 612299 600669
53131 600669 589588 579828 571361 563716 556483 549296 541780 533900 526218 519407 513460 507668 501518 495382
53117 495382 490192 486551 484305 482791 481251 479192 476628 473933 471193 467839 463216 457545 452034 448041
53103 448041 446242 446305 446912 446286 443420 438978 434610 431362 429167 427700 426980 427031 427687 428992 431047 433166
53087 433166 433939 432626 429917 427007 424603 423290 423946 426804 430535 433093 433419 431931 429843 428553 429091
53072 429091 431302 433816 435449 436332 437148 437945 438518 439310 440757 442108 442194 441257 440842 441900 444131 447188
53056D47188L925M146K887R66k9o2m72j594k243j727q85o58q62r36q64p34k81
53039D47765L90L40j115l218m330l612j751j66J76o44j715k167j983j852k137
53024D23981k351j892r85l70l17m73o61j120j709j682q41l01j135k568k701j073
53008D03802P16J320J282J541J602N53r16j226l68n9j192k615k994k700l042m306
52992C91398n341m861k797m05R03J060J315K390L305K836J432M73L0j014k726
52977C87998l655k914j224M40J782K435J874O06q7j51q29k179k573j609j338k969
52961C75607m435l282l51J773K605L431M151L387J488N54J104J270o7j494j415
52946C84326k91N33P84R00R02P21Q30J530K183J920P61m64r54m21P19J392P17
$$ plain form
53056 447188 451113 455259 458146 459112 459083 459021 458549 456955 454712 452985 452100 451442 450580 449644 448780 448046 447765
53039 447765 448155 448495 447380 444162 439832 436220 434469 434303 434479 433835 432120 429953 427970 426118 423981
53024 423981 421630 419738 418753 418383 418066 417593 416932 415812 414103 412421 411580 411279 410144 407576 404875 403802
53008 403802 404518 405838 407120 408661 410263 410816 409900 408674 408306 408247 407055 404440 401446 398746 395704 391398
52992 391398 386057 381196 378399 377994 378897 379957 381272 383662 386967 389803 391235 391708 391738 390724 387998
52977 387998 384343 381429 380205 380645 382427 384862 386736 387342 387255 387104 386275 384096 381523 379914 378576 375607
52961 375607 371172 367890 367539 369312 371917 375348 379499 382886 384374 384928 386032 387302 387235 385741 384326
52946 384326 384035 384568 385352 386252 387154 387875 388705 390235 392418 394338 395099 394635 393681 393260 393979 395371 396088
52929C96088r29k183k119q81R80K928M095L644J884L30J52J154K392L066K642
52914D13243J131l62l49J180K451K060O32l20m10l27m04k81K46R07J425J610J153
52897D23585l8j332j843j503j157j460k149k508k264j693j087m23K72N35j84j682
52881D05069k974l385l285l258k965j697J38J133P84J83L14N87n2j310j986j808
52865C85488j598j615j080K17R78Q4j551j877l40J443J762O63n78j012n06N75
52849C81053J419J060m47j516p42J105J943J129K7l71p28j592j969r64L43L07
52833C80057p94j341q87k75L79J811L581L964K531R89N67K96q97j979j359M79
52817C87122J784K245K816L287K240k17j874j419k82j72l28J033L510M827M178
$$ plain form
52929 396088 395159 392976 390857 389976 390956 393884 397979 401623 403507 403837 403989 405143 407535 410601 413243
52914 413243 414374 414012 413663 414843 417294 419354 419986 419666 419256 418929 418525 418244 418490 419397 420822 422432 423585
52897 423585 423547 422215 420372 418869 417712 416252 414103 411595 409331 407638 406551 406128 406400 406935 406751 405069
52881 405069 402095 398710 395425 392167 389202 387505 387643 388776 389560 389743 390057 390644 390592 389282 387296 385488
52865 385488 383890 382275 381195 381412 382390 382474 380923 379046 378706 380149 381911 382574 381996 380984 380478 381053
52849 381053 382472 383532 383085 381569 380827 381932 383875 385004 385031 384660 383932 382340 380371 379407 379750 380057
52833 380057 379263 377922 377035 376760 377139 378950 382531 386495 389026 390015 390582 390878 389981 388002 386643 387122
52817 387122 388906 391151 393967 397254 399494 399277 397403 395984 395702 395530 395202 396235 399745 404572 408750
52802D08750L231L328L519K297Q7j443j797j999k748l477l422k694k012j882k305
52787C97433k824k841k322j966k193k367j843j419k360m046m218k063M24J061
52773C68456J58n13k69K84P92J313J479R14J89L4n1j003k231k086l86J158J363
52756C69601R57R93J304J338J309J521J537J027O19R58J505J321N47L9j15o14
52740C83847j679k700l166l070k452j493j013j745k870k496l03J410N44j779k496
52725C58539p47J047P57n38m49J043J738P41j52P90K622L023J355q16j808j371
52709C65774k08R64J693J779J347O73j77j261k313k775k387j567j086j361k059
52694C57036k352j743n22P88K279M301O275O749N165K839J535J470J589J318J153
$$ plain form
52802 408750 411981 415309 418828 421125 421212 419769 417972 415973 413225 409748 406326 403632 401620 399738 397433
52787 397433 394609 391768 389446 387480 385287 382920 381077 379658 377298 373252 369034 366971 367395 368456
52773 368456 368614 368101 367832 368116 368908 370221 371700 372614 372803 372837 372786 371783 369552 367466 367080 368238 369601
52756 369601 370558 371551 372855 374193 375502 377023 378560 379587 380206 381164 382669 383990 384537 384576 384461 383847
52740 383847 382168 379468 376302 373232 370780 369287 368274 366529 363659 361163 360860 362270 362814 361035 358539
52725 358539 357792 358839 359596 359058 358609 359652 361390 362131 361979 362769 365391 368414 369769 368953 367145 365774
52709 365774 365566 366530 368223 370002 371349 372022 371845 370584 368271 365496 363109 361542 360456 359095 357036
52694 357036 354684 352941 352419 353207 355486 359787 366062 372811 377976 380815 382350 383820 385409 386727 387880
52679C87880J532K057K104J718J498J777K074J534K1j428j646o88M11J073J461
52664D01378J434M84q87j194j25O43j27j359j552j248j804k698k296q39l54j530
52648C87926k754k694j924j399r74k95K15Q4l70n61j13J339L614N105M013R97
52632C92209j007m78P79M46j066j691q44K04M86K11k68q86j279r66k95k24r94
52615C84337j748j649p52M05J446K146K248J676Q12L23N71J263J706J505Q98M24
52599C95611M08Q79J610K059J819J444K126L859M746L228M25j085m98P15J300
52584D18646J401J140j3j695k252j054K41n6j222j333l7J197J192K53m60L9J770
52567D17757L465L553K047P28P87J172K27j896l548l789l080k201j565j309j210
$$ plain form
52679 387880 389412 391469 393573 395291 396789 398566 400640 402174 402195 400767 399121 398433 398844 399917 401378
52664 401378 402812 403296 402409 401215 401090 401733 401606 400247 398695 397447 395643 392945 390649 389810 389456 387926
52648 387926 385172 382478 380554 379155 378181 377886 378101 378185 377815 377254 377141 378480 382094 387199 391212 392209
52632 392209 391202 390724 391503 391949 390883 389192 388348 388552 389038 389249 388981 388095 386816 385850 385555 385331 384337
52615 384337 382589 380940 380188 380593 382039 384185 386433 388109 388921 389244 389815 391078 392784 394289 395187 395611
52599 395611 396019 396898 398508 400567 402386 403830 405956 409815 414561 417789 418214 417129 416631 417346 418646
52584 418646 420047 421187 421174 419479 417227 416173 416414 416358 415136 413803 413766 414963 416155 416408 415948 415987 417757
52567 417757 421222 424775 426822 427550 428337 429509 429736 427840 424292 420503 417423 415222 413657 412348 411138
52552D11138o82L09P59j33j646k311j597j22J286J884R96j030k382j629K98J189
52536D06327M73l97l77o7j63j02Q10J956K081R84k11m28L07J114J315J088J032
52519D15742J273J412J379J626K098J815K70j423j833j200r69j566j907j300n60
52504D14857p29j661k464k639k225j358l09N03R63J396J869J872J215P65J422
52489D13477K496K064o01l598m148j624J757L323K455N26r14j290p78J79J102
52474D14426J823K538L223L243K256J150J098J818J900R14j17n92j248k463l014
$$ plain form
52552 411138 410456 410765 411524 411391 409745 407434 405837 405715 407001 408885 409881 408851 406469 404840 405138 406327
52536 406327 406800 406403 406026 405959 405796 405694 406504 408460 410541 411525 411314 410886 411193 412307 413622 414710 415742
52519 415742 417015 418427 419806 421432 423530 425345 425615 424192 422359 421159 420190 418624 416717 415417 414857
52504 414857 414128 412467 410003 407364 405139 403781 403472 403975 404938 406334 408203 410075 411290 412055 413477
52489 413477 415973 418037 417436 413838 409690 408066 409823 413146 415601 416127 415213 413923 413145 413324 414426
52474 414426 416249 418787 422010 425253 427509 428659 429757 431575 433475 434389 434272 433680 432432 429969 426955
$$ [...]
##END NTUPLES=NMR SPECTRUM
##END=
