
##TITLE=UV1023_M3-1004-1000_6269524_W8HIBuEm94
##JCAMPDX= 6.0         $$ Bruker NMR JCAMP-DX V2.0
##DATA TYPE= NMR SPECTRUM
##DATA CLASS= NTUPLES
##ORIGIN= BRUKER
##OWNER= Administrator
$$ 1.72 TOPSPIN		Version 2.1
$$ 2012-06-02 03:17:52.640 -0500  Administrator@TOPSPIN
$$ Compression mode = diff/dup
##.OBSERVE FREQUENCY= 400.13188235
##.OBSERVE NUCLEUS= ^1H
##.ACQUISITION MODE= SIMULTANEOUS (DQD)
##.ACQUISITION SCHEME= undefined
##.AVERAGES= 8
##.DIGITISER RES= 22
##SPECTROMETER/DATA SYSTEM= spect
##.PULSE SEQUENCE= zg30
##.SOLVENT NAME= COFFEE_calctemp
##.SHIFT REFERENCE= INTERNAL, COFFEE_calctemp, 1, 14.98061
##AUDIT TRAIL= $$ (NUMBER, WHEN, WHO, WHERE, PROCESS, VERSION, WHAT)
$$ ##TITLE= Audit trail, TOPSPIN		Version 2.1
$$ ##JCAMPDX= 5.01
$$ ##ORIGIN= Bruker BioSpin GmbH
$$ ##OWNER= Administrator
$$ $$ C:\Bruker\TOPSPIN/data/COFFEE/nmr/UV1023_M3-1004-1000_6269524_W8HIBuEm94/10/pdata/1/auditp.txt
$$ ##AUDIT TRAIL=  $$ (NUMBER, WHEN, WHO, WHERE, PROCESS, VERSION, WHAT)
(   1,<2012-06-02 03:17:45.062 -0500>,<Administrator>,<TOPSPIN>,<go>,<TOPSPIN 2.1>,
      <created by zg
	started at 2012-06-02 03:16:38.375 -0500,
	POWCHK enabled, PULCHK disabled,
       configuration hash MD5:
       D5 CA 7A 23 FE 6B EE E2 50 67 74 61 24 F7 5E 3B
       data hash MD5: 64K
       28 86 BC 5C 11 7A 39 16 9A CA C9 DF 04 BE 07 A0>)
(   2,<2012-06-02 03:17:48.250 -0500>,<Administrator>,<TOPSPIN>,<proc1d>,<TOPSPIN 2.1>,
      <Start of raw data processing
       efp LB = 0 FT_mod = 6 PKNL = 1 PHC0 = 0 PHC1 = 0 SI = 32K 
       data hash MD5: 32K
       AE 23 E8 8F 6D 50 1C F3 A6 E4 B8 21 1B 4A 0E CA>)
(   3,<2012-06-02 03:17:48.671 -0500>,<Administrator>,<TOPSPIN>,<proc1d>,<TOPSPIN 2.1>,
      <pk PHC0 = 208.5919 PHC1 = 0 
       data hash MD5: 32K
       12 E5 29 2F D5 8E 8F 61 67 B3 E7 A2 DA F5 7C C1>)
(   4,<2012-06-02 03:17:48.843 -0500>,<Administrator>,<TOPSPIN>,<proc1d>,<TOPSPIN 2.1>,
      <abs ABSG = 1 
       data hash MD5: 32K
       47 C4 02 1F 1C 4F 68 8F 4C BA 00 D9 96 46 41 3F>)
(   5,<2012-06-02 03:17:48.953 -0500>,<Administrator>,<TOPSPIN>,<proc1d>,<TOPSPIN 2.1>,
      <abs ABSG = 2 
       data hash MD5: 32K
       F4 88 36 FE FD 29 55 FF FD 42 83 F5 81 29 72 BB>)
(   6,<2012-06-02 03:17:48.984 -0500>,<Administrator>,<TOPSPIN>,<proc1d>,<TOPSPIN 2.1>,
      <abs ABSG = 3 
       data hash MD5: 32K
       89 07 29 E2 8B 4F FA 23 C9 64 D0 D1 ED F3 BE 6B>)
(   7,<2012-06-02 03:17:49.015 -0500>,<Administrator>,<TOPSPIN>,<proc1d>,<TOPSPIN 2.1>,
      <abs ABSG = 4 
       data hash MD5: 32K
       99 4E E4 9E FA 9C 3F D8 8E C9 64 92 CA 11 15 6B>)
(   8,<2012-06-02 03:17:49.046 -0500>,<Administrator>,<TOPSPIN>,<proc1d>,<TOPSPIN 2.1>,
      <abs ABSG = 5 
       data hash MD5: 32K
       63 D6 C7 AE 2D 2D 27 2F 99 AF C2 37 D0 ED B7 74>)
$$ ##END=
$$ 
$$ $$ hash MD5
$$ $$ A3 60 75 F5 86 02 CF B6 73 C0 49 80 42 09 30 F9
##$RELAX= 
##$RELAX= 
##$RELAX= 
##$RELAX= 
##$RELAX= 
##$RELAX= 
##$RELAX= 
$$ Bruker specific parameters
$$ --------------------------
$$ [...]
150 150 150 150 150 150 150 150
##$TP07= 0
##$TPNAME0= <>
##$TPNAME1= <>
##$TPNAME2= <>
##$TPNAME3= <>
##$TPNAME4= <>
##$TPNAME5= <>
##$TPNAME6= <>
##$TPNAME7= <>
##$TPOAL= (0..7)
0.5 0.5 0.5 0.5 0.5 0.5 0.5 0.5
##$TPOFFS= (0..7)
0 0 0 0 0 0 0 0
##$TUNHIN= 0
##$TUNHOUT= 0
##$TUNXOUT= 0
##$USERA1= <user>
##$USERA2= <user>
##$USERA3= <user>
##$USERA4= <user>
##$USERA5= <user>
##$V9= 5
##$VALIST= <valist>
##$VCLIST= <CCCCCCCCCCCCCCC>
##$VD= 0
##$VDLIST= <DDDDDDDDDDDDDDD>
##$VPLIST= <PPPPPPPPPPPPPPP>
##$VTLIST= <TTTTTTTTTTTTTTT>
##$WBST= 2048
##$WBSW= 25
##$XGAIN= (0..3)
0 0 0 0
##$XL= 0
##$YL= 0
##$YMAX_a= 527976
##$YMIN_a= -650176
##$ZGOPTNS= <>
##$ZL1= 120
##$ZL2= 120
##$ZL3= 120
##$ZL4= 120
##$ABSF1= 14.98061
##$ABSF2= -5.57192
##$ABSG= 5
##$ABSL= 3
##$ALPHA= 0
##$AQORDER= 0
##$ASSFAC= 0
##$ASSFACI= 0
##$ASSFACX= 0
##$ASSWID= 0
##$AUNMP= <proc_prof1d_extract_pilot.lims>
##$AXLEFT= 0
##$AXNAME= <>
##$AXNUC= <1H>
##$AXRIGHT= 0
##$AXTYPE= 0
##$AXUNIT= <>
##$AZFE= 0.1
##$AZFW= 0.1
##$BCFW= 0
##$BC_mod= 0
##$BYTORDP= 0
##$COROFFS= 0
##$CY= 15
##$DATMOD= 1
##$DC= 0
##$DFILT= <>
##$DTYPP= 0
##$F1P= 0
##$F2P= 0
##$FCOR= 0.5
##$FTSIZE= 32768
##$FT_mod= 6
##$GAMMA= 0
##$GB= 0
##$INTBC= 1
##$INTSCL= 1
##$ISEN= 128
##$LB= 0
##$LEV0= 0
##$LPBIN= 0
##$MAXI= 10000
##$MC2= 0
##$MEAN= 0
##$ME_mod= 0
##$MI= 0
##$NCOEF= 0
##$NC_proc= -8
##$NLEV= 6
##$NOISF1= 0
##$NOISF2= 0
##$NSP= 0
##$NTH_PI= 0
##$NZP= 0
##$OFFSET= 14.98061
##$PC= 1
##$PHC0= 208.5919
##$PHC1= 0
##$PH_mod= 1
##$PKNL= yes
##$PPARMOD= 0
##$PPDIAG= 0
##$PPIPTYP= 0
##$PPMPNUM= 2147483647
##$PPRESOL= 1
##$PSCAL= 4
##$PSIGN= 0
##$PYNMP= <proc.py>
##$REVERSE= no
##$SF= 400.13
##$SI= 32768
##$SIGF1= 0
##$SIGF2= 0
##$SINO= 400
##$SIOLD= 32768
##$SPECTYP= <>
##$SREGLST= <1H.CDCl3>
##$SSB= 0
##$STSI= 32768
##$STSR= 0
##$SW_p= 8223.68421052632
##$SYMM= 0
##$S_DEV= 0
##$TDeff= 65536
##$TDoff= 0
##$TI= <>
##$TILT= no
##$TM1= 0
##$TM2= 0
##$TOPLEV= 0
##$USERP1= <user>
##$USERP2= <user>
##$USERP3= <user>
##$USERP4= <user>
##$USERP5= <user>
##$WDW= 1
##$XDIM= 32768
##$YMAX_p= 463744014
##$YMIN_p= -632480
##$CURPLOT= <Network HP LaserJet P1505>
##$CURPRIN= <$Network HP LaserJet P1505>
##$DFORMAT= <normdp>
##$LAYOUT= <+/1D_H.xwp>
##$LFORMAT= <normlp>
##$PFORMAT= <normpl>
##$SURQMSG= 1
$$ End of Bruker specific parameters
$$ ---------------------------------
##NTUPLES= NMR SPECTRUM
##VAR_NAME=  FREQUENCY,     SPECTRUM/REAL,   SPECTRUM/IMAG
##SYMBOL=    X,             R,               I
##VAR_TYPE=  INDEPENDENT,   DEPENDENT,       DEPENDENT
##VAR_FORM=  AFFN,          ASDF,            ASDF
##VAR_DIM=   32768,         32768,           32768
##UNITS=     HZ,            ARBITRARY UNITS, ARBITRARY UNITS
##FACTOR=    0.250966925370066, 1,           1
##FIRST=     8223.43324360095, -223638,      -207255
##LAST=      0,             72845,           -137302
##MIN=       0,             -632480,         0
##MAX=       8223.43324360095, 463744014,    0
$$ Real data points
##PAGE= N=1
##DATA TABLE= (X++(R..R)), XYDATA
$$ [...]
$$ plain form
19513 266851 -72928 -64538 -127048 -268900 18307 -91163 -100706 -162789 -199809 -196983 -184113 -87696
19500 -7351 -77949 115044 -66165 110787 14348 -273123 -355039 195265 39163 47258 5610
19488 -173542 109025 244705 -22923 34394 148741 129277 18028 -190702 79370 17479 -249492
19476 -254888 -210736 -34051 -162434 -78980 -22527 3914 -96249 154262 -228181 -196275 -136176
19465 -136176 -267753 -30331 89025 162919 -42220 11472 21471 4235 15261 152100 17185
19453 -88201 -246564 -441913 268024 -99319 -4981 -94211 159691 -14490 222395 -9708 -3730
19441 114506 -188466 -18639 128337 -17232 133464 -67721 -158545 -83441 145838 91084 -274379
19429 -23279 126471 -2671 -61563 -185016 -90041 106159 43899 -94291 17549 194624 -144030
$$ packed form
19513B66851g2928Q390o2510j41852A8307i1163r543o2083l7020K826J2870h7696
19500g351p0598A15044f6165A10787A4348b73123q1916A95265C9163Q095E610
19488a73542A09025J35680b2923C4394J14347j9464A8028a90702G9370A7479b49492
19476b54888M4152c4051j28383g8980b2527C914i6249A54262b28181L1906O0099
19465a36176j31577c0331H9025P3894d2220A1472R999D235J1026J36839A7185
19453h8201j58363j95349B68024i9319d981q9230A59691a4490B22395i708c730
19441A14506a88466a8639A28337a7232A33464f7721r0824P5104A45838n4754b74379
19429b3279A26471b671n8892j23453i0041A06159D3899i4291A7549J77075a44030
$$ plain form
19417 -64844 46134 197979 -36357 156371 -280327 -345258 44096 -15650 -268140 -317709 -82529
19405 -206327 -559351 -212617 111376 -28295 -157023 19925 -63093 -473264 -415671 -321431
19395 -321431 -279525 -122295 124855 -108745 -119084 -346319 -133852 38292 167269 -40368
19384 95536 320887 5542 -97511 -70410 -258164 118354 16285 -187302 -94804 -230413 -101899
19372 -30030 -1302 65553 5492 135335 -68490 -282296 -366855 54418 106679 12936 37818 -266816
19359 -53664 36670 -324825 -253216 71361 264099 -491955 59666 -244802 -154950 2868 -201298
19347 227312 -141191 -457745 -12815 51043 -199424 -239665 58333 -149103 -42816 318172
19336 -255832 94934 -154193 -219440 202966 -112850 -145086 -93866 -57152 -244885 298711
$$ packed form
19417f4844D6134J51845c6357A56371b80327o4931D4096a5650k52490m9569h2529
19405b06327l53024b12617A11376b8295j28728A9925f3093m10171N7593R4240
19395c21431M1906a22295A24855a08745j0339k27235a33852C8292J28977d0368
19384I5536K25351E542i7511K7101j87754A18354A6285a87302R2498j35609a01899
19372c0030a302F5553E492J29843f8490k13806q4559E4418N2261A2936K4882b66816
19359e3664C6670c24825P1609G1361J92738d91955E9666b44802Q9852B868b01298
19347B27312a41191l16554a2815E1043a99424m0241E8333a49103d2816C18172
19336b55832I4934a54193o5247B02966a12850l2236N1220L6714j87733B98711
$$ plain form
19325 99643 -136624 201607 -266998 123352 124097 162076 -16769 -228257 74916 -355667 54512
19313 -43322 114277 -96407 -272615 -108576 1567 308915 -234162 96869 -257889 -72423 -44931
19302 -44931 121267 -40762 63610 -9435 950 160748 23538 46220 -128766 -254891 -212394
19291 -212394 212948 -56308 3066 -323391 -67327 -59352 -200335 -110594 -370870 104915 -123528
19279 -133130 -74251 -190076 -77264 66337 -113578 -2177 -347969 -323402 -45013 151226 116959
19268 116959 69623 66393 26596 36374 -52162 -153765 -172967 36454 -328104 51334 -68082
19256 -314092 -259219 -53068 -287629 160709 18107 109538 -345530 280482 -64386 -263471
19246 -263471 -206362 -53228 -727 392029 57571 75457 -228840 -355192 -77707 -38538 -58213
$$ packed form
19325I9643a36624B01607b66998A23352P45L7979a6769k11488G4916c55667E4512
19313d3322A14277i6407j76208a08576A567L07348b34162I6869b57889g2423K7492
19302d4931A21267d0762F3610i435I50J59798B3538K2682a28766j26125M2497
19291b12394B12948e6308C066c23391f7327P975j40983Q9741k60276A04915a23528
19279a33130N8879j15825g7264F6337a13578b177l45792K4567d5013A51226l4267
19268A16959m7336l230B6596R778e2162j01603j9202C6454c28104E1334f8082
19256c14092N4873e3068k34561A60709A8107R1431c45530B80482f4386j99085
19246b63471N7109e3228g27C92029E7571J7886b28840j26352g7707c8538j9675
$$ plain form
19235 -58213 -354161 141324 -24263 -173023 -108388 -133420 175693 -100694 -276692 -416554
19225 -416554 -311760 125962 -159336 -385372 109348 -390241 95211 -72687 90333 -342025
19214 45164 -125384 65871 223337 -29757 -19621 -266318 -62258 -9521 43437 -31509 200526
19202 -149241 321773 11819 79933 -373892 -9901 323016 68389 2554 306433 21460 -414082
19190 249543 43436 -149446 -136574 -6887 -300549 -168347 -209416 258424 130716 -162294
19179 -90691 -52125 -72803 252461 50161 94803 -95392 -436948 83756 101442 -138913 -105793
19168 -105793 88101 254862 163448 -190528 -40985 -26828 -384 143805 -156450 -252049 -77671
19156 -149334 -31915 -17747 449842 1408 -80809 -135295 35636 279748 -66261 -46166 -322967
$$ packed form
19235e8213k95948A41324b4263j48760O4635k5032A75693a00694j75998j39862
19225d16554J04794A25962a59336k26036A09348c90241I5211g2687I0333c42025
19214D5164a25384F5871J57466b9757J0136k46697f2258i521D3437c1509B00526
19202a49241C21773A1819O8114c73892i901C23016F8389B554L03879B1460d14082
19190B49543D3436a49446J2872f887k93662J32202m1069B58424j27708a62294
19179i0691L8566k0678B52461E0161M4642i5392l41556H3756J7686a38913L3120
19168a05793H8101J66761r1414a90528d0985J4157c84A43805a56450r5599g7671
19156a49334c1915J4168D49842A408h0809n4486C5636K44112f6261K0095k76801
$$ plain form
19145 -322967 -85397 -258954 50910 76312 -93796 -197316 -101475 202069 -101531 -37809 -157914
19134 -157914 -105314 67258 63426 -167029 -327306 18436 -350611 134741 -34347 -92997 -247732
19123 -247732 73559 -252501 -127539 -166425 -107321 67321 -300701 -51491 106548 240786
19113 240786 3099 -192376 -217448 160192 123590 -255264 -118779 -174681 -71727 -378942 -80022
19101 -202618 -20465 -101929 -413691 50465 -106417 287604 -268794 41880 -178668 -103361
19091 -103361 68091 -67566 -11989 -405681 -177049 -29818 47322 -44379 -74942 -22073 -273455
19080 -273455 -17820 -180938 -132390 -133872 20779 -181123 33585 -141683 56442 -117362 -185569
19069 -185569 14237 -94190 14275 72670 218760 25772 47766 -130868 -259204 -75064 -44661
$$ packed form
19145c22967h5397j73557E0910K5402i3796j03520R5841B02069a01531c7809j20105
19134a57914N2600F7258l832a67029j60277A8436c50611A34741c4347n8650j54735
19123b47732G3559b52501J24962l8886N9104F7321c00701e1491A06548J34238
19113B40786C099a92376k5072A60192l6602b55264a18779n5902g1727l07215h0022
19101b02618b0465q1464l11762E0465a06417B87604b68794D1880a78668P5307
19091a03361F8091f7566a1989l93692a77049b9818D7322d4379l0563b2073k51382
19080b73455a7820j63118M8548j482B0779a81123C3585a41683E6442a17362o8207
19069a85569A4237i4190A4275N8395J46090B5772K1994a30868j28336g5064L0403
$$ plain form
19058 -44661 -77680 113070 -39747 130100 52572 -309432 289075 22363 -114240 -61994 -191953
19047 -191953 -124151 -139979 -110001 68776 -148696 -226465 178009 -128050 128567 -27418 91269
19035 238525 -40434 -51057 87075 189252 -100270 -119962 -262776 6638 85129 118649 -87496
19023 -462347 256855 57610 -359692 -198880 -12939 317549 208395 72647 -75524 -159579
19013 -159579 225367 79267 -287132 37998 482884 -319414 -152199 12829 -200629 72580
19002 309927 -78387 -233223 -103976 -250126 146243 -188783 -368051 -38285 -158579 51037
18991 -1512 28712 21181 -80440 182620 -258311 -75127 -380802 -392527 -153239 32920 -552 -41135
18979 -41135 -54600 -20777 -43426 -10190 -193654 -18089 -209327 119785 -225471 10547 -183757
$$ packed form
19058d4661l3019A13070c9747A30100E2572c09432B89075B2363a14240N2246j29959
19047a91953O7802j5828K9978F8776a48696p7769A78009a28050A28567b7418I1269
19035B38525d0434j0623H7075J02177a00270j9692j42814F638P8491L3520h7496
19023d62347B56855E7610c59692J60812a2939C17549j09154G2647g5524q4055
19013a59579B25367G9267b87132C7998M44886c19414a52199A2829b00629G2580
19002C09927g8387j54836a03976j46150A46243a88783j79268c8285j20294E1037
18991a512B8712p531h0440A82620b58311g5127l05675j1725a53239C2920e52m0583
18979d1135j3465b0777k2649a0190j83464a8089j91238A19785b25471A0547a83757
$$ plain form
18967 290516 62243 -337827 -192729 134998 61635 72811 -331947 -236387 -167519 -144833 163637
18955 -101033 20325 -314252 -236441 -162137 142823 55821 13420 -284692 -315044 -196106 404241
18943 -210629 237252 -184613 186434 137208 -190858 -25593 407635 -61920 223745 363556
18933 363556 -121810 -369421 -12572 24001 93929 -91566 156355 -92160 124350 -104660
18922 -25256 428156 -281071 115110 72818 -321075 -67315 -161929 -54212 -105571 43711 130664
18911 130664 92240 8130 63766 28863 7237 -13317 -184569 -26376 -152672 -391630 69360
18899 -106846 -96069 -184141 87718 -47773 -311415 -152178 -184240 272444 85684 -231677 116903
18887 -153195 -134744 -93432 116833 -96272 -398691 -116105 14292 106275 1354 28903 -124879
$$ packed form
18967B90516F2243c37827J45098A34998F1635J1176c31947R5560O8868K2686A63637
18955a01033B0325c14252P7811P4304A42823E5821A3420b84692l0352J18938D04241
18943b10629B37252a84613A86434m9226a90858b5593D07635f1920B23745J39811
18933C63556a21810k47611a2572B4001O9928i1566A56355i2160A24350a04660
18922b5256D28156b81071A15110m2292c21075f7315r4614e4212n1359D3711Q6953
18911A30664l8424H130N5636B8863G237a3317j71252b6376j26296k38958F9360
18899a06846J0777q8072H7718d7773k63642a52178l2062B72444H5684b31677A16903
18887a53195J8451M1312A16833i6272l02419a16105A4292R1983A354K7549a24879
$$ plain form
18875 118610 -83334 169832 -122148 -39572 -142180 -96210 -216645 -50631 65013 -41947 -338106
18864 -338106 -308717 -397664 -185343 -179067 337286 64539 6292 2185 108503 6710 119116
18853 119116 18376 75178 238793 -185291 -184333 62833 -326198 -225795 -161798 43759 -199198
18841 -55360 -10414 -102210 -197303 -180847 168967 -59223 -315200 -72021 235429 140289 -40194
18829 -73600 -99828 70221 -39648 55543 93844 106230 -195539 5080 -207267 -1037 -156632
18818 -156632 -178433 -145820 187279 35478 34424 -289241 109696 -265938 81186 -224041 -117175
18807 -117175 29964 -326719 153090 -101314 63162 180312 -49977 1726 86176 128355 194266
18796 194266 295342 24050 -194150 -54866 -191165 -63158 120696 3049 -136215 -52745 -150793
$$ packed form
18875A18610h3334A69832a22148c9572j02608M5970j20435e0631F5013d1947k96159
18864c38106K9389q8947a85343O276C37286F4539F292B185J06318F710J12406
18853A19116A8376N6802J63615a85291R58F2833c26198J00403O3997D3759a99198
18841e5360a0414r1796r5093J6456A68967e9223k55977g2021B35429r5140d0194
18829g3600k6228G0221c9648E5543L8301J2386a95539E080b07267a037j55595
18818a56632k1801L2613A87279C5478j054b89241A09696b65938H1186b24041J06866
18807a17175B9964c26719A53090a01314F3162J17150d9977A726Q4450M2179O5911
18796A94266J01076B4050a94150e4866j36299f3158A20696C049a36215e2745r8048
$$ plain form
18785 -150793 -267421 -22332 44272 -190711 -247159 -31835 -19781 52542 -163845 29208 -122628
18773 -403408 222091 243253 -519301 -138346 84499 -8191 -112910 130075 -27804 40974 -104066
18761 -75266 16320 -109981 17530 4146 165878 -220768 -74618 -1514 -188653 -315617 -123994
18749 83508 -340263 131924 -266633 89019 -465033 -167704 -82821 -115222 54387 340930
18739 340930 -72612 41322 -140383 52610 -114993 296813 206012 -94171 -63280 -240795 -347867
18728 -347867 -56598 -211380 -37097 -191289 -243485 -308819 -307388 148566 67347 -300975 -227759
18717 -227759 -40440 -358631 27530 -261776 120264 -176013 -2263 181738 187218 -100974 14680
18705 -32824 -46426 37746 -27998 9317 85198 148973 109509 -60064 254129 -106359 -141128
$$ packed form
18785a50793j16628b2332D4272a90711n6448c1835J2054E2542a63845B9208a22628
18773d03408B22091K1162e19301a38346H4499h191j04719A30075b7804D0974a04066
18761g5266A6320a09981A7530D146J61732b20768g4618a514j87139j26964a23994
18749H3508c40263A31924b66633H9019d65033a67704h2821l2401E4387K86543
18739C40930g2612D1322a40383E2610a14993B96813r0801i4171L0891j77515j07072
18728c47867e6598j54782c7097j54192n2196o5334J431A48566F7347c00975P3216
18717b27759d0440l18191B7530b61776A20264a76013b263A81738N480a00974A4680
18705c2824j3602C7746b7998I317P5881O3775l9464f0064B54129a06359l4769
$$ plain form
18694 -141128 -61897 68483 -116395 118561 -164758 248570 -80861 -76118 -63562 -108053 67536
18682 -51223 -217710 32272 2262 104425 -417149 -164448 -237123 -282016 -427204 -154544 59016
18670 -6692 178295 -140569 110666 203720 127403 -89558 -268014 323 -29749 -85935 46500
18658 -128391 39222 -79161 -218348 -10593 83710 315971 -94556 -76405 -205618 234456 355247
18647 355247 -305593 -21575 74893 -56213 -280057 -126145 -87438 -201613 -110498 -97312 -89059
18636 -89059 -99197 48517 115595 -7333 110474 -78478 -374713 -473644 -41541 -288563 22277
18624 -357246 28679 -119238 128204 -67138 -129237 -27976 43683 13314 295141 -173245 148072
18612 192492 -72783 -310425 5833 389651 -6848 -555445 -189996 -232923 -171654 -334837 -76296
$$ packed form
18694a41128f1897F8483a16395A18561a64758B48570h0861M743J2556m4491F7536
18682e1223j66487C2272B262J02163d17149a64448p2675m4893j45188a54544E9016
18670f692A78295a40569A10666R3054p6317h9558j78456C23b9749n6186D6500
18658a28391C9222g9161j39187a0593H3710K32261i4556J8151j29213B34456J20791
18647C55247c05593b1575G4893e6213k23844a26145L8707j14175R1115J3186Q253
18636h9059j0138D8517O7078g333A10474g8478k96235r8931d1541k47022B2277
18624c57246B8679a19238A28204f7138o2099b7976D3683A3314K81827a73245A48072
18612A92492g2783k37642E833L83818f848n48597a89996m2927O1269j63183g6296
$$ plain form
18600 -40141 85820 -15605 131851 -171320 -79544 43122 -179916 278367 -255966 -203162 -66448
18588 -216044 -444162 163459 -61478 -199822 167427 -133133 -170472 -103672 -213340 360849
18577 99984 -69316 -65142 22175 133114 -70801 151259 -111139 4288 47421 19865 -205427
18565 194492 -278269 -125619 -29211 -12793 -158746 -148498 -199131 -107433 -105831 123150 -298179
18553 51599 -305593 -219062 -105937 92917 -43791 -172166 -28822 -132715 -401059 -198906
18542 92043 161622 274692 200324 -85296 16715 130817 192617 -342304 -110307 -123075 -303235
18531 -303235 220908 71447 164002 177107 -145510 -92447 -108381 -137506 119697 110632 -300080
18519 -144282 -190119 -30126 -87887 311011 -17482 -72034 -47613 214332 -327075 -30440 -87661
$$ packed form
18600d0141H5820a5605A31851a71320g9544D3122a79916B78367b55966N2804f6448
18588b16044k28118A63459f1478j38344A67427a33133l7339O6800j09668C60849
18577I9984f9316M174B2175J10939g0801A51259a11139D288M3133A9865b05427
18565A94492b78269a25619b9211a2793j45953J0248n0633R1698J602A23150b98179
18553E1599c05593Q6531a05937I2917d3791j28375b8822j03893k68344a98906
18542I2043O9579J13070p4368h5296A6715J14102O1800c42304a10307j2768j80160
18531c03235B20908G1447R2555J3105a45510N3063j5934k9125A19697r065c00080
18519a44282m5837c0126n7761C11011a7482n4552K4421B14332c27075c0440n7221
$$ plain form
18508 -87661 310681 -43995 -95306 -403308 -106178 -234560 -333001 70409 -84664 104969 -122830
18496 -281589 -289011 -93606 126803 -116047 -43472 -322136 -140797 -526055 96810 167897 -140335
18484 44947 -75582 -359411 263801 -102418 -112146 107493 67581 35809 -206475 324084 164922
18473 164922 -263673 -121331 378050 -340240 297284 -259201 -95433 -71717 12665 -183576
18462 -205027 -20728 -9502 -90890 -28639 75602 -192594 -119324 -119208 -52148 -204447 -173888 -18868
18449 -164066 136697 -305725 57597 -4939 33300 -145451 69398 -278691 21269 -302187 -161294
18438 -161294 163005 295245 -111179 -43592 -339405 -150797 36755 -17988 186596 -84922
18427 -84370 116556 158183 307132 489285 -508379 -9671 23981 271140 -167907 36809 -214078
$$ packed form
18508h7661C10681d3995n1311l08002a06178j28382r8441G0409h4664A04969a22830
18496b81589p422i3606A26803a16047d3472k78664a40797l85258I6810P1087a40335
18484D4947g5582k83829B63801a02418r728A07493l9912l1772b06475C24084j59162
18473A64922b63673a21331C78050c40240B97284b59201i5433K3716A2665a83576
18462b05027b0728i502q1388b8639G5602a92594P3270J16e2148j52299L0559a8868
18449a64066A36697c05725E7597d939C3300a45451F9398b78691B1269c02187J40893
18438a61294A63005J32240a11179d3592k95813a50797C6755a7988A86596h4922
18427h4370A16556M1627J48949J82153e08379i671B3981K47159a67907C6809b14078
$$ plain form
18415 -217157 -185069 62057 27360 -52640 -195141 -152114 160818 -190638 -97135 -213801 -92335
18403 -539047 139791 -102951 -138469 27302 131906 -84835 -123295 -252173 22931 -160733
18392 -44290 -347492 73075 182662 121106 -269822 228690 -123387 -134451 -97664 -178590 -11890
18380 342326 -54055 -296403 -49728 -240347 44463 11830 172793 117952 -30788 -438872 172059
18368 -60180 -145624 -211910 -64866 256175 -209182 301473 -202320 -147072 -461070 -86737 -87768
18357 -87768 -157774 324681 -209340 139976 -140872 70369 -217455 16367 -106093 -169282
18347 -169282 -86179 279863 271758 -271432 -895 -50793 106258 -48018 -32901 -137714 -26667
18335 79432 199550 116380 82735 -56233 -383158 36307 41217 174328 60700 -252817 -10144
$$ packed form
18415b17157L2088F2057B7360e2640j42501M3027A60818a90638R3503j16666i2335
18403e39047A39791a02951l5518B7302J04604h4835l8460j28878B2931a60733
18392d4290l03202G3075J09587o1556b69822B28690a23387j1064L6787q0926a1890
18380C42326e4055k42348d9728j90619D4463A1830J60963n4841c0788m08084A72059
18368f0180q5444o6286f4866B56175b09182C01473b02320N5248l13998h6737j031
18357h7768p0006C24681b09340A39976a40872G0369b17455A6367a06093o3189
18347a69282Q3103B79863q105b71432h95m9898A06258d8018J5117j04813b6667
18335G9432J20118q3170l3645e6233l26925C6307M910J33111F0700b52817a0144
$$ plain form
18323 -114564 337038 -96001 14000 -348895 -93283 -155369 118862 107322 -82340 -234237 189392
18311 253406 214930 -163341 -440620 254838 80824 -30767 -114072 50675 -108859 -93172 237102
18299 -164200 58944 -82474 -28519 -129910 135294 17557 -147614 2162 -130817 -297593 12253
18287 -192594 242182 -195604 -295562 53445 -36015 -101936 -42189 161654 205945 -128445 -6287
18275 -345909 356019 4022 -120564 -42019 -282609 87721 -114488 131949 -459025 82704
18264 -193808 -319371 -245768 125071 261982 -631512 14003 16547 -473901 -180648 28380
18253 330424 -51376 144075 -129510 34846 508999 -213836 200842 -49235 164251 -57037
18242 -87538 -420536 -392679 -65271 91235 -259075 5468 -151612 91532 -293120 82853 99882
$$ packed form
18323a14564C37038i6001A4000c48895i3283o2086A18862j1540h2340j51897A89392
18311B53406l8476a63341k77279B54838H0824c0767q3305E0675a08859J5687B37102
18299a64200E8944h2474b8519j01391A35294A7557a47614B162a30817j66776A2253
18287a92594B42182a95604r9958E3445c6015o5921d2189A61654M4291a28445f287
18275c45909C56019D022a20564d2019k40590H7721a14488A31949d59025H2704
18264a93808j25563P3603A25071J36911f31512A4003K544d73901a80648B8380
18253C30424e1376A44075a29510C4846M74153b13836B00842d9235A64251e7037
18242h7538l32998K7857f5271I1235b59075E468a51612I1532b93120H2853J7029
$$ plain form
18231 99882 138806 -19763 80661 26461 53119 62550 -291263 65264 16617 22479 -198090 208149
18218 233562 -100512 -130157 -299729 -50306 -298182 194690 -31752 -85997 -2881 40370 -364721
18206 -78670 -169057 186971 -99655 18107 -107740 33095 83996 98310 53559 -80236 -204230
18195 -204230 -400370 -37427 40035 -45551 126339 -261157 -343519 14536 44030 -40121 -245818
18184 -245818 -22013 47485 -95317 -84707 317576 50199 -85866 1768 62504 4224 164116
18173 164116 155881 -122075 63586 -92544 -96013 -12208 13674 -13378 235836 78678 109048
18162 109048 -26604 -210968 -79862 -136472 -244956 -123391 206483 -349031 -5730 -156797
18152 -156797 -65238 -118424 -99569 -123792 -166651 -76317 -164088 -11416 -115337 -176565 -228219
$$ packed form
18231I9882L8924a9763H0661B6461K6658R431b91263F5264A6617N862a98090B08149
18218B33562a00512k9645j69572e0306k47876A94690c1752n4245b881D0370c64721
18206g8670r0387A86971i9655A8107a07740C3095N0901J4314m4751h0236j23994
18195b04230j96140c7427D0035d5551A26339b61157q2362A4536K9494d0121k05697
18184b45818b2013D7485i5317J0610C17576E0199h5866A768O0736D224J59892
18173A64116q235a22075F3586i2544l469a2208A3674a3378B35836G8678L0370
18162A09048b6604j84364g9862n6610j08484J21565B06483c49031e730j51067
18152a56797f5238n3186J8855k4223m2859g6317q7771a1416j03921o1228n1654
$$ plain form
18141 -228219 157653 25187 155633 -248553 -26219 5803 -54463 16590 245138 277978 -127592
18129 -132882 109101 83182 -401824 84930 42110 20831 -147489 71137 -41246 -292793 -115951
18117 108530 269052 187825 -121809 73518 79327 -47691 -68775 -77128 150740 126638 -143545
18105 -138693 -287253 -226436 -86244 119642 -114771 153503 6171 -116263 -55015 -34980 52273
18093 -270343 273708 -336214 -107738 -109175 141933 254155 138074 -877 43891 -58056 -195289
18082 -195289 -52944 -198291 -25570 75513 59063 -187905 -50918 101954 59370 -204217 -200843
18071 -200843 -260566 -65313 177288 -91453 -98163 -6187 19469 -174349 -216212 -366467 31996
18059 253056 344596 -246262 -303683 -64987 171239 67043 -340691 118960 -289985 18818
$$ packed form
18141b28219A57653B5187J30446b48553b6219E803e4463A6590K28548L2840a27592
18129a32882A09101k5919d01824H4930D2110B0831a47489G1137d1246k51547a15951
18117A08530J60522q1227a21809G3518N809d7691k1084q353A50740k4102a43545
18105a38693j48560O0817h6244A19642a14771A53503F171a16263e5015K0035E2273
18093b70343B73708c36214a07738j437A41933J12222j16081h77D3891e8056j37233
18082a95289e2944j45347b5570G5513j6450a87905e0918A01954m2584b04217L374
18071b00843n9723f5313A77288i1453o710f187A9469a74349m1863j50255C1996
18059B53056R1540b46262n7421f4987A71239F7043c40691A18960b89985A8818
$$ plain form
18048 -268014 140611 -152162 -344190 -41167 117301 229349 145184 -104989 -4964 59563
18037 -288772 -189649 172385 102895 -132193 128430 -284471 3941 -133186 327622 -131438
18026 149994 -35436 214447 110533 -31957 14706 -253332 34068 182803 125591 -117781
18015 -13219 -233299 69599 349914 -12168 18368 -167489 61872 145228 189981 106995 -77663
18003 30981 82335 189704 -231636 -45754 -153015 174993 -195006 -171369 307358 -23075
17992 -120060 -66216 -178146 -8302 -92152 -272341 50559 -91426 -295570 -107936 236637 -148151
17980 336491 16166 -173109 -239587 -165328 183681 7730 -284795 63158 85640 198054 53790
17968 22415 -97220 -86665 101491 -42916 155339 128314 -75084 166062 108039 84520 -61361
$$ packed form
18048b68014A40611a52162j92028d1167A17301J12048q4165a04989d964E9563
18037b88772R9123A72385o9490a32193A28430b84471C941a33186C27622a31438
18026A49994c5436B14447j03914c1957A4706b53332C4068J48735n7212a17781
18015a3219k20080F9599K80315a2168A8368a67489F1872Q3356M4753q2986g7663
18003C0981N1354J07369b31636d5754j07261A74993a95006K3637C07358b3075
17992a20060N3844j11930h302q3850j80189E0559i1426k04144a07936B36637a48151
17980C36491A6166a73109o6478P4259A83681G730b84795F3158K2482J12414E3790
17968B2415i7220J0555A01491d2916A55339k7025g5084A66062n8023k3519f1361
$$ plain form
17956 -13143 -7199 239561 19392 -87605 -100961 -229562 32407 -37867 -138360 -42631 86232
17944 98855 132509 -4257 -206395 -45308 231464 -198022 51108 -135804 -107895 30078 145691
17933 145691 224224 -330369 193049 -210996 62727 85419 -64961 26127 188198 -211140
17922 44497 -113558 79442 137181 -53872 131895 -151354 -141755 -100307 -353962 -154087 32853
17910 -75159 -79609 117632 72322 -49013 204396 -88181 -36565 78329 -27783 -398692 -104285
17898 -156761 -202894 239817 -52680 156205 182052 -109464 -252547 -276400 16257 -59015 23557
17886 257497 -132030 134176 -219795 28392 -112305 -150280 163830 261528 -190065 -48766
17875 -57174 -28620 -72519 -154264 -241046 -166595 -36442 -22504 127007 -16409 -157682 135278
$$ packed form
17956a3143N944B39561A9392h7605j3356j28601C2407c7867j00493d2631H6232
17944I8855L3654d257k02138d5308B31464a98022E1108a35804K7909C0078J15613
17933A45691P8533c30369A93049b10996F2727K2692f4961B6127J62071b11140
17922D4497a13558G9442N7739e3872A31895a51354R599M1448k53655a54087C2853
17910g5159m450A17632m5310d9013B04396h8181c6565G8329b7783l70909a04285
17898a56761m6133B39817e2680A56205K5847a09464j43083k3853A6257e9015B3557
17886B57497a32030A34176b19795B8392a12305l7975A63830R7698a90065d8766
17875e7174K8554m3899q1745q6782P4451c6442J3938A27007a6409j41273A35278
$$ plain form
17863 80655 77702 90524 297886 37553 52056 -21427 -120754 65348 9129 -133324 -137950 96972
17850 -152559 -331241 73359 -86675 -131175 64982 -10087 188077 8700 236854 -92216 111573
17838 -85678 4184 90500 -130814 -127427 286168 151584 143060 103113 -223020 229998 183990
17827 183990 510308 -280728 115986 -83660 81871 55455 -172819 188792 -245159 -71969
17816 -83110 39002 22772 -82134 -53774 -204486 33025 187539 -45707 -279743 84772 -63081
17804 229518 -79823 -44084 -127115 59151 53078 85642 26639 -215465 -96944 -229932 -359051
17793 -359051 -151209 17204 51936 217958 260497 -13784 149731 -120879 230982 34427
17782 -125628 -255147 -144223 -34280 30122 -237706 -296627 62539 116186 172630 -252862 -433077
$$ packed form
17863H0655k953J2822K07362C7553J4503b1427r9327F5348I129a33324m626I6972
17850a52559j78682G3359h6675m4500F4982a0087A88077H700K28154i2216A11573
17838h5678D184Q6316a30814L387B86168j34584q524l9947b23020B29998m6008
17827A83990L26318b80728A15986h3660H1871k6416a72819A88792b45159g1969
17816h3110C9002j6230h2134K8360j50712C3025J54514d5707k34036H4772f3081
17804B29518g9823L5739q3031E9151o073L2564B6639b15465i6944j32988j29119
17793c59051a51209A7204L4732J66022M2539a3784A49731a20879B30982C4427
17782a25628j29519J10924c4280C0122b37706n8921F2539N3647N6444b52862j80215
$$ plain form
17771 -433077 174523 -91861 100487 182110 -222631 -81041 129645 62169 9575 -81342 -74743
17760 -74743 338904 32360 55288 151640 -45460 238034 34059 -76659 219673 406303 195209
17748 124140 -128205 220230 49940 -254647 212047 -114990 -359427 222928 -124212 -169442
17738 -169442 260806 129358 105430 -184451 71990 -91422 -290303 133839 -290454 377732
17727 35069 -130227 24862 408001 -175239 -398943 83143 -24341 -46120 -65427 120463 85689
17716 85689 249742 -195458 64043 -118492 -8223 -130201 19795 -234247 -30150 19165 14801
17705 14801 -302258 -39849 149760 -219056 -214707 295299 -147513 -87849 382876 -49151 -4179
17693 -313629 -329798 190270 202804 141161 -24259 -131233 75333 235148 196269 -170978 -139130
$$ packed form
17771d33077A74523i1861A00487Q1623b22631h1041A29645F2169I575h1342O599
17760g4743C38904C2360K2928R6352d5460B38034C4059g6659B19673J86630A95209
17748A24140a28205B20230D9940b54647B12047a14990k44437B22928a24212m5230
17738a69442B60806A29358k3928a84451G1990i1422j98881A33839b90454C77732
17727C5069a30227B4862L83139a75239k23704H3143b4341k1779j9307A20463l4774
17716H5689J64053a95458F4043a18492h223j21978A9795b34247c0150A9165m364
17705A4801c02258c9849A49760b19056M349B95299a47513N9664C82876d9151d179
17693c13629j6169A90270J2534o1643b4259j06974G5333J59815l8879a70978L1848
$$ plain form
17682 -139130 203380 291726 -182113 184669 -21162 973 -12769 71121 -234217 72602 -181127
17670 16542 304145 102819 -64508 -62490 61066 206247 164903 45934 377727 131404 -74731
17658 -56762 132533 -231553 -37269 -212783 186194 -76608 -28214 -243342 195028 -90534
17647 -162051 80770 20699 30138 19948 -13105 142508 -17495 155100 -284484 134453 -12631
17635 -125111 18785 155093 48915 -45287 170807 46448 73879 9538 29682 -61954 -264428
17624 -264428 -121110 98186 -147585 -86095 -16885 28169 228986 -138353 -84796 -164573 225341
17612 -62627 -208733 123497 -149790 303964 240918 163370 449268 39453 190667 5330 -156927
17600 282325 204665 96291 -37986 65195 187291 37692 -34959 -165433 4460 -67105 190656
$$ packed form
17682a39130B03380Q8346a82113A84669b1162I73a2769G1121b34217G2602a81127
17670A6542K87603A02819f4508K018F1066J45181m1344D5934L31793A31404g4731
17658e6762A32533b31553c7269j75514A86194g6608b8214k15128A95028i0534
17647a62051H0770B0699R439j0190a3105A42508a7495A55100b84484A34453a2631
17635a25111A8785J36308D8915d5287A70807D6448K7431I538K0144f1954k02474
17624b64428a21110I8186a47585O1490a6885B8169K00817a38353N3557p9777B25341
17612f2627j46106A23497a49790C03964o3046p7548K85898C9453J51214E330a56927
17600B82325p7660I6291c7986F5195J22096C7692c4959j30474D460f7105A90656
$$ plain form
17588 -367541 25332 -16685 -138008 68822 -251899 309583 13546 -258783 28740 -90386 -71529
17577 -71529 167086 186165 -20178 283631 -290647 52212 111028 -113364 149757 -143096
17566 -74671 2150 65912 -147242 228958 413484 -192317 185603 52635 235614 228677 -6517
17554 -88821 -91022 271242 36163 -85622 24060 -53648 4887 255637 155671 136004 153994 230666
17542 230666 165714 -212941 131747 -304192 -182437 -179845 64484 -352042 -87071 14575 -89335
17530 -69216 -360914 102599 -351733 234535 -165545 -44994 280989 89302 297114 -72208
17519 -94058 -47524 -95591 -87984 97464 -66715 -113523 206428 171289 176694 111455 -122432 93867
17506 -5407 123465 72474 17021 -76930 228109 100204 50842 183628 68572 -12609 130867
$$ packed form
17588c67541B5332a6685j21323F8822b51899C09583A3546b58783B8740i0386J8857
17577g1529A67086J9079b0178B83631b90647E2212N8816a13364A49757a43096
17566g4671B150O3762a47242B28958J84526a92317A85603E2635J82979o937f517
17554h8821k201B71242C6163h5622B4060e3648D887K50750r9966j9667J7990P6672
17542B30666o4952b12941A31747c04192J21755K592F4484c52042h7071A4575h9335
17530f9216k91698A02599c51733B34535a65545d4994B80989H9302K07812g2208
17519i4058M6534m8067P607I7464f6715m6808B06428l5139N405o5239a22432I3867
17506e407A23465n0991A7021g6930B28109A00204m9362J32786F8572a2609A30867
$$ plain form
17494 -56807 218496 101484 -112156 -32972 -96045 110907 267901 -73544 164190 304903
17484 304903 281185 117332 168318 128046 146160 441953 100275 9002 217401 118301 57445
17472 -45628 280105 208580 190665 -17988 57060 205354 -218305 75353 180807 356230 11599
17460 111142 -18723 219780 473722 -60246 182211 247991 113869 63970 -86132 -45212 196134
17448 108777 330678 75603 -113920 9877 -260436 327788 -26952 87315 36394 -2939 286550
17436 379114 239827 239118 219904 618579 552301 126672 173035 194418 120961 326146 45160
17424 110160 176610 310832 164388 259200 406511 161910 190478 155817 232405 -90038 173962
17412 169383 207887 97603 209180 344856 276323 216507 -94182 221116 182709 -58555 293160
$$ packed form
17494e6807B18496A01484a12156c2972o3073A10907J56994g3544A64190J40713
17484C04903k3718A17332N0986m0272J8114K95793A00275I002K08399r9100E7445
17472d5628B80105p1525j7915a7988E7060J48294b18305G5353J05454J75423A1599
17460A11142a8723B19780K53942f0246A82211O5780A13869m9899h6132M0920A96134
17448A08777K21901G5603a13920I877b60436C27788b6952H7315C6394b939B86550
17436C79114j39287p09j9214L98675o6278A26672M6363K1383p3457K05185D5160
17424A10160O6450J34222j46444R4812J47311A61910K8568l4661P6588i0038A73962
17412A69383L8504I7603J11577J35676o8533n9816i4182B21116l8407e8555B93160
$$ plain form
17400 305153 296799 447637 254471 305100 255496 132474 -24336 21146 121042 -66053 155771
17388 52114 58351 206903 8522 265797 269844 -16001 347370 28722 470172 202289 258692
17377 258692 111817 120837 45297 158478 328573 76332 53388 -228076 101713 39183 39098
17366 39098 79324 405264 108336 116971 -105713 -181435 100887 390438 41389 -13474 111495
17354 148328 282048 108027 226839 285670 -66186 175387 181000 -142072 322778 43194
17343 255610 258951 -3487 12314 67243 28276 -102071 97133 213797 246698 190551 84768
17331 61251 215304 87774 157769 89482 57873 182556 362748 236234 300301 177429 -188711
17319 356865 -217437 163535 80844 223095 -58054 35427 203394 291484 99878 516506
$$ packed form
17400C05153q354J50838j93166N0629m9604j23022b4336B1146R9896f6053A55771
17388E2114O237J48552H522K57275M047a6001C47370B8722M41450B02289N6403
17377B58692A11817R020D5297J13181J70095G6332k2944b28076A01713C9183q5
17366C9098M0226L25940A08336Q635a05713p5722A00887K89551D1389a3474A11495
17354A48328J33720A08027J18812N8831f6186A75387N613a42072C22778D3194
17343B55610L341c487A2314N4929B8276a02071I7133J16664L2901n6147H4768
17331F1251J54053H7774O9995o8287l1609J24683J80192j26514O4067j22872a88711
17319C56865b17437A63535H0844J42251e8054C5427J67967Q8090I9878M16628
$$ plain form
17309 516506 19697 -135259 106846 305362 27095 265994 40371 32038 272203 4598 11966
17298 11966 526350 96632 216725 144636 181687 -55376 71710 270467 158819 329384 183530
17287 183530 255014 352641 444689 196976 115830 321544 208119 274774 163765 365729
17277 365729 123131 -22856 226589 -11042 121682 -97235 -36940 28261 -39491 -49998 359993
17265 209928 -253594 232286 156257 46667 31960 218932 261112 -117061 39246 257799
17255 257799 437534 3986 171189 170081 327417 208578 228176 89639 55982 165807 247142
17244 247142 318758 -80227 232040 318308 6156 548965 409704 -132659 178782 48263 367895
17233 367895 146390 206742 405801 99619 442307 379993 -4281 246248 267480 259838 181433
$$ packed form
17309E16506A9697a35259A06846J98516B7095K38899D0371q333K40165D598P368
17298A1966N14384I6632J20093p2089L7051e5376G1710J98757j11648J70565j45854
17287A83530P1484R7627R2048A96976q1146K05714j13425O6655j11009K01964
17277C65729A23131b2856B26589a1042A21682i7235c6940B8261c9491j0507C59993
17265B09928b53594B32286p6029D6667j4707J86972M2180a17061C9246K18553
17255B57799J79735C986J67203j108J57336j18839J9598H9639l3657J09825Q1335
17244B47142P1616h0227B32040Q6268F156N42809j39261a32659A78782D8263L19632
17233C67895A46390O0352J99059I9619L42688o2314d281B46248K1232p642p8405
$$ plain form
17222 181433 248224 75107 417156 241166 300083 183088 147159 209700 324674 175381
17212 175381 360079 54045 63548 146178 34957 239216 367178 249954 275969 572611 18126
17200 538277 294115 275884 -253483 -29959 67603 215172 345109 109590 429539 396852
17190 396852 329239 77626 471437 104595 299523 427821 269662 828724 455796 429724
17180 429724 40713 473405 215269 226167 261255 271422 243782 266318 336463 274851 249049
17169 249049 425458 335241 392843 195656 314276 486799 113692 246743 82532 142472
17159 142472 452587 -144777 421625 284748 324043 368891 178790 688006 256916 311134
17149 311134 376524 477858 135171 125790 174451 338913 434679 130986 319788 381295 335020
$$ packed form
17222A81433O6791G5107L42049j75990N8917j16995l5929O2541J14974j49293
17212A75381J84698E4045R503Q2630C4957K04259J27962j17224K6015K96642A8126
17200E38277k44162j8231b53483b9959F7603J47569J29937A09590L19949l2687
17190C96852o7613G7626L93811A04595J94928J28298j58159N59062l72928k6072
17180D29724D0713M32692B15269J0898L5088J0167k7640K2536P0145o1612k5802
17169B49049J76409r0217N7602A95656J18620J72523A13692J33051H2532N9940
17159A42472L10115a44777D21625j36877L9295M4848A78790N09216B56916N4218
17149C11134O5390J01334A35171r381M8661J64462R5766A30986J88802O1507m6275
$$ plain form
17138 335020 654715 420654 -35597 393963 179863 498205 71763 73734 286726 -26716
17127 399189 367877 272757 131340 256806 243721 154760 17948 198183 473423 203997
17116 364931 281520 -5507 273229 241872 374318 132152 272140 346838 286586 422354 235196
17105 235196 262115 529715 376207 336990 754336 477753 472908 246693 499412 371795
17095 371795 388162 600858 319928 223539 -17184 456847 -17705 286911 261359 321571 35851
17083 314782 522776 149483 614589 321919 545492 421524 521189 422545 242491 373254
17073 373254 801733 196615 678324 405381 619918 823924 591091 480312 443131 440200
17063 440200 531781 571999 272098 414218 187222 357328 388333 718581 282571 821132
$$ packed form
17138C35020L19695k34061c5597C93963A79863L18342G1763J971K12992b6716
17127C99189l1312r5120A31340J25466j3085q8961A7948J80235K75240B03997
17116C64931q3411e507B73229l1357J32446A32152J39988P4698o0252J35768j87158
17105B35196K6919K67600j53508l9217M17346k76583m845k26215K52719j27617
17095C71795J6367K12696k80930r6389a7184D56847a7705B86911k5552O0212C5851
17083C14782K07994A49483M65106k92670K23573j23968R9665r8644j80054J30763
17073C73254M28479A96615M81709k72943K14537K04006k32833j10779l7181k931
17063D40200R1581M0218B72098J42120A87222J70106L1005L30248B82571N38561
$$ plain form
17053 821132 347745 822013 458801 631844 679596 554093 694375 253117 164628 345540
17043 345540 295277 526011 670829 980684 490631 505027 489205 488624 779840 534725 850001
17032 850001 665767 1090143 751579 466603 660067 463669 657749 457714 341967 353103
17022 353103 464463 896443 560214 565709 498872 469781 780441 724762 723095 574431 573905
17011 573905 746218 943762 555791 703078 707337 703293 988896 908296 879996 772205 635167
17000 635167 566483 944805 854187 439325 597629 699960 759748 763828 980940 845868
16990 845868 798876 803147 772489 550154 926657 709741 825931 687138 959331 941093
16980 941093 961237 841262 827167 952894 966941 1097281 695914 787075 993243 901205
$$ packed form
17053H21132C47745M74268l63212J73043M7752j25503J40282B53117q8489J80912
17043C45540n0263K30734J44818L09855m90053J4396j5822n81K91216k45115L15276
17032H50001j84234M24376l38564k84976J93464j96398J94080k00035j15747J1136
17022C53103J11360M31980l36229N495o6837k9091L10660n5679j667j48664n26
17011E73905J72313J97544l87971J47287M259m044K85603q0600k8300j07791j37038
17000F35167o8684L78322r0618m14862J58304J02331N9788M080K17112j35072
16990H45868m6992M271l0658k22335L76503k16916J16190j38793K72193j8238
16980I41093K0144j19975j4095J25727J4047J30340m01367R1161K06168r2038
$$ plain form
16970 901205 786329 883958 865336 997727 775381 886438 797263 938001 566827 1120843
16960 1120843 1203198 723077 1099230 609749 1196497 980630 784459 806761 868794 963725
16950 963725 935846 796115 923203 1032848 1161623 1162020 916407 1623571 1082068 1195166
16940 1195166 1154696 968662 953360 945850 1326870 1246387 1328205 1380127 921531 979491 1302097
16929 1302097 1167631 1507740 1264487 1085378 1193496 1122572 1182819 1233958 1275113 1341562
16919 1341562 1688262 1258630 1244173 1469428 1662531 1504047 1021962 1522880 1490671 1458412
16909 1458412 1389326 1190911 1843691 1503265 1509630 1779529 1404677 1597430 1622821 1739256
16899 1739256 1725807 1685305 1768718 1767051 1594960 1919717 1616589 2076552 1884854 2057475
$$ packed form
16970I01205j14876R7629j8622J32391k22346J11057q9175J40738l71174N54016
16960A120843Q2355m80121L76153m89481N86748k15867j96171K2302O2033R4931
16950I63725k7879j39731J27088J09645J28775L97k45613P07164n41503J13098
16940A195166m0470j86034j5302p510L81020q0483Q1818N1922m58596N7960L22606
16929A302097j34466L40109k43253j79109J08118p0924O0247N1139M1155O6449
16919A341562L46700m29632j4457K25255J93103j58484m82085N00918l2209l2259
16909A458412o9086j98415O52780l40426O365K69899l74852J92753K5391J16435
16899A739256j3449m0502Q3413j667j72091L24757l03128M59963j91698J72621
$$ plain form
16889 2057475 1935134 1472884 1866395 1976095 1866521 2002507 1804765 2178070 2013513
16880 2013513 1994218 2175580 2175762 2160668 2155116 2173345 2056180 2227384 2056994 2414647 2202479
16869 2202479 2160166 2451365 2214759 2284242 2025219 2577716 2634075 2721074 2712927 2644191 2645821
16858 2645821 2647788 2751915 2990698 2695123 2554460 2761262 2919072 3045564 2815341 2963331
16848 2963331 2857725 3126926 3341309 3012700 3024775 3517686 3336183 3580651 3287536 3415943
16838 3415943 3839393 3238677 3253965 3812978 3750788 3369671 3672244 3744413 3816259 3779194
16828 3779194 4131859 4424572 3929158 4357832 4616180 4268084 4369920 4675533 4550056
16819 4550056 4921907 4856919 5026106 4915634 5120259 4859461 5303324 5473137 5311158 5487354
$$ packed form
16889B057475j22341m62250L93511J09700j09574J35986j97742L73305j64557
16880B013513j9295J81362J82j5094n552J8229j17165J71204j70390L57653k12168
16869B202479m2313K91199k36606O9483k59023N52497N6359Q6999q147o8736J630
16858B645821J967J04127K38783k95575j40663K06802J57810J26492k30223J47990
16848B963331j05606K69201K14383l28609J2075M92911j81503K44468k93115J28407
16838C415943M23450o00716J5288N59013o2190l81117L02573P2169P1846l7065
16828C779194L52665K92713m95414M28674K58348l48096J01836L05613j25477
16819D550056L71851o4988J69187j10472K04625k60798M43863J69813j61979J76196
$$ plain form
16809 5487354 5660914 5720620 5861028 5856356 6072389 6054615 6541238 6397425 6570875 6333930
16799 6333930 6716629 6977777 7257455 7185049 7493260 7382089 7846451 7742838 7609728 8202229
16789 8202229 8475843 8567915 8736838 8765030 9238565 9130696 9616502 10229951 10131878 10027644
16779 10027644 10439193 10688655 11360033 11332214 12029116 11950831 12108511 12805115 13041411 13963707
16769 13963707 13688188 14340364 14815222 14912534 15657111 15679559 16348826 16810987 17530242 18022819
16759 18022819 18257047 19176784 19415278 20700489 21199683 21936078 23006036 23659898 24444152
16750 24444152 25172411 26446317 27454989 28472123 29735011 30620998 32019370 33430073
16742 33430073 34739628 36333854 37905111 39878042 41292031 43590467 45553792 47486090
$$ packed form
16809E487354J73560N9706J40408m672K16033j7774M86623j43813J73450k36945
16799F333930L82699K61148K79678p2406L08211j11171M64362j03613j33110N92501
16789H202229K73614R2072J68923K8192M73535j07869M85806O13449r8073j04234
16779A0027644M11549K49462O71378k7819O96902p8285J57680O96604K36296R22296
16769A3963707k75519O52176M74858R7312P44577K2448O69267M62161P19255M92577
16759A8022819K34228R19737K38494J285211M99194P36395J069958O53862P84254
16750B4444152P28259J273906J008672J017134J262888Q85987J398372J410703
16742C3430073J309555J594226J571257J972931J413989K298436J963325J932298
$$ plain form
16734 47486090 49932499 52561409 55390720 58063340 60992152 64296799 67577548 71569318
16726 71569318 74978071 79165171 83490708 88292413 93312249 98148595 103609651 108856941
16718 108856941 114796348 121092577 127018016 133237275 139386273 145455407 151301716 156514669
16710 156514669 161720775 166420284 170358433 173510875 176154854 177724279 178363173 177866811
16702 177866811 176451275 174737841 171717530 168216848 163668378 158916290 153792242 148128221
16694 148128221 142534031 136515734 130796320 124955421 118927495 113426674 107967882 102893838
16686 102893838 97587309 92562418 88090169 83877319 79581004 75133858 72138611 68640858
16678 68640858 64790590 61442380 58748753 55766963 53407466 50582360 48223711 46052873
$$ packed form
16734D7486090K446409K628910K829311K672620K928812L304647L280749L991770
16726G1569318L408753M187100M325537M801705N019836M836346N461056N247290
16718A08856941N939407O296229N925439O219259O148998O069134N846309N212953
16710A56514669N206106M699509L938149L152442K643979J569425O38894m96362
16702A77866811j415536j713434l020311l500682m548470m752088n124048n664021
16694A48128221n594190o018297n719414n840899o027926n500821n458792n074044
16686A02893838n306529n024891m472249m212850m296315m447146k995247l497753
16678F8640858l850268l348210k693627k981790k359497k825106k358649k170838
$$ plain form
16670 46052873 44055800 42135464 40199541 38618559 36819158 35211248 33757010 32102849
16662 32102849 31197324 29867639 28969418 27442327 26194232 25494209 24655128 23509886 22330920
16653 22330920 21886602 21184896 20400700 19615056 18943250 18769179 17540509 17305388 16759329
16644 16759329 15959614 15500905 15066964 14470142 13824047 13559589 13101564 12993986 12639574
16635 12639574 12136055 11926294 11439631 11071113 10523153 10450051 10014284 9952666 9565330 9373647
16625 9373647 9149465 8751982 8873022 8222674 8445610 8199227 8105244 7304149 7561479 7589680
16615 7589680 7154521 7031205 6718284 6765205 6388357 6531286 6231721 5842633 6034545 5954678
16605 5954678 5931018 5697795 5855498 5299621 5239620 5209672 5484120 5042883 5131727 4611764
$$ packed form
16670D6052873j997073j920336j935923j580982j799401j607910j454238j654161
16662C2102849r05525j329685q98221j527091j248095p00023q39081j145242j178966
16653B2330920m44318p01706p84196p85644o71806j74071j228670k35121n46059
16644A6759329p99715m58709m33941n96822o46095k64458m58025j07578l54412
16635A2639574n03519k09761m86663l68518n47960p3102m35767o1618l87336j91683
16625I373647k24182l97483J21040o50348K22936k46383r3983q01095K57330K8201
16615G589680m35159j23316l12921M6921l76848J42929k99565l89088J91912p9867
16605E954678k3660k33223J57703n55877o0001k9948K74448m41237Q8844n19963
$$ plain form
16595 4611764 4733707 4416284 4437162 4200836 4472971 4336412 4303305 3921738 3923980 4052555
16585 4052555 4042952 3504432 3652452 3694431 3558485 3540591 3567150 3440297 3490084 3443497 3145037
16574 3145037 3148612 3105638 3326631 3059053 3237464 2839053 2971502 2927961 2966777 2640296
16564 2640296 2670039 2445895 2796478 2660331 2631406 2398599 2443871 2163154 2913700 2201963
16554 2201963 2436678 1808468 2450895 2278260 2328644 2126331 2303006 2096160 2168093 2033195
16544 2033195 1950109 2024556 1769650 1791134 1737028 2109983 1826690 1729030 2244063 1454628
16534 1454628 2021285 1726311 2020169 1742174 1337539 1786172 1810994 1491207 1579161 1732223
16524 1732223 1565462 1390161 1660398 1451058 1505334 1589893 1475385 1669648 1239773 1524336
$$ packed form
16595D611764J21943l17423K0878k36326K72135j36559l3107l81567K242J28575
16585D052555r603n38520J48020M1979j35946j7894K6559j26853M9787m6587k98460
16574C145037L575m2974K20993k67578J78411l98411J32449m3541L8816l26481
16564B640296K9743k24144L50583j36147k8925k32807M5272k80717P50546p11737
16554B201963K34715o28210O42427j72635N0384k02313J76675k06846P1933j34898
16544B033195q3086P4447k54906K1484n4106L72955k83293r7660N15033p89435
16534A454628N66657k94974K93858k77995m04635M48633K4822l19787Q7954J53062
16524A732223j66761j75301K70237k09340N4276Q4559j14508J94263m29875K84563
$$ plain form
16514 1524336 1402206 1529312 1438932 1198196 1230075 1106139 771322 1249894 1337626 930073
16504 930073 1293302 1078969 1593379 1273383 1160248 906546 1299247 877360 1199287 1033067
16494 1033067 1189722 1332104 1049096 1289848 944186 1187688 1009881 802547 1010295
16485 1010295 1080888 1018376 1078269 781500 969013 852611 1006696 943407 495449 1214852
16475 1214852 569925 561681 1107068 882664 812557 934690 1049899 816170 742932 656463
16465 656463 347188 662495 765944 930930 710765 880960 494240 1209152 622647 884932
16455 884932 448788 862043 1064464 950646 844864 439958 802233 812737 487692 1073290
16445 1073290 589122 481391 853308 688548 928117 556872 698787 749486 589175 384548
$$ packed form
16514A524336j22130J27106r0380k40736L1879j23936l34817M78572Q7732m07553
16504I30073L63229k14333N14410l19996j13135k53702L92701m21887L21927j66220
16494A033067J56655J42382k83008K40752l45662K43502j77807k07334K07748
16485A010295P0593o2512N9893k96769J87513j16402J54085o3289m47958P19403
16475A214852E69925q244N45387k24404p0107J22133J15209k33729p3238q6469
16465F56463l09275L15307J03449J64986k20165J70195l86720P14912n86505K62285
16455H84932m36144M13255K02421j13818j05782m04906L62275J0504l25045N85598
16445A073290m84168j07731L71917j64760K39569l71245J41915N0699j60311k04627
$$ plain form
16435 384548 624316 313062 534858 632863 529782 634931 593572 663140 385793 649102
16425 649102 460372 385479 558918 776730 611514 547917 684708 812916 683098 256624
16414 414788 624729 641067 422511 470983 569636 478285 557115 339528 443067 683692
16404 683692 308645 558584 826861 515475 326210 446789 645619 708467 477179 228842
16393 340978 291968 468038 521663 391245 688242 355072 469868 549531 370399 338940
16383 338940 237991 395389 291367 358528 147730 414359 285707 168117 116860 -4421
16372 181814 382966 353379 430393 289832 334113 446451 230537 181508 467263 365260
16362 365260 241376 124578 196470 447227 444520 208227 288523 446 382507 182233 355665
$$ packed form
16435C84548K39768l11254K21796R8005j03081J05149m1359O9568k77347K63309
16425F49102j88730p4893J73439K17812j65216o3597J36791J28208j29818B56624
16414D14788K09941J6338k18556M8472R8653r1351P8830k17587J03539K40625
16404F83692C08645K49939K68277l11386j89265J20579J98830O2848k31288B28842
16393C40978m9010J76070N3625j30418K96997l33170J14796P9663j79132l1459
16383C38940j00949J57398j04022O7161A47730K66629j28652j17590n1257d421
16372A81814K01152k9587P7014j40561M4281J12338k15914m9029K85755j02003
16362C65260j23884j16798P1892K50757k707B08227Q0296D46L82061A82233J73432
$$ plain form
16351 355665 210555 466454 318187 335677 -16696 266069 250593 251215 294350 112170 303542
16340 303542 464640 343407 290592 114383 391846 235083 413046 125426 343029 509398
16330 509398 196168 126978 267732 430428 106582 91224 481854 132458 285009 71552
16319 373277 13793 72465 279360 603677 103493 235036 146158 127863 -47122 134788
16308 469447 135859 237382 600579 272188 698336 330042 301500 206803 52614 217816
16298 217816 544666 -14266 170837 300927 71372 129774 355793 59020 456238 114500
16287 -42797 250068 236745 343163 474272 213112 128616 -77844 18707 142256 395442
16277 395442 535275 -5248 -60149 315022 592128 209139 250630 187384 273582 -22693 190526
$$ packed form
16351C55665j45110K55899j48267J7490a6696B66069j5476O22M3135A12170J91372
16340C03542J61098j21233n2815A14383K77463j56763J77963A25426K17603J66369
16330E09398A96168o9190J40754J62696A06582j5358L90630A32458J52551G1552
16319C73277A3793N8672K06895L24317A03493J31543q8878j8295d7122A34788
16308D69447A35859J01523L63197B72188M26148C30042k8542r4697E2614J65202
16298B17816L26850a4266A70837J30090G1372N8402K26019E9020L97218A14500
16287d2797B50068j3323J06418J31109B13112q4496g7844A8707J23549K53186
16277C95442J39833e248n4901C15022K77106B09139M1491o3246Q6198b2693A90526
$$ plain form
16265 51383 104414 263726 102712 190947 214618 -41126 54402 241052 122618 30639 198308
16254 198308 354306 182573 627690 -54810 -53498 207659 110894 -23519 81082 156445 242722
16243 242722 298809 -16551 324938 -16858 -220811 254608 -97552 102374 285180 510017
16233 510017 178515 -24572 49668 50972 -87828 77220 -132653 277142 324050 49409 356129
16222 356129 -337319 148792 26403 -163211 336675 18542 -58523 -48151 197374 18014
16211 -75146 173622 -81271 172959 123222 294081 -23656 462207 128881 -97261 -52269 131367
16199 -133515 126378 -36859 283986 116543 201922 -59983 6025 165988 248433 182926 228844
16188 228844 -10784 71281 -308762 82481 42570 335269 363396 -80580 33796 -41816 -15444
$$ packed form
16265E1383N3031J59312A02712Q8235K3671d1126E4402J86650j18434C0639J67669
16254A98308J55998j71733M45117e4810J312B07659r6765b3519H1082P5363Q6277
16243B42722N6087a6551C24938a6858k03953B54608i7552A02374J82806K24837
16233E10017A78515b4572D9668J304h7828G7220a32653B77142M6908D9409L06720
16222C56129c37319A48792B6403a63211C36675A8542e8523J0372A97374A8014
16211g5146A73622h1271A72959m9737J70859b3656D62207A28881i7261M4992A31367
16199a33515A26378c6859B83986A16543Q5379e9983F025J59963Q2445o5507M5918
16188B28844a0784G1281c08762H2481l9911K92699K8127h0580C3796d1816a5444
$$ plain form
16176 -95384 -195671 160516 33092 222545 197158 280810 -5694 -59485 42499 210395 110217
16165 110217 71542 94044 231672 238653 -177560 84953 -41389 -63914 -120083 -187346 300827
16153 176851 -65531 278892 85420 -85915 302684 181590 260104 161424 -34951 52451 56856
16142 56856 118214 19396 20599 -63319 -168803 65245 349331 -11632 -165635 198732 291067
16131 291067 10918 -347618 42938 -111353 227049 277031 -108394 45951 -157599 -61429
16120 -188414 -149654 186115 -444450 217474 -28579 -69455 42651 244854 70478 -127774
16109 211771 -301037 366507 -148840 42859 -51567 -226131 -504256 -12287 -38949 93607
16098 122546 38658 72605 -158898 361210 -18249 48419 -114776 36498 -256244 137445
$$ packed form
16176i5384j00287A60516C3092J89453k5387Q3652e694n3791D2499J67896j00178
16165A10217l8675K2502J37628O981a77560H4953d1389k2525n6169o7263C00827
16153A76851f5531B78892H5420h5915C02684j21094P8514r8680c4951E2451M405
16142E6856O1358A9396J203f3319j05484F5245K84086a1632j54003A98732R2335
16131B91067A0918c47618D2938a11353B27049M9982a08394D5951a57599f1429
16120a88414L8760A86115d44450B17474b8579m0876D2651K02203G0478a27774
16109B11771c01037C66507a48840D2859e1567j74564k78125a2287k6662I3607
16098A22546C8658L3947a58898C61210a8249D8419a14776C6498b56244A37445
$$ plain form
16087 21925 148970 68124 149718 184795 220996 80317 380616 262738 -218083 -115387 -45935
16075 7124 303637 81059 -171030 290856 7028 -218149 52166 -6169 71564 -108496 137587
16063 109901 328529 84981 -87905 13036 39689 -337503 6627 115604 26991 -17640 183298
16051 126484 -71800 78559 135502 98517 -258846 -22811 176712 43391 41168 -479 -223937
16040 -223937 -74831 -116167 -35339 184868 176069 78590 7291 165798 -192687 -29769 111626
16028 -46953 72358 -234415 215657 -2676 99271 -163779 -349415 -258051 -204233 67942 110674
16017 110674 -120486 -130083 -220098 7305 -48832 -3261 -68869 -205784 83048 -121661 -155786
16006 -155786 -380231 -10286 -176816 -280959 -212692 10052 42929 -249350 -97546 -142908 -192792
$$ packed form
16087B1925J27045F8124Q1594L5077L6201H0317L00299j17878b18083J02696d5935
16075G124K96513H1059a71030B90856G028b18149E2166f169G1564a08496A37587
16063A09901K18628H4981h7905A3036K6653c37503F627J08977B6991a7640A83298
16051A26484g1800G8559N6943l6985b58846b2811A76712D3391k223d79k23458
16040b23937g4831m1336c5339A84868q799G8590G291J58507a92687b9769A11626
16028d6953G2358b34415B15657b676I9271a63779j85636R1364N3818F7942M2732
16017A10674a20486r597r0015G305d8832c261o5608j36915H3048a21661l4125
16006a55786k24445a0286j66530j04143O8267A0052L2877b49350i7546m5362m9884
$$ plain form
15995 -192792 -101223 -266441 -217664 18813 -110068 96952 216744 21005 -171152 68142 -89856
15983 -79109 268105 -310897 33432 201002 51082 -134783 321224 277288 113531 -73391
15972 263488 -87649 129761 355404 438984 335423 317747 133195 144229 117640 166221 376528
15961 376528 238182 72668 143587 -20900 -63077 53851 67919 -257355 87979 93148 -5712
15949 -133960 -102293 -141642 289329 99016 -70213 -50947 -181030 -343957 -50498 -74265 106031
15937 -257044 9334 13429 138486 -108441 57925 -161670 25824 17556 -174924 166656 -93045
15925 -31195 -140090 195250 190039 80869 90177 -145301 115015 -85435 65460 -76641 -131938
15914 -131938 -120430 25695 28894 -173548 17685 -169322 -287409 -180416 -43356 41398 245218
$$ packed form
15995a92792R1569j65218M8777A8813a10068I6952J19792B1005a71152F8142h9856
15983g9109B68105c10897C3432J67570E1082a34783C21224m3936A13531g3391
15972B63488h7649A29761K25643Q3580j03561j7676A33195J1034k6589M8581K10307
15961C76528j38346G2668P0919b0900m2177E3851J4068b57355H7979N169e712
15949a33960L1667l9349B89329I9016g0213J9266j30083j62927e0498k3767A06031
15937b57044I334M095J25057a08441E7925a61670B5824q268a74924A66656i3045
15925c1195j08895A95250n211H0869R308a45301A15015h5435F5460g6641n5297
15914a31938J1508B5695L199a73548A7685a69322j18087J06993d3356D1398K03820
$$ plain form
15903 245218 -262252 123500 -30594 -24378 -251049 -250088 132513 -325515 -36204 -154927 -17629
15891 -206275 111172 -319135 136975 190728 -225103 117055 80575 -245090 -55282 -377308
15881 -377308 45886 217200 -132734 -33168 -297955 146008 227844 -42393 141629 27500
15870 84288 -5695 -86384 54854 -421464 46302 -125500 -344449 -6443 76172 -47346 -131341
15859 -131341 70253 53243 -280736 -6397 158730 -25663 -89875 -7845 -450078 31307 -222768
15847 -121634 -13940 -438531 -257934 -144236 218580 883 317433 25786 -69702 -33087 -227036
15836 -227036 -77509 151846 127920 31792 -36551 -135717 -132270 -12461 -106718 55856 -49787
15824 -325608 145985 -171972 -43425 38864 164844 196580 20464 -41993 -529181 -170106
$$ packed form
15903B45218b62252A23500c0594O216k26671R61A32513c25515c6204j18723a7629
15891b06275A11172c19135A36975N3753b25103A17055l6480b45090e5282l22026
15881c77308D5886J71314a32734c3168k64787A46008Q1836d2393A41629B7500
15870H4288e695q0689E4854d21464D6302a25500k18949f443G6172d7346q3995
15859a31341G0253j7010b80736f397A58730b5663o4212g845m42233C1307b22768
15847a21634a3940m24591J80597J13698B18580H83L16550B5786f9702c3087j93949
15836b27036g7509A51846k3926C1792c6551r9166L447a2461r4257E5856d9787
15824c25608A45985a71972d3425C8864J25980L1736B0464d1993m87188a70106
$$ plain form
15813 -307702 45707 -483082 9667 -169829 -163390 -394913 -156057 -111827 -359948 -83172 75681
15801 -120 -194125 -24562 -402728 -285393 56532 -102012 -11336 -306774 221883 -74458 -120390
15790 -120390 17189 -191047 -285305 187272 189791 -89802 -11842 243104 301666 110892 95464
15779 95464 -31945 -50039 224194 189042 -186339 -328974 -88900 57680 1845 -385501 -50913
15767 -322250 -145360 -89279 -139799 -26730 315226 166234 102873 -145250 -193891 -170398 158039
15755 128728 214533 -165590 -268298 125382 -6854 219792 166137 59034 -57179 66645 215476
15744 215476 -172956 -56709 37448 166022 -36322 -217005 -233778 44804 359088 102320
15733 162206 356213 145781 352620 66799 102213 -360147 -125366 126737 -1484 698562
$$ packed form
15813c07702D5707d83082I667a69829O439k31523a56057M4230k48121h3172G5681
15801a20j94005b4562l78166J17335E6532a02012a1336k95438B21883g4458m5932
15790a20390A7189a91047r4258A87272K519h9802a1842B43104N8562A10892j5428
15779I5464c1945j8094B24194l5152a86339j42635h8900E7680A845c85501e0913
15767c22250a45360N6081n0520b6730C15226j48992o3361a45250m8641K3493A58039
15755A28728Q5805a65590j02708A25382f854B19792n3655E9034e7179F6645J48831
15744B15476a72956e6709C7448J28574c6322j80683j6773D4804L14284A02320
15733A62206J94007A45781K06839F6799L5414c60147a25366A26737a484F98562
$$ plain form
15722 253062 -249212 -99855 94207 -137903 -74570 2221 -162252 -47094 -227011 124593 125204
15711 125204 315029 -275623 325089 315546 103448 172659 -110956 -109610 -148291 81668 -248013
15699 -209116 33984 -76495 -112542 -279997 15989 -81749 -152772 -136096 -441152 -98640 -39760
15687 35654 57512 -197033 19295 37615 -60237 -103566 78676 -10397 -109002 209926 -420820
15675 266783 3541 -126347 -177652 225432 204414 282498 -207450 8778 65228 -129891 -67887
15664 -67887 -271493 -177830 14340 124601 -195937 31922 46303 39907 -205280 -83801 -62093
15653 -62093 -50449 102165 -12115 -189990 -28631 -3154 -326404 -49666 115737 -26865 -59598
15642 -59598 -77741 -229736 220948 -61337 62153 -264803 -36757 371227 120379 61336 184640
$$ packed form
15722B53062b49212i9855I4207a37903O3333B221a62252d7094j79917A24593O11
15711A25204J89825b75623C25089r543A03448O9211a10956J346l8681H1668b48013
15699b09116C3984g6495l6047j67455A5989h1749p1023J6676l05056i8640c9760
15687C5654K1858a97033A9295J8320f0237m3329G8676a0397r8605B09926d20820
15675B66783C541a26347n1305B25432k1018P8084b07450H778N6450a29891O2004
15664f7887k03606R3663A4340J10261a95937C1922J4381o396b05280h3801K1708
15653f2093J1644A02165a2115j77875b8631c154l23250d9666A15737b6865l2733
15642e9598j8143j51995B20948f1337F2153b64803c6757C71227A20379n9043J23304
$$ plain form
15631 184640 191003 10588 -306058 15649 131020 -101208 -93253 70033 84972 254743 -153275
15619 -344341 97048 84125 -17340 163596 29997 50920 -15399 489584 239108 63884 -6300
15607 -49718 58439 231372 41513 183232 -111001 -250573 -224667 6540 58935 136397 86982
15596 86982 50766 27689 -403012 -190841 305953 94563 228471 -90115 218207 -175956
15585 123562 -38383 192840 -18934 170772 118402 -286453 8758 47984 -270292 -378178 180123
15573 -115130 -57914 125982 163514 -335418 1903 -78176 67217 140343 -120519 123075 186419
15562 186419 172273 -50555 -148461 187083 16193 125241 -165980 50313 -208632 -165784 -276943
15551 -276943 17769 102659 -186549 -234620 163049 73869 -401975 7476 97886 312272 -239202
$$ packed form
15631A84640O363A0588c06058A5649J15371a01208P955G0033J4939J69771a53275
15619c44341I7048j2923a7340A63596B9997K0923a5399D89584B39108F3884f300
15607d9718E8439J72933D1513J41719a11001j39572K5906F540N2395P7462m9415
15596H6982l6216k3077d03012a90841C05953I4563J33908i0115B18207a75956
15585A23562c8383A92840a8934A70772n2370b86453H758L9226b70292j07886A80123
15573a15130N7216A25982L7532c35418A903g8176F7217P3126a20519A23075O3344
15562A86419j4146e0555r7906A87083A6193J09048a65980E0313b08632M2848j11159
15551b76943A7769Q4890a86549m8071A63049G3869d01975G476R0410K14386b39202
$$ plain form
15539 45695 -303879 -222501 282974 -14603 -97000 -1614 -2664 -108452 -325643 -40923 106107
15527 -162751 -127054 110004 146313 -224635 154210 210701 -12613 -82723 269545 92744 121820
15516 121820 -65142 -55404 -342986 71272 69152 -93984 136135 -36105 -148037 131068 200
15504 147659 194573 340836 -115740 -286132 -77918 56472 -149856 230630 -84778 -132822
15494 -132822 -187658 50507 149067 75763 -160291 -45854 -112589 -79459 193872 -70279 -243963
15483 -243963 70938 -107295 -32721 133328 -34661 172649 -117880 93337 114956 184210 225003
15472 225003 -90797 -369944 -97810 80079 -295481 -8172 75221 183643 -216058 -100118 -139824
15461 -139824 65565 -164087 193545 -148405 -47698 -100272 -128290 -292738 -86228 139478
$$ packed form
15539D5695c03879Q1378B82974a4603q2397a614j050j05788k17191d0923A06107
15527a62751L5697A10004L6309b24635A54210N6491a2613p0110B69545I2744K9076
15516A21820f5142R738k87582G1272k120i3984A36135c6105j11932A31068B00
15504A47659M6914J46263a15740j70392g7918E6472a49856B30630h4778m8044
15494a32822n4836E0507R8560p3304a60291d5854o6735L3130A93872g0279j73684
15483b43963G0938a07295c2721A33328c4661A72649a17880I3337K1619O9254M0793
15472B25003i0797k79147i7810H0079b95481h172G5221J08422b16058a00118l9706
15461a39824F5565a64087A93545a48405d7698n2574k8018j64448h6228A39478
$$ plain form
15450 -51057 -150309 181291 -11444 76866 -162649 237028 93716 189669 195999 -56102 175347
15438 409534 204973 -128533 24680 -30413 -101297 205169 -30600 1321 -409034 -67068 -14220
15426 -226993 -244862 122622 -164400 -160208 -371345 92674 216921 159237 107432 -9932 162778
15414 115595 -333802 21501 186912 119869 -147450 -25031 -111637 107940 317 -78097 -80738
15403 -80738 106454 -4114 120894 174750 -13167 -91738 75872 117644 55205 -34858 182339
15391 309689 263380 -61946 -243880 107925 221289 154307 238187 -4547 328139 -185154 -2305
15379 -197826 413815 -77550 29161 -146381 -214597 119265 -25442 -190402 -477793 -214297
15368 105347 18950 -47864 -324510 26544 -74485 -80310 -153768 134933 174308 -177661 -208246
$$ packed form
15450e1057r9252A81291a1444G6866a62649B37028I3716R5953O330e6102A75347
15438D09534k04561a28533B4680c0413p0884B05169c0600A321d09034f7068a4220
15426b26993j7869A22622a64400M192k11137I2674J24247n7684n1805i932A62778
15414A15595c33802B1501J65411o7043a47450b5031q6606A07940C17g8097k641
15403h0738A06454d114A20894N3856a3167p8571G5872M1772E5205c4858A82339
15391C09689m6309f1946j81934A07925J13364o6982Q3880d547C28139a85154b305
15379a97826D13815g7550B9161a46381o8216A19265b5442j64960k87391b14297
15368A05347A8950d7864k76646B6544g4485n825p3458A34933L9375a77661l0585
$$ plain form
15357 -208246 69318 187051 -102308 64441 -37429 282593 -62695 -87623 -52109 339978 -134937
15345 -67357 24831 51294 -221232 -409455 9942 -127206 -50636 185070 -209994 18003 -412725
15333 -15456 211398 75291 -98330 -5225 -135868 -279596 201740 80870 -327883 146036 274831
15322 274831 49492 -30924 48509 74856 208237 179437 119741 -83933 103138 162510 444746
15311 444746 187363 -24066 169282 -128757 106342 -246081 34639 -100633 -122588 -141046
15301 -141046 -74658 -111398 116628 -147060 330054 -194761 -173086 -80997 242502 121461
15291 121461 188148 182432 130172 -58078 52290 157606 149531 200875 33878 -32021 -7656 20995
15278 48616 84153 286159 110738 69875 87257 246512 42385 138904 206636 266303 423226
$$ packed form
15357b08246F9318J17733a02308F4441c7429B82593f2695k4928L5514C39978a34937
15345f7357B4831K6463b21232j88223I942a27206e0636A85070b09994A8003d12725
15333a5456B11398G5291i8330e225j30643j43728B01740H0870c27883A46036J28795
15322B74831D9492c0924D8509K6347J33381k8800n9696h3933A03138N9372K82236
15311D44746A87363b4066A69282a28757A06342b46081C4639a00633k1955j8458
15301a41046O6388l6740A16628a47060C30054a94761K1675h0997B42502j21041
15291A21461O6687n716n2260e8078E2290J05316q075N1344C3878c2021g656B0995
15278D8616L5537K02006A10738m0863J7382J59255D2385R6519O7732N9667J56923
$$ plain form
15267 423226 36980 63404 -150334 61900 -230583 21553 234111 84586 -275004 -135686
15256 124453 -148301 188244 182520 39858 87627 -249573 115631 -117797 27841 -27520 140822
15244 -147897 195079 385985 -102920 75013 425624 337036 194344 270449 272980 -167439
15233 984703 1088790 1099717 1390453 598842 150814 320515 -67328 202371 -7913 -27809
15223 -27809 119972 285927 196206 40638 182924 -211747 -108591 -303632 -20648 -109939
15213 -109939 4487 164474 10048 99802 146920 -56504 383305 -40141 -59050 184194 67091
15201 221111 182415 171146 3659 -96169 144791 158460 345735 210157 199497 -173269 -167836
15190 -167836 -311380 135200 -164790 161831 355392 -72250 -21264 20188 164371 265351
$$ packed form
15267D23226C6980K6424a50334F1900b30583B1553K12558H4586b75004a35686
15256A24453a48301A88244n724C9858M7769b49573A15631a17797B7841b7520A40822
15244a47897A95079J90906a02920G5013L50611q8588j42692P6105K531a67439
15233I84703J04087J0927K90736E98842A50814J69701f7328B02371g913j9896
15223b7809A19972J65955q9721D0638J42286b11747J03156j95041b0648q9291
15213a09939D487J59987A0048Q9754M7118e6504C83305d0141j8909A84194F7091
15201B21111l8696j1269C659i6169A44791J3669J87275j35578j0660a73269N433
15190a67836j43544A35200a64790A61831J93561g2250b1264B0188J44183J00980
$$ plain form
15180 265351 185085 143083 -69552 272934 -148435 -117882 180777 50740 -204620 57559 157603
15169 157603 -144241 5898 58120 228803 78559 64057 66381 -15343 -143805 1054 -207157
15157 225948 167923 337571 51881 344745 124975 110575 -216731 356325 -31151 793 -190565
15145 129204 135946 -96179 123549 2274 58107 13143 372179 -84955 337823 254951 428772
15134 428772 -173610 233054 381027 -92929 243618 422513 260581 68790 124981 331941
15124 331941 -282548 -65006 18379 -427442 68276 183589 50382 106951 -83132 118980 152187
15113 152187 330792 299625 -244780 7182 136453 178247 -106509 -53858 328795 70500 413116
15102 413116 -302245 424937 -314148 402308 250352 -85742 345919 62017 384924 32282
$$ packed form
15180B65351q0266m2002f9552B72934a48435L0553A80777E0740b04620E7559J00044
15169A57603a44241E898N2222J70683G8559j4502K324a5343j28462A054b07157
15157B25948n8025J69648E1881K92864A24975j4400b16731C56325c1151G93a90565
15145A29204O742i6179A23549B274N5833A3143L59036h4955C37823q2872J73821
15134D28772a73610B33054J47973i2929B43618J78895j61932F8790N6191K06960
15124C31941b82548f5006A8379d27442F8276J15313E0382N6569h3132A18980L3207
15113A52187J78605l1167b44780G182J29271M1794a06509N2651C28795G0500L42616
15102D13116c02245D24937c14148D02308j51956h5742C45919F2017L22907C2282
$$ plain form
15091 -216585 101116 -59120 127582 326677 218159 352876 307930 260475 -117419 33158
15080 190460 426220 51452 249298 373647 -27774 -38338 151555 149215 135378 -25999 106470
15068 299191 -99167 14784 321510 129513 156361 137179 231146 -70691 299077 214233 143293
15057 143293 52140 172290 -173657 274009 196671 325435 147268 96451 135011 45578
15046 253301 163012 94438 193310 -199756 236838 88339 272749 414490 207259 280451
15036 280451 207628 290055 53592 474669 -178581 124175 198246 368392 145761 5521 279470
15025 279470 429539 -231640 -409 179637 271001 230503 132213 -10186 291506 166328 -179644
15013 332011 332682 -19795 177188 268956 -25364 214658 -269160 324170 326397 157661 412204
$$ packed form
15091b16585A01116e9120A27582J99095j08518J34717m4946m7455a17419C3158
15080A90460K35760E1452J97846J24349b7774j0564A51555k340j3837b5999A06470
15068B99191i9167A4784L06726A29513K6848j9182R3967g0691B99077q4844p0940
15057A43293E2140J20150a73657B74009p7338J28764A47268n0817L8560D5578
15046B53301r0289o8574R8872a99756B36838H8339J84410J41741k07231P3192
15036B80451p2823Q2427E3592M21077a78581A24175P4071J70146A45761E521K73949
15025B79470J50069b31640d09A79637R1364m0498r8290a0186B91506j25178a79644
15013C32011O71a9795A77188R1768b5364B14658b69160C24170K227A57661K54543
$$ plain form
15002 412204 -322149 228674 398122 141590 266529 422850 -7395 -132771 77870 376081
14992 376081 138597 -99518 173968 624297 264283 67202 -66292 281768 119070 -143649
14981 70877 160697 6833 69490 -98375 240546 140805 -48794 184878 -175533 8818 104987
14970 104987 124927 424905 163675 121249 66659 319328 -66185 315738 272359 187319 -73510
14958 -56287 100222 576687 382848 -36208 62853 -49525 249968 199038 -17926 512242 362739
14947 362739 379326 316603 213478 193826 268595 -101959 121562 245852 358599 417740
14937 417740 167654 248330 222277 71980 209818 77355 160503 290946 418758 122984
14926 404863 385521 299868 278411 285725 97667 314087 340369 373730 -87825 410786 203753
$$ packed form
15002D12204c22149B28674J69448A41590J24939J56321g395j25376G7870K98211
14992C76081A38597i9518A73968M50329B64283F7202f6292B81768A19070a43649
14981G0877Q9820F833O2657i8375B40546r9741d8794A84878a75533H818R6169
14970A04987J9940K99978A63675m2426n4590K52669f6185C15738m3379q5040g3510
14958e6287A00222M76465j93839c6208F2853d9525B49968n0930a7926E12242j49503
14947C62739J6587o2723j03125j9652P4769a01959A21562J24290J12747N9141
14937D17740A67654Q0676k6053G1980J37838G7355Q3148J30443J27812A22984
14926D04863j9342q5653k1457P314I7667K16420K6282L3361h7825D10786B03753
$$ plain form
14914 407590 576171 204355 78337 612382 141505 177344 204450 196639 202092 116171 326488
14903 326488 214063 263140 187874 248516 429220 309702 120859 195095 234630 -105416
14892 261116 175432 253804 736917 148721 187688 99733 52883 310086 161384 190151 395899
14881 395899 -53552 478803 210442 211433 537744 160679 10615 516867 170992 350543
14871 350543 -10951 513407 432490 400853 683393 293251 9443 209082 488812 474785 496711
14860 496711 764452 403154 172700 556301 430889 423871 112430 380542 464188 241762
14850 241762 498464 652681 29162 418335 480847 605534 306445 243466 109716 854064
14840 854064 354196 220338 756141 431171 575543 634150 305421 378928 499598 416172
$$ packed form
14914D07590J68581B04355G8337N34045A41505L5839K7106p811N453q5921K10317
14903C26488j12425M9077p5266O0642J80704j19518A20859P4236L9535a05416
14892B61116q5684P8372M83113A48721L8967q7955m6850K57203j48702K8767K05748
14881C95899e3552D78803B10442R91L26311A60679A0615N06252A70992J79551
14871C50543a0951E13407q0917l1637K82540B93251I443J99639K79730j4027K1926
14860D96711K67741l61298A72700L83601j25412p018A12430K68112Q3646k22426
14850B41762K56702J54217B9162L89173O2512J24687k99089o2979A09716P44348
14840H54064C54196j33858N35803l24970J44372N8607C05421P3507J20670q3426
$$ plain form
14830 416172 387744 562015 459697 480661 293786 360152 575573 440905 202676 366780
14820 366780 61852 452432 555376 440157 410771 500447 865972 558649 290312 390265
14810 390265 572433 651796 532228 552698 500538 509626 400488 276663 223511 703669 408692
14799 408692 372623 504781 663508 535202 69331 384449 608484 638946 754422 388868
14789 388868 382606 492570 472641 536708 473453 470045 699612 282514 536616 673963 788006
14778 788006 503735 192093 717457 426364 398806 798379 432234 165888 361614 1039807
14768 1039807 556880 566508 911436 210270 553243 845791 608138 628304 528449 705987
14758 705987 884015 469014 491385 627215 613196 755460 681254 508562 543808 538094 826442
$$ packed form
14830D16172k8428J74271j02318K0964j86875O6366K15421j34668B02676J64104
14820C66780F1852L90580J02944j15219k9386Q9676L65525l07323k68337R9953
14810C90265J82168P9363j19568K0470n2160R088j09138j23825n3152M80158k94977
14799D08692l6069J32158J58727j28306F9331L15118K24035L0462J15476l65554
14789C88868o262J09964j9929O4067o3255l408K29567B82514K54102J37347J14043
14778G88006k84271A92093N25364k91093k7558L99573l66145A65888J95726O78193
14768A039807m82927R628L44928B10270L42973K92548k37653K0166r9855J77538
14758G05987J78028m15001K2371J35830j4019J42264p4206j72692L5246n714K88348
$$ plain form
14747 826442 732009 772815 504763 668696 517386 684984 656482 732418 879459 619177
14737 619177 663121 1003131 583759 899979 446490 632720 766168 582556 838495 756149
14727 756149 724657 701214 733862 704227 806924 926764 945029 763348 652836 862346
14717 862346 989134 582000 547769 659454 952469 646889 895328 749751 528969 925942
14707 925942 484930 881009 824587 659924 781543 1055528 823322 930894 1191645 795546
14697 795546 1005448 507498 595591 885365 868535 819636 721081 793000 818144 830306 994125
14686 994125 730304 1003514 947129 933838 661672 933747 891204 956822 415640 534264
14676 534264 818546 774564 859938 1030061 882351 1113844 738879 1009573 1114085 1201563
$$ packed form
14747H26442r4433M0806k68052J63933j51310J67598k8502P5936J47041k60282
14737F19177M3944L40010m19372L16220D46490J86230J33448j83612K55939q2346
14727G56149l1492k3443L2648k9635J02697J19840J8265j81681j10512K09510
14717H62346J26788m07134l4231J11685K93015l05580K48439j45577k20782L96973
14707I25942m41012L96079n6422j64663J21619K73985k32206J07572K60751l96099
14697G95546K09902m97950Q8093K89774j6830m8899r8555P1919K5144J2162J63819
14686I94125k63821K73210n6385j3291k72166K72075m2543O5618D15640J18624
14676E34264K84282m3982Q5374J70123j47710K31493l74965K70694J04512Q7478
$$ plain form
14666 1201563 1093193 892865 911286 904781 1105414 745822 1206161 1253843 1338832 884673
14656 884673 1171782 1023510 1100871 802797 1037957 851755 897381 1358612 998778 1033322
14646 1033322 1224784 1007567 1109588 965585 1192559 1017340 1301780 1136787 1263371
14637 1263371 1087071 1025077 1009283 1313853 1254043 1018030 1055765 1125227 1131975 1158519 1191050
14626 1191050 1294115 1445114 893051 1159532 992534 1264433 1127640 1176104 1492299 1270987
14616 1270987 1451694 1119981 1436883 1432301 1398163 1603835 1327396 1320386 1446906 1279006
14606 1279006 1159524 1101183 1461870 1151349 1548722 1409779 1307332 1328772 1436199 1584368
14596 1584368 1515987 1535923 1404696 1680617 1407519 1455761 1676432 1582020 1846302 1383876
$$ packed form
14666A201563j08370k00328J8421o505K00633l59592M60339M7682Q4989m54159
14656H84673K87109j48272P7361k98074K35160j86202M5626M61231l59834L4544
14646A033322J91462k17217J02021j44003K26974j75219K84440j64993J26584
14637A263371j76300o1994j5794L04570n9810k36013L7735O9462O748K6544L2531
14626A191050J03065J50999n52063K66481j66998K71899j36793M8464L16195k21312
14616A270987J80707l31713L16902m582l4138K05672k76439p010J26520j67900
14606A279006j19482n8341L60687l10521L97373j38943j02447K1440J07427J48169
14596A584368o8381J9936j31227K75921k73098M8242K20671r4412K64282m62426
$$ plain form
14586 1383876 1461693 1365082 1842639 1743830 1961627 1616697 1596374 1675894 1572353 1685062
14576 1685062 1767583 1908098 1776984 1565375 1634817 1116556 1976050 1660915 1750675 2018721
14566 2018721 1934106 2025699 2126443 2156755 1601878 2044203 2102320 2090715 2024700 2274934
14556 2274934 2149451 2267548 2115109 2061934 2318806 2171655 2076962 2716300 2536268 2341163
14546 2341163 2612289 2371481 2806469 2991022 2872971 3368831 3940949 3959206 4663058 5151454
14536 5151454 6288111 7491374 10075591 14211694 21570479 33721269 30057879 17711914
14528 17711914 10487365 7131958 5380804 3823249 3516096 3391990 2643418 3032031 2639883
14519 2639883 2489526 2488168 2513810 2479140 2216177 2335499 2453761 2260700 2426448 2489537
$$ packed form
14586A383876P7817r6611M77557r8809K17797l44930k0323P9520j03541J12709
14576A685062Q2521J40515j31114k11609O9442n18261Q59494l15135Q9760K68046
14566B018721q4615R1593J00744L0312n54877M42325N8117j1605o6015K50234
14556B274934j25483J18097j52439n3175K56872j47151r4693O39338j80032j95105
14546B341163K71126k40808M34988J84553j18051M95860N72118J8257P03852M88396
14536E151454J136657J203263K584217M136103P358785J2150790l663390j2345965
14528A7711914p224549l355407j751154j557555l07153j24106p48572L88613l92148
14519B639883j50357j358K5642l4670k62963J19322J18262j93061J65748O3089
$$ plain form
14509 2489537 2521768 2249709 2369535 2295696 2439830 2507741 2881004 2600268 2611368 2661665
14499 2661665 2855072 2836915 2769672 2910780 2948445 2788886 3128380 2913082 2888798 3071897
14489 3071897 3135856 3041040 3298003 3021109 3119027 3401492 3222341 3033385 3283692 3649328
14479 3649328 3405646 3417532 3549811 3793523 3433488 3433801 3908120 3500619 3924806 3975294
14469 3975294 3729577 3883819 4104402 3665184 3965395 3812774 3719820 4095958 4211447 4106897
14459 4106897 4353165 4095080 4199570 4071313 4148140 4209924 4500924 4596719 4659225 4596407
14449 4596407 4587814 4735108 4433054 4848068 4732314 4960799 4858165 4834368 5125425 5028152
14439 5028152 5357658 5422697 5492330 5462108 5751994 5555063 5356793 5496732 5523812 5733438
$$ packed form
14509B489537L2231k72059J19826p3839J44134O7911L73263k80736J1100N0297
14499B661665J93407j8157o7243J41108L7665j59559L39494k15298k4284J83099
14489C071897O3959r4816K56963k76894R7918K82465j79151j88956K50307L65636
14479C649328k43682J1886J32279K43712l60035L13M74319m07501M24187N0488
14469C975294k45717J54242K20583m39218L00211j52621r2954L76138J15489j04550
14459D106897K46268k58085J04490j28257P6827O1784K91000R5795O2506o2818
14449D596407q593J47294l02054M15014j15754K28485j02634k3797K91057r7273
14439E028152L29506O5039O9633l0222K89886j96931j98270J39939K7080K09626
$$ plain form
14429 5733438 5840129 5871782 5820341 5974740 6154587 6256095 6338934 6212313 6631072 6507536
14419 6507536 6493811 6657344 6786985 7034295 7013052 7102111 6861545 7200539 7266687 7173161
14409 7173161 7576914 7708574 7697490 7870715 8079221 8329835 8184028 8404916 8457082 8898070
14399 8898070 8521179 8595276 8895261 9032783 9306830 9165702 9502118 9902911 9834167 10071049
14389 10071049 10037760 10090001 10484980 10582573 10711284 11055155 11329408 11056808 11597430 11574345
14379 11574345 11952318 11850578 12144716 12495635 12808453 12456253 13172401 13179609 13418684 13759981
14369 13759981 14062092 14197003 14258911 14802463 15110539 15559473 15591816 15639490 15955364 16531460
14359 16531460 16969515 17530132 17620658 17767724 18186466 18737548 19136823 19647387 19733550 20435099
$$ packed form
14429E733438J06691L1653n1441J54399J79847J01508Q2839j26621M18759j23536
14419F507536j3725J63533J29641K47310k1243Q9059k40566L38994O6148r3526
14409G173161M03753J31660j1084J73225K08506K50614j45807K20888N2166M40988
14399H898070l76891P4097K99985J37522K74047j41128L36416M00793o8744K36882
14389A0071049l3289N2241L94979R7593J28711L43871K74253k72600N40622k3085
14379A1574345L77973j01740K94138L50919L12818l52200P16148P208K39075L41297
14369A3759981L02111J34911O1908N43552L08076M48934L2343M7674L15874N76096
14359A6531460M38055N60617R0526J47066M18742N51082L99275N10564Q6163P01549
$$ plain form
14349 20435099 20793035 21057671 21269248 21727406 22250028 22673563 23475061 24256302 24401656
14340 24401656 24994058 25624757 26151405 27005844 27627104 28317254 28947357 29442590 30246388
14331 30246388 31257029 32257231 32988557 33831302 34666673 35657662 36758983 37603956 38541876
14322 38541876 39758284 40629946 42359834 43482567 44658989 45863255 47111281 48758049
14314 48758049 50521244 52096348 53518964 55232087 57623565 59381158 61835385 63703533
14306 63703533 65645522 67921290 70751901 73383807 76341077 79185817 82111629 85081768
14298 85081768 88669549 92607787 96620583 100640271 104629351 109423503 114330482 119698291
14290 119698291 124892394 130677464 136541065 143409634 150130815 157386306 165592026 173656021
$$ packed form
14349B0435099L57936K64636K11577M58158N22622M23535Q01498P81241J45354
14340B4401656N92402O30699N26648Q54439O21260O90150O30103M95233Q03798
14331C0246388J010641J000202P31326Q42745Q35371R90989J101321Q44973R37920
14322C8541876J216408Q71662J729888J122733J176422J204266J248026J646768
14314D8758049J763195J575104J422616J713123K391478J757593K454227J868148
14306F3703533J941989K275768K830611K631906K957270K844740K925812K970139
14298H5081768L587781L938238M012796M019688L989080M794152M906979N367809
14290A19698291N194103N785070N863601O868569O721181P255491Q205720Q063995
$$ plain form
14282 173656021 182277173 191806635 201920734 212269359 223106042 235143420 247664094
14275 247664094 260366231 273959952 288528301 303301341 318879799 334887579 351251610
14268 351251610 367961898 384717849 399995482 413195666 424124813 433663332 441966502
14261 441966502 449376625 455497293 459069180 461440203 462946373 463744014 463425220 455423955
14253 455423955 446349724 438069757 426881068 415843813 402594629 388271451 376212208
14246 376212208 362957615 348686406 335396817 322367068 309702321 296938845 284709919
14239 284709919 272724854 261522774 250495788 239874943 229201917 219390863 209533070
14232 209533070 199539790 190255708 181014491 173106356 165023003 157412367 150350090 143674563
$$ packed form
14282A73656021Q621152R529462J0114099J0348625J0836683J2037378J2520674
14275B47664094J2702137J3593721J4568349J4773040J5578458J6007780J6364031
14268C51251610J6710288J6755951J5277633J3200184J0929147R538519Q303170
14261D41966502P410123O120668L571887K371023J506170P97641l18794q001265
14253D55423955r074231q279967j1188689j1037255j3249184j4323178j2059243
14246C76212208j3254593j4271209j3289589j3029749j2664747j2763476j2228926
14239B84709919j1985065j1202080j1026986j0620845j0673026r811054r857793
14232B09533070r993280r284082r241217p908135q083353p610636p062277o675527
$$ plain form
14224 143674563 137936654 132151696 126887821 121531390 116246654 111489931 107275927 103386389
14216 103386389 99582104 95500211 91662603 88212493 84933704 81605484 78684944 75649158
14208 75649158 73413295 70459391 68142972 65872047 63760719 61734785 59430451 57509955
14200 57509955 55530244 54164612 52282204 50624607 49081534 47732385 46153804 44714830
14192 44714830 43938650 42542436 41271756 40207175 38728204 37512131 37027179 36195715
14184 36195715 34937568 33879838 32858134 31881361 31597948 30804340 29566970 28893391 28314042
14175 28314042 27273659 26895870 26190628 25510071 24967077 24720065 23508934 23525996 22795451
14166 22795451 22413997 21820535 21115117 20993269 20211075 20146751 19495401 19428603 19010111 18628239
$$ packed form
14224A43674563n737909n784958n263875n356431n284736m756723m214004l889538
14216A03386389l804285m081893l837608l450110l278789l328220k920540l035786
14208G5649158k235863k953904k316419k270925k111328k025934k304334j920496
14200E7509955j979711j365632j882408j657597j543073j349149j578581j438974
14192D4714830p76180j396214j270680j064581j478971j216073m84952q31464
14184C6195715j258147j057730j021704r76773k83413p93608j237370o73579n79349
14175B8314042j040383l77789p05242o80557n42994k47012j211131J7062p30545
14166B2795451l81454n93462p05418j21848p82194o4324o51350o6798m18492l81872
$$ plain form
14156 18628239 18262416 17616731 17078508 17148702 16819355 16347927 16086688 15763646 15579763
14147 15579763 15424148 15081397 14365306 14627436 14603198 13908156 13739943 13491786 13175741
14138 13175741 13150447 13108630 12353221 12412228 12106205 11997638 11509663 11476409 11439952 11027739
14128 11027739 10841302 10897695 10671798 10599908 10288357 10105962 9908013 9968048 9410918 9476934
14118 9476934 9392943 9506291 9303121 9291649 9094261 8899194 8536744 8714159 8419280 8346606
14108 8346606 8151808 8174337 8011303 7909862 7897020 7776327 7518419 7369426 7763265 7365347
14098 7365347 7131176 7102486 7288804 6964251 6879154 6740052 6431223 6451357 6436535 6345153
14088 6345153 6332387 6091976 6086868 6174892 6166234 6035514 6001343 6058258 5669436 5861438 5466723
$$ packed form
14156A8628239l65823o45685n38223P0194l29347m71428k61239l23042j83883
14147A5579763j55615l42751p16091K62130k4238o95042j68213k48157l16045
14138A3175741k5294m1817p55409N9007l06023j08567m87975l3254l6457m12213
14128A1027739j86437N6393k25897p1890l11551j82395j97949O0035n57130O6016
14118I476934q3991J13348k03170j1472j97388j95067l62450J77415k94879p2674
14108H346606j94798K2529j63034j01441j2842j20693k57908j48993L93839l97918
14098G365347k34171k8690J86318l24553q5097j39102l08829K0134j4822r1382
14088F345153j2766k40411n108Q8024q658j30720l4171N6915l88822J92002l94715
$$ plain form
14077 5466723 5655870 5697304 5627810 5363923 5299903 5017595 5139419 5442941 5245653 5080496
14067 5080496 5129786 4755613 4809037 4994597 4930741 4731337 4553196 4820413 4339405 4800328
14057 4800328 4631701 4846466 4497925 4083231 4345815 4176344 4258392 4189572 4332941 4054346
14047 4054346 4155812 4209114 4155036 4234764 3960350 3982985 4011981 3729012 3889319 3854302
14037 3854302 3628255 3717876 3223360 3522813 3773089 3555253 3725335 3183618 3101538 3333918
14027 3333918 3386637 3156883 3373842 3299012 3196968 3216820 3390020 3254830 3296374 3136929
14017 3136929 3052425 3020507 3082023 3102512 3060772 3022428 2825277 3126110 2738684 3062235
14007 3062235 2837413 2605156 2870789 2688604 2882399 2900331 2740862 2911511 2559087 2481699
$$ packed form
14077E466723J89147M1434o9494k63887o4020k82308J21824L03522j97288j65157
14067E080496M9290l74173N3424J85560o3856j99404j78141K67217m81008M60923
14057D800328j68627K14765l48541m14694K62584j69471Q2048o8820J43369k78595
14047D054346J01466N3302n4078P9728k74414K2635K8996k82969J60307l5017
14037C854302k26047Q9621m94516K99453K50276k17836J70082n41717q2080K32380
14027C333918N2719k29754K16959p4830j02044J9852J73200j35190M1544j59445
14017C136929q4504l1918O1516K0489m1740l8344j97151L00833l87426L23551
14007C062235k24822k32257K65633j82185J93795J7932j59469J70649l52424p7388
$$ plain form
13997 2481699 2554412 2632995 2360649 2587888 2491539 2502013 2480752 2696871 2289798 2249144
13987 2249144 2317331 2320982 2480580 2387254 2255878 2450140 2404285 2262192 2741626 2814307
13977 2814307 3322601 3778378 4676587 6242129 9858166 16036327 28724122 30949439
13969 30949439 20102432 13284298 9551744 7468688 5939943 4996294 4655549 4248790
13961 4248790 4158025 3761928 3298608 2977485 3069059 2924981 3034926 2824550 2761562 2378327
13951 2378327 2576977 2598736 2610193 2239896 2591775 2253914 2441366 2200636 2392660 1984869
13941 1984869 2120015 1900593 2148765 2287763 1873047 2000371 1668095 2007095 1926054 2118985
13931 2118985 1951156 2079030 1991638 1809616 2184777 1833204 1747740 1734556 1713935 1776040
$$ packed form
13997B481699P2713P8583k72346K27239r6349J0474k1261K16119m07073m0654
13987B249144O8187L651J59598r3326j31376J94262m5855j42093M79434P2681
13977B814307N08294M55777Q98209J565542L616037O178161J2687795K225317
13969C0949439j0847007o818134l732554k083056j528745r43649l40745m06759
13961D248790r0765l96097m63320l21123R1574j44078J09945k10376o2988l83235
13951B378327J98650K1759J1457l70297L51879l37861J87452k40730J92024m07791
13941A984869J35146k19422K48172J38998m14716J27324l32276L39000q1041J92931
13931B118985j67829J27874q7392j82022L75161l51573q5464j3184k0621O2105
$$ plain form
13921 1776040 1936760 1765957 1889134 1936063 1547605 1603018 1575384 1731716 1893011 1132737
13911 1132737 1739087 1739176 1521986 1952003 1647653 1829088 1409925 1523898 1564105 1517344
13901 1517344 1466790 1456790 1303665 1531323 1006258 1263933 1209650 1336534 1138547 1873243
13891 1873243 1581655 1680162 1516039 1424252 1170934 1334082 1518796 1170235 1269868 1150834
13881 1150834 1451067 1269967 1278224 1283630 1298399 1313670 1373893 1535528 1310895 1190074 1243672
13870 1243672 1388395 1351757 1099543 1261112 1211263 1182332 1110101 1341724 1176112 1061741
13860 1061741 1142019 1128955 835181 1200442 986736 1263299 1336919 984910 925605 1139597
13850 1139597 850112 1462013 1138004 1313097 1347213 1057358 1179632 1141767 1163595 835975
$$ packed form
13921A776040J60720j70803J23177M6929l88458N5413k7634J56332J61295p60274
13911A132737O06350Q9k17190M30017l04350J81435m19163J13973M0207m6761
13901A517344n0554j0000j53125K27658n25065K57675n4283J26884j97987P34696
13891A873243k91588R8507j64123r1787k53318J63148J84714l48561R9633j19034
13881A150834L00233j81100Q257N406J4769J5271O0223J61635k24633j20821N3598
13870A243672J44723l6638k52214J61569m9849k8931p2231K31623j65612j14371
13860A061741Q0278j3064k93774L65261k13706K76563P3620l52009n9305K13992
13850A139597k89485O11901l24009J75093L4116k89855J22274l7865K1828l27620
$$ plain form
13840 835975 1106081 891795 1128181 1130422 1028830 1242636 996512 966638 865776 1216591
13830 1216591 938429 1196867 1222513 789305 1225271 981613 1096248 895802 1216680 522603
13819 834924 813248 857571 1115977 996239 841923 1062858 1055159 753880 956877 1157248
13809 1157248 839444 753042 769217 1048739 919565 978660 697289 627671 764904 1049738
13799 1049738 957889 830817 779107 915397 777828 815430 760362 913290 978176 733339
13789 733339 872704 684533 986202 742440 756552 661054 470782 1044449 464752 722530
13779 722530 950695 859970 1086451 691187 803468 582262 940782 825723 754633 671152
13769 671152 826024 698690 798754 848078 725629 550472 869250 406880 631711 640382
$$ packed form
13840H35975K70106k14286K36386K241j01592K13806k46124k9874j00862L50815
13830A216591k78162K58438K5646m33208M35966k43658J14635k00446L20878E22603
13819H34924k1676M4323K58406j19738j54316K20935p699l01279K02997K00371
13809A157248l17804q6402J6175K79522j29174N9095k81371o9618J37233K84834
13799A049738r1849j27072n1710J36290j37569L7602n5068J52928O4886k44837
13789G33339J39365j88171L01669k43762J4112r5498j90272N73667D64752K57778
13779G22530K28165r0725K26481l95264J12281k21206L58520j15059p1090q3481
13769F71152J54872j27334J00064M9324j22449j75157L18778D06880K24831Q671
$$ plain form
13759 640382 818659 988023 834327 609971 556570 586316 907210 932875 709538 830940
13749 830940 788284 475880 1037940 794292 694739 574974 613364 928615 523974 548674
13739 548674 756312 681627 773382 528054 922314 797792 840331 817901 702265 894188
13729 894188 302646 531579 372862 829179 455019 464068 854849 516608 730622 830051
13719 830051 495001 713816 931313 748398 721116 555255 788055 410607 712356 804187
13709 804187 549232 351891 507998 620906 638973 542996 405127 499476 575765 725377
13699 725377 791595 393784 473537 605755 341248 597708 596379 690485 545665 540324 576381
13688 576381 852190 522143 513846 320961 637190 869142 299074 747348 505528 730427
$$ packed form
13759F40382J78277J69364j53696k24356n3401K9746L20894K5665k23337J21402
13749H30940m2656l12404N62060k43648r9553j19765L8390L15251m04641K4700
13739E48674K07638p4685R1755k45328L94260j24522M2539k2430j15636J91923
13729H94188C02646K28933j58717M56317l74160R049L90781l38241K14014R9429
13719H30051l35050K18815K17497j82915k7282j65861K32800l77448L01749R1831
13709H04187k54955j97341J56107J12908J8067r5977j37869R4349P6289J49612
13699G25377O6218C93784P9753J32218k64507K56460j329R4106j44820n341L6057
13688E76381K75809l30047q297j92885L16229K31952B99074M48274k41820K24899
$$ plain form
13678 730427 749495 572581 300076 880709 226750 720690 568389 573666 436376 673803
13668 673803 512075 484439 362212 432176 500347 761099 677669 644724 495815 814970
13658 814970 474337 449647 455701 465381 220744 348226 273132 698618 171232 241605 908130
13647 908130 300678 136549 558456 233822 477544 714510 693538 201242 439658 317026
13637 317026 578738 495582 491141 300197 120045 358187 343254 502265 415458 427592 368039
13626 368039 331494 507968 322750 273429 528442 453206 329864 320249 187864 486522
13616 486522 725398 39746 504184 371449 303276 308305 301583 225905 403765 355979 408210
13605 408210 200241 261661 37496 516909 497799 414758 418070 149014 36112 481981 119271
$$ packed form
13678G30427J9068j76914k72505N80633B26750M93940j52301N277j37290K37427
13668F73803j61728k7636j22227O9964O8171K60752q3430l2945j48909L19155
13658H14970l40633k4690O054R680B20744J27482p5094M25486A71232P0373O66525
13647I08130C00678A36549M21907B33822K43722K36966k0972B01242K38416j22632
13637C17026K61712q3156m441j90944A20045K38142j4933J59011q6807J2134n9553
13626C68039l6545J76474j85218m9321K55013p5236j23342r615j32385K98658
13616D86522K38876C9746M64438j32735o8173N029o722p5678J77860m7786N2231
13605D08210B00241O1420C7496M79413j9110q3041L312A49014C6112M45869A19271
$$ plain form
13593 346363 449216 367927 315001 169453 88705 100157 387474 484844 532633 719081 628914
13582 628914 466175 410190 263784 630578 524004 585926 34248 256429 563417 281091
13571 450299 316390 845004 435403 168378 404824 232522 37149 38152 556142 339997
13561 339997 536910 467306 22051 387237 269992 315847 294772 518484 403911 257710
13551 257710 397788 273850 405262 434659 127028 422776 408102 560637 344914 121047
13540 522136 231341 227284 625491 427812 216735 160176 260135 85156 719667 408049
13530 408049 643757 59322 135743 306003 159256 154671 145067 487124 201856 272859 375674
13519 375674 276710 234612 338908 119557 321474 137882 -141581 260563 356263 453043
$$ packed form
13593C46363J02853q1289n2926j45548q0748J1452K87317R7370M7789J86448r0167
13582F28914j62739n5985j46406L66794j06574O1922C4248K22181L06988B81091
13571D50299j33909N28614m09601A68378K36446j72302C7149J003N17990k16145
13561C39997J96913o9604B2051L65186j17245M5855k1075K23712j14573j46201
13551B57710J40078j23938J31412K9397A27028K95748j4674J52535k15723A21047
13540E22136B31341m057L98207j97679k11077n6559R9959H5156O34511l11618
13530D08049K35708E9322P6421J70260j46747m585r604L42057B01856P1003J02815
13519C75674r8964m2098J04296A19557K01917A37882a41581B60563R5700R6780
$$ plain form
13509 453043 68939 397789 470166 217138 -8866 315048 152001 349027 152770 103207
13499 103207 236200 366335 460222 309116 458430 85917 294456 26427 36147 5603 149916
13488 149916 48617 2966 511776 243033 -199363 308448 166595 -224340 243176 286542
13478 286542 272366 51712 410410 136609 365934 247253 269039 -6497 312719 215910 484584
13467 484584 126369 52166 -61391 250854 124222 234034 26102 25777 282648 163757 412657
13456 412657 -99406 506078 329832 319036 552845 343066 189300 412897 -222124 -43743
13445 -1658 61990 270118 145357 47164 370510 279203 128955 147048 178531 455659 165273
13433 231390 221380 305650 1238 92463 -21280 301155 103715 217952 286125 58812 484967
$$ packed form
13509D53043F8939L28850P2377B17138h866C15048A52001J97026A52770m9563
13499A03207J32993J30135R3887j51106J49314H5917K08539B6427R720E603J44313
13488A49916D8617B966N08810B43033a99363C08448j41853b24340B43176M3366
13478B86542j4176E1712L58698A36609K29325j18681K1786f497C12719r6809K68674
13467D84584A26369E2166f1391B50854A24222J09812B6102l25K56871j18891K48900
13456D12657i9406E06078j76246j0796K33809k09779j53766K23597b22124d3743
13445a658F1990K08128j24761D7164L23346r1307A28955J8093L1483K77128A65273
13433B31390j0010Q4270A238R1225b1280C01155A03715J14237O8173E8812M26155
$$ plain form
13422 484967 -229730 108588 363433 47419 16045 187077 -221215 330003 117572 202683
13412 202683 293899 554697 71696 337469 249828 689270 472629 56118 405164 650611
13402 650611 -30759 231376 325370 -10142 -73103 -117690 80230 265085 348907 178302 -157699
13390 446939 59776 395816 167384 398138 199973 109810 245599 257578 184007 299181
13380 299181 328773 115496 427944 203088 133848 -96421 380249 301880 170150 -222087
13369 89774 350839 235036 -76978 337265 531625 194594 329928 522813 437533 204350
13358 593420 249494 246631 219477 321590 74757 122609 190533 301579 250401 271345 -86269
13346 124512 193328 280200 510670 405028 363024 200753 168039 241716 212054 356419 269064
$$ packed form
13422D84967b29730A08588K54845D7419A6045J71032b21215C30003A17572Q5111
13412B02683R1216K60798G1696K65773q7641M39442k16641E6118L49046K45447
13402F50611c0759B31376R3994a0142o2961m4587H0230J84855Q3822j70605a57699
13390D46939E9776L36040A67384K30754j98165r0163J35789J1979p3571J15174
13380B99181K9592A15496L12448B03088o9240i6421C80249p8369j31730b22087
13369H9774K61065j15803g6978C37265J94360A94594J35334J92885q5280B04350
13358E93420B49494k863k7154J02113G4757M7852O7924J11046n1178K0944h6269
13346A24512O8816Q6872K30470j05642m2004j62271l2714P3677k9662J44365q7355
$$ plain form
13335 269064 -102905 96549 407646 341407 167195 124137 257456 414978 276616 255711
13325 255711 417840 48657 561901 457457 456820 242105 333605 -55862 502640 444715 271489
13314 271489 150266 166264 226085 487083 123832 436881 193178 390012 357529 140847
13303 30103 182358 427495 118583 327292 -24837 291586 180885 9481 545228 239439
13292 205366 186237 125042 343835 100798 264340 289363 238325 36441 -212195 173786
13281 35566 242438 214344 350220 409655 224283 112575 430652 232350 -14891 168325
13270 -139885 77569 144609 107646 -253071 60810 65977 66223 -82220 176198 2111 170556 -226372
13257 314722 31064 -17857 -86357 201061 -107929 275100 90982 319090 80858 -15404 115383
$$ packed form
13335B69064a02905I6549L11097o6239A67195m3058J33319J57522j38362k0905
13325B55711J62129D8657N13244j04444o37k14715R1500e5862E02640n7925j73226
13314B71489j21223J5998N9821K60998A23832L13049A93178J96834l2483A40847
13303C0103J52255K45137A18583K08709b4837B91586j10701I481N35747B39439
13292B05366j9129o1195K18793A00798J63542K5023n1038C6441b12195A73786
13281C5566K06872k8094J35876N9435j85372j11708L18077j98302a4891A68325
13270a39885G7569O7040l6963b53071F0810N167K46h2220A76198B111J68445b26372
13257C14722C1064a7857o8500B01061a07929B75100I0982K28108H0858a5404A15383
$$ plain form
13245 204470 214345 132813 35548 -172907 95799 67956 290004 -21876 155484 -140221 234589
13233 203575 -61829 115346 -107660 324305 242341 -73772 110274 -10226 127364 176087
13223 176087 57474 148945 -108203 -227678 403606 208405 263754 278116 77741 36015 104007
13212 104007 182968 27263 69182 278341 209422 29087 -5787 233885 362771 292267 62943
13200 113240 199465 4836 162739 -6671 99704 -43446 464523 270164 120778 -31733 11323
13188 292828 86541 325986 -197886 303775 247712 -79693 355989 102548 112119 80585 225592
13177 225592 103730 91040 -136166 -181094 185164 430479 168897 172543 211480 304367 145016
13165 207791 216361 -37942 -250343 -191912 358185 -286488 -157368 498495 246114 -3992 4115
$$ packed form
13245B04470R875q1532C5548a72907I5799k7843K22048b1876A55484a40221B34589
13233B03575f1829A15346a07660C24305q1964g3772A10274a0226A27364M8723
13223A76087E7474R1471a08203j19475D03606j95201N5349J4362G7741C6015O7992
13212A04007P8961B7263M1919K09159o8919B9087e787B33885J28886p0504F2943
13200A13240Q6225D836J57903f671I9704d3446D64523j94359A20778c1733A1323
13188B92828H6541K39445a97886C03775n6063g9693C55989A02548R571l1534J45007
13177B25592A03730j2690a36166m4928A85164K45315A68897L646L8937R2887A45016
13165B07791Q570c7942k12401N8431C58185b86488J29120D98495B46114c992D115
$$ plain form
13153 52655 -32773 -260903 38101 245080 433982 273118 110850 485081 -66971 96978
13142 302813 167398 -211583 12030 -145402 150676 341019 165909 -143305 219830 400864
13132 400864 166616 24895 -92309 -42335 104411 21489 -84388 86950 212529 -21030 6561
13120 100495 28623 163329 -228615 6959 91830 -254992 41157 14570 341039 -258957 59752
13108 -48155 163451 63502 -135629 -180821 276744 321008 128250 430665 95765 -106200
13097 -59536 -29913 -264258 -59724 147890 1090 -173764 14831 -215812 287789 -30313 115630
13085 -18725 -16085 198601 146114 161568 157906 216267 -30988 103390 -81183 36139 -8654 226229
13072 -284079 21834 -136600 159100 -46189 -85152 187728 269899 -213380 128490 -69301
$$ packed form
13153E2655c2773k28130C8101K06979J88902j60864A10850L74231f6971I6978
13142C02813j35415b11583A2030a45402A50676J90343A65909a43305B19830J81034
13132D00864A66616B4895i2309d2335A04411B1489h4388H6950J25579b1030F561
13120A00495B8623J34706b28615F959Q4871b54992D1157A4570L26469b58957E9752
13108d8155A63451F3502a35629m5192B76744M4264A28250L02415I5765a06200
13097e9536K9623k34345e9724A47890A090a73764A4831b15812B87789c0313A15630
13085a8725K640A98601n2487J5454l662N8361c0988A03390h1183C6139h654B26229
13072b84079B1834a36600A59100d6189l8963A87728Q2171b13380A28490f9301
$$ plain form
13061 243513 90992 135912 -182024 24313 -172304 166434 8049 106297 236597 1290 387338
13050 387338 -17278 270987 -11472 356934 25626 -22352 363302 38172 -178441 16375 -242822
13038 -91398 -64282 369044 -72256 228199 -136253 191858 483593 80918 348940 -8059 25174
13026 481788 312695 44664 285720 47833 123128 -224708 209035 -3084 223278 57719 -96862
13014 -203249 353421 28988 218782 2846 -60598 8971 -58766 66510 89452 502787 179107
13002 186866 -95437 221246 184589 278475 105134 97323 423671 57342 -43922 120581 128587
12991 128587 142043 348035 180631 262366 -257312 152784 220635 64506 -10729 -54617 -5610
12979 339507 -3358 -8743 35001 -254113 -188394 192426 -120931 243865 387789 257490 104459
$$ packed form
13061B43513I0992M4920a82024B4313a72304A66434H049R8248J30300A290L86048
13050C87338a7278B70987a1472C56934B5626b2352C63302C8172a78441A6375b42822
13038i1398K7116C69044g2256B28199a36253A91858K91735H0918K68022h059B5174
13026D81788j69093D4664K41056D7833P5295b24708B09035c084B23278E7719i6862
13014b03249C53421B8988J89794B846f0598H971e8766F6510K2942M13335A79107
13002A86866i5437B21246l6657R3886A05134p811L26348E7342d3922A20581Q006
12991A28587J3456K05992j67404Q1735b57312A52784O7851F4506a0729m3888e610
12979C39507c358n385C5001b54113O5719A92426a20931B43865J43924j30299A04459
$$ plain form
12967 175483 -29603 147865 97847 105029 269164 153754 206152 308237 -371009 -424578 -275567
12956 -275567 -148054 177129 32241 27445 371394 -394964 259333 1246 379430 490947
12946 490947 -145771 226816 -4635 76352 89862 -118771 27915 164866 32678 149473 -149335
12934 349745 -12025 333424 -177281 20218 72243 240187 -20922 177545 180539 40813 141580
12923 141580 1692 -131780 25155 169400 139934 -40338 243315 244059 -12947 19804 -295319
12911 41334 291364 264127 93314 120016 -24268 59866 193775 -267263 198148 -9862 225698
12899 183686 39665 94927 30884 2362 190167 26846 -43193 166392 96795 329328 -90367
12887 170773 125983 148868 149612 118734 124087 -57978 23818 212633 57798 73192 -143459 61801
$$ packed form
12967A75483b9603A47865n0018P182J64135j15410N2398J02085c71009n3569J49011
12956b75567J27513A77129C2241m796L43949c94964B59333A246L78184J11517
12946D90947a45771B26816d635G6352J3510a18771B7915J36951C2678J16795a49335
12934C49745a2025C33424a77281B0218N2025J67944b0922A77545K994D0813J00767
12923A41580A692a31780B5155J44245k9466d0338B43315P44a2947A9804b95319
12911D1334K50030k7237I3314K6702b4268E9866J33909b67263A98148i862B25698
12899A83686C9665N5262C0884B362J87805B6846d3193A66392o9597K32533i0367
12887A70773m4790K2885P44l0878N353e7978B3818J88815E7798J5394a43459F1801
$$ plain form
12874 -39156 -7734 159849 -94948 350240 287371 293652 -348238 27565 -300410 -382131 -196609
12863 -196609 -131251 -3801 382192 -96165 -13485 116086 351683 -82907 -164859 137357 57405
12851 177876 126526 -49116 -11379 63690 210550 13180 -132446 -62272 -214970 4498 348916
12840 348916 152674 43937 -86481 -63522 -108030 -50524 8225 90480 21219 190932 100071
12829 100071 216327 -12000 -209418 -437639 155585 -16557 81664 -292593 315382 114635
12818 -132209 -139292 -104717 -5739 -215354 -406797 80548 -66314 178580 -279404 174802 -62301
12806 -144740 198049 -87854 -92059 -142338 -101722 -295962 -18086 -283160 -127074 -108441 -345950
12795 -345950 -328679 144488 141129 -135153 -15875 82606 -145365 28747 -85325 -268304 258475
$$ packed form
12874c9156g734A59849i4948C50240o2869O281c48238B7565c00410q1721J85522
12863a96609O5358c801C82192i6165a3485A16086K35597h2907q1952A37357E7405
12851A77876n1350d9116a1379F3690J46860A3180a32446f2272j52698D498L44418
12840C48916A52674D3937h6481K2959m4508e0524H225Q2255B1219J69713r0861
12829A00071J16256a2000j97418k28221A55585a6557H1664b92593C15382A14635
12818a32209p083L4575e739k09615j91443H0548f6314A78580b79404A74802f2301
12806a44740A98049h7854m205n0279M0616j94240a8086k65074a27074J8633k37509
12795c45950J7271A44488l359a35153a5875H2606a45365B8747h5325j82979B58475
$$ plain form
12783 297060 267892 -92183 224869 86701 203608 -134009 -111615 -26528 -110950 190896 173840
12772 173840 366444 -232393 -178230 14441 61484 -34849 3705 282290 -78651 161039 106743
12761 106743 67611 433187 53429 -65672 267218 79775 -69404 -48003 -3599 -21651 -183503
12750 -183503 -316884 -87971 -153925 -181381 -32145 -139946 61527 -103836 156398 352251
12740 352251 178902 203063 163984 99406 -206604 106568 61847 323069 28076 -4572 293654
12728 -55568 417080 88731 -203490 -148174 157283 122020 195086 63983 -52594 140016 237788
12717 237788 21820 364593 139096 356327 138849 -180006 -101548 89376 45605 2317 246776
12706 246776 76787 56370 257260 11360 63960 -96565 221895 -163948 -30211 -24089 -17286
$$ packed form
12783B97060k9168i2183B24869H6701J16907a34009K2394b6528q4422A90896j7056
12772A73840J92604b32393N4163A4441M7043c4849C705K78585g8651A61039n4296
12761A06743l9132L65576E3429f5672B67218G9775f9404K1401c599j8052j61852
12750a83503j33381h7971o5954k7456c2145j07801F1527a03836A56398J95853
12740C52251j73349K4161l9079o4578b06604A06568m4721K61222B8076d572B93654
12728e5568D17080H8731b03490N5316A57283l5263P3066F3983e2594A40016R7772
12717B37788B1820L42773A39096K17231A38849a80006P8458H9376m3771B317K44459
12706B46776G6787k0417K00890A1360N2600i6565B21895a63948c0211O122O803
$$ plain form
12695 -17286 57570 312532 362768 232107 194518 236601 130960 343733 -21853 -137289 264249
12683 -11342 494301 1655 353478 -36399 32460 97876 108674 259251 127510 -7961 -15886
12672 -15886 2034 -30152 199418 460279 437414 -25044 -121380 122135 300989 52274 220447
12661 220447 86273 191604 -17375 113917 -39435 106786 134738 -20509 206524 -23844 19222
12649 -122171 262382 -17318 -70866 65689 158045 -58975 1805 -160851 329508 -80149 373412
12637 162359 120333 -12930 52376 100526 -162032 47472 69975 -206948 340323 134714 124793
12626 124793 -111837 -108805 -224626 251020 23576 21909 -58205 -13262 335489 238488 28666
12614 96414 263845 436120 70023 18986 373134 142899 223128 204377 288951 203212 -11838
$$ packed form
12695a7286E7570K54962N0236j30661l7589M2083j05641K12773b1853j15436B64249
12683a1342D94301A655L51823c6399C2460O5416J0798J50577A27510g961p925
12672a5886B034c0152A99418K60861k2865b5044r6336A22135J78854E2274J68173
12661B20447H6273J05331a7375A13917c9435A06786K7952b0509B06524b3844A9222
12649a22171B62382a7318n3548F5689R2356e8975A805a60851C29508h0149C73412
12637A62359m2026a2930E2376M8150a62032D7472K2503b06948C40323A34714r921
12626A24793a11837L032j15821B51020B3576j667e8205a3262C35489r7001B8666
12614I6414J67431J72275G0023A8986L54148A42899Q0229j8751Q4574q5739a1838
$$ plain form
12602 421389 179252 198974 -73438 -117372 296217 38856 -67884 -23908 172056 59883 -178019
12590 61511 226011 -52160 101381 198098 51915 -190541 357304 112270 196654 38382 99244
12579 99244 -78452 142191 232396 -76885 79388 159032 73706 334081 -84295 127041 157904
12568 157904 188311 123282 -254421 205051 -17067 85778 268145 -112858 -164775 192080
12557 362066 -70118 139553 -17544 -87865 -144419 3584 -68814 326716 334762 1068 85367 20592
12544 46731 -121854 144165 140468 -28091 11784 -282296 286555 -152498 -77140 49425 -152814
12532 179959 -109916 91546 124047 -64625 -80661 -53502 27701 1432 10598 -99210 395203
12520 69290 97670 96962 -81924 -12634 -170047 157893 -118288 -223730 -148823 -19976 107735
$$ packed form
12602D21389A79252J9722g3438m3934B96217C8856f7884b3908A72056E9883a78019
12590F1511J64500e2160A01381R6717E1915a90541C57304A12270Q4384C8382O0862
12579I9244g8452A42191R0205g6885G9388P9644G3706K60375h4295A27041L0863
12568A57904L0407o5029b54421B05051a7067H5778J82367a12858n1917A92080
12557C62066g0118A39553a7544p0321n6554C584f8814C26716Q046A068Q4299B0592
12544D6731a21854A44165l697b8091A1784b82296B86555a52498P5358D9425a52814
12532A79959a09916I1546L2501f4625j6036K7159B7701A432R166i9210C95203
12520F9290K8380p08h1924a2634j57413A57893a18288j05442P4907a9976A07735
$$ plain form
12508 62087 165838 -285434 -62597 189194 74363 268683 -98523 22727 -50311 131485 79138
12497 79138 -64388 -447262 197796 45738 187804 30083 -96008 76185 -154853 -85627 15543
12485 -75715 313692 21295 -184844 30935 -129885 -190142 77054 -135043 164274 46633 -99021
12473 -150177 392410 121088 129421 112252 -75235 -170208 -156251 -161916 -183401 60594 138464
12462 138464 41983 79542 79263 -165049 -37818 -23209 196681 21288 131538 -322497 284190
12450 236762 59869 108268 121639 44783 473 -101014 63920 138465 -285915 -200530 -310532
12439 -310532 36658 -70647 93504 29304 -60551 -49640 15937 211131 323294 94112 22262
12427 22462 407897 -102488 -56685 102760 2923 -276081 -189876 -56150 23444 153231 -375369
$$ packed form
12508F2087J03751b85434f2597A89194G4363J94320i8523B2727e0311A31485n2347
12497G9138f4388l82874A97796D5738J42066C0083i6008G6185a54853O9226A5543
12485g5715C13692B1295a84844C0935a29885o0257G7054a35043A64274D6633i9021
12473a50177C92410A21088Q333j7169g5235r4973J3957n665k1485F0594P7870
12462A38464D1983L7559k79a65049c7818J4609A96681B1288J10250c22497B84190
12450B36762E9869M8399J3371D4783D73a01014F3920P4545b85915Q5385j10002
12439c10532C6658g0647I3504B9304f0551J0911A5937J95194J12163I4112B2262
12427B2462L85435a02488M5803A02760B923b76081Q6205e6150B3444J29787c75369
$$ plain form
12415 625 -273532 -65293 -102603 207969 -66875 68351 -85160 -108056 82476 -73556 114768
12403 -58437 -64441 24640 74777 69281 -155574 -69382 22155 190941 -43248 212067 57602
12391 -187691 -104083 -319401 -75088 265507 25689 -178677 24447 -90021 98155 -376522 137405
12379 -75069 21936 -25898 186755 -156030 33764 40934 -36410 9963 149037 78556 -78938
12367 -321293 4833 344494 -174685 237143 -117855 46113 -130453 166706 93933 308512
12357 308512 237744 -65938 52909 25152 -58625 43614 201285 48917 -74689 -18902 -48181
12346 -48181 -19417 176098 162107 -61627 29044 78691 245111 128766 -85828 30234 11532
12334 -209662 333448 164534 20547 -122982 234503 -311507 157313 21723 98723 -212916
$$ packed form
12415F25b73532f5293l7310B07969f6875F8351h5160k2896H2476g3556A14768
12403e8437o004B4640N0137n496a55574f9382B2155J68786d3248B12067E7602
12391a87691Q3608k15318g5088B65507B5689a78677B4447i0021I8155c76522A37405
12379g5069B1936b5898A86755a56030C3764P170c6410I963J39074p0481g8938
12367c21293D833L39661a74685B37143a17855D6113a30453A66706p2773K14579
12357C08512p0768f5938E2909B5152e8625D3614J57671D8917g4689a8902k9279
12346d8181a9417A76098j3991f1627B9044M9647J66420j16345h5828C0234A1532
12334b09662C33448A64534B0547a22982B34503c11507A57313B1723P7000b12916
$$ plain form
12323 77547 24111 74237 -82742 80034 122115 177759 -3447 -335770 9021 -505 96111 -6290
12310 282125 299498 181578 14384 -100153 -52179 -124975 -32301 161137 -284943 -260287 -141421
12299 -141421 249996 -29562 -47124 -160104 -29690 398635 88996 104290 71000 -14677 -64377
12288 -64377 346973 512580 -4866 224365 144516 57847 278741 -130643 -2740 50713 -153980
12276 213827 179608 233926 -117542 125088 -158801 45479 17335 224344 -161096 108542
12265 478066 -189414 -93677 -46445 364313 -31243 83545 332518 352447 -212625 238 52538
12254 52538 252078 124391 22713 83656 -22378 -266154 210853 181429 72337 -31866 102314
12242 -146332 -8100 322532 173399 -131928 21659 43471 -107212 80044 -10879 56730 71302
$$ packed form
12323G7547B4111N0126h2742H0034M2081N5644c447l32323I021e05I6111f290
12310B82125J7373j17920A4384a00153M7974p2796c2301A61137b84943K4656J18866
12299a41421B49996b9562j7562j12980b9690C98635H8996J5294l3290a4677m9700
12288f4377C46973J65607d866B24365p9849E7847K20894a30643b740E0713a53980
12276B13827l4219N4318a17542A25088a58801D5479A7335K07009a61096A08542
12265D78066a89414i3677d6445C64313c1243H3545K48973J9929b12625B38N2300
12254E2538J99540A24391B2713O0943b2378k43776B10853k9424G2337c1866A02314
12242a46332h100C22532j49133a31928B1659K1812a07212H0044a0879E6730J4572
$$ plain form
12231 71302 -1664 381257 -85517 -4382 225992 143436 19181 390824 513560 131984 -105892
12219 228480 213548 48860 -275232 553675 523965 150665 257218 344853 65268 389229
12209 389229 422138 354339 302641 211933 136804 388302 202647 95047 -33249 60285 83138
12198 83138 -113008 258586 -151682 200660 117175 71647 60 153064 197978 132778 438823
12187 438823 67326 119043 263335 244166 -79431 235777 100170 -156546 -68338 -34484 -24263
12176 -24263 81272 380636 189821 382918 307672 108495 177642 -121756 -19322 124213
12165 108369 133818 371421 168224 -36780 279768 -352476 296349 165757 -158309 59504
12154 -71288 7024 92738 214635 24351 397718 273439 98513 70399 -82008 480956 275975
$$ packed form
12231G1302a664C81257h5517d382B25992q2556A9181L71643J22736A31984a05892
12219B28480j4932D8860b75232E53675k9710A50665J06553Q7635F5268L23961
12209C89229L2909o7799n1698r0708p5129K51498j85655I5047c3249F0285K2853
12198H3138a13008B58586a51682B00660q3485m5528F0J53004M4914o5200L06045
12187D38823F7326N1717J44292j9169g9431B35777A00170a56546f8338L3854J0221
12176b4263H1272K99364A89821J93097p5246A08495O9147a21756a9322A24213
12165A08369K5449K37603A68224c6780B79768c52476B96349j30592a58309E9504
12154g1288G024Q5714J21897B4351L73367j24279I8513k8114h2008D80956k04981
$$ plain form
12143 275975 352750 -84540 -188254 -23709 333519 248557 26142 205014 57506 -110165 102726
12131 -188221 38539 157198 159084 264602 226299 317328 41797 171878 138001 -186398 150486
12119 -158051 218173 131100 151583 36947 -40804 225685 292652 134648 251043 51367 -52954
12107 23356 -94159 253941 117752 -73181 62805 243979 254641 127924 54083 -70768 -31418
12095 280087 173211 -9095 -15029 -142083 16262 222419 216628 244774 -41150 -35364 67372 -64513
12082 -185279 -70390 70538 -194298 -79784 6752 31120 395959 -165418 45942 107338 -179592
12070 31987 -78924 159288 -180166 436592 332525 356370 1161710 1006623 547519 202490
12059 -17899 248118 67142 110584 172750 84584 121685 95492 147569 37538 217406 -276408
$$ packed form
12143B75975P6775h4540j03714b3709C33519q4962B6142J78872E7506a10165A02726
12131a88221C8539J18659J886J05518l8303R1029D1797J30081l3877a86398A50486
12119a58051B18173q7073K0483C6947d0804B25685O6967A34648J16395E1367e2954
12107B3356i4159B53941A17752g3181F2805J81174J0662j26717E4083g0768c1418
12095B80087j06876i095n934j27054A6262K06157n791K8146d1150N786F7372f4513
12082a85279g0390G0538a94298g9784F752K4368L64839a65418D5942O1396a79592
12070C1987g8924A59288a80166D36592j04067K3845Q05340j55087m59104B02490
12059a7899B48118F7142M3442O2166H4584L7101k6193N2077C7538J79868b76408
$$ plain form
12047 52207 141256 -55731 -239514 -181323 125728 -103480 173259 126109 22340 -142337 55773
12035 -224935 -129167 -176118 72670 140684 -66975 -75854 120862 -37758 142117 248561 319134
12024 319134 -197681 -202836 -110857 -71140 -41152 -1154 76729 -6980 -35461 -132382 -101530 200960
12011 168533 -1965 -185908 -237203 229508 349291 164181 -136974 399138 91624 169401
12001 169401 153494 102091 -145529 109647 156590 13672 -71094 -68162 -246549 -127162 171685
11989 -99182 46002 280084 -180471 24037 -210500 -65847 -18107 125491 -315173 -129579
11978 493147 50166 -98805 -10374 -118975 -29207 36448 169664 -164736 -240123 118725 284187
11967 284187 -196887 -321787 -233606 270607 186829 45886 30081 175717 29419 214396
$$ packed form
12047E2207Q9049e5731j83783N8191A25728a03480A73259m7150B2340a42337E5773
12035b24935R5768m6951G2670O8014f6975q879A20862c7758A42117J06444P0573
12024C19134a97681n155R1979L9717K9988a154G6729f980k8481r6921L0852B00960
12011A68533a965j83943n1295B29508J19783A64181a36974C99138I1624P7777
12001A69401j5907n1403a45529A09647M6943A3672g1094K932j78387J19387A71685
11989i9182D6002K34082a80471B4037b10500f5847a8107A25491c15173a29579
11978D93147E0166i8805a0374j08601b9207C6448J33216a64736p5387A18725J65462
11967B84187a96887j24900Q8181B70607q3778D5886j5805J45636B9419J84977
$$ plain form
11957 214396 -260184 115550 -243808 -259132 -133260 89212 139735 122984 19256 -549549
11946 -268828 -12565 158050 105183 176311 296480 31840 111749 -68245 -75114 -131484 -103187
11935 -103187 -166939 -173130 -56074 -245265 125122 11412 -14676 -282722 225151 89077 249449
11924 249449 265587 77696 175733 -86912 -61608 -171949 -73061 -94620 -50291 -247790 130701
11912 9264 -132824 55821 342177 199983 9510 82044 -314857 61886 -30026 171109 -328941
11900 -97152 -24263 325410 -55400 288725 -32063 172408 451183 -198338 90993 -35873 -84478
11889 -84478 -384571 -13372 -24064 -10339 145484 -389397 200527 23513 36780 59878 -125441
11877 225191 134587 34165 88420 -268359 -6774 11091 -192713 -318403 -60113 -253272 38534
$$ packed form
11957B14396b60184A15550b43808j5324J25872H9212N0523j6751A9256e49549
11946b68828a2565A58050n2867P1128J20169C1840P9909f8245o869n6370K8297
11935a03187o3752o191e6074j89191A25122A1412a4676k68046B25151H9077J60372
11924B49449J6138G7696R8037h6912K5304j10341g3061k1559M4329j97499A30701
11912I264a32824E5821K86356j42194I510P2534c14857F1886c0026A71109c28941
11900i7152b4263C25410e5400B88725c2063A72408K78775a98338I0993c5873m8605
11889h4478l00093a3372j0692a0339A45484c89397B00527B3513J3267K3098a25441
11877B25191r0604C4165N4255b68359f774A1091a92713j25690f0113j93159C8534
$$ plain form
11865 12890 -21095 258627 -176475 -125122 96366 -57905 -176547 57761 169906 -53426 18243
11853 -347715 -314105 94727 257490 -271334 -83167 -58682 -55369 -180666 209363 141396 -219935
11841 -33630 -46108 -67526 -8034 47395 -20825 90008 298907 -26676 -7680 -51244 -105066 -343354
11829 -343354 274142 169086 -97119 33096 -35790 -181846 -45401 -3216 -324125 130977 -192344
11817 -124931 149043 60543 -116582 -69225 -185178 -66961 278736 -268931 25275 42098
11807 42098 165588 -33734 -397488 14286 77972 62606 262812 -231855 -170155 -45906 -533210
11796 -533210 28903 314373 -70151 -73749 95796 123557 244885 169299 -139239 -93125 104550
11784 -11641 44149 38873 -31756 -5627 -128801 -326387 96490 -293794 103460 38691 84904
$$ packed form
11865A2890b1095B58627a76475N1353I6366e7905j18642E7761J12145e3426A8243
11853c47715L3610I4727J62763b71334h3167K4485L313j25297B09363o7967b19935
11841c3630j2478k1418h034D7395b0825I0008K08899b6676g680m3564n3822k38288
11829c43354B74142j05056i7119C3096c5790j46056d5401c216l20909A30977a92344
11817a24931A49043F0543a16582M7357j15953f6961B78736b68931B5275J6823
11807D2098J23490c3734l63754A4286O3686j5366K00206b31855O1700d5906m87304
11796e33210B8903K85470g0151l598I5796K7761J21328p5586a39239M6114A04550
11784a1641D4149n276c1756e627j23174j97586I6490b93794A03460C8691M6213
$$ plain form
11773 84904 276979 172821 -210955 -28959 116644 -276168 203791 -288324 419533 49397
11762 -182713 14788 -142896 -140649 46489 55389 -261868 -184792 -231121 -334575 -338030 -132103
11750 36950 222879 -160955 124154 -28301 -126378 85234 143323 32945 -25076 -135533 68895
11738 241211 -79966 69294 -26646 79439 -22589 90674 149396 -142824 -18785 -1450 -149497
11727 -149497 43927 13280 26447 32063 -274031 -86021 -210034 -70363 -79891 -636 -132013 -225530
11715 -225530 127189 215792 76223 -69221 9298 -74009 -191861 -88007 152119 -45794 -270706
11704 -270706 88079 -74192 262514 -76998 257125 113631 65624 360697 -13843 -33252 27815
11692 -67184 -71885 -55314 -157652 -73910 17199 153316 -193029 59226 271802 35265 -3197
$$ packed form
11773H4904J92075j04158b10955b8959A16644b76168B03791b88324D19533D9397
11762a82713A4788a42896K247D6489Q900b61868P7076m6329j03454l455a32103
11750C6950J85929a60955A24154b8301r8077H5234N8089C2945b5076j10457F8895
11738B41211g9966F9294b6646G9439b2589I0674N8722a42824a8785a450j48047
11727a49497D3927A3280J3167N616b74031h6021j24013g0363r528f36j31377r3517
11715b25530A27189Q8603G6223f9221I298g4009j17852h8007A52119d5794k24912
11704b70706H8079g4192B62514g6998B57125A13631m8007K95073a3843j9409B7815
11692f7184m701J6571j02338g3910A7199J36117a93029E9226K12576C5265c197
$$ plain form
11680 -187133 -5733 6505 91813 -273173 215004 39254 -134438 -183259 297717 366587 -177801
11668 49584 -47049 209637 -69819 125204 -11239 433648 -112132 118453 159066 75433 -100722
11656 226852 -320646 -45823 -370524 324260 231304 73489 31167 59469 193866 39597 -40956
11644 32408 222583 316769 -28714 -139068 118934 104300 -83872 -199834 408899 -103421
11633 -185518 -106431 -385501 1593 -101005 241359 323961 351945 -122799 92866 -65783 234012
11621 126759 -82284 105135 -135718 29972 -165552 36799 264762 189309 -120050 -422 187657
11609 -170307 10332 -71310 -375983 46200 213824 -108670 71626 -153835 -19259 -104753 190264
11597 1812 272821 88618 193111 20333 164459 327013 12253 -64323 -255260 -316500 -75716
$$ packed form
11680a87133e733F505Q5308b73173B15004C9254a34438m8821B97717O8870a77801
11668D9584d7049B09637f9819A25204a1239D33648a12132A18453M0613G5433a00722
11656B26852c20646d5823l24701C24260r2956G3489C1167K8302J34397C9597d0956
11644C2408J90175R4186b8714j10354A18934j4634h3872j15962D08899a03421
11633a85518P9087k79070A593a01005B41359Q2602K7984a22799I2866f5783B34012
11621A26759h2284A05135a35718B9972a65552C6799K27963p5453a20050d22A87657
11609a70307A0332g1310l04673D6200J67624a08670G1626a53835a9259q5494A90264
11597A812K71009H8618J04493B0333J44126J62554A2253f4323j90937o1240g5716
$$ plain form
11585 -35521 -142017 212443 37426 50445 126376 -1785 242274 46082 401674 -120114 -119168
11574 -119168 -256545 169021 86623 93708 281665 303153 322655 175165 16219 173838 169871
11563 169871 232831 -103604 201665 -52357 286475 -18094 21679 134837 -164426 116743
11552 109022 -93449 -90073 -115609 142638 -15962 54932 171647 27793 412965 47774 134858
11541 134858 162141 312141 214201 89719 168447 192605 -23211 -18319 -136527 140257 54316
11529 -29154 -27792 -242358 458415 115119 291240 66528 307194 39915 -52615 383605 -181728
11517 -37748 223851 -12465 -284947 -52281 313586 -62018 178277 54282 125527 61832 44091
11506 44091 225191 173714 70702 -255576 121928 302302 190451 77897 -166592 40364
$$ packed form
11585c5521j06496B12443C7426J3019P5931a785B42274D6082L55592a20114R46
11574a19168j37377A69021q2398P085J87957K1488J9502j47490A6219J57619l967
11563A69871O2960a03604B01665e2357B86475a8094B1679J13158a64426A16743
11552A09022i3449L376k5536A42638a5962E4932J16715B7793L85172D7774Q7084
11541A34858K7283J50000r7940H9719P8728K4158b3211M892j18208A40257E4316
11529b9154J362k14566D58415A15119J76121F6528K40666C9915e2615C83605a81728
11517c7748B23851a2465k72482e2281C13586f2018A78277E4282P1245F1832j7741
11506D4091J81100n1477G0702b55576A21928J80374j11851G7897a66592D0364
$$ plain form
11495 261532 333245 29078 -25858 78083 124534 319128 253829 -94166 292240 79566 -241717
11483 271594 365909 108615 254299 107535 -3434 35193 28756 278873 7702 168655 331503
11472 331503 107357 133605 64513 36113 -93516 209907 46762 303301 316157 244146 258695
11461 258695 71097 32225 -134669 161206 182803 163285 -52044 223460 -31961 233470 204032
11450 204032 218456 247276 -5849 -91225 -95507 -43563 382915 -5045 324826 22728 202040
11439 202040 -338977 59199 -171038 46168 99613 -339184 13693 61643 -132292 32885 -100665
11427 138373 182901 206989 386825 -99056 95554 128058 -2882 -162917 211591 122153 391638
11416 391638 -267733 -49934 27607 -182896 51795 -93891 108482 328990 -86757 -213457
$$ packed form
11495B61532P1713B9078b5858G8083M6451J94594o5299i4166B92240G9566b41717
11483B71594R4315A08615J45684A07535c434C5193o437K50117G702J60953J62848
11472C31503A07357K6248F4513k8400i3516B09907D6762K56539J2856p2011J4549
11461B58695G1097C2225a34669A61206K1597j9518e2044B23460c1961B33470k9438
11450B04032J4424K8820e849q5376m282d3563C82915e045C24826B2728J79312
11439B02040c38977E9199a71038D6168N3445c39184A3693M7950a32292C2885a00665
11427A38373M4528K4088J79836i9056I5554L2504b882j60035B11591q9438K69485
11416C91638b67733d9934B7607a82896E1795i3891A08482K20508h6757j26700
$$ plain form
11406 -213457 353247 -15690 17504 -131378 78147 -92620 258102 327821 77639 213849 116096
11395 116096 -14412 -234212 -231851 -161778 63011 28308 7150 233427 -78334 -289956 -286026
11384 -286026 -237376 58550 68713 344383 45365 92374 -108946 -32846 -125753 -19240 -290518
11373 -290518 -195267 -274539 316727 200602 -213481 82916 -33677 -48156 471232 61178 302904
11362 302904 -171630 55497 -91506 123488 82834 174000 276436 -134837 116199 -45596
11351 -120653 -270939 321018 -257688 -6627 151993 -158461 -248414 157276 -109266 178115
11340 -122889 36533 11711 -62964 -9871 282662 220830 60060 -103123 77427 -247870 29226
11328 604489 17449 -7998 -15979 145765 -106735 154022 1588 77119 5296 -200797 37678
$$ packed form
11406b13457C53247a5690A7504a31378G8147i2620B58102O9719G7639J36210r7753
11395A16096a4412k19800K361P0073F3011B8308G150K26277g8334k11622L930
11384b86026M8650E8550J0163K75670D5365M7009a08946c2846r2907a9240k71278
11373b90518R5251p9272C16727j16125b13481H2916c3677j4479D71232F1178K41726
11362C02904a71630E5497i1506A23488m0654R1166J02436a34837A16199d5596
11351a20653j50286C21018b57688f627A51993a58461q9953A57276a09266A78115
11340a22889C6533A1711f2964i871B82662o1832F0060a03123G7427b47870B9226
11328F04489A7449g998p981A45765a06735A54022A588P5531E296b00797C7678
$$ plain form
11316 -185715 13978 67593 -10778 -42622 -146229 146013 212636 126804 -325489 -64650 90048
11304 70469 391372 6629 159516 141825 -181408 -143327 -71570 -165097 -54377 93502 -89162
11292 -2 303546 -145164 -70464 -25199 14909 -184633 -134467 38353 -63724 226572 -89 -41738
11280 -41738 247749 -67382 241250 210580 -289139 38539 -288587 132870 -353668 -355108 60247
11268 10597 55459 -336310 -239040 83420 107916 -168445 105169 -327790 87989 -164594 373144
11256 -92162 -85959 -134655 -159020 131093 -199347 -98361 50993 34275 74134 124739 124127 -153720
11243 -280941 -140649 -44135 -30439 -203477 33654 59689 -180077 -171097 365662 73081 -79911
11231 42581 -115214 115808 -182218 -105733 -131705 -206188 145177 276623 -209277 56829
$$ packed form
11316a85715A3978N3615a0778l1844j03607A46013O6623q5832c25489f4650I0048
11304G0469L20903F629J52887j7691a81408L8081g1570r3527e4377I3502h9162
11292bC03546a45164g0464b5199A4909a84633N0166C8353f3724B26572h9m1649
11280d1738B47749f7382B41250l0670b89139C8539b88587A32870c53668j440F0247
11268A0597M4862c36310R7270H3420K4496a68445A05169c27790H7989a64594C73144
11256i2162O203m8696k4365A31093a99347i8361E0993j6718L9859N0605o12a53720
11243b80941J40292d4135J3696j73038C3654K6035a80077Q980C65662G3081g9911
11231D2581a15214A15808a82218P6485k5972p4483A45177J31446b09277E6829
$$ plain form
11220 211457 -546707 -178676 166190 -148297 -103144 -129393 -56126 43828 16618 1132 -247004
11208 -222129 41639 124955 -231004 115258 -58056 120707 -56420 194713 -243900 190307
11197 -17655 73996 -57698 55703 -291143 230709 72727 82290 -253537 41316 -299242 -182207
11186 -182207 -2886 -246464 -104327 44405 94990 -100625 -213906 27739 -134506 -118258 38284
11174 60847 -135607 -73350 -631244 -227352 -24870 343672 -150773 -247655 -62975 29011 35297
11163 35297 -258288 -178266 7710 182677 143147 149304 259629 291611 -467539 -353499 79449
11151 -42784 36645 69419 -164073 -351967 -31211 -186014 -221700 -53870 -70914 -181214 -227179
11140 -227179 -83825 61114 -189799 -92348 -13856 -486400 -166044 75834 150027 -145256 -154214
$$ packed form
11220B11457e46707a78676A66190a48297M5153k6249e6126D3828A6618A132b47004
11208b22129D1639Q3316b31004A15258e8056A20707e6420A94713b43900A90307
11197a7655G3996e7698E5703b91143B30709G2727R563b53537D1316b99242J17035
11186a82207b886k43578a04327D4405N0585a00625j13281B7739a34506J6248C8284
11174F0847a35607O2257n57894b27352b4870C43672a50773r6882f2975B9011O286
11163C5297b58288Q0022G710J74967l9530O157J10325L1982d67539J14040G9449
11151d2784C6645L2774a64073j87894c1211j54803l5686e3870j7044j10300m5965
11140b27179h3825F1114a89799i2348a3856m72544a66044G5834P4193a45256q958
$$ plain form
11129 -154214 -199730 173466 10460 248813 231015 -25354 -236760 -155194 -65446 -55109 272357
11117 -116082 -184631 200353 90825 -93244 -71147 218558 380297 237197 230884 -150415 44612
11105 332959 48393 -6536 68624 -100395 403380 163438 46303 -175323 1441 -19572 91270
11093 -72972 72835 121359 177048 103481 256905 488391 281032 472807 162869 101805 240233
11082 240233 401934 145525 191552 -74712 60362 -38401 203634 146322 61899 41934 21433
11071 21433 219068 179005 63826 105071 301189 7616 201653 228635 276214 165594 192303
11060 192303 201208 -62252 244616 454120 441595 344762 -56134 567100 284088 509504 452037
11049 452037 464494 266042 560610 551246 191672 426649 231641 216759 508573 548563
$$ packed form
11129a54214m5516A73466A0460K38353j7798b5354k11406Q1566f5446J0337B72357
11117a16082o8549B00353I0825i3244K2097B18558J61739j43100o313a50415D4612
11105C32959D8393f536F8624a00395D03380A63438D6303a75323A441a9572I1270
11093g2972G2835M8524N5689p3567J53424K31486k07359J91775A62869o1064J38428
11082B40233J61701A45525M6027g4712F0362c8401B03634n7312F1899j9965k0501
11071B1433J97635m0063F3826M1245J96118G616J94037K6982M7579j10620K6709
11060A92303Q905f2252B44616K09504j2525r6833e6134E67100k83012K25416n7467
11049D52037J2457j98452K94568r364A91672K34977j95008j4882K91814L9990
$$ plain form
11039 548563 399655 523638 403488 543506 1089783 497191 628928 810346 744928 695774
11029 695774 689892 734800 690913 679898 1009371 788585 542119 761524 654303 497221
11019 497221 623901 686650 398170 677422 905110 827107 880110 629897 511628 1008761
11009 1008761 314321 737486 627291 784037 764114 652597 299750 656286 706047 637899
10999 637899 792429 711665 557591 296997 406393 886084 488956 589118 545319 419928
10989 419928 628425 795385 460129 563035 447398 634158 997380 462504 593963 520891
10979 520891 601325 885406 711282 890253 278547 606176 1017129 566194 706932 1125514
10969 1125514 852818 1163497 882515 1274540 1303499 1345837 1422223 1642806 1423215 1792200
$$ packed form
11039E48563j48908J23983j20150J40018N46277D97191J31737J81418o5418m9154
11029F95774n882M4908m3887j1015L29473k20786k46466K19405j07221j57082
11019D97221J26680O2749k88480K79252K27688p8003N3003k50213j18269M97133
11009A008761C14321M23165j10195J56746j9923j11517B99750L56536M9761o8148
10999F37899J54530q0764j54074k60594J09396M79691l97128J00162m3799j25391
10989D19928K08497J66960l35256J02906j15637J86760L63222D62504J31459p3072
10979E20891Q0434K84081j74124J78971B78547L27629M10953m50935J40738M18582
10969A125514k72696L10679k80982L92025K8959M2338P6386K20583k19591L68985
$$ plain form
10959 1792200 1764078 2235802 2236457 2359616 2299607 2543589 2364187 2435509 2377145 2122062 1729140
10948 1729140 1891987 1759175 1789868 1668570 2031135 2016349 1813086 1733162 1764649 1956989
10938 1956989 1897651 1738931 1545955 994696 1201375 1141943 744177 530607 748012 676588
10928 676588 372974 622888 360269 331720 452457 474402 275704 345401 -202208 241122
10917 345369 75773 205265 141181 -94326 300738 -343538 89010 -190056 -123586 88558 402971
10906 402971 155070 -25147 -273368 66952 168967 -37841 151501 173570 -110367 8802 80977
10895 80977 199936 85377 21741 -163266 103348 127828 -217022 259885 177158 -167257
10884 5133 -96783 -39600 -209293 -65822 -272646 -4174 -338759 -162201 218985 98167 -228272
$$ packed form
10959A792200k8122M71724O55J23159o0009K43982j79402P1322n8364k55083l92922
10948A729140J62847j32812L0693j21298L62565j4786k03263p9924L1487J92340
10938A956989n9338j58720j92976n51259K06679n9432l97766k13570K17405p1424
10928F76588l03614K49914k62619k8549J20737K1945j98698O9697b02208B41122
10917C45369G5773J29492o4084i4326C00738c43538H9010a90056O6470H8558L14413
10906D02971A55070b5147k48221F6952J02015c7841A51501K2069a10367H802P2175
10895H0977J18959H5377B1741a63266A03348K4480b17022B59885q2727a67257
10884E133i6783c9600j69693f5822k06824d174l34585a62201B18985I8167b28272
$$ plain form
10872 -236296 241047 -293717 69404 -222489 -5936 44640 -465970 -132853 224272 237435
10862 237435 -123153 135301 63063 34584 -166218 -165996 157240 -144616 -161083 -142848 230081
10850 -26049 -134627 239977 -282044 -135998 -226930 -60596 -189434 -90282 -283482 -533476
10840 -533476 174761 121715 80801 3588 -119069 220034 47560 -228365 -75281 -188773 -62481
10828 -45098 228223 45980 224924 20216 -6830 -62332 -285669 -124046 -101064 -220555 -231075
10817 -231075 177205 289066 -81248 148677 -192968 -79094 76537 -10852 -348160 -44646
10806 259943 214965 134712 11896 53689 -237518 -296821 121523 77608 145583 -125095 414694
10794 112985 -79640 -314606 260794 -96861 9353 -216791 36297 22112 -129790 -106021 96378
$$ packed form
10872b36296B41047b93717F9404b22489e936D4640d65970a32853B24272J3163
10862B37435a23153A35301F3063k8479a66218K22A57240a44616j6467J8235B30081
10850b6049j08578B39977b82044a35998r0932f0596j28838i0282j93200k49994
10840e33476A74761n3046m0914C588a19069B20034D7560b28365g5281j13492f2481
10828d5098B28223D5980J78944B0216f830n5502k23337a24046K2982j19491j0520
10817b31075A77205J11861h1248A48677a92968g9094G6537a0852l37308d4646
10806B59943m4978q0253A1896M1793b37518n9303A21523m3915O7975a25095D14694
10794A12985g9640k34966B60794i6861I353b16791C6297j4185a29790K3769I6378
$$ plain form
10782 194452 -165142 111489 -261921 14540 31636 138249 -305095 148115 -74906 366202
10771 -59635 160888 -173759 -224530 -229703 5571 -303284 -43157 146943 69720 -139831 39607
10759 -80439 11158 -24682 -41233 -108367 168161 21135 64125 -277197 -167823 115982 -56837
10747 198231 -81907 -141200 189616 160948 178803 -168997 81525 -139834 -847 104061 21796
10735 311649 -12077 -107704 -236761 -130262 -57012 -52498 122858 -137448 265363 5867 14885
10724 14885 83879 -42402 -125918 -89194 278246 -125920 123193 -73983 -35706 9887 -230522
10712 -103146 -142406 237093 -80405 -165974 -338742 70111 10242 -10570 48466 -105351 -265415
10701 -265415 -308193 -103707 102298 -41244 -28133 -88450 -435740 -48081 -27589 13853 -21496
$$ packed form
10782A94452a65142A11489b61921A4540J7096J06613c05095A48115g4906C66202
10771e9635A60888a73759n0771n173E571c03284d3157A46943F9720a39831C9607
10759h0439A1158b4682j6551o7134A68161B1135M2990b77197J09374A15982e6837
10747A98231h1907n9293A89616k8668J7855a68997H1525a39834h47A04061B1796
10735C11649a2077r5627j29057J06499e7012M514A22858a37448B65363E867R018
10724A4885O8994d2402q3516L6724B78246a25920A23193g3983c5706I887b30522
10712a03146l9260B37093h0405q5569j72768G0111A0242a0570D8466a05351j60064
10701b65415m2778a03707A02298d1244J3111o0317l47290d8081K0492A3853b1496
$$ plain form
10689 -354363 -73896 118827 -65100 -227253 29552 -65952 44369 -26209 203286 -203559 47390
10677 -136674 -286437 -44475 210599 -59510 -62014 -149046 10008 -131022 -155277 -263224 216736
10665 114520 219267 -30934 -114307 -37211 -362892 -26480 -80585 53916 -191135 -100670 -32508
10653 861 -54075 -70251 27612 -154994 -346135 -122281 168556 337679 -194403 -157976 -237118
10642 -237118 -125167 152190 -441000 -274057 -61127 -84376 -163445 -376864 -247776 -210027
10632 -210027 -321619 -75985 -259950 2662 -107030 -193609 132293 -255175 -220245 -194968 79803
10620 183197 29778 -11468 87783 71186 -129562 -10085 133831 -51335 -138587 112412 9708
10608 -215046 88501 137646 -236821 -317701 92420 158309 -17386 -259778 -210489 36261 -42915
$$ packed form
10689c54363g3896A18827f5100j62153B9552f5952D4369b6209B03286b03559D7390
10677a36674j49763d4475B10599e9510k504q7032A0008a31022k4255j07947B16736
10665A14520J04747c0934q3373c7211l25681b6480n4105E3916a91135R0465c2508
10653H61e4075j6176B7612a54994j91141a22281A68556J69123a94403L6427p9142
10642b37118J11951A52190d41000J66943f1127k3249p9069k13419J29088L7749
10632b10027j11592g5985j83965B662a07030q6579A32293b55175L4930K5277G9803
10620A83197B9778a1468H7783j6597a29562a0085A33831e1335q7252A12412I708
10608b15046H8501M9145b36821q0880I2420O5889a7386k42392M9289C6261d2915
$$ plain form
10596 -417864 123215 -276579 -49716 -69197 -121422 -151765 -163268 -342288 -186225 -289043
10586 -289043 161952 -21068 165955 54267 -147551 -216725 99519 11405 -347953 137727
10575 -435164 -40091 -123258 95009 -138845 129728 40774 -254132 -193702 -30212 70400 -237946
10563 13910 -248668 -43948 24378 63921 106271 -233477 -52197 349625 108290 -27526 226229
10551 192770 140391 -263229 -134508 -236892 -163947 118646 -89167 -147933 508521 167883
10540 264902 26307 -383859 -117970 185800 -173866 138601 -26914 -125022 -38820 123574
10529 217169 176461 45582 314854 222136 -1415 -10548 172538 -277065 -366244 154427 -1017
10517 -418561 219398 -266869 -57399 116617 -161196 -38036 56680 -172194 -88014 -85264 -227316
$$ packed form
10596d17864A23215b76579d9716j9481n2225l0343j1503j79020J56063j02818
10586b89043A61952b1068A65955E4267a47551o9174I9519A1405c47953A37727
10575d35164d0091q3167I5009a38845A29728D0774b54132O0430c0212G0400b37946
10563A3910b48668d3948B4378L9543M2350b33477e2197C49625A08290b7526B26229
10551A92770n2379b63229J28721j02384P2945A18646h9167n8766E08521A67883
10540B64902B6307c83859a17970A85800a73866A38601b6914r8108c8820A23574
10529B17169m0708D5582K69272r2718a415r133A72538b77065q9179A54427a017
10517d18561B19398b66869e7399A16617a61196c8036E6680a72194Q4180K750j42052
$$ plain form
10506 -227316 151572 734 -235392 -53822 6436 -215072 -305383 126877 -108367 18014 201033
10495 201033 136047 46991 -157772 -358301 210980 56161 -306265 -167402 -164663 95612 53108
10484 53108 -317022 181658 -180623 -10244 16533 122154 -135997 -43070 -59894 -43281 -282802
10473 -282802 -89335 28279 113888 -37260 -89730 117982 324902 -83145 548659 263764 305751
10462 305751 25712 374386 140971 197322 45504 -261788 -24728 -9063 278132 127130 -207395
10450 -32607 59756 -413365 -102696 -44235 119236 102113 159105 161016 -21033 -85883 -387319
10439 -387319 -477991 65427 85550 44093 -94695 -314327 -155471 -258920 -166511 -6843 60984
10427 -212167 -82983 -14352 132672 28469 -5550 -48370 157845 200174 -25570 212217 -149222
$$ packed form
10506b27316A51572G34b35392e3822F436b15072r0311A26877a08367A8014J83019
10495B01033o4986D6991a57772k00529B10980E6161c06265J38863K739I5612m2504
10484E3108c17022A81658a80623a0244A6533J05621a35997d3070j6824J6613k39521
10473b82802h9335B8279Q5609c7260n2470A17982K06920h3145E48659B63764M1987
10462C05751B5712L48674A40971N6351D5504b61788b4728i063B78132A27130b07395
10450c2607E9756d13365a02696d4235A19236j7123N6992J911b1033o4850l01436
10439c87319r0672F5427K0123m1457i4695k19632a55471j03449R2409f843F0984
10427b12167h2983a4352A32672B8469e550m2820A57845M2329b5570B12217a49222
$$ plain form
10415 124832 -142413 38088 -143131 167762 -76039 155224 56998 -96598 -161772 -32826 111937
10403 87344 -178420 -72102 -374821 -215791 241165 21489 174612 26859 227969 -14745
10392 -354861 49682 20118 165836 -123194 -124469 45327 275680 -233909 -219033 -53067 -219856
10381 -219856 315568 -232438 -110098 361167 -122446 353265 -89259 -91853 -119311 89971
10370 242848 -11574 -104650 278471 326150 362458 293499 268738 190364 369362 35251 227174
10359 227174 82898 14204 165974 536166 -141490 50703 123053 518991 492958 343718
10349 343718 481705 82693 200297 215085 110328 70884 502520 45635 53199 -135626 125836
10337 322915 307358 300630 462215 478830 530172 439031 357991 368058 273575 440173 455251
$$ packed form
10415A24832a42413C8088a43131A67762g6039A55224E6998i6598o5174c2826A11937
10403H7344a78420g2102l02719J59030B41165B1489J53123B6859K01110a4745
10392c54861D9682B0118J45718a23194j275D5327K30353b33909J4876e3067j66789
10381b19856C15568b32438a10098C61167a22446C53265h9259k594k7458H9971
10370B42848a1574r3076B78471M7679L6308o8959k4761p8374J78998C5251J91923
10359B27174H2898A4204J51770L70192a41490E0703P2350L95938k6033j49240
10349C43718J37987H2693J17604J4788j04757l9444M31636D5635P564a35626A25836
10337C22915j5557o728J61585J6615N1342r1141q1040J0067r4483J66598J5078
$$ plain form
10326 455251 208482 303495 50860 230141 -90065 589667 8985 35955 151659 21131 120084
10315 120084 257625 -15709 -10743 452497 -12585 94189 206935 23615 20717 21812 425071
10304 425071 190578 279129 -372311 390971 116324 309395 -4448 8949 161430 233063 16319
10292 -98483 468485 146584 63714 -85642 -381293 -412 -112215 -8490 181068 -49451 -97677
10281 -97677 118277 125786 -152291 146921 -260226 -201871 -19545 164536 390307 3460 -207571
10269 -72343 61630 232806 82340 -248410 -5466 159521 -49629 107086 -292304 -422969 -378007
10258 -378007 109045 -66796 40251 13273 -552 -39328 -22180 65953 -50608 142060 -92552
10246 276908 96040 471663 240519 9264 236584 251501 497807 441546 32930 53608 -108469
$$ packed form
10326D55251B08482R5013E0860J79281i0065E89667H985K6970J15704B1131R8953
10315A20084J37541a5709M966D52497a2585I4189J12746B3615k898J095M03259
10304D25071A90578Q8551c72311C90971A16324J93071d448H949J52481P1633A6319
10292i8483D68485A46584F3714h5642k95651d12j11803h490A81068d9451m8226
10281i7677A18277P509a52291A46921b60226N8355a9545A64536K25771C460b07571
10269g2343F1630J71176H2340b48410e466A59521d9629A07086b92304j30665M4962
10258c78007A09045f6796D0251A3273e52l8776J7148F5953e0608A42060i2552
10246B76908I6040L75623k31144I264K27320J4917K46306n6261C2930K0678a08469
$$ plain form
10234 -76592 305077 57175 12690 -249122 -139684 9755 9652 66148 -62538 -28273 155268
10222 119558 -107460 -134110 113199 -47843 -325213 83415 162332 -272299 -233223 100995
10211 77373 -453267 -4437 -145327 17551 -451451 -219088 209397 -13068 39291 7885 29821
10200 29821 -332142 -129079 -278939 -170901 -269309 -46486 -343131 -285773 -283127 51637 -24032
10188 -121077 -303564 -247408 302374 -178045 -152798 62945 -82609 -33116 -121759 -177233 503671
10176 -65129 -117185 377137 -357245 -80221 -68397 -213004 -89658 61110 -157472 -26653 148583
10164 -404022 -50013 70666 173703 -109399 -20381 -58189 118954 -67164 -377553 28828 31699
10153 31699 -22158 20123 -103058 -207321 -385193 -131057 93299 -27266 -253446 -142181
$$ packed form
10234g6592C05077E7175A2690b49122J09438I755j03N6496f2538b8273A55268
10222A19558a07460k6650A13199d7843k77370H3415P8917b72299L9076A00995
10211G7373d53267d437j40890A7551d51451b19088B09397a3068C9291G885K1936
10200B9821c32142a29079j49860J08038r8408d6486k96645N7358K646E1637b4032
10188a21077j82487N6156C02374a78045K5247F2945h2609c3116q8643n5474E03671
10176f5129n2056C77137c57245h0221J1824j44607h9658F1110a57472b6653A48583
10164d04022e0013G0666J03037a09399b0381l7808A18954f7164l10389B8828K871
10153C1699b2158B0123a03058j04263j77872a31057I3299b7266k26180J11265
$$ plain form
10143 -142181 234574 -32752 -137309 -97741 -54329 -114128 -6171 -83058 330573 -157854 -299347
10132 -299347 -201892 101148 -215300 139621 122604 -2839 -55465 -170445 -168775 144261 -57522
10120 -73193 -154362 60140 -30183 145864 130488 -347369 317319 -209814 348976 -269294
10109 -11258 -151395 -509840 -159613 -449278 -163256 -64050 31054 185556 -92654 -286218
10099 -286218 -151742 139766 331928 147765 -84796 -143770 72741 -91699 -176876 190642
10088 -10270 244232 -203670 -84788 275821 21138 178664 -103313 -117941 164295 -51591
10077 -23939 36327 101303 -122846 -97355 -175362 -63356 -20416 46940 -15561 -97296 90899
10065 -75633 -294538 94200 -159047 25377 -223350 95116 48476 149018 386 221871 6348
$$ packed form
10143a42181B34574c2752j04557L9568M3412n9799f171p6887C30573a57854j41493
10132b99347R7455A01148b15300A39621j7017b839n2626j14980J670A44261e7522
10120g3193q1169F0140c0183A45864j5376c47369C17319b09814C48976b69294
10109a1258j40137l58445a59613k89665a63256f4050C1054J54502i2654j93564
10099b86218J34476A39766J92162A47765h4796n8974G2741i1699q5177A90642
10088a0270B44232b03670h4788B75821B1138J57526a03313j4628A64295e1591
10077b3939C6327O4976a22846K5491p8007f3356b0416D6940a5561q1735I0899
10065g5633k18905I4200a59047B5377b23350I5116m6640J00542C86K21485F348
$$ plain form
10053 -98917 341250 -200444 41124 153806 116154 -119488 -63869 -34027 13178 -204887 3908
10041 -333697 145738 -283668 28462 -99250 -58544 -225713 68421 -213230 153584 154155 -117120
10029 -47772 -68508 4846 98816 110971 78690 4868 54670 -141859 -265611 -77626 -10127 -144413
10017 -144413 -50801 -100311 -127160 -116409 -89392 -254487 -159313 146896 112667 -246018 233369
10005 -133546 273669 -180651 168967 33164 226345 -54395 -122177 -118282 127244 26543 60692
9994 60692 33035 10549 32661 77222 51409 -87584 23587 184017 171832 110321 -157552
9982 -230216 150083 -75946 -123376 -53416 -131718 -181928 -165511 79772 -167776 -219163 61468
9970 -176816 -133781 -78448 329969 -220195 89378 -243967 4148 -201936 98764 -110533 105696
$$ packed form
10053i8917C41250b00444D1124J12682l7652a19488N5619K9842A3178b04887C908
10041c33697A45738b83668B8462i9250M0706j67169F8421b13230A53584N71a17120
10029d7772k0736D846R3970J2155l2281D868M9802a41859j23752g7626a0127j34286
10017a44413e0801m9510k6849J0751K7017j65095R5174A46896l4229b46018B33369
10005a33546B73669a80651A68967C3164J93181e4395o7782L895A27244B6543L4149
9994F0692k7657A0549K2112M4561k5813h7584B3587J60430j2185o1511a57552
9982b30216A50083g5946m7430e3416p8302n0210J6417G9772a67776n1387F1468
9970a76816M3035N5333C29969b20195H9378b43967D148b01936I8764a10533A05696
$$ plain form
9958 73069 -269928 -138717 8071 -10967 -64319 -21691 -35952 -41479 89897 -192293 117038
9946 131311 -24757 135431 -92868 -232159 -196575 101669 -11806 -304817 -217357 -307911 -305877
9935 -305877 -339682 -160389 -280803 -239073 266844 -141974 -343152 234424 -209040 -84992
9924 17282 -114749 26155 -159483 -92964 -200788 -112160 -92879 -111305 29342 -10392 -16223
9913 -16223 -52957 -136455 -203652 -39347 -176381 -169310 -169757 -25078 94341 -41199 2967 -73404
9900 -46092 90471 -355472 -134541 181733 -32981 -39419 -79249 -76075 163246 -431087 45661
9888 -128788 229817 -114706 -260107 -214631 -227354 -222885 16063 -122962 270882 -132501 -219837
9877 -219837 -174077 -98538 84961 -162284 -50989 -166717 92919 -307015 232046 -116546 -149912
$$ packed form
9958G3069b69928J31211H071a0967n3352b1691j4261n527H9897a92293A17038
9946A31311b4757A35431i2868j39291L5584A01669a1806k93011Q7460r0554K034
9935c05877l3805a60389j20414M1730B66844a41974k01178B34424b09040h4992
9924A7282a14749B6155a59483O6519j07824Q8628J9281j8426B9342a0392n831
9913a6223l6734q3498o7197c9347j37034P071m47b5078I4341d1199B967g3404
9900d6092I0471c55472a34541A81733c2981o438l9830L174A63246d31087D5661
9888a28788B29817a14706j45401M5476j2723M469A6063a22962B70882a32501q7336
9877b19837M5760P5539H4961a62284e0989j15728I2919c07015B32046a16546l3366
$$ plain form
9866 -149912 53406 -12795 -135881 -46540 -269611 64726 -101552 332638 -60039 -43241 83007
9854 44337 18037 -319947 39146 381860 -102523 -85770 -291940 -32216 -61546 -79271 152430
9842 -250758 -330136 -297073 27737 -99821 247704 -393766 -193778 -83858 -32908 -248923 46671
9830 -621510 -181308 391240 24494 22181 117963 -220394 139893 -24339 68044 -1264 -18357
9819 -18357 -274238 -239025 97422 -91997 -52544 40874 -19928 50038 120926 34498 75191 -106829
9806 -464916 -117115 -271299 -315520 -41130 144041 226206 203047 -332032 -51146 -212534 -141588
9795 -141588 127175 -34381 -8789 24039 -145264 -156524 -288998 -275045 -361722 59004 -115908
9783 -32345 19276 -93554 -249448 62753 -7020 -148117 59651 80327 -22468 -159811 48846
$$ packed form
9866a49912E3406a2795j23086d6540k23071F4726a01552C32638f0039J6798H3007
9854D4337A8037c19947C9146L42714a02523J6753k06170c2216k9330j7725A52430
9842b50758p9378L3063B7737i9821B47704c93766a93778h3858c2908k16015D6671
9830f21510a81308C91240B4494k313R5782b20394A39893b4339F8044a264j7093
9819a8357k55881L5213I7422i1997L9453D0874a9928E0038P0888C4498M0693a06829
9806d64916a17115j54184m4221d1130A44041Q2165k3159c32032e1146j61388P0946
9795a41588A27175c4381h789B4039a45264j1260j32474J3953q6677E9004a15908
9783c2345A9276i3554j55894F2753g020j41097E9651K0676b2468j37343D8846
$$ plain form
9771 21816 -68507 99720 -215102 -94140 5367 181015 -37345 -261336 -303443 -433833 358602
9759 -79864 80721 -170340 -50403 9722 62373 97046 -24428 -386271 -37892 -289627 16746
9747 166793 -177492 180018 247051 22256 -290634 -78271 -156207 30314 -131347 -330992 -106317
9735 42096 59055 -230686 280703 -296107 209868 69450 70667 -262471 120074 -68712 -126223
9724 -126223 146239 38469 -226797 -318366 -264823 -43080 349 -184215 175610 -133819 -314444
9713 -314444 137476 -103043 56517 -123910 -80205 198134 -197714 -304257 -1469 -107507
9703 -107507 9670 76687 -29802 111366 -22590 23667 -120363 -115992 -6508 -292542 70564 -97115
9690 150841 -28443 228051 -32344 -200215 -146951 -53149 -34009 -24179 -86771 4975 -203139
$$ packed form
9771B1816f8507I9720b15102i4140E367J75648c7345k23991m2107j30390C58602
9759g9864H0721a70340e0403I722N2651L4673b4428l61843c7892k51735A6746
9747A66793a77492A80018O7033B2256b90634g8271p7936C0314a31347j99645a06317
9735D2096J6959b30686B80703b96107B09868F9450J217b62471A20074f8712n7511
9724a26223A46239C8469b26797r1569N3543d3080C49a84215A75610a33819j80625
9713c14444A37476a03043E6517a23910M3705A98134a97714j06543a469j06038
9703a07507I670O7017b9802A11366b2590B3667a20363M371f508k86034G0564i7115
9690A50841b8443B28051c2344j67871N3264e3149J9140R830o2592D975b03139
$$ plain form
9678 -151819 38227 -71469 -139374 -165934 247205 195213 -95688 -160365 -175617 56425 -30847
9666 -86757 -114234 -112664 24896 10456 -456118 -49089 -12567 53009 -46981 -279591 7295 293142
9654 293142 69877 -68544 -283279 -213538 -80355 -156674 103443 -253877 -87731 -270389 -154435
9643 -154435 -275957 -77465 6753 75699 -99382 -224767 -263460 2619 -33340 -96920 -298727
9632 -298727 -362293 47207 41327 -3090 167098 -67975 307224 76557 131298 71585 -183237
9620 -170893 134240 289441 36032 76834 28778 -161465 -219357 230245 -18291 185318 -385038
9608 11851 -282176 -238898 -193066 234316 -392128 -104146 -126609 -15072 -174707 -248330 -60541
9596 -329935 27566 -312464 -121199 -50360 86203 -64852 49024 -121556 -53408 -13200 -88824
$$ packed form
9678a51819C8227g1469o7905k6560B47205n1992i5688o4677j5252E6425c0847
9666h6757k7477J570B4896A0456d56118d9089a2567E3009d6981k32610G295K85847
9654B93142F9877f8544k14735O9741h0355p6319A03443b53877h7731j82658J15954
9643a54435j21522g7465F753O8946i9382j25385l8693B619c3340o3580k01807
9632b98727o3566D7207n880c090A67098f7975C07224G6557N4741n9713a83237
9620a70893A34240J55201C6032M0802B8778a61465n7892B30245a8291A85318c85038
9608A1851b82176M3278M5832B34316c92128a04146k2463a5072j59635p3623f0541
9596c29935B7566c12464a21199e0360H6203f4852D9024a21556e3408a3200p5624
$$ plain form
9585 -88824 20571 -294332 -33474 -87628 -138752 -240998 186571 -155879 -348396 315471 -179493
9573 -53635 -93874 279292 -229193 -74045 -16300 -54281 -386341 -69701 -138351 42339 -71651
9561 -315151 75242 -182848 46058 114159 -67587 -357888 14807 15733 294108 -98946 -47570
9549 14765 -58693 -51227 92503 3677 -44017 -161583 188030 -30768 -288658 -353021 -127279
9537 72957 144955 -71394 52247 237089 -173540 55981 -228920 -35235 114703 22113 -16036
9525 -59040 212276 -157160 81351 84143 -12923 -249160 2067 -146332 -153216 224293 -206690
9513 16899 -334271 110326 -2079 -155631 -55587 31158 30057 181652 -80733 134021 -133407
9501 -103189 51245 313863 -52861 139364 -64053 431896 233710 -210888 -218973 -237861 157248
$$ packed form
9585h8824B0571b94332c3474n4154n1124j02246A86571a55879j92517C15471a79493
9573e3635m0239B79292b29193g4045a6300l7981l32060f9701o8650D2339g1651
9561c15151G5242a82848D6058O8101f7587k90301A4807R26K78375i8946d7570
9549A4765e8693P466I2503C677d4017j17566A88030c0768k57890o4363a27279
9537G2957P1998g1394E2247J84842a73540E5981b28920c5235A14703B2113a6036
9525e9040B12276a57160H1351K792a2923k36237B067a46332o884B24293b06690
9513A6899c34271A10326b079j53552e5587C1158j101J51595h0733A34021a33407
9501a03189E1245K62618e2861A39364f4053D31896j98186b10888q085j8888A57248
$$ plain form
9489 267550 -36863 105838 -80197 5983 -251862 -254075 -54038 -184375 -320692 -288325 -26156
9477 -31948 -333703 -31696 -120448 -756 15832 19113 52866 77963 -140025 -341409 -291697 77657
9464 2198 32852 285254 -280250 -65552 123781 -160938 368043 -389600 -15049 -204593 -51220
9452 379123 -426416 -38325 174429 -106377 24927 27791 -107211 -150549 -29493 -134011 187615
9440 -197162 27315 274957 -335306 211349 -410782 225410 -155753 -164862 205057 7044 -121938
9428 -59456 -491591 29587 -48849 -310471 -146903 1772 -181431 -54728 -285618 -91643 147303
9416 330325 57406 -174192 -116796 -120601 -306393 299898 -237702 -76771 -313656 307451 -189883
9404 224532 263135 -133847 -156874 197072 -68191 -92648 -132739 -280117 -163384 145296 -210072
$$ packed form
9489B67550c6863A05838h0197E983b51862k213e4038j30337j36317L2367b6156
9477c1948l01755c1696q8752g56A5832L281L3753K5097a40025k01384M9712G7657
9464B198L0654K52402b80250f5552A23781a60938C68043c89600a5049j89544e1220
9452C79123d26416c8325A74429a06377B4927K864a07211m3338b9493j04518A87615
9440a97162B7315K47642c35306B11349d10782B25410a55753r109B05057G044a21938
9428e9456m32135B9587d8849k61622a46903A772a81431e4728k30890i1643A47303
9416C30325E7406a74192N7396l805j85792B99898b37702g6771k36885C07451a89883
9404B24532L8603a33847k3027A97072f8191k4457m0091j47378J16733A45296b10072
$$ plain form
9392 53349 14435 96216 -235408 103413 212262 -91436 -17358 22061 66054 172689 -126739
9380 -189099 -36523 -58427 -150074 -124329 93688 -252166 -327855 -338652 -63279 -103486 -129756
9369 -129756 -122815 155214 114345 100206 202977 294493 -295081 194208 425977 99744 49614
9357 -369958 -138210 -72031 223917 -280206 -156970 -156899 -280342 -144377 -29623 153709 210214
9346 210214 54170 -112536 -100602 -58645 -445378 -37064 510210 59680 -191884 182817 -346213
9334 -39832 17474 -148206 119610 -175238 2697 -110693 -50076 53540 148148 -62599 -100628
9323 -100628 292235 -19986 -158174 -71119 -232366 -84958 -34392 -10805 -164530 -189661 -2745
9311 -221347 -47709 -141341 -286743 18441 -255373 -117929 -349117 -475944 -218682 196964
$$ packed form
9392E3349A4435Q1781b35408A03413J08849i1436a7358B2061M3993J06635a26739
9380a89099c6523k1904r1647K5745I3688b52166p5689j0797f3279m0207k6270
9369a29756O941A55214m0869j4139J02771R1516b95081A94208K31769I9744D9614
9357c69958a38210O6179B23917b80206J23236P1j23443J35965b9623A53709N6505
9346B10214E4170a12536J1934M1957l86733c7064E10210E9680a91884A82817c46213
9334c9832A7474a48206A19610a75238B697a10693e0076E3540R4608f2599l8029
9323a00628B92235a9986j38188g1119j61247h4958c4392a0805j53725k5131b745
9311b21347d7709r3632j45402A8441b55373a17929k31188j26827b18682A96964
$$ plain form
9300 209786 -243867 55376 -224182 -63257 -370296 -352472 -51176 -39426 -113071 150335 72753
9288 -103156 -308224 -10207 -215845 -345427 -212297 394 -389081 4991 -112382 -332878 -26488
9276 -181744 -161469 -209966 41919 175475 -265982 -14909 227767 9013 162826 -111179 -142652
9265 -142652 -225775 124563 -137335 148167 -93394 166820 -405432 218550 85747 142034
9255 142034 -111669 16720 377572 208467 100555 -59278 -38237 246188 103818 55229
9245 55229 -265942 -31406 -107143 -255747 -15224 -292487 -222992 -22449 -104173 141556 123829
9234 123829 248472 -43637 215352 -61491 -97683 -165681 36841 -71175 -70695 -29152 252117
9222 484124 331015 -260146 -6763 84845 284927 -235687 -61626 -221241 63110 -104069 -181083
$$ packed form
9300B09786b43867E5376b24182f3257l07039J7824e1176J1750p3645A50335G2753
9288a03156k05068a0207k05638j29582J33130C94c89081D991a12382k20496b6488
9276a81744K0275m8497D1919J33556b65982a4909B27767I013J53813a11179l1473
9265a42652q3123A24563a37335A48167i3394A66820d05432B18550H5747N6287
9255A42034a11669A6720L60852j69105A00555e9278K1041B46188A03818m8589
9245E5229b65942c1406p5737j48604a5224k77263O9495b2449q1724A41556j7727
9234A23829J24643d3637B15352f1491l6192o7998C6841g1175M80b9152B52117
9222D84124j53109b60146f763H4845K00082b35687f1626j59615F3110a04069p7014
$$ plain form
9211 -181083 -58243 -155434 -156462 -24922 -209105 -144137 -42398 -71329 -95864 44656 -248354
9199 100631 -71966 -145788 -36682 -188805 -2077 -3349 125465 -110272 -163374 -95179 -33540
9187 -37992 -249711 181892 -114798 185656 -36109 -81743 -34683 197055 -145220 -89658 93289
9175 -287733 -147173 299884 -124093 -401897 -99437 -12920 -252637 59472 -125819 -85550
9165 -85550 117710 -222504 -128886 142629 -393624 158692 -16866 168294 63723 250436
9155 250436 -12668 -333820 97131 -290620 -50688 -27013 -258734 -253516 4598 -160981 -153860
9144 -153860 -154227 -87796 35924 -37030 112428 -43149 6793 -86510 -111919 -76654 262978 164382
9132 164382 -294897 21891 -191891 -169265 -319863 122986 -28964 368586 -121773 130495
$$ packed form
9211a81083e8243r7191j028b4922j84183O4968d2398k8931k4535D4656b48354
9199A00631g1966p3822c6682j52123b077j272A25465a10272n3102O8195c3540
9187c7992k11719A81892a14798A85656c6109m5634c4683A97055a45220N5562I3289
9175b87733J40560B99884a24093k77804i9437a2920k39717E9472a25819M0269
9165h5550A17710b22504R3618A42629c93624A58692a6866A68294F3723J86713
9155B50436a2668l21152I7131b90620e0688K3675k31721N218D598a60981P121
9144a53860l67O6431C5924c7030A12428d3149F793h6510k5409L5265B62978r8596
9132A64382b94897B1891a91891K2626j50598A22986b8964C68586a21773A30495
$$ plain form
9121 56531 -185022 -3477 436517 84278 117918 -88062 -34838 -248005 60974 -4168 -160731
9110 -160731 -28781 -100455 250955 124028 -301335 3294 151744 184763 108899 -140274 -73458
9099 -73458 36050 -410903 -225727 -147656 219226 -62550 -177673 145283 -349718 -25604 361942
9087 22714 -29147 -183188 -114153 -324829 18675 -256334 -69687 278999 -200066 -60531 -9190
9075 -268175 -425060 234361 54090 85599 53717 -14660 -60357 171494 48516 -113807 252142
9063 -553151 83966 88884 -25871 14889 6764 -205841 -7068 -339141 100585 167277 -138553
9051 -22026 -65373 -195872 -36558 -133366 15477 -30979 -100103 -170274 -122649 1290 -50047 100448
9038 250440 125723 -41314 40240 -356596 -120111 -292962 -27661 10051 57039 -9203 156055
$$ packed form
9121E6531a85022c477D36517H4278L3640h8062c4838k13167F0974d168j56563
9110a60731b8781p1674B50955A24028c01335C294J48450L3019p5864a40274O6816
9099g3458C6050d10903J85176P8071B19226f2550j15123A45283c49718b5604C61942
9087B2714b9147j54041O9035k10676A8675b56334f9687B78999b00066f0531i190
9075b68175j56885B34361E4090L1509l1882a4660m5697A71494D8516a13807B52142
9063e53151H3966M918b5871A4889F764b05841g068l32073A00585O6692a38553
9051b2026m3347j30499c6558r6808A5477c0979o9124p0171M7625A290e0047A00448
9038B50440j24717d1314D0240c56596a20111j72851b7661A0051M6988i203A56055
$$ plain form
9026 77874 -308822 -255633 -133252 -88978 26226 -37034 247846 -247412 -184728 -97333 120024
9014 -69129 -42201 -11981 -98695 -59019 -30577 10829 -194998 -27441 -285769 112899 34179
9002 -126154 -111548 -168502 321696 -412701 -202532 25768 -98365 -183055 -302842 -104974 -154999
8991 -154999 -139336 -115332 -81062 42015 132912 66296 -30117 -112500 -89643 -16990 -94698 201231
8978 -48135 -191162 -201183 -128078 171970 151451 -126480 -132591 -24896 125206 60827 247358
8967 247358 -290475 77243 18625 105284 48308 70654 -95722 157883 -136374 105830 -287245
8955 228657 208937 95065 -325693 -218255 -38741 29580 54755 -55020 -131179 187764 -93505
8943 58046 6850 -101639 48666 57873 190291 2495 -269329 89560 184446 245371 165968 -92403
$$ packed form
9026G7874c08822N3189J22381M4274B6226c7034B47846b47412O2684Q7395A20024
9014f9129K6928a1981q6714L9676K8442A0829a94998b7441k58328A12899C4179
9002a26154J4606n6954C21696d12701b02532B5768i8365q4690j19787a04974n0025
8991a54999J5663K4004L4270D2015R0897F6296c0117q2383K2857a6990p7708B01231
8978d8135j43027j0021P3105A71970k0519a26480o111b4896A25206F0827J86531
8967B47358b90475G7243A8625Q6659D8308K2346i5722A57883a36374A05830b87245
8955B28657j9720I5065c25693J07438c8741B9580K5175e5020p6159A87764i3505
8943E8046F850a01639D8666R207J32418B495b69329H9560R4886O0925p9403i2403
$$ plain form
8930 -223104 -102679 -20741 168768 -365318 6167 -123198 -56839 -294241 -39764 -10200 284488
8918 256767 120103 -13287 42445 27845 119908 72588 374987 273485 429397 1023772 1359543
8907 1359543 3253780 6841172 10163723 4827029 2487175 1453150 721984 719232 640636
8898 640636 -8613 161703 105583 222936 -116944 285775 489788 192110 202157 86212 264272
8887 264272 34859 -18381 334550 192611 311478 125466 -171404 106655 189449 -271269
8876 212208 53391 -300775 -176157 -18675 88160 65699 -270287 17955 56416 -178113 105358
8864 23167 -329224 -319887 48771 -7444 29661 118415 16549 297455 48304 21994 108409 -298622
8851 -189364 346486 -208716 -56925 100129 -101623 -217040 -148005 -125684 -215011 -90956 182009
$$ packed form
8930b23104a02679b0741A68768c65318F167a23198e6839k37402c9764a0200B84488
8918B56767A20103a3287D2445j4600R2063m7320L02399j01502J55912N94375L35771
8907A359543J894237L587392L322551D827029k339854j034025G21984k752p8596
8898F40636h613A61703n6120J17353a16944B85775K04013A92110J0047H6212J78060
8887B64272C4859a8381C34550j41939J18867A25466a71404A06655Q2794b71269
8876B12208E3391c00775J24618a8675H8160k2461b70287A7955L8461a78113A05358
8864B3167c29224R337D8771g444B9661Q8754A6549K80906D8304B1994Q6415b98622
8851a89364C46486b08716e6925A00129a01623j15417O9035K2321q9327i0956A82009
$$ plain form
8839 225293 -66658 -20527 -489079 -110336 180450 76635 189331 -2550 -16431 -111880 -80168
8828 -80168 58947 -79174 -244043 -190072 6145 121653 -12405 -85796 -58590 -225380 28078
$$ packed form
8839B25293f6658b0527m68552a10336A80450G6635J12696b550j3881r5449L1712
8828h0168E8947g9174j64869N3971F145J15508a2405p3391K7206j66790B8078
$$ [...]
##END NTUPLES=NMR SPECTRUM
##END=
