
##TITLE=UV1023_M3-1004-1000_6269524_W8HIBuEm94
##JCAMPDX= 6.0         $$ Bruker NMR JCAMP-DX V2.0
##DATA TYPE= NMR SPECTRUM
##DATA CLASS= NTUPLES
##ORIGIN= BRUKER
##OWNER= Administrator
$$ 1.72 TOPSPIN		Version 2.1
$$ 2012-06-02 03:30:56.625 -0500  Administrator@TOPSPIN
$$ Compression mode = diff/dup
##.OBSERVE FREQUENCY= 400.13188235
##.OBSERVE NUCLEUS= ^1H
##.ACQUISITION MODE= SIMULTANEOUS (DQD)
##.ACQUISITION SCHEME= undefined
##.AVERAGES= 64
##.DIGITISER RES= 22
##SPECTROMETER/DATA SYSTEM= spect
##.PULSE SEQUENCE= noesygpps1d.comp
##.SOLVENT NAME= COFFEE_calctemp
##.SHIFT REFERENCE= INTERNAL, COFFEE_calctemp, 1, 14.96699
##AUDIT TRAIL= $$ (NUMBER, WHEN, WHO, WHERE, PROCESS, VERSION, WHAT)
$$ ##TITLE= Audit trail, TOPSPIN		Version 2.1
$$ ##JCAMPDX= 5.01
$$ ##ORIGIN= Bruker BioSpin GmbH
$$ ##OWNER= Administrator
$$ $$ C:\Bruker\TOPSPIN/data/COFFEE/nmr/UV1023_M3-1004-1000_6269524_W8HIBuEm94/12/pdata/1/auditp.txt
$$ ##AUDIT TRAIL=  $$ (NUMBER, WHEN, WHO, WHERE, PROCESS, VERSION, WHAT)
(   1,<2012-06-02 03:30:51.078 -0500>,<Administrator>,<TOPSPIN>,<go>,<TOPSPIN 2.1>,
      <created by zg
	started at 2012-06-02 03:19:20.859 -0500,
	POWCHK enabled, PULCHK disabled,
       configuration hash MD5:
       D5 CA 7A 23 FE 6B EE E2 50 67 74 61 24 F7 5E 3B
       data hash MD5: 64K
       76 B2 32 E3 42 75 32 72 6E 39 6A C4 F2 89 67 66>)
(   2,<2012-06-02 03:30:54.171 -0500>,<Administrator>,<TOPSPIN>,<proc1d>,<TOPSPIN 2.1>,
      <Start of raw data processing
       efp LB = 0.3 FT_mod = 6 PKNL = 1 PHC0 = 0 PHC1 = 0 SI = 128K 
       data hash MD5: 128K
       4D 69 05 19 D0 57 EB D6 BE CF B8 31 71 47 83 14>)
(   3,<2012-06-02 03:30:55.453 -0500>,<Administrator>,<TOPSPIN>,<proc1d>,<TOPSPIN 2.1>,
      <pk PHC0 = 30.34973 PHC1 = 0 
       data hash MD5: 128K
       81 60 2E 61 10 9B D0 04 78 A4 9E FF ED 1B 42 9F>)
(   4,<2012-06-02 03:30:56.265 -0500>,<Administrator>,<TOPSPIN>,<proc1d>,<TOPSPIN 2.1>,
      <abs ABSG = 1 
       data hash MD5: 128K
       1E 9D 26 58 6C 58 D3 6A 14 83 CF D4 39 B0 BE C2>)
(   5,<2012-06-02 03:30:56.343 -0500>,<Administrator>,<TOPSPIN>,<proc1d>,<TOPSPIN 2.1>,
      <abs ABSG = 2 
       data hash MD5: 128K
       D5 75 C2 4D CA EA CA 23 8C 77 C6 1C 26 60 B7 D2>)
(   6,<2012-06-02 03:30:56.406 -0500>,<Administrator>,<TOPSPIN>,<proc1d>,<TOPSPIN 2.1>,
      <abs ABSG = 3 
       data hash MD5: 128K
       53 A8 C4 EC 15 DF 6D E8 61 62 8A 94 0C C5 44 5D>)
(   7,<2012-06-02 03:30:56.468 -0500>,<Administrator>,<TOPSPIN>,<proc1d>,<TOPSPIN 2.1>,
      <abs ABSG = 4 
       data hash MD5: 128K
       C5 D1 70 D5 61 84 AA 11 DB 8D 33 D9 C2 FF B2 9D>)
(   8,<2012-06-02 03:30:56.546 -0500>,<Administrator>,<TOPSPIN>,<proc1d>,<TOPSPIN 2.1>,
      <abs ABSG = 5 
       data hash MD5: 128K
       4F 5C 97 7E A9 CB DE DE C3 11 F6 B9 A6 6D DE 02>)
$$ ##END=
$$ 
$$ $$ hash MD5
$$ $$ E2 48 41 8E 59 70 36 29 C7 5D 9B F5 E4 F7 BE CD
##$RELAX= 
##$RELAX= 
##$RELAX= 
##$RELAX= 
##$RELAX= 
##$RELAX= 
##$RELAX= 
##$RELAX= 
$$ [...]
##$TP07= 0
##$TPNAME0= <>
##$TPNAME1= <>
##$TPNAME2= <>
##$TPNAME3= <>
##$TPNAME4= <>
##$TPNAME5= <>
##$TPNAME6= <>
##$TPNAME7= <>
##$TPOAL= (0..7)
0.5 0.5 0.5 0.5 0.5 0.5 0.5 0.5
##$TPOFFS= (0..7)
0 0 0 0 0 0 0 0
##$TUNHIN= 0
##$TUNHOUT= 0
##$TUNXOUT= 0
##$USERA1= <user>
##$USERA2= <user>
##$USERA3= <user>
##$USERA4= <user>
##$USERA5= <user>
##$V9= 5
##$VALIST= <valist>
##$VCLIST= <CCCCCCCCCCCCCCC>
##$VD= 0
##$VDLIST= <DDDDDDDDDDDDDDD>
##$VPLIST= <PPPPPPPPPPPPPPP>
##$VTLIST= <TTTTTTTTTTTTTTT>
##$WBST= 2048
##$WBSW= 25
##$XGAIN= (0..3)
0 0 0 0
##$XL= 0
##$YL= 0
##$YMAX_a= 12571234
##$YMIN_a= -6931535
##$ZGOPTNS= <>
##$ZL1= 120
##$ZL2= 120
##$ZL3= 120
##$ZL4= 120
##$ABSF1= 14.96699
##$ABSF2= -5.58554
##$ABSG= 5
##$ABSL= 3
##$ALPHA= 0
##$AQORDER= 0
##$ASSFAC= 0
##$ASSFACI= 0
##$ASSFACX= 0
##$ASSWID= 0
##$AUNMP= <proc_prof1d_extract.lims>
##$AXLEFT= 0
##$AXNAME= <>
##$AXNUC= <1H>
##$AXRIGHT= 0
##$AXTYPE= 0
##$AXUNIT= <>
##$AZFE= 0.1
##$AZFW= 0.1
##$BCFW= 0
##$BC_mod= 0
##$BYTORDP= 0
##$COROFFS= 0
##$CY= 15
##$DATMOD= 1
##$DC= 0
##$DFILT= <>
##$DTYPP= 0
##$F1P= 0
##$F2P= 0
##$FCOR= 0.5
##$FTSIZE= 131072
##$FT_mod= 6
##$GAMMA= 0
##$GB= 0
##$INTBC= 1
##$INTSCL= 1
##$ISEN= 128
##$LB= 0.3
##$LEV0= 0
##$LPBIN= 0
##$MAXI= 10000
##$MC2= 0
##$MEAN= 0
##$ME_mod= 0
##$MI= 0
##$NCOEF= 0
##$NC_proc= -3
##$NLEV= 6
##$NOISF1= 0
##$NOISF2= 0
##$NSP= 0
##$NTH_PI= 0
##$NZP= 0
##$OFFSET= 14.96699
##$PC= 1
##$PHC0= 30.34973
##$PHC1= 0
##$PH_mod= 1
##$PKNL= yes
##$PPARMOD= 0
##$PPDIAG= 0
##$PPIPTYP= 0
##$PPMPNUM= 2147483647
##$PPRESOL= 1
##$PSCAL= 4
##$PSIGN= 0
##$PYNMP= <proc.py>
##$REVERSE= no
##$SF= 400.130005451299
##$SI= 131072
##$SIGF1= 0
##$SIGF2= 0
##$SINO= 400
##$SIOLD= 131072
##$SPECTYP= <>
##$SREGLST= <1H.CDCl3>
##$SSB= 0
##$STSI= 131072
##$STSR= 0
##$SW_p= 8223.68421052632
##$SYMM= 0
##$S_DEV= 0
##$TDeff= 65536
##$TDoff= 0
##$TI= <>
##$TILT= no
##$TM1= 0
##$TM2= 0
##$TOPLEV= 0
##$USERP1= <user>
##$USERP2= <user>
##$USERP3= <user>
##$USERP4= <user>
##$USERP5= <user>
##$WDW= 1
##$XDIM= 131072
##$YMAX_p= 466163113
##$YMIN_p= -16173892
##$CURPLOT= <Network HP LaserJet P1505>
##$CURPRIN= <$Network HP LaserJet P1505>
##$DFORMAT= <normdp>
##$LAYOUT= <+/1D_H.xwp>
##$LFORMAT= <normlp>
##$PFORMAT= <normpl>
##$SURQMSG= 1
$$ End of Bruker specific parameters
$$ ---------------------------------
##NTUPLES= NMR SPECTRUM
##VAR_NAME=  FREQUENCY,     SPECTRUM/REAL,   SPECTRUM/IMAG
##SYMBOL=    X,             R,               I
##VAR_TYPE=  INDEPENDENT,   DEPENDENT,       DEPENDENT
##VAR_FORM=  AFFN,          ASDF,            ASDF
##VAR_DIM=   131072,        131072,          131072
##UNITS=     HZ,            ARBITRARY UNITS, ARBITRARY UNITS
##FACTOR=    0.0627417313425165, 1,          1
##FIRST=     8223.62146879498, 3457,         -119623
##LAST=      0,             4275,            -119405
##MIN=       0,             -16173892,       0
##MAX=       8223.62146879498, 466163113,    0
$$ Real data points
##PAGE= N=1
##DATA TABLE= (X++(R..R)), XYDATA
$$ [...]
67167 226924 227220 227091 225938 223512 221219 220959 222778 225109 227192 229547 231968 233055 232442 231731 232267 233492
67151 233492 234596 236328 239669 243730 246563 247484 247257 246458 245096 243651 243047 243344 243476 242654 241461 241356
67135 241356 243365 247102 250684 251949 250398 247785 246326 246613 247844 249633 252611 257306 263271 269413
67121 269413 274544 277594 278104 276844 275379 274737 274786 274965 275136 275532 276280 277231 278023 278222 277658 276701 276015 276056
67103 276056 276972 278788 281238 283565 285048 285768 286358 287044 287604 288403 290663 295120 300840 305911 309070 310329
67087 310329 310404 310190 310653 312492 315566 318915 321575 323304 324452 325300 325694 325314 324239 323167 322997 324142
67071 324142 326325 329107 332441 336492 340975 344977 347664 349084 350156 351868 354563 357838 360873 362818
67057 362818 363212 362410 361496 361434 362239 363260 364340 366318 370135 375620 381405 385882 388179 388635 388744 390250
67041 390250 393576 397155 398958 398815 398602 399923 402368 404566 406265 408419 411434 414480 416819 418981 421980
67026 421980 425875 429856 433559 437483 441887 445965 448691 450248 452023 455091 459081 462718 465173 466634
67012 466634 467701 468701 469684 470881 472914 476565 482268 489613 497362 504232 509946 515367 521392 527849
66998 527849 533725 538331 541821 544590 546668 548009 549023 550407 552546 555388 558890 563289 568835 575475
66984 575475 582824 590408 597988 605754 614035 622643 630678 637310 642615 647300 651829 656403 661695 668664
66970 668664 677300 686317 694706 702903 711658 720367 727754 733970 740676 748647 756507 762594 767286 772537
66956 772537 779647 788380 797919 807577 816537 824061 830582 837992 848141 861047 874880 887570 898364
66943 898364 908132 918483 930431 943643 956965 969648 981861 994014 1006092 1017971 1029995 1042678
66931 1042678 1055977 1069445 1083041 1097186 1111842 1126115 1139201 1151418 1163879 1177308 1191559
66920 1191559 1206245 1221509 1238040 1256445 1276581 1297444 1317892 1337631 1357345 1377752 1398795
66909 1398795 1420056 1441607 1463935 1487171 1510938 1534878 1558813 1582492 1606058 1630911 1659037
66898 1659037 1690728 1723540 1754398 1782552 1809894 1838642 1869411 1901310 1933088 1964127 1995038
66887 1995038 2027499 2062949 2101241 2140936 2180790 2220374 2259471 2298011 2336978 2378345 2423271
66876 2423271 2470883 2519482 2568419 2618102 2668717 2719977 2771994 2825406 2880477 2936661 2993223
66865 2993223 3049766 3106151 3162502 3219397 3277504 3336858 3396992 3457873 3520039 3583518 3647268
66854 3647268 3710309 3773039 3836782 3902114 3968157 4033666 4098477 4163625 4230182 4298143 4366527
66843 4366527 4434418 4501645 4568407 4634649 4700073 4764415 4827105 4886949 4943002 4995923 5047703
66832 5047703 5099697 5151409 5201399 5248619 5292434 5332249 5368110 5401294 5433334 5464517 5493988
66821 5493988 5521031 5545221 5565446 5580023 5588406 5592069 5593052 5591950 5587720 5579051 5565559 5547934 5527410
66808 5527410 5505003 5481001 5455120 5426983 5396088 5361460 5322155 5278532 5232508 5186055 5139706
66797 5139706 5092688 5043959 4992677 4938357 4881368 4823025 4764404 4705222 4644488 4582068 4518913
66786 4518913 4455930 4393437 4331694 4271038 4211281 4151693 4091817 4031732 3971458 3910938 3850835
66775 3850835 3792337 3735612 3679243 3621864 3563686 3505760 3448520 3392048 3337152 3284874 3235067
66764 3235067 3186664 3139408 3094139 3050990 3008386 2964501 2919105 2873398 2828582 2785178 2743283
66753 2743283 2702759 2663256 2624405 2585860 2547046 2507437 2467571 2429233 2393837 2360816 2328298
66742 2328298 2295150 2261657 2228357 2195271 2162532 2130815 2100600 2071626 2043611 2016812 1991137
66731 1991137 1965313 1938058 1910007 1883424 1859682 1837776 1815635 1792237 1767948 1743486 1719404
66720 1719404 1696377 1675127 1655796 1637761 1620213 1602705 1585135 1567531 1549942 1532361 1514739
66709 1514739 1497245 1480448 1464908 1450568 1436751 1422821 1408621 1394382 1380506 1367358 1354879
66698 1354879 1342471 1329775 1317464 1306488 1296360 1285050 1271269 1256268 1242647 1231800 1223194
66687 1223194 1215643 1208112 1199425 1188560 1175883 1163235 1152102 1142187 1132389 1122605 1113665 1105732 1097776
66674 1097776 1088962 1079877 1071824 1065172 1058889 1051660 1043108 1033897 1024990 1016992 1009865 1002869 994899 985412
66660 985412 975194 965802 957958 950778 942925 934199 925576 917892 911058 904589 898308 892357 886867 881862
66646 881862 877323 873214 869527 866206 862814 858500 852766 846135 839568 833313 827023 821011 816356 813278
66632 813278 810199 805220 798155 790401 783160 776532 770182 763997 757915 751723 745425 739505 734546 730660
66618 730660 727311 723674 719277 714424 709777 705411 700672 695277 690021 685755 682004 677521 672148 667201
66604 667201 663669 660805 657036 651808 646016 640958 637376 635212 633622 631213 626879 620779 614321 608871
66590 608871 604414 599682 593657 586792 580570 575951 572541 569249 565311 560596 555478 550837 547665 545985
66576 545985 544448 541758 538243 535210 532910 530236 526604 522994 520459 518566 516175 513209 510710 509345
66562 509345 508588 507276 504384 499500 493191 486929 482079 478874 476571 474407 471965 468922 465158 461097
66548 461097 457371 454186 451513 449709 449174 449267 448364 445404 440951 436510 433130 430802 428648 425543 421138
66533 421138 416579 413631 412717 412332 410861 408348 405869 403689 401013 397347 393164 389062 385104 381290 377982
66518 377982 375349 372807 369567 365568 361523 358135 355577 353598 351781 349727 347282 344671 342218 339960
66504 339960 337788 335935 334842 334312 333138 330195 325951 322429 321291 322104 322777 321671 318993 316129 313980
66489 313980 312304 310531 308721 307379 306487 305188 302678 299151 295569 292640 290435 288959 288456 288744 288736 287278
66473 287278 284422 281329 278831 276644 274148 271429 269050 267108 265076 262574 259858 257404 255313 253338
66459 253338 251311 249321 247559 246196 245446 245472 246012 246272 245478 243624 241500 239885 238889 238158 237444 236734 236029
66442 236029 235263 234367 233180 231433 229158 227000 225804 225870 226815 227952 228436 227308 224209 220238 217395 216761
66426 216761 217558 218311 218481 218565 218975 219403 219212 218050 216043 213591 210995 208320 205786 204109 203822 204181 203522
66409 203522 201240 198675 197322 196730 195226 192460 190071 189567 190483 191116 190510 189172 188222 188364 189540 191154
66393 191154 192492 193094 193019 192985 194052 196565 199163 199506 196699 192611 190051 189903 190844 191538 191905 192131 191783
66376 191783 190564 189045 187835 186649 184945 182987 181558 180928 180802 181041 181731 182663 183340 183551 183525 183531 183617 183578
66358 183578 182868 180834 177528 174176 172274 172160 172754 172704 171545 169865 168677 168572 169144 169370 168750 167897 167611
66341 167611 167655 167009 165293 163312 162133 162158 163275 165331 167941 170097 170568 168863 165672 162270 159595 157978
66325 157978 157583 158638 160942 163454 165001 165451 165646 165964 165570 163596 160618 158204 157109 156594 155659 154452
66309 154452 154077 155272 157490 159380 160087 159934 159652 159127 157447 154325 150905 148732 148284 148857 149512 149578 148659
66292 148659 146887 145098 144131 143914 143713 143265 143155 144034 145886 148113 149955 150859 150814 150414 150363 151018 152435
66275 152435 154464 156425 157186 156257 154488 153045 151927 150292 147984 145838 144486 143718 143129 142620 142122 141569
66259 141569 141340 142103 144112 147194 151126 155182 157628 156969 153914 150817 148938 147473 145674 144298 144092
66244 144092 144236 143600 142537 142135 142399 142589 142809 143800 145342 146194 145790 144909 144437 144257 143605 141943 139337
66227 139337 136428 134169 133289 134024 136365 140034 143962 146589 147387 147509 148186 149195 149785 150372 151867 153747
66211 153747 154323 152943 150524 147793 144505 140848 138210 137714 138930 140729 142523 143935 144153 142710 140582
66196 140582 139534 140274 141753 142335 141450 140213 140471 143023 146710 149535 150605 150579 150434 150496 150653 150560 149463
66179 149463 146734 142944 139593 137418 135917 134966 135673 138669 142580 145410 146822 147764 148380 147791 145907
66164 145907 144023 143240 143291 143320 142971 142326 141529 140972 141235 142334 143455 143816 143501 143166 143356 144423 146580 149512
66146 149512 152143 153290 152572 150532 148181 146619 146708 148433 150627 151800 151491 150639 150564 151731 153462 154597
66130 154597 154363 152764 150377 147753 145015 142074 139256 137558 138040 140766 144363 146852 147124 145673 143914
66115 143914 142908 142842 143516 144905 147012 149433 151383 152194 151712 150298 148563 146999 145657 144289 142979
66100 142979 142533 143762 146261 148385 148820 147951 147264 147644 148806 150231 151828 153342 153859 152629 150141 147765
66084 147765 146373 145787 145464 145153 144879 144914 145897 148371 151905 155119 156915 157403 157447 157826 159128 161697 164931
66067 164931 167087 166785 164641 162532 161285 160051 158231 156879 157357 159285 160841 160876 159920 159245 159759 161807
66051 161807 165107 168447 170182 169636 167787 166199 165622 165941 166990 168693 170533 171660 171820 171801 172669 174601
66035 174601 176569 177155 175847 173713 172636 173598 175800 177674 178547 178959 179560 180278 180505 179585 177107 173431
66019 173431 170015 168535 169283 170908 172000 172335 172297 171892 171012 170084 169569 169178 168428 167722 167972 169206 170470
66002 170470 171202 171885 173175 175188 177884 181178 184126 184861 182354 177940 174333 173258 174524 177027 179667
65987 179667 181356 181283 179859 178718 179073 180408 181452 182055 183146 184864 185955 185606 184918 185544 187402 188925
65971 188925 189399 189714 190625 191614 192189 193181 195640 199066 201906 203529 204687 206135 207789 209393 211212 213739
65955 213739 217136 221033 224584 226961 228348 230195 233794 238809 244031 249298 255470 262437 268526 272499
65941 272499 275081 277719 280672 283334 285829 289149 293509 297363 298435 295755 290789 286592 285399 286725
65927 286725 287980 287040 283953 280169 276747 273628 270200 266181 262151 259256 257974 257190 255180 251653 248079
65912 248079 245778 244627 244053 244240 245465 247095 248206 248699 248819 248103 245954 243035 241036 240964 242406 244352
65896 244352 246048 247232 248424 250878 255372 260941 265536 268051 269114 270014 271609 274254 277903 282020
65882 282020 285994 289701 293190 296031 297879 299554 302451 306636 310546 312996 314649 316982 320591 324996
65868 324996 329443 333340 336484 339379 342826 346833 350514 353409 356171 359513 363343 367603 372970 379563
65854 379563 385646 389064 389865 390216 391502 392604 391458 387495 382066 377072 373662 371731 370111 367438 363275
65839 363275 358419 354022 350638 348135 346015 343443 339366 333243 325730 318254 311759 305984 299992 293243
65825 293243 286134 279649 274488 270449 266699 262763 259081 256260 253938 250982 247029 243251 241012 240104
65811 240104 239012 236842 234233 232290 231429 231659 233097 235408 237317 237768 237450 238123 240216 242036 241919 240485
65795 240485 239964 241513 243935 245131 244363 242834 242323 243564 245944 248510 250885 253177 255418 257512 259555
65780 259555 261701 263718 265251 266694 269290 273834 279608 285112 289746 294282 299612 305553 311225 316269
65766 316269 321101 325883 329791 331894 332608 333571 335717 337935 338204 335867 332163 328619 325593 322615 319475
65751 319475 316369 313270 309692 305165 299687 293768 288230 283882 281034 279208 277451 275172 272747 271330
65737 271330 271920 274476 277934 281118 283537 285322 286778 288465 291386 296364 303013 309809 315504 320179
65723 320179 324752 329825 335329 340837 345732 349215 350636 349896 347342 343403 338516 333155 327630 321950
65709 321950 316138 310427 304818 298774 292073 285836 281962 281249 282705 285046 288279 293170 299536 305950
65695 305950 311244 315787 321119 328686 338942 350988 362768 372177 378627 383328 387585 391135 392689
65682 392689 391778 389131 385273 379749 372125 362945 353107 342898 332203 321142 309821 297982 285734
65669 285734 274312 265187 258537 253336 248779 244765 241154 237653 234582 232667 231669 230167 227283 223789
65655 223789 220883 218594 216179 213547 211429 210447 210721 212089 213989 215278 215015 213497 211984 211384 211608
65640 211608 212131 212600 212852 212927 213294 214744 217782 222187 227082 231344 234194 235718 236715 237883 239502 242133
65624 242133 246892 254111 262184 269010 274745 281949 292467 305246 318020 330292 343417 358181 373703
65611 373703 388854 403475 417499 429837 439252 446089 452158 458664 464891 469264 471307 472207 473693
65598 473693 476770 481443 487182 493371 499380 504503 508107 510007 510609 510525 509998 508780 506313 501691 493729
65583 493729 481817 466931 451060 435269 418977 401683 384587 369436 356246 343386 329930
65572 329930 316779 305282 295818 288025 281350 274860 267544 259571 252420 247034 242545 237703 232861 229490
65558 229490 228242 228520 229548 230632 230612 228575 225425 223565 224316 226444 227742 227372 226021 224432 222679
65543 222679 220746 218998 217880 217542 218016 219558 222492 226586 230664 233207 233636 232929 232761 234122 237064
65528 237064 241475 247441 254679 262220 269156 275579 282436 290496 299758 309854 320761 332727 345436
65515 345436 357546 367538 375134 381505 387803 393821 398403 400828 401228 399811 396398 390918 383842 375770
65501 375770 366850 356887 345896 334336 322910 312207 302492 293749 286000 279498 274468 270653 267352
65488 267352 264030 260842 258443 257223 256691 255743 253809 251683 250788 251486 252558 252705 252079 251878 252866 254866
65472 254866 257306 259306 259420 256493 251224 246030 242783 241177 239726 237684 235287 232648 229514 226171
65458 226171 223717 223017 223729 224639 224688 223593 221943 221004 222074 225350 229425 232376 233440 233270 232604 231443
65442 231443 229924 229146 230155 232407 234337 235479 237018 239997 243941 247802 251365 255028 258894 262816
65428 262816 266789 270452 272751 273003 271974 271042 270573 269937 268803 267409 265764 263554 260779 257562 253498
65413 253498 248249 242700 238313 235273 232531 229846 228315 228341 228518 227479 225756 224640 224079 222989 221259
65398 221259 220174 220784 222647 224323 224670 223650 222237 221467 221510 221849 222312 223299 224808 226072 226607 226929 227631
65381 227631 228470 229124 230266 232927 237048 241436 245021 247496 248976 249698 249936 249663 248509 246541 244768
65366 244768 244190 244590 244894 244525 243792 243179 242905 243025 243273 242971 241710 239951 238407 237203 236359 236576 238397
65349 238397 240784 241836 241196 240653 242063 245553 250160 255244 260601 265970 271160 276238 280946 284234 284965
65334 284965 283115 280039 277564 276737 277128 277268 276105 274050 272324 271516 271392 271928 273567 276216 278843 280550
65318 280550 281420 281961 282412 283116 284846 288001 291899 295554 298872 302548 307142 312912 320199 329143 338969
65303 338969 348208 355916 362491 369319 377777 388308 400063 411552 421925 431385 440136 447352 451766
65290 451766 452982 451557 448029 442735 436578 430956 426433 422070 416697 410458 404472 399232 393963 387669
65276 387669 380163 371766 362511 352418 342493 334558 329417 325598 320667 313856 306656 300758 296223 292136
65262 292136 288229 284973 282471 280227 278025 276207 274940 273902 272897 272200 271990 271961 271780 271451 271001 270319
65246 270319 269628 269533 270202 271096 272085 274113 277776 281693 283680 283654 284046 286644 290076 291440 289827 287170
65230 287170 285819 286384 288004 289697 290921 291487 291604 291744 292030 291876 290557 288048 285127 282850 281971 282424
65214 282424 283014 282003 278557 273570 268771 265187 262837 261553 261310 261667 261583 260217 257658 254701 252179
65199 252179 250549 249702 248942 247487 245287 243182 242056 242043 242622 243226 243564 243673 243834 244120 243935 242501 240123
65182 240123 238433 238748 240534 242218 243273 244587 246586 247956 246943 243600 240006 238139 237929 237643 236007
65167 236007 233609 232069 232123 232999 233617 233743 233611 233104 232148 231601 232564 234616 235745 234626 232261 230642 230408
65150 230408 230768 231386 233133 236705 241318 245251 247249 247158 245716 244185 243750 244730 246462 248243 250063 252100
65134 252100 253958 255061 255638 256511 257906 259198 260127 261535 264338 268327 272665 277258 282753 289141 295130
65119 295130 299378 301988 304384 307910 312773 318061 322424 325032 326457 328702 333827 342130 351897 361204
65105 361204 369731 378478 388030 397873 407585 417887 429829 443321 457338 471543 486953 504796
65093 504796 525494 549153 576234 606847 639847 673790 708911 747246 790366 837431 885671
65082 885671 932207 975127 1013595 1047843 1078958 1108037 1135268 1159935 1181146 1198298 1210977
65071 1210977 1218694 1220650 1215737 1203248 1184036 1160589 1135202 1108105 1077930 1043952 1007044 968291
65059 968291 927596 884422 839545 795353 754293 717244 683261 650674 618605 587640 558975
65048 558975 532877 508424 485048 463741 446028 431929 419765 408068 396965 387429 379854 373914
65036 373914 369343 366062 363620 361210 358540 356273 355203 355100 354691 352834 349512 345606 341910 338615 335685
65021 335685 333362 332077 331970 332639 333307 333182 331905 329882 328088 327279 327427 328044 328818 329609 329981 329274 327275
65004 327275 324492 321689 319447 318157 317979 318665 319749 320937 321913 321869 320029 316897 314202 313027 312591 311491
64988 311491 309556 307679 306253 304757 302756 300363 297689 294632 291380 288449 286079 284148 282631 281368
64974 281368 279351 275244 269121 262939 258759 256955 256530 256541 256638 256680 256533 256148 255504 254729 254416 255277 257085
64957 257085 258542 258711 258120 257962 258785 260637 263947 269221 275898 282334 287046 289632 290715 291588 293617
64942 293617 297175 301116 303884 305032 305137 304589 303471 302555 303234 306086 310240 314473 318171 320974 322505
64927 322505 323092 323989 326015 328405 329674 329324 328106 326872 325787 324470 322363 319079 314841 310541 306937
64912 306937 303860 300571 296726 292690 289100 286578 285612 286072 286823 286400 284291 281286 278488 276264 274203
64897 274203 271671 268284 264168 259996 256650 254738 254490 255902 258512 261058 261981 260831 258982 258555 260512
64882 260512 263882 266684 267371 265640 262410 259268 257573 257591 258369 258668 258115 257392 257331 258030 259013 259977 261006
64865 261006 262082 262802 262816 262371 262130 262614 264081 266819 271069 276423 281594 285215 286989 287908 289297 291722
64849 291722 294741 297485 299429 300863 302807 306287 311451 317428 323210 328467 333308 337580 341031 344026
64835 344026 347374 351163 354499 356807 358735 361134 363592 364832 364380 362984 361362 359403 356814 353843
64821 353843 350913 347999 344816 341410 338293 336092 335093 334853 334363 333062 331648 331275 331857 332045 331143 330033
64805 330033 329466 328329 324861 319264 313747 309783 306444 302026 296537 291747 289103 288289 287864 286811 285322
64790 285322 284330 284519 285770 287458 289148 290814 292396 293387 293226 292141 291226 291394 292317 292811 292348 291778 292221
64773 292221 293600 294823 295371 296040 297904 301036 304607 307918 310918 313913 317279 321528 327216 334478 342723
64758 342723 351009 358870 366689 375110 384163 393272 402068 410610 418495 424420 427363 427765 426630 423787
64744 423787 418207 410040 401067 392837 385582 379393 374995 372363 369802 365764 360838 356732 353993 352109
64730 352109 351058 351034 351015 349568 347183 345939 346474 347087 346545 346071 347425 350473 354108 358550 364981 373223
64714 373223 381310 387609 392428 397292 403179 409703 415775 420939 425904 431385 436702 440523 443067 446220
64700 446220 450815 455275 458109 460369 463721 466930 466618 461642 454579 448278 442760 436408 428715 420590
64686 420590 412940 406136 400228 394652 388251 380427 371860 363465 355428 348100 342917 341020 341395 341809 341426
64671 341426 341177 341674 342338 342859 344017 346243 348538 349689 349792 349777 350193 351242 353256 356115 358767 360338
64655 360338 361340 362654 363730 363129 360864 358716 357725 356484 352822 346489 339473 334062 331174 330135 329416
64640 329416 327819 325496 323649 322923 322540 321629 320896 321969 325248 329433 333374 337331 341878 346504 350317
64625 350317 353686 358120 364461 372098 380244 389245 399995 412437 425232 436773 446121 453059 457776
64612 457776 460623 461854 461530 459838 457337 454428 450705 445599 439741 434747 431115 427203 421231 413759
64598 413759 407073 402431 399205 396725 395565 396428 398991 402700 407878 415045 423668 432634 441715 451664
64584 451664 462989 475489 489009 503752 519582 535585 550680 564313 576345 586580 594684 600580
64572 600580 604822 608412 611866 614391 614477 611590 606759 601078 594299 585668 575596 565428 555828 546519
64558 546519 537466 529036 520828 511631 501025 489864 478575 466280 452657 439654 429833 423298 417502
64545 417502 410102 401045 391845 383795 377232 371801 367049 363037 360438 359624 359733 359319 358052 357081 357473
64530 357473 358897 360322 361414 362640 364329 366420 369112 373015 378239 383641 387431 388616 387790 386542
64516 386542 386153 386707 387249 386741 384967 382505 379768 376282 371308 365272 360061 357310 356599 355935 354080 351716
64500 351716 350094 349200 347992 346105 344370 343461 342751 341169 338918 337644 338569 340823 342182 341531 340103
64485 340103 339876 341081 341946 340995 338883 337602 338322 340554 343091 345120 346410 346987 346913 346243 345153 344281
64469 344281 344690 346986 350449 353601 355849 358025 361014 364413 367148 369106 371311 374429 377835 380530
64455 380530 382522 384842 388472 393672 400125 407261 414505 421699 429292 437719 446572 454859 462079 468482
64441 468482 474088 478228 480460 481251 481000 478910 473885 466427 458685 452438 447760 443818 440088 436371 432344
64426 432344 427801 423066 418672 414813 411377 408199 404951 401101 396450 391657 388018 386745 388299 391953
64412 391953 395947 398660 399866 400336 400226 398889 396713 395884 398116 402304 405783 407565 408914 410830 412609
64397 412609 413450 414210 416605 421312 427570 434191 440348 445826 451162 457374 465080 474032 483717 494052
64383 494052 505178 517084 529979 544611 561503 580023 598931 617972 638464 662104 689462
64372 689462 719729 751755 785311 821534 862151 908217 959696 1016373 1078879 1148527 1226299
64361 1226299 1312315 1405962 1505873 1609693 1714462 1817521 1916833 2010355 2095751 2171228 2236364
64350 2236364 2291481 2336088 2368265 2385697 2387107 2372694 2343622 2301338 2247192 2182151 2106650
64339 2106650 2020920 1925848 1823764 1718380 1613682 1512539 1416201 1325121 1240129 1162574
64329 1162574 1093320 1031972 977427 928965 886290 848554 813985 781017 749677 721480 697862
64318 697862 678775 662693 647793 633126 618783 605085 591957 579377 568135 559286 552484 545596
64306 545596 536790 526728 517944 512146 508925 507114 506359 506731 507619 508048 508103 509275 513123 519847 528257
64291 528257 536769 544172 549680 552783 553467 552586 551642 551772 552828 553524 552584 549738 545808 542085 539594 538748
64275 538748 539515 541861 545878 551382 557678 564034 570241 576310 581826 586142 589257 591819 594034 595000 593443
64260 593443 588748 581151 571498 561185 551763 543821 536422 528210 519020 509911 501728 494205 486607 478702
64246 478702 470837 463405 456671 451056 447210 445547 445659 446422 446955 447500 449172 452890 458839 466850 476541
64231 476541 486802 495945 503257 510043 518193 527735 536788 544141 550911 558972 568407 577365 584214 589070
64217 589070 593197 597611 602446 606922 609459 608332 603075 595269 587307 580193 573117 565398 558089 552930
64203 552930 550226 548724 547432 546445 545709 544138 540683 535513 529255 521699 512278 501629 491586 483402
64189 483402 476711 470475 464397 459128 455350 452849 450422 446922 442654 439294 437915 437573 436657 435186 434580
64174 434580 435245 435735 434702 432487 430255 428647 427965 428677 430688 432793 433795 433699 433040 431729 429598 427487
64158 427487 426422 425938 424552 422012 419811 419154 419528 419767 419653 419801 420647 422257 424670 427738 430822 433235
64142 433235 435097 437461 441487 447372 453976 459695 464130 468828 475884 485858 497674 510516 524853
64129 524853 541099 558067 573584 586304 596195 603376 607233 606896 602233 594225 584364 573637 562028
64116 562028 549221 535754 523025 512024 502661 494711 488772 485512 484367 483866 483232 482920 483633 485537
64102 485537 488575 492716 497509 501973 505369 507605 508557 507549 504144 499112 493985 489782 486652 484567
64088 484567 483655 483821 484653 485871 487289 488202 487546 485157 482265 480080 478315 475970 473324 472009 472868 474746
64072 474746 476013 476483 477021 477842 478341 478511 479505 482512 487627 494115 501285 508959 517497 527462 538830
64057 538830 550536 561434 571770 582925 595362 607696 618370 627530 636400 645296 653184 659106
64045 659106 663191 666286 669323 673155 678371 684993 692630 700920 709462 717383 723490 727013 727971 726949
64031 726949 724844 722595 720409 717295 712032 704736 696895 689646 682626 674740 665482 655165 644466 634329
64017 634329 625878 619776 615622 612254 608599 604185 599147 594068 589629 586167 583723 582530 583011 585037
64003 585037 587635 589899 591921 594405 597677 601586 606243 612206 619872 629115 639550 650713 661938
63990 661938 672643 683099 694496 707848 723040 739350 756662 775518 795914 816714 836618
63979 836618 855126 871897 885665 894953 900064 903272 906337 908477 907592 903026 896200 888867 881866 875519
63965 875519 869968 864586 857941 849114 838667 827943 817862 808782 800898 794103 787767 781379 775322
63952 775322 770562 767648 766325 765970 766000 765890 765180 763592 761138 758223 755530 753438 751543 749293 747231
63937 747231 746954 749456 754103 759730 766231 774407 784679 796739 810250 825221 841693 859627 878999
63924 878999 899624 921094 943482 967947 996033 1028344 1064321 1103065 1143838 1186015 1229461
63913 1229461 1275207 1325202 1380994 1442787 1509660 1580395 1654381 1732205 1815331 1904766 2000381
63902 2000381 2102123 2211597 2331593 2464252 2610705 2772460 2951879 3150888 3370409
63893 3370409 3611887 3878435 4173237 4497080 4848365 5225419 5627692 6054167 6501234
63884 6501234 6962854 7432883 7906692 8380067 8846684 9297137 9720569 10106791 10446848
63875 10446848 10732742 10957962 11118420 11212207 11238439 11196903 11088643 10915985 10681950 10390561
63865 10390561 10048119 9663619 9247536 8810377 8361806 7909782 7459951 7016552 6584284
63856 6584284 6168652 5774318 5404087 5059800 4742966 4453559 4189193 3946834 3725065
63847 3725065 3523814 3342214 3177780 3027636 2889797 2763243 2647416 2541664 2444656 2354360
63837 2354360 2269012 2188031 2111742 2040477 1974270 1912846 1855219 1799696 1745208 1692529 1643404
63826 1643404 1598556 1557343 1519364 1485413 1456479 1432521 1412744 1396688 1384481 1376153 1371022 1367838
63814 1367838 1365511 1363781 1363176 1364302 1367333 1372223 1379003 1387507 1397024 1406593 1415543 1423568 1430492 1436174
63800 1436174 1440317 1442149 1440776 1436251 1429778 1422226 1412890 1400425 1384570 1366111 1345446 1322252 1296490
63787 1296490 1268786 1239675 1209307 1178040 1146457 1114583 1081920 1048587 1015675 984091 953641
63776 953641 923665 894129 865794 839689 816420 795449 775157 754483 734524 717446 703515
63765 703515 690448 676263 661564 648035 635833 623892 612085 601445 592311 583759 575187 567412
63753 567412 561687 558309 556487 555027 552906 549709 545811 541816 537759 533271 528451 523913 519833 515647
63739 515647 510947 506003 501024 495618 489550 483473 478132 473138 467409 460800 454582 450050 447220 445164
63725 445164 443216 441437 440077 438917 437188 434117 429779 425524 423254 423922 426770 430161 432836 434132
63711 434132 433427 430298 425345 420252 416623 415111 415732 418306 422052 425388 426968 426789 425712 424182 422242
63696 422242 420560 420296 421601 423096 423405 422649 421953 422011 422701 423743 425129 427048 429845 433890 439076 444584
63680 444584 449537 453839 458106 462921 468309 473650 477855 480092 480852 482051 485476 491219 497898 504142
63666 504142 509440 513972 518372 523437 529264 534700 538374 540295 541622 542828 543014 541343 538232 534606
63652 534606 530747 526597 522574 519244 516562 514287 512976 513727 516821 521302 526067 530792 535544 540044
63638 540044 543898 547374 551388 556455 561803 565847 567686 568046 568594 570390 573191 576057 578198 579242 579287
63623 579287 579110 579879 582149 585238 587915 589500 590018 589612 588410 586888 585841 585829 586918 588904 591444 593995
63607 593995 595950 596805 596032 593121 588213 582469 577111 572154 566764 560778 555044 550091 545416 540617 536505
63592 536505 534350 534406 535724 537089 537668 537178 536108 535586 536469 538677 541842 546215 552305 559887 568149 576731
63576 576731 585844 595438 605105 615039 626245 639366 653873 668926 684538 701303 719318 738108
63564 738108 757569 778326 800838 824622 848963 874466 903281 937123 975134 1014413 1053014
63553 1053014 1091842 1132994 1176634 1220209 1260448 1295181 1323351 1344561 1359340 1369124 1375101 1377224
63541 1377224 1374871 1368314 1359159 1349350 1339871 1330176 1318743 1304482 1287695 1269282 1249004 1225356
63529 1225356 1197550 1166930 1135814 1105586 1076704 1049891 1026021 1004958 985796 968552 954586
63518 954586 944846 938626 934771 933364 935268 940348 947185 954598 962638 971834 982208 993564 1006246
63505 1006246 1020877 1037406 1055018 1073106 1091919 1112189 1134582 1159715 1188099 1219540 1253000
63494 1253000 1287697 1324206 1363840 1406893 1451907 1496519 1538308 1574911 1604203 1624756 1635792
63483 1635792 1636813 1628278 1612887 1595059 1578244 1563169 1549032 1535419 1522139 1508135 1491909 1472773
63471 1472773 1450575 1424550 1393749 1358475 1320019 1278940 1235070 1189614 1145678 1105703 1069304
63460 1069304 1034696 1001535 971198 944644 921233 899773 879776 861344 844421 828671 813848
63449 813848 799984 787212 775528 764736 754673 745501 737619 731137 725537 720097 714684 709988 706865
63436 706865 705490 705155 704835 703842 702029 699713 697705 697090 698278 700164 700959 700347 700298 703072 708651 714745
63420 714745 719094 721127 721571 721344 720953 720225 718325 714499 708985 702771 696525 690439 685095 681500 679847
63405 679847 679035 678048 677170 677230 678214 679525 681297 684506 689721 696431 703900 712164 721820 733103 745612
63390 745612 759029 773679 790044 807869 826427 845899 867773 893149 921136 949941 979291
63379 979291 1010658 1044852 1080593 1115904 1149897 1182482 1213215 1241451 1267198 1291027 1313558
63368 1313558 1335854 1359940 1387950 1420740 1457822 1498381 1541698 1586867 1632889 1678864 1723214
63357 1723214 1762795 1793897 1814756 1826649 1832121 1832459 1827250 1816150 1800588 1783452 1767071 1751601
63345 1751601 1735439 1716950 1695325 1670014 1640233 1605551 1566476 1524087 1479556 1434316 1389981
63334 1389981 1347483 1306839 1268325 1233193 1202471 1175702 1151872 1130973 1113556 1099277 1087330
63323 1087330 1078107 1072864 1071692 1073349 1077496 1085594 1098800 1116162 1135722 1156452 1178216 1200670
63311 1200670 1223289 1246168 1270031 1295696 1323877 1354817 1387578 1420437 1452897 1486664 1523657
63300 1523657 1563412 1603447 1641789 1677854 1710766 1738139 1757366 1767712 1770708 1768714 1763316 1754830
63288 1754830 1743045 1728375 1712094 1695200 1677203 1656389 1631309 1601802 1568763 1533396 1496689
63277 1496689 1459156 1420836 1381769 1342402 1303402 1265220 1228360 1193989 1163618 1137923 1116363
63266 1116363 1098140 1082996 1070656 1059961 1049248 1037450 1024184 1008823 990262 968069 943445
63255 943445 918660 895729 875923 860062 848358 839824 832589 825351 818212 811861 806497 802075 799000
63242 799000 797555 796841 795370 792896 790515 788311 783988 775013 761799 747701 735876 726945 719593 712321
63228 712321 704214 694961 685088 675895 668553 663261 659564 657086 655459 653863 651521 648732 646703 646002
63214 646002 645776 644935 643682 643260 644524 647447 651886 657897 665000 671894 677524 682114 686674 691846 697741
63199 697741 704607 712921 722822 733921 745653 757378 768377 778545 789112 801784 816879 833069
63187 833069 849400 866780 886841 909917 934952 960983 987903 1016002 1045622 1077201 1110936
63176 1110936 1146422 1183349 1222475 1264980 1310656 1357547 1403704 1448580 1492412 1535179 1576855
63165 1576855 1617994 1659156 1700033 1739898 1778710 1817125 1855640 1894329 1933142 1971481 2007453
63154 2007453 2038396 2062466 2079198 2088518 2090126 2084222 2071964 2054481 2031934 2004275 1972597 1938905
63142 1938905 1904627 1870059 1835385 1801634 1770337 1742497 1718130 1696604 1677305 1660194 1645941
63131 1645941 1635554 1629809 1628928 1632580 1640092 1650811 1664425 1680839 1699689 1720292 1742262 1765784
63119 1765784 1790940 1817018 1842900 1867886 1891769 1914420 1935877 1956550 1976653 1995546 2012267
63108 2012267 2026387 2037334 2042991 2040384 2028294 2008228 1982233 1950886 1914294 1873903 1831734 1788186
63096 1788186 1742116 1693270 1643506 1595304 1549994 1507817 1468876 1433350 1401184 1372052 1345452
63085 1345452 1320642 1296908 1274263 1253647 1236117 1221891 1210304 1200456 1191803 1184370 1178621 1175009
63073 1175009 1173515 1173732 1175429 1178816 1184231 1191758 1201189 1212041 1223395 1234012 1242833 1249407 1253836
63060 1253836 1256498 1257874 1258465 1258662 1258640 1258232 1256757 1253183 1247061 1239454 1232531 1227903 1225465 1224104 1223195
63045 1223195 1222866 1222894 1222090 1219384 1215343 1211903 1210296 1209694 1208335 1205752 1203181 1201838 1201664 1202166 1203751 1207347
63029 1207347 1212977 1219530 1226017 1232504 1239629 1247682 1256359 1265259 1274527 1285078 1297953 1313101 1329046
63016 1329046 1344305 1359109 1375283 1394466 1416904 1441822 1468237 1495266 1522446 1550278 1580029
63005 1580029 1612621 1648036 1686194 1727960 1774611 1826383 1882247 1941458 2005013 2074987 2152224
62994 2152224 2235013 2320501 2407268 2495930 2587260 2680713 2775387 2871414 2969260 3068060 3165927
62983 3165927 3261760 3355553 3446958 3535098 3620254 3704258 3788140 3870326 3948156 4020325 4086623
62972 4086623 4145885 4195614 4233601 4258622 4269336 4263625 4239800 4198074 4140453 4069530 3987781
62961 3987781 3897827 3802750 3705784 3609452 3515031 3423003 3334137 3250159 3173435 3106114 3049342
62950 3049342 3002911 2965755 2937356 2918709 2911210 2914363 2925317 2941211 2961395 2986755 3017489 3052502
62938 3052502 3090767 3132092 3176245 3222035 3267891 3313082 3357893 3402556 3446224 3487159 3523810
62927 3523810 3555364 3580972 3598776 3606413 3602610 3587732 3562529 3526852 3479907 3421336 3351843 3273255
62915 3273255 3188235 3099214 3007106 2911656 2813583 2715669 2620929 2530252 2442716 2357757 2275997
62904 2275997 2198222 2124745 2055875 1991932 1932478 1876280 1822382 1770708 1721457 1674494 1629541
62893 1629541 1586456 1545209 1506007 1469443 1435917 1404839 1375029 1346016 1318386 1292837 1269635
62882 1269635 1249030 1231233 1215554 1200390 1184695 1168937 1154118 1140432 1127539 1115640 1105400
62871 1105400 1096855 1089108 1081209 1073007 1065090 1058155 1052429 1047522 1042797 1037919 1032891 1027635 1021902 1015661
62857 1015661 1009107 1002109 994221 985674 977833 972004 967918 963966 958836 952433 945404 938435 932183 927275
62843 927275 923955 921936 920744 920028 919510 918985 918394 917466 915247 910756 904662 899711 898474 900650 903324
62828 903324 903966 902481 900190 897834 895277 892557 890250 888836 888361 888662 889457 890295 890856 891163 891070 889998
62812 889998 887900 886008 885486 885454 883717 879706 875350 872551 871174 870484 871202 874508 879583 883744 885155
62797 885155 884366 883172 882890 883862 885708 887692 889303 890695 892260 893864 894768 894216 891892 888209 884435
62782 884435 881918 880692 879472 877578 875967 875487 875163 873706 872021 872344 875074 878338 880872 883507 887211
62767 887211 891370 894993 898419 902768 908495 915238 922422 929478 936278 943767 953173 964045 974308 983113
62753 983113 992484 1004906 1020169 1035909 1050706 1065289 1080911 1097930 1116236 1136080 1158081 1182818
62741 1182818 1210410 1240159 1270690 1301028 1331643 1364284 1400915 1442864 1490486 1543181 1600020
62730 1600020 1660764 1726262 1797833 1876527 1962793 2056188 2155456 2259769 2369985 2487646 2612531
62719 2612531 2742421 2875545 3011664 3149864 3286859 3418792 3543361 3658612 3760874
62710 3760874 3845915 3911563 3957274 3981755 3983204 3961804 3919853 3859180 3780420 3685300 3577595
62699 3577595 3460889 3337000 3207627 3076048 2945789 2818516 2694410 2573931 2458150
62690 2458150 2347834 2243208 2144419 2051593 1964747 1884157 1810410 1743641 1683173 1628257 1578531
62679 1578531 1533321 1491356 1451983 1416047 1384641 1357452 1333270 1311798 1293841 1279658 1268160
62668 1268160 1258117 1249565 1243566 1240876 1241189 1243661 1247929 1254371 1263242 1273841 1285208 1297791 1313752
62655 1313752 1335031 1361454 1391323 1423729 1459658 1500842 1547970 1600290 1656743 1717254 1782782
62644 1782782 1854090 1930682 2011340 2095636 2184338 2278182 2376794 2479107 2584168 2690888 2797260
62633 2797260 2900389 2997218 3084965 3161233 3224261 3272928 3306010 3321654 3318178 3295376 3254505
62622 3254505 3197082 3124339 3037983 2940927 2836935 2729783 2622599 2517246 2413912 2311806
62612 2311806 2210943 2113124 2020656 1934255 1852861 1775663 1703533 1637780 1577970 1521987 1468467
62601 1468467 1418271 1373009 1332745 1296011 1261597 1229296 1198995 1170234 1143017 1118090 1095849
62590 1095849 1075709 1057089 1040272 1025492 1011879 998412 985610 975152 967723 962113 956665 950869
62578 950869 945346 940871 937719 935396 932641 928180 921937 915409 910545 908315 908360 909709 911643 914024 917043
62563 917043 920764 925084 930190 936656 944699 953638 962675 972022 982600 994657 1007505 1020789 1035148
62550 1035148 1051226 1068785 1087434 1107699 1130620 1156579 1185188 1216152 1249638 1285939 1325393
62539 1325393 1368704 1416811 1470199 1528484 1590616 1655239 1721007 1786888 1852076 1915323 1974530
62528 1974530 2027435 2072648 2109552 2137278 2154359 2159611 2153096 2136106 2110432 2077543 2038008 1991621
62516 1991621 1938507 1880269 1819764 1759550 1700677 1642933 1585911 1529849 1475861 1425477 1379624
62505 1379624 1338059 1300092 1265676 1235140 1208058 1183353 1160698 1140741 1123417 1107195 1090922
62494 1090922 1075564 1062843 1052761 1043870 1035796 1029887 1027039 1026211 1025750 1025199 1025074 1025626 1026632 1027947
62480 1027947 1029626 1031813 1035000 1039976 1046944 1055060 1063435 1072242 1082278 1093901 1107169 1122667 1141142
62467 1141142 1162307 1184998 1208931 1235499 1266333 1301618 1340405 1382270 1427983 1478516 1533841
62456 1533841 1592842 1654259 1717593 1783157 1851282 1921475 1992404 2062628 2131104 2196867 2258389
62445 2258389 2313574 2360562 2398552 2427891 2449460 2464167 2473106 2478043 2481322 2485031 2490354 2497983
62433 2497983 2509073 2525436 2548624 2579056 2616293 2660072 2710645 2767824 2829921 2894137 2958047
62422 2958047 3020220 3078927 3130713 3171221 3197694 3210091 3209494 3196060 3168988 3127733 3072298 3002580
62410 3002580 2918657 2822201 2717014 2607687 2497926 2390207 2286353 2187711 2094881 2007787
62400 2007787 1926257 1850381 1780366 1716280 1658183 1606449 1561711 1524193 1492982 1466183 1442008
62389 1442008 1419752 1399756 1382760 1369512 1360547 1355693 1353717 1352922 1352108 1350725 1348325 1344687 1340571
62376 1340571 1337468 1335929 1334592 1331382 1325347 1316848 1306474 1294655 1282153 1269879 1257823 1244900
62364 1244900 1230402 1215127 1200507 1186901 1173434 1159465 1145501 1132350 1119944 1107579 1095138
62353 1095138 1083477 1073468 1065109 1057826 1051318 1045814 1041654 1038961 1037592 1037063 1036610 1035688 1034527 1033954
62339 1033954 1034595 1036370 1038653 1040667 1041927 1042757 1044289 1047369 1051413 1055019 1057980 1061994 1068842 1078424
62325 1078424 1089288 1100654 1112986 1126718 1141348 1156012 1170220 1183745 1196593 1209636 1224735
62314 1224735 1243324 1264904 1287571 1310253 1334004 1360865 1391656 1425318 1460475 1497507 1538813
62303 1538813 1586933 1642416 1703628 1768595 1836786 1908984 1985514 2064888 2144249 2220988 2293580
62292 2293580 2360720 2420040 2468446 2504171 2528204 2543182 2550875 2550980 2542146 2523560 2495604 2459767
62280 2459767 2418297 2373395 2326059 2275960 2222962 2168507 2114935 2063562 2014159 1966440 1921304
62269 1921304 1880062 1842751 1807760 1773106 1737771 1701779 1665395 1628677 1591880 1555922 1521989
62258 1521989 1490551 1461056 1432729 1405364 1379151 1354133 1330285 1307754 1286520 1266181 1246786
62247 1246786 1229560 1215839 1205337 1196518 1188786 1183114 1180057 1178425 1176750 1175028 1174023 1173816 1174349 1176552
62233 1176552 1181295 1187578 1193453 1198702 1204960 1212999 1221661 1230046 1239114 1250004 1262056 1273833 1285356
62220 1285356 1298094 1313246 1331096 1351631 1374518 1398538 1422119 1444849 1467970 1493239 1521550
62209 1521550 1552430 1584531 1616901 1650096 1685803 1725169 1768122 1814769 1866461 1924414 1987801
62198 1987801 2054394 2122896 2193511 2266283 2339945 2412360 2480903 2542211 2592889 2631311 2658247
62187 2658247 2675323 2683399 2682597 2672977 2654506 2626842 2589785 2543790 2489899 2429567 2364715 2297447
62175 2297447 2229378 2161604 2095350 2032067 1972729 1917707 1867451 1822467 1782280 1745444 1711274
62164 1711274 1680823 1655227 1633659 1613889 1594592 1576159 1559467 1544791 1532037 1521157 1511945
62153 1511945 1503943 1496883 1491011 1486826 1484596 1484169 1485072 1486870 1489620 1493837 1499883 1507549 1516432 1526309
62139 1526309 1536802 1547093 1556628 1565909 1575866 1586436 1596357 1604477 1610839 1616518 1622978 1631636 1643200
62126 1643200 1656980 1671291 1684953 1698003 1710735 1722682 1733248 1742893 1752862 1763814 1775468 1787695
62114 1787695 1801218 1817095 1836290 1860015 1889523 1924630 1963015 2002108 2041567 2082945 2126886
62103 2126886 2171709 2214916 2254800 2289805 2317543 2335945 2345089 2346691 2341849 2330361 2312231 2288638
62091 2288638 2260875 2229149 2192964 2152153 2107156 2058829 2008489 1957814 1908381 1861506 1818450
62080 1818450 1780048 1745846 1714301 1684367 1656418 1631240 1608686 1587827 1567871 1548334 1528820
62069 1528820 1509383 1490896 1474344 1459924 1447346 1436735 1428568 1422894 1419269 1417375 1417027 1417555 1417881
62056 1417881 1417426 1416520 1415666 1414570 1412042 1406885 1399112 1390294 1382215 1374897 1366509 1355651 1342980 1329921
62042 1329921 1316661 1302760 1289260 1278443 1271222 1266346 1262698 1260936 1261859 1264472 1267124 1269881 1274234
62029 1274234 1280722 1288432 1297041 1307871 1322057 1338630 1355469 1371794 1388776 1407829 1429105 1451906
62017 1451906 1475867 1501265 1528436 1557337 1587583 1618650 1650059 1681708 1714093 1748060 1784211
62006 1784211 1822534 1862345 1902292 1940430 1974729 2003815 2027234 2044975 2056821 2062188 2060456 2051507
61994 2051507 2036046 2015317 1990197 1960574 1925781 1885597 1840569 1791576 1739594 1685868 1631690
61983 1631690 1577791 1524452 1472334 1422563 1375666 1331102 1288399 1248230 1211680 1178845 1148972
61972 1148972 1121792 1097820 1077160 1058761 1041241 1024170 1008111 993521 979935 966401 952629
61961 952629 939410 927749 917926 909652 902726 896837 891091 884793 878695 874275 871544 868919 865827 863950
61947 863950 864827 867528 870153 872539 875777 879782 883414 886668 890673 895335 898891 900325 900575 900721 900453
61932 900453 898988 896064 891212 883471 872871 861135 849923 839283 828638 818186 808303 798617 788983
61919 788983 780467 774044 768984 763875 758663 754236 750415 746000 740690 735528 731250 727502 723895 720737
61905 720737 718388 716847 716215 716701 718043 719853 722616 727225 733345 739455 744969 751007 758373 766099 773128
61890 773128 780390 789708 801290 813943 827583 843745 863099 883893 903935 923331 944222 968151
61878 968151 994546 1021678 1048104 1073010 1095991 1117171 1137210 1156606 1175018 1191568 1205606
61867 1205606 1216842 1225045 1230359 1233907 1237238 1240620 1242516 1241440 1238054 1234721 1233157 1233269 1234337 1236525
61853 1236525 1240826 1248228 1259546 1275518 1296013 1318984 1341079 1360018 1376202 1391544 1406755 1420204
61841 1420204 1429540 1434047 1435174 1435064 1434933 1434636 1433257 1429938 1424546 1417863 1411102 1405141 1400188 1395888 1391416
61826 1391416 1385590 1377515 1367204 1355038 1340574 1322705 1301511 1279191 1258310 1239510 1221844 1205056
61814 1205056 1190367 1178811 1169802 1161908 1154428 1147772 1142819 1140355 1140680 1143264 1147176 1152312 1159728 1170222
61800 1170222 1183146 1197511 1213953 1234402 1259627 1288194 1318311 1349746 1383126 1418181 1453908
61789 1453908 1490162 1527657 1565974 1602629 1634950 1662300 1685623 1705215 1719949 1728818 1732350 1732105
61777 1732105 1729351 1724736 1718814 1712294 1705986 1700999 1698802 1700429 1705651 1713471 1723467 1735928 1750409
61764 1750409 1764905 1777041 1785560 1790105 1790169 1785332 1776306 1764482 1750101 1731939 1709437 1684308 1659160
61751 1659160 1634966 1610666 1584872 1557126 1527681 1497080 1466121 1435506 1405292 1375245 1345915
61740 1345915 1318703 1294674 1273789 1255375 1238697 1222890 1207142 1191470 1176712 1163311 1150729
61729 1150729 1138676 1128284 1121158 1117433 1115432 1113232 1110142 1106849 1104537 1103711 1103661 1103398 1103247 1104758 1108513
61714 1108513 1112929 1116279 1119235 1124224 1132587 1143681 1156582 1171149 1187143 1203687 1220278 1237377
61702 1237377 1255467 1274364 1293831 1313824 1333425 1350407 1362784 1370297 1373780 1373648 1369615 1361320
61690 1361320 1348480 1331114 1310383 1288637 1267575 1246715 1224745 1202116 1181026 1162687 1145753
61679 1145753 1128026 1109017 1090299 1073864 1060686 1050542 1042475 1035256 1027825 1019781 1011624 1004496
61667 1004496 999453 996724 995528 994565 992858 990381 988002 986512 985526 983590 979713 974441 968985 963643
61653 963643 957870 951602 945500 939858 934318 928881 924058 919531 913859 906362 898388 891754 886596 881621
61639 881621 875764 868622 860100 850989 843330 838592 835519 831212 824583 817506 812259 808987 806195 802698
61625 802698 798446 794161 790753 788585 786817 783930 779235 773481 767917 763361 760311 759036 759035 759137 758743
61610 758743 758460 759007 760185 761551 763455 766511 770428 774338 778133 782559 788016 794125 800630 807802 815528
61595 815528 822709 828238 832227 835739 839476 843252 846589 849277 851294 852750 854177 856463 860067 864523
61581 864523 869065 873556 878419 883799 889329 894681 899677 903587 904979 902870 897861 891603 885169 878271
61567 878271 870057 860348 849919 839724 830043 820664 811837 804539 799283 795044 790270 784886 780221 776651
61553 776651 772581 766623 759768 754133 750069 745872 740169 733350 726579 720558 715536 711453 707580 702779
61539 702779 696685 690125 684075 678693 673596 668533 663510 658798 655032 652753 651524 650105 647847 645422
61525 645422 643856 643367 643562 644343 646052 648879 652425 655707 657621 657838 657312 657397 658297 658984 658737 658002 657408
61508 657408 656823 656090 656065 657934 661738 666270 670345 673607 676212 678344 680226 682303 685256 689737 695733
61493 695733 702088 707038 709564 709973 709188 707963 706892 706386 706204 705732 705279 706365 710015 715512 721646 728377
61477 728377 735912 742700 746181 745861 744275 744218 745993 747931 748726 748388 747531 746648 746049 745929 746383 747371 748470
61460 748470 748805 747840 746411 746219 747880 750183 751875 753464 756299 760285 763757 765747 767318 770146 774489
61445 774489 779195 783316 787096 791500 797181 803939 810932 817582 824498 833242 844706 857759 869917
61432 869917 879385 886085 890796 894020 896121 898078 901288 906438 912862 919167 924303 927951 930094 930573
61418 930573 929318 926976 924842 923702 922875 920967 917770 914821 913681 914088 914318 913132 910795 908311 906224
61403 906224 904285 901859 898533 894534 890643 887620 885773 885064 885222 885572 885450 885301 886744 890646 895619
61388 895619 899591 902673 907110 914244 922856 931008 938235 944983 950972 955403 958402 961144 964528 968468
61374 968468 972528 976657 981157 986145 991035 994646 996284 996867 998345 1001703 1006134 1010527 1014910 1019745
61360 1019745 1024554 1028300 1030822 1032990 1035527 1038350 1040743 1041606 1039941 1035937 1031167 1026817 1022160 1015907
61346 1015907 1008618 1002254 997331 992173 985557 978576 972875 968140 962663 955867 949057 943765 940303 938024
61332 938024 936254 934672 933168 931705 930246 928730 927146 925641 924575 924467 925800 928755 933233 939159
61318 939159 946466 954572 962419 969578 976852 984985 993037 999136 1002892 1005996 1010050 1014833 1019244 1022893
61304 1022893 1025884 1027803 1028095 1027173 1026296 1026422 1027802 1030534 1034810 1040661 1048022 1056871 1066754 1076418 1084663
61289 1084663 1091470 1097604 1103154 1107347 1109875 1111542 1113179 1114571 1114985 1114380 1113668 1113989 1115892 1118808 1121108
61274 1121108 1121162 1118796 1115429 1112399 1109494 1105619 1100711 1096300 1094037 1094016 1094834 1095227 1095479 1097157 1101347 1107325
61258 1107325 1113270 1118286 1123276 1129679 1138022 1148093 1159828 1173039 1186633 1199382 1211779 1226044
61246 1226044 1243486 1262392 1279261 1291817 1300178 1305417 1307916 1307336 1303553 1297137 1289071 1280150 1270601
61233 1270601 1260208 1248789 1236355 1222808 1207990 1192544 1178333 1167159 1158931 1151726 1143883 1135573
61221 1135573 1128130 1122434 1118330 1115276 1113112 1112358 1113901 1118072 1123878 1129528 1133988 1137688 1141563 1146039
61207 1146039 1151310 1157830 1165711 1174169 1182496 1191374 1202122 1214611 1226916 1237316 1245767 1252976 1258914
61194 1258914 1263155 1266205 1269449 1273590 1277837 1280990 1283021 1285129 1288262 1291993 1295117 1297096 1298433 1299605
61180 1299605 1300236 1299740 1298252 1296324 1294002 1291077 1288239 1287108 1288739 1292618 1297399 1302119 1306428 1310332
61166 1310332 1314446 1320026 1327845 1337002 1345448 1351915 1356911 1361680 1366639 1371207 1374932 1378206 1381673 1385297
61152 1385297 1388486 1391144 1394134 1398397 1403907 1409843 1415576 1421030 1426327 1431816 1438479 1447534 1459273 1472821
61138 1472821 1487316 1502804 1519539 1536942 1553829 1569297 1582809 1593701 1601273 1605391 1606501 1605171
61126 1605171 1602044 1598079 1594128 1590133 1585209 1578781 1571407 1564353 1558427 1553289 1547868 1541640 1535464 1530677
61112 1530677 1527148 1522955 1516563 1508774 1501660 1496010 1490942 1485799 1481166 1477870 1476255 1476838 1480491 1487175
61098 1487175 1495471 1504188 1513734 1525198 1538922 1554948 1573943 1596168 1619782 1641718 1660527 1677329
61086 1677329 1693792 1710229 1726102 1741353 1756496 1771951 1788050 1805361 1824437 1845301 1867514
61075 1867514 1890668 1914592 1939210 1964383 1989741 2014450 2037198 2056739 2072802 2086707 2100892
61064 2100892 2117199 2135223 2152662 2167571 2179909 2190654 2200149 2208169 2214932 2220809 2225215 2226998
61052 2226998 2226053 2223443 2219799 2214839 2208709 2202352 2195806 2187302 2175008 2158848 2139784 2118226 2094044
61039 2094044 2067317 2037933 2005200 1969122 1931689 1895676 1862227 1830398 1798786 1766773 1734618
61028 1734618 1703346 1674313 1648022 1623655 1600501 1579096 1559802 1541069 1520955 1500163 1481834
61017 1481834 1468069 1458062 1449804 1442061 1434345 1426498 1418993 1412450 1406301 1399185 1391193 1384395 1380442
61004 1380442 1378936 1378904 1380599 1384698 1390767 1397765 1405495 1414654 1425949 1439859 1456500 1475140 1494635
60991 1494635 1515030 1537800 1563861 1592513 1623188 1656913 1694751 1736029 1779768 1826919 1879305
60980 1879305 1936923 1998223 2062861 2132333 2207777 2288875 2375375 2468216 2568549 2676678 2792459
60969 2792459 2915900 3046982 3185547 3331757 3486226 3649895 3824397 4012314 4216280
60960 4216280 4438017 4679082 4942196 5230749 5547288 5893756 6273266 6690679 7151889
60951 7151889 7664094 8236915 8882099 9612381 10441990 11387708 12467624 13699869 15105881
60942 15105881 16714380 18555769 20645564 22967511 25462076 28014531 30446503 32537979
60934 32537979 34098866 35058342 35503066 35628543 35643030 35694507 35846906 36076734 36266564
60925 36266564 36218163 35717463 34631929 32973394 30880884 28546207 26143137 23796889
60917 23796889 21586017 19553414 17716014 16073901 14618119 13334685 12206012 11212851
60909 11212851 10336885 9562202 8875527 8265959 7724031 7240558 6806923 6416545 6064846
60900 6064846 5747179 5457950 5192640 4949459 4727658 4525020 4338433 4166322 4008802
60891 4008802 3865180 3732466 3606710 3485255 3367672 3255189 3149257 3050102 2956530 2867183
60881 2867183 2781559 2699492 2620397 2543757 2469715 2398295 2328636 2260218 2194409 2133327 2077173
60870 2077173 2024106 1972989 1924765 1880468 1839219 1799267 1760180 1722788 1687422 1653475 1620640
60859 1620640 1589455 1560235 1532238 1504573 1477510 1452175 1428996 1407162 1386027 1366430 1349722
60848 1349722 1335518 1321360 1305169 1287384 1269957 1253771 1238157 1222833 1208968 1197663 1188310
60837 1188310 1179451 1170718 1162831 1155740 1147963 1138308 1127467 1117198 1108331 1100315 1092424 1084540 1076779
60824 1076779 1069194 1062050 1055534 1048867 1040597 1030527 1020655 1013319 1008805 1005692 1003063 1001173 1000061 998917
60810 998917 997268 995691 994763 994161 993390 992710 992609 992833 992629 991622 989921 987673 984961 981848 978154 973509
60794 973509 968015 962482 957640 953530 950059 947585 946271 945169 942561 937131 928514 917204 904497 892152
60780 892152 881204 871154 860918 850488 841041 833305 826440 818816 809676 799886 791255 785315 782627
60767 782627 782887 785125 787584 788087 785558 781264 777733 776160 775542 774474 772813 771198 769964 769148 768611
60752 768611 767438 764245 759114 754324 751931 751352 750608 749221 748230 747808 746905 745381 744588 745178 745896 745435
60736 745435 744199 743150 741952 739577 736241 733443 731983 730855 728426 724376 720214 717792 717205 716290 712567
60721 712567 705706 697783 691145 686589 683545 681143 678606 675303 671255 667481 665299 665229 666761 669002 671213
60706 671213 672909 673937 674613 675608 677513 680500 684326 688546 692659 696158 698621 699942 700516 701014 701953
60691 701953 703526 705751 708481 711308 713913 716627 720116 724252 727766 729466 729475 728929 728808 729395 730463 731469
60675 731469 731840 731546 731093 730640 729562 727303 724168 720798 717458 714486 712694 712390 712553 712014 711075 710858
60659 710858 711467 712003 712024 711602 710096 706494 701216 696057 691958 688176 684137 680604 678206 676057 672851
60644 672851 668416 663267 657558 651596 646685 644240 644221 645243 646023 646153 645863 645730 646377 647825 649389 650632
60628 650632 651996 653931 655920 657136 657727 658665 660471 662875 665760 669708 675286 682102 688883 694535 699159
60613 699159 703881 709411 714898 718648 719865 719122 717197 714397 711264 708931 708026 707831 707187 705785 704135
60598 704135 702883 702732 704334 707516 711091 714247 717596 722035 727010 730920 733018 733998 734707 735082 734485
60583 734485 732500 729344 725832 722736 719823 715980 710918 706299 704228 704842 706239 706617 705593 703561 701018
60568 701018 698871 698402 700204 703515 706921 709453 710903 711533 711691 711464 710761 710049 710676 713616 717856 720846
60552 720846 720942 718880 716747 716066 717111 719348 721993 724387 726212 727321 727537 727136 727330 729473 733597 738458
60536 738458 743210 748153 753478 758363 762103 765358 769212 773474 776930 779142 780954 783205 785794 788227
60522 788227 790352 792321 794421 797260 801619 807728 814966 822484 829906 837395 845391 854438 864817 876132
60508 876132 887636 899150 911265 924365 937828 950539 961836 971620 979897 986692 992175 996353
60496 996353 998853 999489 998951 998503 999160 1001522 1006046 1012762 1020854 1029308 1038085 1048122 1060274 1074974
60482 1074974 1092758 1114067 1138328 1164396 1192311 1223573 1258906 1296722 1334694 1372018 1409030
60471 1409030 1445147 1478404 1506805 1529106 1544443 1552234 1552568 1546063 1533498 1516236 1496629 1477010
60459 1477010 1458361 1440685 1424330 1409969 1397689 1387407 1380039 1376861 1377693 1381127 1386731 1395596 1408402
60446 1408402 1424506 1443629 1467079 1496452 1532231 1574331 1622744 1676687 1734261 1793962 1855532
60435 1855532 1918342 1980089 2038327 2092283 2141778 2185398 2221499 2250677 2275672 2299024 2321964
60424 2321964 2344925 2367271 2386525 2399434 2403986 2399124 2382719 2351807 2305434 2245799 2175909 2097595
60412 2097595 2012761 1925198 1839431 1758007 1680929 1607644 1538682 1475350 1418524 1368015 1322907
60401 1322907 1282285 1245613 1212474 1182296 1154752 1130243 1109327 1091462 1074792 1057563 1039695
60390 1039695 1022755 1008385 996631 985808 974265 962342 952067 944629 938758 932296 924783 917573
60378 917573 911797 907353 903756 900668 897341 892777 887142 882135 879178 877728 875954 872714 868405 864330
60364 864330 861648 860585 860338 860073 860215 862135 866169 870587 873193 873563 873043 872872 873152 873622 874564 876443
60348 876443 879072 881647 883640 885331 887351 889983 893188 897136 902117 907660 912356 915158 916689 918727
60334 918727 922457 927670 933475 939286 945172 951663 959083 966680 972867 977010 980540 985275 990974 995824
60320 995824 999197 1002372 1006237 1009965 1012784 1015506 1019083 1022863 1025807 1028587 1032749 1038106 1042558 1044619
60306 1044619 1044895 1044909 1045619 1047355 1050240 1054134 1058768 1064144 1070335 1076926 1083381 1089960 1097448 1105856 1114220
60291 1114220 1121798 1128503 1133878 1136865 1137268 1136435 1135532 1133922 1130361 1125207 1120111 1115670 1110733 1104374 1097426
60276 1097426 1091445 1086917 1083171 1079598 1076218 1073205 1070451 1067652 1064414 1060204 1054607 1047920 1041406 1036708
60262 1036708 1034792 1035366 1037382 1040164 1043950 1049215 1055811 1063205 1071407 1080895 1091382 1101368 1109558 1116310
60248 1116310 1123038 1130530 1138650 1147585 1158342 1171570 1186458 1201169 1213857 1222874 1226686 1224474 1216790
60235 1216790 1205030 1190112 1172130 1151492 1129985 1110221 1093881 1080654 1069007 1057922 1047619
60224 1047619 1038645 1030793 1023388 1016261 1009821 1004185 998949 993887 989146 984411 978551 970709 961476 952561
60210 952561 945550 941228 939575 939809 940673 941324 941867 942695 943607 944115 944302 944640 945006 944695 943682 943296 945082
60193 945082 949119 953840 957566 960085 962511 965525 968101 968510 966558 964243 963839 965747 968482 970323 970564
60178 970564 969654 968773 969057 970720 973035 975465 978430 982556 987711 993406 999729 1007080 1015278 1023776 1032635
60163 1032635 1042492 1053606 1065686 1078620 1092554 1107137 1121475 1135110 1148452 1162054 1175991
60152 1175991 1190199 1204896 1220312 1236152 1251494 1265315 1277401 1288819 1300885 1313302 1324054
60141 1324054 1331866 1338009 1344653 1352040 1358587 1363306 1366515 1368442 1368913 1368711 1369364 1370825 1370874 1367833 1362623
60126 1362623 1357196 1352088 1346643 1340626 1334286 1327586 1320807 1315526 1313697 1315652 1319725 1323660 1325736 1325083
60112 1325083 1322078 1318360 1315495 1313452 1311022 1307693 1304306 1301708 1299391 1295858 1290077 1282530 1275029 1269438
60098 1269438 1266225 1264197 1261777 1258557 1255622 1254632 1256494 1260386 1263952 1265100 1264013 1262896 1263418 1265009
60084 1265009 1266076 1266161 1266121 1266781 1268339 1270780 1273900 1277044 1279624 1281923 1284666 1287818 1290606 1292842 1295447
60069 1295447 1299276 1303964 1308380 1311976 1315388 1319800 1325915 1333555 1342086 1351084 1360426 1369891 1379092 1387815
60055 1387815 1396052 1403620 1410345 1416837 1424498 1434180 1445208 1456126 1466038 1474728 1481982 1487530 1491577
60042 1491577 1494783 1497802 1501176 1505349 1510156 1514470 1517070 1517942 1518213 1518626 1518419 1515882 1509957 1501344 1491972
60027 1491972 1483025 1473434 1460931 1444815 1426956 1409574 1392851 1375713 1358350 1342584 1329678 1318869
60015 1318869 1308462 1297610 1286557 1275643 1264694 1253309 1241606 1230516 1221135 1213587 1206830 1199723
60003 1199723 1191988 1183979 1176160 1169203 1163837 1159814 1155682 1150633 1146044 1143960 1144239 1144574 1143355 1141223
59989 1141223 1139575 1138867 1138953 1139862 1141404 1142930 1144355 1146573 1149846 1152490 1152445 1149990 1147665 1147278 1147916 1147395
59973 1147395 1144995 1142004 1139748 1137791 1134448 1128838 1121903 1115289 1109599 1104090 1097849 1090681 1082839 1074526
59959 1074526 1066029 1057920 1050695 1044345 1038670 1033877 1030468 1028471 1027115 1025390 1022702 1018850 1013650 1007036
59945 1007036 999520 992155 985825 980810 977119 974815 973662 972936 972220 972123 973456 975859 978160 980139 982917
59930 982917 987307 992785 998579 1004738 1011388 1017883 1023694 1029359 1035375 1040726 1043844 1044750 1044925 1045123 1044615
59915 1044615 1042806 1040328 1038021 1035785 1033165 1030427 1028457 1027896 1028693 1030232 1031709 1032655 1033194 1033613 1033904
59900 1033904 1034078 1034580 1035705 1036938 1037691 1038437 1039994 1041756 1041981 1040216 1038287 1038246 1040252 1043114 1046029 1048926
59884 1048926 1051820 1054762 1058093 1061980 1066002 1069868 1074226 1080041 1087338 1095201 1102894 1110437 1118069 1125747
59870 1125747 1133228 1140295 1146731 1152243 1156520 1159392 1161132 1162547 1164450 1166927 1169521 1172297 1176215 1182085
59856 1182085 1189575 1197731 1206149 1215120 1224763 1234562 1243787 1252009 1259103 1264967 1269405 1272210 1273279 1272511
59842 1272511 1269510 1263745 1255463 1246290 1238229 1231833 1225937 1219504 1213119 1208260 1205652 1204997 1205908 1208269
59828 1208269 1211656 1215166 1218178 1221075 1225018 1231023 1239182 1248578 1258013 1266936 1275600 1284272 1292597 1299962
59814 1299962 1306281 1312072 1317806 1323394 1328220 1331436 1332358 1330975 1328278 1325934 1325332 1326664 1328854 1330485
59800 1330485 1331005 1331043 1331524 1332758 1334681 1337652 1342355 1348846 1356304 1363959 1371761 1379885 1388056 1395752 1402641
59785 1402641 1408343 1412110 1413466 1413187 1413211 1415422 1420643 1428553 1438063 1447620 1455602 1460931 1463522 1464096 1463443
59770 1463443 1461844 1459275 1456102 1453214 1451170 1449493 1447331 1444786 1443045 1443017 1444286 1445680 1446615 1447610 1449603
59755 1449603 1452840 1456200 1457666 1455882 1451393 1446034 1441035 1436248 1431237 1426274 1421640 1416663 1410413 1403245
59741 1403245 1396751 1391982 1388270 1383995 1378149 1370954 1363344 1356202 1349932 1344433 1339465 1335120 1331900 1330133
59727 1330133 1329328 1328227 1325660 1321403 1316281 1311667 1308889 1308645 1310436 1312647 1313828 1314058 1314514 1315673 1316880
59712 1316880 1318161 1321316 1327906 1336749 1344849 1350794 1355898 1361817 1368574 1375482 1382695 1390786 1399705 1409316
59698 1409316 1420337 1433583 1448526 1463536 1477414 1489826 1500466 1508853 1515140 1520310 1525228 1530071
59686 1530071 1534815 1539579 1544098 1547501 1549294 1550352 1552328 1555943 1560242 1563664 1565596 1566693 1567933 1569775
59672 1569775 1572228 1575295 1579057 1583561 1588844 1594817 1600767 1605317 1607484 1607908 1608527 1610925 1615169 1620155
59658 1620155 1624684 1628200 1630999 1633804 1636887 1639783 1642361 1645914 1652299 1661938 1673599 1686403 1701033
59645 1701033 1718394 1737990 1758528 1779598 1801771 1825175 1848773 1871125 1891478 1910102 1927852
59634 1927852 1945201 1961475 1975323 1986232 1995240 2003721 2011768 2018198 2021896 2022716 2021364 2018952 2016560
59621 2016560 2014597 2012397 2008669 2002540 1994262 1985144 1976738 1969678 1963282 1956708 1950441 1945811 1942860 1939782
59607 1939782 1935300 1930784 1928877 1930510 1934490 1939869 1947330 1957692 1970021 1982130 1992689 2002256 2012173
59594 2012173 2022704 2032379 2039104 2041718 2040346 2035355 2026361 2012376 1992661 1967399 1937968 1906680
59582 1906680 1875689 1845696 1815912 1785475 1754691 1724867 1697422 1673168 1651628 1630730 1608033
59571 1608033 1583006 1557622 1534217 1513317 1493949 1475081 1455789 1434813 1411360 1386212 1361037
59560 1361037 1336748 1313469 1291872 1273276 1258225 1245870 1234938 1224548 1214095 1203409 1193412
59549 1193412 1185730 1181144 1178835 1177505 1176703 1176691 1177490 1178523 1179073 1178910 1178505 1178538 1179060 1179493 1179721 1180625 1182816
59532 1182816 1185275 1186294 1185564 1184130 1182278 1178864 1173335 1167133 1162066 1158102 1153940 1149272 1145199 1142398
59518 1142398 1140105 1137311 1133991 1130325 1125398 1118018 1108977 1101330 1097554 1096983 1096878 1095593 1093560 1091402
59504 1091402 1088710 1085265 1082159 1080678 1080872 1082203 1084842 1089163 1094409 1099078 1102571 1105586 1109124 1113904
59490 1113904 1120370 1128383 1137183 1146533 1157402 1170527 1184963 1199615 1215670 1235639 1259982 1286543
59478 1286543 1313423 1340049 1364484 1382065 1388868 1385781 1377689 1369268 1362695 1358514 1356737 1356766 1357410 1357593
59464 1357593 1356887 1355418 1353515 1351192 1347807 1342624 1335793 1328075 1319457 1309019 1296680 1284004 1272493
59451 1272493 1262062 1252076 1242815 1234635 1226535 1217217 1207260 1198725 1192650 1188240 1184437 1180902 1177387 1173756
59437 1173756 1171202 1172134 1177926 1187467 1198400 1209027 1218544 1226529 1233171 1239383 1245805 1252093 1257926 1264212
59423 1264212 1272337 1282354 1292740 1301843 1308864 1313574 1316080 1317122 1317832 1318681 1319098 1318462 1317008 1315407
59409 1315407 1313888 1312259 1310527 1308996 1307921 1307555 1308397 1310871 1314679 1318983 1323396 1328412 1334657 1342038
59395 1342038 1349865 1357541 1364861 1371810 1378441 1384942 1391632 1398730 1406013 1412585 1417181 1419090 1418925 1418172
59381 1418172 1417817 1417581 1416551 1414367 1411751 1410155 1410850 1413925 1418120 1422107 1425985 1430965 1437547 1444816 1451817
59366 1451817 1458734 1466285 1475057 1486298 1502298 1524422 1551074 1578918 1606060 1632972 1660601 1689154
59354 1689154 1718958 1750759 1783975 1815335 1840134 1854794 1858405 1852849 1842047 1830161 1819526 1810359
59342 1810359 1802693 1797955 1797946 1802373 1807741 1808646 1800517 1782097 1755900 1725935 1694823 1663500 1633305
59329 1633305 1606773 1585653 1569356 1556624 1547845 1544213 1544895 1546708 1547084 1546294 1546191 1547593 1549704 1551770
59315 1551770 1554389 1558884 1565643 1573557 1581232 1588488 1596191 1604754 1613565 1622106 1630824 1640201 1649526 1657594
59301 1657594 1664468 1671614 1680164 1689808 1699722 1709938 1721208 1733874 1747437 1761227 1775171 1789743
59289 1789743 1805302 1821757 1838969 1857273 1877111 1897943 1917988 1935477 1949888 1961451 1969725
59278 1969725 1973571 1972702 1968473 1962575 1955386 1946111 1934136 1919632 1903063 1884900 1865832 1846503 1826771
59265 1826771 1805811 1783353 1760312 1737744 1715676 1693555 1671459 1650072 1629623 1609740 1590425
59254 1590425 1572319 1555717 1540074 1524907 1510603 1497957 1487471 1479443 1474097 1471054 1469375 1468860
59242 1468860 1470797 1476607 1486103 1497779 1510303 1522689 1533240 1539501 1539537 1532801 1520094 1503621 1486912
59229 1486912 1473355 1464311 1459161 1457038 1457463 1459418 1461475 1463668 1468102 1476638 1488645 1501922 1515260
59216 1515260 1529219 1544862 1562763 1582935 1604656 1626187 1645642 1662622 1678646 1695632 1714041
59205 1714041 1732499 1748846 1761437 1769838 1774810 1777756 1779850 1781194 1780552 1776104 1766796 1753180 1737053
59192 1737053 1720418 1704589 1689719 1674836 1658710 1641134 1623193 1606121 1590231 1575279 1561267
59181 1561267 1548317 1536307 1525317 1515939 1508192 1500571 1491334 1480615 1470235 1461499 1454174 1447473 1440789
59168 1440789 1433500 1425482 1418068 1413075 1410401 1407960 1404502 1401034 1398656 1396459 1392841 1387796 1382580 1377869
59154 1377869 1373567 1369759 1366537 1363300 1359564 1356124 1354118 1352984 1350659 1345997 1339932 1334026 1328900 1324555
59140 1324555 1321361 1319773 1319358 1318917 1317908 1317425 1319251 1323828 1329561 1334428 1337814 1340243 1341964 1342991 1344312
59125 1344312 1347463 1352286 1356333 1357379 1355674 1352929 1349937 1346197 1341219 1335033 1327650 1318897 1308796 1297636
59111 1297636 1286008 1275110 1266349 1259972 1254645 1249122 1243768 1239749 1237359 1236018 1235310 1234921 1233942 1231431
59097 1231431 1227596 1223493 1219633 1215803 1212179 1209619 1208574 1208257 1207092 1203757 1198059 1191161 1184618 1178802
59083 1178802 1172723 1165760 1158748 1152530 1146258 1138406 1129151 1120624 1114880 1112466 1112640 1113950 1114831 1114771 1114966
59068 1114966 1117064 1121565 1128228 1137503 1150019 1164813 1179586 1193021 1205632 1218166 1230464 1242335
59056 1242335 1254208 1266328 1278401 1290680 1304236 1319282 1334107 1346643 1356486 1364553 1371341 1376604
59044 1376604 1380397 1383314 1385511 1386211 1384593 1380836 1376102 1371593 1367729 1364118 1360268 1356232 1352483 1349319
59030 1349319 1346653 1344351 1342471 1341018 1339628 1337663 1334629 1330482 1325547 1320103 1314126 1307597 1300837 1294104
59016 1294104 1286955 1278706 1269714 1261472 1254974 1249588 1244080 1238197 1232615 1227871 1224077 1221265 1219085 1216404
59002 1216404 1212107 1206335 1200239 1194522 1188806 1182416 1175329 1168362 1162768 1159358 1157610 1155973 1153508 1150838
58988 1150838 1149015 1147975 1146784 1144895 1142354 1139326 1136402 1134937 1135938 1138701 1141490 1143373 1144563 1145368
58974 1145368 1146015 1147308 1150126 1154161 1158357 1162795 1168988 1177998 1189278 1201700 1214730 1228147 1241498
58961 1241498 1254477 1267257 1280087 1292948 1305675 1317716 1327604 1333456 1334527 1331930 1327761 1323870
58949 1323870 1321277 1319921 1318866 1317409 1316121 1316222 1317967 1320294 1322059 1322895 1322949 1322622 1322626 1323399 1324330 1324251 1322840
58932 1322840 1320950 1319556 1319026 1319160 1319184 1318049 1315863 1314796 1317272 1323241 1330541 1338018 1346834 1358402 1372504
58917 1372504 1388085 1404630 1422078 1440454 1460293 1482378 1506219 1529508 1549816 1566246 1579146
58906 1579146 1589097 1596732 1602641 1606821 1608864 1609051 1608260 1606337 1601535 1592339 1579025 1562924 1545144 1526688
58892 1526688 1508691 1491433 1473866 1455139 1436050 1418065 1401472 1385469 1369767 1355184 1342810
58881 1342810 1333096 1325492 1318608 1311272 1303921 1298399 1295817 1295289 1295307 1295531 1296303 1297090 1296702 1294921 1292949 1292160
58865 1292160 1293033 1295251 1298209 1301334 1304340 1307201 1309777 1311789 1313453 1315704 1319279 1323873 1328689 1333626
58851 1333626 1339461 1346997 1356445 1367579 1380213 1394447 1410463 1427965 1445992 1463676 1481134 1499124
58839 1499124 1517844 1536642 1554942 1572843 1590693 1608738 1627391 1647192 1668224 1690020 1712196
58828 1712196 1734663 1757154 1779128 1800181 1820001 1838130 1854568 1870411 1886684 1902547 1915863
58817 1915863 1925824 1933817 1941481 1949201 1956824 1964278 1970709 1974441 1974799 1972895 1969666 1964263 1955414 1943357
58803 1943357 1929283 1913750 1896783 1878651 1859327 1837918 1813963 1788620 1763354 1737940 1711196
58792 1711196 1683256 1655763 1630009 1606178 1584297 1564554 1546405 1528401 1509269 1488698 1467129
58781 1467129 1445530 1425241 1407140 1390824 1375211 1360040 1346147 1334309 1324415 1315859 1308105 1300687
58769 1300687 1293278 1286145 1280269 1276629 1275316 1275431 1275984 1276882 1278755 1281706 1284695 1286756 1288431 1291164 1295369
58754 1295369 1299995 1303973 1307090 1309385 1310752 1311415 1311672 1310857 1307742 1302409 1296526 1291061 1284981 1277128 1268292
58739 1268292 1260349 1254158 1249278 1245032 1240914 1236667 1232901 1230966 1231338 1232887 1234613 1237282 1242252 1249453
58725 1249453 1257744 1266651 1276535 1287554 1299813 1314090 1330954 1349107 1365841 1379350 1389893 1398660
58713 1398660 1406257 1412195 1415153 1413844 1408317 1400282 1391546 1382254 1371176 1357530 1341950 1325883 1310482
58700 1310482 1295940 1281557 1266697 1251810 1238061 1225933 1214998 1205198 1197206 1191055 1185646 1180407
58688 1180407 1176305 1174168 1173090 1171720 1170416 1170773 1173494 1177757 1182289 1186158 1189033 1191647 1195562 1201655
58674 1201655 1209319 1217754 1227080 1237228 1246695 1253786 1258465 1261721 1263772 1264399 1264698 1266848 1271860 1278529
58660 1278529 1284848 1289925 1294649 1300910 1309807 1320187 1329480 1336353 1341759 1346960 1351551 1354077 1353356 1348369
58646 1348369 1338166 1323196 1305633 1287154 1267283 1245021 1220874 1195934 1170300 1144147 1119259
58635 1119259 1097639 1079247 1062678 1047145 1032284 1017231 1001983 988674 979227 972426 965539 958153
58623 958153 952024 947629 943546 939139 935296 932251 929156 926310 925546 927599 930873 933542 935376 936990
58609 936990 938826 941503 945874 952123 959599 967535 975011 980598 983410 984220 984164 982818 979151 973676 967654
58594 967654 960693 951595 941368 932663 925978 919089 910852 902929 896716 891003 884167 876758 870337 865150
58580 865150 860370 855504 850518 845561 841512 839735 840410 841974 842844 842768 842059 840655 838472 835613 831830
58565 831830 826980 822395 820401 821835 825254 829103 833381 838516 843974 848964 853543 858198 863046 868013
58551 868013 873107 878144 882945 887932 893629 899571 904829 909575 914875 920867 926637 932029 937955 944478
58537 944478 950114 953729 955836 957525 959354 961824 965785 971750 979725 989949 1002780 1017773 1034013
58524 1034013 1051334 1069823 1088278 1104901 1119717 1134592 1150536 1166647 1182019 1196959 1211986
58513 1211986 1227394 1244217 1263690 1285145 1306218 1325813 1345219 1365869 1387895 1411443 1437196
58502 1437196 1464608 1491607 1517098 1541921 1566263 1587976 1604784 1616443 1623492 1625570 1622565 1616055
58490 1616055 1608010 1599001 1588770 1577565 1565829 1553598 1540959 1528061 1513946 1496718 1475626 1451665
58478 1451665 1425589 1397117 1366984 1337729 1311025 1285878 1261065 1237777 1218007 1201452 1185942
58467 1185942 1170373 1155637 1142858 1131918 1121664 1110972 1099824 1089440 1080812 1073292 1065682 1058502
58455 1058502 1053469 1050660 1048001 1044016 1039304 1034973 1031605 1030225 1031933 1035595 1038109 1038193 1037945 1039416 1041671
58440 1041671 1042701 1042351 1041693 1041108 1040732 1041517 1044394 1049336 1056150 1064846 1074438 1083238 1091393 1101285 1114270
58425 1114270 1128923 1143739 1159445 1177071 1195816 1214602 1233899 1254078 1273701 1291273 1307022
58414 1307022 1320995 1331082 1335125 1333730 1329067 1322159 1313211 1303171 1292983 1282468 1271821 1262983
58402 1262983 1257658 1255190 1254260 1255473 1260314 1268671 1279242 1291225 1303758 1314933 1323370 1329767 1335022
58389 1335022 1337911 1336542 1331022 1322730 1312027 1298753 1284167 1270409 1258504 1248391 1240016 1232931
58377 1232931 1225877 1218388 1211778 1207167 1203898 1201504 1201669 1206130 1213780 1221798 1228620 1234165 1238503 1242285
58363 1242285 1247163 1253650 1259570 1262576 1262984 1262182 1259691 1254303 1246992 1240070 1234019 1227444 1219798 1212188
58349 1212188 1205694 1200420 1195728 1190409 1183642 1176835 1173062 1173398 1175514 1177258 1179439 1183266 1187448 1190460
58335 1190460 1193561 1198636 1204743 1209916 1214871 1221621 1229488 1235810 1240002 1243921 1248650 1253791 1259584 1266932
58321 1266932 1275402 1283587 1291371 1299804 1308989 1318040 1326777 1335691 1344688 1353416 1362197 1371274 1380163 1389138
58307 1389138 1399941 1413362 1427617 1440834 1453470 1466465 1478944 1489949 1500587 1512123 1523719
58296 1523719 1534258 1544305 1553855 1560556 1563202 1564864 1569293 1576163 1583045 1589935 1598203 1607008 1614854
58283 1614854 1623331 1635241 1649976 1664469 1677843 1691659 1706627 1722584 1740625 1761627 1783573
58272 1783573 1803849 1823106 1843410 1863734 1881133 1895441 1908963 1922177 1933358 1941790 1948054 1952093
58260 1952093 1954458 1958399 1967077 1979666 1993560 2009119 2028450 2050754 2072954 2094083 2115405 2137233
58248 2137233 2159313 2183053 2209538 2236603 2261831 2287108 2316202 2349180 2383207 2417212 2451469
58237 2451469 2484228 2513460 2540740 2569069 2598315 2626972 2656419 2688640 2721801 2753189 2784597
58226 2784597 2819450 2856659 2893016 2929756 2970656 3015260 3060192 3105726 3154818 3207086 3260101
58215 3260101 3315215 3375485 3439144 3501963 3564927 3632733 3705788 3780703 3857607 3939635 4026167
58204 4026167 4113963 4204223 4301056 4403786 4508273 4614808 4726848 4842969 4958426 5073999
58194 5073999 5194949 5322024 5452141 5587095 5732426 5888175 6050004 6218950 6400615
58185 6400615 6595355 6799283 7014458 7247501 7498408 7761856 8039880 8341991 8672297
58176 8672297 9028168 9412564 9835890 10304351 10818178 11382735 12009412 12703874 13464824
58167 13464824 14295113 15201892 16185348 17240370 18369841 19582888 20880014 22254734
58159 22254734 23709986 25257624 26902666 28646018 30503060 32500543 34654336 36970251
58151 36970251 39467748 42181123 45136231 48350456 51858857 55716133 59970589 64662783
58143 64662783 69851157 75608144 81989915 89049088 96888651 105673329 115591816 126859952
58135 126859952 139770043 154678104 171918793 191777182 214533779 240422321 269465756
58128 269465756 301370151 335475282 370444654 403680258 431193476 448655944 453206589
58121 453206589 444637198 425107570 397911276 366372648 333327127 300938443 270614611
58114 270614611 243063126 218495988 196832489 177812066 161082835 146302922 133193532
58107 133193532 121526178 111111722 101814835 93542718 86201331 79679581 73874745 68703324
58099 68703324 64080781 59917558 56143486 52713979 49585587 46706359 44036361 41557439
58091 41557439 39255945 37113831 35122367 33285764 31602383 30055813 28629213 27313521
58083 27313521 26096144 24956362 23878946 22860718 21898706 20983459 20108714 19276245 18486264
58074 18486264 17733036 17013665 16330971 15684087 15066066 14474144 13912716 13383093 12879831
58065 12879831 12400066 11946876 11520154 11113272 10721993 10348118 9991677 9648204 9316379
58056 9316379 8999708 8697830 8404591 8117421 7840343 7575202 7318340 7068638 6830262
58047 6830262 6604180 6385049 6169904 5962220 5764059 5571672 5382362 5198653 5022292
58038 5022292 4850913 4683877 4524898 4375785 4233837 4098126 3971772 3855270 3744111
58029 3744111 3635971 3533913 3439622 3349911 3262783 3180492 3103452 3027468 2950316 2875019 2803448
58018 2803448 2732836 2661973 2594662 2533233 2474468 2415791 2359844 2308833 2259738 2209550 2160571
58007 2160571 2116213 2075751 2037142 2000957 1967615 1934515 1899721 1865187 1833048 1801957 1769990
57996 1769990 1737809 1706219 1674081 1641250 1610155 1581922 1554322 1525809 1498058 1472358 1447196
57985 1447196 1421558 1396822 1373270 1348622 1322154 1296260 1271888 1246780 1220451 1196441 1176956
57974 1176956 1159466 1141265 1123072 1105479 1086353 1064904 1044056 1025516 1006651 985579 965183
57963 965183 948360 933117 916216 898228 881229 864791 848045 832684 820229 809086 797649
57952 797649 787380 779410 771173 760053 747680 737044 727964 718979 711076 705783 701815 697211 692719
57939 692719 689686 686744 682033 676799 673418 671571 669476 667231 665993 665473 664842 664416 664048 661949 657549
57924 657549 653192 650549 647843 643188 637938 633823 629694 624510 620789 621186 623911 625447 625874 627530 630101
57909 630101 631072 629912 628059 625759 622354 618736 616096 613062 607178 598568 589321 580204 570717 561335
57895 561335 552926 544889 536429 528494 521940 515278 507001 498583 492219 487161 481600 476653 474838 475670
57881 475670 476474 476856 478727 482413 486363 490583 496827 505174 513440 520239 525825 529781 530690 528465 524591
57866 524591 519822 513914 507614 502439 498184 492931 485873 478169 470842 463848 457437 452429 448632 444626
57852 444626 439625 434448 430451 428421 428369 429588 431272 433580 437083 440459 440429 435414 427824 421100 416054
57837 416054 411769 408213 405526 402336 397538 392677 389853 388284 385760 382553 380832 380694 379885 377352 374206
57822 374206 371083 367349 363251 360311 359058 358541 358435 359484 361409 362414 361490 359694 358712 359481 362292
57807 362292 366756 371493 375271 378614 383193 389880 398545 409192 421730 434950 447268 458281 468320
57794 468320 477151 484595 491628 498975 505290 508679 509477 509390 508413 505068 499589 494444 491306 489557 488144
57779 488144 486918 485653 483569 480659 478155 476963 476567 475811 474010 471202 468024 465187 462411 458472 453127
57764 453127 448201 445670 445471 446293 447435 448438 448128 446067 444114 444447 446565 448117 448034 446794 444366 440371
57748 440371 435984 433208 432108 430819 428348 425362 422276 418710 415049 412489 411168 410011 408735 408265
57734 408265 408901 409748 410297 411096 412583 414596 417097 419963 422082 422172 420592 418920 417786 416532 414927 413714
57718 413714 413372 413555 413712 413197 411249 408084 405317 403820 401852 397014 389358 380848 372617 364785 358121
57703 358121 353384 349486 344787 339864 336585 334728 332074 327784 323236 319600 317145 316762 319363 323704
57689 323704 327615 331546 337874 346377 353716 358263 362194 367528 373147 377416 381008 385121 389125 392034
57675 392034 394565 397867 401642 405143 408729 412992 417576 422108 427085 432713 438087 442529 446422 449828
57661 449828 451769 451894 451362 450968 449840 447146 443661 440440 437296 433767 430258 426942 422806 417087 410567
57646 410567 404260 398016 391641 386219 382934 381513 381112 381748 383569 385676 387139 388399 390270 392185 392915
57631 392915 392646 392983 394994 398282 401926 405449 408883 412592 417124 422946 430385 439839 451568 465203
57617 465203 480005 495796 513057 532164 553344 577530 606337 640834 680905 725691 773612
57606 773612 821653 865438 900249 921646 925939 911944 882638 843832 800700 756185 712143 670185
57594 670185 631079 594965 562660 535497 513601 495626 480368 467297 455562 444350 434464 427648
57582 427648 423788 420558 416210 410908 404969 398107 391124 385948 382816 379579 375035 370664 367613 364361
57568 364361 359490 354692 352405 351903 350276 346464 341913 337852 334098 330278 326276 321624 316076 310553
57554 310553 305998 301676 296235 290168 285441 282727 280693 278293 276127 274926 274051 272433 270232 268561
57540 268561 267711 266386 263023 257717 252397 248871 247041 245534 243655 241854 240482 239210 237768 236159
57526 236159 234022 230994 227923 226332 226086 224951 221237 215754 210339 205545 200782 195792 190949 186708
57512 186708 183454 181230 179119 175863 171662 168331 166867 165954 163731 160064 156104 152582 149501 146622
57498 146622 143278 138635 133221 129236 128106 128485 127938 125982 124175 123667 124077 124640 125297 126473 128428 130901
57482 130901 133087 134316 134992 136210 138026 138912 137635 135004 132939 132336 132505 132151 130214 126296 121096
57467 121096 116211 112828 110720 108714 105861 102117 98424 96135 95662 95680 94550 92368 90577 89819 89667
57452 89667 90394 93017 97207 101278 105142 111173 120788 132029 142229 151492 161533 172253 181704 189007
57438 189007 195294 201692 207825 212532 215054 215375 214040 211659 208413 204402 200499 197871 196252 193860
57424 193860 189731 185171 182000 180265 178520 175572 171120 165436 159290 153721 149269 145863 143492 141983
57410 141983 140089 136229 130612 125286 121641 119338 118047 118267 119669 120551 120089 119498 119914 120905 122089 124237
57394 124237 127393 129867 130767 131758 134643 138881 143166 147546 152035 154999 155261 154349 154407 155265 155689 155887
57378 155887 156365 155978 154004 152734 154846 159140 162088 162910 163822 165779 167541 169105 172432 177763 182195
57363 182195 183297 182036 180921 180982 181679 182369 182902 183710 185714 189270 193187 195855 197213 198405 199889 201334
57347 201334 202926 205031 206902 207676 208451 211289 216023 220211 222572 224438 227185 230202 232397 234105 236417
57332 236417 239687 243625 248080 252941 257745 261839 264786 266682 268352 270701 273434 275244 276009 277687
57318 277687 281844 287445 292593 297331 302846 308883 314217 319037 324450 330030 334317 337567 341483 346200
57304 346200 350237 353751 358971 366416 373239 376861 378329 380523 384425 388762 392384 395660 399923 406254
57290 406254 414425 422768 429664 435244 440921 447368 453958 460063 465761 471295 476974 483490 491093 498598
57276 498598 504652 509852 516002 523256 529728 534311 538198 543086 549288 556331 564143 572841 582049 590991
57262 590991 598864 605185 610454 616209 623628 632412 641886 652406 664355 676491 687116 696548 706689
57249 706689 718333 730589 742698 754521 765306 774067 781512 789882 800429 812425 824681 836555
57237 836555 847565 857755 868451 880919 894223 906157 916201 925718 935353 944481 953376 963564
57225 963564 975372 987222 998082 1008834 1020544 1033151 1046425 1060485 1074765 1088162 1100778
57214 1100778 1113902 1127802 1141347 1154396 1168668 1185493 1204242 1223640 1243062 1261997 1279968
57203 1279968 1297695 1316782 1337548 1358571 1378780 1398410 1417484 1435139 1451214 1466921 1483327
57192 1483327 1500550 1518776 1538326 1558231 1576525 1592691 1608280 1624736 1642193 1660688 1680597
57181 1680597 1701346 1721632 1741540 1762594 1785187 1807898 1829918 1851957 1873979 1894356 1912458
57170 1912458 1929985 1948187 1965348 1978544 1986781 1991389 1994382 1997236 2000212 2002302 2002908 2003853 2008403
57157 2008403 2018235 2032844 2051830 2075649 2103846 2134854 2168267 2205393 2246952 2292012 2339592
57146 2339592 2389250 2439594 2488339 2534504 2578570 2620088 2657403 2690284 2720450 2748715 2773802
57135 2773802 2794614 2811416 2824173 2832156 2835997 2837768 2838377 2837314 2835431 2835044 2836373 2836856 2835177 2833160
57121 2833160 2832350 2831490 2828812 2824199 2817565 2807660 2794041 2777971 2760030 2739147 2714958 2688439 2658968
57108 2658968 2623564 2580436 2530544 2474384 2410232 2337375 2258347 2176214 2092233 2007714 1925262
57097 1925262 1846179 1769043 1692492 1616992 1542596 1467773 1392047 1317034 1243431 1169831 1095894
57086 1095894 1023682 954505 887622 823266 763434 708325 655925 606656 564168 529407 498183
57075 498183 467119 437972 413375 392418 373433 357266 344414 332133 317213 298495 273973
57064 273973 238528 186730 114583 16710 -114410 -284815 -498841 -763885 -1090000 -1482735
57054 -1482735 -1941344 -2465344 -3056372 -3711573 -4422322 -5182302 -5989868 -6840002 -7722384
57045 -7722384 -8630749 -9564937 -10518593 -11472730 -12404813 -13294078 -14113732 -14830355 -15417890
57036 -15417890 -15859945 -16129219 -16173892 -15928085 -15319852 -14264394 -12675762 -10501628 -7716608
57027 -7716608 -4245020 92122 5490348 11954510 19101764 26084529 31697782 34715780
57019 34715780 34381817 30764589 24696252 17351211 9838247 3058190 -2289897 -5774293
57011 -5774293 -7347539 -7333221 -6249352 -4622451 -2899091 -1410670 -334961 316501 651716
57002 651716 827015 996882 1282079 1743984 2381188 3155883 4022472 4936503 5857001 6755703
56992 6755703 7620640 8445151 9218832 9932821 10586236 11181813 11721050 12208142 12652657
56983 12652657 13062884 13440451 13784971 14099487 14388064 14652662 14895911 15123003 15337570
56974 15337570 15539142 15727319 15905293 16077296 16246356 16416824 16595515 16787593 16992789
56965 16992789 17205047 17411436 17591311 17723525 17799447 17827364 17823181 17800063 17767160 17731815
56955 17731815 17698202 17666278 17635123 17605524 17577624 17548807 17515939 17477566 17432444 17378596 17315631
56944 17315631 17245831 17171432 17092608 17008595 16918001 16817116 16701078 16568249 16421034 16261688
56934 16261688 16090699 15910889 15729810 15555773 15393659 15246124 15116008 15005126 14912518
56925 14912518 14835907 14773447 14722808 14680602 14644455 14614251 14590247 14571816 14559148 14554192 14558340
56914 14558340 14570586 14589035 14612630 14640463 14671201 14704454 14741207 14781889 14825370 14870642 14917986
56903 14917986 14967752 15019533 15073123 15128745 15185794 15242887 15299246 15354007 15403831 15443582 15470122
56892 15470122 15483544 15484424 15472488 15448755 15416246 15377084 15330956 15277666 15219126 15157342 15092144
56881 15092144 15022146 14946443 14864318 14774879 14677960 14574020 14462620 14342760 14215198 14082317
56871 14082317 13945007 13801608 13650456 13491000 13321773 13140246 12946487 12744806 12540253
56862 12540253 12335409 12131756 11931631 11736915 11547775 11364704 11190122 11026084 10871909
56853 10871909 10725779 10587212 10456263 10331820 10212516 10098201 9988936 9883753 9781939
56844 9781939 9684276 9591402 9501948 9413728 9325776 9238052 9150410 9063155 8977431 8893658 8810730
56833 8810730 8727881 8645998 8565802 8486235 8406238 8326896 8250153 8176196 8103218 8028472 7948434
56822 7948434 7859690 7761627 7657237 7549692 7439276 7325290 7209591 7096014 6987004 6882697
56812 6882697 6782771 6687316 6596244 6509494 6427748 6351848 6281946 6218309 6162253 6115019 6076325
56801 6076325 6045154 6021075 6003134 5987834 5969557 5942897 5903913 5850238 5781775 5701235 5612784
56790 5612784 5519999 5425461 5331414 5239672 5151313 5067245 4988665 4916380 4850482 4791321 4739986
56779 4739986 4697291 4663530 4639861 4628380 4629560 4640738 4657938 4677192 4692336 4693438 4670570 4619627
56767 4619627 4543588 4449163 4343609 4233215 4121963 4011351 3902836 3799928 3706257 3622391
56757 3622391 3546549 3477984 3417677 3366134 3322939 3288652 3264980 3252377 3248966 3251959 3258341 3263643
56745 3263643 3261887 3247935 3219314 3175744 3118447 3050477 2976278 2899637 2822420 2745664 2671115
56734 2671115 2601024 2536804 2478308 2424286 2373611 2326390 2283729 2246174 2212958 2183450 2158632
56723 2158632 2139939 2126956 2117352 2108702 2098931 2085132 2063868 2033597 1995725 1952639 1905565 1854995
56711 1854995 1802236 1749437 1698252 1649200 1602274 1557707 1516006 1477454 1441727 1408180 1376534
56700 1376534 1346986 1319398 1292807 1266253 1239936 1214975 1192004 1170353 1148677 1126231 1103607
56689 1103607 1082271 1063035 1044906 1025995 1005796 985883 967897 951615 935832 920445 906567
56678 906567 894741 884132 873624 862876 852097 841426 830855 820461 810492 801331 793293 786304
56666 786304 779954 773957 768310 762914 757527 752250 747471 743042 738209 732878 728145 724849 722190 718641
56652 718641 713878 709017 705201 702718 701232 700119 698631 696353 693435 690076 686172 681896 678021 674909
56638 674909 671639 667060 661425 656003 651266 646444 640961 635349 630455 626361 622445 618048 612850 606934
56624 606934 600739 594806 589457 584765 580759 577561 575355 574137 573339 571955 569470 566613 564526 563249
56610 563249 561817 559905 558306 557520 556981 556376 556574 558235 560268 560839 559487 557261 555098 552965 550338
56595 550338 546677 541601 535354 528868 522703 516097 507770 497558 486794 477260 470092 465226 461437 457354
56581 457354 453009 449866 448850 449014 448901 448449 448508 449035 448913 447415 444886 442121 439993 439532 441377 445003
56565 445003 449121 452896 456300 459505 462496 465054 466448 465429 461337 455262 449450 445449 443207 441869
56551 441869 441025 441088 442668 445550 448416 450028 450546 450954 451288 450635 449053 447930 447687 446708 443894 440967
56535 440967 440483 442363 444208 444574 444079 443415 442246 440567 439627 440595 443066 445505 446756 446850 446669 446879 447018
56518 447018 445993 443757 441884 441807 443198 444999 447390 451516 457605 464640 471700 478445 484332 488701 491951
56503 491951 495593 500765 507358 514761 522640 530611 537724 542763 545054 545022 543992 543004 541743 539264 535997
56488 535997 533919 534010 534580 533233 529699 525593 522203 519865 518805 518836 518571 516591 513389 510670 508789 506480
56472 506480 503195 500088 498227 497258 496375 495452 494585 493477 491852 489731 487010 483556 479896 476911 474592
56457 474592 472073 469232 467145 466414 466029 464679 462422 460171 458015 455096 451150 447319 444962 444045 443335
56442 443335 442247 441831 443423 446848 450882 455092 459823 464321 466591 465964 464384 464103 465282 466967 468979
56427 468979 471206 472222 470708 467741 465743 465427 465554 465417 465574 465994 465411 463119 459969 456995 454200 451235
56411 451235 448370 446348 445918 447556 450952 454755 457460 458414 457478 454522 450233 446590 445050 444718 443765
56396 443765 442137 441285 441690 442543 443671 445826 448952 451996 454643 457479 460280 461901 462267 462710 463891
56381 463891 465001 465482 465886 466454 466490 465818 465411 465874 466627 467213 468027 469141 469780 469666 469617 470142 470638 470639 470647 471132
56361 471132 471783 472248 472436 471755 469585 467077 466885 470115 474780 478109 479265 479015 478091 476921 475895 474790
56345 474790 472707 469475 466379 464754 464503 464577 464248 463513 463045 464011 466964 470687 473375 475214 478287 483393
56329 483393 488488 491153 491244 490211 489158 488835 490382 494589 500813 507453 513137 517006 518711 518865 518823 519489
56313 519489 520873 522892 525472 527593 527634 525473 523172 522813 524521 527125 529697 531795 533215 534302 535809
56298 535809 537908 539984 541478 542060 541211 539036 537400 538417 541592 544267 545248 545925 547362 548704 549454
56283 549454 550880 553698 556599 558810 561997 567509 573574 577639 580225 584009 589920 596513 602647 608595
56269 608595 614536 619892 624294 627896 630644 632258 632838 632702 631994 631127 631002 631997 633436 634735 636263 638421
56253 638421 640983 644154 648932 655247 661097 664878 667515 670905 675546 681225 688738 698848 710304 720913
56239 720913 730137 738951 747707 756020 764308 773580 783844 794436 805712 818657 832801 846311 858521
56226 858521 871006 885740 903232 922698 943039 963377 983388 1003343 1023492 1043759 1064655
56215 1064655 1087839 1114796 1145321 1178172 1212707 1248889 1286357 1324882 1365502 1409800 1458029
56204 1458029 1509140 1562785 1620224 1683018 1751727 1826283 1907018 1994999 2091545 2197432 2312476
56193 2312476 2436137 2568686 2711232 2864315 3027024 3197849 3375779 3560008 3749089
56184 3749089 3940702 4131672 4317873 4494829 4658818 4806768 4935039 5039518 5117419 5167954
56174 5167954 5190786 5185147 5151278 5091527 5009046 4906282 4785563 4650216 4504156 4351074
56164 4351074 4194371 4036717 3879046 3721302 3564968 3413465 3269105 3130993 2997143
56155 2997143 2867498 2743787 2627559 2519408 2418990 2324672 2234299 2147434 2065819 1990771
56145 1990771 1921472 1856805 1797240 1743532 1694925 1650089 1608549 1569833 1532599 1496175 1461793
56134 1461793 1430857 1403152 1378073 1356078 1337353 1320430 1304010 1288966 1276766 1266949 1257860 1248973
56122 1248973 1240914 1234103 1228711 1224870 1221754 1217900 1213623 1211381 1212332 1214520 1216176 1218563 1223357 1229410
56108 1229410 1234881 1240718 1249003 1259274 1269580 1279978 1291866 1304758 1316942 1328874 1342987 1360341
56096 1360341 1380015 1401513 1425369 1451726 1480681 1513723 1552680 1597590 1647506 1702597 1763501
56085 1763501 1829888 1902319 1984540 2080869 2191472 2312332 2438992 2567743 2694122 2813542
56075 2813542 2923549 3023246 3111121 3185984 3249465 3304835 3353583 3395385 3430512 3459410 3480545
56064 3480545 3491728 3493398 3487892 3475865 3456134 3428393 3392851 3347317 3287823 3212537 3122798 3020782
56052 3020782 2909119 2792723 2677871 2568785 2466964 2373442 2289176 2213676 2146008 2086954
56042 2086954 2037695 1996765 1960874 1928372 1899482 1874011 1851701 1834035 1822437 1815152 1808944 1803287
56030 1803287 1799868 1798723 1798279 1798529 1800606 1803680 1805826 1807484 1810533 1814568 1818020 1822460 1831571 1845886
56016 1845886 1862482 1879824 1898957 1919968 1941432 1963542 1987767 2013342 2038213 2063438 2092257
56005 2092257 2124403 2155849 2184784 2213534 2243783 2274174 2303593 2332731 2361441 2388324 2413803
55994 2413803 2439957 2466731 2491962 2515562 2539903 2565885 2592588 2620813 2652660 2687448 2722533
55983 2722533 2758275 2797553 2840234 2883044 2925276 2969699 3017434 3067045 3119064 3176090 3237711
55972 3237711 3300506 3363619 3429171 3497031 3565091 3635070 3711660 3794983 3880125 3965141 4053222
55961 4053222 4145925 4241041 4338504 4441610 4550661 4662118 4775716 4895663 5023290 5155741
55951 5155741 5293699 5442720 5604586 5774912 5951887 6139686 6340522 6551276 6771242
55942 6771242 7005455 7256897 7522928 7802940 8102199 8425056 8772141 9147478 9560191
55933 9560191 10015826 10514227 11059233 11661611 12328748 13060268 13857251 14726189 15670070
55924 15670070 16685573 17773291 18940560 20190105 21516815 22920231 24409321 25991351
55916 25991351 27669285 29455427 31374099 33444737 35675907 38081941 40691249 43532877
55908 43532877 46632004 50026898 53774328 57931448 62549971 67693313 73436236 79839777
55900 79839777 86954944 94868033 103723402 113699312 125001642 137900597 152738105 169884599
55892 169884599 189737191 212770307 239475703 270109675 304416834 341459650 379391196
55885 379391196 415102078 444242861 462255676 466163113 455875551 434012209 404516929
55878 404516929 371206798 337027656 303951971 273132404 245113493 220054720 197897414
55871 197897414 178441339 161392815 146433208 133271343 121650587 111348905 102196342
55864 102196342 94074117 86879140 80498597 74821410 69751718 65199283 61074439 57305477
55856 57305477 53848640 50671893 47740788 45026711 42514360 40191101 38039404 36046322
55848 36046322 34208228 32517978 30957475 29509687 28167597 26924281 25764138 24671376
55840 24671376 23638510 22659899 21725614 20828725 19971076 19155370 18378395 17637300 16934954
55831 16934954 16273062 15646706 15051171 14487621 13956814 13453805 12974238 12519675 12091485
55822 12091485 11685320 11296585 10925475 10571674 10229893 9895882 9571553 9259056 8954902
55813 8954902 8655012 8360967 8076426 7801749 7536660 7283735 7044531 6816057 6595128
55804 6595128 6382268 6177567 5977157 5777960 5581821 5390951 5203592 5018497 4839577
55795 4839577 4671456 4513861 4364588 4224368 4094333 3971864 3853400 3738707 3628645
55786 3628645 3521736 3416934 3316848 3224112 3136998 3052310 2970034 2891532 2815856 2741775 2671104
55775 2671104 2606128 2545670 2487215 2430965 2378442 2329079 2281516 2236355 2194390 2153960 2113218
55764 2113218 2073299 2036202 2001213 1966371 1931799 1898697 1866639 1834653 1803531 1774520 1747194
55753 1747194 1720901 1696573 1674884 1654465 1634276 1615648 1599605 1584357 1568169 1552574 1539880
55742 1539880 1529419 1519165 1509214 1500632 1492405 1482575 1471032 1458333 1443056 1423296 1399843 1375357
55730 1375357 1351374 1328311 1306979 1287562 1268428 1248503 1229530 1213387 1198491 1181736 1163048
55719 1163048 1145284 1130415 1118507 1109943 1105933 1106922 1112393 1121858 1134126 1146015 1153444 1153515 1144674
55706 1144674 1126315 1100019 1069861 1039463 1009511 979644 951263 926413 905022 885344 866256
55695 866256 847367 828162 809107 792508 780066 770379 760745 750555 741042 732793 725532 719361 714162
55682 714162 708632 701973 695596 691042 687067 680977 672156 662129 651717 640329 627794 615016 602925
55669 602925 592198 583412 576045 568047 557905 546497 535643 525898 517225 510463 506147 502975 499574
55656 499574 496907 496938 499649 503410 507557 512572 518259 523643 528194 531537 532619 530710 526369 520030 510956
55641 510956 499375 488052 479429 472480 464900 457037 450727 445357 438532 430236 423023 418052 414075 410581
55627 410581 408822 409049 409583 409619 410571 413569 417808 422332 427476 433385 438861 442854 445685 447794 448554 447433
55611 447433 445405 444172 444514 445884 447108 447230 446240 445049 444285 443357 441415 438722 436158 433940 432031
55596 432031 431202 432217 434262 435724 436341 437044 437797 437208 434446 430194 425505 420920 416689 412631 407725
55581 407725 401021 392915 384411 375426 365184 354169 344241 336765 331712 328347 325540 321897 317246 313715
55567 313715 313465 315450 316296 314457 311491 309021 306615 303496 300356 298230 297014 296264 296320 297440 298621
55552 298621 298431 296589 293980 291414 289003 286612 284541 283667 284659 286790 288020 286920 284122 281237 278898
55537 278898 276769 274724 272685 269749 265046 259391 254759 252192 251465 252396 254731 256852 256668 254374 252595
55522 252595 253010 254258 254019 251840 249053 247089 246950 249346 254117 259955 265627 271241 277619 284722 291365
55507 291365 296423 299729 301704 302476 301830 300080 298440 297770 297097 294451 289440 283897 279481 275961 272698
55492 272698 270351 269564 269087 267118 263910 261187 259424 257596 255402 253768 253066 252612 252214 252533 253563 254289
55476 254289 254296 254267 254528 254454 253723 252886 252198 251041 248859 245674 241632 237264 234122 233505 234214 233176 228838
55459 228838 222587 216456 211052 206345 202792 200618 199196 198044 197354 196835 195388 192861 190953 191213 193057
55444 193057 194787 195695 196194 196662 197320 198616 200579 202055 201615 199139 195980 193713 193143 194146 195935 197649
55428 197649 199081 200728 203059 206023 209166 211767 212901 212108 210157 208562 208220 209014 210487 211995 212259
55413 212259 209997 205511 200931 198407 198414 199765 200650 199764 197193 194247 191891 189741 187353 185793 186468 188811
55397 188811 190827 191830 192837 194201 194902 194680 194760 195530 195414 193335 190751 189687 189944 189773 188515 187108
55381 187108 186468 186634 187283 188119 188898 189637 190480 190985 190155 187665 184582 182478 182322 184325 187901 191543 193802
55364 193802 194826 195938 197402 198008 197374 197086 198529 201049 203529 206502 211045 216462 220792 223188 224335
55349 224335 224728 224004 222015 219441 217061 215144 213543 211881 209595 206299 202051 197183 192257 188201 185713
55334 185713 184219 182376 180105 179100 180565 183377 185457 186156 186232 186196 185871 185165 184233 183089 181839 180867
55318 180867 180054 178544 176274 175039 176621 180228 183142 183792 182781 180871 177550 172336 166347 161568 158955
55303 158955 157959 157683 157811 158294 158676 158260 156983 155682 155239 155835 157378 160083 163789 167106 168491 168221
55287 168221 168129 169210 170678 171676 172412 172942 172369 170443 168712 168703 169825 170454 170285 170101 169837 168613 166569
55270 166569 165067 164867 165401 166029 166821 167763 168273 168042 167530 167158 166663 165734 164715 164177 164164 164348 164678 165445
55252 165445 166771 168375 169892 171133 171879 171722 170650 169641 169931 171313 171946 170585 168354 167238 167429
55237 167429 167541 167143 167291 168349 169153 169042 169131 170419 171981 172238 171046 169391 167973 167188 167621 169281 171028
55220 171028 171929 172511 173515 174162 173013 170056 166679 164037 162610 162829 164618 166575 167003 165809 164313
55205 164313 163393 162897 162644 162760 163090 163393 164004 165221 166202 165722 164092 163131 164094 166579 169454 171792 172866
55188 172866 172393 171118 170316 170582 171687 173270 174687 174639 172454 169765 169325 171715 174530 175280 173909 171992
55172 171992 170725 170460 171119 172083 172328 171467 170187 169174 168258 167163 166391 166656 167935 169706 171639 173410
55156 173410 174265 173626 171958 170385 169464 168854 168181 167680 167815 168614 169714 170915 172403 174279 176109 177268
55140 177268 177699 177990 178657 179724 181128 182940 184864 186074 186046 185269 184686 184775 185469 186436 186982 186290 184414
55123 184414 182468 181202 180005 178142 176255 175510 175758 175804 175277 174967 175418 176402 177723 179272 180231 179558 177556
55106 177556 175838 175452 176154 177732 180662 184944 189415 192895 195066 195742 194573 192311 191214 192900 196323
55091 196323 198864 199018 197195 194444 191530 189151 188016 188339 189725 191606 193522 195061 195854 195631 194225
55076 194225 191819 189357 188180 188777 190137 190773 190152 188768 187078 184962 182310 179722 178332 178876 180868
55061 180868 182834 183679 183852 184737 186769 188617 188576 186509 184022 182889 183638 185517 187398 188580 188999 189012
55045 189012 189104 189672 190793 192122 193243 194256 195771 197980 200001 200609 199636 198247 197750 198419 199564 200489
55029 200489 201213 202315 204098 206032 207260 207691 208190 209444 211045 211967 211617 210137 208115 206412 205769 205964
55013 205964 205805 204552 202906 201894 201369 200638 200157 201192 203718 205983 206644 206376 206725 208050 209243 209147
54997 209147 207728 205969 204852 204424 203996 203341 203169 203907 204615 204122 202864 202362 202876 202941 201577 199683 198606
54980 198606 198467 198729 199536 201369 203820 205752 206611 206789 206669 206046 204770 203525 203451 204901 206887 208149
54964 208149 208714 209684 211245 211848 210231 207551 206175 206601 207023 206067 204426 203267 202513 201704 201470 202811
54948 202811 205325 207288 207497 206392 205359 205308 205869 205754 204150 201848 200607 201386 203754 206988 210689 213971
54932 213971 215319 214282 212494 211817 211909 210861 207966 204569 202071 200468 199488 200046 203401 209127 214991
54917 214991 219066 221264 222433 222590 220978 217760 214615 213073 212832 212438 211310 210357 210665 212279 214354
54902 214354 216081 217366 218943 221667 225257 227990 228265 226288 223663 221691 220942 222051 225339 229315 231064
54887 231064 229147 225408 223038 223385 225329 227178 228166 228243 227429 225920 224602 224931 227912 233057 238675 243422
54871 243422 247257 250635 253465 255576 257730 261070 265816 271441 277924 285687 294418 303225 311867 320430
54857 320430 327735 331790 332381 331625 331207 330461 328036 323956 318911 312836 305680 298726 293635 290587 288345
54842 288345 285741 282310 278224 274493 272385 271625 270124 266705 263167 262075 263256 264275 263917 263280 263476
54827 263476 264285 265571 268272 273092 279416 286356 293869 301995 309848 316456 322184 328246 334808 340374
54813 340374 343411 344142 344150 344258 343335 339560 332479 323222 312973 302235 291718 282800 276284 271353 266520
54798 266520 261252 256103 251771 248702 247105 246572 245980 244436 242104 239627 237255 235139 233743 232984 231472
54783 231472 227815 222618 218162 216041 215827 216032 215653 214790 214374 215305 217425 219554 220992 222420 224565 226574
54767 226574 226841 225131 222720 220589 218686 216971 215822 215024 213524 210868 208162 207070 208372 211747 216253
54752 216253 220518 223135 223654 223216 223775 226458 230489 233674 234210 232384 230248 229367 229290 228666 227320 226402
54736 226402 226814 228424 230839 234026 237954 242162 245939 248627 249912 250241 250659 251714 252766 253026 252970 253923
54720 253923 256420 259722 262851 265335 267127 268557 270292 272667 275290 277918 281238 285854 291128 296324
54706 296324 302445 311225 322332 333222 342054 349066 354584 357415 356349 351988 345965 339190 331853 324412
54692 324412 317486 311187 305389 300316 296232 292871 289717 286548 283400 280476 278389 277866 278749 279825 280079
54677 280079 279616 279107 279012 279700 281564 284434 287491 290230 292945 295892 298809 301814 305893 311718 318665
54662 318665 325688 332432 338707 343724 346947 349086 350884 351255 348060 340939 332241 324641 318531 312232
54648 312232 304390 295662 288033 282736 279134 275838 272503 269768 267577 264742 260744 256983 255361 256126
54634 256126 257856 258962 258559 256556 253927 252271 251987 251322 248466 244220 241069 239666 237956 234271 229816
54619 229816 227078 226787 227621 228359 229090 230242 231355 231266 229198 225462 221294 218216 217385 219032 222098 224616
54603 224616 225111 223999 223258 224398 227075 229902 231974 233035 232786 231062 228516 226216 224578 223486 223271
54588 223271 224464 226489 227835 227965 227892 228265 228096 226477 224492 223951 224758 225228 224951 225492 227649 229662 229510
54571 229510 227917 227430 228816 230185 230029 229515 230640 233186 235104 235548 235866 237196 238524 238152 236182 234314
54555 234314 233541 233258 232683 232005 231746 231875 232148 232687 233605 234444 234565 233879 232824 231953 232024 233914 237580 241350
54537 241350 243144 242512 240706 238776 236634 234292 232868 233449 235613 237964 239686 240690 240734 239608 238157
54522 238157 237866 239141 240877 242007 242430 242030 240017 236258 232477 230846 231573 232785 232604 230609 227573
54507 227573 224852 224000 225805 229304 232493 234356 235521 236732 237646 237754 237621 238193 239245 239520 238434 236976
54491 236976 236751 238651 242457 247214 251764 255412 258356 261230 264003 265733 265772 264924 264796 265901 266910
54476 266910 266039 262959 259020 255817 253901 252782 251798 250901 250807 252281 254954 257042 256860 254640 252186 250602
54460 250602 249224 247207 245217 244526 245061 245484 245022 244109 243273 242517 241986 242105 242628 242570 241730 241440 242947 245669
54442 245669 247890 248768 248689 247908 245988 242932 240090 239330 241342 244981 248321 250381 251794 253644 255712
54427 255712 256438 254885 252230 250694 251356 253615 256475 259423 262077 263999 265309 266728 268568 270263 271438
54412 271438 272784 275094 277920 280151 281731 283761 286722 289537 290800 290309 288925 287550 286804 287124 288386
54397 288386 289554 289374 287517 284762 282191 280493 279715 279213 278041 275869 273371 271354 269894 268819 268423
54382 268423 268784 268884 267642 265742 265113 266396 268169 269020 269149 269353 269691 269940 270369 271132 271671 271574 271217 270750
54364 270750 269319 266394 263207 261714 262590 265159 268701 272700 276356 279107 281333 283428 284592 283841 281868
54349 281868 280445 279989 279178 277190 275073 274449 275831 278616 281913 284962 287272 288649 288954 288277 287771 289499
54333 289499 294271 300052 303722 304170 302676 300896 299969 301027 304539 308957 311811 312472 312387 312565 312631 312580 313381
54316 313381 315151 316542 316818 316933 317756 318839 319763 321040 322813 324383 325897 328528 331763 332643 329532
54301 329532 324926 322488 322671 323362 323542 323848 324261 323740 322043 319986 317933 315690 313682 312649 312263 311412
54285 311412 309652 307150 303772 299777 296836 296551 298152 299391 299477 299395 299591 299393 298753 298574 298981 299122 299019
54268 299019 299715 301017 300994 298544 294926 291944 290045 289033 289133 290287 291577 292394 293194 294236 294669 293871
54252 293871 292629 291830 290803 288191 283982 279595 276332 274530 273891 273837 273786 273659 273881 274497 274897 274861 275223
54235 275223 276696 278504 279063 277910 276399 276509 279230 283854 288572 291980 294174 296067 297784 298459 297599
54220 297599 295706 293347 290724 288636 288620 291128 294419 296386 296939 297584 299154 301088 302631 303697 304584
54205 304584 305692 307522 310167 312758 314105 313898 312842 311705 310750 310001 309564 309758 311220 314466 318835
54190 318835 322334 323301 321961 319714 317309 314674 312131 310501 309893 309542 309146 309300 310226 311048 310898 309922
54174 309922 308582 306733 304095 300960 297567 293350 287898 282490 279581 280481 284149 288379 291567 293159
54160 293159 293198 292129 290774 289913 289734 289817 289608 288853 287738 286703 285947 285074 283526 281579 280498 281255 283202
54143 283202 284508 283898 281689 279213 277654 277556 278900 281268 284116 287091 289923 292017 292571 291483 289880
54128 289880 289352 290706 293518 296706 299248 300682 301260 301605 301993 302197 302221 302771 304472 306903 309041 310529
54112 310529 311894 313416 314531 314521 313155 310357 305935 300221 294545 290416 288344 287938 288888 291083 293761
54097 293761 295421 295214 294064 293765 294987 296615 297147 296289 294988 294290 294556 295530 296640 297301 297432 297795 299391
54080 299391 302302 305511 308024 309753 310968 311419 310671 309160 308171 308483 309443 309754 309057 308363 308852 310505
54064 310505 312306 313806 315980 320016 325510 330600 333916 335728 336904 337538 337209 336063 334792 333711 332564
54049 332564 331247 330125 329413 328620 326881 323882 320467 318213 317987 318883 319072 317933 316756 316980 318385 319674
54033 319674 320233 320442 320639 320847 321355 322524 323874 324375 323945 323803 324904 326762 328384 329749 331641 334282
54017 334282 336878 338602 339587 340669 342347 344271 345855 347149 348750 350877 353024 354781 356560 359038
54003 359038 362152 365142 367475 369315 371154 373307 375664 377754 379235 380492 382328 384777 386849 388050
53989 388050 389585 393182 399011 405649 411975 418231 425233 433340 442346 451802 461291 470813 480791 491282
53975 491282 501526 510956 520299 530763 542308 553612 563621 572206 579421 585308 590607 596546 603464
53962 603464 610337 615836 619168 619983 618560 616265 614717 613979 612463 608852 603229 596056 587339 577463 567761
53947 567761 559389 552244 545614 539154 532697 525970 519188 513222 508422 503984 499235 494865 492000 490597
53933 490597 489615 488420 487255 486613 486868 488241 490437 492439 493136 492052 489316 485398 481063 476860 472230
53918 472230 465879 457648 449338 442953 438813 436060 434261 433452 433129 432367 430874 429132 427688 426956 427375
53903 427375 428941 430882 432574 434444 437150 440270 442856 445036 447780 451038 453371 453864 453434 453727 455508
53888 455508 458617 462770 467699 473000 478583 485059 493080 502321 511587 519906 527154 533607 539441 544942
53874 544942 550828 557865 566221 575545 585548 596003 606252 615590 624447 634330 645906 657878 668674
53861 668674 678597 689060 700252 711207 722114 734684 749533 764833 778591 791112 803998 817511
53849 817511 830239 840897 849381 856281 862155 867124 870531 871315 869370 866190 863500 861475 858851 854455
53835 854455 848007 839778 830176 819563 808018 795278 781129 765610 748818 731032 713119 696064
53823 696064 679921 664163 649353 637192 628214 620547 611895 601789 590953 579663 568135 557657
53811 557657 549641 543757 538263 531915 524558 516435 508256 501459 496883 493380 489093 483911 479273 475711
53797 475711 472212 468147 464298 461476 459340 456971 453686 449047 443120 437049 432428 429814 428637 428527
53783 428527 429497 430699 430437 428147 425334 423869 424050 424832 425258 425069 424507 424008 423698 423123 421975 421012 421327
53766 421327 422691 423750 424177 425435 428776 433543 438273 442654 447346 452390 456824 459826 461566 462905
53752 462905 464643 467002 469709 472714 476786 482883 490856 499422 507802 516804 527727 540504 553455
53739 553455 564825 574211 582616 591351 600857 610415 618951 626035 632120 638068 644608 651867 658983 664372
53725 664372 666863 666473 663850 659368 653268 646232 639025 631759 624159 616302 608312 599657 589746 579199
53711 579199 569563 561637 554852 548351 541777 534926 527528 519723 512073 504828 497761 490821 484339 478529
53697 478529 473415 469268 466416 464541 462762 460403 457228 453296 449371 446995 446915 447675 447005 444570 442054
53682 442054 440632 439858 439148 438733 438665 438450 438217 438703 439516 439040 437034 435685 436792 439282 441059 442163 444287
53665 444287 447789 451006 452541 452795 452987 453733 454981 456694 459139 462599 466826 470983 474474 477725 481468
53650 481468 485379 488496 491170 495257 501713 509082 515183 519388 522459 525259 528744 534255 542284 551336
53636 551336 559175 565059 569854 574332 578301 581202 582720 582997 582841 583315 584541 585527 585843 586599 588766 591380
53620 591380 592807 593145 593725 594554 594048 591472 587997 584860 581963 579090 577232 577511 579422 581231 581903 581842
53604 581842 581749 581576 580977 580328 580648 582364 584601 586139 586901 587967 590149 593178 596398 599520 602351 604374
53588 604374 605140 604691 603352 601609 600396 600697 602391 604242 605632 607454 610558 614111 616572 617743 618796
53573 618796 620628 623191 626135 629024 631109 632022 632704 634673 638198 641978 644709 646262 647308 648583 650619
53558 650619 653442 656419 659091 662307 667773 676122 685913 694926 702136 708249 714537 721352 727767 732627
53544 732627 735888 738559 741403 744287 746997 749912 753277 756489 758844 760501 761980 763211 763877 764197 764421
53529 764421 763959 762125 759544 757677 756924 756250 754750 752590 750142 747172 743359 739014 734856 731412 728826
53514 728826 726994 725872 725818 727255 729579 730920 729809 726827 723828 721815 720439 719248 718191 716930 714920
53499 714920 712558 711261 711912 713895 715979 717473 718229 718311 718180 718719 720591 723742 727557 731239 734179 736505
53483 736505 739200 743156 748284 754130 761016 769610 779622 790043 800742 812612 825872 839427 852389
53470 852389 865185 878610 892764 907577 923462 940653 958669 977232 997076 1018977 1042505
53459 1042505 1066613 1091117 1116767 1144134 1173256 1204171 1236945 1271126 1305939 1341241 1377749
53448 1377749 1416072 1455828 1495828 1534843 1572172 1607921 1643115 1679274 1717374 1757017 1796781
53437 1796781 1835554 1873316 1910480 1946765 1981261 2013555 2044224 2074101 2103642 2133253 2163488
53426 2163488 2194352 2224863 2253912 2281249 2307254 2332366 2357416 2383842 2412493 2442321 2471126
53415 2471126 2497414 2520776 2540769 2556638 2568264 2576373 2581551 2583671 2582428 2577782 2569919 2559385
53403 2559385 2547114 2533536 2517909 2499538 2479384 2459225 2439257 2417987 2394864 2371522 2349654
53392 2349654 2328783 2306998 2283068 2257080 2229815 2202466 2176500 2152902 2131453 2110957 2090037
53381 2090037 2067981 2045648 2025602 2010371 2000171 1993082 1987510 1983400 1980881 1979216 1977946 1977860 1979869
53368 1979869 1983881 1989671 1997879 2008975 2022060 2035992 2051159 2068987 2090126 2114265 2141315 2171499
53356 2171499 2204333 2238627 2273650 2309685 2347524 2387969 2431439 2477325 2524126 2571070 2619256
53345 2619256 2670300 2724238 2779908 2837152 2897356 2961735 3030154 3101916 3176608 3253846 3333066
53334 3333066 3414109 3497343 3582742 3669354 3755977 3841874 3926610 4009776 4091216 4171026 4248964
53323 4248964 4324206 4395932 4463791 4527619 4587215 4642711 4694653 4743224 4787559 4826181 4857926
53312 4857926 4882269 4899118 4908730 4911636 4908133 4897768 4879535 4852593 4816785 4772654 4721300 4664173
53300 4664173 4602657 4537673 4469729 4399291 4326982 4253428 4179200 4104950 4031397 3959034 3888077
53289 3888077 3818891 3752156 3688128 3625808 3563361 3499581 3434662 3369561 3305188 3242436 3182263
53278 3182263 3125049 3070194 3017029 2965970 2918275 2874773 2835366 2799436 2766056 2734089 2703023
53267 2703023 2673727 2647342 2623194 2598691 2571806 2542986 2514156 2486553 2460115 2434539 2410144
53256 2410144 2387751 2368015 2350845 2335363 2320725 2307027 2295019 2284951 2276431 2269627 2265729 2265576
53244 2265576 2268335 2272290 2276690 2282247 2290058 2300747 2314639 2332101 2353246 2377369 2402981 2428732
53232 2428732 2454455 2481089 2509383 2539083 2569730 2601633 2635033 2668565 2699757 2727277 2751670
53221 2751670 2773701 2793209 2810088 2825101 2838695 2849888 2857299 2860612 2860005 2854830 2844173 2828522
53209 2828522 2809664 2788763 2765405 2738751 2708961 2677175 2644406 2610763 2575672 2538780 2500437
53198 2500437 2460984 2419834 2376075 2330202 2284430 2240740 2199142 2158325 2117401 2076474 2036018
53187 2036018 1996310 1957185 1918003 1878395 1839255 1802202 1767646 1734227 1700750 1667634 1635650
53176 1635650 1604225 1572198 1539590 1507574 1477238 1449396 1424848 1403492 1383622 1363357 1342542
53165 1342542 1322176 1302540 1283180 1264182 1245826 1227166 1206666 1184328 1161678 1139453 1116901
53154 1116901 1093736 1071196 1050311 1030287 1009475 987126 963601 939805 917100 896964 879793
53143 879793 864351 848946 832894 816654 801025 786576 773278 760300 746466 731194 714808
53132 714808 698020 681646 666646 653616 642000 630513 618527 606574 595535 586046 578632 573376
53120 573376 569246 564750 559665 555194 551939 548694 543992 538100 532593 528305 524538 520157 514876 509450
53106 509450 504976 502066 500571 499986 499818 499373 497660 494245 490083 486698 484519 482699 480638 478825 477966
53091 477966 478001 478238 477908 476427 473807 470999 469231 468795 468923 468765 467862 465961 463412 461622 461828 463349
53075 463349 464377 464632 465683 468192 470594 471431 471437 472117 473632 475547 478421 482915 488139 492681 496742 501403
53059 501403 506120 508923 509375 509495 511106 513585 515112 515072 514299 513629 513151 512646 512008 511192 510059 508306 505429
53042 505429 500961 494962 488230 481883 476613 472264 468126 463741 459478 456185 454229 453161 452315 451350 450082
53027 450082 448306 446238 444733 444550 445435 446310 446406 446034 446161 447210 448229 447638 445181 442798 442695 444708
53011 444708 446584 446916 446480 446205 445262 442369 438072 434344 432339 431716 431847 432469 433269 433934 434659 435660 436114
52994 436114 434667 431329 428062 426999 428502 431151 433217 433923 433738 433636 433964 434103 433484 432580 432356 432928
52978 432928 433508 433652 433943 435274 437847 440899 443111 443427 441934 439837 438187 436880 435345 433868 433551
52963 433551 435149 438509 442797 446645 448630 448627 448310 449182 450474 450387 449127 448876 450501 452187 452086 450639
52947 450639 449161 447745 446029 444820 445187 446726 448374 450393 453644 457208 458825 458124 457560 459299 462609
52932 462609 465389 467110 468908 471443 474121 476347 478355 480518 482621 484153 484800 484389 482813 480460 478444
52917 478444 477905 478941 480432 481065 480583 480003 480589 482617 485252 487649 489890 492571 495641 498164 499382
52902 499382 499552 499296 498481 496433 493310 490611 489796 490729 491964 492458 492503 492857 493448 493365 491984 489745 487646
52885 487646 486201 485112 483939 482845 482447 483010 484036 484748 484803 484380 483737 482981 482301 482082 482553 483343 483617
52868 483617 482791 481112 479520 478920 479489 480553 481107 480633 479613 479147 479803 480838 480925 479808 478797 479167 480336
52851 480336 480282 477893 474348 471824 471174 471267 470494 468554 466641 466045 466812 467967 468969 470447 473142 476515
52835 476515 479185 480722 482148 484392 487091 489424 491338 493060 493946 493096 491149 490230 491494 493508 493816
52820 493816 491740 488923 487404 487979 490412 494168 498295 501344 502548 503076 505117 509304 513828 516632 517652
52805 517652 517979 517497 514871 509924 504515 500369 497102 493287 488640 484104 480234 476625 472840 468962 465186
52790 465186 461606 458529 456387 455187 454528 454171 454002 453439 451558 448160 444193 440805 438337 436539 435373
52775 435373 435145 435909 437071 437735 437421 436460 435619 435399 435831 436893 438569 440314 441045 440287 438912 438089 437810
52758 437810 437234 436163 435169 434379 433374 432584 433485 436656 440646 443676 445634 447241 447895 445910 441061 435576
52742 435576 431927 430331 429121 427138 424989 423937 424133 424374 423532 421897 420823 421172 422478 423804 424938
52727 424938 426329 428073 429617 430601 431466 432827 434456 435226 434172 431523 428695 427196 427339 428003 427812 426577
52711 426577 425290 424687 424295 423262 421655 420245 419267 418300 417555 418216 420807 423967 425885 426579 427613 429721
52695 429721 432020 433856 436040 439397 443198 446142 448188 450073 451479 451242 449547 448503 449956 453674
52681 453674 458205 462690 467127 471550 475729 479363 481981 483020 482478 481162 479825 478545 477489 477598 479499
52666 479499 482074 483305 482562 481113 480212 479707 478816 477229 474889 471704 468314 466350 466825 468713 470130
52651 470130 470605 471049 471774 471971 471387 471065 471679 472296 471734 470352 469418 469308 469537 470149 471784 474291 476487
52634 476487 477599 478019 478262 478014 476612 473924 470427 467018 464867 464641 465499 465659 464396 462735 461764 461317
52618 461317 461055 461742 464189 467581 470192 471513 472475 473697 474802 475516 476248 477229 478024 478277 478180 477958 477617
52601 477617 477472 478146 479681 481301 482465 483508 484956 486821 488990 491646 494817 497881 499876 500056 498216
52586 498216 495167 492851 492864 494420 494802 492526 489059 486570 485008 482764 479640 477592 478463 482168 487217
52571 487217 492064 495693 497894 499460 501507 504203 506545 507561 507221 506077 504613 503204 502164 501485 500926
52556 500926 500614 501026 502037 502516 501395 498966 496671 495753 496344 497662 498795 499452 500210 501778 503729 504347
52540 504347 502283 498184 494140 491509 489913 488417 486967 486199 486353 487066 488039 489308 490849 492537 494580
52525 494580 497411 500819 503724 505293 505959 506782 508000 508878 508942 508733 509094 510228 511681 512863 513304 512813
52509 512813 511779 510983 510675 510074 508267 505455 502915 501720 501802 502232 502066 501056 499876 499651 500796 502300
52493 502300 502521 500723 497514 493825 490095 486637 484155 483292 483860 484985 485943 486578 487111 487879 489096 490479
52477 490479 491224 490803 489689 488896 488925 489735 491595 494934 498969 501515 501203 499465 499253 501849 505927 509720
52461 509720 512931 515938 518243 518867 517948 516956 517247 518956 521263 523151 523904 523489 522699 522566 523474 525061
52445 525061 526851 528449 529087 527681 523858 518694 514048 511183 510017 509475 508387 506296 503690 501492 500361
52430 500361 500420 501439 502889 504031 504403 504291 504306 504616 505112 506264 509001 513359 517845 520555 520616 518391 514971
52413 514971 511878 510540 511323 513357 515799 518760 522330 525382 526468 525813 525376 526824 530219 534737 539665
52398 539665 544308 547809 549773 550568 550432 548649 544278 537573 530168 523784 519022 515419 512400 509981 508547
52383 508547 508023 507558 506310 504456 503030 502756 503453 504598 505876 506898 507012 506044 504989 505225 507034 509377
52367 509377 511293 513018 515423 518631 521634 523306 523602 523619 524524 526568 529136 531631 534062 536779 539896
52352 539896 543143 546222 549158 552372 556525 562190 569468 577877 586655 595144 602873 609409 614310 617155
52338 617155 617458 614670 608705 600721 593057 587855 585412 584028 581751 578348 575404 574472 575378 576524 576652
52323 576652 575887 575093 574747 574800 575307 576604 578848 581821 585333 589431 594023 598665 603105 607797 613348 619482
52307 619482 625068 629415 633135 637364 642325 647084 650659 652915 654308 655205 655860 656817 658840 662217 666348
52292 666348 670275 673578 676589 679769 683094 686256 689405 693432 699324 707153 715783 723681 730208 736237
52278 736237 743449 752958 764611 777613 791534 806392 821923 837483 852983 869564 888786 911252
52266 911252 936344 963136 990989 1019206 1046820 1073317 1099428 1126770 1156571 1188834 1222579
52255 1222579 1256684 1290531 1324078 1357519 1390886 1424042 1456962 1489828 1522705 1555352 1587614
52244 1587614 1619904 1652841 1686239 1718732 1748734 1775677 1800092 1822576 1843106 1861372 1877229
52233 1877229 1890372 1899966 1905310 1907027 1907018 1906822 1906173 1903445 1897446 1888747 1879380 1871380 1865498 1861193 1857857
52218 1857857 1855805 1855746 1857521 1860119 1863138 1867519 1874410 1883868 1895195 1907994 1922161 1937251 1952690
52205 1952690 1968498 1985131 2002739 2021215 2040764 2061644 2083439 2105473 2127969 2151891 2177468
52194 2177468 2203553 2228622 2251744 2272590 2291342 2308606 2324426 2337276 2345261 2348609 2349588 2349295
52182 2349295 2345980 2337680 2325254 2311380 2297423 2282912 2267474 2251457 2234702 2216411 2196679 2176811
52170 2176811 2157718 2139130 2120823 2103512 2087814 2073250 2059072 2045484 2033324 2023001 2014386
52159 2014386 2007305 2001397 1995738 1989354 1982305 1975871 1971668 1970741 1973250 1978522 1985270 1992194 1998627 2004546
52145 2004546 2009945 2014474 2017934 2020898 2024356 2028624 2033094 2037446 2042716 2050367 2060304 2070560 2079248 2086152
52131 2086152 2092051 2097224 2101295 2104060 2105687 2106271 2105754 2104066 2100884 2095662 2088488 2080505 2072752 2064919
52117 2064919 2056009 2045868 2035227 2024685 2014734 2006351 2000131 1994949 1989010 1982418 1977113 1973913 1971396
52104 1971396 1968558 1966844 1968078 1971647 1975450 1978785 1982450 1986340 1988817 1988760 1986838 1984389 1982117 1980306
52090 1980306 1979337 1979389 1980203 1981483 1983095 1984894 1987056 1990652 1996800 2004796 2012057 2016766 2019882 2023696 2028971
52075 2028971 2034640 2040077 2046392 2055086 2066494 2080236 2096515 2116007 2138698 2163702 2190443 2219345
52063 2219345 2251066 2285505 2321912 2359671 2398521 2438286 2478749 2519632 2560340 2600068 2638676
52052 2638676 2677139 2716255 2754897 2790502 2821686 2849584 2876062 2901297 2923999 2943511 2960579
52041 2960579 2975986 2989381 2999820 3006867 3010670 3011319 3008575 3002078 2991603 2977243 2959583 2939627
52029 2939627 2918339 2896298 2873800 2851043 2828085 2805008 2782480 2761880 2744240 2729076 2714949
52018 2714949 2701369 2689471 2680395 2673686 2668182 2664074 2662989 2666012 2672659 2682032 2693946 2708370 2724729
52005 2724729 2742522 2761886 2782734 2804044 2824987 2846134 2868487 2891882 2915484 2939109 2962267
51994 2962267 2982360 2996202 3003928 3009311 3015052 3019429 3018867 3012398 3001865 2988774 2972858 2953398 2930346
51981 2930346 2904145 2875678 2846330 2816938 2786767 2754621 2720851 2687175 2654665 2623162 2592617
51970 2592617 2563519 2535611 2507510 2478250 2448303 2418591 2389398 2360762 2333061 2306586 2281157
51959 2281157 2256562 2232544 2208067 2181824 2154347 2128522 2106694 2087772 2068317 2046058 2021118
51948 2021118 1994228 1965364 1934562 1902699 1870657 1838487 1806187 1774669 1745046 1717117 1689462
51937 1689462 1661204 1633042 1606180 1580729 1555727 1530454 1504980 1479364 1453126 1426101 1399266
51926 1399266 1373949 1350382 1327670 1305019 1282116 1258429 1233281 1207201 1182331 1160602 1141893
51915 1141893 1124653 1108078 1093008 1080884 1072392 1067109 1063940 1061888 1060759 1061153 1063592 1067810 1073149
51902 1073149 1079361 1086604 1094750 1103035 1110321 1115654 1119006 1121796 1126159 1133127 1142045 1152365 1165392
51889 1165392 1183103 1205444 1229913 1253816 1275753 1294694 1308872 1316420 1316491 1309420 1296758 1281740
51877 1281740 1268566 1259760 1254320 1249204 1242413 1233986 1224517 1213934 1201874 1188257 1173038 1155973
51865 1155973 1137077 1117022 1096700 1076485 1056067 1034974 1013291 991963 972224 954543 938293
51854 938293 922707 907863 894385 882484 871888 862597 855060 849457 845333 842125 839740 838396 838073
51841 838073 838151 837459 834929 830465 824926 818835 811549 802412 792324 783054 775048 767192 759029 751872 746936
51826 746936 743488 740026 736618 734827 735666 738711 743128 748530 754737 761495 768537 775277 780621 784044
51812 784044 786819 791055 797099 802849 806106 806768 806124 804891 802898 800116 796841 793077 788838 785129 783603
51797 783603 784832 787663 790689 793567 796215 797460 795690 790863 784753 778821 772697 765354 756960 748630
51783 748630 740826 733192 725897 719841 715224 711029 706627 702967 701298 701407 702141 703067 704429 705735 705825
51768 705825 704569 703336 703243 703745 703453 701682 698677 694963 691081 687586 684726 682261 679897 677743 676132
51753 676132 675319 675563 677097 679761 683028 686566 690402 694286 697494 699586 700756 700945 699381 695930 692527
51738 692527 692138 696011 702404 708071 710623 709646 706375 702553 699138 695792 691813 687547 684424 683442 683928
51723 683928 684173 683150 681431 680438 680913 682238 683231 683409 683212 683202 683680 685254 689016 695452 703499 711391
51707 711391 718410 725250 732670 740355 747193 752166 754750 754748 752147 747180 740506 733163 726016 719130 712085
51692 712085 705075 699223 695374 692985 690730 687802 684080 679640 675067 671926 671724 674323 678267 682635
51678 682635 687467 692376 696234 698811 701516 705648 710834 715976 720764 725269 728955 731499 734016 738074
51664 738074 743556 748705 752281 754513 755885 756150 754874 752040 747842 742785 738214 735662 735054 734388 731857
51649 731857 727655 723209 719508 717004 716396 718256 721953 725809 728310 728625 726284 721399 715280 709968 706712
51634 706712 705254 704521 703460 701223 697470 692900 688899 686168 684084 681758 679350 677867 677966 679351 681116
51619 681116 682251 681975 680088 677220 674659 673779 675300 678693 682393 685125 687282 690640 696648 705415 716263
51604 716263 728359 740420 750752 758308 763164 765330 763974 758932 752301 747159 744826 744569 745778 748882
51590 748882 753917 759724 765237 770319 774593 776484 774343 767780 757203 743120 726955 711648 699853
51577 699853 691628 684956 678338 671842 665776 659683 653089 646483 641024 637635 636464 636804 637535 638034 638558
51562 638558 639327 639570 638272 635637 632828 630208 626932 622645 618582 616237 615565 615293 614674 614237 614919 617023
51546 617023 620059 623278 626238 629032 632013 635497 639977 646451 655978 668671 683412 698619 712863
51533 712863 724711 732791 736593 736868 734820 731250 726924 723200 721445 721891 723810 726866 731558 738104
51519 738104 745577 752729 759359 766343 774450 783692 793872 805202 817893 831457 844939 857854 870399
51506 870399 882650 894195 904979 916054 928859 943961 961158 980673 1003345 1029385 1057608
51495 1057608 1086278 1113994 1139345 1160530 1176523 1188397 1198284 1206580 1210934 1208657 1199642 1186074
51483 1186074 1169389 1148549 1121999 1090812 1058793 1029084 1001430 973493 944461 916316 891476
51472 891476 870279 851440 834151 818608 804745 791684 778918 767166 757382 749334 741931 734767
51460 734767 728530 723757 719925 716274 712950 710518 708492 705267 699991 693878 689018 686176 684370 682508
51446 682508 680626 679263 678358 677388 676261 675398 675026 674970 675235 676171 677747 679171 679726 679642 679544 679264 677947 675397
51428 675397 672432 669569 666194 661801 657338 654231 652346 650117 646779 643306 640738 638660 635989 632407
51414 632407 628266 623767 619112 614858 611310 608088 605194 603796 604721 606630 607174 605846 604184 603114 601850
51399 601850 600036 599188 600775 604078 607431 610841 615804 622820 630686 638467 646885 657112 668897 680616
51385 680616 690898 699854 708811 718911 729705 738971 744279 745106 743424 742035 742254 743136 742729 739916
51371 739916 735047 729037 722183 714007 704064 692647 680822 670041 661544 655732 652086 649951 649264 650061
51357 650061 651451 651878 650668 648722 647350 647002 647463 648594 650300 652245 654314 657026 660800 665045 668757
51342 668757 671874 675273 679434 683908 688397 693583 700254 707993 715450 721920 728141 735282 743477 751847
51328 751847 759975 768859 780093 794400 811419 830598 851591 873855 896814 920885 947690 978665
51316 978665 1013729 1051490 1090062 1127035 1159359 1184358 1201124 1210498 1213798 1211891 1205033 1192953
51304 1192953 1175350 1153014 1128140 1102598 1076011 1046579 1013930 980119 947466 916562 887078
51293 887078 859565 835210 814166 795275 777502 760718 744864 729321 713835 699557 688131
51282 688131 679586 671841 662820 652729 643660 637055 632233 627583 622649 618422 615816 614426 612885 610157
51268 610157 606365 602605 600010 598941 598973 599559 600424 601305 601723 601369 600570 599948 599643 599241 598520 598058 598882 601459
51250 601459 605002 607948 609372 609950 611191 613770 617018 619958 622093 623005 622134 619596 616492 613600 610450
51235 610450 606640 603509 603091 605527 608777 611032 612225 612959 613256 613051 612953 613703 615578 618874 624146 631047
51219 631047 637613 641820 643653 644754 646221 647675 648441 648640 648781 649020 649353 650128 651959 655244 659885 665103
51203 665103 669421 671384 670874 669428 668680 668624 668033 666481 664958 664109 662862 659883 655852 652984 652260 652405
51187 652405 651947 650915 649717 647550 643393 637920 632951 629116 625415 621209 617410 615329 615271 616668 618697
51172 618697 620402 621032 620760 620448 620422 620177 619610 619523 620347 621323 621814 622626 624914 628234 630783 631538 631215 631110
51154 631110 631755 632974 634619 636813 639680 643097 646857 651067 656106 661780 666703 669311 669648 669394 669823
51139 669823 670562 670851 671044 671971 673512 674813 675494 675773 675820 675862 676413 677439 677779 676609 675047 674875 675857 675821
51121 675821 673557 670101 666784 663507 659697 655759 652677 650904 650364 650837 651795 652585 653290 654660 656727
51106 656727 658407 659093 659695 661342 663969 666993 670414 674187 677384 679306 680737 682771 684880 685597 684777
51091 684777 683674 682960 682246 681581 681764 682704 682949 681560 679329 677503 676366 675804 676253 678083 680621 682673
51075 682673 683595 683344 682013 680009 678252 677567 678100 679599 681731 683873 685463 687149 690638 696486 702735
51060 702735 706860 708638 709948 712035 714198 715245 715136 714877 715534 717567 720520 723215 724793 725705 727194
51045 727194 729832 733123 736477 739889 743575 747547 751648 755522 758478 759926 760080 759863 760179 761562 764130
51030 764130 767251 769699 771039 772484 775271 778496 780068 779822 779989 782069 784866 786567 787495 789551 793728
51015 793728 799260 804566 808146 809312 809162 810370 814951 822577 831815 842283 854469 867979 881487
51002 881487 894478 907972 923321 940976 960205 979202 995550 1007552 1015304 1020009 1022557 1023414
50990 1023414 1023458 1023797 1024790 1026069 1027346 1028337 1028239 1026463 1023802 1021621 1019897 1017330 1013487 1009445 1005967 1002486
50974 1002486 998486 994521 990949 986810 981099 974414 968249 963178 958768 955008 952919 953766 958180 965867
50960 965867 975638 985901 995587 1004500 1012716 1020127 1026896 1033753 1041239 1048973 1056076 1062025 1066746 1070319
50946 1070319 1073088 1075773 1079051 1083213 1088384 1094604 1101527 1108634 1116024 1124279 1133271 1142070 1150623 1160496
50932 1160496 1172950 1187095 1201162 1215112 1230762 1249666 1272136 1298177 1327982 1361262 1397189
50921 1397189 1435265 1475367 1516710 1557785 1597791 1637371 1677667 1719559 1764206 1813369 1868389
50910 1868389 1929394 1996089 2068745 2147716 2232656 2323082 2419270 2521511 2628558 2737865 2847641
50899 2847641 2957800 3068433 3178016 3283755 3383284 3475378 3559396 3634994 3702437 3762208
50889 3762208 3813669 3854772 3883946 3902134 3912359 3917466 3918965 3917807 3915020 3911008 3905044 3896224 3884429
50876 3884429 3869658 3850912 3826781 3797120 3763263 3726282 3685676 3640168 3589265 3533466 3473068
50865 3473068 3407373 3335369 3257068 3173871 3087658 2999748 2910937 2822251 2735129 2650856 2570181
50854 2570181 2493548 2421261 2353312 2289502 2229863 2174536 2123222 2075422 2031391 1991918 1956680
50843 1956680 1923764 1891701 1861204 1833841 1809634 1787316 1766581 1748493 1733524 1720742 1709469
50832 1709469 1700369 1693978 1689311 1685137 1681991 1681523 1684054 1688005 1692079 1697086 1705025 1716828 1731586 1747827
50818 1747827 1765013 1783628 1804237 1826988 1852018 1879832 1910864 1944905 1981456 2020564 2062785
50807 2062785 2108230 2156272 2206639 2260513 2319938 2386080 2458358 2535571 2617848 2707294 2806665
50796 2806665 2917438 3039337 3171649 3314652 3469570 3637401 3818143 4010996 4214950
50787 4214950 4429049 4652407 4884098 5123030 5367852 5616744 5866865 6113828 6352127
50778 6352127 6576487 6782691 6967134 7126397 7258008 7361289 7436740 7484863 7506521 7504430
50768 7504430 7483374 7448680 7404999 7356435 7306659 7258265 7212684 7171252 7135640 7106355 7080928
50757 7080928 7054166 7020195 6974227 6913054 6834807 6738542 6623871 6490880 6340392 6174042
50747 6174042 5993950 5802490 5602479 5397153 5189711 4983025 4779882 4583077 4395043
50738 4395043 4217686 4052696 3901470 3764343 3640349 3528232 3427434 3337820 3258910 3189927
50728 3189927 3130249 3079227 3035790 2998739 2967092 2939582 2914191 2889124 2864168 2840252 2817611
50717 2817611 2795213 2772219 2749023 2726240 2703317 2678966 2652793 2625813 2599248 2573111 2546144
50706 2546144 2517033 2485668 2453255 2421234 2390329 2360832 2333480 2309363 2288930 2271851 2258206
50695 2258206 2249146 2245648 2246981 2251279 2257650 2267031 2280784 2299083 2321121 2346502 2375903 2410383
50683 2410383 2450517 2496307 2547725 2605055 2668747 2739183 2816762 2901985 2995056 3095366 3201785
50672 3201785 3313708 3431329 3554452 3681468 3810258 3939857 4070282 4200511 4327633
50663 4327633 4448485 4561332 4665178 4758044 4836920 4899165 4943194 4968096 4973649 4960874 4931930
50652 4931930 4889518 4837168 4779850 4722820 4669195 4619467 4573900 4534410 4503258 4480683 4464762
50641 4464762 4453016 4443041 4431954 4416474 4393840 4361968 4318812 4262442 4191946 4107697 4010872
50630 4010872 3903630 3789905 3674902 3562928 3455921 3354406 3259283 3172092 3093909 3024805
50620 3024805 2964609 2913748 2872990 2842387 2820705 2806174 2797936 2796610 2803238 2817749 2838734 2864645
50608 2864645 2894844 2929161 2966471 3004067 3038932 3069946 3098558 3126856 3155322 3183188 3210548
50597 3210548 3238511 3266804 3293036 3315773 3337130 3360523 3386500 3412792 3438124 3463746 3491040
50586 3491040 3520068 3551452 3587474 3629659 3676679 3726374 3778711 3835016 3895069 3956926 4019300
50575 4019300 4082230 4145203 4206156 4262899 4314525 4361130 4402993 4440242 4472523 4498869 4518530
50564 4518530 4531768 4538714 4537576 4525469 4501689 4469121 4431909 4392803 4353483 4316160 4283318 4256205
50552 4256205 4234768 4218897 4208674 4203294 4200629 4198178 4194018 4186729 4174883 4156641 4129542 4090923
50540 4090923 4039310 3975552 3901928 3819945 3729616 3631148 3526649 3419592 3313101 3209209
50530 3209209 3109215 3013782 2922768 2835782 2753110 2675645 2603981 2538283 2479097 2427342 2382979
50519 2382979 2344422 2309893 2278961 2252201 2229943 2212171 2199226 2191508 2188506 2189180 2193501 2202656
50507 2202656 2217315 2236526 2258923 2284329 2313358 2345941 2381088 2418011 2456731 2497526 2540408
50496 2540408 2585381 2632793 2683132 2736483 2792294 2849656 2907963 2967318 3028024 3089574 3150488
50485 3150488 3209608 3267456 3326016 3387281 3452298 3521458 3595215 3674377 3759931 3852660 3952761
50474 3952761 4059751 4172825 4291332 4414984 4543884 4678597 4820086 4969328 5126813
50465 5126813 5292164 5463766 5638713 5813687 5986262 6154941 6317645 6470810 6610663
50456 6610663 6734796 6841527 6928069 6990751 7027369 7038211 7024228 6985317 6921391 6834612 6729474
50445 6729474 6610858 6482807 6349044 6213671 6081041 5955556 5841758 5743826 5664222 5603032
50435 5603032 5558952 5530720 5517295 5517160 5528157 5547867 5573254 5599561 5620185 5628385 5619140 5589215
50423 5589215 5536009 5457421 5353281 5226344 5081251 4922555 4753982 4579177 4402256 4227191
50413 4227191 4056945 3893466 3738192 3592128 3455579 3328357 3210468 3102426 3004771 2917488
50403 2917488 2839900 2770904 2709327 2654518 2606852 2567237 2535743 2511062 2491775 2477765 2469702
50392 2469702 2467367 2469478 2475216 2485009 2499368 2517751 2539124 2563098 2590020 2620429 2654750 2692572
50380 2692572 2731341 2766581 2794647 2815076 2829283 2837611 2839279 2835205 2829051 2824610 2823208 2824354 2827733
50367 2827733 2833394 2840787 2849132 2858911 2872083 2890481 2914369 2942659 2974261 3009211 3048691 3094051
50355 3094051 3145835 3203828 3267843 3337966 3413891 3494459 3578152 3663829 3750814 3838482 3925764
50344 3925764 4010839 4091437 4165849 4233476 4293845 4345290 4385397 4412590 4426208 4425007 4407023
50333 4407023 4371613 4320467 4255841 4178856 4090540 3993606 3891895 3788595 3686228 3587866 3496870
50322 3496870 3415340 3343892 3283075 3234065 3197824 3174241 3162146 3159511 3163757 3172650 3184929 3199376
50310 3199376 3213372 3223094 3225181 3217586 3199232 3170082 3131759 3087005 3037850 2984692 2927145 2864981
50298 2864981 2798012 2725989 2649347 2569664 2489010 2409138 2331453 2257155 2187034 2121476 2061006
50287 2061006 2006500 1958564 1916925 1880595 1848536 1820164 1795564 1775241 1759376 1747332 1738148
50276 1738148 1731287 1726417 1722792 1719664 1717335 1716968 1719076 1722836 1727109 1731497 1736090 1740937 1746359 1753354
50262 1753354 1762968 1775235 1789045 1803089 1816811 1830477 1844425 1858393 1871834 1884853 1898162
50251 1898162 1911737 1924251 1934728 1944297 1955303 1968874 1984461 2001647 2021012 2042868 2066378
50240 2066378 2090634 2115708 2142117 2170061 2199802 2231844 2265780 2299287 2328816 2350842 2362235
50229 2362235 2360765 2346721 2323799 2297173 2270375 2244447 2219680 2197066 2177867 2162693 2151706
50218 2151706 2145390 2144464 2148902 2157427 2168486 2181774 2198409 2219273 2243600 2269754 2297067 2326079
50206 2326079 2356968 2388534 2418937 2446773 2471297 2492370 2510579 2526928 2542121 2556507 2570447
50195 2570447 2583847 2595264 2602529 2604477 2601101 2591956 2575939 2553268 2526255 2497222 2466941 2436153
50183 2436153 2407141 2382096 2360796 2341443 2323024 2305127 2286072 2263340 2235987 2205077 2171742
50172 2171742 2136565 2101073 2067900 2038489 2011744 1985699 1959589 1933722 1908290 1883140 1858156
50161 1858156 1833346 1808976 1785689 1763706 1741901 1718839 1695020 1672788 1653369 1635388 1617236
50150 1617236 1599587 1584113 1570745 1558037 1545745 1535072 1526199 1517346 1507077 1496256 1486861 1479677
50138 1479677 1474057 1469281 1465121 1461307 1457337 1452890 1447931 1442472 1436717 1431246 1426415 1421723 1416585 1411781
50124 1411781 1409034 1408612 1408313 1405827 1401467 1397379 1394417 1391409 1387699 1384832 1384672 1386973 1390081 1393392 1397652
50109 1397652 1402992 1408254 1412784 1417828 1425371 1436180 1449734 1465664 1484444 1506628 1532057 1560119
50097 1560119 1590478 1623354 1659361 1699527 1745403 1798528 1859156 1925492 1994591 2064103 2132929
50086 2132929 2200376 2265425 2327201 2385526 2440458 2491662 2538823 2582210 2621954 2656797 2684274
50075 2684274 2702185 2709309 2704885 2688376 2660239 2622154 2576013 2523127 2464820 2403093 2339968 2276526
50063 2276526 2213324 2151609 2093360 2040098 1992320 1950089 1913352 1881289 1852113 1824305 1797891
50052 1797891 1773983 1753305 1735599 1720153 1706126 1692579 1679199 1667169 1658222 1652287 1647006 1640318
50040 1640318 1632634 1625423 1618519 1610434 1600980 1591868 1584520 1578833 1574542 1572174 1571756 1572002 1572038 1572868 1575771
50025 1575771 1579978 1583511 1586012 1589323 1595232 1603836 1614222 1625673 1637851 1650505 1663293 1675528
50013 1675528 1686256 1695290 1703981 1714030 1725397 1736188 1744784 1751402 1757276 1762892 1767357 1769265 1768182
50000 1768182 1765474 1763301 1762338 1760992 1757574 1752696 1748465 1745863 1744378 1743908 1745170 1747964 1751035 1754599
49986 1754599 1761313 1773325 1789459 1806791 1824166 1842693 1863412 1886311 1911679 1940795 1974534
49975 1974534 2012201 2052321 2094087 2137632 2183232 2230566 2278452 2325107 2368886 2408969 2445232
49964 2445232 2477421 2504609 2525625 2540070 2549033 2554677 2558668 2560567 2557766 2547140 2526815 2496551
49952 2496551 2457018 2409217 2354507 2294874 2232891 2171174 2111461 2054097 1998692 1945404 1895422
49941 1895422 1850216 1810594 1776566 1747703 1723445 1703218 1686245 1671223 1656637 1641993 1628271
49930 1628271 1616298 1604958 1592215 1577732 1562832 1547581 1529920 1508874 1486913 1467227 1449635
49919 1449635 1431251 1410761 1390040 1371441 1355480 1341625 1329585 1318815 1307935 1295870 1283016
49908 1283016 1270625 1259571 1250189 1242543 1236055 1229453 1221971 1214346 1208013 1203555 1200618 1199107 1199749 1203283
49894 1203283 1209493 1217163 1224825 1231606 1237556 1243111 1248287 1252681 1256276 1259699 1263290 1266324 1267701 1267133
49880 1267133 1265162 1262203 1258213 1253232 1247544 1241099 1233314 1223851 1213241 1202360 1191560 1180744 1170130
49867 1170130 1160366 1151779 1143928 1136253 1128928 1122749 1118219 1115089 1112877 1111608 1111874 1114178 1118246 1122962
49853 1122962 1127107 1130420 1133851 1138320 1143336 1147471 1150433 1153881 1159534 1167011 1174507 1181318 1188539 1197198
49839 1197198 1206815 1216289 1225076 1232576 1237305 1238070 1235782 1232801 1230247 1227010 1221797 1215132 1208478 1202088
49825 1202088 1194880 1186361 1177686 1170431 1164856 1159848 1154360 1148668 1144209 1142219 1142393 1142869 1141785 1138855
49811 1138855 1135229 1132037 1129676 1128517 1129332 1132321 1136273 1139615 1142150 1145060 1149353 1155174 1162552 1171702
49797 1171702 1182176 1192720 1202694 1212802 1223478 1233204 1239718 1242721 1244153 1245582 1246514 1245925 1244406
49784 1244406 1243564 1243568 1242516 1238590 1232128 1224960 1218127 1211110 1203377 1195911 1190554 1188148 1188006 1189044 1190626
49769 1190626 1192033 1192129 1190373 1187750 1185876 1185364 1185758 1186812 1188868 1191911 1195253 1198583 1202622 1208141 1214815
49754 1214815 1221564 1227634 1232899 1237373 1240931 1243428 1244841 1245379 1245467 1245235 1243956 1240593 1235186 1228971 1222764
49739 1222764 1216045 1208337 1200600 1194116 1188512 1182159 1174415 1166189 1158376 1151082 1144590 1139629 1136080 1132736
49725 1132736 1129143 1126582 1126217 1127236 1128012 1128307 1128995 1130111 1130755 1130881 1131774 1134431 1138600 1143790 1150229 1158246
49709 1158246 1167386 1176605 1184877 1191335 1195494 1197727 1199040 1200006 1200468 1200496 1200929 1202328 1203919 1204227 1202489
49694 1202489 1198927 1193960 1187815 1180851 1173757 1167307 1162136 1158698 1157207 1157565 1159324 1161624 1163327 1163730
49680 1163730 1163240 1162880 1163013 1163043 1162502 1161760 1161370 1161407 1161949 1163688 1167431 1173254 1180496 1188184 1195297 1201325 1206970
49663 1206970 1213541 1221168 1228525 1234948 1241710 1250119 1259397 1267878 1275481 1283250 1290925 1296956 1300868 1303692
49649 1303692 1305686 1305477 1302168 1296852 1291301 1286460 1282887 1281282 1281570 1282628 1283824 1285756 1288484 1290300
49635 1290300 1289624 1287318 1285798 1286434 1289075 1293495 1299798 1307573 1315941 1324572 1333730 1343365 1352955 1362175
49621 1362175 1371072 1379879 1389359 1400936 1415608 1432945 1451879 1471791 1491766 1509460 1522403 1530407
49609 1530407 1535257 1537987 1538051 1535448 1532028 1529852 1529466 1530586 1533354 1537891 1543304 1548013 1550592 1549739 1544165
49594 1544165 1533427 1518478 1500864 1481951 1463431 1447559 1435628 1426639 1418592 1410918 1404656 1400434
49582 1400434 1397562 1395279 1393791 1393581 1394494 1395942 1397338 1397803 1396179 1392099 1386651 1381203 1375759 1369180 1360915
49567 1360915 1351740 1342699 1334219 1326676 1320995 1317700 1315666 1312727 1307708 1301314 1295073 1290262 1287957 1288980
49553 1288980 1292791 1297085 1299615 1300460 1301667 1304647 1308743 1312395 1314814 1316067 1316393 1316231 1316497 1318004 1320551
49538 1320551 1323063 1324622 1325045 1324658 1324082 1324284 1326135 1329506 1333162 1336076 1338557 1341554 1344942 1347323 1347795
49523 1347795 1347135 1346629 1346364 1345694 1345007 1345709 1348296 1351725 1355237 1359457 1364714 1369444 1371853 1372733 1375064 1380919
49507 1380919 1390066 1401483 1414594 1428681 1442680 1456293 1469993 1483181 1493797 1500967 1506767 1513729
49495 1513729 1521387 1527037 1529475 1530054 1530066 1529146 1526984 1524877 1524302 1525076 1526278 1528214 1531974 1537302 1542414
49480 1542414 1546256 1549838 1554794 1561458 1568979 1576758 1585030 1594243 1604563 1615997 1628524 1642182 1657550
49467 1657550 1676118 1699505 1727942 1760001 1794235 1830612 1869545 1909550 1946624 1976444 1996980
49456 1996980 2008946 2014387 2015566 2014955 2015102 2017541 2021845 2026344 2029931 2032700 2034628 2034265 2029425 2019086
49442 2019086 2004017 1985555 1964486 1941397 1917388 1893837 1871700 1851391 1832946 1815890 1799378
49431 1799378 1783098 1767794 1754404 1743023 1733359 1725750 1720709 1717611 1714985 1712335 1710612 1710476 1711057
49418 1711057 1711044 1710155 1708819 1707161 1705213 1703606 1703004 1702961 1702362 1701074 1700447 1701920 1705665 1710763 1716300 1722023
49402 1722023 1728108 1734401 1739879 1743168 1743879 1743207 1742773 1743079 1743494 1743410 1742672 1741082 1738476 1735499 1733364 1732307
49386 1732307 1730983 1728089 1724043 1720349 1717763 1716003 1715039 1715485 1717389 1719704 1721817 1725109 1732033 1743626
49372 1743626 1758546 1774544 1790220 1805151 1819135 1832081 1844433 1857015 1870228 1883701 1896768
49361 1896768 1909017 1920304 1930480 1939196 1945868 1949906 1951317 1951101 1950654 1950730 1951406 1953277 1958091 1967526
49347 1967526 1981482 1998260 2016558 2036764 2059951 2086071 2113761 2141794 2170057 2198781 2227357
49336 2227357 2254454 2279190 2301679 2322480 2342012 2360431 2377389 2391630 2401671 2407544 2411298 2414952
49324 2414952 2418153 2418686 2415135 2408122 2398897 2387866 2374965 2360681 2345930 2331289 2316945 2303221
49312 2303221 2290734 2280167 2272080 2266600 2263013 2260071 2257094 2254459 2252605 2250909 2248070 2243372 2237015
49299 2237015 2229342 2220335 2209970 2198585 2186744 2174870 2163042 2151012 2138499 2125677 2113292 2102143
49287 2102143 2092552 2084507 2078088 2073472 2070588 2068970 2067989 2067216 2066848 2067840 2071299 2077551 2085979 2095803 2106408
49272 2106408 2116656 2124476 2127838 2126035 2119690 2109879 2097643 2083973 2069611 2054982 2040619 2027289
49260 2027289 2015220 2003555 1991178 1977821 1963827 1949296 1934275 1919485 1905920 1893788 1882677
49249 1882677 1872668 1864413 1858027 1852736 1847750 1842794 1837894 1833559 1831202 1832180 1835986 1840244 1842940 1843889
49235 1843889 1843789 1842918 1841410 1839854 1838723 1837783 1836768 1835991 1835588 1834766 1832733 1829931 1827522 1826078 1825573 1826277
49219 1826277 1828614 1832345 1836960 1842900 1851402 1862877 1876104 1889289 1901316 1911804 1920617 1927689 1932927
49206 1932927 1936046 1936886 1936125 1935276 1935617 1937182 1938959 1939968 1940149 1940468 1942276 1946427 1952867 1960969 1970076
49191 1970076 1979630 1989024 1997547 2004228 2007679 2006562 2000759 1991802 1981628 1971143 1960381 1949628 1939540
49178 1939540 1930324 1921776 1914280 1908967 1906621 1907035 1909655 1914254 1920744 1929049 1939410 1952109 1966466
49165 1966466 1980911 1994659 2008751 2024698 2042565 2061087 2079243 2096799 2113648 2129662 2145347
49154 2145347 2161690 2178899 2195797 2210884 2223737 2235296 2247219 2261185 2278300 2298662 2321568
49143 2321568 2346382 2373091 2401832 2432120 2462882 2493239 2523002 2552396 2581428 2609593 2636152
49132 2636152 2660807 2684190 2707538 2731647 2756114 2779873 2802537 2824961 2848252 2872440 2896559
49121 2896559 2920201 2944617 2971989 3003677 3039286 3077332 3116634 3157327 3200933 3249358 3303236
49110 3303236 3360839 3418771 3473758 3523601 3566620 3601126 3626238 3642984 3653874 3661358 3667183 3673145
$$ [...]
##END NTUPLES=NMR SPECTRUM
##END=
