
##TITLE=UV1024_M3-1004-1000_6269813_UShNbwHXxB
##JCAMPDX= 6.0         $$ Bruker NMR JCAMP-DX V2.0
##DATA TYPE= NMR SPECTRUM
##DATA CLASS= NTUPLES
##ORIGIN= BRUKER
##OWNER= Administrator
$$ 1.72 TOPSPIN		Version 2.1
$$ 2012-06-02 05:10:02.000 -0500  Administrator@TOPSPIN
$$ Compression mode = diff/dup
##.OBSERVE FREQUENCY= 400.13188235
##.OBSERVE NUCLEUS= ^1H
##.ACQUISITION MODE= SIMULTANEOUS (DQD)
##.ACQUISITION SCHEME= undefined
##.AVERAGES= 8
##.DIGITISER RES= 22
##SPECTROMETER/DATA SYSTEM= spect
##.PULSE SEQUENCE= zg30
##.SOLVENT NAME= COFFEE_calctemp
##.SHIFT REFERENCE= INTERNAL, COFFEE_calctemp, 1, 14.98061
##AUDIT TRAIL= $$ (NUMBER, WHEN, WHO, WHERE, PROCESS, VERSION, WHAT)
$$ ##TITLE= Audit trail, TOPSPIN		Version 2.1
$$ ##JCAMPDX= 5.01
$$ ##ORIGIN= Bruker BioSpin GmbH
$$ ##OWNER= Administrator
$$ $$ C:\Bruker\TOPSPIN/data/COFFEE/nmr/UV1024_M3-1004-1000_6269813_UShNbwHXxB/60/pdata/1/auditp.txt
$$ ##AUDIT TRAIL=  $$ (NUMBER, WHEN, WHO, WHERE, PROCESS, VERSION, WHAT)
(   1,<2012-06-02 05:09:53.812 -0500>,<Administrator>,<TOPSPIN>,<go>,<TOPSPIN 2.1>,
      <created by zg
	started at 2012-06-02 05:08:46.796 -0500,
	POWCHK enabled, PULCHK disabled,
       configuration hash MD5:
       D5 CA 7A 23 FE 6B EE E2 50 67 74 61 24 F7 5E 3B
       data hash MD5: 64K
       60 7C 55 9E 36 F4 D8 A6 37 17 EC B6 5A 0D 48 A8>)
(   2,<2012-06-02 05:09:57.671 -0500>,<Administrator>,<TOPSPIN>,<proc1d>,<TOPSPIN 2.1>,
      <Start of raw data processing
       efp LB = 0 FT_mod = 6 PKNL = 1 PHC0 = 0 PHC1 = 0 SI = 32K 
       data hash MD5: 32K
       E9 92 7A A9 C7 D0 6A 16 E5 B5 EC AB 93 B2 AA 46>)
(   3,<2012-06-02 05:09:57.968 -0500>,<Administrator>,<TOPSPIN>,<proc1d>,<TOPSPIN 2.1>,
      <pk PHC0 = 207.301 PHC1 = 0 
       data hash MD5: 32K
       FC F7 9C 68 30 A2 61 3A 80 61 54 39 25 47 17 C2>)
(   4,<2012-06-02 05:09:58.187 -0500>,<Administrator>,<TOPSPIN>,<proc1d>,<TOPSPIN 2.1>,
      <abs ABSG = 1 
       data hash MD5: 32K
       33 F7 93 A8 73 0C 36 20 0B 1B E4 59 3C 74 F9 E4>)
(   5,<2012-06-02 05:09:58.375 -0500>,<Administrator>,<TOPSPIN>,<proc1d>,<TOPSPIN 2.1>,
      <abs ABSG = 2 
       data hash MD5: 32K
       97 03 76 50 B2 AE 11 42 6A 4C 49 65 1D 34 A0 6B>)
(   6,<2012-06-02 05:09:58.406 -0500>,<Administrator>,<TOPSPIN>,<proc1d>,<TOPSPIN 2.1>,
      <abs ABSG = 3 
       data hash MD5: 32K
       08 1A 79 6F 4E A3 95 45 C7 C0 BD 13 71 D3 B7 9C>)
(   7,<2012-06-02 05:09:58.437 -0500>,<Administrator>,<TOPSPIN>,<proc1d>,<TOPSPIN 2.1>,
      <abs ABSG = 4 
       data hash MD5: 32K
       9E 39 EC 02 97 86 4B DD A0 9D B5 E2 F2 69 30 FB>)
(   8,<2012-06-02 05:09:58.468 -0500>,<Administrator>,<TOPSPIN>,<proc1d>,<TOPSPIN 2.1>,
      <abs ABSG = 5 
       data hash MD5: 32K
       C9 62 80 23 0F F3 96 04 8E D6 50 12 48 1C 05 37>)
$$ ##END=
$$ 
$$ $$ hash MD5
$$ $$ 63 B3 F4 FD D2 E7 AC 1B F6 27 07 07 E9 88 9E 81
##$RELAX= 
##$RELAX= 
##$RELAX= 
##$RELAX= 
##$RELAX= 
##$RELAX= 
##$RELAX= 
$$ Bruker specific parameters
$$ --------------------------
$$ [...]
150 150 150 150 150 150 150 150
##$TP07= 0
##$TPNAME0= <>
##$TPNAME1= <>
##$TPNAME2= <>
##$TPNAME3= <>
##$TPNAME4= <>
##$TPNAME5= <>
##$TPNAME6= <>
##$TPNAME7= <>
##$TPOAL= (0..7)
0.5 0.5 0.5 0.5 0.5 0.5 0.5 0.5
##$TPOFFS= (0..7)
0 0 0 0 0 0 0 0
##$TUNHIN= 0
##$TUNHOUT= 0
##$TUNXOUT= 0
##$USERA1= <user>
##$USERA2= <user>
##$USERA3= <user>
##$USERA4= <user>
##$USERA5= <user>
##$V9= 5
##$VALIST= <valist>
##$VCLIST= <CCCCCCCCCCCCCCC>
##$VD= 0
##$VDLIST= <DDDDDDDDDDDDDDD>
##$VPLIST= <PPPPPPPPPPPPPPP>
##$VTLIST= <TTTTTTTTTTTTTTT>
##$WBST= 2048
##$WBSW= 25
##$XGAIN= (0..3)
0 0 0 0
##$XL= 0
##$YL= 0
##$YMAX_a= 527256
##$YMIN_a= -654211
##$ZGOPTNS= <>
##$ZL1= 120
##$ZL2= 120
##$ZL3= 120
##$ZL4= 120
##$ABSF1= 14.98061
##$ABSF2= -5.57192
##$ABSG= 5
##$ABSL= 3
##$ALPHA= 0
##$AQORDER= 0
##$ASSFAC= 0
##$ASSFACI= 0
##$ASSFACX= 0
##$ASSWID= 0
##$AUNMP= <proc_prof1d_extract_pilot.lims>
##$AXLEFT= 0
##$AXNAME= <>
##$AXNUC= <1H>
##$AXRIGHT= 0
##$AXTYPE= 0
##$AXUNIT= <>
##$AZFE= 0.1
##$AZFW= 0.1
##$BCFW= 0
##$BC_mod= 0
##$BYTORDP= 0
##$COROFFS= 0
##$CY= 15
##$DATMOD= 1
##$DC= 0
##$DFILT= <>
##$DTYPP= 0
##$F1P= 0
##$F2P= 0
##$FCOR= 0.5
##$FTSIZE= 32768
##$FT_mod= 6
##$GAMMA= 0
##$GB= 0
##$INTBC= 1
##$INTSCL= 1
##$ISEN= 128
##$LB= 0
##$LEV0= 0
##$LPBIN= 0
##$MAXI= 10000
##$MC2= 0
##$MEAN= 0
##$ME_mod= 0
##$MI= 0
##$NCOEF= 0
##$NC_proc= -8
##$NLEV= 6
##$NOISF1= 0
##$NOISF2= 0
##$NSP= 0
##$NTH_PI= 0
##$NZP= 0
##$OFFSET= 14.98061
##$PC= 1
##$PHC0= 207.301
##$PHC1= 0
##$PH_mod= 1
##$PKNL= yes
##$PPARMOD= 0
##$PPDIAG= 0
##$PPIPTYP= 0
##$PPMPNUM= 2147483647
##$PPRESOL= 1
##$PSCAL= 4
##$PSIGN= 0
##$PYNMP= <proc.py>
##$REVERSE= no
##$SF= 400.13
##$SI= 32768
##$SIGF1= 0
##$SIGF2= 0
##$SINO= 400
##$SIOLD= 32768
##$SPECTYP= <>
##$SREGLST= <1H.CDCl3>
##$SSB= 0
##$STSI= 32768
##$STSR= 0
##$SW_p= 8223.68421052632
##$SYMM= 0
##$S_DEV= 0
##$TDeff= 65536
##$TDoff= 0
##$TI= <>
##$TILT= no
##$TM1= 0
##$TM2= 0
##$TOPLEV= 0
##$USERP1= <user>
##$USERP2= <user>
##$USERP3= <user>
##$USERP4= <user>
##$USERP5= <user>
##$WDW= 1
##$XDIM= 32768
##$YMAX_p= 464165362
##$YMIN_p= -713015
##$CURPLOT= <Network HP LaserJet P1505>
##$CURPRIN= <$Network HP LaserJet P1505>
##$DFORMAT= <normdp>
##$LAYOUT= <+/1D_H.xwp>
##$LFORMAT= <normlp>
##$PFORMAT= <normpl>
##$SURQMSG= 1
$$ End of Bruker specific parameters
$$ ---------------------------------
##NTUPLES= NMR SPECTRUM
##VAR_NAME=  FREQUENCY,     SPECTRUM/REAL,   SPECTRUM/IMAG
##SYMBOL=    X,             R,               I
##VAR_TYPE=  INDEPENDENT,   DEPENDENT,       DEPENDENT
##VAR_FORM=  AFFN,          ASDF,            ASDF
##VAR_DIM=   32768,         32768,           32768
##UNITS=     HZ,            ARBITRARY UNITS, ARBITRARY UNITS
##FACTOR=    0.250966925370066, 1,           1
##FIRST=     8223.43324360095, 33797,        -191119
##LAST=      0,             -215003,         -244656
##MIN=       0,             -713015,         0
##MAX=       8223.43324360095, 464165362,    0
$$ Real data points
##PAGE= N=1
##DATA TABLE= (X++(R..R)), XYDATA
$$ [...]
19517B03991c83028a62314A47866g0284n1399F5959m34b7882j36611A65202J0739
$$ 203991 -383028 -162314 147866 -70284 -121683 65959 65525 -27882 -164493 165202 175941
19506A75941a43887a4214j23319H3797a72827P4126j11065j76104B11254i1318
$$ 175941 -143887 -14214 -137533 83797 -172827 -98701 -209766 -385870 211254 -91318
19495a55611j26263q6606B75104e7593B95457a37046l57497B76225A03678a67427
$$ -155611 -281874 -368480 275104 -57593 295457 -137046 -494543 276225 103678 -167427
19484a6712k8145A6396R1773a34465A67976F8378c6975j87319R8070E1558a93838
$$ -16712 -44857 16396 108169 -134465 167976 68378 -36975 -224294 -126224 51558 -193838
19472A69081E8688B6608a61466B3988a97824D1660e3689B10606a24544E7005a07553
$$ 169081 58688 26608 -161466 23988 -197824 41660 -53689 210606 -124544 57005 -107553
19460b51955I7880i6377E6644a43775K0676e8983k06265b0275j34436k17306A80194
$$ -251955 97880 -96377 56644 -143775 -123099 -58983 -265248 -20275 -154711 -372017 180194
19448C2346e40190a25343j3151o8660h940k56383a01832D1248a34411M4951L5571
$$ 32346 -540190 -125343 -138494 -207154 -8940 -265323 -101832 41248 -134411 -89460 -53889
19437e3889a221j83120O4937B87381E4262a15051r3578O4294c3k08679o4180G3281
$$ -53889 -1221 -184341 -119404 287381 54262 -115051 -208629 -144335 -33 -208712 -272892 73281
19424d8769j10181m2219P410l91275b7191l73966A40127a2097A6997b22661N5420
$$ -48769 -158950 -201169 -193759 -585034 -27191 -401157 140127 -12097 16997 -222661 -167241
19413a67241E2405a1611p9646B0132i4055c6052F4662b27593R7955j4271q5048
$$ -167241 52405 -11611 -91257 20132 -94055 -36052 64662 -227593 -129638 -143909 -228957
19402b28957o0882G0448J06203J29475c56143g8368q9192B95847A26314M8381
$$ -228957 -289839 70448 176651 306126 -356143 -78368 -167560 295847 126314 174695
19392A74695d4194l07580a72132A71566a1561r2570j2272A06433i0584L1451j62988
$$ 174695 -44194 -351774 -172132 171566 -11561 -104131 -116403 106433 -90584 -59133 -222121
19381b22121a4273p0822L6493D7041K33015b98238I940K8075a138l84001A38778
$$ -222121 -14273 -85095 -48602 47041 280056 -298238 9940 38015 -1138 -385139 138778
19369a45851j59620A60279d3530O124B9662N3252e6689A85327b7909H1192P1720
$$ -145851 -305471 160279 -43530 -37406 29662 82914 -56689 185327 -27909 81192 152912
19358A52912h1900k9787O48D9620L51063a33937A79538b21310A5552a8316E7597
$$ 152912 -81900 -111687 -111039 49620 400683 -133937 179538 -221310 15552 -18316 57597
19346c23720J12420A37706I136b51533e4383C9298J15235a95306J8674B9065a27811
$$ -323720 -211300 137706 9136 -251533 -54383 39298 154533 -195306 -176632 29065 -127811
19334A04388b62529a10118C0334B176c07878d9769o3703A18155a53802d4282j32781
$$ 104388 -262529 -110118 30334 2176 -307878 -49769 -113472 118155 -153802 -44282 -177063
19323a77063I6582a6537j20838N1037j09923a252k61449a19988A87502N574b6080
$$ -177063 96582 -16537 -137375 -86338 -196261 -1252 -262701 -119988 187502 193076 -26080
19311c2500A45918b39212J12152j83277D8185a11106p6291Q4347C7109J91136
$$ -32500 145918 -239212 -127060 -310337 48185 -111106 -187397 -103050 37109 228245
19301B28245J1019a96771J633A81523c72167f0260D69326g3389b2355k07227p3784
$$ 228245 239264 -196771 -195138 181523 -372167 -60260 469326 -73389 -22355 -229582 -303366
19290c03366b1247j18716O5559k2989o0825l4771c2671p3976C3119e144j29942
$$ -303366 -21247 -139963 -74404 -97393 -158218 -192989 -32671 -106647 33119 -5144 -135086
19279a35086C9670O9247l1327h4632l31572a5300F5589k6817R2156c96307A21241
$$ -135086 39670 108917 77590 -84632 -416204 -15300 65589 38772 130928 -396307 121241
19267D281c11485g7683K3931m9109k3933n86221a20082A00826c6667j06201p7373
$$ 4281 -311485 -77683 -53752 -102861 -126794 -713015 -120082 100826 -36667 -142868 -220241
19256b20241l8987a3692F9966i9690J348c5905m06043a01143J8387k50646f4525
$$ -220241 -259228 -13692 69966 -99690 -98342 -35905 -441948 -101143 -82756 -333402 -64525
19244A50644b35155f7166A87865o3068e2945j3737j51161k120B72840b01791f5805
$$ 150644 -235155 -67166 187865 124797 -52945 -66682 -217843 -219963 272840 -201791 -65805
19232H7408b31040b1925H4451d1793k95362A68434c74738A99481B1031h7724j41611
$$ 87408 -231040 -21925 84451 -41793 -337155 168434 -374738 199481 21031 -87724 -229335
19221b29335A15973B7883d09028J56957A59065f063I8742b53691i3855g787A9939
$$ -229335 115973 27883 -409028 -252071 159065 -6063 98742 -253691 -93855 -7787 19939
19209h9818K2191r0932o1725k11343a41188e9098A05569J26775b85217C7597a47244
$$ -89818 -67627 -158559 -220284 -431627 -141188 -59098 105569 232344 -285217 37597 -147244
19197a89035e0935o6339B24918b72554J19752G4412c23287A32083d5962J6347
$$ -189035 -50935 -117274 224918 -272554 -152802 74412 -323287 132083 -45962 -29615
19187b9615D64379a09429d3801B5834d851A47053N9648q2469b49206d255B57643
$$ -29615 464379 -109429 -43801 25834 -4851 147053 206701 124232 -249206 -4255 257643
19175d5914I945a06146o7782j83413J40543j90347a08003o8210A69829m3240a5798
$$ -45914 9945 -106146 -173928 -357341 -216798 -407145 -108003 -176213 169829 126589 -15798
19163G7668b37188B05808f8443Q843k8038K0608k9459k2681A31899J15397r5728
$$ 77668 -237188 205808 -68443 -59600 -87638 -67030 -96489 -119170 131899 247296 151568
19152A51568g2088q50K6326D6996c56163d9287j53078q2661B4863J14679a31309
$$ 151568 -72088 -72938 -46612 46996 -356163 -49287 -202365 -285026 24863 139542 -131309
19140f1414j92023r4999J1506O4913L3063j7569A92969f7958B0646J17997L1606
$$ -61414 -253437 -348436 -336930 -272017 -238954 -256523 192969 -67958 20646 138643 170249
19129A70249o3154b52732A93198g5153Q306j68314l9467P0989N6125H3344a48897
$$ 170249 107095 -252732 193198 -75153 -66847 -235161 -274628 -203639 -147514 83344 -148897
19117b46176m3051Q5008O8085b0587A91487J85441F4817J09622a89750b6107m9413
$$ -246176 -289227 -204219 -136134 -20587 191487 376928 64817 174439 -189750 -26107 -75520
19106g5520b6196l38893J64820N455B6605K65879b4962j10225M4317j77524P9446
$$ -75520 -26196 -365089 -200269 -194814 26605 292484 -24962 -135187 -90870 -268394 -188948
19095a88948d3786j63135E6351d10495b04963A88222k5975a5530k16941H3428
$$ -188948 -43786 -206921 56351 -410495 -204963 188222 162247 -15530 -232471 83428
19084B24303J92545A31084A1864b7347j65771I3047h4495j6237o1371C99313b91762
$$ 224303 416848 131084 11864 -27347 -193118 93047 -84495 -100732 -162103 399313 -291762
19072b1849r334j88136R9658a7529l55614B9638K28011g2267J0837A49186a31642
$$ -21849 -31183 -219319 -119661 -17529 -373143 29638 257649 -72267 -61430 149186 -131642
19060i8951j08168n2793B87834a15462G3098e3343C0345b44922A25185M6273b01923
$$ -98951 -207119 -259912 287834 -115462 73098 -53343 30345 -244922 125185 171458 -201923
19048d8267k43187b7564G5137b24346C88311j88329c18872E192K2784a26175p209
$$ -48267 -291454 -27564 75137 -224346 388311 199982 -318872 5192 27976 -126175 -133384
19037a33384K0257e0716G691a31116f0816B2914J26395L0733b75588a17408e2681
$$ -133384 -113127 -50716 7691 -131116 -60816 22914 149309 180042 -275588 -117408 -52681
19025B34948a34751a4634k72652B80739F6597l629j1905J65360d1825k22719B07300
$$ 234948 -134751 -14634 -287286 280739 66597 62968 51063 216423 -41825 -264544 207300
19013b32737c835C9683I905d7269A67980P1935O4975b08981e7690o8539q3194
$$ -232737 -3835 39683 9905 -47269 167980 239915 304890 -208981 -57690 -126229 -209423
19002b09423J316B11071M0530b01022N6439A92964g6156k96032C48619f2051k23820
$$ -209423 -208107 211071 251601 -201022 -144583 192964 -76156 -372188 348619 -62051 -285871
18991b85871j29812a71104b657B1128f0066b7781j71095g5088j58997i5626n7801
$$ -285871 -415683 -171104 -2657 21128 -60066 -27781 -198876 -75088 -234085 -95626 -153427
18980a53427M1819j8142C6767b36531J04765O0220A00637a89697A76676b09652
$$ -153427 -111608 -129750 36767 -236531 -131766 -71546 100637 -189697 176676 -209652
18969A17923d0202I5544c60340B52716a63127E1676K35587i0029j75367A21385
$$ 117923 -40202 95544 -360340 252716 -163127 51676 287263 -90029 -265396 121385
18958A0136a60393J2983m5664I2231D3922c26001c3812j56321Q5018o1282A61459
$$ 10136 -160393 -147410 -193074 92231 43922 -326001 -33812 -190133 -105115 -166397 161459
18946B05320C4361a35869K6741A0335B802a65965r7249A39395a95025F5038f1694
$$ 205320 34361 -135869 -109128 10335 2802 -165965 -263214 139395 -195025 65038 -61694
18934A22482e581A27579a81182B06413b13537A06493a70437b6289j10556H0252
$$ 122482 -5581 127579 -181182 206413 -213537 106493 -170437 -26289 -136845 80252
18923c33424B48137h195r1019A50734D9336h7922H3529b63782A7950b0857k91924
$$ -333424 248137 -8195 -99214 150734 49336 -87922 83529 -263782 17950 -20857 -312781
18912c12781K3626I5003c26022b9109C3598K07452a6645r0991k05204b3204l31299
$$ -312781 -289155 95003 -326022 -29109 33598 241050 -16645 -107636 -312840 -23204 -354503
18901c54503c783k29768I172c74540A45632e8479n5702A4551J13928m6401a29372
$$ -354503 -3783 -233551 9172 -374540 145632 -58479 -114181 14551 128479 82078 -129372
18889B62877i0240A65251B7671a00242k7277q0527A82279e3490j55623Q2181f537
$$ 262877 -90240 165251 27671 -100242 -127519 -208046 182279 -53490 -209113 -126932 -6537
18877A92620a42627O2368b8559C5982b97853C04265E1704a81132j34156n9405
$$ 192620 -142627 -80259 -28559 35982 -297853 304265 51704 -181132 -315288 -374693
18867c74693J69584E7566J28968a33326l28150A07009b40091A19110D9798b64457
$$ -374693 -205109 57566 186534 -133326 -461476 107009 -240091 119110 49798 -264457
18856h2207B92274e07222B49104a12765n6272q7088e3432B16285i4225j18517
$$ -82207 292274 -507222 249104 -112765 -169037 -256125 -53432 216285 -94225 -212742
18846b12742L1821P5628j98559h4030k74170h0257G651c47015A51055h9075I0805
$$ -212742 -180921 -105293 -303852 -84030 -358200 -80257 7651 -347015 151055 -89075 90805
18834F0212J3938i1974I8818a77513M3877K2034o3446JB86888e0226k5890A45316
$$ 60212 74150 -91974 98818 -177513 -133636 -111602 -175048 -175047 286888 -50226 -76116 145316
18821a98061h7961d2862a8295k41288J23705j06176f8276j10030B23525A5536
$$ -198061 -87961 -42862 -18295 -259583 -135878 -242054 -68276 -178306 223525 15536
18810a09098l2912B02706a70684A98508a06568j32081B9853J54773G8500l3396
$$ -109098 -142010 202706 -170684 198508 -106568 -238649 29853 184626 78500 45104
18800D5104a36021j45107J13848C11236B2042R1509a59345B3531O4146d05419
$$ 45104 -136021 -281128 -167280 311236 22042 113551 -159345 23531 87677 -405419
18789A49183D7810b39402A4504c1937A24910J42986i7330C9463a42825a8589A02952
$$ 149183 47810 -239402 14504 -31937 124910 267896 -97330 39463 -142825 -18589 102952
18777D7532L4228c1064j84362A88903b70174A31841b66812C52976c0725A03298
$$ 47532 81760 -31064 -215426 188903 -270174 131841 -266812 352976 -30725 103298
18766B85249b47k34915a3580A49716c22644a5083j53267L4791h020j20389A94979
$$ 285249 -247 -235162 -13580 149716 -322644 -15083 -168350 -133559 -8020 -128409 194979
18754a58602j4467j92388a1956l43502B44937a05004A93061a37037B16908A8171
$$ -158602 -173069 -365457 -11956 -355458 244937 -105004 193061 -137037 216908 18171
18743c09446C3231J59456E4786a71137J8855o4549R5311A8243M6238K22716a09236
$$ -309446 33231 192687 54786 -171137 -152282 -216831 -121520 18243 64481 287197 -109236
18731C4957i1184A56627K5355h0921k7983B01820b61884C58617b74456g4114B40058
$$ 34957 -91184 156627 181982 -80921 -108904 201820 -261884 358617 -274456 -74114 240058
18719f2725A93716b33778b3642k30550C28341d8360k16860E5802a16946C2502
$$ -62725 193716 -233778 -23642 -254192 328341 -48360 -265220 55802 -116946 32502
18708A70928b03789K1617f8856i749k57085n5751g2577L1535M277k4494B72373
$$ 170928 -203789 -182172 -68856 -9749 -266834 -322585 -72577 -41042 -36765 -61259 272373
18696e793k46220K6136C71103a58o1654A55278a17485b976j54608f8252A48058
$$ -5793 -252013 -225877 371103 -158 -61812 155278 -117485 -2976 -157584 -68252 148058
18684B39481d25774H6515a04494j6621P103B6509b11652L6749A91541q5833i6337
$$ 239481 -425774 86515 -104494 -121115 -114012 26509 -211652 -174903 191541 105708 -96337
18672f8092b85j514l41835a34962j79596G5243g2203e177r8105B55548e3908j5184
$$ -68092 -285 -1799 -343634 -134962 -314558 75243 -72203 -5177 -103282 255548 -53908 -69092
18660f9092G887N6122L7346N6861E9335a43265b6776j43274B5678R5945k7818
$$ -69092 7887 64009 101355 158216 59335 -143265 -26776 -170050 25678 121623 93805
18649I3805a51303c9582l2978B09882H2392b375r5444j24174i468j42678k17696
$$ 93805 -151303 -39582 -72560 209882 82392 -2375 -97819 -221993 -9468 -152146 -369842
18638c69842a79688m1591M6060j30499d8712l2293r1334l73859J44011A82765
$$ -369842 -179688 -221279 -175219 -305718 -48712 -81005 -172339 -546198 -402187 182765
18627H1529h038G926b72174j88491B56485p5316b41988L3422e0540n4764j68574
$$ 81529 -8038 7926 -272174 -460665 256485 181169 -241988 -208566 -50540 -105304 -273878
18616b73878i3426j35124L8739A99614I6186a56008k14081J34725q1710g4825
$$ -273878 -93426 -228550 -189811 199614 96186 -156008 -370089 -235364 -317074 -74825
18605B07797f3146B04274G5642b26685D88392C6194a61196F69i806k33727G2135
$$ 207797 -63146 204274 75642 -226685 488392 36194 -161196 669 -9806 -243533 72135
18593g2049C10062f0623a2883F7123L58611A2039J19197F1392M910n576a55224
$$ -72049 310062 -60623 -12883 67123 425734 12039 131236 61392 66302 60726 -155224
18581b77760B673d68442a46380G9170J04611e02838e5309j10032l9371f0437l715
$$ -277760 2673 -468442 -146380 79170 183781 -502838 -55309 -165341 -204712 -60437 -64152
18570f4152l55631G5446b65000j1677a28379I2915i5118H8532b58683i8639H6808
$$ -64152 -419783 75446 -265000 -276677 -128379 92915 -95118 88532 -258683 -98639 86808
18558H2305a7761j24071k4488d4664D7979p050M2246a57353f3163o1915B68329
$$ 82305 -17761 -141832 -166320 -44664 47979 40929 83175 -157353 -63163 -125078 268329
18546C3383O8874K9985c17355O3730B53818d7185j72539F0061C23c79792a39821
$$ 33383 102257 132242 -317355 -253625 253818 -47185 -219724 60061 323 -379792 -139821
18534E4231b5003G8034e9504j88952D7230j9222c49316G499K69618A6530M3690
$$ 54231 -25003 78034 -59504 -248456 47230 28008 -349316 7499 277117 16530 60220
18523F0220b97076C5376b18480d9256C0745i0772M4154A66831g1418K22d661k8930
$$ 60220 -297076 35376 -218480 -49256 30745 -90772 -46618 166831 -71418 -71196 -4661 -33591
18511c3591k28525o4044g5576P185B34008a82694A47982e6691j8497b2890E782
$$ -33591 -262116 -326160 -75576 -68391 234008 -182694 147982 -56691 -75188 -22890 5782
18499B89389i8435M5622l59731g9805j66981A28894c04036b6404D2574b58897
$$ 289389 -98435 -52813 -412544 -79805 -246786 128894 -304036 -26404 42574 -258897
18488g238C9260Q7918Q1667a61994o13D5267R4337o685E9659K5939R0075d31765
$$ -7238 39260 127178 208845 -161994 -162607 45267 139604 132919 59659 85598 175673 -431765
18475A0951b41163J01191d4049j90561E5408a99191g3640A18748a28813f602k87486
$$ 10951 -241163 -139972 -44049 -234610 55408 -199191 -73640 118748 -128813 -6602 -294088
18464b94088G8316a03509k43059c4863j10956C83710A8665a04365E7413K1746
$$ -294088 78316 -103509 -346568 -34863 -145819 383710 18665 -104365 57413 79159
18454G9159L1779J14170C3644J39788a02394N75j19362k13648i3376b1179j77428
$$ 79159 110938 225108 33644 173432 -102394 -101819 -221181 -434829 -93376 -21179 -198607
18443a98607B74867a60430F6190j1132c47167c2616j37391h2997k33431B3994
$$ -198607 274867 -160430 66190 55058 -347167 -32616 -170007 -82997 -316428 23994
18432B5673H352a13449l46733J42145B56649d0606l61305a59820O261q5489j22647
$$ 25673 8352 -113449 -460182 -318037 256649 -40606 -401911 -159820 -153559 -239048 -361695
18421c61695I0978J2130a31786F8589b16680A03864b7986k38669j31786J81676
$$ -361695 90978 103108 -131786 68589 -216680 103864 -27986 -266655 -398441 -216765
18411b16765g5742B08625c00385j40637A08384f9339j92588M0823O468c3374r134
$$ -216765 -75742 208625 -300385 -441022 108384 -69339 -261927 -221104 -214636 -33374 -42508
18400d2508J2496j12603j67035O2808A34366K9189J54200q5402e26E15330e3293
$$ -42508 -30012 -142615 -309650 -246842 134366 163555 317755 232353 -526 515330 -53293
18388A5980K3962a81270A0354h677R16A9086d551j50814q1938P1569E2163j8298
$$ 15980 39942 -181270 10354 -8677 -7761 19086 -4551 -155365 -237303 -165734 52163 33865
18376C3865g5697A38142o5324a83804N3323j26260a20078q0943B40215e6435B773
$$ 33865 -75697 138142 72818 -183804 -130481 -256741 -120078 -201021 240215 -56435 2773
18364b46317A8681d8940j25474k152K3612c6617C5044J034M084f6423G1050i5472
$$ -246317 18681 -48940 -174414 -176566 -152954 -36617 35044 36078 40162 -66423 71050 -95472
18351A80768c80940b4920k08284O834a09175m5317A18479d8115A59161G7093d9477
$$ 180768 -380940 -24920 -233204 -226370 -109175 -154492 118479 -48115 159161 77093 -49477
18339a40295c2867A64607C0970h8088p1122A35574j1879c8988n2518k21654L0664
$$ -140295 -32867 164607 30970 -88088 -159210 135574 123695 -38988 -91506 -313160 -282496
18328b82496N5128i8804l6074A85772b40273Q4696O0346A05293b03964B00766
$$ -282496 -227368 -98804 -134878 185772 -240273 -155577 -95231 105293 -203964 200766
18317E2480a32892p8634A78010f4311K1866D7962a579j27286I2178A9950K02578
$$ 52480 -132892 -211526 178010 -64311 -42445 47962 -1579 -128865 92178 19950 222528
18306B22528D5844M915a67582A57656c58811C22761g6184E5779a25990C37551
$$ 222528 45844 50759 -167582 157656 -358811 322761 -76184 55779 -125990 337551
18295c90751B65663a56575C0338b04611j1102h5500D4843Q1535D8097g1035A41925
$$ -390751 265663 -156575 30338 -204611 -215713 -85500 44843 126378 48097 -71035 141925
18283a76621h2577c8065B49091A8336N0951J19666h755n6034m5259H1425a412
$$ -176621 -82577 -38065 249091 18336 69287 188953 -8755 -64789 -110048 81425 -1412
18271H8437b31157P0281L3884C02911b27807j2214B5755b6747A35895j2012C0873
$$ 88437 -231157 -160876 -126992 302911 -227807 -240021 25755 -26747 135895 123883 30873
18259A79568J81208A60931c17209J19611P2369p0516A12527P7404a17804j36977
$$ 179568 360776 160931 -317209 -197598 -125229 -195745 112527 189931 -117804 -254781
18249b54781p2452b5287C9174K83167a4281G5103b4223r0491a6386B3575a94339
$$ -254781 -327233 -25287 39174 322341 -14281 75103 -24223 -114714 -16386 23575 -194339
18237C14823F6403a39890I8582c6938k7724k832c1999o6985B18561b10486j59416
$$ 314823 66403 -139890 98582 -36938 -64662 -67494 -31999 -98984 218561 -210486 -369902
18226c69902b6678r7997A19236a12466A4027b20396a3435j85320G6046K27563
$$ -369902 -26678 -124675 119236 -112466 14027 -220396 -13435 -198755 76046 303609
18216C03609A16756i9466A4903a19140A19560B2992a13291F211J94575a20353
$$ 303609 116756 -99466 14903 -119140 119560 22992 -113291 6211 200786 -120353
18205b47235f1943j24683A87781E9423e7656C4694d95182g0653E4151K81967a43197
$$ -247235 -61943 -186626 187781 59423 -57656 34694 -495182 -70653 54151 336118 -143197
18193a51056A34619J69363A34293j9350L59667c4344k26360J12841f3157H3679
$$ -151056 134619 303982 134293 114943 474610 -34344 -260704 -147863 -63157 83679
18182b55300G1052e6450k98414g7621B52547j21401D4258c96p8077q4626B4584
$$ -255300 71052 -56450 -354864 -77621 252547 131146 44258 -396 -78473 -163099 24584
18170H5372b66032O27b5090h67A96300C79J91014d3876J3679k3530r4194r0763
$$ 85372 -266032 -265405 -25090 -867 196300 379 191393 -43876 -30197 -53727 -147921 -238684
18158b38684B04859c38911K5016C241b92741C34637B9993n482Q3462J14314b2078
$$ -238684 204859 -338911 -313895 3241 -292741 334637 29993 24511 107973 222287 -22078
18146a79300j14937f0707l12841a85939A08746a41067A43463b73153B6130J8351
$$ -179300 -294237 -60707 -373548 -185939 108746 -141067 143463 -273153 26130 44481
18136D4481f3362q9709C43492A52268M2255n1555b69453E0701J0303c73068I3980
$$ 44481 -63362 -153071 343492 152268 194523 142968 -269453 50701 61004 -373068 93980
18124a50077G1407J23601h6857J925E319J42645D0590Q3242j7850B1841J03091
$$ -150077 71407 195008 -86857 -84932 5319 147964 40590 123832 105982 21841 124932
18113A24932a5606D9117a82228B94477A3018J19191c15583a53983C26988c18107
$$ 124932 -15606 49117 -182228 294477 13018 132209 -315583 -153983 326988 -318107
18102g593l08219d5453l0618o8857b0451B34553a0596k94249B9316J68165P4252
$$ -7593 -315812 -45453 -76071 -144928 -20451 234553 -10596 -304845 29316 197481 271733
18091B71733c23802a1388D1471c41813e0861A08199c0297k22663a02800o4404
$$ 271733 -323802 -11388 41471 -341813 -50861 108199 -30297 -252960 -102800 -167204
18081a67204A64481a53716j26867I7657a12863I4361b0037B22002a69209H4210
$$ -167204 164481 -153716 -280583 97657 -112863 94361 -20037 222002 -169209 84210
18070f9000B05163c44386a04766q5277m4520A23425l4436b9522A175a07360p4778
$$ -69000 205163 -344386 -104766 -190043 -234563 123425 88989 -29522 1175 -107360 -182138
18059a82138B69283a59500f5570C5435J23313e2374j12987d5176C02843h9505
$$ -182138 269283 -159500 -65570 35435 158748 -52374 -165361 -45176 302843 -89505
18048c459k653I0773C7647f8831j32832f5391k5019q038A77584C615g5450i460
$$ -3459 -6112 90773 37647 -68831 -201663 -65391 -90410 -98448 177584 3615 -75450 -9460
18035a41844A22589a39599b2091l57314C3487b0156j03461F6462b48127q6749
$$ -141844 122589 -139599 -22091 -379405 33487 -20156 -123617 66462 -248127 -334876
18025c34876A03302h7730o6360l9185j09517Q2186a8069j00657b2832C2503f4283
$$ -334876 103302 -87730 -154090 -193275 -302792 -220606 -18069 -118726 -22832 32503 -64283
18013d7934j9362k15018d0087F6976j315L8912L776c26664B2562a23029A12205
$$ -47934 -67296 -282314 -40087 66976 65661 104573 108349 -326664 22562 -123029 112205
18001A13299a10338I131c64547E1305J73782I2718c3335r3490c4017E0543N9264
$$ 113299 -110338 9131 -364547 51305 225087 92718 -33335 -126825 -34017 50543 109807
17990A09807c40581J31776A39558f4556k6569A57784p4481a09615p0401p6183
$$ 109807 -340581 -208805 139558 -64556 -91125 157784 83303 -109615 -180016 -256199
17980b56199B22315a37089J9914j97978j2285A38599C4995Q2379P9173G6598N1969
$$ -256199 222315 -137089 -117175 -315153 -327438 138599 34995 117374 196547 76598 128567
17969A28567P06K00756A60676k8720a68883A70041L3622M7937r6409H225J66765
$$ 128567 129273 330029 160676 131956 -168883 170041 203663 251600 155191 8225 174990
17958A74990a49838d1343j21060I3377b75988B19446Q0616G8459a34526M5186
$$ 174990 -149838 -41343 -162403 93377 -275988 219446 300062 78459 -134526 -89340
17948h9340I5314J26945a17849B11851a3419C7181e657k92515C15567A9317j390
$$ -89340 95314 222259 -117849 211851 -13419 37181 -5657 -298172 315567 19317 17927
17937A7927c0601A79556H4163a57349f5242B20028F49J76546d9038k3859A09195
$$ 17927 -30601 179556 84163 -157349 -65242 220028 649 177195 -49038 -72897 109195
17925A73194e1969D17666A0224k119b18710d5367F3113R6011Q9092p4755B6160
$$ 173194 -51969 417666 10224 8105 -218710 -45367 63113 159124 248216 173461 26160
17913a52781C5485K49325c17732a7337A24650a90032I5647b62161H0785b2451
$$ -152781 35485 284810 -317732 -17337 124650 -190032 95647 -262161 80785 -22451
17902A96253E0651K60819e7871i286B6129b70561n5524P2009a22566r1123c8160
$$ 196253 50651 311470 -57871 -9286 26129 -270561 -326085 -254076 -122566 -213689 -38160
17890A00225a27611K2687F6649a60123J1662G6821b42773c5386A32464O6418a35123
$$ 100225 -127611 -104924 66649 -160123 -148461 76821 -242773 -35386 132464 198882 -135123
17878b280A78462i5980E2734a02065p3016k14006i4793J9951A04281a95501A42209
$$ -2280 178462 -95980 52734 -102065 -175081 -389087 -94793 -74842 104281 -195501 142209
17866C19217j23727o6822a09242M8820H9645C8236E052b73782a13719k6574B26609
$$ 319217 195490 128668 -109242 -60422 89645 38236 5052 -273782 -113719 -140293 226609
17854D5940K0747q228c09638C03215b2396C3996a8239k70152A25186D9688b47470
$$ 45940 66687 58459 -309638 303215 -22396 33996 -18239 -288391 125186 49688 -247470
17842E14942A0713f0897p558A29892b2087n7632L465A06107a16868C11068K8901
$$ 514942 10713 -60897 -68455 129892 -22087 -79719 -76254 106107 -116868 311068 339969
17831C39969j33752b07855C1599a37259A18036E4554M6801J30854a54874B2428
$$ 339969 206217 -207855 31599 -137259 118036 54554 101355 232209 -154874 22428
17820A69198N6309d050A18880D0479M4487b05706j07801E0885K73787A43136b07270
$$ 169198 225507 -4050 118880 40479 84966 -205706 -313507 50885 324672 143136 -207270
17808d29235H2156a31682J6789q5355A90861a16618B55514j07852D2352c1644
$$ -429235 82156 -131682 -114893 -200248 190861 -116618 255514 147662 42352 -31644
17797B9642N5474J80368a56234O5286H7350d23644c4397C94892E4721J01714A7574
$$ 29642 85116 265484 -156234 -90948 87350 -423644 -34397 394892 54721 156435 17574
17785a02555B44409a5699B0952b58186A0395J3586K07929b5160l46751a8981r7141
$$ -102555 244409 -15699 20952 -258186 10395 23981 231910 -25160 -371911 -18981 -116122
17774a16122B2319k148i2155l38069j2424d0562B2578e4059m14639C51933e6638
$$ -116122 22319 20171 -92155 -430224 -442648 -40562 22578 -54059 -468698 351933 -56638
17762B87155q9363i6302d2917l5643l76713A39494J7172a11783E376a92779B8287
$$ 287155 197792 -96302 -42917 -78560 -455273 139494 156666 -111783 5376 -192779 28287
17750I530J3515a74968B85608A22216j9887Q8465m9517n0465a67607H0834c5925
$$ 9530 23045 -174968 285608 122216 102329 190794 141277 90812 -167607 80834 -35925
17738B57177A24847b41948c1799j28031a1967j13102c5218j49859B52324a87925
$$ 257177 124847 -241948 -31799 -159830 -11967 -125069 -35218 -185077 252324 -187925
17727a18759n6975F7050R4104p8691b0118A12764b4944b701j24419A72520b36627
$$ -118759 -175734 67050 161154 82463 -20118 112764 -24944 -2701 -127120 172520 -236627
17715G3660a04589k12476A70658b3895A23586a88675j71921b3796o6273A53328
$$ 73660 -104589 -317065 170658 -23895 123586 -188675 -360596 -23796 -90069 153328
17704E63928b42837C16189a25846h790G4674i2354A95333a77197H448d28846h0271
$$ 563928 -242837 316189 -125846 -8790 74674 -92354 195333 -177197 8448 -428846 -80271
17692A40365J68786g3998A26302J40493c54348A16577K22925i076D1407K59805
$$ 140365 309151 -73998 126302 266795 -354348 116577 339502 -9076 41407 301212
17682C01212i9496p976J619D8736g0394B15439i8659a2470B00349a09357F5663
$$ 301212 -99496 -107472 -105853 48736 -70394 215439 -98659 -12470 200349 -109357 65663
17670C71840b12808e2712A18835j6518j087c72287D5354L78304a90792C09568
$$ 371840 -212808 -52712 118835 102317 101230 -372287 45354 423658 -190792 309568
17659B26096b7299A5309d54949A06646b28041D062J0096f1653J2325A59180K0541
$$ 226096 -27299 15309 -454949 106646 -228041 4062 14158 -61653 -49328 159180 179721
17648A79721l3686e8849A9988R7996k6357L19260a79375K5539D269f938E730R0562
$$ 179721 146035 -58849 19988 117984 91627 410887 -179375 -153836 4269 -6938 5730 96292
17636I6292J11775m1879d3622A02102P0700a01392A24988N5652E7216J29221c03848
$$ 96292 208067 166188 -43622 102102 172802 -101392 124988 180640 57216 186437 -303848
17624D9260a1306H0339J33368C349L06374j6930b7210B22405B7269a73271L263
$$ 49260 -11306 80339 213707 3349 309723 292793 -27210 222405 27269 -173271 -170008
17613a70008A69188c11733A64123l0945o5993a64502r8522g7940l526K1970d796
$$ -170008 169188 -311733 164123 133178 67185 -164502 -263024 -77940 -81466 -59496 -4796
17601I6382A6675J06474B9675j4685a91529D2133a57839A92261d3582B57467A4259
$$ 96382 16675 123149 29675 14990 -191529 42133 -157839 192261 -43582 257467 14259
17589a21899N3441j17789A43766F6894K4403K7542a43153A61935b59615e251D7983
$$ -121899 -68458 -186247 143766 66894 91297 118839 -143153 161935 -259615 -5251 47983
17577A45356c94331A07612b46074G3748l0608K81781c2301l7307A51733b62770
$$ 145356 -394331 107612 -246074 73748 43140 324921 -32301 -69608 151733 -262770
17566B00802l6523o0689M3553k9670J03514j09734k629d97827B73020a56922A95361
$$ 200802 164279 103590 147143 117473 220987 111253 108624 -497827 273020 -156922 195361
17554H8900B6824J59210j0973d6020G1505c1378j23988E4155d1913A96057I4751
$$ 88900 26824 186034 175061 -46020 71505 -31378 -155366 54155 -41913 196057 94751
17542a09592k8727A29628R598f1260C10857a24669M4484A72921o7167k0245a36197
$$ -109592 -138319 129628 139226 -61260 310857 -124669 -80185 172921 105754 85509 -136197
17530A67873K4647F0352N9916g6659F3193g6003k9881L3756B16175p0167K64463
$$ 167873 192520 60352 120268 -76659 63193 -76003 -105884 -72128 216175 146008 410471
17519D10471b0917A25796m8289J43831i186A11417P4510J20383G8953K43599D0796
$$ 410471 -20917 125796 77507 221338 -9186 111417 185927 306310 78953 322552 40796
17507e9597A08006k3000O6815d0893h146A57130F2157k3619d1195A31204K2005
$$ -59597 108006 85006 151821 -40893 -8146 157130 62157 38538 -41195 131204 153209
17496A53209k6846C3173b43247C39685c60336C08063k9066E3451N1823Q7970c046
$$ 153209 126363 33173 -243247 339685 -360336 308063 278997 53451 105274 193244 -3046
17484A53238b48760C11280E5826J72816I8626b9406B59134O4384H8458J54031
$$ 153238 -248760 311280 55826 228642 98626 -29406 259134 323518 88458 242489
17474B42489j15168K05182a04105A18055a8976n0225A8753J74106a58662F7929
$$ 242489 127321 332503 -104105 118055 -18976 -69201 18753 192859 -158662 67929
17463C4566M09821j2259A07752P3393p37p08J2134n2503b9696q257A33050N348
$$ 34566 444387 432128 107752 181145 180408 179700 191834 139331 -29696 -37953 133050 138398
17451A38398Fe4341F3091e9038b8423E76705H3496J89628K5545l6896Q2066q4533
$$ 138398 6 -54341 63091 -59038 -28423 576705 83496 273124 298669 261773 343839 259306
17439B59306j1675j00304L4540L41958B52345m0477K1103p5743K35748J40718
$$ 259306 247631 147327 181867 523825 252345 211868 232971 157228 392976 533694
17429E33694b41810C8510M79463k47024N1156j47177J29481l1967j9557K17719
$$ 533694 -241810 38510 517973 270949 322105 174928 304409 272442 252885 470604
17419D70604j41445k0498N5704q1742A14253C5503L07699H6529D1202L22018j67870
$$ 470604 329159 308661 364365 282623 114253 35503 343202 86529 41202 363220 195350
17408A95350P1376a00407B36178A09658J10714K21206A14417J69459m3973j16338
$$ 195350 266726 -100407 236178 109658 220372 441578 114417 283876 239903 123565
17398A23565J59987G3429a16220D1074a6690H239K0326f7597D99706A52339K92254
$$ 123565 283552 73429 -116220 41074 -16690 8239 28565 -67597 499706 152339 444593
17387D44593F4657R3589o1920R3006O2725A09135L43735j93134j20315K59488
$$ 444593 64657 158246 96326 189332 252057 109135 452870 259736 139421 398909
17377C98909A13480k0682K48803O7949k0795D7551K38816n6437p6604b84244a0282
$$ 398909 113480 92798 341601 409550 388755 47551 286367 229930 153326 -284244 -10282
17365D59058G0821J01376k5578N782o0666O7531m0762L0645c1264C1565M073K42959
$$ 459058 70821 172197 146619 152401 91735 159266 118504 149149 -31264 31565 35638 278597
17353B78597j820j26584Q5218f0728k715H7935J51585g1285J4204B08441i730
$$ 278597 276777 150193 235411 -60728 -63443 87935 239520 -71285 -57081 208441 -9730
17341b7423l8780A87921K3291n8796A679f871D14933g2575G3631N7448K0601P2237
$$ -27423 -66203 187921 211212 152416 1679 -6871 414933 -72575 73631 131079 151680 223917
17329B23917J1590L8965C0585J32286m4964K34788A2375J68985e9372A83437b1818
$$ 223917 235507 274472 30585 162871 117907 352695 12375 181360 -59372 183437 -21818
17317C79928A12832b10640B38140A16175J33973D3481J99459A0203M5690P7741
$$ 379928 112832 -210640 238140 116175 250148 43481 242940 10203 55893 133634
17307A33634m2644A4941J22349k9002D5487d9199D64162O0764k61772J35992C0735
$$ 133634 90990 14941 137290 108288 45487 -49199 464162 524926 263154 399146 30735
17295B63786D8975A4118J08029L76374O256j62520j25194j07616a44208G3082
$$ 263786 48975 14118 122147 498521 504777 342257 217063 109447 -144208 73082
17284G2585N6540J68821e4357C32577A54456M2295e532j58821C16893A49148M74582
$$ 72585 129125 297946 -54357 332577 154456 196751 -5532 -164353 316893 149148 623730
17273F23730A54375J59978c6752C47881B9015N4218f9956A01018J85378J00968
$$ 623730 154375 314353 -36752 347881 29015 83233 -69956 101018 286396 387364
17263C87364A27743M98i6216c4860a2949j00052A16051J13223O1390A667J31598
$$ 387364 127743 128241 -96216 -34860 -12949 -113001 116051 229274 290664 1667 133265
17252A33265l4704M96367A93046P5216H0929J99358a41288A85122Q1612O6764
$$ 133265 98561 594928 193046 268262 80929 280287 -141288 185122 266734 333498
17242C33498A55066a36829D25111o5350A32705J18212A813K79791J6157o2380
$$ 333498 155066 -136829 425111 359761 132705 250917 1813 281604 297761 235381
17232B35381k0731M4912L1643n7076J82234n1880j07080P5179q6643H976J67504
$$ 235381 214650 259562 291205 234129 416363 364483 257403 332582 245939 8976 176480
17221A76480j3389K24852I7526J43218H5268J92825m3603a15273B8692K80002
$$ 176480 163091 387943 97526 240744 85268 278093 234490 -115273 28692 308694
17211C08694b52869B09996K36174j08773p7101j10911J61457P2689j68390K04437
$$ 308694 -252869 209996 446170 337397 260296 149385 310842 383531 215141 419578
17201D19578A37813R4007D1370O8601l1216K74050A9904K16817n5250J4127L60007
$$ 419578 137813 231820 41370 109971 78755 352805 19904 236721 181471 195598 555605
17190E55605A806J68712J76463J57071k03912A36594J12748J41004k8218A18598
$$ 555605 1806 170518 346981 504052 300140 136594 249342 390346 362128 118598
17179B32384b91326I5972K68027I8476A628L97721o1358M6631o001q0337N0015
$$ 232384 -291326 95972 363999 98476 1628 399349 337991 384622 378621 298284 348299
17168C48299A06787D1612L71484j6724A97824N4572K22822k29614J6323K11474
$$ 348299 106787 41612 413096 396372 197824 252396 475218 245604 261927 473401
17158D73401B07780D2032J47640J18336e4576C42463K61329k46019A58340J45979
$$ 473401 207780 42032 189672 308008 -54576 342463 603792 357773 158340 304319
17148C04319K31470j43426E9236R5952K33490l9115I1880K29392J40870j26721
$$ 304319 535789 392363 59236 155188 388678 349563 91880 321272 462142 335421
17138C35421k825I2557L56237o9070j61565J67161p4494l9669J1173M21532j6936
$$ 335421 332596 92557 448794 379724 218159 385320 310826 271157 282330 703862 686926
17127F86926A741P36480l68159R3593m754o1545k812j58005L00284r8774A62848
$$ 686926 1741 738221 370062 463655 458901 397356 394544 236539 536823 438049 162848
17115D68358A39030N42984C25651L8967J1830k59p2959J93809o7858p4405K7448
$$ 468358 139030 682014 325651 364618 376448 376189 303230 497039 429181 354776 382224
17104C82224A58294K59169r4952J50924j96082J28459K4339j02529j27486L81711
$$ 382224 158294 417463 322511 473435 277353 405812 430151 327622 200136 581847
17094E81847M8780k27300p3557K32059j62354K11571B39379J53340J3885j549
$$ 581847 630627 403327 329770 561829 399475 611046 239379 392719 406604 405055
17084D05055K37960l03350K3364A72763K29397J17839A60970M10782k78551K39900
$$ 405055 643015 339665 363029 172763 402160 519999 160970 571752 293201 533101
17074E33101j54170L81657j85235B31807R3066L9924J78155R3712K4866j82693
$$ 533101 378931 760588 575353 231807 324873 364797 542952 636664 661530 478837
17064D78837j71730J24946o3938N2168K99261j37886N1782J21395j30270B33249
$$ 478837 307107 432053 368115 420283 719544 581658 633440 754835 624565 233249
17053D70283J41842R2927j01796j05919n8050q3885P6079K7129K1857j22654l4192
$$ 470283 612125 705052 603256 497337 439287 355402 431481 458610 480467 357813 323621
17042C23621L34920B68902M49736j4508l1009J71193a6332F93988j93213Q7544
$$ 323621 658541 268902 718638 704130 673121 844314 -16332 693988 500775 588319
17032E88319k84085J00585K44033k28896k0112K28715J83178k13490K176p8932
$$ 588319 304234 404819 648852 419956 399844 628559 811737 598247 600423 521491
17022E21491N2926M3970j42478K58615J30888j44509k85386K16766k17888K74781
$$ 521491 574417 618387 475909 734524 865412 720903 435517 652283 434395 709176
17012G09176k99646p11L39328j27529K55691l45503K4646L88061q8595J30064
$$ 709176 409530 408819 748147 620618 876309 530806 555452 943513 854918 984982
17002I84982k99684R0352k82043J26139P4312O7815o2327M02038j91110j02839
$$ 984982 685298 775650 493607 619746 694058 761873 699546 1101584 910474 807635
16992H07635j44432K85969j81398j13714K78157o7355l36107L54290L18330E49002
$$ 807635 663203 949172 767774 654060 932217 864862 528755 883045 1201375 549002
16981G74268J00198p258N1406q9514j0352K71231k04696k30939J86723j0832K63670
$$ 774268 874466 867208 918614 829100 818748 1089979 885283 654344 841067 830235 1093905
16970A093905j2946M9289k21262r7258K24444l02581L49315J8240j63143N7352
$$ 1093905 1080959 1130248 908986 811728 1036172 733591 1082906 1101146 938003 995355
16960I95355K71078n2380l55662J01720k28502M33032k10398k3393j95115M23941
$$ 995355 1266433 1214053 858391 960111 731609 1164641 954243 930850 735735 1159676
16950A159676l89003R0205M27267k92228K34642l11094M46431o8279L8904j86721
$$ 1159676 770673 860878 1288145 995917 1230559 919465 1365896 1297617 1336521 1149800
16940A149800R1306o1333j13346r0444M00392m18586K20167L05843m79013L06078
$$ 1149800 1241106 1179773 1066427 975983 1376375 957789 1177956 1483799 1004786 1310864
16930A310864m8227j62439J60410K49028L9972j01793m57602L48856j47389O0936
$$ 1310864 1262637 1100198 1260608 1509636 1549608 1447815 990213 1339069 1191680 1252616
16920A252616J09707k5216J01289J84405j71091J82028j79094j47283J33836l70268
$$ 1252616 1362323 1337107 1438396 1622801 1451710 1633738 1454644 1307361 1441197 1070929
16910A070929N46102j48070J96698J03119j73203k51961Q2072N77390k87430N8003
$$ 1070929 1617031 1468961 1665659 1768778 1595575 1343614 1425686 2003076 1715646 1773649
16900A773649k07533K05112m93235L26316J63639J4274J74540j65730o053K78983
$$ 1773649 1566116 1771228 1277993 1604309 1767948 1782222 1956762 1791032 1784979 2063962
16890B063962k01876J12823J74975j22381j59484P7654j52157J18256J6138J1117
$$ 2063962 1862086 1974909 2149884 2027503 1868019 1945673 1793516 1911772 1927910 1939027
16880A939027J12161R8581j94098P8877L5137K63387J72155l61100K63288j37546
$$ 1939027 2051188 2149769 1955671 2034548 2069685 2333072 2505227 2144127 2407415 2269869
16870B269869J12385J04112k77617K77180N6100R5624j07673j93559M15994P8984
$$ 2269869 2382254 2486366 2208749 2485929 2542029 2637653 2529980 2336421 2752415 2831399
16860B831399k54562j51182M29194M4341l33460K91184j87123L33310K25430k49539
$$ 2831399 2576837 2425655 2854849 2899190 2565730 2856914 2669791 3003101 3228531 2978992
16850B978992o7475j15822M29775m1220M213K77606l5739m81579N35366j52094
$$ 2978992 2911517 2795695 3225470 3184250 3188463 3466069 3430330 2948751 3484117 3332023
16840C332023o460j11605K60765O022L40645n4612j0824Q6829J20066K45972j68601
$$ 3332023 3325563 3213958 3474723 3480745 3821390 3766778 3755954 3842783 3962849 4208821 4040220
16829D040220N41217k28352m37449L53018l6352M99190n34525N82434j41783J91022
$$ 4040220 4581437 4353085 3915636 4268654 4232302 4731492 4196967 4779401 4637618 4828640
16819D828640J51261n6350N5256J38811j73595J73014K91781q8957L8728M25106
$$ 4828640 4979901 4923551 4978807 5117618 4944023 5117037 5408818 5319861 5358589 5783695
16809E783695k14514M87745k36672K07775L28436J72431j15333J22077J95260
$$ 5783695 5569181 6056926 5820254 6028029 6356465 6528896 6413563 6535640 6730900
16800F730900M04230k04414P0272P87713l92385L65426o5470M04956l18662O83435
$$ 6730900 7135130 6930716 7000988 7788701 7396316 7761742 7696272 8101228 7782566 8466001
16790H466001J59150K93323j58500K85863M30934j382M50672j50367L99385K48031
$$ 8466001 8625151 8918474 8759974 9045837 9476771 9475389 9926061 9775694 10175079 10423110
16780A0423110K57106L69926M49968K03263K6821P68167K67574K53935J36088
$$ 10423110 10680216 11050142 11500110 11703373 11730194 12498361 12765935 13019870 13155958
16771A3155958L54242P49217K20070K83943L12300Q47918P58386l2672O56445
$$ 13155958 13510200 14259417 14479487 14763430 15075730 15923648 16682034 16649362 17305807
16762A7305807N11431N01269N64153Q76862M25518O75348Q26348P05108R58714
$$ 17305807 17817238 18318507 18882660 19759522 20185040 20860388 21686736 22391844 23350558
16753B3350558Q18871Q11185P16358J208734J228060R03272J420225P57273J519410
$$ 23350558 24169429 24980614 25696972 26905706 28133766 29037038 30457263 31214536 32733946
16744C2733946J056004J793338J472357J706564J536885K043603J962355J769666
$$ 32733946 33789950 35583288 37055645 38762209 40299094 42342697 44305052 46074718
16736D6074718K523960K416071K224357K715072L235844K656146L142134L533651
$$ 46074718 48598678 51014749 53239106 55954178 59190022 61846168 64988302 68521953
16728F8521953L663165L916211M000602M208497M556778M979948N107839N277854
$$ 68521953 72185118 76101329 80101931 84310428 88867206 93847154 98954993 104232847
16720A04232847N294834N982398N496104O257652N601751O082138N842947N910699
$$ 104232847 109527681 115510079 121006183 127263835 132865586 138947724 144790671 150701370
16712A50701370N395912N044541M488387M328754L156809K468079J468234J010507
$$ 150701370 156097282 161141823 165630210 169958964 173115773 175583852 177052086 178062593
16704A78062593q9101j012145j811966k886468l681607m276313m739097m892496
$$ 178062593 177973492 176961347 175149381 172262913 168581306 164304993 159565896 154673400
16696A54673400n803309n788979n895846n673622o248405n851596n666069n573809
$$ 154673400 148870091 143081112 137185266 131511644 125263239 119411643 113745574 108171765
16688A08171765n638023m881306n411349m527561m452339m448138m005157l752754
$$ 108171765 102533742 97652436 92241087 87713526 83261187 78813049 74807892 71055138
16680G1055138l788284l194363l282061k863013k862643k787959k455921k593440
$$ 71055138 67266854 64072491 60790430 57927417 55064774 52276815 49820894 47227454
16672D7227454k097866k112502k109213j852350j759782j504519j743973j429138
$$ 47227454 45129588 43017086 40907873 39055523 37295741 35791222 34047249 32618111
16664C2618111j084240j556136j050705j214331j124764r48445q62933j107299
$$ 32618111 31533871 29977735 28927030 27712699 26587935 25639490 24776557 23669258
16656B3669258j055643n17250q25128j094642o21316n72129n71111p47903n03979
$$ 23669258 22613615 22096365 21271237 20176595 19555279 18983150 18412039 17664136 17160157
16647A7160157p76293j98310q99336k00441n27929m40175m23328m46860r9810
$$ 17160157 16383864 16185554 15286218 15085777 14557848 14117673 13694345 13247485 13147675
16638A3147675p83142l04354m14970j92562k18833j93755o54088k61971j93460
$$ 13147675 12364533 12060179 11645209 11452647 11233814 11040059 10385971 10124000 9930540
16629I930540L6725n08055j74835l50854J21710k75582k89543k80411m26952k90586
$$ 9930540 9967265 9459210 9284375 8933521 9055231 8779649 8490106 8209695 7782743 7492157
16619G492157L61770p0287j96721o66231k78822K88743l55511n3424l37590j80714
$$ 7492157 7853927 7783640 7586919 6920688 6641866 6930609 6575098 6521674 6184084 6003370
16609F003370o5301J41977j31645l27533J16225j18260j80230k08747r5214j81507
$$ 6003370 5938069 6080046 5948401 5620868 5737093 5618833 5438603 5229856 5134642 4953135
16599D953135K62398q00374N37463j12015l59369J67409k10k17654m14571J81919
$$ 4953135 5215533 4415159 4952622 4840607 4481238 4648647 4648437 4430783 4016212 4198131
16589D198131L04625m88119p3631l01793M82645m55970K02351j72509J19477l21355
$$ 4198131 4502756 4014637 3941006 3639213 4121858 3665888 3868239 3695730 3815207 3493852
16579C493852J21548l14402K33867k97400M5930r8214K27027k64577k3806m56104
$$ 3493852 3615400 3300998 3534865 3237465 3283395 3185181 3412208 3147631 3123825 2667721
16569B667721J83559K21116l69730K4613L04306K7565m47149l65130L18505J55087
$$ 2667721 2851280 3072396 2702666 2727279 3031585 3059150 2612001 2246871 2565376 2720463
16559B720463l91735K73338m46055m6341K88280k02743J43754n4043K48465m57367
$$ 2720463 2328728 2602066 2156011 2109670 2397950 2195207 2338961 2284918 2533383 2076016
16549B076016J95122j04270J36105J37462k36757l61583J40100j62165L29871
$$ 2076016 2271138 2166868 2302973 2440435 2203678 1842095 1982195 1820030 2149901
16540B149901j34050M4967l03406j31483K56800m09820N35288k42844j49372L63217
$$ 2149901 2015851 2060818 1757412 1625929 1882729 1472909 2008197 1765353 1615981 1979198
16530A979198k47808O5658j99896J37403k64929J45631p2739j18940K02558L3999
$$ 1979198 1731390 1797048 1597152 1734555 1469626 1615257 1542518 1423578 1626136 1660135
16520A660135O8650n32911j15801M94520k76942L13437o3076j51735j89343M35413
$$ 1660135 1728785 1195874 1080073 1574593 1297651 1611088 1548012 1396277 1206934 1642347
16510A642347k49606r9325L70090m27844k51611L68017L40465j43724j52954j68883
$$ 1642347 1392741 1293416 1663506 1235662 984051 1352068 1692533 1548809 1395855 1226972
16500A226972J09596n26966M16352r3558Q6064P7849j7788J8673l56041j46121
$$ 1226972 1336568 809602 1225954 1132396 1218460 1296309 1278521 1297194 941153 795032
16490G95032L20247m3132m5981J03825r1219J43938n2439K56781n30552J46334
$$ 795032 1115279 1072147 1026166 1129991 1038772 1182710 1130271 1387052 856500 1002834
16480A002834K86571n37498N0060Q7039Q0139k20478L26958J3369m83978O73834
$$ 1002834 1289405 751907 801967 889006 969145 748667 1075625 1088994 605016 1278850
16470A278850l30783j94336l10957P5549K38136J92454m54205P18578k69028r7703
$$ 1278850 948067 753731 442774 518323 756459 948913 494708 1213286 944258 846555
16460H46555O9766k91303K02862J50842q7646r5650k1102M1981R9721l55859J63085
$$ 846555 916321 625018 827880 978722 891076 795426 774324 816305 916026 560167 723252
16449G23252j02265J42818Q010o1792K67312l62335J79027o0984k66144L60016
$$ 723252 620987 763805 771815 710023 977335 615000 794027 733043 466899 826915
16439H26915J70975J1583k40752C29646M33420k0824C68106J55787j49354M64171
$$ 826915 997890 1009473 768721 329646 763066 742242 368106 523893 374539 838710
16429H38710J67j80250j84634K44394P8454j23194j72769N7430J30443J08320
$$ 838710 838877 658627 473993 718387 796841 673647 500878 558308 688751 797071
16419G97071l20961R1036A03074N68217R0511C33410M34927B47281L67341k1439
$$ 797071 476110 567146 103074 671291 761802 333410 768337 247281 614622 593183
16409E93183l1427k6251J43076J04107j60626B22510J47439j1489m821o1368K89243
$$ 593183 561756 535505 678581 782688 622062 222510 369949 358460 353639 292271 581514
16398E81514J27246j94440k57001K06633M30435A62375O8163P4467J39229o1420
$$ 581514 708760 514320 257319 463952 894387 162375 230538 305005 444234 382814
16388C82814A66058L62618B44611J21456P5283f392B04107J10529k2564M7529
$$ 382814 166058 528676 244611 366067 441350 -6392 204107 314636 292072 339601
16378C39601r9208J76111A80229j1969M65589B59278l785J08794L315j00960K34017
$$ 339601 240393 416504 180229 168260 633849 259278 255493 364287 367602 266642 500659
16367E00659k9897K5624B33172E0642J07373k6g3466A93001p2086K09308J32504
$$ 500659 470762 496386 233172 50642 158015 157989 -73466 193001 120915 330223 462727
16356D62727j82323p9456M31388O9389C27979b7378C46589R9160A13060K80560
$$ 462727 280404 200948 632336 701725 327979 -27378 346589 445749 113060 393620
16346C93620J36730B05137J92645m8750L4984j45420J24223R3683A03401P4291
$$ 393620 530350 205137 397782 349032 384016 238596 362819 456502 103401 177692
16336A77692Q9890M4022A46000L97601P2003A15165N8630L17578m3585B01460
$$ 177692 267582 311604 146000 543601 615604 115165 173795 491373 447788 201460
16325H6609M89830a9673B09104K34089A90715K13019C8360L84790A26135b6019
$$ 86609 576439 -19673 209104 443193 190715 403734 38360 423150 126135 -26019
16314A71919L14772A78573n2324e7746C33087H8453K89208H9268l5701N77923
$$ 171919 486691 178573 126249 -57746 333087 88453 377661 89268 53567 631490
16304F31490E8258J84601r8130A44J42879K89422A73203b9045C47734H6275M46615
$$ 631490 58258 242859 144729 144 143023 432445 173203 -29045 347734 86275 532890
16293E32890n277j39264j14330I902K78731K29730B03495p2728J94793A58393
$$ 532890 527613 388349 274019 9902 288633 518363 203495 130767 325560 158393
16282E29230B58870h0373A59355C1700N1701L43405d9910A9602J6882Q2355J37448
$$ 529230 258870 -80373 159355 31700 83401 426806 -49910 19602 36484 118839 256287
16271B56287K4016D8267M708J40198p0688J51932J32092k1553B8860K31860J06925
$$ 256287 280303 48267 52975 193173 122485 274417 406509 384956 28860 260720 367645
16260C67645A49799J64066h3494m5790D53985B12417q0997O1672K26559A07834
$$ 367645 149799 313865 -83494 -129284 453985 212417 131420 193092 419651 107834
16249B12164J20496A34735O1639K0292F5673J83284E0849L70117d7648A73792
$$ 212164 332660 134735 196374 216666 65673 248957 50849 420966 -47648 173792
16238B91835A03076a8586D6075n747D081R3395J65773G7867Q4830i176A18179
$$ 291835 103076 -18586 46075 40328 4081 97476 263249 77867 162697 -9176 118179
16226e8078A08999J77884b52506J8570B05310A2452J38349E8562K82734A28533
$$ -58078 108999 286883 -252506 -233936 205310 12452 150801 58562 341296 128533
16215A59546h80C87382j85203J9318l9735b61825H8416J59989J6314B3077J52492
$$ 159546 -880 387382 202179 221497 181762 -261825 88416 248405 264719 23077 175569
16204A75569p4980i1978j65716M8842A82911B8581K96610M3301A80349b11298
$$ 175569 100589 -91978 -257694 -208852 182911 28581 325191 368492 180349 -211298
16193B80523j39090K9488D5396J77906q2183D0991f2841h831C9864a19987C9559
$$ 280523 141433 170921 45396 223302 141119 40991 -62841 -8831 39864 -119987 39559
16181d18076A43484e4449A72357o1488K8507k5265O7562a37283o0413B78067K89178
$$ -418076 143484 -54449 172357 110869 139376 114111 181673 -137283 -197696 278067 567245
16170E67245g8141j47659b1858m2006j55230j3480O1417g7865n7494q0238R1131
$$ 567245 -78141 -225800 -21858 -63864 -219094 -232574 -171157 -77865 -135359 -215597 -124466
16159a24466e8460A4808a93349C9518d3947f558E5153M64495b5358q245C9739
$$ -124466 -58460 14808 -193349 39518 -43947 -6558 55153 519648 -25358 -33603 39739
16147E2657L28164M1044A55649a66743g9506C31430b5741p6689A62597a01790
$$ 52657 380821 421865 155649 -166743 -79506 331430 -25741 -102430 162597 -101790
16136a45142l4909F8115a60270j32505a02318k6853A78786C7069R6052b98167
$$ -145142 -180051 68115 -160270 -292775 -102318 -129171 178786 37069 133121 -298167
16125A14292a0552A55898L40846B4030b869k64151i2343A59676c268F1846d6265
$$ 114292 -10552 155898 496744 24030 -2869 -267020 -92343 159676 -3268 61846 -46265
16113E5138J10839a02699E2955P7567n4444K2105J66138d4247p1395A81116j8437
$$ 55138 165977 -102699 52955 130522 76078 98183 264321 -44247 -115642 181116 162679
16102A62679b39278A40832m8345O2148c7661B69279b40436A99679b17324E0653
$$ 162679 -239278 140832 92487 154635 -37661 269279 -240436 199679 -217324 50653
16091a00869B68397i4466B85036e2391A10479J96582c8924B46462b8958l61478
$$ -100869 268397 -94466 285036 -52391 110479 307061 -38924 246462 -28958 -390436
16081c90436C40373B0135P4529a69748h3056k98511J80804E0689d9465B69484
$$ -390436 340373 20135 94664 -169748 -83056 -381567 -200763 50689 -49465 269484
16070b7210q732D6838M30835F7505i854A05062a57369C54112a0648E068b69890
$$ -27210 -35942 46838 477673 67505 -9854 105062 -157369 354112 -10648 5068 -269890
16058e2569a400k14239i5168B15325G2359a07855A19522b78795B08284g9385A76923
$$ -52569 -1400 -215639 -95168 215325 72359 -107855 119522 -278795 208284 -79385 176923
16046I7599J86342A41626n3882L6005E9957c9354J6471j14760A55189A5740P6686
$$ 97599 283941 141626 87744 123749 59957 -39354 -22883 -137643 155189 15740 92426
16035I2426J28312a36251m4125D3214a47134A65074D9774a4524E5687j4943h3396
$$ 92426 220738 -136251 -180376 43214 -147134 165074 49774 -14524 55687 40744 -83396
16023B90835F1340K45855F1982O711N9588e9900A55160N6377p595J80843d31763
$$ 290835 61340 307195 61982 68693 128281 -59900 155160 211537 203942 384785 -431763
16011h0581C56872P8309G6253O0394d8704k7905H2684i0904d1348l05136j10940
$$ -80581 356872 435181 76253 136647 -48704 -76609 82684 -90904 -41348 -346484 -457424
16000d57424a01695H0903d7246p4340K9686A00746k9710a5233A6315J46396e440
$$ -457424 -101695 80903 -47246 -121586 -91900 100746 71036 -15233 16315 162711 -5440
15988a43040A22500d1689A75102D5911J20201A5706L4972B3574c99861E989b51971
$$ -143040 122500 -41689 175102 45911 166112 15706 50678 23574 -399861 5989 -251971
15976a93675B40527b39596O0026C20351j55755N7579j04423J60857L37834k32538
$$ -193675 240527 -239596 -179570 320351 164596 222175 117752 278609 616443 383905
15966C83905A30523J13929k5627d1685B04687b5135k40840B66785O648b198B67169
$$ 383905 130523 244452 218825 -41685 204687 -25135 -265975 266785 273433 -2198 267169
15954c59804h0959B2192K74782c3878k2662j43090B00027r3042B2891o206K9696
$$ -359804 -80959 22192 296974 -33878 -56540 -199630 200027 106985 22891 16685 46381
15943D6381K44836C1080a37353A5908e5333a2704B14375D8840J40313a37229k98439
$$ 46381 291217 31080 -137353 15908 -55333 -12704 214375 48840 189153 -137229 -435668
15932d35668A51473a54931B66239j1593h8370B79768h576j65499I4749C8360K91018
$$ -435668 151473 -154931 266239 254646 -88370 279768 -8576 -174075 94749 38360 329378
15921C29378b03894H187R4093D5647L55500A15387c7372l60106J54241J04571
$$ 329378 -203894 8187 102280 45647 401147 115387 -37372 -397478 -243237 -138666
15911a38666q6517a08355m88j78383D5363J50169g6754L1339m70573d0347m22091
$$ -138666 -225183 -108355 -108843 -287226 45363 195532 -76754 -45415 -515988 -40347 -462438
15900d62438b6107j91717p8095O4P5326D4651a17748A7577g1355C33370b21224
$$ -462438 -26107 -217824 -295919 -295855 -220529 44651 -117748 17577 -71355 333370 -221224
15888d90252K37182g4842A63078E4246i5243L1037E6416a15867N4178A07584a39126
$$ -490252 -253070 -74842 163078 54246 -95243 -64206 56416 -115867 -61689 107584 -139126
15876c11927D1872b7016J1080q1592C8020b05862C8528K3242b05387B54243c64716
$$ -311927 41872 -27016 -15936 -97528 38020 -205862 38528 61770 -205387 254243 -364716
15864D2881d7608J847B83513a83958P3065F5647a08047b3205C18165D7259N4957
$$ 42881 -47608 -45761 283513 -183958 -110893 65647 -108047 -23205 318165 47259 102216
15853A02216L9076c2558j58030C0435a31740B36796a32210j2379j25599g0395
$$ 102216 141292 -32558 -190588 30435 -131740 236796 -132210 -144589 -270188 -70395
15842a84440j21411I5122J3403c46619G8503g368j68143C34455b64259I2899a55492
$$ -184440 -305851 95122 108525 -346619 78503 -7368 -175511 334455 -264259 92899 -155492
15830a49533b2514j53146p2617A88795a83501l0851I8206b94408C04200a83401
$$ -149533 -22514 -175660 -248277 188795 -183501 -214352 98206 -294408 304200 -183401
15819B5280J62618H6348a06820G5011f7616C07326c37944A84594l0898A8018J30615
$$ 25280 187898 86348 -106820 75011 -67616 307326 -337944 184594 153696 18018 148633
15808A48633G863b20461l64624D0359a30040F55a28674k00197C08104j29088E4797
$$ 148633 7863 -220461 -585085 40359 -130040 655 -128674 -328871 308104 179016 54797
15796A44187o8939b08331j15635B10843i0076A3475a85670j16017K8424M1274
$$ 144187 75248 -208331 -323966 210843 -90076 13475 -185670 -301687 -273263 -231989
15786b31989k3981h9096a9990n69A19590b03957M837L7853A87475d7113j72909
$$ -231989 -255970 -89096 -19990 -20559 119590 -203957 -199120 -161267 187475 -47113 -220022
15775b20022B6763a92754P8189j07595J07074b8235B08447i354j44081H3402C8185
$$ -220022 26763 -192754 -114565 -222160 -115086 -28235 208447 -9354 -153435 83402 38185
15763a97765R2887j21791r6792K4812A03628k2283a95774b3416l27636a40780
$$ -197765 -104878 -226669 -323461 -298649 103628 81345 -195774 -23416 -351052 -140780
15752G1314d176k6538a1253k3677E1049K87641d0190A40702P1612e4922H3396
$$ 71314 -4176 -30714 -11253 -34930 51049 338690 -40190 140702 212314 -54922 83396
15740B3031f7386b1317k48351J16021H2145a13847B05722A5107a38889l962I8431
$$ 23031 -67386 -21317 -269668 -153647 82145 -113847 205722 15107 -138889 -142851 98431
15728a29715f0714A10082a74294d5302j34173c1519E8810M5906A6441b7283C30018
$$ -129715 -60714 110082 -174294 -45302 -179475 -31519 58810 104716 16441 -27283 330018
15716h8351B00155K21096H5496l1620K2843a9822j86543l07205a3820A55762g4490
$$ -88351 200155 421251 85496 53876 76719 -19822 -206365 -513570 -13820 155762 -74490
15704G8976a84816D104J61599a15092d701j48637I53a49499j6187E13170d15190
$$ 78976 -184816 4104 165703 -115092 -4701 -153338 953 -149499 -165686 513170 -415190
15692a58008d1096j99698A04280c4364E9159f4546K0309j29469j04962A82457
$$ -158008 -41096 -240794 104280 -34364 59159 -64546 -44237 -173706 -278668 182457
15681A40381b71435A79648j5686o3754b8553C05881E4638R1931a19953A08808
$$ 140381 -271435 179648 163962 100208 -28553 305881 54638 146569 -119953 108808
15670B06882j5973r2362b66859I6000g7077L6569G3409J1682a45991j0862A6272
$$ 206882 190909 98547 -266859 96000 -77077 -40508 73409 85091 -145991 -156853 16272
15658h0069p4963E2104R3676b6391H7990g3399F9540j180b45305h1899r2277A90033
$$ -80069 -155032 52104 145780 -26391 87990 -73399 69540 68360 -245305 -81899 -174176 190033
15645c9961d435k84541B627a40085N6578K7096r0901E927b9048k24425b5514B1536
$$ -39961 -4435 -288976 2627 -140085 -83507 -56411 -147312 5927 -29048 -253473 -25514 21536
15632b13300I1736J76194A23058c0724B1279K35474e3201A3234O1875J79436A8071
$$ -213300 91736 267930 123058 -30724 21279 256753 -53201 13234 75109 254545 18071
15620B4930K91791j33088a14039A92767D912J26735c75277c2345n6800o0938A90055
$$ 24930 316721 183633 -114039 192767 4912 131647 -375277 -32345 -89145 -150083 190055
15608E509a48084O7217j03960C8753d5603h684A54080a11175G8344A9902J01225
$$ 5509 -148084 -80867 -184827 38753 -45603 -8684 154080 -111175 78344 19902 121127
15597A21127L32430b03755A93489c9387n2917J086E9076L11508d0027k80083F8562
$$ 121127 453557 -203755 193489 -39387 -92304 -91218 59076 370584 -40027 -320110 68562
15585c60450A80543a34754p5409A6709e1171D26039D9592a04646G7345b76296
$$ -360450 180543 -134754 -210163 16709 -51171 426039 49592 -104646 77345 -276296
15574b46914C3878O5761g2693H1615b43304f685F8794a75035a9619A05517c450
$$ -246914 33878 99639 -72693 81615 -243304 -6685 68794 -175035 -19619 105517 -3450
15562B18485c59535A01901K39666a33295A81172I697L58861A185J25497k3096
$$ 218485 -359535 101901 341567 -133295 181172 9697 368558 1185 126682 103586
15552A03586K76183C559K20733R5337a41796p615p0736B3013K36675c3869I5088
$$ 103586 379769 3559 224292 319629 -141796 -149411 -220147 23013 259688 -33869 95088
15540G7638J1318k5073b83959I9024a15605A8428J04501b05574N8433C51141i5919
$$ 77638 88956 63883 -283959 99024 -115605 18428 122929 -205574 -147141 351141 -95919
15528b03188A07870a96448A21583c27435l5070G3018c35271C45984f8943G1825
$$ -203188 107870 -196448 121583 -327435 -362505 73018 -335271 345984 -68943 71825
15517H7974P0277d9802l8269F829J44620K63907a2432C28466b07754b7585j19411
$$ 87974 158251 -49802 -88071 6829 151449 415356 -12432 328466 -207754 -27585 -146996
15506a46996A02638f8248O713p8866B16732d3028A65526a05649C9002N0840j2748
$$ -146996 102638 -68248 -61535 -140401 216732 -43028 165526 -105649 39002 89842 77094
15495G7094R7641a23208j01361O5517B98550c364l2049J3140l33337a10543g073
$$ 77094 174735 -123208 -224569 -159052 298550 -3364 -35413 -22273 -355610 -110543 -7073
15483c67874A3109d0268A1021J71334p5467e7046h101I1505O6234f6837j91457
$$ -367874 13109 -40268 11021 182355 106888 -57046 -8101 91505 157739 -66837 -258294
15472b58294C2479K55011A12647D1038d17091P8835h9491F5581b45634A16600
$$ -258294 32479 287490 112647 41038 -417091 -338256 -89491 65581 -245634 116600
15461I7097K3729a68720C4633d84885C11121g574q0813a291m32144E5745g1449
$$ 97097 120826 -168720 34633 -484885 311121 -7574 -88387 -1291 -433435 55745 -71449
15449B05627a07159n9047p3402A20621B9866L012K38715F83a2224A16976b00727
$$ 205627 -107159 -166206 -239608 120621 29866 32878 271593 683 -12224 116976 -200727
15437A18239a08757K0695B03473P7071A00688h3587b5875l37918B7251a18707
$$ 118239 -108757 -88062 203473 280544 100688 -83587 -25875 -363793 27251 -118707
15426a46969N6369n1119M1330n2699c613A91720i1447A6680c67567A32528a1905
$$ -146969 -90600 -141719 -100389 -153088 -3613 191720 -91447 16680 -367567 132528 -11905
15414h4907m0364K5108j10151H7382J77849Q3835B6144a83191b0903B7844J0250
$$ -84907 -125271 -100163 -210314 87382 265231 349066 26144 -183191 -20903 27844 38094
15403C8094a35484f5442j21704d0306R661k3208a1610o6669C84782b6778j73144
$$ 38094 -135484 -65442 -187146 -40306 -30645 -53853 -11610 -78279 384782 -26778 -199922
15392a99922A12991n0771f1610j91989J21592j03778g236k95975B3055m184a07508
$$ -199922 112991 62220 -61610 -253599 -132007 -235785 -7236 -303211 23055 18871 -107508
15380A3205K80859j34433k0073j2996c28252B02597a94185a5007A68709b04713
$$ 13205 294064 159631 139558 126562 -328252 202597 -194185 -15007 168709 -204713
15369A1127b38645h233m19786A04550J24487F475K35269a12126I1659b04615c2831
$$ 11127 -238645 -8233 -428019 104550 229037 6475 241744 -112126 91659 -204615 -32831
15357i8766j55646d6578C0524a98430i8384J9464L811m352A12865b15257C3273
$$ -98766 -254412 -46578 30524 -198430 -98384 -78920 -75109 -79461 112865 -215257 33273
15345b8519B64073Q5154f6863G2932J18157g4451A08124a2467G648M735b36653
$$ -28519 264073 349227 -66863 72932 191089 -74451 108124 -12467 7648 12383 -236653
15333b8368h576k68866B15917b1780B03038a31379A41M68907A05098n328a56026
$$ -28368 -8576 -277442 215917 -21780 203038 -131379 141 469048 105098 99770 -156026
15321A4757o705R8675f9497G9548N5169c91954I5096b4265A51036i8210a3818
$$ 14757 8052 106727 -69497 79548 134717 -391954 95096 -24265 151036 -98210 -13818
15309a8460C25320a31968L1551g733n6444B42369J05843A25816c27102A12017
$$ -18460 325320 -131968 -100417 -7733 -64177 242369 348212 125816 -327102 112017
15298b46491B22732e7834B06455K22293E3830c7663E3856e4939A39350K874J35345
$$ -246491 222732 -57834 206455 428748 53830 -37663 53856 -54939 139350 142224 277569
15287B77569j01951H4895K38749b8488B66214h6650L4494r7107j09697G8766a20943
$$ 277569 175618 84895 323644 -28488 266214 -86650 -52156 -149263 -258960 78766 -120943
15275b9875D2088H958e8521B57567a42075L5216B14106O3172A02746a36203N4548
$$ -29875 42088 8958 -58521 257567 -142075 -106859 214106 277278 102746 -136203 -81655
15264h1655C25353j40033q3194a44658A75037e5803B42498L6447I6941a71929
$$ -81655 325353 185320 102126 -144658 175037 -55803 242498 278945 96941 -171929
15253B898L41378I8622M1937A9941N93013a35626B32814e1970B42191H9545L03616
$$ 2898 344276 98622 140559 19941 612954 -135626 232814 -51970 242191 89545 393161
15242C93161A36452Q3159J55627F2436K26155o3187r673J29772L90199N15969
$$ 393161 136452 219611 375238 62436 288591 225404 215731 345503 735702 1251671
15232A251671l88750K75535l15876k79000k9110j77520A66023d9242K0349j76201
$$ 1251671 862921 1138456 822580 543580 514470 336950 166023 -49242 -28893 -205094
15222b05094C31265a52062A58966a2843k75179a32569J7642A56338k8508f9019
$$ -205094 331265 -152062 158966 -12843 -288022 -132569 -114927 156338 127830 -69019
15211A85088h2797A83373j0887a40505C1032K34479j17625f2195B17806h8014
$$ 185088 -82797 183373 172486 -140505 31032 265511 147886 -62195 217806 -88014
15200D0782P7128J21198k7669C7214R4160P5778p4562K62219F2466J44347a21947
$$ 40782 117910 239108 211439 37214 131374 207152 132590 394809 62466 206813 -121947
15188h9320K1146C19444C8214M5740K53110A3774m263g6227A13036k9082N5684
$$ -89320 -68174 319444 38214 83954 337064 13774 9511 -76227 113036 83954 139638
15177A39638g6048b9703j69750A77880f9160C65719M9942j63309a58538a8162
$$ 139638 -76048 -29703 -199453 177880 -69160 365719 415661 252352 -158538 -18162
15166B62066K0451j28349R511J32571r5491a498p2560B15984Q6762p2046a16408
$$ 262066 282517 154168 163679 296250 200759 -1498 -74058 215984 302746 230700 -116408
15154a02949L7556A37167a93321C8208a8673j41821A35120b940I0936r072n353
$$ -102949 -65393 137167 -193321 38208 -18673 -160494 135120 -2940 90936 81864 76511
15143G6511Q9271b5312B30029q4531a09312d6744r8277o2763C3573b29133A74993
$$ 76511 165782 -25312 230029 145498 -109312 -46744 -145021 -207784 33573 -229133 174993
15131a94973J7836g9021B94693b6754G6819b29307B16051o8015a14249l84000
$$ -194973 -177137 -79021 294693 -26754 76819 -229307 216051 148036 -114249 -498249
15121d98249B90167G9444J91355E5456J70373o9129d1495E882h6039F5194O0631
$$ -498249 290167 79444 270799 55456 225829 156700 -41495 5882 -86039 65194 125825
15110A25825d9388F8153K23858J70589A83731i851B99084n0949I6724a12506k28848
$$ 125825 -49388 68153 292011 462600 183731 -9851 299084 248135 96724 -112506 -341354
15099c41354d7693A83700R0277b23906B29564k4439K208m6886d2403E30552A99235
$$ -341354 -47693 183700 273977 -223906 229564 205125 207333 160447 -42403 530552 199235
15087f1617C23485A17037L6938a31980C65572f6746p5103j17853A99470r503J39618
$$ -61617 323485 117037 153975 -131980 365572 -66746 -141849 -259702 199470 189967 329585
15076C29585b35292E1009O139L52113j62801o8070n3335g6156C28171I068K71172
$$ 329585 -235292 51009 57148 409261 246460 178390 125055 -76156 328171 9068 280240
15065B80240n3014C3656K51031o154f2229A87146M553p712J42205A62607A9458
$$ 280240 227226 33656 284687 278533 -62229 187146 191699 183987 326192 162607 19458
15053b5093C51226i3888L1089H921K79103J1128a72050P7988j3067C56581c24210
$$ -25093 351226 -93888 -62799 8921 288024 299152 -172050 -94062 -107129 356581 -324210
15041d2275C27283j36149K86481k19102a8459F3477a32151C70129o9839A36659
$$ -42275 327283 191134 477615 258513 -18459 63477 -132151 370129 300290 136659
15030C36835a87684D33423J7687C3563a21822H0653K15710j9589J14851j90723
$$ 336835 -187684 433423 451110 33563 -121822 80653 296363 276774 391625 200902
15020B00902q8550a40871b9856B71265M3662A15084a9280B45090l2541D2407M1891
$$ 200902 112352 -140871 -29856 271265 314927 115084 -19280 245090 212549 42407 84298
15009H4298k7078N5973J66270j32031d4341D12008h210C23163A55092K93921j67493
$$ 84298 57220 113193 279463 147432 -44341 412008 -8210 323163 155092 449013 281520
14998B81520J15639A47956b2876B044d183A71424R4697Q0746b32853a7681j07183
$$ 281520 397159 147956 -22876 2044 -4183 171424 266121 346867 -232853 -17681 -124864
14987a24864A15325a6794D00670j5367A00251a55178A80167K04590A79930N8478
$$ -124864 115325 -16794 400670 385303 100251 -155178 180167 384757 179930 238408
14977B38408n5750L4310J37719p3208B9867J70763l1758J53112C10K73716o3273
$$ 238408 182658 216968 354687 281479 29867 200630 168872 321984 310 274026 210753
14966B10753I3980O7725a23569F5982L70546A99579I0330g6294C13783J3790k3585
$$ 210753 93980 161705 -123569 65982 436528 199579 90330 -76294 313783 327573 303988
14955C03988f9228A53884B1672N73721B23048J12621a61649C3018J13240L24355
$$ 303988 -69228 153884 21672 595393 223048 335669 -161649 33018 146258 470613
14945D70613B29173M10032C02406J69159j58626J16830r7186k4233A50431K44826
$$ 470613 229173 639205 302406 471565 312939 429769 332583 308350 150431 395257
14935C95257A37850O6379L83818B57681J99737A66105M0915p1684P6988Q9960
$$ 395257 137850 204229 588047 257681 457418 166105 207020 135336 212324 302284
14925C02284q2367K43026j8997j63602j5818j09039K0111o8656L6890J75198L76025
$$ 302284 219917 462943 443946 280344 264526 155487 175598 106942 143832 319030 695055
14914F95055B35537C1600J69120M14755B95854K59372N2692k14398E3497L43120
$$ 695055 235537 31600 200720 615475 295854 555226 607918 393520 53497 396617
14904C96617P5965A22308K88267P4557o4612o4102M0726j58853N7304l5260J81860
$$ 396617 472582 122308 410575 485132 420520 356418 397144 238291 295595 260335 442195
14893D42195L11787A06481L03209H0367J47612K07060k04230M4664J15116j3336
$$ 442195 753982 106481 409690 80367 227979 435039 230809 275473 390589 377253
14883C77253A77245B2380K28930J7596J75774j46990b9280F72972j80177Q1643
$$ 377253 177245 22380 251310 268906 444680 297690 -29280 672972 492795 574438
14873E74438j76619N7826A02663K76848k1209A62293K17794A66213M2970O4752
$$ 574438 397819 455645 102663 379511 358302 162293 380087 166213 209183 273935
14863B73935J54353p1781K6042Q8743q4100A72140M51661j36520l3975J166L7524
$$ 273935 428288 356507 382549 471292 387192 172140 623801 487281 453306 454472 491996
14852D91996M01270j98697k84623j7266Q1324j85634j28036K63970L49271l15083
$$ 491996 893266 694569 409946 392680 474004 288370 160334 424304 773575 458492
14842D58492k5575J54851k78244J74710K32308G6216K75531Q816J97225k16299
$$ 458492 432917 587768 309524 484234 716542 76216 351747 360563 557788 341489
14832C41489J19420j10330L64572k03440A85823K48124k09779L60177j32876r0489
$$ 341489 460909 350579 715151 511711 185823 433947 224168 584345 451469 360980
14822C60980K51764k54175K97432k55530A39478L30833O6551j4571B43940K99060
$$ 360980 612744 358569 656001 400471 139478 470311 536862 522291 243940 543000
14812E43000K00098B71680J596K74703j59144J3301L0862K42745B64112N29044
$$ 543000 743098 271680 273276 547979 388835 402136 432998 675743 264112 793156
14802G93156B27833K08131K9852o5151M04993l13095m3307k00351M09734o6822
$$ 793156 227833 435964 465816 400665 805658 492563 449256 248905 658639 591817
14792E91817l0799j50139r7946K34220k03112L8482M2874M706L41258l0250M6978
$$ 591817 561018 410879 312933 547153 344041 382523 425397 430103 771361 741111 788089
14781G88089l17514o6069K28471B40482K81711K78013N1985B58203L63097j42543
$$ 788089 470575 404506 632977 240482 522193 800206 852191 258203 621300 478757
14771D78757L17170n4978B05313K98364J46068j48297q1760K69636k00005r8172
$$ 478757 795927 740949 205313 503677 649745 501448 419688 689324 489319 391147
14761C91147K91828J451k00391J22258k0834r9475P9428J53209r4999k87165J63111
$$ 391147 682975 684426 484035 606293 585459 485984 565412 718621 623622 336457 499568
14750D99568K56634J13755D07226Q2281L20102k34846N0567J09418J22413k07087
$$ 499568 756202 869957 407226 489507 809609 574763 625330 734748 857161 650074
14740F50074k428J04301n505m5334j81998M8843p6854P3550K69754j51433r4288
$$ 650074 647646 751947 746442 701108 519110 567953 491099 564649 834403 682970 588682
14729E88682N64801D47407K92431j4970J31593N5101j34012J68270l7065k05603
$$ 588682 1153483 447407 739838 724868 856461 911562 777550 945820 908755 703152
14719G03152j10656J15387j48684N52778k23933j27191k07496M39739j83366J58246
$$ 703152 592496 707883 559199 1111977 888044 760853 553357 993096 809730 967976
14709I67976k56774j9538L0636l2219k16043L21620L28794n25035K1221J97913
$$ 967976 711202 691664 722300 690081 474038 795658 1124452 599417 620638 818551
14699H18551k57211K30569O3045J95133l70398O3018L57855m92223j52771N06447
$$ 818551 561340 791909 854954 1050087 679689 742707 1100562 608339 455568 962015
14689I62015j43644j49200K64571l53533K45487Q87J15553J03311j19124l94859
$$ 962015 818371 669171 933742 580209 825696 826583 942136 1045447 926323 531464
14679E31464N61450l92813M12857E51234K96170M30935o24549J11546K03935p1781
$$ 531464 1092914 700101 1112958 551234 847404 1278339 653790 765336 969271 897490
14669H97490J24148N8170O2620K6196l8914j83034Q5075k32098J56467l1m8876
$$ 897490 1021638 1079808 1142428 1168624 1129710 946676 1031751 799653 956120 956089 907213
14658I07213L07696l70413K96260q5801p1992K4370Q2234o37J8754p2029K6034
$$ 907213 1214909 844496 1140756 1054955 982963 1007333 1089567 1088930 1107684 1035655 1061689
14647A061689k61012L20085J44169j80344l8137O2123J0111r7771K06211j49823
$$ 1061689 800677 1120762 1264931 1084587 1046450 1108573 1118684 1020913 1227124 1077301
14637A077301q325n5791L75682j78884m21249N19784k66282L98893k53964l8481
$$ 1077301 1068976 1013185 1388867 1209983 788734 1308518 1042236 1441129 1187165 1148684
14627A148684j32887L06440q7029K67030m69111L48266l10037Q2437L19010j10115
$$ 1148684 1015797 1322237 1235208 1502238 1033127 1381393 1071356 1153793 1472803 1362688
14617A362688M4827J9451p9101j65508M22003l20841k09455K24953k2432q3246
$$ 1362688 1407515 1426966 1347865 1182357 1604360 1283519 1074064 1299017 1276585 1193339
14607A193339l350L21227n6794k61647M52296J0947q1540L06710l28550J00204
$$ 1193339 1189989 1511216 1454422 1192775 1645071 1656018 1574478 1881188 1552638 1652842
14597A652842j39227M72730k06407j04306j24521M9166k89013K14686L35706K0836
$$ 1652842 1513615 1986345 1779938 1675632 1551111 1600277 1311264 1525950 1861656 1882492
14587A882492j06471j32497N4828L13987m40929j63433N07073l98539O16469n71185
$$ 1882492 1776021 1643524 1698352 2012339 1571410 1407977 1915050 1516511 2132980 1561795
14577A561795J34301K53442P5336l27320K44668k02954L9223J96810n9136o4985
$$ 1561795 1696096 1949538 2024874 1697554 1942222 1739268 1778491 1975301 1916165 1851180
14567A851180J74328j18294M14143j33426l11284L6794K76847L22577m35950K21542
$$ 1851180 2025508 1907214 2321357 2187931 1876647 1913441 2190288 2512865 2076915 2298457
14557B298457m67912K58911K49586j72606M98175m24004J27291J93384j63218
$$ 2298457 1830545 2089456 2339042 2166436 2664611 2240607 2367898 2561282 2398064
14548B398064J48198J58678J23473m6710M19786K33651L04522K30746o197P23053
$$ 2398064 2546262 2704940 2828413 2781703 3201489 3435140 3739662 3970408 3964211 4687264
14538D687264O08083O43067J193844J369060K078995L797702O908022J1593013
$$ 4687264 5295347 5938414 7132258 8501318 10580313 14378015 21286037 32879050
14530C2879050l113453j2682133p209942l377190j728737j154490l04471R97m31944
$$ 32879050 29765597 17083464 9873522 6496332 4767595 3613105 3308634 3309631 2877687
14521B877687l40922K58306j82042k89619L72103J1841k80958J29556k92619J58447
$$ 2877687 2536765 2795071 2613029 2323410 2695513 2707354 2426396 2555952 2263333 2421780
14511B421780o6782K75168K91945l07634m12504K53999j61558L61593n7106k18017
$$ 2421780 2354998 2630166 2922111 2614477 2201973 2455972 2294414 2656007 2598901 2380884
14501B380884L22453K50753l00551l8993L56993k52663j2121J87037J06891l5744
$$ 2380884 2703337 2954090 2653539 2614546 2971539 2718876 2706755 2893792 3000683 2964939
14491B964939q8788j37023J75604M1209j58433L79707K84958k29573m2245J71014
$$ 2964939 2876151 2739128 2914732 2955941 2797508 3177215 3462173 3232600 3190355 3361369
14481C361369M6595J75370J7441m10872J82227q2999J86511q53m998K3011P8505
$$ 3361369 3407964 3583334 3600775 3189903 3372130 3289131 3475642 3474789 3469791 3492802 3571307
14470C571307L63076k43154O1483o9592M98708P7083l14832J63788n44050P70048
$$ 3571307 3934383 3691229 3752712 3683120 4181828 4258911 3944079 4107867 3563817 4333865
14460D333865l12825L65604n31597J14896J21159L89058j12568j56442K48751
$$ 4333865 4021040 4386644 3855047 3969943 4091102 4480160 4367592 4211150 4459901
14451D459901K13671J03157K26798m43575L47835k14981K66138l36898N10687
$$ 4459901 4673572 4776729 5003527 4559952 4907787 4692806 4958944 4622046 5132733
14442E132733O5265L39513m63132K82039J63876l01193K93112R0932j22444p2512
$$ 5132733 5197998 5537511 5074379 5356418 5520294 5219101 5512213 5603145 5480701 5408189
14432E408189L71450J94188k03534L75626j77245o5725M49041j45877r8327K7285
$$ 5408189 5779639 5973827 5770293 6145919 5968674 5902949 6351990 6206113 6107786 6135071
14422F135071L46236J17262J05052J51826K76188j12953j10294j64948M17100
$$ 6135071 6481307 6598569 6703621 6855447 7131635 7018682 6908388 6743440 7160540
14413G160540J29583J56731j2826m1285L43524j02252K36136o3660N33092l0859
$$ 7160540 7290123 7446854 7434028 7392743 7736267 7634015 7870151 7806491 8339583 8308724
14403H308724j81091K76148K27848J37865N07039k54073p8528K59423L24614j01581
$$ 8308724 8127633 8403781 8631629 8769494 9276533 9022460 8943932 9203355 9527969 9426388
14393I426388L37288j78859K17250N90074k72365M38437q2394K31508L73632j79096
$$ 9426388 9763676 9584817 9802067 10392141 10119776 10558213 10475819 10707327 11080959 10901863
14383A0901863O96230J3242K81545L06602j3528j43261J57528L03898N12793m0110
$$ 10901863 11598093 11611335 11892880 12199482 12185954 12042693 12200221 12504119 13016912 12976802
14373A2976802M41838K14635K88975J99103j17717N15651N72204K2329L06946
$$ 12976802 13418640 13633275 13922250 14121353 14003636 14519287 15091491 15113820 15420766
14364A5420766M73145J37941L8646K18245P60802N77529J5460M93718J23423K40815
$$ 15420766 15893911 16031852 16070498 16288743 17049545 17627074 17642534 18136252 18259675 18500490
14354A8500490M76685O60523L53082L01056K91967N08724L24441L95120N47990
$$ 18500490 18977175 19637698 19990780 20291836 20583803 21092527 21416968 21812088 22360078
14345B2360078O34812O68001N97647L63457N37211R09916K00675R48102R58706
$$ 22360078 22994890 23662891 24260538 24623995 25161206 26071122 26271797 27219899 28178605
14336B8178605J46455Q54592O49439O91481J317900O36650Q16163P96713L94035
$$ 28178605 28325060 29179652 29829091 30520572 31838472 32475122 33291285 34087998 34482033
14327C4482033J367981J040103J254302P37263J048199J281705J415406J123626
$$ 34482033 35850014 36890117 38144419 38881682 39929881 41211586 42626992 43750618
14319D3750618J257918J151659J345038J627705J651966J404090J677697K077964
$$ 43750618 45008536 46160195 47505233 49132938 50784904 52188994 53866691 55944655
14311E5944655J764119J907277K139812K199272K541324J771927K673299K664040
$$ 55944655 57708774 59616051 61755863 63955135 66496459 68268386 70941685 73605725
14303G3605725L178698K562487L102265L291916L407800L738820L683709M248510
$$ 73605725 76784423 79346910 82449175 85741091 89148891 92887711 96571420 100819930
14295A00819930L786767M794347N134476M732471N649181N582269N944390O514237
$$ 100819930 104606697 109401044 114535520 119267991 124917172 130499441 136443831 142958068
14287A42958068O809101P101027P861574P766512Q768052R322976R945363R997266
$$ 142958068 149767169 156868196 164729770 172496282 181264334 190587310 200532673 210529939
14279B10529939J1084951J1708449J2074908J3002822J3392726J4425514J4758730
$$ 210529939 221614890 233323339 245398247 258401069 271793795 286219309 300978039
14272C00978039J5291951J5538702J6115543J5574967J4402565J3515267J1887200
$$ 300978039 316269990 331808692 347924235 363499202 377901767 391417034 403304234
14265D03304234J0535108R518676P828772P335867N718237M251139N279244N262750
$$ 403304234 413839342 423358018 431186790 438522657 444240894 448492033 453771277 459034027
14257D59034027K735494J221956J173885o930496r024679j0366181j0134469j2681465
$$ 459034027 461769521 462991477 464165362 457234866 448210187 437844006 427709537 415028072
14249D15028072j4265417j4019971j3299120j3158627j3721970j3412418j3574643
$$ 415028072 400762655 386742684 373443564 360284937 346562967 333150549 319575906
14242C19575906j3653518j3388751j2546139j1705637j2205654j1714020j1149997
$$ 319575906 305922388 292533637 279987498 268281861 256076207 244362187 233212190
14235B33212190j0467751j0420474j0015294r766597r503456q206674p960640
$$ 233212190 222744439 212323965 202308671 192542074 183038618 174831944 166871304
14228A66871304q342015p465869p020257o748358n462371o173156n330774n302048
$$ 166871304 158529289 151063420 144043163 137294805 131832434 125659278 120328504 115026456
14220A15026456m950092m692721m372465m076437l683294l747630l679069l154387
$$ 115026456 110076364 105383643 101011178 96934741 93251447 89503817 85824748 82670361
14212H2670361l450301k769171l076357k456295k513161k446032k117573k185545
$$ 82670361 79220060 76450889 73374532 70918237 68405076 65959044 63841471 61655926
14204F1655926k293814j878274j905181j992157j722246j166425j742275j275160
$$ 61655926 59362112 57483838 55578657 53586500 51864254 50697829 48955554 47680394
14196D7680394j824686j325701j146012j139156q23452j627908j118643q94681
$$ 47680394 45855708 44530007 43383995 42244839 41421387 39793479 38674836 37780155
14188C7780155r60434r61799p97274q69854r53751j106424q73136n45654m19433
$$ 37780155 36819721 35857922 35060648 34190794 33237043 32130619 31257483 30711829 30292396
14179C0292396q51548q66440o66591n11671j015295q37431l05256l77864o96909
$$ 30292396 29440848 28574408 27907817 27396146 26380851 25543420 25238164 24860300 24163391
14170B4163391j28874r25529l01177o98803m47515l03964p15267k71582j68286
$$ 24163391 24034517 23108988 22807811 22109008 21661493 21357529 20642262 20370680 20202394
14161B0202394q76474l73266k06069k23736n90852j90168k91449l45196n11562
$$ 20202394 19325920 18952654 18746585 18522849 17931997 17741829 17450380 17105184 16593622
14152A6593622k13800j4760l40067m64756k73110n28513M1980l95877l7076o88388
$$ 16593622 16379822 16365062 16024995 15560239 15287129 14758616 14800596 14404719 14367643 13679255
14142A3679255J58914l78077k4705r9021n61389j20635k12667k45682P3416l62195
$$ 13679255 13838169 13460092 13435387 13336366 12774977 12654342 12441675 12195993 12269409 11907214
14132A1907214k56182j40731p9119k20025j52076o10696K06102j60099j66138
$$ 11907214 11651032 11510301 11431182 11211157 11059081 10448385 10654487 10494388 10328250
14123A0328250J01638l60125l583p0163j73061l63634j93335J86038k84645m31494
$$ 10328250 10429888 10069763 10066180 9996017 9822956 9459322 9265987 9452025 9167380 8735886
14113H735886K10515j13767j68113L20121o14835j5218r8526K522k33683j75217
$$ 8735886 8946401 8832634 8664521 8984642 8369807 8354589 8256063 8258585 8024902 7849685
14103G849685l0811k14990o3638K8305o2058k49485q033l18261L59083l19854
$$ 7849685 7818874 7603884 7540246 7568551 7506493 7257008 7248975 6930714 7289797 6969943
14093F969943j47932k56312J12463j48383N9077P048k22446k21519N9640j12354
$$ 6969943 6822011 6565699 6678162 6529779 6588856 6595904 6373458 6151939 6211579 6099225
14083F099225j66993r8676J00583j15377k36785P1647j41787K21923k04710n8734
$$ 6099225 5932232 5833556 5934139 5818762 5581977 5653624 5511837 5733760 5529050 5470316
14073E470316L2211K04372m04279l10739L20603j44984j75543m2185J4798K55794
$$ 5470316 5502527 5706899 5302620 4991881 5312484 5167500 4991957 4949772 4964570 5220364
14063E220364k07780j68198j12237j01577j05527j6781j75378K87838n06890J68051
$$ 5220364 5012584 4844386 4732149 4630572 4525045 4508264 4332886 4620724 4113834 4281885
14053D281885K37215k59906K20748m25676M15141k01320n7154J656J2518R2033
$$ 4281885 4519100 4259194 4479942 4054266 4469407 4268087 4210933 4212589 4225107 4317140
14043D317140l35267J62096K61874l83158L3204l809m09490K6882N0087J52775
$$ 4317140 3981873 4143969 4405843 4022685 4055889 4052080 3642590 3669472 3719559 3872334
14033C872334l27415J99918l90146L58334j90635r5238J52659l8180l51719K18876
$$ 3872334 3544919 3744837 3354691 3713025 3522390 3427152 3579811 3541631 3189912 3408788
14023C408788j72133p9274J17798p9249J69436j57087L19931m16119J34491L34764
$$ 3408788 3236655 3157381 3275179 3195930 3365366 3208279 3528210 3112091 3246582 3581346
14013C581346n42097k78227Q1624L48415l31617J55069J32191l69137r282j13978
$$ 3581346 3039249 2761022 2842646 3191061 2859444 3014513 3146704 2777567 2768285 2654307
14003B654307L00583k58386K36057l34398M1607k37581K39847J75617l80936L29876
$$ 2654307 2954890 2696504 2932561 2598163 2639770 2402189 2642036 2817653 2436717 2766593
13993B766593m79491L24607m74778N89511o27174J81432J6202K1816K58839j36318
$$ 2766593 2287102 2611709 2136931 2726442 2099268 2280700 2296902 2318718 2577557 2441239
13983B441239j88291L91888P6735k53433N20934K89734P76991M34879J000776
$$ 2441239 2252948 2644836 2721571 2468138 2989072 3278806 4055797 4490676 5491452
13974E491452J364414L358554N993084J1774631K694523j1183098o732799l698142
$$ 5491452 6855866 10214420 16207504 27982135 30676658 19493560 12760761 9062619
13966I062619j895879j533999m33247j104098m6250k84002l12709l51565q3606
$$ 9062619 7166740 5632741 5199494 4095396 4049146 3765144 3452435 3100870 3017264
13957C017264m4401k32653J21704K0400l11084K08534m92578J99254j02563l11070
$$ 3017264 2972863 2740210 2861914 2882314 2571230 2779764 2287186 2486440 2383877 2072807
13947B072807J85722Q1533r9508L5581l57277K13411Q7224L7883k40472L6927
$$ 2072807 2258529 2340062 2240554 2276135 1918858 2132269 2219493 2257376 2016904 2053831
13937B053831j26057o1541K11586j0357j35542K56661l65528N7464m3037K5735
$$ 2053831 1927774 1866233 2077819 2067462 1931920 2188581 1823053 1880517 1837480 1863215
13927A863215l36239m118R4290K71434n9842o0790L51180m62214R5754K64466
$$ 1863215 1526976 1522858 1617148 1888582 1828740 1767950 2119130 1656916 1752670 2017136
13917B017136m29932J16307j04243j1054J05671j60680J38701j73246N0063L37264
$$ 2017136 1587204 1703511 1599268 1588214 1693885 1533205 1671906 1498660 1548723 1885987
13907A885987l87180K1997J28515j07135J17512N6919k6656k94122M82866m33007
$$ 1885987 1498807 1520804 1649319 1542184 1659696 1716615 1689959 1395837 1878703 1445696
13897A445696K12855j29680O6809k72341K04042k29699J30386J11644K07646l58239
$$ 1445696 1658551 1528871 1595680 1323339 1527381 1297682 1428068 1539712 1747358 1389119
13887A389119J44890J42533l71918J58248k18545K74081j09726j92932K6339M4393
$$ 1389119 1534009 1676542 1304624 1462872 1244327 1518408 1408682 1215750 1242089 1286482
13877A286482l21071M76933l21988K13583j36628Q9215j21331M0915J856l34840
$$ 1286482 965411 1442344 1120356 1333939 1197311 1286526 1165195 1206110 1207966 873126
13867H73126L01540M22904n48320K92494r3789l2563j05978k24176K55200j35124
$$ 873126 1174666 1597570 1049250 1341744 1247955 1215392 1109414 885238 1140438 1005314
13857A005314J93349P5195k23450R2482L26258p570j44719k89613J12050j76990
$$ 1005314 1198663 1273858 1050408 1142890 1469148 1461578 1316859 1027246 1139296 962306
13847I62306Q7437n8803J23080k02020P1369n562K01362O1230j56598O9617p2538
$$ 962306 1049743 990940 1114020 912000 983369 977807 1179169 1240399 1083801 1153418 1080880
13836A080880K59248j81493j56219R6731K8974Q5060m4525m13085R4022M52628
$$ 1080880 1340128 1158635 1002416 1099147 1128121 1213181 1168656 755571 849593 1302221
13826A302221o02341K23047K24578l93203J53395J18234J62692l03281J87955
$$ 1302221 699880 922927 1147505 754302 907697 1025931 1188623 885342 1073297
13817A073297l27304K45713r1453K7728q9361Q3058K26253k13657J28936l16606
$$ 1073297 745993 991706 900253 927981 838620 921678 1147931 934274 1063210 746604
13807G46604l49M348L12730j31889j72423j84670K69550o5872L40969k34867p2394
$$ 746604 746255 750603 1063333 931444 759021 574351 843901 778029 1118998 884131 811737
13796H11737k13k01619L00896J10663j77308P6634j84058O9114J0482k6064q5469
$$ 811737 811524 609905 910801 1021464 844156 920790 736732 805846 816328 790264 704795
13785G04795J1530p0636J32338N00260D24251L64158l9530N8553p8321R5913j07076
$$ 704795 716325 645689 778027 1278287 424251 788409 748879 807432 729111 825024 717948
13774G17948L6j55219R6381m2788O6620J72261M00303E91059k03788L04813J98256
$$ 717948 717984 562765 659146 616358 682978 855239 1255542 591059 387271 692084 890340
13763H90340o7566J77679j99736j46846n4671M7327J77499Q8521k39540J29803
$$ 890340 822774 1000453 800717 653871 599200 646527 824026 912547 673007 802810
13753H02810j09438j44575K98387k80334l1700M18785p9136k50453K60607r8062
$$ 802810 693372 548797 847184 566850 535150 953935 874799 624346 884953 786891
13743G86891m5203C65570J19390L27084j06992j56155J35714P4630p1427R279
$$ 786891 741688 365570 484960 812044 705052 548897 684611 759241 687814 697093
13733F97093k42689R7619l5067L54212l85278K29087j0246j47923J64419B92620
$$ 697093 454404 552023 516956 871168 485890 714977 704731 556808 721227 292620
13722G18413N9652m3280j13283J18904M4405L7066j10538l52147J58673J97960
$$ 718413 778065 734785 621502 740406 784811 821877 711339 359192 517865 715825
13712G15825R0796o1310j94699k08892M83484B88350L30391J41038k33510j66666
$$ 715825 806621 745311 550612 341720 825204 288350 618741 759779 526269 359603
13702C59603Q9256K56470R7263l32138K24902C19507N30321m6027C80907Q9903
$$ 359603 448859 705329 802592 470454 695356 319507 849828 803801 380907 470810
13692D70810B23866K88388J37414k86713J88704j28492L33264l17541Q7496J25531
$$ 470810 223866 512254 649668 362955 551659 423167 756431 438890 526386 651917
13682F51917Q5139G1414N41756j82757M01763o4988l76552L54894B50489K42157
$$ 651917 737056 71414 613170 430413 832176 767188 390636 745530 250489 492646
13672D92646j40914R4685J60405j28641K03887j27717K49808k59041K2777j09243
$$ 492646 351732 446417 606822 478181 682068 554351 804159 545118 567895 458652
13662D58652J00072l722L4132B01317K68362l0399p9348L25095q8939B82042L90569
$$ 458652 558724 555002 589134 201317 469679 439280 359932 685027 596088 282042 672611
13651F72611A12272N54142A58821K73034J8765P9034R6935A83954L52274B19031
$$ 672611 112272 666414 158821 431855 450620 529654 626589 183954 536228 219031
13640E90387M0906A24486P52989C2856K38318L7657L8959J17637B14366L88549
$$ 590387 631293 124486 877475 32856 271174 308831 347790 465427 214366 602915
13630F02915k3645p3532R1845j09006H9755O58083B09738M9249o9588L09018j03931
$$ 602915 579270 505738 597583 488577 89755 747838 209738 258987 189399 498417 394486
13619C94486l8152M3821J32099l2262B08645J36243J19497j7727p4000k3708J98759
$$ 394486 356334 400155 532254 499992 208645 344888 464385 446658 372658 348950 547709
13608E47709k52351K17898j33433J28385B00398M47888l6353C04003l6175M48474
$$ 547709 295358 513256 379823 508208 200398 648286 611933 304003 267828 716302
13598G16302l05558q4453J15382A74095L47491q850k42042M2898r8148M02648
$$ 716302 410744 326291 441673 174095 521586 512736 270694 313592 215444 618092
13588F18092j59853k21632J04444n5032a0083C76638J77041B35689h7958B38726
$$ 618092 458239 236607 341051 286019 -10083 376638 553679 235689 -87958 238726
13577E7423L58317A26689L10248j10930J55681A68027k3678L86829G5993J87496
$$ 57423 415740 126689 436937 326007 481688 168027 144349 531178 75993 263489
13567B63489L71976l12539N2677R2461A18545J69721n5824N50679A82870K02466
$$ 263489 635465 322926 375603 468064 118545 288266 232442 783121 182870 385336
13557C85336L8678L2096I4578J06465J70515l2252q6138L91418A15538J75013
$$ 385336 424014 456110 94578 201043 371558 339306 253168 644586 115538 290551
13547B90551N8023L3899J84322A46746J5878K78466j00323J13678j29867J70656
$$ 290551 348574 382473 566795 146746 162624 441090 340767 454445 324578 495234
13537D95234B18054A05172J07663K1910M0649K01095j30654K0331j21886K07437
$$ 495234 218054 105172 212835 234745 275394 476489 345835 366166 244280 451717
13527D51717K46926j91008j10557L2728h0252B77898I6363O26654C4390j699M50482
$$ 451717 698643 507635 397078 429806 -80252 277898 96363 723017 34390 32691 483173
13516D83173A01680J50159K51322L2903B11415G9808J28564N175L91334A00487
$$ 483173 101680 251839 503161 536064 211415 79808 208372 213547 604881 100487
13505D18035B05484L39620A61439K49057D0179M43753A36385J45512J53987j71571
$$ 418035 205484 545104 161439 410496 40179 483932 136385 281897 435884 264313
13495B64313A22568M93289j56248b38741B57321k9254Q7616j35829R0044M3754
$$ 264313 122568 615857 459609 -238741 257321 228067 315683 179854 269898 313652
13485C13652o644J21555h0059B35452K23513A45464j36J90975A0761K18028n3028
$$ 313652 307008 428563 -80059 235452 458965 145464 145328 336303 10761 228789 175761
13474A75761K56594r9131Q6497K57347A74038Q0689J51774G6636L26110o0745
$$ 175761 432355 333224 419721 677068 174038 254727 406501 76636 402746 342001
13464C42001j02933K58628j60775A34535K49596P6804j92306O4022Q2863i4015
$$ 342001 239068 497696 336921 134535 384131 460935 268629 332651 415514 -94015
13453B80791k0394J99999m6415A77561K17566j95679e8174j9256D06509l1886
$$ 280791 260397 460396 413981 177561 395127 199448 -58174 -77430 406509 374623
13443C74623a10155F3034J28114D9849L58936A13810J19202d7716F3946k1956
$$ 374623 -110155 63034 191148 49849 408785 113810 233012 -47716 63946 41990
13433D1990K56340K49546B39026M8238R008A14551J97682E0383L14991m9913m9751
$$ 41990 298330 547876 239026 287264 296272 114551 312233 50383 365374 315461 265710
13422B65710A10249P216J64092f4102A92384L29165A98980N477P4195J76916K8304
$$ 265710 110249 117465 281557 -64102 192384 521549 198980 204457 278652 455568 483872
13411D83872A95328r4748J82992c9794B98382j21516l3352J64562n1675K46397
$$ 483872 195328 100580 283572 -39794 298382 176866 143514 308076 256401 502798
13401E02798L0674j2995A27522K09619j49187K16085o029E9375B967K06138N96219
$$ 502798 533472 520477 127522 337141 187954 404039 398010 59375 2967 209105 805324
13390H05324G4458a33434C07519J01508j83724N4232D1836J95224N7781k5321
$$ 805324 74458 -133434 307519 409027 225303 279535 41836 237060 294841 269520
13380B69520B514K79710F81J87201K86604j11794G9804J43751n1090g324C0439
$$ 269520 2514 282224 681 187882 474486 362692 79804 223555 172465 -7324 30439
13368a27186A89821P9215K2866c8391E02240J38911A48068N7491K24040j61483
$$ -127186 189821 269036 291902 -38391 502240 641151 148068 205559 429599 268116
13358B68116A02215J9051R8624j01276l4747M43316B41243A13650b5029B21486
$$ 268116 102215 121266 219890 118614 83867 527183 241243 113650 -25029 221486
13347C83356a9906m8486B66158r2762O5636F7554J04415J37258k2749I5530L95466
$$ 383356 -19906 -68392 266158 173396 239032 67554 171969 309227 286478 95530 490996
13336D90996A61962j4420j0998K01375j63771k2791K76029A34415K12183A19631
$$ 490996 161962 147542 136544 337919 174148 151357 427386 134415 346598 119631
13325D13804K23586A64563R3248P9721o4933K71205A06504J92555n0713m7592
$$ 413804 637390 164563 257811 337532 272599 543804 106504 299059 248346 200754
13315B00754R1023N0829J77419B52755a13426C32473J21676H1347A9386M5017
$$ 200754 291777 342606 520025 252755 -113426 332473 454149 81347 19386 64403
13305F4403M217N2121J90940q3587N9634p2927l4752F0611k2400Q4872K34819
$$ 64403 68620 120741 311681 228094 287728 214801 180049 60611 38211 123083 357902
13294C57902J91462A59622a57917h766B18170g21A46737R6852a6389C39935M8537
$$ 357902 549364 159622 -157917 -8766 218170 -721 146737 243589 -16389 339935 388472
13283C88472j77721J31729q7423l3670J41889f9761E49442B5539N9278J55267
$$ 388472 210751 342480 255057 221387 363276 -69761 549442 25539 84817 240084
13273B40084I4645J07678J31518K11392B425J3917K75825A13091P114C7028j2802
$$ 240084 94645 202323 333841 545233 2425 16342 292167 113091 120205 37028 24226
13262B4226a36283C23378F7809J81169A21407J68884L014a73216C55483a21433
$$ 24226 -136283 323378 67809 248978 121407 290291 293305 -173216 355483 -121433
13251e6375C40809b89392D519J42027J25438I4297a13016H0618A3322J50564m9098
$$ -56375 340809 -289392 4519 146546 271984 94297 -113016 80618 13322 163886 114788
13240A14788m552L03966g5554B22466m1849N7250m7667N4690J03811c00305A74083
$$ 114788 110236 414202 -75554 222466 180617 237867 190200 244890 348701 -300305 174083
13228b29008A38674J3833a4155B13638b8563B29183a68895A20474K53179A53465
$$ -229008 138674 152507 -14155 213638 -28563 229183 -168895 120474 373653 153465
13217a4C51039A75226a22298B88083A16595J48730E3138j0967b7824m0698B72668
$$ -14 351039 175226 -122298 288083 116595 265325 53138 42171 -27824 -68522 272668
13205h0405B64250K7255J96786k25506p4440P1053a05578I4652a2136A28489k5520
$$ -80405 264250 291505 488291 262785 188345 259398 -105578 94652 -12136 128489 102969
13194A02969J52928O3769m998a08827A60411J79071K8026a24666I3954a91392
$$ 102969 255897 319666 314668 -108827 160411 339482 367508 -124666 93954 -191392
13183A43194c6706j44258B8600d3051j1219C70037A28427a41451I7122c4962A36888
$$ 143194 -36706 -180964 28600 -43051 -54270 370037 128427 -141451 97122 -34962 136888
13171A32962Q7028J26810C2282d1731C31610J14534A29739h3875p6405B75839
$$ 132962 219990 346800 32282 -41731 331610 446144 129739 -83875 -160280 275839
13160A62683q336J38374F5549J45096i4106E9073b603q3451B25178o4215B6218
$$ 162683 154347 292721 65549 210645 -94106 59073 -2603 -86054 225178 160963 26218
13148A92823A4585h8033J6857I9973M7860F2785d7054B62546j02316J3603b71
$$ 192823 14585 -88033 -71176 99973 147833 62785 -47054 262546 160230 173833 -271
13136b3634B9238J79657i952G1173J46029a32480a3974B98942j32883B922Q3647
$$ -23634 29238 208895 -9952 71173 217202 -132480 -13974 298942 166059 2922 86569
13125H6569L34354A98408n2k9526p564l9858a33445n5697B74156A8925J95553
$$ 86569 420923 198408 198356 168830 161266 121408 -133445 -189142 274156 18925 214478
13114B14478b5326C073a75596J1017c4605A03547a25366C93012H8555e51C26721
$$ 214478 -25326 3073 -175596 -164579 -34605 103547 -125366 393012 88555 -551 326721
13102B14393J03112r1833B1485J82217b12784c1526D20662A98026l3048g2922
$$ 214393 317505 225672 21485 203702 -212784 -31526 420662 198026 164978 -72922
13091b63137O4268A73992c44745A3733b03517A49873O6880a33471M4558A07331
$$ -263137 -198869 173992 -344745 13733 -203517 149873 216753 -133471 -88913 107331
13080B68113I3468K84007a71043B2259f8044l7864C59234h5676c4206k79124B9266
$$ 268113 93468 377475 -171043 22259 -68044 -105908 359234 -85676 -34206 -313330 29266
13068c6432B87197J20309D7382K25393a27422a1400F7019L57506G5619i5900A60302
$$ -36432 287197 407506 47382 272775 -127422 -11400 67019 424525 75619 -95900 160302
13056A59101o9633K2346J58898j22080J16102A21889k4653J31860a882B90450
$$ 159101 89468 111814 270712 148632 264734 121889 97236 229096 -1882 290450
13045B83499J78420A82772n8870J63276c94182A04248O8569g2004A99384M1341
$$ 283499 461919 182772 123902 287178 -394182 104248 172817 -72004 199384 240725
13035B40725A08679E3097K31607a19611C19423j35499p5033d0374A453J69128
$$ 240725 108679 53097 284704 -119611 319423 183924 108891 -40374 1453 170581
13025A70581f0396B26624C2160b77790A70313g8568c3550k6763A30958A014P4540
$$ 170581 -60396 226624 32160 -277790 170313 -78568 -33550 -60313 130958 1014 75554
13014G5554C5940M98090k62120J86454f1885r3458E19873A79305K64089A58634
$$ 75554 35940 534030 271910 458364 -61885 -155343 519873 179305 443394 158634
13003A50198K08396B1641g1038D16171a63109e0816C00018F0127L8288K0621Q5118
$$ 150198 358594 21641 -71038 416171 -163109 -50816 300018 60127 98415 119036 204154
12992B04154e6660A73155P9065a78542A81861c9400B06975K86872A09870B8070
$$ 204154 -56660 173155 252220 -178542 181861 -39400 206975 493847 109870 28070
12981a77167G0118c0868C55647j02017i6335c2826C5851a19904j39562A18548
$$ -177167 70118 -30868 355647 253630 -96335 -32826 35851 -119904 -259466 118548
12970a6647C45521a35975I574b59158d9054E47487A78039J60516b07855F8251
$$ -16647 345521 -135975 9574 -259158 -49054 547487 178039 338555 -207855 68251
12959A9021L9256a08195A3752b2135d295j25167a1942A47334a41750B57437a91334
$$ 19021 58277 -108195 13752 -22135 -4295 -129462 -11942 147334 -141750 257437 -191334
12947a92162N6231N7349D6399E441J09878a28983k29606B43168b62129f6239p1043
$$ -192162 -135931 -78582 46399 5441 115319 -128983 -358589 243168 -262129 -66239 -137282
12936a37282B90031e2711A36001J02664A8832J81902j7250E6871Q8577R7130p7100
$$ -137282 290031 -52711 136001 238665 18832 200734 183484 56871 145448 242578 165478
12925A65478a3615F00692a11291B10825f0656C04222A6079P8782d2295l3170A24035
$$ 165478 -13615 600692 -111291 210825 -60656 304222 16079 94861 -42295 -75465 124035
12913A42000G021c04032R1221B2552a04951D6795h9030E9394k1916g0359k37454
$$ 142000 7021 -304032 -212811 22552 -104951 46795 -89030 59394 37478 -70359 -307813
12902c07813A47161K4558D7334i9666n0039A34549n6939a83007A580L3356A750
$$ -307813 147161 171719 47334 -99666 -149705 134549 77610 -183007 1580 34936 1750
12890f1287B58273r5114b2128B78227J7894a40112A04244M4907D4137e1558A03637
$$ -61287 258273 163159 -22128 278227 296121 -140112 104244 149151 44137 -51558 103637
12878G7733K7487R9725l7387p9296a8660C524K45489j6728a58892j8792D8122
$$ 77733 105220 204945 167558 88262 -18660 3524 249013 232285 -158892 -177684 48122
12866a76986O8672B66499f3610F1189k8092b57480R7233d7136R401j68663E7460
$$ -176986 -108314 266499 -63610 61189 33097 -257480 -160247 -47136 -37735 -206398 57460
12854A96422a39096B12039A04580k3723b98284B06468a91465b6731L149k9558
$$ 196422 -139096 212039 104580 80857 -298284 206468 -191465 -26731 -23582 -53140
12844e3140l13321J42302I5030H638e6522A22116a15368B5166K2775N2411h8287
$$ -53140 -366461 -224159 95030 8638 -56522 122116 -115368 25166 47941 100352 -88287
12832c919A5789h487A13513C8322M8646g1504B37428a89123P7641E0208b04900
$$ -3919 15789 -8487 113513 38322 86968 -71504 237428 -189123 -111482 50208 -204900
12820A75231B1204h7229j77818B7158b67135C9224b6165k45763E7505i7855A21737
$$ 175231 21204 -87229 -265047 27158 -267135 39224 -26165 -271928 57505 -97855 121737
12808f5910A87556b0633p0385A79110g3516r2002P9891D4358a36948o9394A8366
$$ -65910 187556 -20633 -91018 179110 -73516 -165518 -85627 44358 -136948 -206342 18366
12796C30788a22475B58378C4325a46304b3347j8434m30841A50196G4488a69419
$$ 330788 -122475 258378 34325 -146304 -23347 -41781 -472622 150196 74488 -169419
12785C45338a08575H9212h5516B63375N5986a3779A84322a25240B23909a52094
$$ 345338 -108575 89212 -85516 263375 319361 -13779 184322 -125240 223909 -152094
12774C1893i6557B41279H3548l9842J50055C5286i1900j50560a13272P633c7032
$$ 31893 -96557 241279 83548 43706 193761 35286 -91900 -242460 -113272 -105639 -37032
12762E7894J41541I6765a10456C1432L03473k977A4926f5805q4207B72044H8051
$$ 57894 199435 96765 -110456 31432 334905 331928 14926 -65805 -150012 272044 88051
12750D27324C2205L23180j9085b40018B86653F3614K8594i66A74029b01210c4152
$$ 427324 32205 355385 336300 -240018 286653 63614 92208 -966 174029 -201210 -34152
12738a99292G6220K4960g0947k85185O6495c3511k06480o0508C93226g1194j1503
$$ -199292 76220 101180 -70947 -356132 -289637 -33511 -239991 -300499 393226 -71194 -82697
12727h2697K1173k81784c3294I1395r689J80018c9054A21235b5094A74245a3819
$$ -82697 -61524 -343308 -33294 91395 81706 261724 -39054 121235 -25094 174245 -13819
12715B77390J96931A73910c44936B48415D7576a83862R1311d5723k7057J7349
$$ 277390 474321 173910 -344936 248415 47576 -183862 -92551 -45723 -72780 -55431
12705e5431B21103A04234m5487L33628j06678a61308b8441j4384A54770j5251
$$ -55431 221103 104234 58747 392375 285697 -161308 -28441 -42825 154770 139519
12695A39519b0119D05585A82467Q9775F5406h0914A26767J07146a31145q689A71478
$$ 139519 -20119 405585 182467 272242 65406 -80914 126767 233913 -131145 -139834 171478
12683g6487C87505O1623D1225K70234a26429C78075b28675A96391c09840C03820
$$ -76487 387505 449128 41225 311459 -126429 378075 -228675 196391 -309840 303820
12672C35156A67570A179L29594a57273B42911a93727A98939E3249d669C50667
$$ 335156 167570 1179 330773 -157273 242911 -193727 198939 53249 -4669 350667
12661A57322n0896J7327d9341A46781n9918R3145A0816K68387b03516R1842B84333
$$ 157322 106426 123753 -49341 146781 86863 180008 10816 279203 -203516 -111674 284333
12649A15409n6548B1850e4202j55452E8831M6881b0931C75581B6659K7501n981
$$ 115409 58861 21850 -54202 -209654 58831 105712 -20931 375581 26659 54160 48179
12638D8179j9237J10687b08233G3211g8422J8731K2346F5628A7878L13755j54251
$$ 48179 28942 139629 -208233 73211 -78422 -59691 -37345 65628 17878 331633 177382
12627A77382g5039I0756d9984F6126k9392h1914A36447R6497N084M6063j13460
$$ 177382 -75039 90756 -49984 66126 36734 -81914 136447 232944 238028 284091 170631
12616A70631n0378n6433J21077o2288E8662f7177B13181p7438c805H2027J12577
$$ 170631 120253 63820 184897 122609 58662 -67177 213181 135743 -3805 82027 194604
12605A94604K72437A51570k0078b5456o007F9846c9157C17341A19673g3075A92072
$$ 194604 467041 151570 131492 -25456 -31463 69846 -39157 317341 119673 -73075 192072
12593A92690O2492F4533J4819l8248a22174M7399b0733C45344F8279K54344a04239
$$ 192690 255182 64533 79352 41104 -122174 -74775 -20733 345344 68279 322623 -104239
12581A79683C9998R7470h3164B24573b9487B0660J23111d05445c4184A01194A4527
$$ 179683 39998 137468 -83164 224573 -29487 20660 143771 -405445 -34184 101194 14527
12569A87167c31127l9342I519g1026J9080K7B55966p9516m0951c73121D07490
$$ 187167 -331127 -370469 9519 -71026 -51946 -51919 255966 176450 135499 -373121 407490
12557f3418a4906j67197Q6043A70626o7677a67910B76335j27112i733B45813a27730
$$ -63418 -14906 -182103 -96060 170626 102949 -167910 276335 149223 -9733 245813 -127730
12545H6825b7768C00664n038g146m0334k27491A61529a29832B61416A9335J06892
$$ 86825 -27768 300664 295626 -7146 -47480 -274971 161529 -129832 261416 19335 126227
12534A26227a71348H6307M9545c38727j517J65137B64776D027P5087b81894F5867
$$ 126227 -171348 86307 135852 -338727 -340244 -175107 264776 4027 79114 -281894 65867
12522d813A17318B4710L1542b5643A25497K58328A31011c90686i4071C3951L4877
$$ -4813 117318 24710 56252 -25643 125497 383825 131011 -390686 -94071 33951 68828
12511F8828K26138C409e6603D4275j9399K98418b00245g3331B99235b00076E3034
$$ 68828 294966 3409 -56603 44275 24876 323294 -200245 -73331 299235 -200076 53034
12499a3184F3942J44326K9758O6231i5829E4182B3073b29111G9700N03426B84563
$$ -13184 63942 208268 238026 304257 -95829 54182 23073 -229111 79700 583126 284563
12487A36442a12034C1238K20548f5611r8116B4894c2102G9492j7335J47829a01207
$$ 136442 -112034 31238 251786 -65611 -163727 24894 -32102 79492 62157 209986 -101207
12475a01341q0194A42528f7369o3938l3965L8600e5850l85257a15147G2K69118
$$ -101341 -181535 142528 -67369 -131307 -165272 -126672 -55850 -441107 -115147 72 269190
12464B69190b30180F1313a34280R728J1723e3503A60963B2018n454L4349j0580
$$ 269190 -230180 61313 -134280 -124552 -112829 -53503 160963 22018 16564 50913 40333
12453D0333b3319D31066a97392B86941a48939A27754E7L76167d29677B76349G0617
$$ 40333 -23319 431066 -197392 286941 -148939 127754 57 376224 -429677 276349 70617
12441a7469k41155A02083b58810f6479K8025F818K14247e8158l8460A86306g1431
$$ -17469 -258624 102083 -258810 -66479 -38454 6818 221065 -58158 -96618 186306 -71431
12429b5917L50k65930R0487C07040l9109j32754a42727K0430c1208c143l5791
$$ -25917 -25567 -291497 -201010 307040 267931 135177 -142727 -122297 -31208 -3143 -38934
12418c8934j79490p8716a35596A92020E5753a9363B60826H713a8003m4449j08140
$$ -38934 -218424 -297140 -135596 192020 55753 -19363 260826 8713 -18003 -62452 -170592
12407a70592A22001b6673A93428H3714l8925J85806k0828a23278B4556b03529
$$ -170592 122001 -26673 193428 83714 44789 230595 209767 -123278 24556 -203529
12396h347I3736C8498d1525G7304b7395A68187m3541l5386G95P9097O0086a48270
$$ -8347 93736 38498 -41525 77304 -27395 168187 124646 89260 795 79892 139978 -148270
12383b41850A34115a32275B13925C9192b7792j48172j67758C7501a9975A38177
$$ -241850 134115 -132275 213925 39192 -27792 -175964 -343722 37501 -19975 138177
12372b85850a24898j7130C5964c14531O9596a18171B741J7180J29897o8305J60071
$$ -285850 -124898 -142028 35964 -314531 -244935 -118171 2741 19921 149818 81513 241584
12361B41584N1780F7883J38369G1682b33410g6692j30542a2717j33573e9254A17800
$$ 241584 293364 67883 206252 71682 -233410 -76692 -207234 -12717 -146290 -59254 117800
12349C09851A354O8557h9402A45896E7166a25922d7886j09394A53656h9710A43845
$$ 309851 1354 69911 -89402 145896 57166 -125922 -47886 -157280 153656 -89710 143845
12337b0683C87423I1215a47618A36843e3419l05813A58916j0138O9913a3723B13210
$$ -20683 387423 91215 -147618 136843 -53419 -359232 158916 148778 218691 -13723 213210
12325C5302L60710b3401E0576j0458a56112A73380J67877I6336K06091b42894
$$ 35302 396012 -23401 50576 40118 -156112 173380 341257 96336 302427 -242894
12314b5573o5559a3705D7981J72359j07459a71998A21984A9841L9512Q2489A0801
$$ -25573 -91132 -13705 47981 220340 112881 -171998 121984 19841 59353 141842 10801
12302c3556j23310P4311q8542c7743j20363A29631J037b48881B1249b13574A44580
$$ -33556 -156866 -82555 -171097 -37743 -158106 129631 130668 -248881 21249 -213574 144580
12290C5937Q0336c38476B56044b17414H1130c06852A59212k5305C7397b15452
$$ 35937 116273 -338476 256044 -217414 81130 -306852 159212 133907 37397 -215452
12279H0417a27744D2779J21451J47501i240F7449K95619c10426F9849k6065J01713
$$ 80417 -127744 42779 164230 311731 -9240 67449 363068 -310426 69849 43784 145497
12268A45497a14301B01405N1626j571E2104L18511b5952A26212o1399Q9016B2211
$$ 145497 -114301 201405 253031 251460 52104 370615 -25952 126212 64813 153829 22211
12256C6130L81286r9314A0533J92153a10086C80302m5444b22574a2712H1038P2815
$$ 36130 417416 318102 10533 202686 -110086 380302 334858 -222574 -12712 81038 153853
12245A53853b73620D685J34265I769a5072A63259d0818m4824D744L4738R1708
$$ 153853 -273620 4685 138950 9769 -15072 163259 -40818 -85642 4744 39482 131190
12234A31190b05408C81157A01793A6355K47889O1065F6363L28348A23028D0103
$$ 131190 -205408 381157 101793 16355 264244 325309 66363 394711 123028 40103
12223g1956p039I2443A9037d5052A38541Q0257O8426h2880A1576b30131B97245
$$ -71956 -78995 92443 19037 -45052 138541 218798 287224 -82880 11576 -230131 297245
12211A68388l9681l3593b30471A11785J75771o677F52K05810o2877J62653M0038
$$ 168388 128707 95114 -230471 111785 287556 280879 652 206462 143585 306238 346276
12200C46276b33345H2389K17944h4129B33651P5340A36582n1229K7775P983n4523
$$ 346276 -233345 82389 300333 -84129 233651 308991 136582 85353 113128 121111 66588
12189F6588J33025D4058J71000D4272b282C78347A52113F1284b4568I2553J65448
$$ 66588 199613 44058 215058 44272 -2282 378347 152113 61284 -24568 92553 258001
12178B58001J2231j19570P3362g0088o8566A09293e1575B74070G4691a16394j68058
$$ 258001 270232 150662 224024 -70088 -138654 109293 -51575 274070 74691 -116394 -284452
12167b84452A3428M5942K1596J50844J29391j63986C8629c4264B17548A04661
$$ -284452 13428 59370 80966 231810 361201 197215 38629 -34264 217548 104661
12156A38564a6883j8844A71536J63348A41231b8519H7100J11383J85773b2053
$$ 138564 -16883 -35727 171536 334884 141231 -28519 87100 198483 384256 -22053
12145E1203A4864K11046r3438j6002m5899l254M7727a62177B03202e6129j72127
$$ 51203 14864 225910 132472 116470 70571 67317 115044 -162177 203202 -56129 -228256
12134b28256M0313E9251J63327i5165p6170a5818B7665g7861B1138C026K78468
$$ -228256 -187943 59251 222578 -95165 -171335 -15818 27665 -77861 21138 3026 281494
12123B81494a805n3273A23610J65629j17874P889H6685b2620A6912J86174L532
$$ 281494 -1805 -55078 123610 289239 171365 179254 86685 -22620 16912 203086 206618
12112B06618c06558a17624k9545m7464A01986L32621a43096q519A46425J38202
$$ 206618 -306558 -117624 -147169 -194633 101986 434607 -143096 -151615 146425 284627
12102B84627H301J88048m4016g6926J4282A52932g61j19946B59006n9635r3331
$$ 284627 8301 196349 152333 -76926 -62644 152932 -761 -120707 259006 199371 106040
12091A06040d61556J94281k8449C30170j00014M0262F0915b11892P883b4643B3432
$$ 106040 -461556 -267275 -295724 330170 230156 270418 60915 -211892 -204009 -24643 23432
12079A3182a19307N1354A57384c9596B50926j20383Q2284c16971A14844K25893
$$ 13182 -119307 -67953 157384 -39596 250926 130543 212827 -316971 114844 340737
12069C40737k5443g0169A55640m2478P99169J40354N58086F59370F5990b119r0856
$$ 340737 315294 -70169 155640 113162 912331 1052685 1610771 659370 65990 -2119 -92975
12058i2975l9619B64275J64606a36563k0604A87933D0276Q6321l9634a32686a4080
$$ -92975 -132594 264275 428881 -136563 -157167 187933 40276 126597 86963 -132686 -14080
12046b04853p9789f5128j4691k62678A29257C5989c567A27690a35097I8012b7947
$$ -204853 -284642 -65128 -79819 -342497 129257 35989 -3567 127690 -135097 98012 -27947
12034a41336A45929b31781d260G8049f2335r6578O1354A14839D579b93681B99150
$$ -141336 145929 -231781 -4260 78049 -62335 -158913 -97559 114839 4579 -293681 299150
12022c49995a16307N2593j53945L0209m8946P0064A51950a39234D3646R2742l6357
$$ -349995 -116307 -63714 -217659 -187450 -236396 -166332 151950 -139234 43646 136388 100031
12011A00031J64273A19144a40346J9559A1111J48570J8568e5138B08969d6229
$$ 100031 264304 119144 -140346 -120787 11111 159681 178249 -55138 208969 -46229
12000a806A51425a48693B9009c3487O944E2275h7538B42747D3506Q5588J68015
$$ -1806 151425 -148693 29009 -33487 -26543 52275 -87538 242747 43506 129094 297109
11989B97109j5103a12280f89p5806J8213q3599k98847F5862g9833l1764N3916
$$ 297109 282006 -112280 -689 -76495 -58282 -141881 -440728 65862 -79833 -111597 -57681
11978e7681B8401R7352a87797g6111k50077i3211b4927A1559J54620a39352O8197
$$ -57681 28401 125753 -187797 -76111 -326188 -93211 -24927 11559 166179 -139352 -71155
11967g1155k90104a74838M6208M5775J4380a0744A66326G6458a31131M1762f658
$$ -71155 -361259 -174838 -128630 -82855 -68475 -10744 166326 76458 -131131 -89369 -6658
11955b42878A51670E4380K68528C5627J65451b47594h2947b2313b376k18342a3459
$$ -242878 151670 54380 322908 35627 201078 -247594 -82947 -22313 -2376 -220718 -13459
11943A0470J99685c5495j03142J1532M2067A0679a15354D9977a79455A49337c9793
$$ 10470 210155 -35495 -138637 -127105 -85038 10679 -115354 49977 -179455 149337 -39793
11931B09305q1791b9778H3120C2462a86320M9610C27626a38977B6267L5988h5004
$$ 209305 127514 -29778 83120 32462 -186320 -136710 327626 -138977 26267 62255 -85004
11919d0433j37519c6909j18507B0319a73734A91855k0559b67201A9398c81599
$$ -40433 -177952 -36909 -155416 20319 -173734 191855 171296 -267201 19398 -381599
11908b41865I9132D997P030b9272B58256b08529G3515g6260A29188L3480C6986
$$ -241865 99132 4997 12027 -29272 258256 -208529 73515 -76260 129188 162668 36986
11896E8618J08278G8793N5874D4351h8826o0333A21739c2553m25138O9568F9758
$$ 58618 166896 78793 134667 44351 -88826 -149159 121739 -32553 -457691 -388123 69758
11884C4582d7209A83807J32424H3214c08080E5900Q554L2109a76111m08007A58923
$$ 34582 -47209 183807 316231 83214 -308080 55900 64454 96563 -176111 -584118 158923
11872F6011A0243a45063E9278J5533h5382H2084d508l5953j26065f404j20803
$$ 66011 10243 -145063 59278 74811 -85382 82084 -4508 -40461 -166526 -6404 -127207
11861a27207B53509h0534k2759C50836B4243a88232F9885c33400a62087o780g2652
$$ -127207 253509 -80534 -103293 350836 24243 -188232 69885 -333400 -162087 -168867 -72652
11849c1077H5933i5950d1213j96530A82905a85727k5330A96269J21462H0147j0236
$$ -31077 85933 -95950 -41213 -237743 182905 -185727 -211057 196269 317731 80147 69911
11838F9911R9195l4050j03l3917c04368b4124A29813L08075d03251N6826J39570
$$ 69911 169106 135056 134953 101036 -304368 -24124 129813 437888 -403251 -346425 -206855
11827b06855I0837M8600b2149I8108e3718n06065A13132b38475k8775C01326c64305
$$ -206855 90837 139437 -22149 98108 -53718 -559783 113132 -238475 -267250 301326 -364305
11815c49606A9213J09441g1949A6151P7045d1636C3595b83108A38380n7315b33880
$$ -349606 19213 128654 -71949 16151 93196 -41636 33595 -283108 138380 81065 -233880
11803A16722c9101j16726H7106j1126j5907f459p0175B66734j16861c429o5067
$$ 116722 -39101 -155827 87106 75980 60073 -6459 -76634 266734 149873 -3429 -68496
11792f8496k21307J04526C58013j65928d9025G2721Q8414a03751b0888A73075
$$ -68496 -289803 -185277 358013 192085 -49025 72721 161135 -103751 -20888 173075
11781d9590G9629N4866Q6569h1751E6597c06880g6467r9911q8099B4979b5691
$$ -49590 79629 134495 221064 -81751 56597 -306880 -76467 -176378 -264477 24979 -25691
11769a56466m5572f8399j07315d7886D0023h5164A03954l7529L6911a32081A2111
$$ -156466 -202038 -68399 -175714 -47886 40023 -85164 103954 66425 103336 -132081 12111
11757a00876E8547M9662h8611m2181n7182F3267a69720A95228h7924G760J10567
$$ -100876 58547 108209 -88611 -130792 -187974 63267 -169720 195228 -87924 7760 118327
11746A18327a2159B34355j06245D5965P5039J3013a27426A86261A1946b3001I059
$$ 118327 -12159 234355 128110 45965 121004 134017 -127426 186261 11946 -23001 9059
11734A07754h8506k04591Q4709j0569e6980j09379D6636e25213K60821A03442
$$ 107754 -88506 -293097 -208388 -218957 -56980 -166359 46636 -525213 -264392 103442
11723G4966a6853b823A62388K6608a01169I904P3692a20942A12023j3596O2928
$$ 74966 -16853 -2823 162388 188996 -101169 9904 83596 -120942 112023 98427 161355
11712A61355a26586f0442B96995A27401H545J58105b7621C167J28273b01520A8910
$$ 161355 -126586 -60442 296995 127401 8545 166650 -27621 3167 131440 -201520 18910
11700a82437B84113q1829J52653a65197L7639I3665D5258O4101b85001g5452C6217
$$ -182437 284113 202284 354937 -165197 -127558 93665 45258 109359 -285001 -75452 36217
11688b27613N8101F4448b54636J05530A2972c3595A41767J96159a17061l58623
$$ -227613 -169512 64448 -254636 -149106 12972 -33595 141767 337926 -117061 -475684
11678d75684B9612R8923o2581a95035G7735c8853F7616J05285f959B07362L1525
$$ -475684 29612 128535 65954 -195035 77735 -38853 67616 172901 -6959 207362 238887
11667B38887a24370G4024J3271J76245e9388A25675a19636B04967k2021o2148
$$ 238887 -124370 74024 87295 263540 -59388 125675 -119636 204967 182946 120798
11657A20798f1552B17449c46477i9545A33833b284k9325r4077O1731A46344b09466
$$ 120798 -61552 217449 -346477 -99545 133833 -2284 -31609 -125686 -63955 146344 -209466
11645i2739k88104B54761a98830A61994d01294B42212E7052B4721N7901L33045
$$ -92739 -380843 254761 -198830 161994 -401294 242212 57052 24721 82622 415667
11635D15667A36940d40100a3303r2377A61510e6872K325j3344I536m001J3372
$$ 415667 136940 -440100 -13303 -105680 161510 -56872 -54547 -67891 9536 5535 18907
11624A8907b01182C308a92676h4082n3734B52489a10548L524C60270A49443K780
$$ 18907 -201182 3308 -192676 -84082 -137816 252489 -110548 -107024 360270 149443 152223
11613A52223B7258a55131D15081g0741Q089E5713O4202J05711a99683B94687h6728
$$ 152223 27258 -155131 415081 -70741 -62652 55713 119915 225626 -199683 294687 -86728
11601A97684m5915B0107j82a8283F9868a87034j9900B66270D7121i9567A57891
$$ 197684 151769 20107 19925 -18283 69868 -187034 -206934 266270 47121 -99567 157891
11589a37023A36384a4416A16910e9851A2095J78718c9808A39331J19238e3030
$$ -137023 136384 -14416 116910 -59851 12095 190813 -39808 139331 258569 -53030
11578a8586F7139L27697C9628A7327Q1884b17457i0091c6026B9343R138R0570
$$ -18586 67139 394836 39628 17327 99211 -217457 -90091 -36026 29343 38481 129051
11567A29051f2688B4114J16993J85449j57515b09879a00972A6926L98540A87188
$$ 129051 -62688 24114 141107 326556 169041 -209879 -100972 16926 415466 187188
11556B11138q6738c36757A36257M9451o274E8008k0042a93815D6522G209a57008
$$ 211138 124400 -336757 136257 185708 179434 58008 37966 -193815 46522 7209 -157008
11544A78743a03372p0133c930C66414A31215K26557a48191E5160a20149B33368
$$ 178743 -103372 -173505 -3930 366414 131215 357772 -148191 55160 -120149 233368
11533B28021m5098n813B5327L7599L5617R3966a89688C17896l2818b56855B54708
$$ 228021 182923 177110 25327 62926 98543 192509 -189688 317896 285078 -256855 254708
11521A85421O0092J34421K0512M725F5220K41387I7590i0379B67917A05034J59397
$$ 185421 245513 379934 400446 405171 65220 306607 97590 -90379 267917 105034 264431
11510B64431H5911P45M2069b15638M3217A5977K10059K37044a80529J186A53343
$$ 264431 85911 86656 128725 -215638 -172421 15977 226036 463080 -180529 -179343 153343
11498a19259b2962B69496F745K53230C3935a48776D69324B11978i010C13279e5167
$$ -119259 -22962 269496 6745 259975 33935 -148776 469324 211978 -9010 313279 -55167
11486G9886K10395a1625A8374M1138P9402A516K50561a04510k06284B75805M7701
$$ 79886 290281 -11625 18374 59512 138914 1516 252077 -104510 -310794 275805 323506
11475C23506B9925a8866A68747J02118J5016j19783m1182J23542c9087B87099
$$ 323506 29925 -18866 168747 270865 285881 166098 124916 248458 -39087 287099
11464A16892e688A29484k8253M228P7348K6886p494p0594J66967F0488J49692
$$ 116892 -5688 129484 101231 105459 182807 209693 202199 131605 298572 60488 210180
11453B10180a6946A00688N90215a9058D81136A21300A7241K61444B3175a24245
$$ 210180 -16946 100688 690903 -19058 481136 121300 17241 278685 23175 -124245
11442B75895f6242D07894C3354J68112a59577R269A33261e5937k02871a4314l4781
$$ 275895 -66242 407894 33354 201466 -159577 -150308 133261 -55937 -258808 -14314 -49095
11431d9095A41357c906j93948D58595B1409M26489d3564j7460B44483d5956D7975
$$ -49095 141357 -3906 -197854 458595 21409 447898 -43564 -61024 244483 -45956 47975
11419C32515d33225R9454e6563B60556a58283C41244j07071c0417j98021j16840
$$ 332515 -433225 -333771 -56563 260556 -158283 341244 234173 -30417 -228438 -345278
11409c45278D0307b4941A177P9277K07976g1037j4649A92250p7207i4422j58980
$$ -345278 40307 -24941 1177 80454 288430 -71037 -85686 192250 115043 -94422 -253402
11398b53402h1268I4488a01235B9575g5925m2083C21971c1978r1432A19924b65720
$$ -253402 -81268 94488 -101235 29575 -75925 -118008 321971 -31978 -123410 119924 -265720
11386A85862H3814K09296a69881B27310J94165a25151B0189a77349c178F9812
$$ 185862 83814 293110 -169881 227310 421475 -125151 20189 -177349 -3178 69812
11375C08558b25107J11835p2544P8753L3263K6221b1780C8183J01199b38416A03527
$$ 308558 -225107 -113272 -185816 -107063 -73800 -47579 -21780 38183 139382 -238416 103527
11363f4680B33904M7124J78059a76968Q0058D3554b6708p9711c2421e593o8157
$$ -64680 233904 281028 459087 -176968 -96910 43554 -26708 -106419 -32421 -5593 -73750
11352g3750B53450H3699J22665h0232k0410r3873P4717c0775A05488J10360a46902
$$ -73750 253450 83699 206364 -80232 -100642 -194515 -119798 -30775 105488 215848 -146902
11340E6348K92131e1241j03395b7796C11190a64196A31614M1097A4104L04917
$$ 56348 348479 -51241 -154636 -27796 311190 -164196 131614 172711 14104 319021
11330C19021H1170b31890C6362j0022J369J54783E7363a27962H9732M7953a76903
$$ 319021 81170 -231890 36362 26340 27709 182492 57363 -127962 89732 137685 -176903
11318H3394j5884M3151a91829d7932A00615a31097j66031A69848a40355A22601
$$ 83394 67510 110661 -191829 -47932 100615 -131097 -297128 169848 -140355 122601
11307a81338n5915a00990A95871m5295a95531r6135N3120I0372i1860j22122C98692
$$ -181338 -237253 -100990 195871 150576 -195531 -291666 -238546 90372 -91860 -213982 398692
11295A35951J5544b75675f0318A6382J6962e2320L039k15868b3167o348A21155
$$ 135951 151495 -275675 -60318 16382 33344 -52320 -49281 -265149 -23167 -29515 121155
11283G401c5340C14187a43227B62362e9744C3649a64991A305d2470A33655e4441
$$ 7401 -35340 314187 -143227 262362 -59744 33649 -164991 1305 -42470 133655 -54441
11271a47110d6969B09661d60246d3596q9453k11788H9338a54588m5362D98422
$$ -147110 -46969 209661 -460246 -43596 -133049 -344837 89338 -154588 -199950 498422
11260a06517m8666A11882h74A88245K5272n7162O1303q9888I659a02029A65988
$$ -106517 -155183 111882 -874 188245 213517 156355 217658 127770 9659 -102029 165988
11248a83545q6400E0090a30931l372M7498q3401g7046k3946l8186j85465h626
$$ -183545 -269945 50090 -130931 -134303 -86805 -170206 -77046 -100992 -139178 -324643 -8626
11236b4897m4993a9106A32706A7692L11705b86423k9896a34409o409L8728d6587
$$ -24897 -69890 -19106 132706 17692 329397 -286423 -316319 -134409 -140818 -102090 -46587
11224g2277E637J45717c72522i4816L4556B0232a89694j04714d429n5699A02724
$$ -72277 5637 151354 -372522 -94816 -60260 20232 -189694 -294408 -4429 -60128 102724
11212b3563B6228g2375k02454a11493D12284A42338J3160c1025j73841H9539c62314
$$ -23563 26228 -72375 -274829 -111493 412284 142338 155498 -31025 -204866 89539 -362314
11200A20438A1835J20084a22744E0532b09106G3360a23859J3417k9289j06605
$$ 120438 11835 131919 -122744 50532 -209106 73360 -123859 -110442 -139731 -246336
11190b46336a648o1354C8700J55955a93780h8798p962C5761c30727B85679a61122
$$ -246336 -1648 -63002 38700 194655 -193780 -88798 -96760 35761 -330727 285679 -161122
11178b02646I0531e1747C43766a03522A39192b98928A72045a97762j7915a02168
$$ -202646 90531 -51747 343766 -103522 139192 -298928 172045 -197762 -215677 -102168
11167A8593b41501j09477J13473h8845H1368D281e8226j38245j28235A60919a19512
$$ 18593 -241501 -350978 -237505 -88845 81368 4281 -58226 -196471 -324706 160919 -119512
11155h5748G918d6685m7750A02688I977c83168a4625G1232e8617j73200B07267
$$ -85748 7918 -46685 -94435 102688 9977 -383168 -14625 71232 -58617 -231817 207267
11143A93894a21719o7155A77021a02067d9002a3997n1176p8274p4135A18344d5263
$$ 193894 -121719 -188874 177021 -102067 -49002 -13997 -65173 -143447 -217582 118344 -45263
11131a90066f486H0968a29301j70651A81342i4859K6610C21382L9224j37331B6477
$$ -190066 -6486 80968 -129301 -299952 181342 -94859 -68249 321382 360606 223275 26477
11119b38787d9620B03637b096j52486A30408a04107c0033j12324H7626j4370c6440
$$ -238787 -49620 203637 -2096 -154582 130408 -104107 -30033 -142357 87626 73256 -36440
11107C4473L55413g1308C75578a58332g4372A19780J5970J74518e4081A88724
$$ 34473 389886 -71308 375578 -158332 -74372 119780 135750 310268 -54081 188724
11096F3865J45143r3864c612E4513A6403L4428O7573m3179g9695A23909n4964
$$ 63865 209008 115144 -3612 54513 16403 50831 118404 75225 -79695 123909 68945
11085F8945a85504n1505A66560K8749a46827M736B40771G5089G908R8207J42191
$$ 68945 -185504 -237009 166560 195309 -146827 -142091 240771 75089 7908 106115 248306
11074B48306J16304H9771c7261k6915A04545Q991J93149a48282B86399j41923
$$ 248306 364610 89771 -37261 -64176 104545 113536 306685 -148282 286399 144476
11064A44476C682N0674l164K42512A45178J83347J02538j1278A97062J29318A08919
$$ 144476 3682 54356 51192 293704 145178 328525 431063 419785 197062 326380 108919
11052B04463r1824L67458o2648L15890P2492j43834j32113J18810m6130m5309
$$ 204463 112639 480097 417449 733339 805831 661997 529884 648694 602564 557255
11042E57255B39070L33825o0912L75061D11205J243K57190J04595N5814k2562
$$ 557255 239070 572895 511983 887044 411205 412448 669638 774233 830047 807485
11032H07485N8004B85414M45777o1859J94462n8807j80421L2364o6908J89760
$$ 807485 865489 285414 731191 669332 863794 804987 624566 656930 590022 779782
11022G79782K51185j56179j31818l00236j0513J94663J296J76328l30954L24065
$$ 779782 1030967 874788 742970 442734 432221 626884 628180 804508 473554 797619
11012G97619n8736n7109j06335J70267J96994r6599m04128L90191M8125Q3866
$$ 797619 738883 681774 575439 745706 942700 846101 441973 832164 880289 964155
11002I64155k02820p7572C08399Q9740L54886C11659L56487O1800j30422k32161
$$ 964155 761335 683763 308399 398139 753025 311659 668146 729946 599524 367363
10992C67363m3978L38829B01754N37317j76066Q6430j16724K17281N056J30144
$$ 367363 323385 662214 201754 739071 563005 649435 532711 749992 755048 885192
10982H85192j94691J02076k91565K17453J11720J40860r0832k53579L08365J5148
$$ 885192 690501 792577 501012 718465 830185 971045 880213 626634 934999 950147
10972I50147l34410J45979J2052K74404M7899m9190k77785L55261M29482k54750
$$ 950147 615737 761716 773768 1048172 1096071 1046881 769096 1124357 1553839 1299089
10962A299089M40557o2872J43790J40171J62451K72302m159L0430j26443p8510
$$ 1299089 1739646 1676774 1820564 1960735 2123186 2395488 2391329 2421759 2295316 2216806
10952B216806J57798j55106J55408l97718L7009O8516k02953P0444k55880L1743
$$ 2216806 2374604 2219498 2374906 1977188 2014197 2082713 1879760 1950204 1694324 1726067
10942A726067k291M09246n19944p7915j02391P8994l09316J63968m45603j9722
$$ 1726067 1723776 2133022 1613078 1535163 1432772 1511766 1202450 1366418 920815 901093
10932I01093j27239l23546K18048k30729P4334B03564M9871A15544K3037K12245
$$ 901093 773854 450308 668356 437627 511961 203564 253435 115544 138581 350826
10922C50826o1888J0396D5795c20375A75841A781J27818J14308B9027d4102A87180
$$ 350826 288938 299334 45795 -320375 175841 1781 129599 243907 29027 -44102 187180
10910b15692A56048b75017a2022A76848N7756M453C4736h2728C06310N9049b49568
$$ -215692 156048 -275017 -12022 176848 234604 239057 34736 -82728 306310 365359 -249568
10898A82189b19309P3651G7774B0534c84203A43094a57070j08634E7403d196C17624
$$ 182189 -219309 -145658 77774 20534 -384203 143094 -157070 -265704 57403 -4196 317624
10886g5266l20252a16262E4722a90348e7333k16319A27844O2465k9100K1818H5069
$$ -75266 -395518 -116262 54722 -190348 -57333 -273652 127844 190309 161209 183027 85069
10874A58794K5078f9353B07289d4758J5404E5460g6132A13376a10910d0714k21879
$$ 158794 183872 -69353 207289 -44758 -29354 55460 -76132 113376 -110910 -40714 -262593
10863b62593D7394j7912K1251N3928b16435A32479d9838F4419c42266h1474k14512
$$ -262593 47394 29482 50733 104661 -216435 132479 -49838 64419 -342266 -81474 -295986
10852b95986J7931g9657B96138A47363f7789A53901G415e1506A60922p3851l7244
$$ -295986 -278055 -79657 296138 147363 -67789 153901 7415 -51506 160922 87071 49827
10841D9827c2125B50719r465D0292a71853b5655A2492J46803a29329k60334a31564
$$ 49827 -32125 250719 241254 40292 -171853 -25655 12492 159295 -129329 -389663 -131564
10829F0453j5258J02987a23842H2894a01562B40082I736J59243K390a81002G5355
$$ 60453 45195 148182 -123842 82894 -101562 240082 9736 168979 171369 -181002 75355
10817H795J22100B6808a23175A41168A8062a3350j68242O4117H3757b45478G852
$$ 8795 130895 26808 -123175 141168 18062 -13350 -181592 -117475 83757 -245478 7852
10805b76145a31775l2366E1823j663a11570k55667f3488B77777C2885c44721A3249
$$ -276145 -131775 -164141 51823 50160 -111570 -367237 -63488 277777 32885 -344721 13249
10793a22240J2197j13360B5957K92526a04530k12454A93120a44085k30194h5720
$$ -122240 -110043 -223403 25957 318483 -104530 -316984 193120 -144085 -374279 -85720
10782H5565b08684G5929h3924B91222j34874a18500m68325b0809j54354A30330
$$ 85565 -208684 75929 -83924 291222 156348 -118500 -586825 -20809 -175163 130330
10771B5463b24754p3656B04510D817K85211b19313h6164A6040R1210i0260a4617
$$ 25463 -224754 -298410 204510 4817 290028 -219313 -86164 16040 107250 -90260 -14617
10759A07727g0601l16103h1035F3466c9646A90576b55931C23806a68769F2757
$$ 107727 -70601 -386704 -81035 63466 -39646 190576 -255931 323806 -168769 62757
10748A26050o2670b9066A83550c11632C3656h8692K5867j40541N9455O386L9731
$$ 126050 63380 -29066 183550 -311632 33656 -88692 -62825 -203366 -143911 -137525 -97794
10737i7794G891J48598g2264E9920b7590o696r8905j2236A15866P7029D1646a79003
$$ -97794 7891 156489 -72264 59920 -27590 -34286 -133191 -145427 115866 192895 41646 -179003
10724b35761J11742G7548M3012K97971b32163N1467o0234B9663K801c0205G3603
$$ -235761 -124019 77548 120560 418531 -232163 -180696 -240930 29663 32464 -30205 73603
10712D41624b38978A33804P9358b16770P307J02546L0462j5843k54393J37564
$$ 441624 -238978 133804 213162 -216770 -209463 -106917 -76455 -92298 -346691 -209127
10702b09127K0488A62712J79452j25579c0455j82346g5338j82989k1474a15360
$$ -209127 -188639 162712 342164 216585 -30455 -212801 -75338 -258327 -279801 -115360
10691I6014c09881A90218o1888m9407b15017P4945N3016G1827M2911a00732B58769
$$ 96014 -309881 190218 128330 78923 -215017 -140072 -87056 71827 114738 -100732 258769
10679B0344d9951F8248C3800b30215B87051A20498b10400h0624k56838A13012
$$ 20344 -49951 68248 33800 -230215 287051 120498 -210400 -80624 -337462 113012
10668B12206b16668o325A33092C3496a77938j61045A48456G1254c2287m1471A74471
$$ 212206 -216668 -222993 133092 33496 -177938 -338983 148456 71254 -32287 -73758 174471
10656d1293I6024l7278f6927H1587i4573A08094P9917h6771E3458c45032i7338
$$ -41293 96024 58746 -66927 81587 -94573 108094 188011 -86771 53458 -345032 -97338
10644c3995A1858a25540j15220D5758i1942A73114c59867J49591A67960A7528
$$ -33995 11858 -125540 -240760 45758 -91942 173114 -359867 -210276 167960 17528
10633i4208k86840D1178L6999b18381b7418I3650a44417j20646I9659c20103a5070
$$ -94208 -381048 41178 78177 -218381 -27418 93650 -144417 -265063 99659 -320103 -15070
10621A09877c0145A80948J39822g1642l2260k9947k3330d4547C0770a5845m13451
$$ 109877 -30145 180948 320770 -71642 -103902 -133849 -157179 -44547 30770 -15845 -429296
10610d29296D3985K84133A13761a29085N1449A58974e6511k1683A62378m5268
$$ -429296 43985 328118 113761 -129085 -77636 158974 -56511 -78194 162378 117110
10600A17110N6163b43896d2854j31634E0760J57338a63350D8497k3881j1660c88425
$$ 117110 173273 -243896 -42854 -174488 50760 208098 -163350 48497 24616 12956 -388425
10588E4627J1481L6672a93665A53703c75411B47665E9826a90435c133C7328b29470
$$ 54627 66108 102780 -193665 153703 -375411 247665 59826 -190435 -3133 37328 -229470
10576A11254g0842B72594B2594b79010N8055I6707J93521e0791f853C7019a06838
$$ 111254 -70842 272594 22594 -279010 -220955 96707 290228 -50791 -6853 37019 -106838
10564a57863A87547m412e13526b37024H7443J22896J5745a04443b6320l1997C63819
$$ -157863 187547 183135 -513526 -237024 87443 210339 226084 -104443 -26320 -58317 363819
10552a42547B48925E8443a63135j08239J9515b3076I4811J54649a61494A98821
$$ -142547 248925 58443 -163135 -271374 -251859 -23076 94811 249460 -161494 198821
10541b5221l07602A12966c03414g0477j06288O3067A80696d2702l3016n1710A10463
$$ -25221 -332823 112966 -303414 -70477 -176765 -113698 180696 -42702 -75718 -127428 110463
10529b49495B85359b39892B20251a1852A49926m2784a7279l93377a63341k0052
$$ -249495 285359 -239892 220251 -11852 149926 107142 -17279 -410656 -163341 -183393
10519a83393M3145A68367b8588L689j72571P6117D15890m158a3611j3542A56079
$$ -183393 -140248 168367 -28588 -24899 -197470 -121353 415890 411732 -13611 -27153 156079
10507a83646h0680j76961R538b3504I4080C9894K4348M4452c13877A00359j3762
$$ -183646 -80680 -257641 -248103 -23504 94080 39894 64242 108694 -313877 100359 86597
10496H6597a04880c19j80490P484e5383A03715C8979D100M7677K1311P976a56378
$$ 86597 -104880 -319 -180809 -173325 -55383 103715 38979 4100 51777 73088 81064 -156378
10483A4892c06620a6209A7028N5864J8709f3930J0337k28608b1303j89957G5809
$$ 14892 -306620 -16209 17028 72892 91601 -63930 -53593 -282201 -21303 -211260 75809
10471A87110M0952J5392B7310J8556L49896I9087K82694K9960j13089K10229A66133
$$ 187110 228062 243454 27310 45866 395762 99087 381781 411741 298652 508881 166133
10459B56497E3938L5150h7466A92057q4947M4657C6117N1808L0205J86895b04742
$$ 256497 53938 89088 -87466 192057 107110 151767 36117 87925 118130 305025 -204742
10447E0618b56397f985j00218f353k8087j8586j434A98004a90715f8979H3035
$$ 50618 -256397 -6985 -107203 -6353 -34440 -53026 -54460 198004 -190715 -68979 83035
10435i3489o3777b8154k73507r1274a85073k140c3028G291J48033C2929a97175
$$ -93489 -157266 -28154 -301661 -392935 -185073 -187213 -33028 7291 155324 32929 -197175
10423A92728A4346M4922M3996a6305l4019k53778J29704P9274m6710g0110k46948
$$ 192728 14346 59268 103264 -16305 -50324 -304102 -174398 -95124 -141834 -70110 -317058
10412c17058a27808R178l0744b2441A35138e09598F3492j9145b24606A34423i1617
$$ -317058 -127808 -118630 -149374 -22441 135138 -509598 63492 44347 -224606 134423 -91617
10400C72406C4067c91938J84798F7186b63243I5961a436H1105a36565j95134C9837
$$ 372406 34067 -391938 -207140 67186 -263243 95961 -1436 81105 -136565 -331699 39837
10388B29407P3312j46071K99R3422b34789l9418B49830a66541F5836K4353K24635
$$ 229407 302719 156648 156947 250369 -234789 -274207 249830 -166541 65836 90189 314824
10377C14824r9305b29712j80167E07937A33352j7084D6916K26341N0442a29685
$$ 314824 215519 -229712 -409879 507937 133352 116268 46916 273257 323699 -129685
10366B95533j36749l7530J56919k4531K8348A04829L0182M1183n6567L09283J4701
$$ 295533 158784 121254 278173 253642 281990 104829 135011 176194 119627 428910 443611
10355D43611G7897K49755p0608I8914M67625m1756k24422R7444R3344A94369N6560
$$ 443611 77897 327652 257044 98914 566539 524783 300361 397805 491149 194369 250929
10344B50929p8130o1974e1810B2633K29236j08368m0611K17745E8206L66066j51104
$$ 250929 172799 110825 -51810 22633 251869 143501 102890 320635 58206 424272 273168
10333B73168K23615n9932O1109A33590J34352N8586J80834A29594J66355q3530
$$ 273168 496783 436851 497960 133590 267942 326528 507362 129594 295949 212419
10323B12419J12008j29755P6421H7437J79244A17432K5647J478N013J387O0088
$$ 212419 324427 194672 271093 87437 266681 117432 143079 144557 149570 150957 211045
10312B11045J80856j25139I7221J93083e4709j1507C46539b1959B09039e4528
$$ 211045 391901 266762 97221 290304 -54709 -66216 346539 -21959 209039 -54528
10301B61660a05700A37545D4876P7190N3235a52478G1717l0317a39848k48141
$$ 261660 -105700 137545 44876 122066 175301 -152478 71717 41400 -139848 -387989
10291c87989H8233K5170L27396I3813b52452J19562A9913R6251a96244h8943J6728
$$ -387989 88233 113403 440799 93813 -252452 -132890 19913 116164 -196244 -88943 -72215
10280g2215a1031k03339h6135A18466A28g6234r8054F1400a68681F2005K4365
$$ -72215 -11031 -214370 -86135 118466 128 -76234 -174288 61400 -168681 62005 86370
10269H6370a80447A20976d7594a947B1605J79764r2301B3392g9905l02776i6560
$$ 86370 -180447 120976 -47594 -1947 21605 201369 109068 23392 -79905 -382681 -96560
10257C20706k5630c0593F5796b10518G0071c1437A90720q2307P0808n2558J67124
$$ 320706 295076 -30593 65796 -210518 70071 -31437 190720 108413 179221 126663 293787
10246B93787J24303A96759J57195m2136r8657J80136J0520D1996J85627J14749
$$ 293787 418090 196759 353954 311818 213161 393297 403817 41996 227623 342372
10236C42372h2871B28656G5438K67856a22918a3692l63446a84530a7429N465n172
$$ 342372 -82871 228656 75438 343294 -122918 -13692 -377138 -184530 -17429 -11964 -17136
10225a7136q9709P934r7048Q7643p3777B1845K14030b07029O6583e7130k69613
$$ -17136 -106845 -98911 -195959 -108316 -182093 21845 235875 -207029 -140446 -57130 -326743
10214c26743a61781k8441I6165a39504k0347k4082G6320L221A889b43595i1398
$$ -326743 -161781 -190222 96165 -139504 -159851 -183933 76320 79541 1889 -243595 -91398
10202E48a376k42481i4713k4342A88768c2913j20317L6869A49569b93430a44585
$$ 548 -1376 -243857 -94713 -119055 188768 -32913 -153230 -116361 149569 -293430 -144585
10190a42430M8994L6484g746H2751c5762B44726i4560n05492a25964j33213A64254
$$ -142430 -93436 -56952 -7746 82751 -35762 244726 -94560 -600052 -125964 -259177 164254
10178h9162o1769C33712c28534I6532h0202j22949A05160c75976J59578l83213
$$ -89162 -150931 333712 -328534 96532 -80202 -203151 105160 -375976 -216398 -599611
10168e99611B29551a83401A74071C3134b09032G8703c05596a04809B4760c33785
$$ -599611 229551 -183401 174071 33134 -209032 78703 -305596 -104809 24760 -333785
10157A41019a73795a127q4512k5461A70709J72B1341b01440a1962j11512C22441
$$ 141019 -173795 -1127 -85639 -111100 170709 170881 21341 -201440 -11962 -123474 322441
10145h9180B2689b26964A69423d4440k7284j35402o557L3415C7079d42070f740
$$ -89180 22689 -226964 169423 -44440 -71724 -207126 -213683 -180268 37079 -442070 -6740
10133a62229d0664k23931a31155B20164e8679k763B95489J0927a13880B08347
$$ -162229 -40664 -264595 -131155 220164 -58679 -61442 295489 306416 -113880 208347
10122E7287j8776e9727b6425D3114g2126j01321g9900b3101j13085g195k89130
$$ 57287 38511 -59727 -26425 43114 -72126 -173447 -79900 -23101 -136186 -7195 -296325
10111b96325a32280E6568b4603k02916r7685A03621c65593a46032M5079g627C6005
$$ -296325 -132280 56568 -24603 -227519 -325204 103621 -365593 -146032 -100953 -7627 36005
10099a145j27317K6674A7033f01221F2954a33657f6042l29910d7338j1496g78
$$ -1145 -128462 -101788 17033 -601221 62954 -133657 -66042 -395952 -47338 -58834 -778
10087a8236o2801j69998O1729a7172o741j83649k2839J03555r4831e039j2835
$$ -18236 -81037 -251035 -189306 -17172 -23913 -207562 -230401 -126846 -221677 -5039 -17874
10076a7874B6700A0075c19598B7814J84602J12028a9089A17346J36748a8290j20203
$$ -17874 26700 10075 -319598 27814 212416 324444 -19089 117346 254094 -18290 -138493
10065a38493m682n029l06343H6661c15075E5083a41721J9583n8295J4719D9146
$$ -138493 -143175 -148204 -454547 86661 -315075 55083 -141721 -122138 -180433 -165714 49146
10053a99631O8901N9072j44582i8835E7906a94754A90206D2826c8706p8073Q771
$$ -199631 -130730 -71658 -216240 -98835 57906 -194754 190206 42826 -38706 -116779 -108008
10042a08008c7251D042a55164J9272M8629f465j69540H4320a01892A75765a02729
$$ -108008 -37251 4042 -155164 -135892 -87263 -6465 -176005 84320 -101892 175765 -102729
10030a28667j12039P6874D8881N6870g2078j57119B06902a07271o0477l129C32341
$$ -128667 -240706 -163832 48881 105751 -72078 -229197 206902 -107271 -167748 -170877 332341
10018a16428D8743q624J5098h6148M0797H0269h1406k62240e4124p9982H1252
$$ -116428 48743 40119 55217 -86148 -45351 80269 -81406 -343646 -54124 -134106 81252
10006a86923k17650f1140m2575J1063B60346j13507a04629A23255K6416b24114
$$ -186923 -404573 -61140 -103715 -92652 260346 146839 -104629 123255 149671 -224114
9995a69835C04287j34086e4859B08112b52888J02448N5886n1559C28665e2868
$$ -169835 304287 170201 -54859 208112 -252888 -150440 -94554 -146113 328665 -52868
9984A78133b40329e6774k1210o4167d8732A03944C7568j4984a05941d9625j08294
$$ 178133 -240329 -56774 -77984 -142151 -48732 103944 37568 22584 -105941 -49625 -157919
9973a57919d1769a9093C17354a46217N7588A08707a51661p0497o1035b485F7322
$$ -157919 -41769 -19093 317354 -146217 -88629 108707 -151661 -222158 -283193 -2485 67322
9961c479k8904l141l12040e7359a0616n1542o4259A0172e14930a74084k20784
$$ -3479 -32383 -35524 -347564 -57359 -10616 -62158 -126417 10172 -514930 -174084 -394868
9950c94868A94521c6118j85397E6056b477j77340l0916a02974q5596j71912a5248
$$ -394868 194521 -36118 -221515 56056 -2477 -179817 -210733 -102974 -188570 -360482 -15248
9938h7555n6594I9174c17518P1195B08799b3638j52311f9735A47520D650K09364
$$ -87555 -144149 99174 -317518 -246323 208799 -23638 -175949 -69735 147520 4650 214014
9927B14014a07410j99559C98131d44945J90983B47945g7110j77915B09021c0769
$$ 214014 -107410 -306969 398131 -444945 -253962 247945 -77110 -255025 209021 -30769
9916F401L3527a47878B26335b14720G3386j08h930A25496J02484b30487Q8652
$$ 6401 39928 -147878 226335 -214720 73386 73278 -8930 125496 227980 -230487 -141835
9905a41835o5997n9756a31021M9732l97k41747a43015a5985p719f331j62586Q274
$$ -141835 -207832 -267588 -131021 -81289 -81686 -323433 -143015 -15985 -23704 -6331 -168917 -160643
9893a60643M7376m1128M4141j51622B78977b54755j46430a25391a6719n86526
$$ -160643 -113267 -154395 -110254 -261876 278977 -254755 -401185 -125391 -16719 -603245
9883f03245a23976A24771b39143C9297d3458q0064A4004K65553a23982B00903
$$ -603245 -123976 124771 -239143 39297 -43458 -123522 14004 279557 -123982 200903
9872A23989A218Q0378A227a21442o2960C07092l8855G9616O8188c9095j85967
$$ 123989 1218 81596 1227 -121442 -184402 307092 268237 79616 147804 -39095 -225062
9861b25062K5558E5784b58011I2094A8110J19758J6304G1577b89472J09890A10389
$$ -225062 -199504 55784 -258011 92094 18110 137868 154172 71577 -289472 -179582 110389
9849b122E0714c38774B05336a81784B23820a88251b3961p0642F0914b68905R0917
$$ -2122 50714 -338774 205336 -181784 223820 -188251 -23961 -94603 60914 -268905 -177988
9838a77988A46240C7561d61070a76214q1905A1014b49933r9758a40892C1307c07071
$$ -177988 146240 37561 -461070 -176214 -258119 11014 -249933 -349691 -140892 31307 -307071
9826b7857j6043l1160k20555a16601j29174j4979J19782A3487b14440n180j03430
$$ -27857 -43900 -75060 -295615 -116601 -245775 -260754 -140972 13487 -214440 -219620 -323050
9815c23050N7854A77342a82026F6500a96345A04919J7354D7983J7146c16405J30330
$$ -323050 -265196 177342 -182026 66500 -196345 104919 122273 47983 65129 -316405 -186075
9804a86075A03672C0182K97282b31131a0002G4809j567C5539P1727a40862B59320
$$ -186075 103672 30182 327464 -231131 -10002 74809 73242 35539 107266 -140862 259320
9792G0799J9923c3432k45441B5258J7159a28470j19547J06343j7700l4706k5542
$$ 70799 90722 -33432 -278873 25258 42417 -128470 -248017 -141674 -159374 -194080 -219622
9781b19622I8389b11815d7304A08551f4993A87475a45807c6234A13589J10680
$$ -219622 98389 -211815 -47304 108551 -64993 187475 -145807 -36234 113589 224269
9771B24269c11435F9359b79084N9169O400F6342g3433j56714B99986a590j82197
$$ 224269 -311435 69359 -279084 -219915 -213515 66342 -73433 -230147 299986 -1590 -183787
9760a83787A92567a26084q8787r9055n1980A30110g6694k48761e6238C5346f0397
$$ -183787 192567 -126084 -214871 -313926 -365906 130110 -76694 -325455 -56238 35346 -60397
9748b21689P8451k50630h3865L3443H7754P5735c94919a21832A06702a81942j55609
$$ -221689 -143238 -393868 -83865 -50422 87754 163489 -394919 -121832 106702 -181942 -337551
9737c37551a07965n2013b9563A41315b08489l5331R1860C5208L56526A75236A2605
$$ -337551 -107965 -159978 -29563 141315 -208489 -243820 -151960 35208 391734 175236 12605
9725b06844j9509A8735L52618C9933J11617J13987A1462q10O123a08178B29326
$$ -206844 -226353 18735 371353 39933 151550 265537 11462 10652 16775 -108178 229326
9713a10798q8887k7171M7083K3891E140J68268a48037C83488a24198B1055b38813
$$ -110798 -199685 -226856 -179773 -155882 5140 173408 -148037 383488 -124198 21055 -238813
9701c5349j85676R8973l4773j6678I312J3254a48357A53634c11252A23844g4576
$$ -35349 -221025 -122052 -156825 -173503 9312 22566 -148357 153634 -311252 123844 -74576
9689B17257b10733M2715C1116G765c97134a05069q1944J9717f4140l31866b7955
$$ 217257 -210733 -168018 31116 7765 -397134 -105069 -187013 -167296 -64140 -396006 -27955
9677A97278A2c09128g3045K3677q4614c8306a7336k06025r6037A8281a08735G8331
$$ 197278 12 -309128 -73045 -49368 -133982 -38306 -17336 -223361 -319398 18281 -108735 78331
9664B76996J1105c58723B53336b14586q4630d0061A57004g0645j42997M6671k13413
$$ 276996 288101 -358723 253336 -214586 -299216 -40061 157004 -70645 -213642 -166971 -380384
9653c80384A83692a60784a3898j98078R5444A9889c2839k19512C11613j05301
$$ -380384 183692 -160784 -13898 -211976 -116532 19889 -32839 -252351 311613 206312
9643B06312B0227a52002I0426a04420l50520c0867k5559m09915a16945J0126I0231
$$ 206312 20227 -152002 90426 -104420 -454940 -30867 -56426 -466341 -116945 -106819 90231
9631a89888a4055p4844k54739d773k02125q4719G4899A2104h6270j35761N9356
$$ -189888 -14055 -88899 -343638 -4773 -206898 -291617 74899 12104 -86270 -222031 -162675
9620a62675j19120d4921j28008p2954h2054I9509c72571d3166j22789m9222q2914
$$ -162675 -281795 -44921 -172929 -245883 -82054 99509 -372571 -43166 -165955 -215177 -298091
9609b98091O9159G3468a21162J5231A14852c6414k4708j85528a20223j43482Q9838
$$ -298091 -228932 73468 -121162 -105931 114852 -36414 -61122 -246650 -120223 -263705 -173867
9598a73867j61900A17155a14744m7126B71385a59951A50992c19659Q229D3152
$$ -173867 -335767 117155 -114744 -161870 271385 -159951 150992 -319659 -311430 43152
9587c82037F6519h539j70001b980k9741E2531a91641q2460E5112M3751J08167
$$ -382037 66519 -8539 -178540 -2980 -32721 52531 -191641 -274101 55112 98863 207030
9576B07030b45183A6271c37068J05781E0962a49993L5588D7975B256f7939G8766
$$ 207030 -245183 16271 -337068 -231287 50962 -149993 -114405 47975 2256 -67939 78766
9564H686P9991b29736M0298A00834C1709e134j64808o7455C01806E138d9674I2832
$$ 8686 88677 -229736 -189438 100834 31709 -5134 -169942 -237397 301806 5138 -49674 92832
9551A612b43268e8314l7535B46924b76697A00535b94578f3377A83732A6345c3434
$$ 1612 -243268 -58314 -95849 246924 -276697 100535 -294578 -63377 183732 16345 -33434
9539A47483M8666A1682h7979k30408A1496J58706J818b24416C2907b58620d827
$$ 147483 196149 11682 -87979 -318387 11496 170202 172020 -224416 32907 -258620 -4827
9527g6919c4029m6676L412K1093j10001r9457a6526m7850D6257i0610j43707J05724
$$ -76919 -34029 -80705 -77293 -56200 -166201 -265658 -16526 -64376 46257 -90610 -234317 -128593
9515a28593D3149c7950k2105A26611a72712P2960a364j409n20859F9578c04637
$$ -128593 43149 -37950 -60055 126611 -172712 -99752 -1364 -2773 -523632 69578 -304637
9503C4785a46777k19911H5322a59414r1898C61846g8810j64836e352F9892g8038
$$ 34785 -146777 -366688 85322 -159414 -251312 361846 -78810 -243646 -5352 69892 -78038
9491b36153h2162A35951E0337a19859D32188e820j68813g6494A28187E9802d9310
$$ -236153 -82162 135951 50337 -119859 432188 -5820 -174633 -76494 128187 59802 -49310
9479c34622d9349C17910G1078M7951M0062f9516B72427b80994K8407H8223D122
$$ -334622 -49349 317910 71078 119029 159091 -69516 272427 -280994 -252587 88223 4122
9467h1579G1680J42807o7797a01577k28928b7050k08216m0554e2367j53502B6884
$$ -81579 71680 214487 146690 -101577 -330505 -27050 -235266 -275820 -52367 -205869 26884
9455b74116f3819G7343l8396b45904a16450N2469j84332a23905E0835b58302A0161
$$ -274116 -63819 77343 38947 -245904 -116450 -63981 -248313 -123905 50835 -258302 10161
9443a91448B37982i0530d1751k60437N3663e0908B90596c1599q5441N4226f155
$$ -191448 237982 -90530 -41751 -302188 -248525 -50908 290596 -31599 -117040 -62814 -6155
9431a26015N7491H2291e2402B8398N8303h0298k02808A69851a10810n4975r0040
$$ -126015 -68524 82291 -52402 28398 86701 -80298 -283106 169851 -110810 -165785 -255825
9420b55825b6824l71466e5459n32034G3734M7443g6815A81322b92260a29594C16007
$$ -255825 -26824 -398290 -55459 -587493 73734 121177 -76815 181322 -292260 -129594 316007
9408b83193G4309C0450j907b28180e4442r2443d108k2755k583j16344r1250R7257
$$ -283193 74309 30450 28543 -228180 -54442 -146885 -4108 -26863 -29446 -145790 -237040 -139783
9396a39783C7967f4206m49580G5914b57411k55308f8494G0438J6329b4515p1285
$$ -139783 37967 -64206 -513786 75914 -257411 -512719 -68494 70438 86767 -24515 -95800
9385i5800k28945A60407i6035c7233k21700e4840j66375E2286a74630A8674a0776
$$ -95800 -324745 160407 -96035 -37233 -258933 -54840 -221215 52286 -174630 18674 -10776
9373D2144K44241f3796J4128j55010P8587E9724J70078I9409K80803g9214k33258
$$ 42144 286385 -63796 -49668 -204678 -126091 59724 229802 99409 380212 -79214 -312472
9362c12472J02945L3043l4376e7966q5659K5865A19865c0216F6804P6390a84692
$$ -312472 -209527 -176484 -210860 -57966 -143625 -117760 119865 -30216 66804 143194 -184692
9350h8531E7654J0196B855d2336j34111H9455d17010A19351J26218h7155E4150
$$ -88531 57654 67850 2855 -42336 -176447 89455 -417010 119351 245569 -87155 54150
9338c78035h5643I1835a17610B18229a08196K3447A46653c99286B84165I5082
$$ -378035 -85643 91835 -117610 218229 -108196 -84749 146653 -399286 284165 95082
9327i5849K1653A16951E7664a1741A7291h5874k66429d5161j50400K4236a2107
$$ -95849 -74196 116951 57664 -11741 17291 -85874 -352303 -45161 -195561 -171325 -12107
9315e2606B97102c81491J80254R9347A3304O3401a32279D5329L9979l7409L59092
$$ -52606 297102 -381491 -201237 -101890 13304 76705 -132279 45329 85308 47899 406991
9304D06991e446l2899k62570a27500E25397a4924l28703f9302j44355r990b612
$$ 406991 -5446 -38345 -300915 -127500 525397 -14924 -343627 -69302 -213657 -223647 -2612
9292b57218k09338I8263d80294a81296B27301a14640l9719d8308J2906q0738c7122
$$ -257218 -466556 98263 -480294 -181296 227301 -114640 -154359 -48308 -35402 -116140 -37122
9280A93653l2400E5781d7723H880a70405D7384N7967a57655B60310E6178O3138
$$ 193653 161253 55781 -47723 8880 -170405 47384 105351 -157655 260310 56178 119316
9269A19316P0171I0754i6818B0498a65122l0279g7318k18283q5022F7019a89044
$$ 119316 189487 90754 -96818 20498 -165122 -195401 -77318 -295601 -380623 67019 -189044
9257a95993f2154l11285C00239a46151H6237J62361e93352K20349a31193B7603
$$ -195993 -62154 -373439 300239 -146151 86237 248598 -593352 -373003 -131193 27603
9246a86818A89474m270a05035M9120q7488m7448n1969c0938A31529b15945q8040
$$ -186818 189474 185204 -105035 -55915 -143403 -190851 -242820 -30938 131529 -215945 -303985
9235c03985C01699a01706J2348K5766l1769j04853H61a77642E9859N9186f3713
$$ -303985 301699 -101706 -89358 -63592 -95361 -200214 861 -177642 59859 119045 -63713
9223H7592J89997c06575A98102d67551a13485E5196a13537N1191B20173p5843
$$ 87592 277589 -306575 198102 -467551 -113485 55196 -113537 -62346 220173 144330
9213A44330a69551B24575K4236a03188B38852b00021I1676a70043B37054r704
$$ 144330 -169551 224575 248811 -103188 238852 -200021 91676 -170043 237054 227350
9203B27350F5081b88194G8774b76353J19939E864a94588G2702d8533J7945B04137
$$ 227350 65081 -288194 78774 -276353 -156414 5864 -194588 72702 -48533 -30588 204137
9191a23216A8603P5643b49553J22591M3726G6235d4305K436j05404c8121n4982
$$ -123216 18603 94246 -249553 -126962 -83236 76235 -44305 -41869 -147273 -38121 -93103
9180i3103J6059r7018C3342e1859D3070j8992J82807c25386F8914G026c40215
$$ -93103 -77044 -174062 33342 -51859 43070 24078 206885 -325386 68914 7026 -340215
9168d7813j0247A69899M20b37317F5555c1393k22715H5530b16640b4191r5232
$$ -47813 -58060 169899 170319 -237317 65555 -31393 -254108 85530 -216640 -24191 -119423
9157a19423K5699q4445r3498e5243r3504m8664G6483a54457F8397c26770B06847
$$ -119423 -93724 -178169 -271667 -55243 -148747 -197411 76483 -154457 68397 -326770 206847
9145i1261j30579f9772p7600C2266J52995l3607R1385b06448J01657e2176j45516
$$ -91261 -221840 -69772 -147372 32266 185261 151654 243039 -206448 -104791 -52176 -197692
9134a97692A6406L76198D2576l699P4214c36676d5977j57414c0390j55350k88823
$$ -197692 16406 392604 42576 38877 113091 -336676 -45977 -203391 -30390 -185740 -474563
9123d74563a69622J5169I1051b59978i5852K3275j68656j28606g4960E1573a83935
$$ -474563 -169622 -154453 91051 -259978 -95852 -72577 -241233 -369839 -74960 51573 -183935
9111a33040A03064c57770a77492j0659L7130E3040J29102e55213i6199n5867A15807
$$ -133040 103064 -357770 -177492 -188151 -151021 53040 182142 -555213 -96199 -152066 115807
9099a05708M8831F0009b93915Q5480k29648H2896b53614d9525R261A24096b31920
$$ -105708 -56877 60009 -293915 -208435 -438083 82896 -253614 -49525 -40264 124096 -231920
9087A41282a66950C3257a24767j00205a3189j24161A43562b37578A07203a34034
$$ 141282 -166950 33257 -124767 -224972 -13189 -137350 143562 -237578 107203 -134034
9076G410b04314I5984a6577A89088b42950J6858G2078b69874E3485a60624m2399
$$ 7410 -204314 95984 -16577 189088 -242950 -226092 72078 -269874 53485 -160624 -203023
9065b03023R3100o671j84318g450k68460g011A50865b04141D2028c41088F1995
$$ -203023 -109923 -116594 -300912 -7450 -275910 -7011 150865 -204141 42028 -341088 61995
9053b4974B42059d0754E7469b46168j55377i7960k1462D1158a95046h4148p4119
$$ -24974 242059 -40754 57469 -246168 -401545 -97960 -119422 41158 -195046 -84148 -158267
9042a58267l7694f1876B66801F0063B770d2916A80294a15861A2426b69268A80562
$$ -158267 -195961 -61876 266801 60063 2770 -42916 180294 -115861 12426 -269268 180562
9030B602a42707l6405A67130b99686J23531I7892c30517g10I1918b33786n6707
$$ 2602 -142707 -179112 167130 -299686 -176155 97892 -330517 -710 91918 -233786 -290493
9019b90493a23531O1470a3824C6783Q8785d16059B07760l0038f1155k4643A32595
$$ -290493 -123531 -62061 -13824 36783 125568 -416059 207760 177722 -61155 -85798 132595
9007c09198i6162a2971A85036P1510b37239M8130C5682a4165k41922p3772O4718
$$ -309198 -96162 -12971 185036 256546 -237239 -189109 35682 -14165 -256087 -329859 -265141
8996b65141o3752A41321F0774l813a79798f3495o0179B89826A42919B177b4127
$$ -265141 -328893 141321 60774 56961 -179798 -63495 -123674 289826 142919 2177 -24127
8984B84598m9258h7918j0017j8545c6458O271b019p8610j05857Q1312J4449p4678
$$ 284598 235340 -87918 -97935 -116480 -36458 -30187 -2019 -80629 -186486 -105174 -90725 -165403
8972a65403C6231a61203j73991h6333b6649A03120i5309L0366A58083a0628l92543
$$ -165403 36231 -161203 -335194 -86333 -26649 103120 -95309 -64943 158083 -10628 -403171
8961d03171A04878a76431A5761c06796J49250f3799j38382g4410K3787k68539
$$ -403171 104878 -176431 15761 -306796 -157546 -63799 -202181 -74410 -50623 -319162
8951c19162L0300h005D2573c1203j48082d9659D8675a22721L9075j28764a00196
$$ -319162 -288862 -8005 42573 -31203 -179285 -49659 48675 -122721 -83646 -212410 -100196
8939A20037i5823B20738q5098b25359A08367K5164b2767E0646K32772b54189C3953
$$ 120037 -95823 220738 135640 -225359 108367 133531 -22767 50646 283418 -254189 33953
8927B72522C1267P5049c0411j0461E9372i9112B3812P3254L59257j04509F7709
$$ 272522 31267 106316 -30411 -40872 59372 -99112 23812 97066 456323 351814 67709
8915C62153J13353A77336M2348M61234P0519P0960L89597M61027J576625L655184
$$ 362153 475506 177336 219684 680918 751437 822397 1211994 1673021 3249646 6904830
8905F904830L940009D906459B210725q26595m50162J6787D09412K32007k82476
$$ 6904830 10844839 4906459 2210725 1384130 933968 950755 409412 641419 358943
8896C58943j06951j1500B0118K00906L77816G5555a64667M7182J5755E3872Q7297
$$ 358943 251992 240492 20118 221024 598840 75555 -164667 -117485 -101730 53872 141169
8885A41169a97436A24807B6561J22295b4671o4756a4923A633Q6325L5187A4096
$$ 141169 -197436 124807 26561 148856 -24671 -89427 -14923 1633 87958 123145 14096
8873A53958c24621b5485k40461O8347k0740B64981c4417j36370K7556k8620A35376
$$ 153958 -324621 -25485 -265946 -197599 -218339 264981 -34417 -170787 -143231 -171851 135376
$$ [...]
##END NTUPLES=NMR SPECTRUM
##END=
