
##TITLE=UV1024_M3-1004-1000_6269813_UShNbwHXxB
##JCAMPDX= 6.0         $$ Bruker NMR JCAMP-DX V2.0
##DATA TYPE= NMR SPECTRUM
##DATA CLASS= NTUPLES
##ORIGIN= BRUKER
##OWNER= Administrator
$$ 1.72 TOPSPIN		Version 2.1
$$ 2012-06-02 05:23:05.609 -0500  Administrator@TOPSPIN
$$ Compression mode = diff/dup
##.OBSERVE FREQUENCY= 400.13188235
##.OBSERVE NUCLEUS= ^1H
##.ACQUISITION MODE= SIMULTANEOUS (DQD)
##.ACQUISITION SCHEME= undefined
##.AVERAGES= 64
##.DIGITISER RES= 22
##SPECTROMETER/DATA SYSTEM= spect
##.PULSE SEQUENCE= noesygpps1d.comp
##.SOLVENT NAME= COFFEE_calctemp
##.SHIFT REFERENCE= INTERNAL, COFFEE_calctemp, 1, 14.96699
##AUDIT TRAIL= $$ (NUMBER, WHEN, WHO, WHERE, PROCESS, VERSION, WHAT)
$$ ##TITLE= Audit trail, TOPSPIN		Version 2.1
$$ ##JCAMPDX= 5.01
$$ ##ORIGIN= Bruker BioSpin GmbH
$$ ##OWNER= Administrator
$$ $$ C:\Bruker\TOPSPIN/data/COFFEE/nmr/UV1024_M3-1004-1000_6269813_UShNbwHXxB/62/pdata/1/auditp.txt
$$ ##AUDIT TRAIL=  $$ (NUMBER, WHEN, WHO, WHERE, PROCESS, VERSION, WHAT)
(   1,<2012-06-02 05:23:00.546 -0500>,<Administrator>,<TOPSPIN>,<go>,<TOPSPIN 2.1>,
      <created by zg
	started at 2012-06-02 05:11:30.265 -0500,
	POWCHK enabled, PULCHK disabled,
       configuration hash MD5:
       D5 CA 7A 23 FE 6B EE E2 50 67 74 61 24 F7 5E 3B
       data hash MD5: 64K
       59 99 8A 54 94 C5 DF 9E 2F 73 14 3D 9B DC C3 25>)
(   2,<2012-06-02 05:23:03.359 -0500>,<Administrator>,<TOPSPIN>,<proc1d>,<TOPSPIN 2.1>,
      <Start of raw data processing
       efp LB = 0.3 FT_mod = 6 PKNL = 1 PHC0 = 0 PHC1 = 0 SI = 128K 
       data hash MD5: 128K
       CA DF 26 05 F4 B9 3B 8D BD 3F 05 FF F1 EF C5 EE>)
(   3,<2012-06-02 05:23:04.562 -0500>,<Administrator>,<TOPSPIN>,<proc1d>,<TOPSPIN 2.1>,
      <pk PHC0 = 29.32251 PHC1 = 0 
       data hash MD5: 128K
       DD BB CF ED F7 2A ED 1D 67 2B 5C 77 77 4F 1A 73>)
(   4,<2012-06-02 05:23:05.250 -0500>,<Administrator>,<TOPSPIN>,<proc1d>,<TOPSPIN 2.1>,
      <abs ABSG = 1 
       data hash MD5: 128K
       81 20 C9 A3 EB 8C C5 6F 20 FB 0A 58 2B E9 30 76>)
(   5,<2012-06-02 05:23:05.328 -0500>,<Administrator>,<TOPSPIN>,<proc1d>,<TOPSPIN 2.1>,
      <abs ABSG = 2 
       data hash MD5: 128K
       48 CA 81 85 FB 03 7F C8 24 26 B0 F3 AD 5C 86 33>)
(   6,<2012-06-02 05:23:05.375 -0500>,<Administrator>,<TOPSPIN>,<proc1d>,<TOPSPIN 2.1>,
      <abs ABSG = 3 
       data hash MD5: 128K
       47 24 C2 79 17 DE A8 8C 1E 97 08 AA 0A 28 9E 9B>)
(   7,<2012-06-02 05:23:05.437 -0500>,<Administrator>,<TOPSPIN>,<proc1d>,<TOPSPIN 2.1>,
      <abs ABSG = 4 
       data hash MD5: 128K
       96 BB 08 26 10 83 44 9F 16 93 70 3D 43 45 0C F1>)
(   8,<2012-06-02 05:23:05.500 -0500>,<Administrator>,<TOPSPIN>,<proc1d>,<TOPSPIN 2.1>,
      <abs ABSG = 5 
       data hash MD5: 128K
       F8 EE 2E 62 83 7C E3 75 78 37 3B 43 37 2A E7 A9>)
$$ ##END=
$$ 
$$ $$ hash MD5
$$ $$ F7 B6 90 1C 19 E6 07 CF 8E 77 6A C8 F2 6D B5 F1
##$RELAX= 
##$RELAX= 
##$RELAX= 
##$RELAX= 
##$RELAX= 
##$RELAX= 
##$RELAX= 
##$RELAX= 
$$ [...]
##$TP07= 0
##$TPNAME0= <>
##$TPNAME1= <>
##$TPNAME2= <>
##$TPNAME3= <>
##$TPNAME4= <>
##$TPNAME5= <>
##$TPNAME6= <>
##$TPNAME7= <>
##$TPOAL= (0..7)
0.5 0.5 0.5 0.5 0.5 0.5 0.5 0.5
##$TPOFFS= (0..7)
0 0 0 0 0 0 0 0
##$TUNHIN= 0
##$TUNHOUT= 0
##$TUNXOUT= 0
##$USERA1= <user>
##$USERA2= <user>
##$USERA3= <user>
##$USERA4= <user>
##$USERA5= <user>
##$V9= 5
##$VALIST= <valist>
##$VCLIST= <CCCCCCCCCCCCCCC>
##$VD= 0
##$VDLIST= <DDDDDDDDDDDDDDD>
##$VPLIST= <PPPPPPPPPPPPPPP>
##$VTLIST= <TTTTTTTTTTTTTTT>
##$WBST= 2048
##$WBSW= 25
##$XGAIN= (0..3)
0 0 0 0
##$XL= 0
##$YL= 0
##$YMAX_a= 12381478
##$YMIN_a= -6907961
##$ZGOPTNS= <>
##$ZL1= 120
##$ZL2= 120
##$ZL3= 120
##$ZL4= 120
##$ABSF1= 14.96699
##$ABSF2= -5.58554
##$ABSG= 5
##$ABSL= 3
##$ALPHA= 0
##$AQORDER= 0
##$ASSFAC= 0
##$ASSFACI= 0
##$ASSFACX= 0
##$ASSWID= 0
##$AUNMP= <proc_prof1d_extract.lims>
##$AXLEFT= 0
##$AXNAME= <>
##$AXNUC= <1H>
##$AXRIGHT= 0
##$AXTYPE= 0
##$AXUNIT= <>
##$AZFE= 0.1
##$AZFW= 0.1
##$BCFW= 0
##$BC_mod= 0
##$BYTORDP= 0
##$COROFFS= 0
##$CY= 15
##$DATMOD= 1
##$DC= 0
##$DFILT= <>
##$DTYPP= 0
##$F1P= 0
##$F2P= 0
##$FCOR= 0.5
##$FTSIZE= 131072
##$FT_mod= 6
##$GAMMA= 0
##$GB= 0
##$INTBC= 1
##$INTSCL= 1
##$ISEN= 128
##$LB= 0.3
##$LEV0= 0
##$LPBIN= 0
##$MAXI= 10000
##$MC2= 0
##$MEAN= 0
##$ME_mod= 0
##$MI= 0
##$NCOEF= 0
##$NC_proc= -3
##$NLEV= 6
##$NOISF1= 0
##$NOISF2= 0
##$NSP= 0
##$NTH_PI= 0
##$NZP= 0
##$OFFSET= 14.96699
##$PC= 1
##$PHC0= 29.32251
##$PHC1= 0
##$PH_mod= 1
##$PKNL= yes
##$PPARMOD= 0
##$PPDIAG= 0
##$PPIPTYP= 0
##$PPMPNUM= 2147483647
##$PPRESOL= 1
##$PSCAL= 4
##$PSIGN= 0
##$PYNMP= <proc.py>
##$REVERSE= no
##$SF= 400.130005451789
##$SI= 131072
##$SIGF1= 0
##$SIGF2= 0
##$SINO= 400
##$SIOLD= 131072
##$SPECTYP= <>
##$SREGLST= <1H.CDCl3>
##$SSB= 0
##$STSI= 131072
##$STSR= 0
##$SW_p= 8223.68421052632
##$SYMM= 0
##$S_DEV= 0
##$TDeff= 65536
##$TDoff= 0
##$TI= <>
##$TILT= no
##$TM1= 0
##$TM2= 0
##$TOPLEV= 0
##$USERP1= <user>
##$USERP2= <user>
##$USERP3= <user>
##$USERP4= <user>
##$USERP5= <user>
##$WDW= 1
##$XDIM= 131072
##$YMAX_p= 443804075
##$YMIN_p= -46188193
##$CURPLOT= <Network HP LaserJet P1505>
##$CURPRIN= <$Network HP LaserJet P1505>
##$DFORMAT= <normdp>
##$LAYOUT= <+/1D_H.xwp>
##$LFORMAT= <normlp>
##$PFORMAT= <normpl>
##$SURQMSG= 1
$$ End of Bruker specific parameters
$$ ---------------------------------
##NTUPLES= NMR SPECTRUM
##VAR_NAME=  FREQUENCY,     SPECTRUM/REAL,   SPECTRUM/IMAG
##SYMBOL=    X,             R,               I
##VAR_TYPE=  INDEPENDENT,   DEPENDENT,       DEPENDENT
##VAR_FORM=  AFFN,          ASDF,            ASDF
##VAR_DIM=   131072,        131072,          131072
##UNITS=     HZ,            ARBITRARY UNITS, ARBITRARY UNITS
##FACTOR=    0.0627417313425165, 1,          1
##FIRST=     8223.62146879498, -1103,        -109891
##LAST=      0,             203,             -111694
##MIN=       0,             -46188193,       0
##MAX=       8223.62146879498, 443804075,    0
$$ Real data points
##PAGE= N=1
##DATA TABLE= (X++(R..R)), XYDATA
$$ [...]
$$ plain form
61193 1340220 1344503 1347724 1350590 1353920 1357919 1362251 1366714 1371255 1375295 1377716 1377764 1375627 1372090 1368209
61179 1368209 1365327 1364492 1365248 1365584 1363805 1360282 1357026 1355874 1357439 1361325 1366684 1372643 1378726 1384868 1390951
61164 1390951 1396692 1402178 1407892 1413734 1418648 1421921 1424396 1427605 1432051 1437042 1441821 1445902 1448686 1449931
61150 1449931 1450549 1451883 1454096 1456310 1458420 1461535 1466289 1471985 1478129 1485764 1496305 1509685 1524565
61137 1524565 1539943 1555637 1571423 1586483 1599659 1609793 1616047 1618497 1618303 1616789 1614489 1611506 1608440
61124 1608440 1606020 1603748 1599795 1592771 1583280 1573240 1563819 1554537 1544474 1533919 1524357 1516822 1510690
61111 1510690 1504332 1496693 1487901 1478614 1469261 1459963 1450774 1441957 1434197 1428343 1424523 1421800 1419352 1417848
61097 1417848 1418897 1423160 1429878 1438328 1448601 1460493 1472723 1484176 1495217 1506781 1518651 1529544
$$ packed form
61193A340220M283L221K866L330L999M332M463M541M040K421M8k137l537l881
61179A368209k882q35P56L36j779l523l256j152J565L886N359N959O083O142O083
61164A390951N741N486N714N842M914L273K475L209M446M991M779M081K784J245
61150A449931O18J334K213K214K110L115M754N696O144P635J0541J3380J4880
61137A524565J5378J5694J5786J5060J3176J0134O254K450j94j514k300k983l066
61124A608440k420k272l953p024r491j0040r421r282j0063j0555r562p535o132
61111A510690o358p639q792r287r353r298r189q817p760n854l820k723k448j504
61097A417848J049M263O718Q450J0273J1892J2230J1453J1041J1564J1870J0893
$$ plain form
61085 1529544 1538694 1546524 1553911 1561567 1570090 1579822 1590656 1602584 1616471 1633579 1654170 1677234
61073 1677234 1701953 1728940 1759388 1793046 1827632 1860726 1892318 1925012 1961418 2001663 2043874
61062 2043874 2086531 2129245 2171472 2212066 2250770 2288853 2327175 2364519 2398982 2430233 2459048
61051 2459048 2485145 2507067 2524151 2537139 2546626 2552093 2552861 2548865 2540069 2526049 2506676 2482388
61039 2482388 2453337 2419130 2380068 2338013 2295308 2253215 2211851 2171140 2131210 2092218 2054385
61028 2054385 2018096 1983543 1950494 1918803 1888893 1861341 1836152 1812863 1791238 1771409 1753359
61017 1753359 1736716 1721228 1707127 1694698 1683611 1673080 1662882 1653956 1647598 1644086 1642487 1641899
61005 1641899 1642437 1644832 1649475 1656150 1664306 1673330 1683011 1694101 1707970 1725276 1745428 1767789 1792714
$$ packed form
61085A529544R150P830P387P656Q523R732J0834J1928J3887J7108K0591K3064
61073A677234K4719K6987L0448L3658L4586L3094L1592L2694L6406M0245M2211
61062B043874M2657M2714M2227M0594L8704L8083L8322L7344L4463L1251K8815
61051B459048K6097K1922J7084J2988R487N467P68l996q796j4020j9373k4288
61039B482388k9051l4207l9062m2055m2705m2093m1364m0711l9930l8992l7833
61028B054385l6289l4553l3049l1691k9910k7552k5189k3289k1625j9829j8050
61017A753359j6643j5488j4101j2429j1087j0531j0198q926o358l512j599n88
61005A641899N38K395M643O675Q156R024R681J1090J3869J7306K0152K2361K4925
$$ plain form
60992 1792714 1820802 1851909 1885889 1923666 1966317 2013425 2063673 2116954 2174555 2237147 2303900
60981 2303900 2373946 2447585 2525713 2609102 2698722 2795667 2900202 3011688 3129906 3255596
60971 3255596 3389343 3530959 3680558 3839159 4007415 4184630 4370123 4565105 4772394
60962 4772394 4994636 5233476 5490052 5765300 6059498 6371898 6701292 7047753 7414639
60953 7414639 7808915 8239144 8713846 9242766 9838661 10515468 11284497 12154730 13137454
60944 13137454 14248426 15505092 16925798 18535341 20367926 22454122 24790568 27306329
60936 27306329 29845930 32186710 34096992 35417404 36123436 36331164 36245011 36081681 36004338
60927 36004338 36077698 36244374 36333381 36114290 35386015 34058028 32179512 29905587 27430111
$$ packed form
60992A792714K8088L1107L3980L7777M2651M7108N0248N3281N7601O2592O6753
60981B303900P0046P3639P8128Q3389Q9620R6945J04535J11486J18218J25690
60971C255596J33747J41616J49599J58601J68256J77215J85493J94982K07289
60962D772394K22242K38840K56576K75248K94198L12400L29394L46461L66886
60953G414639L94276M30229M74702N28920N95895O76807P69029Q70233R82724
60944A3137454J110972J256666J420706J609543J832585K086196K336446K515761
60936B7306329K539601K340780J910282J320412P06032K07728q6153j63330p7343
60927C6004338P3360J66676Q9007k19091p28275j327987j878516k273925k475476
$$ plain form
60918 27430111 24927405 22524980 20301424 18293903 16508183 14931257 13543713 12326241
60910 12326241 11259994 10326180 9507573 8789315 8157675 7599459 7103430 6661061 6265132
60901 6265132 5908596 5585488 5291730 5024182 4779928 4557191 4355532 4173710 4008066
60892 4008066 3854270 3710074 3575172 3448960 3329882 3216796 3109569 3008046 2911353 2818499
60882 2818499 2728970 2642634 2559760 2481276 2408252 2340699 2277283 2216460 2157639 2101029 2046786
60871 2046786 1994741 1944887 1897689 1853709 1813065 1775439 1740391 1707300 1675124 1642974 1611260
60860 1611260 1581514 1554395 1528468 1501982 1475367 1450733 1429006 1409007 1389554 1371013 1354148
60849 1354148 1338799 1324583 1311751 1300241 1288776 1276116 1262614 1249480 1237215 1225921 1216356
$$ packed form
60918B7430111k502706k402425k223556k007521j785720j576926j387544j217472
60910A2326241j066247r33814q18607p18258o31640n58216m96029m42369l95929
60901F265132l56536l23108k93758k67548k44254k22737k01659j81822j65644
60892D008066j53796j44196j34902j26212j19078j13086j07227j01523r6693r2854
60882B818499q9529q6336q2874p8484p3024o7553o3416o0823n8821n6610n4243
60871B046786n2045m9854m7198m3980m0644l7626l5048l3091l2176l2150l1714
60860A611260k9746k7119k5927k6486k6615k4634k1727j9999j9453j8541j6865
60849A354148j5349j4216j2832j1510j1465j2660j3502j3134j2265j1294r565
$$ plain form
60838 1216356 1209053 1202649 1194820 1185040 1174987 1165938 1157258 1148033 1138855 1130955 1124362 1117874 1110425 1101925
60824 1101925 1093288 1086222 1082279 1081085 1079850 1075644 1068235 1060020 1053230 1048014 1043392 1039103 1035826 1034032
60810 1034032 1033351 1033108 1032930 1032681 1032183 1031371 1030692 1031073 1033261 1036979 1040739 1042728 1042190 1039982 1037536 1035256
60794 1035256 1032295 1028106 1023732 1020903 1019809 1018433 1014516 1007918 1000546 994057 988142 981331 973027 964173
60780 964173 955897 948131 939994 931136 921967 912682 902903 892634 882890 874767 868296 862775 857887 853799
60766 853799 850370 847034 843532 840154 837164 834484 831921 829230 825988 821997 817855 814513 812157 810039
60752 810039 807435 804248 800788 797641 795770 795825 797152 798266 798539 798617 799054 799660 800627 803112 807725 813133
60736 813133 817037 818113 816469 812969 808935 805803 804019 802586 800455 797858 795534 793215 789916 785264
$$ packed form
60838A216356p303o404p829r780j0053r049q680r225r178p900o593o488p449q500
60824A101925q637p066l943j194j235m206p409q215o790n216m622m289l277j794
60810A034032o81k43j78k49m98q12o79L81K188L718L760J989n38k208k446k280
60794A035256k961m189m374k829j094j376l917o598p372o489n915o811q304q854
60780I64173q276p766q137q858r169r285r779j0269r744q123o471n521m888m088
60766H53799l429l336l502l378k990k680k563k691l242l991m142l342k356k118
60752H10039k604l187l460l147j871N5J327J114K73P8M37O06R67K485M613N408
60736H13133L904J076j644l500m034l132j784j433k131k597k324k319l299m652
$$ plain form
60722 785264 779587 773171 766597 761322 758510 757279 755529 752684 750400 750231 751701 753109 753216 751662 748623
60707 748623 744757 740972 737782 735292 733904 734384 736983 741150 746302 752051 757436 760990 762254 762509 763255
60692 763255 764521 765497 766395 768678 773370 779805 786322 791856 796499 800526 803333 803977 802828 801727 801702
60677 801702 801265 798211 792765 787459 783891 781283 778683 776825 776693 777573 777975 777657 777449 777694 778118 778754
60661 778754 779765 780779 781523 782629 784518 785878 784778 781211 777121 773953 771605 769850 769018 768752 767701
60646 767701 765298 762544 760163 757279 753095 748793 746277 745584 744918 742955 739903 736420 732700 728773 724887
60631 724887 721460 719186 718980 721020 724095 726892 729795 734243 740259 745957 750070 753759 758911 765427
60617 765427 771290 775021 777150 779318 782614 786764 790332 791682 790246 787023 783627 780899 778666 776538
$$ packed form
60722G85264n677o416o574n275k812j231j750k845k284j69J470J408J07j554l039
60707G48623l866l785l190k490j388M80K599M167N152N749N385L554J264K55P46
60692G63255J266R76Q98K283M692O435O517N534M643M027K807O44j149j101k5
60677H01702m37l054n446n306l568k608k600j858j32Q80M02l18k08K45M24O36
60661G78754J011J014P44J106J889J360j100l567m090l168k348j755q32k66j051
60646G67701k403k754k381k884m184m302k516o93o66j963l052l483l720l927l886
60631G24887l427k274k06K040L075K797K903M448O016N698M113L689N152O516
60617G65427N863L731K129K168L296M150L568J350j436l223l396k728k233k128
$$ plain form
60603 776538 774441 772477 770799 769732 769627 770520 772177 774399 776944 779302 780993 782058 782831 783354 783555
60588 783555 783884 784912 786176 786315 784785 782661 781155 780020 778289 776095 774644 774409 774329 773122 770752
60573 770752 768252 766575 765986 766221 766773 767071 766730 765828 765031 765328 767291 770272 772651 773336 772994 773260 774689
60556 774689 776070 776006 774708 773857 774940 778022 781845 784830 786272 786996 788683 792135 796369 799866 802566
60541 802566 805932 810889 816413 820663 823162 825193 828126 831944 835602 838360 840419 842491 845140 848569
60527 848569 852700 857294 862063 866732 871040 874869 878581 883077 889123 896420 903593 909431 914149 919282
60513 919282 926329 935628 946571 958684 972200 987505 1004207 1021063 1036919 1051475 1064930 1077161
60501 1077161 1087678 1096356 1103735 1110293 1115635 1118761 1119165 1117605 1115746 1115073 1116097 1118576 1122345 1127691
$$ packed form
60603G76538k097j964j678j067j05Q93J657K222K545K358J691J065P73N23K01
60588G83555L29J028J264J39j530k124j506j135j731k194j451k35q0j207k370
60573G70752k500j677n89K35N52K98l41r02p97K97J963K981K379O85l42K66J429
60556G74689J381o4j298q51J083L082L823K985J442P24J687L452M234L497K700
60541H02566L366M957N524M250K499K031K933L818L658K758K059K072K649L429
60527H48569M131M594M769M669M308L829L712M496O046P297P173N838M718N133
60513I19282P047R299J0943J2113J3516J5305J6702J6856J5856J4556J3455J2231
60501A077161J0517Q678P379O558N342L126M04j560j859o73J024K479L769N346
$$ plain form
60487 1127691 1134921 1144007 1155028 1168605 1185361 1205117 1227202 1251428 1278120 1307148 1337757 1369595
60475 1369595 1403250 1439389 1477814 1517522 1557018 1594280 1627103 1653983 1674173 1686727 1690501
60464 1690501 1685626 1674051 1657839 1637983 1615786 1594225 1576197 1561918 1549641 1538674 1530081 1524610
60452 1524610 1521762 1521192 1523346 1528239 1535266 1544934 1559264 1579566 1605120 1635088 1670364 1712162 1759835
60439 1759835 1811651 1867057 1926493 1989157 2052405 2113532 2171119 2224554 2273163 2316066 2352315
60428 2352315 2381318 2403883 2422685 2440808 2459591 2478344 2495743 2510379 2519862 2520525 2508783 2482546
60416 2482546 2441366 2385974 2318110 2240357 2155702 2067251 1978127 1891071 1808033 1730365 1659085
60405 1659085 1594295 1534752 1479213 1428389 1384350 1347438 1314804 1282965 1251161 1221206 1194561
$$ packed form
60487A127691P230R086J1021J3577J6756J9756K2085K4226K6692K9028L0609L1838
60475A369595L3655L6139L8425L9708L9496L7262L2823K6880K0190J2554L774
60464A690501m875j1575j6212j9856k2197k1561j8028j4279j2277j0967q593n471
60452A524610k848n70K154M893P027R668J4330K0302K5554K9968L5276M1798M7673
60439A759835N1816N5406N9436O2664O3248O1127N7587N3435M8609M2903L6249
60428B352315K9003K2565J8802J8123J8783J8753J7399J4636R483O63j1742k6237
60416B482546m1180n5392o7864p7753q4655q8451q9124q7056q3038p7668p1280
60405A659085o4790n9543n5539n0824m4039l6912l2634l1839l1804k9955k6645
$$ plain form
60394 1194561 1170841 1149194 1129848 1113533 1100019 1088058 1076661 1065817 1055898 1046892 1038561 1030983
60382 1030983 1024429 1018836 1013881 1009608 1006356 1003822 1000758 996098 989989 983193 975895 967930 960044 954023
60368 954023 951284 951751 954096 956481 957163 955329 951837 948562 946635 945705 945050 944597 944448 944269 943979 944404
60352 944404 946359 949466 952818 956477 961180 966555 970862 973016 974003 975693 978825 982747 986624 990177
60338 990177 993518 997008 1001265 1006706 1012953 1019062 1024447 1029270 1033893 1038405 1042789 1047166 1051658 1056349
60324 1056349 1061553 1067616 1074010 1079134 1081820 1082989 1085047 1089380 1095056 1100307 1104612 1108718 1113031 1116840
60310 1116840 1119203 1120100 1120604 1122187 1125699 1130588 1135191 1138255 1140205 1142446 1145608 1149209 1153056 1157935
60296 1157935 1164394 1171733 1179097 1186954 1196315 1206601 1215550 1221620 1225584 1229084 1232199 1233342 1231410 1227246
$$ packed form
60394A194561k3720k1647j9346j6315j3514j1961j1397j0844r919r006q331p578
60382A030983o554n593m955m273l252k534l064m660o109o796p298p965p886o021
60368I54023k739M67K345K385O82j834l492l275j927r30o55m53j49j79k90M25
60352I44404J955L107L352L659M703N375M307K154R87J690L132L922L877L553
60338I90177L341L490M257N441O247O109N385M823M623M512M384M377M492M691
60324A056349N204O063O394N124K686J169K058M333N676N251M305M106M313L809
60310A116840K363Q97N04J583L512M889M603L064J950K241L162L601L847M879
60296A157935O459P339P364P857R361J0286Q949O070L964L500L115J143j932m164
$$ plain form
60282 1227246 1222629 1218247 1213188 1206458 1198642 1191629 1186677 1183112 1179255 1174354 1169054 1164050 1159088 1153681
60268 1153681 1148113 1142906 1137582 1131052 1123528 1117270 1114689 1116049 1119576 1123595 1127890 1133044 1139356 1146846
60254 1146846 1155779 1166390 1178041 1189124 1198119 1204843 1210783 1218257 1228941 1242696 1257682 1271782
60242 1271782 1284055 1294750 1304086 1311333 1315127 1314340 1308398 1297095 1280669 1260359 1238642 1218466
60230 1218466 1201797 1188661 1177534 1166771 1155753 1144866 1134700 1125496 1117164 1109437 1101897 1094206
60218 1094206 1086552 1079649 1073917 1068737 1062885 1055862 1048590 1042624 1038781 1036668 1035319 1033929 1031991 1029246
60204 1029246 1025956 1023089 1021758 1022248 1023861 1025903 1028665 1033168 1039882 1047772 1054652 1058668 1059765 1059810 1060952
60189 1060952 1063657 1066562 1068373 1069441 1070998 1073216 1074813 1074631 1072956 1071061 1070001 1070155 1071512 1073894
$$ packed form
60282A227246m617m382n059o730p816p013m952l565l857m901n300n004m962n407
60268A153681n568n207n324o530p524o258k581J360L527M019M295N154O312P490
60254A146846Q933J0611J1651J1083Q995O724N940P474J0684J3755J4986J4100
60242A271782J2273J0695R336P247L794p87n942j1303j6426k0310k1717k0176
60230A218466j6669j3136j1127j0763j1018j0887j0166r204q332p727p540p691
60218A094206p654o903n732n180n852p023p272n966l843k113j349j390j938k745
60204A029246l290k867j331M90J613K042K762M503O714P890O880M016J097M5J142
60189A060952K705K905J811J068J557K218J597j82j675j895j060J54J357K382
$$ plain form
60175 1073894 1077087 1081116 1086310 1092814 1100178 1107657 1114833 1121840 1129147 1137313 1146657 1156856 1167035
60162 1167035 1176649 1186228 1196876 1209049 1222113 1235186 1248135 1261640 1276344 1291976 1307261 1320858
60150 1320858 1332531 1343267 1354090 1365002 1375338 1384812 1393704 1402148 1409919 1417019 1423824 1430261 1435368
60137 1435368 1438178 1438941 1439071 1439908 1441628 1443174 1443020 1440327 1435764 1431160 1427955 1425980 1423972 1421134 1417734
60122 1417734 1414228 1410507 1406460 1402808 1400683 1400393 1401151 1402187 1403543 1405411 1407133 1407463 1405716 1402080 1396833
60107 1396833 1390013 1382197 1374962 1369761 1366480 1363691 1360346 1356773 1353891 1352002 1350616 1349166 1347636 1346622
60093 1346622 1346953 1349008 1352183 1355195 1357165 1358281 1359309 1360586 1361773 1362526 1363167 1364504 1367027 1370331 1373464
60078 1373464 1375895 1378014 1380554 1383773 1387445 1391365 1395332 1398762 1401126 1403065 1406364 1412189 1419662 1426707
$$ packed form
60175A073894L193M029N194O504P364P479P176P007P307Q166R344J0199J0179
60162A167035R614R579J0648J2173J3064J3073J2949J3505J4704J5632J5285J3597
60150A320858J1673J0736J0823J0912J0336R474Q892Q444P771P100O805O437N107
60137A435368K810P63J30Q37J720J546j54k693m563m604l205j975k008k838l400
60122A417734l506l721m047l652k125k90P58J036J356J868J722L30j747l636n247
60107A396833o820p816p235n201l281k789l345l573k882j889j386j450j530j014
60093A346622L31K055L175L012J970J116J028J277J187P53O41J337K523L304L133
60078A373464K431K119K540L219L672L920L967L430K364J939L299N825P473P045
$$ plain form
60064 1426707 1432076 1436108 1439732 1443427 1447252 1451473 1456831 1464143 1473501 1483839 1493714 1502762 1512040 1522551
60050 1522551 1533930 1545074 1555567 1565692 1575315 1583718 1590491 1595736 1599331 1601045 1601658 1602996 1606230
60037 1606230 1610691 1614796 1617441 1618065 1616144 1611550 1604968 1597143 1587942 1576914 1564615 1552538 1541477
60024 1541477 1530442 1517460 1501414 1483198 1465156 1449117 1434817 1420596 1405779 1391628 1379462
60013 1379462 1368573 1357010 1344103 1331151 1319631 1309738 1300965 1293136 1286273 1279969 1273569 1266903 1260542
60000 1260542 1255318 1251519 1248472 1245061 1240921 1236868 1233753 1231204 1228133 1224314 1220670 1218027 1216444 1215964
59986 1215964 1217182 1220494 1225269 1230162 1233983 1236211 1237160 1237758 1238535 1238721 1237146 1234219 1231981 1231553 1231410
59971 1231410 1229092 1223988 1217498 1210969 1204627 1198345 1192269 1186455 1180629 1174600 1168399 1161997 1155433 1149220
$$ packed form
60064A426707N369M032L624L695L825M221N358P312R358J0338R875R048R278J0511
60050A522551J1379J1144J0493J0125R623Q403O773N245L595J714O13J338L234
60037A606230M461M105K645O24j921m594o582p825r201j1028j2299j2077j1061
60024A541477j1035j2982j6046j8216j8042j6039j4300j4221j4817j4151j2166
60013A379462j0889j1563j2907j2952j1520r893q773p829o863o304o400o666o361
60000A260542n224l799l047l411m140m053l115k549l071l819l644k643j583m80
59986A215964J218L312M775M893L821K228R49N98P77J86j575k927k238m28j43
59971A231410k318n104o490o529o342o282o076n814n826o029o201o402o564o213
$$ plain form
59957 1149220 1143977 1139638 1135596 1131716 1128471 1125918 1123266 1119872 1116103 1112752 1109987 1107386 1104708 1102091
59943 1102091 1099539 1096684 1093209 1089374 1085994 1083788 1082650 1081685 1080291 1079223 1080156 1083972 1089745 1095655
59929 1095655 1100639 1104840 1108697 1112212 1115296 1118437 1122535 1127940 1133864 1138938 1142341 1144247 1145235 1145562
59915 1145562 1145233 1144516 1143954 1143841 1143969 1144012 1143903 1143705 1143348 1142739 1142040 1141586 1141502 1141632 1141930 1142623 1143676 1144261 1143340
59896 1143340 1140998 1138665 1137577 1137458 1137379 1137516 1138971 1141845 1144804 1147070 1149602 1153230 1156580 1157446 1155955
59881 1155955 1154899 1156663 1161035 1166440 1172142 1178447 1185483 1192779 1199874 1206853 1214424 1223598 1234765 1246630
59867 1246630 1256595 1262836 1265879 1267757 1269936 1272547 1275292 1278309 1282033 1286740 1292443 1299066 1306630 1315315
59853 1315315 1325217 1335869 1346186 1355121 1362266 1367641 1371113 1372276 1370794 1366731 1360732 1354048 1347896
$$ packed form
59957A149220n243m339m042l880l245k553k652l394l769l351k765k601k678k617
59943A102091k552k855l475l835l380k206j138r65j394j068R33L816N773N910
59929A095655M984M201L857L515L084L141M098N405N924N074L403J906R88L27
59915A145562l29p17n62j13J28M3j09j98l57o09o99m54q4J30K98O93J053N85r21
59896A143340k342k333j088j19p9J37J455K874K959K266K532L628L350Q66j491
59881A155955j056J764M372N405N702O305P036P296P095O979P571R174J1167J1865
59867A246630R965O241L043J878K179K611K745L017L724M707N703O623P564Q685
59853A315315R902J0652J0317Q935P145N375L472J163j482m063n999o684o152
$$ plain form
59840 1347896 1342477 1336973 1330948 1325329 1321427 1319298 1317879 1316601 1316076 1317062 1319462 1322561 1325704 1328577
59826 1328577 1331465 1335390 1341349 1349052 1357036 1364437 1372039 1381044 1391384 1401924 1411881 1421188 1429610
59813 1429610 1436405 1441049 1443777 1445323 1446507 1447966 1449747 1451152 1451488 1450998 1450617 1450923 1451968 1454004 1457356
59798 1457356 1461346 1464401 1465961 1467590 1471296 1477279 1484126 1490935 1498307 1507295 1518191 1530369 1542610
59785 1542610 1553432 1561788 1567745 1572099 1575309 1577371 1578788 1580813 1584242 1588466 1592226 1595009 1597151 1598704
59771 1598704 1598707 1595802 1589568 1581191 1572706 1565403 1559096 1553050 1547256 1542348 1538689 1536306 1535548 1536784 1539378
59756 1539378 1541979 1544083 1546171 1547881 1547435 1543896 1538977 1535234 1533081 1530928 1527747 1523970 1519989 1515438
59742 1515438 1510392 1505913 1502719 1500280 1497800 1495278 1493008 1490866 1488790 1487269 1486479 1485404 1482733 1478467
$$ packed form
59840A347896n419n504o025n619l902k129j419j278n25R86K400L099L143K873
59826A328577K888L925N959P703P984P401P602R005J0340J0540R957R307Q422
59813A429610O795M644K728J546J184J459J781J405L36m90l81L06J045K036L352
59798A457356L990L055J560J629L706N983O847O809P372Q988J0896J2178J2241
59785A542610J0822Q356N957M354L210K062J417K025L429M224L760K783K142J553
59771A598704Lk905o234q377q485p303o307o046n794m908l659k383p58J236K594
59756A539378K601K104K088J710m46l539m919l743k153k153l181l777l981m551
59742A515438n046m479l194k439k480k522k270k142k076j521p90j075k671m266
$$ plain form
59728 1478467 1473907 1470087 1466843 1463366 1459008 1453406 1446427 1438520 1430960 1425319 1422377 1421481 1421041 1419851
59714 1419851 1418015 1416532 1416047 1416299 1416951 1418591 1422401 1428668 1436035 1442678 1448247 1454205 1462050 1471706 1482214
59699 1482214 1493586 1506845 1522112 1537779 1552310 1566000 1580036 1594407 1607852 1619514 1629449
59688 1629449 1637708 1644241 1649933 1656440 1664337 1672267 1678574 1683077 1686634 1689666 1691983 1693846 1696328 1700300
59674 1700300 1705271 1709486 1711375 1711021 1709976 1709473 1709348 1709133 1709457 1711246 1713972 1716073 1717156 1718422 1720635
59659 1720635 1723021 1724712 1726018 1727663 1729959 1733493 1739377 1747815 1757430 1767154 1777852 1790944 1806253
59646 1806253 1822450 1838964 1856173 1874348 1893647 1914620 1937305 1960269 1981846 2001904 2021038
59635 2021038 2038615 2053420 2065951 2078137 2090570 2101834 2110942 2118551 2125042 2129078 2129270 2126146 2121490
$$ packed form
59728A478467m560l820l244l477m358n602o979p907p560n641k942q96m40j190
59714A419851j836j483m85K52O52J640L810O267P367O643N569N958P845R656J0508
59699A482214J1372J3259J5267J5667J4531J3690J4036J4371J3445J1662R935
59688A629449Q259O533N692O507P897P930O307M503L557L032K317J863K482L972
59674A700300M971M215J889l54j045n03j25k15L24J789K726K101J083J266K213
59659A720635K386J691J306J645K296L534N884Q438R615R724J0698J3092J5309
59646A806253J6197J6514J7209J8175J9299K0973K2685K2964K1577K0058J9134
59635B021038J7577J4805J2531J2186J2433J1264R108P609O491M036J92l124m656
$$ plain form
59622 2121490 2116585 2111878 2107326 2102051 2094462 2083811 2071189 2058254 2045564 2032901 2020550 2009357
59610 2009357 1999961 1992725 1987927 1985240 1983537 1982150 1981966 1984391 1989522 1996225 2003743 2012190 2021535 2031186
59596 2031186 2040688 2049902 2058190 2064269 2067395 2068082 2067089 2064008 2057287 2045466 2028008 2005217 1978004
59583 1978004 1947906 1916843 1886164 1855832 1824999 1793662 1763376 1735906 1711514 1689215 1668416
59572 1668416 1649256 1631219 1612644 1592335 1570843 1549404 1528369 1507651 1487939 1469975 1452863
59561 1452863 1434687 1415163 1396355 1380101 1365899 1352264 1339277 1328429 1320284 1313610 1307116 1300998
59549 1300998 1296206 1292817 1289871 1286604 1283181 1280223 1278072 1276793 1276507 1277267 1278657 1279863 1280404 1280705 1281779
59534 1281779 1284268 1287860 1291606 1294674 1296649 1297250 1296189 1293599 1290302 1287148 1284053 1280267 1275794 1271911
$$ packed form
59622B121490m905m707m552n275p589j0651j2622j2935j2690j2663j2351j1193
59610B009357r396p236m798k687j703j387j84K425N131O703P518Q447R345R651
59596B031186R502R214Q288O079L126O87r93l081o721j1821j7458k2791k7213
59583A978004l0098l1063l0679l0332l0833l1337l0286k7470k4392k2299k0799
59572A668416j9160j8037j8575k0309k1492k1439k1035k0718j9712j7964j7112
59561A452863j8176j9524j8808j6254j4202j3635j2987j0848q145o674o494o118
59549A300998m792l389k946l267l423k958k151j279k86P60J390J206N41L01J074
59534A281779K489L592L746L068J975O01j061k590l297l154l095l786m473l883
$$ plain form
59520 1271911 1269660 1268135 1265001 1258733 1249911 1240430 1232094 1225948 1222089 1219616 1217264 1214589 1212241 1210898
59506 1210898 1210422 1210431 1211083 1212585 1214318 1215273 1215257 1215005 1215155 1215889 1217610 1221097 1226567 1233150 1239834 1246600 1254160
59489 1254160 1262825 1272198 1281918 1292210 1303544 1316126 1330035 1345731 1364055 1385492 1409557 1434962
59477 1434962 1460155 1483185 1501158 1510886 1511204 1504698 1496333 1489924 1486167 1483947 1482519 1481805 1481370 1480388
59463 1480388 1478674 1476857 1475308 1473478 1470577 1466192 1459927 1451160 1439920 1427588 1415897 1405171 1394209
59450 1394209 1381981 1368964 1356700 1346544 1338972 1333621 1329614 1326175 1323207 1321178 1320371 1320536 1321437 1323374
59436 1323374 1326836 1331796 1337558 1343214 1348229 1352818 1357749 1363397 1369098 1374051 1378895 1385409 1394144 1403322
59422 1403322 1411021 1417654 1425046 1433517 1441359 1447196 1451360 1454491 1456127 1455619 1453574 1451421 1449991 1449240
$$ packed form
59520A271911k251j525l134o268q822r481q336o146l859k473k352k675k348j343
59506A210898m76RO52J502J733R55j6k52J50P34J721L487N470O583O684O766P560
59489A254160Q665R373R720J0292J1334J2582J3909J5696J8324K1437K4065K5405
59477A434962K5193K3030J7973R728L18o506q365o409l757k220j428p14m35r82
59463A480388j714j817j549j830k901m385o265q767j1240j2332j1691j0726j0962
59450A394209j2228j3017j2264j0156p572n351m007l439k968k029q07J65R01J937
59436A323374L462M960N762N656N015M589M931N648N701M953M844O514Q735R178
59422A403322P699O633P392Q471P842N837M164L131J636n08k045k153j430p51
$$ plain form
59408 1449240 1448926 1448754 1448221 1447090 1445954 1445744 1446801 1448944 1452280 1457325 1464423 1473524 1484375 1496370
59394 1496370 1508342 1519281 1529316 1539254 1548989 1557167 1562865 1566892 1570660 1574075 1575455 1573679 1569735
59381 1569735 1565839 1563387 1562239 1561709 1561615 1562173 1563384 1565046 1567198 1570051 1573415 1576724 1579961 1584272 1591169
59366 1591169 1601144 1613335 1626692 1641224 1657961 1677770 1700451 1725021 1750705 1777383 1805118
59355 1805118 1833798 1863625 1895419 1929359 1962907 1990686 2007409 2011418 2005456 1994290 1981757 1969735
59343 1969735 1959115 1951176 1947756 1949826 1955796 1961442 1961947 1954289 1938005 1914409 1885715 1854639 1823856
59330 1823856 1795238 1769709 1747894 1730453 1717559 1708457 1702068 1697932 1696187 1696678 1698528 1700708 1702796
59317 1702796 1705064 1708029 1712028 1717046 1722741 1728675 1734641 1740850 1747836 1756234 1766421 1778079 1790059
$$ packed form
59408A449240l14j72n33j131j136k10J057K143L336N045P098R101J0851J1995
59394A496370J1972J0939J0035R938R735Q178N698M027L768L415J380j776l944
59381A569735l896k452j148n30r4N58J211J662K152K853L364L309L237M311O897
59366A591169R975J2191J3357J4532J6737J9809K2681K4570K5684K6678K7735
59355A805118K8680K9827L1794L3940L3548K7779J6723M009n962j1166j2533j2022
59343A969735j0620p939l420K070N970N646N05p658j6284k3596k8694l1076l0783
59330A823856k8618k5529k1815j7441j2894r102o389m136j745M91J850K180K088
59317A702796K268K965L999N018N695N934N966O209O986Q398J0187J1658J1980
$$ plain form
59304 1790059 1801075 1810773 1819965 1829670 1840132 1850877 1861364 1871311 1880770 1890347 1901058 1913476
59292 1913476 1927201 1941659 1957097 1974014 1991845 2009163 2025258 2040559 2055356 2069162 2081669
59281 2081669 2093182 2103398 2110713 2113646 2112271 2107540 2099993 2089961 2078084 2064419 2047887 2027980
59269 2027980 2006325 1985007 1963916 1941563 1918184 1895891 1875517 1855473 1834427 1813252 1793300
59258 1793300 1774306 1755236 1735963 1716898 1698047 1679644 1662770 1648142 1635093 1622904 1612327
59247 1612327 1604461 1598924 1594632 1591845 1591842 1594835 1599823 1606553 1616191 1629559 1645585 1661602 1674356 1680917
59233 1680917 1679918 1672496 1661408 1649103 1637135 1627009 1620145 1616701 1615549 1615891 1618062 1622446 1628630
59220 1628630 1636282 1645926 1658000 1671687 1685600 1699395 1714068 1730691 1749356 1769298 1789596 1809592
$$ packed form
59304A790059J1016R698R192R705J0462J0745J0487R947R459R577J0711J2418
59292A913476J3725J4458J5438J6917J7831J7318J6095J5301J4797J3806J2507
59281B081669J1513J0216P315K933j375m731p547j0032j1877j3665j6532j9907
59269B027980k1655k1318k1091k2353k3379k2293k0374k0044k1046k1175j9952
59258A793300j8994j9070j9273j9065j8851j8403j6874j4628j3049j2189j0577
59247A612327p866n537m292k787lK993M988O730R638J3368J6026J6017J2754O561
59233A680917r99p422j1088j2305j1968j0126o864l444j152L42K171M384O184
59220A628630P652R644J2074J3687J3913J3795J4673J6623J8665J9942K0298J9996
$$ plain form
59208 1809592 1828843 1846863 1863146 1877557 1890521 1902493 1913243 1921908 1927640 1929959 1928613 1923602
59196 1923602 1915329 1904410 1891325 1876581 1861013 1845418 1829928 1814238 1798411 1782991 1768372
59185 1768372 1754506 1741151 1727929 1714303 1700194 1686534 1674480 1664081 1654485 1645465 1637672 1631200
59173 1631200 1624976 1618254 1611825 1606880 1603186 1599198 1593742 1586937 1579568 1572181 1564874 1557643 1550851 1545261
59159 1545261 1541411 1538944 1536967 1535072 1533417 1531758 1529235 1525589 1521878 1519306 1517834 1516660 1515653 1515491
59145 1515491 1516481 1517919 1518621 1517644 1514723 1510640 1507097 1505463 1505467 1505653 1505256 1505085 1506292 1508790 1511455 1513619
59129 1513619 1515846 1519119 1523629 1528610 1533180 1536990 1539962 1541756 1541874 1540136 1536674 1531454 1524273 1515456
59115 1515456 1506109 1497165 1488277 1478147 1466203 1453762 1443293 1436338 1432202 1428741 1424470 1419801 1416254
$$ packed form
59208A809592J9251J8020J6283J4411J2964J1972J0750Q665N732K319j346n011
59196A923602q273j0919j3085j4744j5568j5595j5490j5690j5827j5420j4619
59185A768372j3866j3355j3222j3626j4109j3660j2054j0399r596r020p793o472
59173A631200o224o722o429m945l694l988n456o805p369p387p307p231o792n590
59159A545261l850k467j977j895j655j659k523l646l711k572j472j174j007j62
59145A515491R90J438P02r77k921m083l543j634MJ86l97j71J207K498K665K164
59129A513619K227L273M510M981M570L810K972J794J18j738l462n220p181q817
59115A515456r347q944q888j0130j1944j2441j0469o955m136l461m271m669l547
$$ plain form
59102 1416254 1414787 1415050 1415936 1416404 1415885 1414333 1411974 1408831 1404668 1399643 1394630 1390272 1385934 1380369 1373475
59087 1373475 1366621 1361009 1356432 1351870 1346540 1340025 1332214 1323756 1315980 1309628 1304105 1298696 1294055 1291588
59073 1291588 1291542 1292619 1293649 1294897 1297497 1302149 1308780 1317118 1327082 1338564 1351075 1363882 1376625
59060 1376625 1389656 1403517 1418168 1433074 1448024 1463314 1478930 1494055 1507786 1519963 1530941
59049 1530941 1540981 1550255 1559018 1567201 1574104 1579046 1582103 1583738 1583984 1582673 1580248 1577574 1574921 1571849
59035 1571849 1568217 1564662 1561745 1559156 1556185 1552668 1549071 1545728 1542302 1538153 1533175 1528073 1523626 1519742
59021 1519742 1515643 1510987 1506166 1501182 1494982 1486720 1477237 1468311 1460514 1452791 1444300 1435753 1428473 1422800
59007 1422800 1418029 1413531 1409342 1405676 1402169 1397744 1391374 1383164 1374509 1366842 1360341 1354329 1348655 1343943
$$ packed form
59102A416254j467K63Q86M68n19j552k359l143m163n025n013m358m338n565o894
59087A373475o854n612m577m562n330o515p811q458p776o352n523n409m641k467
59073A291588m6J077J030J248K600M652O631Q338R964J1482J2511J2807J2743
59060A376625J3031J3861J4651J4906J4950J5290J5616J5125J3731J2177J0978
59049A530941J0040R274Q763Q183O903M942L057J635K46j311k425k674k653l072
59035A571849l632l555k917k589k971l517l597l343l426m149m978n102m447l884
59021A519742m099m656m821m984o200q262r483q926p797p723q491q547p280n673
59007A422800m771m498m189l666l507m425o370q210q655p667o501o012n674m712
$$ plain form
58993 1343943 1340546 1338257 1337291 1338439 1341549 1344730 1345999 1345317 1344187 1343750 1344240 1345939 1349208 1353325 1356461
58978 1356461 1357657 1358164 1360051 1363778 1367851 1370794 1372774 1375066 1378465 1382719 1387434 1393007 1400428 1410385
58964 1410385 1422854 1437413 1453470 1470123 1486259 1501172 1514824 1527118 1537172 1543800 1546662 1546502
58952 1546502 1544288 1540554 1535676 1530306 1525298 1521493 1519628 1520052 1522325 1525456 1528815 1532533 1536788 1541165
58938 1541165 1545096 1548553 1551826 1554875 1557535 1560133 1563166 1566220 1567930 1567390 1565236 1563001 1561703 1561348
58924 1561348 1561594 1562517 1564815 1569522 1577397 1588274 1600917 1613773 1626080 1638353 1651849 1667481 1685075
58911 1685075 1703454 1721222 1737616 1752736 1766991 1780188 1791049 1797910 1800285 1799671 1798184 1796200
58899 1796200 1791960 1783903 1772700 1760281 1747481 1733706 1718582 1702657 1686317 1669170 1650970 1632339
$$ packed form
58993A343943l397k289r66J148L110L181J269o82j130m37M90J699L269M117L136
58978A356461J196N07J887L727M073K943J980K292L399M254M715N573P421R957
58964A410385J2469J4559J6057J6653J6136J4913J3652J2294J0054O628K862j60
58952A546502k214l734m878n370n008l805j865M24K273L131L359L718M255M377
58938A541165L931L457L273L049K660K598L033L054J710n40k154k235j298l55
58924A561348K46R23K298M707P875J0877J2643J2856J2307J2273J3496J5632J7594
58911A685075J8379J7768J6394J5120J4255J3197J0861O861K375o14j487j984
58899A796200m240q057j1203j2419j2800j3775j5124j5925j6340j7147j8200j8631
$$ plain form
58887 1632339 1614202 1597208 1581892 1568455 1556118 1543770 1531731 1521764 1514781 1509849 1506262 1505101
58875 1505101 1507274 1511133 1513883 1514743 1515021 1515483 1515595 1515305 1515652 1517145 1518975 1520297 1521093 1521431 1521122 1520507
58859 1520507 1520401 1520907 1521530 1522806 1526389 1532799 1540438 1547727 1555052 1563655 1573711 1584745 1597111 1611676
58845 1611676 1628379 1646182 1664269 1682489 1700822 1719163 1737479 1755665 1773432 1790602 1807182
58834 1807182 1823013 1838091 1853453 1870789 1890577 1911518 1932456 1953884 1976651 2000077 2022410
58823 2022410 2042525 2060250 2075683 2089206 2101441 2112210 2120366 2125871 2131063 2138134 2145928 2151079
58811 2151079 2152107 2150487 2147639 2142824 2134634 2123008 2108988 2093607 2077720 2061858 2045466 2027026
58799 2027026 2005584 1981741 1956901 1932218 1908387 1885553 1863112 1840354 1817610 1795982 1775843
$$ packed form
58887A632339j8137j6994j5316j3437j2337j2348j2039r967o983m932l587j161
58875A505101K173L859K750Q60K78M62J12k90L47J493J830J322P96L38l09o15
58859A520507j06N06O23J276L583O410P639P289P325Q603J0056J1034J2366J4565
58845A611676J6703J7803J8087J8220J8333J8341J8316J8186J7767J7170J6580
58834A807182J5831J5078J5362J7336J9788K0941K0938K1428K2767K3426K2333
58823B022410K0115J7725J5433J3523J2235J0769Q156N505N192P071P794N151
58811B151079J028j620k848m815q190j1626j4020j5381j5887j5862j6392j8440
58799B027026k1442k3843k4840k4683k3831k2834k2441k2758k2744k1628k0139
$$ plain form
58788 1775843 1756501 1737418 1718653 1699930 1680670 1661457 1644054 1629079 1614921 1599958 1584682
58777 1584682 1570389 1556863 1543060 1529525 1518325 1510518 1504988 1500032 1495067 1490526 1487005 1484870 1484078
58764 1484078 1484149 1484704 1486079 1488946 1493405 1498866 1504531 1509301 1511669 1510949 1508665 1507453 1508093 1508752 1507854 1506570
58748 1506570 1507257 1510065 1512517 1512437 1510022 1506674 1502871 1498014 1491772 1484666 1477428 1470581 1464796 1461025 1459749
58733 1459749 1460264 1461170 1461732 1462620 1465173 1469992 1476395 1483383 1490945 1500119 1511648 1524806 1537869 1549677
58719 1549677 1560601 1572019 1584964 1599030 1612348 1622785 1629579 1633709 1636267 1636732 1633555 1626382 1616808
58706 1616808 1606549 1595714 1583491 1569822 1555541 1541275 1527214 1513852 1502005 1491881 1482833
58695 1482833 1474239 1466086 1458462 1451040 1443475 1435979 1429184 1423644 1419662 1417336 1416524 1416887 1418169 1420412
$$ packed form
58788A775843j9342j9083j8765j8723j9260j9213j7403j4975j4158j4963j5276
58777A584682j4293j3526j3803j3535j1200p807n530m956m965m541l521k135p92
58764A484078P1N55J375K867M459N461N665M770K368p20k284j212O40O59q98j284
58748A506570O87K808K452q0k415l348l803m857o242p106p238o847n785l771j276
58733A459749N15R06N62Q88K553M819O403O988P562R174J1529J3158J3063J1808
58719A549677J0924J1418J2945J4066J3318J0437O794M130K558M65l177p173r574
58706A616808j0259j0835j2223j3669j4281j4266j4061j3362j1847j0124r048
58695A482833q594q153p624p422p565p496o795n540l982k326q12L63J282K243
$$ plain form
58681 1420412 1423770 1428202 1433378 1438819 1444141 1449256 1454352 1459599 1464927 1470192 1475510 1481296 1487955 1495411
58667 1495411 1502790 1508701 1512403 1514873 1518187 1523411 1529539 1535031 1539983 1545933 1553658 1562128 1569925 1576928
58653 1576928 1583884 1590589 1595205 1595732 1591929 1585381 1577514 1567930 1555215 1539151 1521204 1502467 1482108
58640 1482108 1458791 1433158 1407794 1384723 1363774 1343663 1323852 1304925 1287640 1272257 1258778
58629 1258778 1247329 1237960 1230103 1222702 1215249 1208428 1203134 1198959 1194510 1189336 1184631 1181649 1180292 1179727
58615 1179727 1179449 1179040 1177964 1176596 1176568 1178928 1182777 1186949 1192093 1199467 1208345 1216556 1223254 1229221 1234578
58600 1234578 1238334 1240291 1241111 1240004 1234762 1225286 1214946 1206781 1199906 1191453 1180811 1170064 1161026
58587 1161026 1153877 1148397 1144629 1142022 1139305 1135845 1132393 1130163 1129545 1129813 1129761 1128657 1126787 1124956 1123529
$$ packed form
58681A420412L358M432N176N441N322N115N096N247N328N265N318N786O659P456
58667A495411P379N911L702K470L314N224O128N492M952N950P725Q470P797P003
58653A576928O956O705M616N27l803o548p867r584j2715j6064j7947j8737k0359
58640A482108k3317k5633k5364k3071k0949k0111j9811j8927j7285j5383j3479
58629A258778j1449r369p857p401p453o821n294m175m449n174m705k982j357n65
58615A179727k78m09j076j368k8K360L849M172N144P374Q878Q211O698N967N357
58600A234578L756J957Q20j107n242r476j0340q165o875q453j0642j0747r038
58587A161026p149n480l768k607k717l460l452k230o18K68n2j104j870j831j427
$$ plain form
58572 1123529 1122486 1122276 1123520 1125420 1125713 1123179 1119381 1116889 1116450 1117071 1118252 1120681 1124772 1129793 1134641
58557 1134641 1138771 1142356 1146215 1151383 1157968 1164632 1170057 1174706 1180134 1186673 1192958 1197867 1201790 1205591
58543 1205591 1209446 1213332 1217759 1223171 1229091 1234643 1239622 1244456 1249361 1254261 1259464 1265726 1273435 1282264
58529 1282264 1291990 1303294 1317249 1334048 1352599 1371376 1389359 1406175 1421925 1437199 1452816
58518 1452816 1469021 1485143 1500347 1514392 1527334 1539179 1550691 1563907 1580527 1599896 1619901
58507 1619901 1639976 1661765 1686437 1712899 1739547 1766371 1794012 1821676 1847388 1869702 1887842
58496 1887842 1900719 1907441 1908909 1907518 1904842 1900477 1893464 1884041 1873575 1863302 1853451 1843296 1831874
58483 1831874 1818819 1804351 1788222 1769124 1745928 1719427 1692058 1665678 1640196 1614668 1589178
$$ packed form
58572A123529j043k10J244J900K93k534l798k492m39O21J181K429M091N021M848
58557A134641M130L585L859N168O585O664N425M649N428O539O285M909L923L801
58543A205591L855L886M427N412N920N552M979M834M905M900N203O262P709Q829
58529A282264R726J1304J3955J6799J8551J8777J7983J6816J5750J5274J5617
58518A452816J6205J6122J5204J4045J2942J1845J1512J3216J6620J9369K0005
58507A619901K0075K1789K4672K6462K6648K6824K7641K7664K5712K2314J8140
58496A887842J2877O722J468j391k676m365p013r423j0466j0273r851j0155j1422
58483A831874j3055j4468j6129j9098k3196k6501k7369k6380k5482k5528k5490
$$ plain form
58472 1589178 1565155 1543981 1525691 1509076 1492886 1476748 1460999 1446135 1432776 1421676 1412918
58461 1412918 1405159 1396725 1387745 1380209 1375367 1371976 1367900 1362709 1357686 1353834 1350920 1348369 1346225 1345215
58447 1345215 1346199 1349154 1352372 1353523 1352381 1351684 1354092 1358889 1363079 1365265 1366845 1369564 1373705 1378991
58433 1378991 1385507 1392938 1400381 1407921 1417223 1429462 1443519 1457425 1470905 1485271 1501265 1518328
58421 1518328 1535947 1554405 1573785 1593209 1611596 1628522 1643733 1656253 1664758 1668838 1669358 1667446
58409 1667446 1663524 1657483 1649557 1640734 1632463 1626042 1622013 1619830 1618369 1617168 1617065 1619274 1624008 1630595
58395 1630595 1638781 1649072 1661370 1673917 1684180 1690574 1693021 1692073 1687976 1680593 1670076 1657567 1645005
58382 1645005 1633790 1623578 1612971 1601604 1591087 1583602 1579851 1578587 1577733 1575855 1573151 1571393 1572501
$$ packed form
58472A589178k4023k1174j8290j6615j6190j6138j5749j4864j3359j1100q758
58461A412918p759q434q980p536m842l391m076n191n023l852k914k551k144j010
58447A345215R84K955L218J151j142o97K408M797M190K186J580K719M141N286
58433A378991O516P431P443P540R302J2239J4057J3906J3480J4366J5994J7063
58421A518328J7619J8458J9380J9424J8387J6926J5211J2520Q505M080N20j912
58409A667446l922o041p926q823q271o421m029k183j461j201j03K209M734O587
58395A630595Q186J0291J2298J2547J0263O394K447r48m097p383j0517j2509j2562
58382A645005j1215j0212j0607j1367j0517p485l751j264q54j878k704j758J108
$$ plain form
58369 1572501 1576835 1583107 1590023 1597354 1605189 1612896 1619433 1624395 1628287 1631954 1635748 1638882 1639649 1637030
58355 1637030 1632172 1627340 1623254 1618508 1611968 1604466 1597411 1590890 1584319 1578004 1572806 1568794 1565507 1563251
58341 1563251 1562993 1565102 1569115 1574616 1581442 1588998 1596175 1602187 1607206 1612230 1618447 1626315 1634952 1642865
58327 1642865 1649525 1655706 1662066 1668234 1673706 1678679 1683389 1687524 1691125 1695313 1701292 1709223 1718693 1729514
58313 1729514 1741364 1753456 1765331 1777249 1789261 1800966 1812900 1826865 1843749 1862086 1879851
58302 1879851 1896594 1912707 1927954 1942229 1956502 1971307 1985340 1997316 2008157 2019349 2030092
58291 2030092 2038416 2044521 2050652 2057790 2064797 2070999 2077582 2085979 2096447 2108660 2122467 2137952 2155707
58278 2155707 2176716 2200739 2225326 2247900 2268361 2288238 2307973 2326912 2345389 2364566 2384288
$$ packed form
58369A572501M334O272O916P331P835P707O537M962L892L667L794L134P67k619
58355A637030m858m832m086m746o540p502p055o521o571o315n198m012l287k256
58341A563251k58K109M013N501O826P556P177O012N019N024O217P868Q637P913
58327A642865O660O181O360O168N472M973M710M135L601M188N979P931R470J0821
58313A729514J1850J2092J1875J1918J2012J1705J1934J3965J6884J8337J7765
58302A879851J6743J6113J5247J4275J4273J4805J4033J1976J0841J1192J0743
58291B030092Q324O105O131P138P007O202O583Q397J0468J2213J3807J5485J7755
58278B155707K1009K4023K4587K2574K0461J9877J9735J8939J8477J9177J9722
$$ plain form
58267 2384288 2402973 2419545 2433812 2445357 2454191 2462267 2472153 2484147 2496710 2509604 2524315 2541457
58255 2541457 2560195 2580504 2603475 2628912 2655041 2681314 2709111 2738815 2768506 2796794 2825012
58244 2825012 2855304 2888005 2922027 2956466 2990826 3024810 3058787 3093547 3129136 3164885 3200753
58233 3200753 3237487 3275390 3314238 3354423 3396709 3440894 3486229 3533037 3582292 3633763 3686380
58222 3686380 3740298 3796696 3855768 3916988 3981135 4049820 4123007 4199219 4277988 4359812 4444058
58211 4444058 4529691 4618026 4711722 4810889 4913100 5017475 5125636 5238384 5354827 5475537
58201 5475537 5603230 5739198 5881895 6029883 6183296 6341804 6504448 6672446 6849061
58192 6849061 7035878 7232515 7440787 7665511 7910079 8174942 8461721 8775017 9118487
$$ packed form
58267B384288J8685J6572J4267J1545Q834Q076R886J1994J2563J2894J4711J7142
58255B541457J8738K0309K2971K5437K6129K6273K7797K9704K9691K8288K8218
58244B825012L0292L2701L4022L4439L4360L3984L3977L4760L5589L5749L5868
58233C200753L6734L7903L8848M0185M2286M4185M5335M6808M9255N1471N2617
58222C686380N3918N6398N9072O1220O4147O8685P3187P6212P8769Q1824Q4246
58211D444058Q5633Q8335R3696R9167J02211J04375J08161J12748J16443J20710
58201E475537J27693J35968J42697J47988J53413J58508J62644J67998J76615
58192F849061J86817J96637K08272K24724K44568K64863K86779L13296L43470
$$ plain form
58183 9118487 9492738 9898681 10339309 10816427 11329255 11878065 12465647 13093496 13760443
58174 13760443 14467133 15218292 16018703 16870629 17776827 18741982 19769260 20859668 22016801
58165 22016801 23247932 24558625 25950883 27428294 28997476 30662264 32422750 34283640
58157 34283640 36258223 38361055 40602736 42995489 45557572 48307634 51259518 54424033
58149 54424033 57805964 61393021 65157000 69077394 73164741 77461936 82034841 86970825
58141 86970825 92380474 98394723 105169255 112900054 121826402 132209366 144312704 158402705
58133 158402705 174735297 193511702 214857748 238881863 265738649 295513244 327811450
58126 327811450 361183557 392766339 418587243 434668167 438472479 429830349 410754714
$$ packed form
58183I118487L74251M05943M40628M77118N12828N48810N87582O27849O66947
58174A3760443P06690P51159Q00411Q51926R06198R65155J027278J090408J157133
58165B2016801J231131J310693J392258J477411J569182J664788J760486J860890
58157C4283640J974583K102832K241681K392753K562083K750062K951884L164515
58149E4424033L381931L587057L763979L920394M087347M297195M572905M935984
58141H6970825N409649O014249O774532P730799Q926348J0382964J2103338J4090001
58133A58402705J6332592J8776405K1346046K4024115K6856786K9774595L2298206
58126C27811450L3372107L1582782K5820904J6080924L804312q642130j9075635
$$ plain form
58119 410754714 384384848 353872916 321810228 290143924 260226792 232845405 208306705
58112 208306705 186608723 167588180 150984763 136480762 123762411 112565203 102672134
58105 102672134 93899536 86101096 79168090 73008083 67528233 62642586 58280336 54375973
58097 54375973 50860652 47671985 44764457 42102957 39653622 37387947 35288457 33342479
58089 33342479 31534658 29850455 28281115 26819596 25456180 24182444 22994357 21887020
58081 21887020 20851325 19880128 18972775 18128858 17341872 16603311 15908667 15255137 14637610
58072 14637610 14051539 13496105 12970275 12469279 11989202 11531649 11099353 10690047 10298967
58063 10298967 9924714 9568372 9229180 8905409 8597615 8306725 8030174 7763745 7506299
$$ packed form
58119D10754714k6369866l0511932l2062688l1666304k9917132k7381387k4538700
58112B08306705k1697982j9020543j6603417j4504001j2718351j1197208r893069
58105A02672134q772598p798440o933006o160007n479850m885647m362250l904363
58097E4375973l515321l188667k907528k661500k449335k265675k099490j945978
58089C3342479j807821j684203j569340j461519j363416j273736j188087j107337
58081B1887020j035695r71197r07353q43917p86986p38561o94644o53530o17527
58072A4637610n86071n55434n25830n00996m80077m57553m32296m09306l91080
58063A0298967l74253l56342l39192l23771l07794k90890k76551k66429k57446
$$ plain form
58054 7506299 7259478 7023677 6797325 6579362 6369770 6168260 5974507 5788731 5610223
58045 5610223 5436502 5265759 5098965 4938097 4783865 4636748 4498211 4368883 4247203
58036 4247203 4131872 4023796 3923588 3829115 3737952 3650654 3569122 3493144 3421070 3352718 3288995
58025 3288995 3229329 3171644 3114331 3056565 2997738 2938437 2881053 2827444 2776595 2726077 2675064
58014 2675064 2624544 2575690 2529449 2486544 2446251 2406349 2365886 2326826 2291318 2258653 2226715
58003 2226715 2195185 2165314 2137549 2111296 2086092 2061263 2035535 2008941 1983945 1962563 1943322
57992 1943322 1923236 1901802 1880684 1860326 1839658 1818754 1799057 1780765 1762361 1743187 1724561
57981 1724561 1707877 1693180 1679851 1667116 1653677 1638459 1622145 1606716 1593249 1581267 1570201
$$ packed form
58054G506299k46821k35801k26352k17963k09592k01510j93753j85776j78508
58045E610223j73721j70743j66794j60868j54232j47117j38537j29328j21680
58036D247203j15331j08076j00208r4473r1163q7298q1532p5978p2074o8352o3723
58025C288995n9666n7685n7313n7766n8827n9301n7384n3609n0849n0518n1013
58014B675064n0520m8854m6241m2905m0293l9902m0463l9060l5508l2665l1938
58003B226715l1530k9871k7765k6253k5204k4829k5728k6594k4996k1382j9241
57992A943322k0086k1434k1118k0358k0668k0904j9697j8292j8404j9174j8626
57981A724561j6684j4697j3329j2735j3439j5218j6314j5429j3467j1982j1066
$$ plain form
57970 1570201 1560055 1550503 1540687 1530217 1519272 1507613 1494729 1481180 1468593 1457967 1448883 1440573
57958 1440573 1432787 1425311 1417528 1408904 1399394 1389258 1379004 1369500 1361520 1355116 1349843 1345391 1341541
57945 1341541 1337970 1334739 1332601 1331994 1332115 1331797 1331091 1331170 1332919 1336341 1340993 1346219 1351310 1356221 1361610
57930 1361610 1367297 1371357 1372089 1370392 1368666 1367498 1365166 1360702 1355781 1352692 1351621 1351016 1349941 1348988 1349043
57915 1349043 1350049 1351187 1351846 1352091 1352346 1352908 1353892 1355413 1357428 1359429 1360634 1360461 1358572 1354674 1348848
57900 1348848 1341906 1334707 1327209 1319012 1310605 1302884 1295490 1287134 1277913 1269663 1263338 1257682 1251566 1246047
57886 1246047 1242603 1240597 1238299 1235557 1233807 1233976 1236002 1239973 1246069 1253520 1261050 1268326 1275834 1283519
57872 1283519 1290677 1296927 1302161 1305820 1307317 1306822 1304498 1299543 1291417 1281603 1272573 1265117 1258131 1250793
$$ packed form
57970A570201j0146r552r816j0470j0945j1659j2884j3549j2587j0626r084q310
57958A440573p786p476p783q624r510j0136j0254r504p980o404n273m452l850
57945A341541l571l231k138o07J21l18p06P9J749L422M652N226N091M911N389
57930A361610N687M060P32j697j726j168k332m464m921l089j071o05j075r53N5
57915A349043J006J138O59K45K55N62R84J521K015K001J205j73j889l898n826
57900A348848o942p199p498q197q407p721p394q356r221q250o325n656o116n519
57886A246047l444k006k298k742j750J69K026L971O096P451P530P276P508P685
57872A283519P158O250N234L659J497m95k324m955q126r814r030p456o986p338
$$ plain form
57858 1250793 1243338 1235772 1227651 1219452 1212640 1207956 1204879 1202947 1202191 1202067 1201498 1200519 1200504 1202177 1204531
57843 1204531 1206137 1206339 1204833 1201444 1196971 1193040 1190400 1188300 1186001 1183703 1181531 1179062 1176719 1176219
57829 1176219 1178360 1181298 1182312 1180754 1178299 1176843 1177028 1178293 1179438 1179510 1178932 1179337 1181637 1184816 1187349
57814 1187349 1189264 1191920 1196196 1201812 1208088 1214450 1220400 1225822 1231248 1237140 1243162 1248916 1255115 1263007
57800 1263007 1272579 1282277 1290843 1298590 1306347 1313746 1319373 1322546 1324241 1325912 1327722 1328455 1327106 1323990
57786 1323990 1319969 1315198 1309393 1303123 1297862 1294496 1292373 1290155 1287174 1283720 1280579 1278569 1278062 1278545
57772 1278545 1279044 1279280 1279962 1281546 1283178 1283420 1281830 1279497 1278217 1279372 1283115 1288201 1292950 1296797 1300520
57757 1300520 1304582 1307924 1309231 1308880 1308417 1308073 1306035 1300801 1293450 1286744 1282317 1279465 1276560 1272882 1268820
$$ packed form
57858A250793p455p566q121q199o812m684l077j932p56j24n69r79j5J673K354
57843A204531J606K02j506l389m473l931k640k100k299k298k172k469k343n00
57829A176219K141K938J014j558k455j456J85J265J145P2n78M05K300L179K533
57814A187349J915K656M276N616O276O362N950N422N426N892O022N754O199P892
57800A263007R572R698Q566P747P757P399N627L173J695J671J810P33j349l116
57786A323990m021m771n805o270n261l366k123k218k981l454l141k010n07M83
57772A278545M99K36O82J584J632K42j590k333j280J155L743N086M749L847L723
57757A300520M062L342J307l51m63l44k038n234p351o706m427k852k905l678m062
$$ plain form
57742 1268820 1264850 1260825 1256316 1251368 1246783 1243551 1241840 1240574 1238353 1235054 1232253 1231589 1232801 1233983
57728 1233983 1233904 1233462 1234480 1237535 1241590 1245392 1248434 1250546 1251381 1250832 1249663 1249269 1250670 1253774 1257480
57713 1257480 1260435 1261786 1261409 1259628 1256858 1253410 1249394 1244833 1240122 1236268 1234158 1233570 1233501 1233583 1234351 1235825
57697 1235825 1236811 1236426 1235581 1235914 1237834 1240667 1244293 1249250 1255293 1261178 1266212 1271045 1276616 1283114 1290088
57682 1290088 1296754 1302162 1306129 1309994 1315282 1321437 1326387 1329772 1333891 1340397 1347644 1352872 1355945 1359018
57668 1359018 1363073 1366797 1369051 1370695 1373302 1377131 1381110 1384141 1385870 1386633 1386996 1387047 1385998 1383000 1378487
57653 1378487 1374158 1371377 1370015 1369057 1367745 1365781 1363091 1360147 1358204 1358357 1360217 1362182 1363269 1364132 1365852
57638 1365852 1368319 1370590 1372599 1375379 1379215 1382534 1383474 1382120 1380314 1379594 1380259 1382276 1385891 1391024 1397013
$$ packed form
57742A268820l970m025m509m948m585l232j711j266k221l299k801o64J212J182
57728A233983p9m42J018L055M055L802L042K112Q35n49j169l94J401L104L706
57713A257480K955J351l77j781k770l448m016m561m711l854k110n88o9Q2P68J474
57697A235825R86l85q45L33J920K833L626M957O043N885N034M833N571O498O974
57682A290088O666N408L967L865N288O155M950L385M119O506P247N228L073L073
57668A359018M055L724K254J644K607L829L979L031J729P63L63N1j049k998m513
57653A378487m329k781j362r58j312j964k690k944j943J53J860J965J087Q63J720
57638A365852K467K271K009K780L836L319R40j354j806p20O65K017L615N133N989
$$ plain form
57623 1397013 1403457 1410560 1418301 1426109 1433931 1442813 1453710 1466458 1480749 1497485 1518143 1543220
57611 1543220 1572371 1605840 1644629 1689048 1737700 1787539 1833912 1870774 1892440 1896177 1882922
57600 1882922 1855616 1817677 1773109 1726678 1682695 1643578 1609748 1580505 1554823 1531936 1511730
57589 1511730 1494463 1480053 1468065 1458269 1450464 1443696 1436680 1429324 1422827 1417727 1413027 1408082 1404138
57576 1404138 1402591 1402515 1401558 1398962 1396072 1394023 1392598 1391580 1391379 1391599 1390572 1387466 1383714 1381129 1379500
57561 1379500 1377336 1374338 1371726 1370389 1369966 1369615 1368551 1365814 1360832 1354553 1349115 1345993 1345118 1345911 1348090
57546 1348090 1350956 1352888 1352589 1350457 1347963 1345874 1343809 1341489 1339647 1339199 1339765 1339560 1337129 1333122 1329864
57531 1329864 1328920 1329517 1329813 1329214 1328601 1328582 1328689 1328510 1328460 1328916 1329455 1329619 1329662 1329718 1328901 1326159 1321728 1316795 1311908
$$ packed form
57623A397013O444P103P741P808P822Q882J0897J2748J4291J6736K0658K5077
57611A543220K9151L3469L8789M4419M8652M9839M6373L6862K1666L737j3255
57600A882922k7306l7939m4568m6431m3983l9117l3830k9243k5682k2887k0206
57589A511730j7267j4410j1988r796p805o768p016p356o497n100m700m945l944
57576A404138j547p6r57k596k890k049j425j018k01K20j027l106l752k585j629
57561A379500k164k998k612j337m23l51j064k737m982o279n438l122q75P93K179
57546A348090K866J932k99k132k494k089k065k320j842m48N66k05k431m007l258
57531A329864r44N97K96n99o13j9J07j79n0M56N39J64M3N6q17k742m431m933m887
$$ plain form
57512 1311908 1306602 1300674 1295059 1291170 1289704 1290200 1291487 1292554 1293123 1293346 1293052 1291881 1290267 1289470 1289994
57497 1289994 1290690 1290229 1288847 1287744 1287326 1287246 1287791 1289719 1292647 1294981 1295836 1295845 1295632 1294747 1292875 1291090 1290880
57480 1290880 1292548 1295471 1299405 1304552 1310561 1316334 1320868 1323755 1325024 1325072 1324718 1324750 1325330 1326184 1327273 1328878
57464 1328878 1331106 1333773 1336795 1340241 1343968 1347631 1351208 1355078 1359365 1363595 1367385 1371143 1375492 1380035
57450 1380035 1383470 1385275 1386649 1389002 1391877 1393424 1393112 1392842 1394637 1398030 1400721 1401413 1400986 1401079 1402535
57435 1402535 1405308 1408807 1411983 1413885 1414637 1415303 1416457 1417478 1417541 1416658 1415254 1413412 1411231 1409504 1409246
57420 1409246 1410604 1412710 1414548 1415633 1416062 1416344 1417182 1419055 1421950 1425513 1429267 1432650 1435310 1437675 1440833
57405 1440833 1445346 1450398 1454600 1457523 1460030 1463079 1466556 1469354 1470424 1469790 1468695 1468694 1470462 1473494 1476884
$$ packed form
57512A311908n306n928n615l889j466M96J287J067N69K23k94j171j614p97N24
57497A289994O96m61j382j103m18q0N45J928K928K334Q55Rk13q85j872j785k10
57480A290880J668K923L934N147O009N773M534K887J269M8l54L2N80Q54J089J605
57464A328878K228K667L022L446L727L663L577L870M287M230L790L758M349M543
57450A380035L435J805J374K353K875J547l12k70J795L393K691O92m27R3J456
57435A402535K773L499L176J902P52O66J154J021O3q83j404j842k181j727k58
57420A409246J358K106J838J085M29K82Q38J873K895L563L754L383K660K365L158
57405A440833M513N052M202K923K507L049L477K798J070o34j095jJ768L032L390
$$ plain form
57390 1476884 1480133 1483123 1485765 1488061 1490355 1493207 1496975 1501573 1506493 1511050 1514950 1518718 1523189 1528389
57376 1528389 1533341 1537251 1540484 1544020 1548338 1553255 1558511 1563898 1569003 1573469 1577554 1581971 1587046 1592301
57362 1592301 1596924 1600561 1603693 1607389 1612393 1618269 1623678 1627755 1630918 1634027 1637243 1640296 1643424 1647087
57348 1647087 1650796 1653172 1653565 1653022 1653301 1655365 1659141 1664179 1669974 1675828 1680929 1684674 1686851 1687817 1688762
57333 1688762 1691403 1696740 1703907 1710635 1715067 1717030 1717642 1718161 1719450 1722070 1726191 1731323 1736650 1741862
57319 1741862 1747351 1753460 1759992 1766800 1774420 1783446 1793458 1803223 1811997 1820066 1827964 1835844 1843869 1852474
57305 1852474 1861782 1871229 1880361 1889563 1899398 1909549 1919153 1928081 1937092 1946578 1955819 1963842 1970636 1977197
57291 1977197 1984623 1993374 2003134 2013092 2022470 2031010 2039014 2046901 2054794 2062515 2069763 2076335 2082494 2089208
$$ packed form
57390A476884L249K990K642K296K294K852L768M598M920M557L900L768M471N200
57376A528389M952L910L233L536M318M917N256N387N105M466M085M417N075N255
57362A592301M623L637L132L696N004N876N409M077L163L109L216L053L128L663
57348A647087L709K376L93n43K79K064L776N038N795N854N101L745K177R66R45
57333A688762K641N337P167O728M432J963O12N19J289K620M121N132N327N212
57319A741862N489O109O532O808P620R026J0012R765Q774Q069P898P880Q025Q605
57305A852474R308R447R132R202R835J0151R604Q928R011R486R241Q023O794O561
57291A977197P426Q751R760R958R378Q540Q004P887P893P721P248O572O159O714
$$ plain form
57277 2089208 2097581 2107725 2118448 2128494 2137909 2147762 2158635 2170054 2181552 2193570 2206800 2221022
57265 2221022 2235190 2248475 2260659 2271704 2281633 2290974 2300680 2311344 2322851 2334899 2347261 2359314
57253 2359314 2369996 2378820 2386520 2394171 2401974 2409325 2415813 2421689 2427747 2435188 2445104 2457367 2470276
57240 2470276 2482154 2493106 2504541 2517222 2530757 2544968 2560581 2578178 2597264 2616857 2636441
57229 2636441 2655913 2675076 2693550 2710975 2727234 2742890 2759243 2777181 2795866 2813340 2828616
57218 2828616 2842338 2854990 2865514 2872487 2876007 2877508 2878020 2877379 2874945 2870537 2864794 2859144 2855276 2854150
57204 2854150 2855596 2859131 2864815 2872826 2882530 2892721 2902885 2913737 2926264 2940460 2955273 2969769
57192 2969769 2984203 2999677 3016647 3034139 3050860 3066705 3082406 3097902 3112142 3124779 3137020
$$ packed form
57277B089208Q373J0144J0723J0046R415R853J0873J1419J1498J2018J3230J4222
57265B221022J4168J3285J2184J1045R929R341R706J0664J1507J2048J2362J2053
57253B359314J0682Q824P700P651P803P351O488N876O058P441R916J2263J2909
57240B470276J1878J0952J1435J2681J3535J4211J5613J7597J9086J9593J9584
57229B636441J9472J9163J8474J7425J6259J5656J6353J7938J8685J7474J5276
57218B828616J3722J2652J0524O973L520J501N12o41k434m408n743n650l868j126
57204B854150J446L535N684Q011R704J0191J0164J0852J2527J4196J4813J4496
57192B969769J4434J5474J6970J7492J6721J5845J5701J5496J4240J2637J2241
$$ plain form
57181 3137020 3150070 3163490 3175900 3186775 3196707 3206238 3215435 3224633 3234744 3246463 3259535 3273116
57169 3273116 3286811 3301226 3317388 3335498 3354461 3373004 3391075 3409424 3427842 3444798 3459247
57158 3459247 3471960 3484319 3496562 3508183 3519654 3532602 3548164 3566033 3585438 3606476 3630117
57147 3630117 3657191 3687669 3720898 3756354 3794081 3834384 3877236 3922167 3968562 4015802 4063268
57136 4063268 4110609 4157928 4205246 4251863 4296774 4339572 4380354 4418927 4455060 4489372 4522764
57125 4522764 4554687 4583162 4607020 4627040 4644260 4658433 4669173 4677595 4685464 4693328 4700728 4707828
57113 4707828 4715663 4724991 4736126 4749844 4767270 4788470 4811836 4835043 4855986 4872685 4882999 4884990
57101 4884990 4877427 4859819 4832148 4794834 4748965 4696568 4640470 4583776 4529447 4480270 4438517
$$ packed form
57181C137020J3050J3420J2410J0875R932R531R197R198J0111J1719J3072J3581
57169C273116J3695J4415J6162J8110J8963J8543J8071J8349J8418J6956J4449
57158C459247J2713J2359J2243J1621J1471J2948J5562J7869J9405K1038K3641
57147C630117K7074L0478L3229L5456L7727M0303M2852M4931M6395M7240M7466
57136D063268M7341M7319M7318M6617M4911M2798M0782L8573L6133L4312L3392
57125D522764L1923K8475K3858K0020J7220J4173J0740Q422P869P864P400P100
57113D707828P835R328J1135J3718J7426K1200K3366K3207K0943J6699J0314J991
57101D884990p563j7608k7671l7314m5869n2397n6098n6694n4329m9177m1753
$$ plain form
57090 4438517 4404987 4378664 4358085 4342958 4333864 4330833 4333270 4341123 4355023 4375286 4401727 4434261
57078 4434261 4472304 4513585 4554915 4594212 4630274 4660600 4681367 4690084 4686521 4670281 4638938 4588935
57066 4588935 4516298 4415485 4279048 4099210 3868241 3576850 3214291 2771054 2239829 1613535
57056 1613535 884831 48111 -900920 -1968974 -3165772 -4500261 -5979880 -7615628 -9424000
57047 -9424000 -11419898 -13607885 -15979508 -18513353 -21174185 -23916418 -26693941 -29465843
57039 -29465843 -32190999 -34820748 -37299601 -39569143 -41569461 -43245430 -44560478 -45500494
57031 -45500494 -46054505 -46188193 -45834911 -44905468 -43306493 -40969842 -37891786 -34160066 -29964642
57022 -29964642 -25630837 -21680804 -18819048 -17723130 -18703558 -21489285 -25333275 -29356108
$$ packed form
57090D438517l3530k6323k0579j5127r094l031K437P853J3900K0263K6441L2534
57078D434261L8043M1281M1330L9297L6062L0326K0767Q717l563j6240l1343n0003
57066D588935p2637j00813j36437j79838k30969k91391l62559m43237n31225o26294
57056A613535p28704D8111i00920j068054j196798j334489j479619j635748j808372
57047i424000j995898k187987k371623k533845k660832k742233k777523k771902
57039b9465843k725156k629749k478853k269542k000318j675969j315048r40016
57031d5500494n54011j33688L53282R29443J598975K336651L078056L731720M195424
57022b9964642M333805L950033K861756J095918r80428k785727l843990m022833
$$ plain form
57014 -29356108 -32866912 -35489982 -37121781 -37825956 -37736699 -36999015 -35757972 -34177751 -32444204
57005 -32444204 -30730563 -29156347 -27773678 -26577048 -25516412 -24512325 -23480165 -22354366
56997 -22354366 -21098009 -19700018 -18171529 -16542820 -14855783 -13154754 -11481691 -9873750
56989 -9873750 -8358948 -6953078 -5662246 -4487219 -3424423 -2466085 -1603487 -829980 -139609
56979 475370 1023507 1512125 1948357 2340803 2698321 3028511 3338991 3638384 3933835 4228692
56969 4228692 4524364 4823190 5127839 5439387 5757302 6078541 6393332 6683566 6929981
56960 6929981 7122934 7266038 7371131 7452122 7522100 7591505 7666215 7747653 7834874 7925807 8017390
56949 8017390 8106662 8192139 8272998 8347252 8412305 8467125 8512106 8546644 8568736 8577599 8575191 8564361
$$ packed form
57014b9356108l510804k623070j631799p04175Q9257P37684J241043J580221J733547
57005c2444204J713641J574216J382669J196630J060636J004087J032160J125799
56997b2354366J256357J397991J528489J628709J687037J701029J673063J607941
56989i873750J514802J405870J290832J175027J062796R58338Q62598P73507a39609
56979D75370N48137M88618M36232L92446L57518L30190L10480K99393K95451K94857
56969D228692K95672K98826L04649L11548L17915L21239L14791K90234K46415
56960F929981J92953J43104J05093Q0991O9978O9405P4710Q1438Q7221R0933R1583
56949H017390Q9272Q5477Q0859P4254O5053N4820M4981L4538K2092Q863k408j0830
$$ plain form
56937 8564361 8546621 8522461 8492721 8458549 8420591 8379281 8335940 8292961 8252707 8216239 8183085
56926 8183085 8152217 8123110 8095370 8067053 8033954 7991534 7937661 7873099 7799507 7717673 7627800
56915 7627800 7530733 7428343 7322879 7216236 7109746 7004394 6901084 6800596 6703248 6608612
56905 6608612 6515602 6422918 6329686 6235902 6141975 6047555 5951090 5851162 5748071 5643300 5537179
56894 5537179 5427813 5312714 5191095 5064341 4934773 4804407 4674694 4547077 4423643
56885 4423643 4306790 4197651 4094979 3996342 3900404 3807313 3717031 3628705 3542313 3459774 3383423
56874 3383423 3313994 3251000 3194432 3144818 3101478 3061493 3020706 2975582 2924504 2868025 2808020
56863 2808020 2746221 2683343 2619511 2555142 2491170 2428642 2368366 2310678 2255196 2201025 2147547
$$ packed form
56937H564361j7740k4160k9740l4172l7958m1310m3341m2979m0254l6468l3154
56926H183085l0868k9107k7740k8317l3099m2420n3873o4562p3592q1834q9873
56915G627800r7067j02390j05464j06643j06490j05352j03310j00488r7348r4636
56905F608612r3010r2684r3232r3784r3927r4420r6465r9928j03091j04771j06121
56894E537179j09366j15099j21619j26754j29568j30366j29713j27617j23434
56885D423643j16853j09139j02672r8637r5938r3091r0282q8326q6392q2539p6351
56874C383423o9429o2994n6568m9614m3340l9985m0787m5124n1078n6479o0005
56863B808020o1799o2878o3832o4369o3972o2528o0276n7688n5482n4171n3478
$$ plain form
56852 2147547 2095053 2044403 1996218 1950537 1907153 1866123 1827952 1793205 1761774 1732588 1704225
56841 1704225 1675715 1646701 1617317 1588392 1561322 1536909 1514411 1492493 1471158 1452004 1436639
56830 1436639 1425610 1418837 1416144 1417127 1421298 1428554 1438731 1450593 1462166 1472231 1480484 1486055 1487265
56817 1487265 1483644 1477117 1470258 1464079 1458288 1452845 1448284 1445175 1444401 1447553 1455901 1469025 1485260 1503464
56803 1503464 1523783 1546957 1573648 1604314 1638644 1674410 1707159 1731607 1743998 1743654 1732580 1713653
56791 1713653 1689396 1662471 1636390 1614504 1598226 1587104 1580615 1578869 1581686 1588558 1600179 1618742
56779 1618742 1645770 1680585 1721758 1769022 1822627 1881502 1942999 2003512 2057890 2098922 2119511
56768 2119511 2116389 2091535 2050217 1998320 1941095 1882902 1827171 1776481 1732615 1696436 1668020
$$ packed form
56852B147547n2494n0650m8185m5681m3384m1030l8171l4747l1431k9186k8363
56841A704225k8510k9014k9384k8925k7070k4413k2498k1918k1335j9154j5365
56830A436639j1029o773k693R83M171P256J0177J1862J1573J0065Q253N571J210
56817A487265l621o527o859o179n791n443m561l109p74L152Q348J3124J6235J8204
56803A503464K0319K3174K6691L0666L4330L5766L2749K4448J2391l44j1074j8927
56791A713653k4257k6925k6081k1886j6278j1122o489j746K817O872J1621J8563
56779A618742K7028L4815M1173M7264N3605N8875O1497O0513N4378M1032K0589
56768B119511l122k4854m1318n1897n7225n8193n5731n0690m3866l6179k8416
$$ plain form
56757 1668020 1647245 1633958 1627499 1626756 1631274 1641779 1659026 1682604 1711403 1744578 1781030 1818112
56745 1818112 1851499 1876246 1887811 1883065 1861655 1826585 1782865 1735478 1688444 1644707 1605702
56734 1605702 1571199 1540326 1512824 1489117 1469747 1455253 1445919 1441003 1438895 1438887 1442215 1450508 1463665
56721 1463665 1479826 1496483 1510570 1518514 1517950 1509219 1494065 1473413 1447883 1419774 1392370 1367036
56709 1367036 1342766 1318937 1296738 1277255 1259849 1243530 1228700 1216304 1206086 1196862 1188134 1180442
56697 1180442 1174222 1169119 1164422 1159691 1154845 1149896 1144788 1139591 1134759 1130742 1127089 1122478 1116227 1109293
56683 1109293 1103056 1097633 1092443 1087999 1085616 1085201 1084829 1083119 1080820 1079348 1078759 1078085 1076920 1075700 1074784
56668 1074784 1074115 1073537 1072804 1071486 1069510 1067668 1066971 1067542 1068598 1069495 1070324 1071379 1072450 1073035 1073106 1073257 1073846
$$ packed form
56757A668020k0775j3287o459p43M518J0505J7247K3578K8799L3175L6452L7082
56745A818112L3387K4747J1565m746k1410l5070m3720m7387m7034m3737l9005
56734A605702l4503l0873k7502k3707j9370j4494r334m916k108qL328Q293J3157
56721A463665J6161J6657J4087P944n64q731j5154k0652k5530k8109k7404k5334
56709A367036k4270k3829k2199j9483j7406j6319j4830j2396j0218r224q728p692
56697A180442o220n103m697m731m846m949n108n197m832m017l653m611o251o934
56683A109293o237n423n190m444k383m15l72j710k299j472n89o74j165j220r16
56668A074784o69n78p33j318j976j842o97N71J056Q97Q29J055J071N85P1J51N89
$$ plain form
56651 1073846 1074228 1073373 1071354 1069694 1069846 1071655 1073736 1075018 1075346 1074897 1073799 1072347 1070912 1069507 1067909
56636 1067909 1066250 1064995 1064400 1064504 1065579 1067830 1070517 1072130 1071851 1070299 1068455 1066370 1063448 1059680 1055929
56621 1055929 1052943 1050619 1048489 1046665 1045801 1046037 1046521 1046405 1045977 1046165 1047140 1048259 1049378 1051092 1053353 1054815
56605 1054815 1054233 1051681 1047931 1043521 1039146 1035860 1033940 1032387 1030515 1029061 1028719 1028760 1028510 1028933 1030847
56590 1030847 1032591 1031845 1029219 1027508 1027495 1027111 1025056 1022623 1021134 1019996 1018531 1017588 1017918 1018617 1018595 1018034
56574 1018034 1017138 1015032 1011497 1008265 1006810 1006053 1004137 1001377 999422 998219 996051 992394 988806 986925
56560 986925 987120 989078 992085 994633 995274 994244 992997 992006 990446 988269 986982 987491 988428 987758 985310 982685
56544 982685 981091 980172 978831 976445 973231 969979 967635 966821 967511 969181 971330 973819 976679 979660 982186
$$ packed form
56651A073846L82q55k019j660J52J809K081J282L28m49j098j452j435j405j598
56636A067909j659j255n95J04J075K251K687J613k79j552j844k085k922l768l751
56621A055929k986k324k130j824q64K36M84j16m28J88R75J119J119J714K261J462
56605A054815n82k552l750m410m375l286j920j553j872j454l42M1k50M23J914
56590A030847J744p46k626j711j3l84k055k433j489j138j465r43L30O99k2n61
56574A018034q96k106l535l232j455p57j916k760j955j203k168l657l588j881
56560I86925J95J958L007K548O41j030j247r91j560k177j287N09R37o70k448k625
56544I82685j594r19j341k386l214l252k344q14O90J670K149K489K860K981K526
$$ plain form
56529 982186 983859 984825 985320 985026 983372 980575 977801 976020 975162 974698 974582 975144 976431 978234 980625 983897
56513 983897 988004 992363 996246 999270 1001715 1004529 1008671 1014105 1019742 1024726 1029565 1035574 1043324 1052000
56499 1052000 1060198 1067094 1072914 1078472 1084136 1089183 1092381 1093331 1092898 1092140 1091181 1089414 1086531 1083034 1079847
56484 1079847 1077626 1076228 1074819 1072754 1070326 1068208 1066258 1063641 1060260 1057153 1054939 1052665 1048923 1043600
56470 1043600 1037861 1032850 1029181 1027218 1026891 1027168 1026534 1024198 1020483 1016031 1011051 1005430 999290 993196 987743
56455 987743 982908 978015 972727 967819 964347 962034 959293 954985 949343 943007 936326 930141 926051 924819
56441 924819 925217 925486 925305 925261 925034 923490 920460 917227 915122 914487 914964 915975 916835 917129 917062 916969 916724 916263
56423 916263 916288 917482 919177 919825 918783 916719 914281 911430 908273 905421 903039 900352 896699 892569 889065
$$ packed form
56529I82186J673R66M95k94j654k797k774j781q58m64j16N62J287J803K391L272
56513I83897M107M359L883L024K445K814M142N434N637M984M839O009P750Q676
56499A052000Q198O896N820N558N664N047L198R50m33p58r59j767k883l497l187
56484A079847k221j398j409k065k428k118j950k617l381l107k214k274l742n323
56470A043600n739n011l669j963l27K77o34k336l715m452m980n621o140o094n453
56455I87743m835m893n288m908l472k313k741m308n642o336o681o185m090j232
56441I24819L98K69j81m4k27j544l030l233k105o35M77J011Q60K94o7r3k45m61
56423I16263K5J194J695O48j042k064k438k851l157k852k382k687l653m130l504
$$ plain form
56408 889065 886728 885318 884370 883586 882876 882305 881974 881858 881901 882225 883135 884900 887542 890620 893258 894845 895852
56391 895852 897277 898986 899433 897697 894974 893152 892653 892771 893391 894768 895922 895047 891847 888025 885057
56376 885057 882767 880565 878769 877985 878218 879360 881635 884878 888128 890600 892303 893203 892820 891435 890611
56361 890611 891343 892442 892052 890291 889107 889731 891565 893572 895487 897323 898674 899097 898570 897229 895174
56346 895174 892895 891306 890890 891149 891300 891241 891325 891403 890700 888873 886764 885706 886178 887521 889067 891094 894228
56329 894228 898004 900665 900730 898530 895887 894446 894591 895788 897301 898331 897999 895985 893302 891789 892266
56314 892266 893427 893228 891432 890084 891073 893789 895859 895928 894881 894304 894623 895233 895908 897298 899921 903215
56298 903215 905954 907594 908912 911053 914010 916444 917289 917157 917615 919140 920480 920401 919513 919740 922105 925639
$$ packed form
56408H89065k337j410r48p84p10n71l31j16M3L24R10J765K642L078K638J587J007
56391H95852J425J709M47j736k723j822m99J18O20J377J154q75l200l822k968
56376H85057k290k202j796p84K33J142K275L243L250K472J703R00l83j385q24
56361H90611P32J099l90j761j184O24J834K007J915J836J351M23n27j341k055
56346H95174k279j589m16K59J51n9Q4P8p03j827k109j058M72J343J546K027L134
56329H94228L776K661O5k200k643j441J45J197J513J030l32k014k683j513M77
56314H92266J161j99j796j348R89K716K070O9j047n77L19O10O75J390K623L294
56298I03215K739J640J318K141K957K434Q45j32M58J525J340p9q88K27K365L534
$$ plain form
56282 925639 928649 930586 932276 934606 937562 940621 943543 946438 949357 952252 955198 958198 960860 962691
56268 962691 963746 964600 965692 967112 969052 971881 975543 979355 982679 985437 987851 990129 992650 995940
56254 995940 1000081 1004513 1008744 1012856 1017051 1021223 1025479 1030568 1037171 1044949 1052774 1059796 1066068 1072490
56240 1072490 1080377 1090617 1102724 1115051 1126257 1136302 1145926 1155970 1167578 1182019 1199315 1217681
56228 1217681 1235269 1252072 1269294 1287476 1306342 1326022 1346983 1368839 1390470 1411490 1432599
56217 1432599 1454386 1476852 1500365 1526046 1554716 1586060 1619211 1653701 1689768 1728248 1770104
56206 1770104 1815459 1863263 1912703 1964860 2021962 2084946 2152837 2224841 2301932 2385731 2476684
56195 2476684 2574215 2678300 2790056 2910810 3040899 3179414 3324934 3476516 3633899 3796728
$$ packed form
56282I25639L010J937J690K330K956L059K922K895K919K895K946L000K662J831
56268I62691J055Q54J092J420J940K829L662L812L324K758K414K278K521L290
56254I95940M141M432M231M112M195M172M256N089O603P778P825P022O272O422
56240A072490P887J0240J2107J2327J1206J0045R624J0044J1608J4441J7296J8366
56228A217681J7588J6803J7222J8182J8866J9680K0961K1856K1631K1020K1109
56217A432599K1787K2466K3513K5681K8670L1344L3151L4490L6067L8480M1856
56206A770104M5355M7804M9440N2157N7102O2984O7891P2004P7091Q3799R0953
56195B476684R7531J04085J11756J20754J30089J38515J45520J51582J57383J62829
$$ plain form
56185 3796728 3963751 4132768 4300745 4463648 4616904 4756814 4881059 4987220 5071677 5131183
56175 5131183 5165025 5174248 5159033 5118465 5053005 4965658 4860294 4740134 4608335 4468648 4324501
56164 4324501 4177962 4030094 3881728 3733777 3587654 3445600 3309732 3180510 3057044
56155 3057044 2938943 2826759 2720552 2619544 2523632 2433732 2349964 2270974 2195956 2125976
56145 2125976 2062153 2003837 1949858 1900445 1856267 1816334 1778566 1742143 1707928 1676729 1648458
56134 1648458 1622953 1600325 1580280 1562160 1545956 1532450 1521966 1513571 1505936 1498620 1492163 1487060
56122 1487060 1482975 1479083 1475020 1471177 1467916 1465072 1462762 1462214 1464742 1470034 1476536 1483643 1492255 1502833
56108 1502833 1514268 1525460 1536806 1549136 1562227 1575618 1590166 1607281 1626879 1647403 1667952
$$ packed form
56185C796728J67023J69017J67977J62903J53256J39910J24245J06161Q4457N9506
56175E131183L3842R223j5215m0568o5460q7347j05364j20160j31799j39687j44147
56164D324501j46539j47868j48366j47951j46123j42054j35868j29222j23466
56155C057044j18101j12184j06207j01008r5912q9900q3768p8990p5018o9980
56145B125976o3823n8316n3979m9413m4178l9933l7768l6423l4215l1199k8271
56134A648458k5505k2628k0045j8120j6204j3506j0484q395p635p316o457n103
56122A487060m085l892m063l843l261k844k310n48K528N292O502P107Q612J0578
56108A502833J1435J1192J1346J2330J3091J3391J4548J7115J9598K0524K0549
$$ plain form
56097 1667952 1689329 1712714 1738201 1765146 1793504 1824327 1858900 1897546 1939550 1984493 2033474
56086 2033474 2088572 2151226 2221782 2300613 2388664 2486504 2593532 2708463 2829670 2954237
56076 2954237 3077215 3192752 3296188 3385215 3459932 3522441 3575892 3622892 3664338 3699434 3726436
56065 3726436 3743546 3749970 3746578 3735274 3717633 3694272 3664890 3627821 3579811 3517641 3440438 3349712
56053 3349712 3247589 3136560 3020942 2906471 2797392 2695171 2600625 2515633 2441603 2377693
56043 2377693 2322110 2274321 2234668 2202458 2175685 2152423 2131732 2113641 2098825 2087774 2079841
56032 2079841 2073815 2069661 2068602 2070994 2075340 2080127 2085451 2092080 2100025 2108912 2118714 2129353 2140607
56019 2140607 2152970 2167321 2183162 2198779 2213983 2231016 2251652 2275068 2299707 2325361 2351949
$$ packed form
56097A667952K1377K3385K5487K6945K8358L0823L4573L8646M2004M4943M8981
56086B033474N5098O2654P0556P8831Q8051R7840J07028J14931J21207J24567
56076B954237J22978J15537J03436Q9027P4717O2509N3451M7000M1446L5096K7002
56065C726436J7110O424l392j1304j7641k3361k9382l7069m8010o2170p7203r0726
56053C349712j02123j11029j15618j14471j09079j02221r4546q4992p4030o3910
56043B377693n5583m7789l9653l2210k6773k3262k0691j8091j4816j1051p933
56032B079841o026m154j059K392M346M787N324O629P945Q887R802J0639J1254
56019B140607J2363J4351J5841J5617J5204J7033K0636K3416K4639K5654K6588
$$ plain form
56008 2351949 2378250 2403861 2430859 2461253 2493990 2526501 2558138 2589903 2621797 2652715 2682438
55997 2682438 2711641 2740346 2768216 2796060 2825398 2856773 2889682 2923586 2957940 2992252 3027303
55986 3027303 3065064 3106109 3148613 3191455 3236576 3286326 3340188 3396440 3455334 3518100 3584338
55975 3584338 3653344 3726629 3805854 3889153 3972721 4055638 4140224 4228242 4319768 4415210 4515193
55964 4515193 4618511 4723244 4830016 4941579 5059462 5183784 5315865 5457768 5609269
55955 5609269 5768375 5935029 6111529 6299355 6498596 6710587 6938130 7182934 7445780
55946 7445780 7729278 8037505 8372862 8736166 9129659 9556499 10017147 10509721 11034408
55937 11034408 11594475 12192681 12829901 13507574 14228314 14994037 15806819 16671596 17594446
$$ packed form
56008B351949K6301K5611K6998L0394L2737L2511L1637L1765L1894L0918K9723
55997B682438K9203K8705K7870K7844K9338L1375L2909L3904L4354L4312L5051
55986C027303L7761M1045M2504M2842M5121M9750N3862N6252N8894O2766O6238
55975C584338O9006P3285P9225Q3299Q3568Q2917Q4586Q8018R1526R5442R9983
55964D515193J03318J04733J06772J11563J17883J24322J32081J41903J51501
55955E609269J59106J66654J76500J87826J99241K11991K27543K44804K62846
55946G445780K83498L08227L35357L63304L93493M26840M60648M92574N24687
55937A1034408N60067N98206O37220O77673P20740P65723Q12782Q64777R22850
$$ plain form
55928 17594446 18578060 19622406 20729760 21905341 23153511 24477892 25885047 27382880
55920 27382880 28974882 30661088 32445642 34338767 36351022 38491547 40773390 43214892
55912 43214892 45833761 48644111 51659096 54888485 58330284 61971656 65804993 69844650
55904 69844650 74132580 78737324 83750845 89280577 95442931 102370923 110229361 119215249
55896 119215249 129542498 141435151 155137526 170925094 189115186 210092506 234316194
55889 234316194 262207808 293841404 328480189 364145389 397499143 424314457 440575061
55882 440575061 443804075 433904261 413013070 384540044 352045947 318508802 286057135
55875 286057135 255975961 228842789 204749174 183536873 164952708 148706892 134498588
$$ packed form
55928A7594446R83614J044346J107354J175581J248170J324381J407155J497833
55920B7382880J592002J686206J784554J893125K012255K140525K281843K441502
55912D3214892K618869K810350L014985L229389L441799L641372L833337M039657
55904F9844650M287930M604744N013521N529732O162354O927992P858438Q985888
55896A19215249J0327249J1892653J3702375J5787568J8190092K0977320K4223688
55889B34316194K7891614L1633596L4638785L5665200L3353754K6815314J6260604
55882D40575061L229014r899814k0891191k8473026l2494097l3537145l2451667
55875B86057135l0081174k7133172k4093615k1212301j8584165j6245816j4208304
$$ plain form
55868 134498588 122046987 111109518 101476680 92966186 85427111 78737437 72790124 67486017
55860 67486017 62739456 58480021 54643927 51169260 48001513 45097558 42422149 39946213
55852 39946213 37650316 35523794 33556841 31735919 30046883 28477591 27015965 25649708
55844 25649708 24369534 23169483 22043402 20984839 19991004 19062695 18198919 17394709 16644939
55835 16644939 15946571 15295872 14686817 14113876 13573787 13063461 12578828 12117145 11678224
55826 11678224 11262212 10867830 10493333 10137194 9797391 9471904 9160026 8861123 8572241
55817 8572241 8289547 8012311 7742771 7481800 7227626 6979408 6739016 6508062 6285889
55808 6285889 6071855 5867143 5672585 5486575 5306832 5132830 4965204 4804138 4649625
$$ packed form
55868A34498588j2451601j0937469r632838q510494p539075o689674n947313n304107
55860F7486017m746561m259435l836094l474667l167747k903955k675409k475936
55852C9946213k295897k126522j966953j820922j689036j569292j461626j366257
55844B5649708j280174j200051j126081j058563r93835r28309q63776q04210p49770
55835A6644939o98368o50699o09055n72941n40089n10326m84633m61683m38921
55826A1678224m16012l94382l74497l56139l39803l25487l11878k98903k88882
55817H572241k82694k77236k69540k60971k54174k48218k40392k30954k22173
55808F285889k14034k04712j94558j86010j79743j74002j67626j61066j54513
$$ plain form
55799 4649625 4502060 4361338 4226346 4096319 3971801 3853492 3741089 3634082 3532801
55790 3532801 3437876 3349168 3265718 3186261 3109668 3035452 2963855 2894854 2827491 2761132 2696812
55779 2696812 2635942 2578134 2521842 2466838 2414208 2364082 2315453 2268507 2224995 2185571 2148565
55768 2148565 2112360 2077410 2044882 2014468 1984601 1954098 1922921 1892001 1862679 1835584 1809908
55757 1809908 1784588 1760130 1738096 1718864 1701285 1684587 1669138 1655066 1641730 1629086 1618167
55746 1618167 1609657 1603231 1598682 1596308 1595684 1595465 1594926 1594251 1592756 1588509 1580604 1570339 1559117 1546563
55732 1546563 1531824 1515411 1498388 1480771 1462155 1443249 1425481 1409603 1395695 1383872 1373753
55721 1373753 1363780 1352509 1340642 1330840 1325366 1324590 1327681 1333936 1343140 1355092 1369049 1383426 1395725
$$ packed form
55799D649625j47565j40722j34992j30027j24518j18309j12403j07007j01281
55790C532801r4925q8708q3450p9457p6593p4216p1597o9001o7363o6359o4320
55779B696812o0870n7808n6292n5004n2630n0126m8629m6946m3512l9424l7006
55768B148565l6205l4950l2528l0414k9867l0503l1177l0920k9322k7095k5676
55757A809908k5320k4458k2034j9232j7579j6698j5449j4072j3336j2644j0919
55746A618167q510o426m549k374o24k19n39o75j495m247p905j0265j1222j2554
55732A546563j4739j6413j7023j7617j8616j8906j7768j5878j3908j1823j0119
55721A373753r973j1271j1867r802n474p76L091O255R204J1952J3957J4377J2299
$$ plain form
55708 1395725 1402688 1400997 1388771 1366960 1338825 1307574 1274931 1242357 1212389 1187199 1166393 1147932
55696 1147932 1131089 1116807 1105106 1094104 1082175 1069488 1056757 1044070 1031782 1020980 1011909
55685 1011909 1003164 993739 984834 978311 974059 970088 964698 957490 948654 938427 927179 915360 903485
55672 903485 892523 883749 877633 873211 868977 863991 857981 851187 844545 839192 835094 830795 825046 818130
55658 818130 811220 805312 801297 800195 802447 807471 814365 822355 830108 835658 837738 836471 832257 825111
55644 825111 815799 806337 798096 790293 781546 772077 763070 754709 746418 738551 732165 727260 722751 718318
55630 718318 714897 713034 711892 710401 708552 706999 705914 704842 703618 703043 704390 708009 712697 716960
55616 716960 720630 724303 727330 727875 725527 722402 720595 719756 718413 716563 715294 714587 713256 710844 708076
$$ packed form
55708A395725O963j691j2226k1811k8135l1251l2643l2574k9968k5190k0806j8461
55696A147932j6843j4282j1701j1002j1929j2687j2731j2687j2288j0802r071
55685A011909q745r425q905o523m252l971n390p208q836j0227j1248j1819j1875
55672I03485j0962q774o116m422m234m986o010o794o642n353m098m299n749o916
55658H18130o910n908m015j102K252N024O894P990P753N550K080j267m214p146
55644H25111r312r462q241p803q747r469r007q361q291p867o386m905m509m433
55630G18318l421j863j142j491j849j553j085j072j224n75J347L619M688M263
55616G16960L670L673L027N45k348l125j807q39j343j850j269p07j331k412k768
$$ plain form
55601 708076 705556 703364 701884 701709 702606 703574 703841 702976 700536 696945 694288 694460 696436 696929 694048 688883
55585 688883 683292 677763 672015 666090 659864 652614 644093 635243 627079 619659 612822 607013 602462 598234
55571 598234 593240 587902 583961 582650 583480 584725 584733 583013 580383 578049 576490 575448 574685 574054 572889 570172
55555 570172 565586 559811 553780 548351 544566 542952 542224 539959 535318 530022 525916 522753 519466 516528
55541 516528 515359 515833 515978 514238 510882 507117 503909 501780 500638 499373 496486 491674 486266 481732 478317
55526 478317 475561 473555 473047 474392 476894 479310 480923 482090 483680 485927 488082 489440 490442 492279
55512 492279 495566 499964 504982 510392 515655 519851 522728 525223 528191 530905 531570 529203 524391 518255
55498 518255 511489 504671 498709 494278 491083 488271 485538 483331 481886 480558 478336 474806 470475 466387
$$ packed form
55601G08076k520k192j480j75Q97R68K67q65k440l591k657J72J976M93k881n165
55585F88883n591n529n748n925o226p250q521q850q164p420o837n809m551m228
55571E98234m994n338l941j311Q30J245Qj720k630k334j559j042p63o31j165k717
55555E70172m586n775o031n429l785j614p28k265m641n296m106l163l287k938
55541E16528j169M74J45j740l356l765l208k129j142j265k887m812n408m534l415
55526D78317k756k006n08J345K502K416J613J167J590K247K155J358J002J837
55512D92279L287M398N018N410N263M196K877K495K968K714O65k367m812o136
55498E18255o766o818n962m431l195k812k733k207j445j328k222l530m331m088
$$ plain form
55484 466387 463609 462783 463807 465933 468407 470982 473649 476032 477413 477350 475920 473257 469249 463944 457939
55469 457939 452031 446656 441974 438357 436245 435412 434803 433369 430990 428444 426608 425722 425190 424010 421663
55454 421663 418744 416412 415062 413938 412409 411036 410643 410740 410017 408473 407853 409320 411671 412834 412479 412010
55438 412010 412282 412603 412137 411065 409791 407928 404951 401425 398755 397776 398118 398913 399660 400398 401467 403208
55422 403208 405567 407834 408996 408574 407108 405711 405131 405286 405607 405636 405145 403950 402037 399914 398337 397403
55406 397403 396263 394093 391041 387851 384960 382522 380965 380624 380855 380362 378597 376282 374414 373480 373710
55391 373710 375149 377015 377791 376703 374583 372749 371544 370536 369590 368983 368812 369032 369773 370865 371249 369764
55375 369764 366625 363516 362087 362788 365091 368223 371534 374683 377665 380446 382577 383533 383408 382916 382701
$$ packed form
55484D66387k778q26J024K126K474K575K667K383J381o3j430k663m008n305o005
55469D57939n908n375m682l617k112q33o09j434k379k546j836q86n32j180k347
55454D21663k919k332j350j124j529j373l93R7p23j544o20J467K351J163l55m69
55438D12010K72L21m66j072j274j863k977l526k670r79L42P95P47P38J069J741
55422D03208K359K267J162m22j466j397n80J55L21K9m91j195j913k123j577r34
55406C97403j140k170l052l190k891k438j557l41K31m93j765k315j868r34K30
55391C73710J439J866P76j088k120j834j205j008r46o07j71K20P41J092L84j485
55375C69764l139l109j429P01K303L132L311L149K982K781K131R56j25m92k15
$$ plain form
55360 382701 382954 383691 384958 386722 388858 391250 393566 395059 395103 394090 393301 393555 394161 393476 390445 385515
55344 385515 380166 375648 372132 369025 365950 363194 361184 359853 358733 357460 356032 354807 354449 355539
55330 355539 357917 360620 362744 364057 364479 363407 360289 355661 351035 347712 346121 346163 347489 349217 349990
55315 349990 348861 346140 343186 341246 340367 339427 337348 334263 331223 328859 326919 325206 324119 323739 323120
55300 323120 321391 319122 317735 317802 318677 319576 320173 320267 319795 319203 319054 319235 319211 318967 318911 318959 318607 317901 317354
55281 317354 316896 315957 314686 313884 313476 312380 310470 309373 310370 312615 314516 315940 317725 319656 320428 319451
55265 319451 317420 315115 312883 311484 312149 315143 319161 322803 326017 329371 332422 333828 333041 331136 329647
55250 329647 329091 328884 328282 326915 324728 322067 319827 318914 319301 320063 320573 321117 321978 322563 322123 321001 320377
$$ packed form
55360C82701K53P37J267J764K136K392K316J493M4j013p89K54O06o85l031m930
55344C85515n349m518l516l107l075k756k010j331j120j273j428j225l58J090
55330C55539K378K703K124J313M22j072l118m628m626l323j591M2J326J728P73
55315C49990j129k721k954j940q79r40k079l085l040k364j940j713j087l80o19
55300C23120j729k269j387O7Q75Q99N97R4m72n92j49J81k4k44n6M8l52p06n47
55281C17354m58r39j271q02m08j096j910j097R97K245J901J424J785J931P72r77
55265C19451k031k305k232j399O65K994M018L642L214L354L051J406p87j905j489
55250C29647n56k07o02j367k187k661k240r13L87P62N10N44Q61N85m40j122o24
$$ plain form
55233 320377 320946 322507 324624 326820 328271 328367 327711 327558 327882 327062 324042 319861 316293 313810 311917 310798
55217 310798 311275 313172 314992 315603 315466 315740 316716 317686 318066 318071 318171 318229 317510 315664 313553 312730 313873 315880
55199 315880 316746 315445 312839 310753 310249 310866 311397 311152 310239 308917 307306 305889 305623 306890 308701 309616
55183 309616 309274 308352 307269 305847 304351 303832 304877 306614 307501 306774 304883 302968 302213 303163 305202 306981
55167 306981 307753 308014 308606 309606 310381 310296 309010 306547 303549 301151 300145 300326 300952 301578 302260 303255 304739
55150 304739 306504 307749 307629 306308 305042 304898 305713 306516 306425 304969 302272 299410 297897 298180 299079 299251
55134 299251 298699 298265 298221 298189 297990 297746 297320 296392 294958 293254 291566 290554 291152 293301 295341 295692 294825
55117 294825 294519 295436 296623 297294 297798 298620 299651 300863 302642 304864 306528 307032 307136 307968 309512 310697
$$ packed form
55233C20377N69J561K117K196J451R6o56j53L24q20l020m181l568k483j893j119
55217C10798M77J897J820O11j37K74R76R70L80NJ00N8p19j846k111q23J143K007
55199C15880Q66j301k606k086n04O17N31k45r13j322j611j417k66J267J811R15
55183C09616l42r22j083j422j496n19J045J737Q87p27j891j915p55R50K039J779
55167C06981P72K61N92J000P75q5j286k463k998k398j006J81O26O26O82R95J484
55150C04739J765J245j20j321j266j44Q15Q03r1j456k697k862j513K83Q99J72
55134B99251n52m34m4l2j99k44m26r28j434j704j688j012N98K149K040L51q67
55117B94825l06R17J187O71N04Q22J031J212J779K222J664N04J04Q32J544J185
$$ plain form
55101 310697 310696 309583 308019 306785 306476 307116 307974 308037 306861 305011 303734 303958 305342 306449 306154 304778 303508
55084 303508 302938 302729 302509 302294 301914 300832 298911 296767 294946 293262 291384 289677 288972 289721 291690 294178
55068 294178 296249 297124 296863 296421 296664 297483 298283 298988 299962 301006 301237 300259 298964 298703 299824 301423 302455
55051 302455 302657 302291 301431 299995 298409 297750 298907 301694 304912 307272 308261 308322 308294 308604 308919 308705 308059
55034 308059 307782 308592 310417 312464 313770 313817 312951 312198 312217 312538 312335 311847 312137 313316 314059 313461 312397 312205
55016 312205 312844 313379 313602 313953 314200 313639 312539 312171 313136 314674 315827 316319 316005 314503 311923 309190 307059
54999 307059 305352 303662 302284 301943 302880 304548 305999 306469 305974 305504 306152 307905 309648 310405 310106 309184
54983 309184 308125 307615 308337 310160 311959 312651 312196 311376 310897 310821 310548 309415 307628 306386 306505 307182 306921
$$ packed form
55101C10697jj113j564j234l09O40Q58O3j176j850j277K24J384J107k95j376j270
55084C03508n70k09k20k15l80j082j921k144j821j684j878j707p05P49J969K488
55068B94178K071Q75k61m42K43Q19Q00P05R74J044K31r78j295k61J121J599J032
55051C02455K02l66q60j436j586o59J157K787L218K360R89O1k8L10L15k14o46
55034C08059k77Q10J825K047J306M7q66p53J9L21k03m88K90J179P43n98j064j92
55016C12205O39N35K23L51K47n61j100l68R65J538J153M92l14j502k580k733k131
54999C07059j707j690j378l41R37J668J451M70m95m70O48J753J743P57k99r22
54983C09184j059n10P22J823J799O92m55q20m79p6k73j133j787j242J19O77k61
$$ plain form
54966 306921 305476 303882 302699 301500 300202 299541 299751 300093 300237 300811 301859 302162 301074 299708 299067 298305
54950 298305 296413 294604 295026 297540 299729 299999 298977 297822 296934 296824 298554 302386 306967 310677 313046
54935 313046 314391 314843 314457 313702 313171 313092 313400 313863 313944 313133 311766 310986 311481 312730 313791 314293 314238 313365
54917 313365 311341 308375 305240 302808 301781 302510 304669 307321 309537 310817 310941 310020 309037 309633 312553
54902 312553 316512 319279 319868 319083 318023 316943 315938 315962 318176 322258 326102 327676 326931 325561 325057 325464
54886 325464 325965 326016 325550 324586 323160 321591 320366 319745 319707 320066 320329 319827 318607 318031 319665 323359 327174
54869 327174 329516 330901 333205 337712 344300 352117 360408 368782 377221 385883 394624 402670 408970 412841
54855 412841 414184 413267 410495 406260 400723 393913 386241 378725 372329 367141 362508 357918 353465 349445
$$ packed form
54966C06921j445j594j183j199j298o61K10L42J44N74J048L03j088j366o41p62
54950B98305j892j809M22K514K189K70j022j155q88j10J730L832M581L710K369
54935C13046J345M52l86p55n31p9L08M63Q1q11j367p80M95J249J061N02n5q73
54917C13365k024k966l135k432j027P29K159K652K216J280J24r21r83N96K920
54902C12553L959K767N89p85j060j080j005K4K214M082L844J574p45j370n04M07
54886C25464N01N1m66r64j426j569j225o21l8L59K63n02j220n76J634L694L815
54869C27174K342J385K304M507O588P817Q291Q374Q439Q662Q741Q046O300L871
54855D12841J343r17k772m235n537o810p672p516o396n188m633m590m453m020
$$ plain form
54841 349445 345953 343083 341252 340933 341925 343037 342838 341064 339235 339418 342116 345635 347843 348239 348009 348507
54825 348507 350296 353401 357570 362214 366898 372193 379194 387748 395965 402273 407334 412861 418836 423053
54811 423053 423585 420724 416103 410803 404940 398437 391353 383673 375515 367533 360596 355077 350846 347800
54797 347800 345824 344154 341479 337121 331832 327002 323283 320364 317929 316161 315059 313860 311812 309353
54783 309353 307743 307347 307041 305816 304284 303683 303810 303079 300636 297341 294362 291884 289751 288413 288394 289517
54767 289517 291480 294466 298286 301584 303102 303316 303523 303566 301935 298281 294389 292073 291189 290398 289070 287737
54751 287737 287194 287716 288778 289278 288595 287671 288309 291093 294781 298113 301269 304850 308304 310432 310971 310765
54735 310765 310667 311062 312204 314044 315760 316197 315023 313112 311805 312013 313744 316116 318009 319071 319880 321030
$$ packed form
54841C49445l492k870j831l19R92J112j99j774j829J83K698L519K208L96k30M98
54825C48507J789L105M169M644M684N295P001Q554Q217O308N061N527N975M217
54811D23053N32k861m621n300n863o503p084p680q158p982o937n519m231l046
54797C47800j976j670k675m358n289m830l719k919k435j768j102j199k048k459
54783C09353j610l96l06j225j532o01J27p31k443l295k979k478k133j338j9J123
54767B89517J963K986L820L298J518K14K07M3j631l654l892k316q84p91j328j333
54751B87737n43N22J062N00o83r24O38K784L688L332L156L581L454K128N39k06
54735C10765r8L95J142J840J716M37j174j911j307K08J731K372J893J062Q09J150
$$ plain form
54719 321030 322639 325053 329114 334925 341046 346037 350428 356030 363420 371287 378423 385223 392770 401130
54705 401130 409106 415265 418964 420698 421614 422406 422618 421306 418257 414149 409607 404622 398870 392090 384268
54690 384268 375975 368472 362794 358662 354896 351037 347959 346698 347098 347802 347350 345388 343166 342616 344406
54675 344406 347112 348925 349808 351044 353017 354861 356476 359397 364857 372078 379441 386568 394148 402112
54661 402112 409115 413865 416255 416994 416539 414597 410574 404464 397197 389810 382393 374253 365163 355965 347905
54646 347905 341939 338627 337878 338482 338743 337991 336793 335369 332911 329283 326357 326212 328313 329757 328426
54631 328426 324999 321727 320036 319647 319359 318313 316748 315662 315536 315493 314150 311206 307730 304884 302852
54616 302852 301153 299441 297775 296360 295347 294715 294284 293909 293704 293879 294292 294338 293347 291164 288362 285909
$$ packed form
54719C21030J609K414M061N811O121M991M391N602P390P867P136O800P547Q360
54705D01130P976O159L699J734R16P92K12j312l049m108m542m985n752o780p822
54690C84268q293p503n678m132l766l859l078j261M00P04m52j962k222n50J790
54675C44406K706J813Q83J236J973J844J615K921N460P221P363P127P580P964
54661D02112P003M750K390P39m55j942m023o110p267p387p417q140r090r198q060
54646C47905n966l312p49O04K61p52j198j424k458l628k926j45K101J444j331
54631C28426l427l272j691l89k88j046j565j086j26m3j343k944l476k846k032
54616C02852j699j712j666j415j013o32m31l75k05J75M13M6r91k183k802k453
$$ plain form
54600 285909 284457 283960 284184 285443 288242 292013 294891 295348 293680 291347 289228 287253 285479 284524 284672
54585 284672 285315 285746 286134 287266 289422 291764 292924 292230 290466 289270 289595 290889 291971 292342 292198 291511
54569 291511 289948 287774 286098 285750 286355 286933 287081 287269 288175 290046 292458 294420 294968 294166 293453 294470
54553 294470 297239 299847 300332 298854 297570 298212 300200 301643 301833 301920 303000 304472 304944 304122 302905 301885
54537 301885 300746 299162 297405 295736 293909 291744 289716 288482 288132 288314 288839 289763 291064 292624 294478
54522 294478 296719 299114 301004 301700 300987 299397 298019 297855 299134 301176 302913 303566 302972 301498 299574
54507 299574 297192 294070 290573 288198 288433 291082 294282 296412 297507 298575 300083 301571 302394 302453 302399 303364
54491 303364 306174 310489 314893 318002 319244 318704 317061 315856 316747 319690 322665 324084 324674 325817 326951
$$ packed form
54600B85909j452m97K24J259K799L771K878M57j668k333k119j975j774r55J48
54585B84672O43M31L88J132K156K342J160o94j764j196L25J294J082L71j44o87
54569B91511j563k174j676l48O05N78J48J88R06J871K412J962N48q02p13J017
54553B94470K769K608M85j478j284O42J988J443J90Q7J080J472M72q22j217j020
54537C01885j139j584j757j669j827k165k028j234l50J82N25R24J301J560J854
54522B94478K241K395J890O96p13j590j378j64J279K042J737O53n94j474j924
54507B99574k382l122l497k375K35K649L200K130J095J068J508J488Q23N9n4R65
54491C03364K810M315M404L109J242n40j643j205Q91K943K975J419N90J143J134
$$ plain form
54476 326951 326426 324590 323885 325383 327140 326905 324901 322688 320617 318019 315095 312876 311628 310749 310209
54461 310209 310702 312251 313823 314560 314489 313877 312902 312228 312883 315074 317797 319925 321002 320818 319209 316751
54445 316751 314705 313650 312955 312202 312160 313391 314642 313998 311405 308906 308266 309293 310663 311519 311856 311958
54429 311958 312050 312356 313132 314601 316852 319756 322994 326197 328983 330907 331767 332011 332347 332750 332480 331493 331180
54412 331180 332945 336437 339937 342243 343434 344017 344259 344411 344726 345088 345230 345470 346482 348147 349269 348874
54396 348874 347317 345752 344797 344103 343089 341804 340905 340695 340350 338522 334964 331083 328510 327529 327260 326729
54380 326729 325221 322398 319055 317087 317439 318618 318589 317655 317714 318954 319441 318324 317195 317321 317535 316282
54364 316282 314185 312986 313187 314378 316838 320850 325013 327127 326766 325520 324784 324624 324812 325625 327306 329621
$$ packed form
54476C26951n25j836p05J498J757k35k004k213k071k598k924k219j248q79n40
54461C10209M93J549J572P37p1o12r75o74O55K191K723K128J077j84j609k458
54445C16751k046j055o95p53m2J231J251o44k593k499o40J027J370Q56L37J02
54429C11958R2L06P76J469K251K904L238L203K786J924Q60K44L36M03k70r87l13
54412C31180J765L492L500K306J191N83K42J52L15L62J42K40J012J665J122l95
54396C48874j557j565r55o94j014j285q99k10l45j828l558l881k573r81k69n31
54380C26729j508k823l343j968L52J179k9r34N9J240M87j117j129J26K14j253
54364C16282k097j199K01J191K460M012M163K114l61j246p36j60J88Q13J681K315
$$ plain form
54348 329621 332126 334183 334978 334430 333829 334597 336569 338591 340509 343157 346336 348417 348540 348049 348969 351861
54332 351861 355743 359420 362258 364059 364745 364107 361900 358588 355734 354873 355988 357852 359737 361796 363762
54317 363762 364591 363932 362917 362886 364167 366613 370324 374956 379137 381584 382462 382829 383105 382866 381912 380866
54301 380866 380668 381816 383826 385192 384324 381039 376808 373215 370605 368618 367221 366500 365967 365042 363906
54286 363906 362952 361644 358936 354913 351008 348332 346541 344738 342737 340888 339188 337336 335552 334683 335290
54271 335290 336941 338591 339481 339432 338397 336202 333019 329837 328006 328160 329742 331561 332642 332721 332310 332296
54255 332296 333080 334135 334744 335031 335566 335998 335058 332329 329127 326891 325392 323505 321280 320059 320506 321570
54239 321570 321881 321522 321854 323811 326778 329200 330139 330165 330601 332018 333809 335279 336563 338059 339440 339973
$$ packed form
54348C29621K505K057P95n48o01P68J972K022J918K648L179K081J23m91R20K892
54332C51861L882L677K838J801O86o38k207l312k854q61J115J864J885K059J966
54317C63762Q29o59j015l1J281K446L711M632M181K447Q78L67K76k39r54j046
54301C80866j98J148K010J366q68l285m231l593k610j987j397p21n33r25j136
54286C63906r54j308k708m023l905k676j791j803k001j849j700j852j784q69O07
54271C35290J651J650Q90m9j035k195l183l182j831J54J582J819J081P9m11j4
54255C32296P84J055O09K87N35M32r40k729l202k236j499j887k225j221M47J064
54239C21570L11l59L32J957K967K422R39K6M36J417J791J470J284J496J381N33
$$ plain form
54223 339973 339531 338625 337525 336126 334745 334256 335042 336331 336946 336450 335310 334220 333457 332748 331647 330221
54207 330221 329287 329636 331089 332756 334226 335921 338266 341113 344129 346977 348854 348832 347353 346531 347944
54192 347944 350623 352339 352522 352545 353099 352888 350649 347288 344878 344204 344357 344379 344257 344356 344815 345612 346411 346270
54174 346270 344326 341122 338522 337796 338310 338534 337853 336903 336542 337101 338293 339262 338964 337161 334951 333641
54158 333641 333158 332268 330481 328934 328970 330373 331665 331930 331786 332458 334238 336093 336634 335308 332673 329881
54142 329881 328097 328159 330068 332608 334037 333703 332690 332371 332704 332588 331670 330942 331477 333288 335575 337461
54126 337461 338279 337901 337190 337501 339267 341529 343258 344559 346046 347595 348482 348414 347613 346135 344038 342276
54110 342276 342331 344437 346806 347341 345836 343884 342767 342206 341301 339879 338264 336198 333035 329128 326057
$$ packed form
54223C39973m42r06j100j399j381m89P86J289O15m96j140j090p63p09j101j426
54207C30221r34L49J453J667J470J695K345K847L016K848J877k2j479q22J413
54192C47944K679J716J83K3N54k11k239l361k410o74J53K2j22R9M59P97P99j41
54174C46270j944l204k600p26N14K24o81r50l61N59J192R69k98j803k210j310
54158C33641m83q90j787j547L6J403J292K65j44O72J780J855N41j326k635k792
54142C29881j784O2J909K540J429l34j013l19L33j16r18p28N35J811K287J886
54126C37461Q18l78p11L11J766K262J729J301J487J549Q87o8q01j478k097j762
54110C42276N5K106K369N35j505j952j117n61r05j422j615k066l163l907l071
$$ plain form
54095 326057 324932 325189 325781 326900 329295 332175 333347 331952 329901 329726 331743 334247 335930 337028 338267
54080 338267 339757 341157 342215 342815 343019 343300 344300 346012 347511 347937 347595 347676 348845 350478 351580 352163
54064 352163 353224 355398 358275 361324 364771 368854 372703 375026 375837 376405 377270 377363 375559 372224 368578
54049 368578 365358 362867 361508 361181 360622 358535 355325 352809 352232 353321 355201 357220 358777 359320 359014
54034 359014 358863 359714 361402 363071 364042 364298 364430 365172 366639 368057 368630 368618 369042 370419 372363 374401 376399
54017 376399 378003 378537 377998 377612 378751 381612 385444 389709 394359 399133 403321 406391 408321 409076 408317
54002 408317 406211 404257 404425 407094 410332 411882 411657 411689 413703 417512 421895 426076 429835 433106 436358
53987 436358 440865 447592 456043 464966 473779 482270 489398 494008 497048 501576 509710 520504 531510 541550
$$ packed form
54095C26057j125K57N92J119K395K880J172j395k051j75K017K504J683J098J239
54080C38267J490J400J058O00K04K81J000J712J499M26l42Q1J169J633J102N83
54064C52163J061K174K877L049L447M083L849K323Q11N68Q65R3j804l335l646
54049C68578l220k491j359l27n59k087l210k516n77J089J880K019J557N43l06
54034C59014j51Q51J688J669R71K56J32P42J467J418N73j2M24J377J944K038J998
54017C76399J604N34n39l86J139K861L832M265M650M774M188L070J930P55p59
54002D08317k106j954J68K669L238J550k25L2K014L809M383M181L759L271L252
53987D36358M507O727Q451Q923Q813Q491P128M610L040M528Q134J0794J1006J0040
$$ plain form
53973 541550 551075 560668 570487 580772 591626 602214 611193 618218 624264 630167 635518 639461 642056
53960 642056 644242 646651 648922 650127 649468 646534 641384 634703 627624 620916 614367 607358 600077 593533
53946 593533 587980 581948 573739 563839 554928 549079 545508 541628 535926 529276 523557 519581 516540 513175
53932 513175 509249 505831 504203 504533 505771 506740 507063 507046 507209 508247 510977 515521 520426 523166 522014 517376
53916 517376 511151 504928 499022 493057 487060 481643 477269 473724 470516 467649 465709 465039 465054 464673 463590
53901 463590 462794 463549 465881 468507 470382 471880 474120 477492 481329 484832 487719 490139 492624 496153 501481
53886 501481 508151 514844 521015 527488 535102 543555 552123 560700 569239 576829 582531 586952 591906 598358
53872 598358 605533 612221 618246 624372 631277 638928 646825 654847 663885 675145 688394 701510 712587
$$ packed form
53973E41550R525R593R819J0285J0854J0588Q979P025O046N903N351L943K595
53960F42056K186K409K271J205o59k934n150o681p079o708o549p009p281o544
53946E93533n553o032q209r900q911n849l571l880n702o650n719l976l041l365
53932E13175l926l418j628L30J238R69L23j7J63J038K730M544M905K740j152m638
53916E17376o225o223n906n965n997n417m374l545l208k867j940o70J5l81j083
53901D63590p96P55K332K626J875J498K240L372L837L503K887K420K485L529N328
53886E01481O670O693O171O473P614Q453Q568Q577Q539P590N702M421M954O452
53872E98358P175O688O025O126O905P651P897Q022R038J1260J3249J3116J1077
$$ plain form
53859 712587 722112 732139 743665 755999 768560 781816 796050 810458 824211 837554 851006 863954
53847 863954 874705 881722 884669 884743 884166 884529 885182 883815 879029 871755 863810 855907 847725 839152 830448
53832 830448 821474 811705 800978 789607 777723 765009 751203 736506 721382 706210 691302 677227
53820 677227 664888 654861 646490 638188 629133 620156 612225 604570 595524 585026 574871 566236 558429
53807 558429 550609 543389 537775 533559 529784 526040 522432 518920 515536 512527 509483 505047 498496 491047
53793 491047 484746 480541 478114 476628 474698 470774 465111 460671 460273 463140 465821 466327 465675 465354 465162
53778 465162 464128 462114 459648 457143 454957 453494 452702 452104 451581 451429 451439 450879 449714 448990 449537 451096
53762 451096 453214 456167 460354 465435 470784 476302 482078 487595 492034 495294 498178 501486 505327 509533
$$ packed form
53859G12587R525J0027J1526J2334J2561J3256J4234J4408J3753J3343J3452J2948
53847H63954J0751P017K947P4n77L63O53j367m786p274p945p903q182q573q704
53832H30448q974r769j0727j1371j1884j2714j3806j4697j5124j5172j4908j4075
53820F77227j2339j0027q371q302r055q977p931p655r046j0498j0155q635p807
53807E58429p820p220n614m216l775l744l608l512l384l009l044m436o551p449
53793D91047o301m205k427j486j930l924n663m440l98K867K681N06o52l21j92
53778D65162j034k014k466k505k186j463p92n98n23j52J0n60j165p24N47J559
53762D51096K118K953M187N081N349N518N776N517M439L260K884L308L841M206
$$ plain form
53748 509533 514549 521425 530535 540462 548945 555289 561185 568592 577524 586732 595858 605562 615832 625544
53734 625544 633856 640943 647318 653566 660698 669234 677599 682960 684413 684107 684369 684866 683552 679344 672728
53719 672728 664569 655640 646834 638675 630753 622471 614055 606085 598423 590498 582290 574147 565898 557157
53705 557157 548461 541172 536035 532360 528664 523797 517640 511228 505926 501953 498031 493103 488017 484730
53691 484730 483994 484680 485219 484799 483186 480413 477081 474250 472560 471774 471332 470930 470408 469629 468752 468286 468550
53674 468550 469293 469965 470205 470059 469994 470687 472487 475060 477673 479626 480273 479207 477097 475854 476961 479770
53658 479770 482505 484871 488244 492922 496853 498308 498629 500660 504945 509305 512204 514750 518662 523805
53644 523805 528915 533793 539215 545089 550242 554304 558521 564135 570849 577568 583882 589980 595598 600095
$$ packed form
53748E09533N016O876R110R927Q483O344N896P407Q932R208R126R704J0270R712
53734F25544Q312P087O375O248P132Q536Q365N361J453l06K62M97j314m208o616
53719F72728q159q929q806q159p922q282q416p970p662p925q208q143q249q741
53705E57157q696p289n137l675l696m867o157o412n302l973l922m928n086l287
53691D84730p36O86N39m20j613k773l332k831j690p86m42m02n22p79q77m66K64
53674D68550P43O72K40j46o5O93J800K573K613J953O47j066k110j243J107K809
53658D79770K735K366L373M678L931J455L21K031M285M360K899K546L912N143
53644E23805N110M878N422N874N153M062M217N614O714O719O314O098N618M497
$$ plain form
53630 600095 603400 606053 608308 609996 611289 612725 614112 614240 612193 608585 604976 602399 600762 599323
53616 599323 597393 594922 592836 592473 594251 597144 599802 601890 603854 605739 606886 606698 605245 603247 601890
53601 601890 602344 604689 607392 608613 608228 607892 608930 610885 612477 613234 613478 613282 612375 611007 610094 610253
53585 610253 611323 613037 615639 619432 624145 629238 634547 640109 645576 650440 654771 658957 662687 665071
53571 665071 666149 667336 669639 672219 673709 674364 675629 677915 680236 682204 684844 688847 693309 697093
53557 697093 700468 704423 709106 713991 718955 724043 728526 731416 732902 734348 736845 740566 745431 751410
53543 751410 757945 764006 769127 773811 778548 782908 786006 787563 788265 789247 791175 793587 795212 795327 794617
53528 794617 794221 794104 793111 790624 787369 784339 781669 778985 776283 773935 772151 770868 769901 768843 767100
$$ packed form
53630F00095L305K653K255J688J293J436J387J28k047l608l609k577j637j439
53616E99323j930k471k086l63J778K893K658K088J964J885J147j88j453j998j357
53601F01890M54K345K703J221l85l36J038J955J592P57K44j96r07j368r13J59
53585F10253J070J714K602L793M713N093N309N562N467M864M331M186L730K384
53571F65071J078J187K303K580J490O55J265K286K321J968K640M003M462L784
53557F97093L375L955M683M885M964N088M483K890J486J446K497L721M865N979
53543G51410O535O061N121M684M737M360L098J557P02R82J928K412J625J15p10
53528G94617l96j17r93k487l255l030k670k684k702k348j784j283r67j058j743
$$ plain form
53513 767100 764437 761379 758708 756562 754235 750993 747048 743667 742079 742207 742737 742647 742291 742533 743315 743879
53497 743879 744257 745511 748255 751732 754776 757107 759270 761785 764843 768439 772435 776729 781531 787104
53483 787104 793140 799006 804816 811554 819712 828450 836684 844456 852618 861713 871886 883393 896314
53470 896314 910003 923756 937957 953844 972107 992427 1014327 1037618 1061810 1085895 1109277
53459 1109277 1132513 1156774 1182820 1210781 1240618 1272309 1305595 1339778 1374029 1408109 1442838
53448 1442838 1479502 1518515 1558854 1599148 1639050 1679021 1718992 1757981 1795178 1830797 1865566
53437 1865566 1899847 1933550 1966584 1999089 2031398 2063840 2096301 2127986 2158087 2186808 2215223
53426 2215223 2243844 2271883 2298360 2323465 2348291 2373511 2398911 2424038 2448659 2472578 2495503
$$ packed form
53513G67100k663l058k671k146k327l242l945l381j588J28N30r0l56K42P82N64
53497G43879L78J254K744L477L044K331K163K515L058L596L996M294M802N573
53483G87104O036N866N810O738Q158Q738Q234P772Q162R095J0173J1507J2921
53470H96314J3689J3753J4201J5887J8263K0320K1900K3291K4192K4085K3382
53459A109277K3236K4261K6046K7961K9837L1691L3286L4183L4251L4080L4729
53448A442838L6664L9013M0339M0294L9902L9971L9971L8989L7197L5619L4769
53437A865566L4281L3703L3034L2505L2309L2442L2461L1685L0101K8721K8415
53426B215223K8621K8039K6477K5105K4826K5220K5400K5127K4621K3919K2925
$$ plain form
53415 2495503 2517183 2537299 2555116 2569563 2579791 2585603 2587623 2587308 2586370 2585329 2582516 2575340 2562926
53402 2562926 2546972 2529682 2511538 2491789 2470589 2449557 2429967 2411085 2390822 2367723 2342090
53391 2342090 2315364 2288788 2262725 2237097 2212229 2188921 2167514 2147161 2126497 2105171 2084403
53380 2084403 2065922 2050526 2037753 2026673 2016810 2008556 2002914 2000708 2001876 2005592 2011091 2018082 2026318
53367 2026318 2035329 2045075 2056612 2071405 2089815 2110665 2132519 2155119 2179530 2207156 2238662 2273459
53355 2273459 2309994 2346945 2384526 2424480 2468369 2515923 2565318 2614973 2664658 2714949 2766329
53344 2766329 2819261 2874685 2933690 2996554 3062502 3130529 3200226 3271848 3345920 3422868 3502510
53333 3502510 3583662 3664610 3744392 3823371 3902277 3981077 4059289 4136888 4213968 4289551 4361750
$$ packed form
53415B495503K1680K0116J7817J4447J0228N812K020l15r38j041k813p176j2414
53402B562926j5954j7290j8144j9749k1200k1032j9590j8882k0263k3099k5633
53391B342090k6726k6576k6063k5628k4868k3308k1407k0353k0664k1326k0768
53380B084403j8481j5396j2773j1080r863q254n642k206J168L716N499O991Q236
53367B026318R011R746J1537J4793J8410K0850K1854K2600K4411K7626L1506L4797
53355B273459L6535L6951L7581L9954M3889M7554M9395M9655M9685N0291N1380
53344B766329N2932N5424N9005O2864O5948O8027O9697P1622P4072P6948P9642
53333C502510Q1152Q0948P9782P8979P8906P8800P8212P7599P7080P5583P2199
$$ plain form
53322 4361750 4429454 4493180 4553933 4611916 4666718 4717891 4764436 4804342 4835847 4859276 4876806
53311 4876806 4890184 4899162 4902147 4897619 4884525 4862063 4829981 4789228 4741773 4689305 4632141 4569724
53299 4569724 4502342 4431968 4360917 4289858 4217864 4144387 4070184 3995948 3921278 3846152 3772636
53288 3772636 3703560 3639381 3577528 3515095 3451238 3386741 3322404 3258601 3195776 3134576 3075687
53277 3075687 3019798 2967438 2918582 2872824 2830106 2790859 2755341 2723259 2694023 2666635 2639397
53266 2639397 2610865 2581598 2554016 2529736 2507762 2485923 2463313 2440491 2418029 2396078 2374993
53255 2374993 2355310 2337219 2320887 2307068 2296421 2288453 2282204 2277922 2276919 2279582 2284536 2290148 2295927
53242 2295927 2302071 2308602 2315772 2324676 2336536 2351441 2368312 2386093 2404753 2425337 2449256 2477279
$$ packed form
53322D361750O7704O3726O0753N7983N4802N1173M6545L9906L1505K3429J7530
53311D876806J3378Q978K985m528j3094k2462l2082m0753m7455n2468n7164o2417
53299D569724o7382p0374p1051p1059p1994p3477p4203p4236p4670p5126p3516
53288C772636o9076o4179o1853o2433o3857o4497o4337o3803o2825o1200n8889
53277C075687n5889n2360m8856m5758m2718l9247l5518l2082k9236k7388k7238
53266B639397k8532k9267k7582k4280k1974k1839k2610k2822k2462k1951k1085
53255B374993j9683j8091j6332j3819j0647p968o249m282j003K663M954N612N779
53242B295927O144O531P170Q904J1860J4905J6871J7781J8660K0584K3919K8023
$$ plain form
53230 2477279 2508787 2542097 2575612 2608598 2640869 2672138 2701886 2729531 2754422 2775921 2793839
53219 2793839 2808634 2820899 2830688 2837613 2841465 2842389 2840302 2834420 2823755 2808282 2789319 2768341 2745383
53206 2745383 2719155 2688937 2655723 2621019 2585141 2547548 2508369 2468358 2427442 2384761 2340580
53195 2340580 2296720 2254186 2211511 2166868 2121196 2077647 2037997 2000897 1963811 1925468 1886036
53184 1886036 1846176 1806820 1769057 1733146 1697901 1661851 1624885 1588194 1552825 1518994 1486713
53173 1486713 1456269 1427914 1401677 1377694 1356100 1336327 1317114 1297687 1278463 1260135 1242489
53162 1242489 1224783 1206878 1189071 1170905 1151032 1128540 1103700 1077180 1049415 1021332 994889
53151 994889 971813 951882 933330 915050 897747 882626 869504 856685 842519 826689 809978
$$ packed form
53230B477279L1508L3310L3515L2986L2271L1269K9748K7645K4891K1499J7918
53219B793839J4795J2265R789O925L852R24k087n882j0665j5473j8963k0978k2958
53206B745383k6228l0218l3214l4704l5878l7593l9179m0011m0916m2681m4181
53195B340580m3860m2534m2675m4643m5672m3549l9650l7100l7086l8343l9432
53184A886036l9860l9356l7763l5911l5245l6050l6966l6691l5369l3831l2281
53173A486713l0444k8355k6237k3983k1594j9773j9213j9427j9224j8328j7646
53162A242489j7706j7905j7807j8166j9873k2492k4840k6520k7765k8083k6443
53151I94889k3076j9931j8552j8280j7303j5121j3122j2819j4166j5830j6711
$$ plain form
53140 809978 793093 776032 758668 741651 726235 712975 700941 688530 674954 660722 646882
53129 646882 634094 622404 611560 601578 593004 586473 581804 577940 574028 570167 566613 562762 557769
53116 557769 552054 547222 544177 541958 538772 533759 527549 521598 517261 515001 514038 512987 511113 508795
53102 508795 506626 504452 501522 497387 492466 487935 485046 484110 484084 483577 482382 481515 481706 482529 483289 483987
53086 483987 484891 485795 486316 486489 486509 486296 485892 485830 486481 487457 488298 489177 490170 490506 489758 489272 490962 494590 497785
53067 497785 499096 499651 501112 503311 504963 505785 506671 508210 510215 512488 515013 517380 519010 520171 521960
53052 521960 524847 527717 528818 527503 524820 522452 521163 520206 518215 514657 510237 505918 501940 498045
53038 498045 494194 490547 487077 483791 481129 479429 478141 476283 473721 471215 469104 466893 464380 462290
$$ packed form
53140H09978j6885j7061j7364j7017j5416j3260j2034j2411j3576j4232j3840
53129F46882j2788j1690j0844r982q574o531m669l864l912l861l554l851m993
53116E57769n715m832l045k219l186n013o210n951m337k260r63j051j874k318
53102E08795k169k174k930m135m921m531k889r36k6n07j195q67J91Q23P60O98
53086D83987R04R04N21J73K0k13m04o2O51R76Q41Q79R93L36p48m86J690L628L195
53067D97785J311N55J461K199J652Q22Q86J539K005K273K525K367J630J161J789
53052E21960K887K870J101j315k683k368j289r57j991l558m420m319l978l895
53038D98045l851l647l470l286k662j700j288j858k562k506k111k211k513k090
$$ plain form
53024 462290 461197 460690 460290 460415 461450 462464 462121 460585 459334 459075 459046 458565 458001 457733 457241 456084 454907
53007 454907 454488 454331 453221 450962 448694 447576 447856 449117 450694 451761 451660 450380 448404 446181 444143
52992 444143 442961 443057 443911 444657 445403 447055 449612 451570 451647 450391 449301 448919 448634 448071 447702 448044 449088
52975 449088 450766 453284 456519 459542 461345 461928 462209 462767 463078 462184 459853 456848 454236 452772 452891 454730
52959 454730 457865 461336 464281 466442 467930 468868 469551 470538 471929 472765 471868 469334 466562 464751 464006 464098
52943 464098 465271 467753 470936 473636 475028 475099 474504 474300 475406 477862 480730 483051 484696 486051 487184
52928 487184 487777 487762 487656 488244 490066 493043 496463 499439 501433 502212 501566 499738 498062 498150 499935 501331
52912 501331 500558 498214 496290 495773 496220 497275 499349 502538 505802 507574 506902 504093 500788 499261 500802
$$ packed form
53024D62290j093n07m00J25J035J014l43j536j251k59k9m81n64k68m92j157j177
53007D54907m19j57j110k259k268j118K80J261J577J067j01j280j976k223k038
52992D44143j182R6Q54P46P46J652K557J958P7j256j090l82k85n63l69L42J044
52975D49088J678K518L235L023J803N83K81N58L11q94k331l005k612j464J19J839
52959D54730L135L471K945K161J488R38O83R87J391Q36q97k534k772j811p45R2
52943D64098J173K482L183K700J392P1n95k04J106K456K868K321J645J355J133
52928D87184N93j5j06N88J822K977L420K976J994P79o46j828j676Q8J785J396
52912E01331p73k344j924n17M47J055K074L189L264J772o72k809l305j527J541
$$ plain form
52897 500802 504558 508411 510917 511967 511855 510715 508900 506921 504702 501697 498108 495143 493563 492694 491509
52882 491509 490103 489426 489861 490742 491101 490405 488767 486910 485897 486350 487808 489010 488925 487567 485985 485458
52866 485458 486408 487987 488885 488643 487921 487495 487382 487077 486308 485390 485043 485889 487751 489427 489667 488517 487227
52849 487227 486717 486730 486683 486526 486199 484991 482441 479620 478495 479848 482430 484438 485316 485779 486456 487046 486913
52832 486913 486166 485733 486343 487819 489643 491820 494604 497519 499332 499193 497339 494679 492226 490887 490920 491304
52816 491304 490505 488417 486868 487644 490614 494351 497816 500662 502623 503710 504605 505779 506424 505286 502432
52801 502432 499207 496544 494338 492407 490844 489219 486752 483724 481544 480670 479420 475807 469908 463631
52787 463631 458694 455685 454479 454312 453604 450891 446371 441828 438804 437360 436700 436286 436022 435968 436405 437728
$$ packed form
52897E00802L756L853K506J050j12j140j815j979k219l005l589k965j580q69j185
52882D91509j406o77M35Q81L59o96j638j857j013M53J458J202q5j358j582n27
52866D85458R50J579Q98k42p22m26j13l05p69r18l47Q46J862J676K40j150j290
52849D87227n10J3m7j57l27j208k550k821j125J353K582K008Q78M63O77N90j33
52832D86913p47m33O10J476J824K177K784K915J813j39j854k660k453j339L3L84
52816D91304p99k088j549P76K970L737L465K846J961J087Q95J174O45j138k854
52801E02432l225k663k206j931j563j625k467l028k180q74j250l613n899o277
52787D63631m937l009j206j67p08k713m520m543l024j444o60m14k64n4M37J323
$$ plain form
52771 437728 439749 441406 441716 440875 439951 439609 439641 439631 439441 438952 438037 437103 437072 438284 439935 441206 442545 444964
52753 444964 448184 450406 450258 448323 446399 445742 446415 447807 449183 449812 449071 446664 442851 438605 435379
52738 435379 434159 434572 435357 435802 436201 436736 436784 435933 435047 435401 437001 438509 438702 437416 435250 433155 432201
52721 432201 432923 434593 435760 435777 435381 435594 436477 437211 436982 435517 433067 430261 427874 426480 426147 426438 426737
52704 426737 426786 426972 427860 429391 430941 432359 434404 437694 441660 445189 447979 450559 453169 455343 456519
52689 456519 456416 455008 453025 452336 454694 459631 464464 466968 467527 468199 470170 472725 474381 474459 473626 473289
52673 473289 474490 477196 480540 483596 485883 487419 488658 490184 492043 493496 493739 492563 490017 486068
52659 486068 481384 477845 477038 478467 480388 482101 483955 485228 484061 480210 476125 474256 474532 475495 476487
$$ packed form
52771D37728K021J657L10q41r24l42L2j0j90m89r15r34l1J212J651J271J339K419
52753D44964L220K222j48j935j924o57O73J392J376O29p41k407l813m246l226
52738D35379j220M13P85M45L99N35M8q51q86L54J600J508J93j286k166k095r54
52721D32201P22J670J167J7l96K13Q83P34k29j465k450k806k387j394l33K91K99
52704D26737M9J86Q88J531J550J418K045L290L966L529K790K580K610K174J176
52689D56519j03j408j983o89K358M937M833K504N59O72J971K555J656P8q33l37
52673D73289J201K706L344L056K287J536J239J526J859J453K43j176k546l949
52659D86068m684l539q07J429J921J713J854J273j167l851m085j869K76R63R92
$$ plain form
52644 476487 477431 477732 477101 476642 477416 478475 477933 475647 473252 471822 471094 470871 471396 472056 471468 469493 467764
52627 467764 467534 468149 468391 468232 468291 468448 468043 467012 465937 465257 465049 465358 466102 466850 467164 467068 467021 467677 469756
52608 469756 473435 477441 479433 478161 475029 472829 473015 474734 476323 477029 477254 477887 479755 483219 487770
52593 487770 492113 494954 495844 495315 494408 494107 494916 496594 498275 499091 498795 497725 496155 494002 491288 488588
52577 488588 486627 485562 485090 485147 485942 487250 488435 489549 491682 495483 499822 502801 503886 504095 504089 503205
52561 503205 500846 497988 496373 496528 497333 497554 497171 496913 496935 496519 495158 493416 492292 491922 491484 490502 489580
52544 489580 489479 490084 490846 491759 493015 494058 494085 493607 494383 497218 500625 502404 502168 501630 502612 505337 508510
52527 508510 510511 510460 508684 506602 505980 507821 511488 514880 515871 513977 510595 507431 505010 503008 501464
$$ packed form
52644D76487R44L01o31m59P74J059n42k286k395j430p28k23N25O60n88j975j729
52627D67764k30O15K42j59N9J57m05j031j075o80k08L09P44P48L14r6m7O56K079
52608D69756L679M006J992j272l132k200J86J719J589P06K25O33J868L464M551
52593D87770M343K841Q90n29r07l01Q09J678J681Q16k96j070j570k153k714k700
52577D88588j961j065m72N7P95J308J185J114K133L801M339K979J085K09oq84
52561E03205k359k858j615J55Q05K21l83k58K2m16j361j742j124l70m38r82r22
52544D89580j01O05P62R13J256J043K7m78P76K835L407J779k36n38R82K725L173
52527E08510K001n1j776k082o22J841L667L392R91j894l382l164k421k002j544
$$ plain form
52512 501464 500793 500760 500542 500035 500176 501427 502768 502929 502017 501139 500827 500794 501053 502202 504246 505839 505277 502099
52494 502099 497460 493083 490028 488394 487885 488372 489741 491327 492041 491396 490169 489653 490204 490855 490476 489097
52478 489097 487888 487890 488923 489917 490223 490355 491233 492884 494243 494329 493406 492860 493968 496738 499828 501722 502082
52461 502082 501811 501732 501681 501298 501108 501978 503857 506104 509043 513840 520416 526652 530479 531896 532199 532061 531524
52444 531524 531148 531713 532831 533098 531725 529177 526094 522613 519007 516010 513971 512322 510398 508310 506664
52429 506664 505859 505984 506956 508316 509303 509533 509375 509327 509335 509098 508751 508758 509249 509817 509906 509163 507630 505921 505058 505757
52409 505757 507984 511437 516065 521549 526527 529372 530135 531004 534198 539683 545438 549661 551993 552768 552095
52394 552095 550177 547946 546500 545889 544925 542421 538434 534131 530572 527756 524946 521867 519306 518184 518148
$$ packed form
52512E01464o71l3k18n07J41J251J341J61r12q78l12l3K59J149K044J593n62l178
52494E02099m639m377l055j634n09M87J369J586P14o45j227n16N51O51l79j379
52478D89097j209KJ033R94L06J32Q78J651J359Q6r23n46J108K770L090J894L60
52461E02082k71p9n1l83j90Q70J879K247K939M797O576O236L827J417L03j38n37
52444E31524l76N65J118K67j373k548l083l481l606k997k039j649j924k088j646
52429E06664q05J25R72J360R87K30j58m8Qk37l47PM91N68Q9p43j533j709q63O99
52409E05757K227L453M628N484M978K845P63Q69L194N485N755M223K332P75o73
52394E52095j918k231j446o11r64k504l987m303l559k816k810l079k561j122l6
$$ plain form
52379 518148 517702 515986 513810 512405 511662 510495 508692 507354 507306 508020 508574 508885 509383 510071 510729 511680 513547
52362 513547 516311 519288 522145 525362 529498 534327 538885 542180 543948 544957 546578 549728 554198 559207
52348 559207 564458 570197 576259 581739 586026 589801 594362 599852 604650 606902 606474 604954 603662 602127
52334 602127 598857 593315 586661 580655 576325 573701 572266 571476 571150 571562 572878 574598 576066 577580 580207
52319 580207 584191 588260 591055 592736 594589 597532 601640 606652 612144 617507 622541 627904 634202 640703
52305 640703 645755 648468 649293 649014 648096 647231 647530 649550 652618 655666 658461 661590 665472 669747 673596
52290 673596 676487 678732 681471 686033 693222 703058 714844 727251 738747 748640 757641 766914 776654
52277 776654 786239 795702 806176 818554 832420 846775 861356 876804 893920 913196 934690 957812
$$ packed form
52379E18148m46j716k176j405p43j167j803j338m8P14N54L11M98O88O58R51J867
52362E13547K764K977K857L217M136M829M558L295J768J009J621L150M470N009
52348E59207N251N739O062N480M287L775M561N490M798K252m28j520j292j535
52334F02127l270n542o654o006m330k624j435p90l26M12J316J720J468J514K627
52319E80207L984M069K795J681J853K943M108N012N492N363N034N363O298O501
52305F40703N052K713Q25k79r18q65K99K020L068L048K795L129L882M275L849
52290F73596K891K245K739M562P189R836J1786J2407J1496R893R001R273R740
52277G76654R585R463J0474J2378J3866J4355J4581J5448J7116J9276K1494K3122
$$ plain form
52265 957812 981421 1004749 1028292 1053429 1080948 1110060 1139013 1166738 1193885 1222128 1252385
52254 1252385 1284015 1315893 1347744 1379859 1411853 1442792 1472665 1502747 1534015 1565969 1597531
52243 1597531 1628456 1659031 1688913 1717168 1743287 1767348 1789227 1808471 1825154 1840081 1853683
52232 1853683 1865221 1873619 1878871 1882033 1883788 1883468 1879858 1872848 1864009 1855489 1848573 1843407 1839769 1837565
52218 1837565 1836608 1836395 1836500 1837026 1838430 1841016 1844848 1850134 1857387 1867046 1879010 1892763 1907951 1924685
52204 1924685 1943059 1962477 1981849 2000705 2019838 2040491 2062900 2085925 2108118 2129026 2149414
52193 2149414 2170309 2191790 2212576 2230892 2245868 2257962 2268061 2276513 2283163 2287834 2290226 2289667
52181 2289667 2285626 2278416 2268884 2257438 2243883 2228260 2211396 2194428 2177985 2161778 2144841 2126496
$$ packed form
52265I57812K3609K3328K3543K5137K7519K9112K8953K7725K7147K8243L0257
52254A252385L1630L1878L1851L2115L1994L0939K9873L0082L1268L1954L1562
52243A597531L0925L0575K9882K8255K6119K4061K1879J9244J6683J4927J3602
52232A853683J1538Q398N252L162J755l20l610p010q839q520o916n166l638k204
52218A837565r57k13J05N26J404K586L832N286P253R659J1964J3753J5188J6734
52204A924685J8374J9418J9372J8856J9133K0653K2409K3025K2193K0908K0388
52193B149414K0895K1481K0786J8316J4976J2094J0099Q452O650M671K392n59
52181B289667m041p210r532j1446j3555j5623j6864j6968j6443j6207j6937j8345
$$ plain form
52169 2126496 2107478 2089841 2075171 2063026 2051624 2039827 2027904 2016630 2006424 1997242 1988617 1979973
52157 1979973 1971656 1965375 1962555 1962389 1962610 1962333 1962853 1965405 1969343 1973050 1975620 1977152 1978475 1981114 1986380
52142 1986380 1993666 2000579 2005516 2009260 2013406 2018347 2023806 2030218 2038142 2046835 2054768 2061281 2066774 2071646
52128 2071646 2076005 2080047 2083649 2085814 2085367 2081976 2075835 2066905 2055433 2042782 2030715 2020042 2010588
52115 2010588 2001783 1992540 1981655 1969804 1960264 1955793 1955226 1954983 1953557 1952382 1952431 1952509 1951653 1950937 1951635 1953340
52099 1953340 1955223 1957693 1961328 1965294 1968373 1970770 1973462 1976334 1978390 1979503 1980714 1982871 1985933 1989509
52085 1989509 1993249 1996885 2000642 2005364 2011409 2017637 2022410 2025573 2028636 2033044 2039025 2046131 2054030 2062542
52071 2062542 2071679 2082063 2094750 2110255 2128124 2147805 2169607 2194454 2222841 2254401 2288383
$$ packed form
52169B126496j9018j7637j4670j2145j1402j1797j1923j1274j0206r182q625q644
52157A979973q317o281k820j66K21k77N20K552L938L707K570J532J323K639N266
52142A986380P286O913M937L744M146M941N459O412P924Q693P933O513N493M872
52128B071646M359M042L602K165m47l391o141q930j1472j2651j2067j0673r454
52115B010588q805r243j0885j1851r540m471n67k43j426j175M9P8q56p16O98J705
52099A953340J883K470L635L966L079K397K692K872K056J113J211K157L062L576
52085A989509L740L636L757M722O045O228M773L163L063M408N981P106P899Q512
52071B062542R137J0384J2687J5505J7869J9681K1802K4847K8387L1560L3982
$$ plain form
52060 2288383 2324236 2361628 2400077 2438809 2477044 2514344 2550655 2586134 2621094 2655893 2690434
52049 2690434 2723738 2754338 2781338 2804946 2825941 2844975 2862531 2879157 2895111 2909737 2921589
52038 2921589 2929571 2934010 2936355 2937438 2936091 2929994 2918190 2902335 2884973 2867003 2847625 2826546
52026 2826546 2805123 2784966 2766204 2747739 2728862 2710139 2692941 2678362 2666353 2655800 2645771
52015 2645771 2636801 2630492 2627695 2627685 2629373 2632733 2638524 2647064 2657866 2670240 2683858 2698867 2715701
52002 2715701 2734429 2754162 2773598 2792407 2811439 2831126 2850344 2867587 2882667 2896360 2908663
51991 2908663 2918315 2923958 2925004 2921479 2913911 2903438 2891199 2877291 2860835 2841221 2818773 2794112
51979 2794112 2767532 2739269 2709783 2679432 2648343 2616970 2586282 2556881 2528195 2499011 2468749
$$ packed form
52060B288383L5853L7392L8449L8732L8235L7300L6311L5479L4960L4799L4541
52049B690434L3304L0600K7000K3608K0995J9034J7556J6626J5954J4626J1852
52038B921589P982M439K345J083j347o097j1804j5855j7362j7970j9378k1079
52026B826546k1423k0157j8762j8465j8877j8723j7198j4579j2009j0553j0029
52015B645771q970o309k797j0J688L360N791Q540J0802J2374J3618J5009J6834
52002B715701J8728J9733J9436J8809J9032J9687J9218J7243J5080J3693J2303
51991B908663R652N643J046l525p568j0473j2239j3908j6456j9614k2448k4661
51979B794112k6580k8263k9486l0351l1089l1373l0688k9401k8686k9184l0262
$$ plain form
51968 2468749 2437950 2407731 2379117 2352571 2327565 2302568 2276049 2247879 2219489 2192442 2167084
51957 2167084 2142805 2119164 2096219 2073941 2052051 2030563 2009700 1988861 1966406 1941217 1914006
51946 1914006 1886172 1857758 1827675 1795935 1764305 1734230 1705199 1676014 1646808 1618713 1592029
51935 1592029 1565906 1539820 1514360 1490244 1467188 1444138 1420349 1396067 1372206 1349249 1326447
51924 1326447 1302523 1277438 1252918 1230564 1209889 1189138 1167787 1147129 1128332 1111117 1094909
51913 1094909 1080251 1068219 1059019 1052240 1048141 1047607 1050556 1055274 1059889 1064123 1069062 1075370 1082258 1088244
51899 1088244 1092564 1095673 1098686 1102615 1107896 1114223 1120739 1126692 1132084 1137740 1144922 1155037 1169422
51886 1169422 1188691 1212096 1237827 1264001 1288837 1309924 1324271 1330038 1328031 1320990 1311544 1301201
$$ packed form
51968B468749l0799l0219k8614k6546k5006k4997k6519k8170k8390k7047k5358
51957B167084k4279k3641k2945k2278k1890k1488k0863k0839k2455k5189k7211
51946A914006k7834k8414l0083l1740l1630l0075k9031k9185k9206k8095k6684
51935A592029k6123k6086k5460k4116k3056k3050k3789k4282k3861k2957k2802
51924A326447k3924k5085k4520k2354k0675k0751k1351k0658j8797j7215j6208
51913A094909j4658j2032r200o779m099n34K949M718M615M234M939O308O888N986
51899A088244M320L109L013L929N281O327O516N953N392N656P182J0115J4385
51886A169422J9269K3405K5731K6174K4836K1087J4347N767k007p041r446j0343
$$ plain form
51874 1301201 1290730 1280426 1269828 1258006 1244546 1229831 1214115 1196834 1177262 1155445 1132048
51863 1132048 1107519 1081964 1055796 1029953 1005257 981944 960126 940402 923474 909169 896372
51852 896372 884202 873035 864111 858267 855157 853391 851279 847971 844349 842360 842752 843795 843023 839983
51838 839983 836198 832482 827563 819770 808939 796114 782504 769628 759464 753156 749900 748010 746651
51825 746651 745728 744805 743456 742501 743558 747262 752897 759825 768057 777069 785158 790829 794400 797610 801712
51810 801712 806152 809080 809186 807172 805156 804463 804470 804025 803296 803314 804206 805037 805316 805533 806135 806913 807430 807114
51792 807114 804891 799943 793038 786035 779671 772919 764920 756426 748693 741914 735565 729404 723424 717486
51778 717486 711815 707244 704184 701896 699460 696943 694960 693662 692854 692599 692991 693823 695100 697195 699711
$$ packed form
51874A301201j0471j0304j0598j1822j3460j4715j5716j7281j9572k1817k3397
51863A132048k4529k5555k6168k5843k4696k3313k1818j9724j6928j4305j2797
51852H96372j2170j1167q924n844l110j766k112l308l622j989L92J043p72l040
51838H39983l785l716m919p793j0831j2825j3610j2876j0164o308l256j890j359
51825G46651r23r23j349r55J057L704N635O928Q232R012Q089N671L571L210M102
51810H01712M440K928J06k014k016o93Pm45p29J8Q92Q31K79K17O02P78N17l16
51792H07114k223m948o905p003o364o752p999q494p733o779o349o161n980n938
51778G17486n671m571l060k288k436k517j983j298q08k55L92Q32J277K095K516
$$ plain form
51763 699711 701035 700208 698653 698683 700535 702319 702839 702975 703834 704814 704382 702019 698652 695567 693557 692805
51747 692805 692954 693170 692632 691242 689909 689891 691565 693896 695545 696524 698101 700786 703225 703844 702922 701939
51731 701939 701279 699877 697172 694078 691557 689355 686871 684410 682672 681583 680630 680183 681472 685057 689915
51716 689915 694418 697884 700886 704217 707921 711498 714868 718800 724202 731125 738706 746006 752633 758541
51702 758541 763493 766827 767651 765354 760175 753233 745698 737832 729203 719961 711479 705307 701593 698935
51688 698935 695892 692378 689355 687348 685693 683486 680947 679326 679408 680645 682067 683668 686371 690803 696581
51673 696581 702869 709116 715054 720229 723883 725506 725600 725911 728448 733824 740502 745934 748525 748427 746800
51658 746800 744758 742963 741600 740475 739285 737899 736251 734161 731629 729162 727234 725494 723321 721422
$$ packed form
51763F99711J324q27j555L0J852J784N20J36Q59R80m32k363l367l085k010p52
51747F92805J49K16n38j390j333j8J674K331J649R79J577K685K439O19r22r83
51731G01939o60j402k705l094k521k202k484k461j738j089r53m47J289L585M858
51716F89915M503L466L002L331L704L577L370L932N402O923P581P300O627N908
51702G58541M952L334Q24k297n179o942p535p866q629r242q482o172l714k658
51688F98935l043l514l023k007j655k207k539j621Q2J237J422J601K703M432N778
51673F96581O288O247N938N175L654J623R4L11K537N376O678N432K591r8j627
51658G46800k042j795j363j125j190j386j648k090k532k467j928j740k173j899
$$ plain form
51644 721422 721979 726321 732770 737641 738393 735353 730555 725765 721734 718459 715381 711733 707407 703412 700948
51629 700948 700023 699477 698332 696563 694458 692011 689365 687203 685984 685187 684078 682951 682801 683870 685489
51614 685489 687458 690481 694679 698593 700595 700917 701560 704407 710008 717837 726909 736059 744197 750519 754383
51599 754383 755336 753716 750905 748247 745739 742468 738533 735867 736718 741503 748431 755084 760149 763649 765786
51584 765786 765955 763224 757532 749735 740403 729401 717121 705356 695957 688983 682997 677010 671356 666765
51570 666765 663454 661111 659022 656180 652076 647432 643520 640823 639106 638557 639604 641486 642368 641409 639622
51555 639622 638085 636514 634467 632895 633190 635252 637654 639360 640260 640372 639805 639555 641169 645269 651036
51540 651036 657404 664191 671961 681350 692586 705006 716838 726086 732059 735651 737938 739028 738676 737527
$$ packed form
51644G21422N57M342O449M871P52l040m798m790m031l275l078l648m326l995k464
51629G00948r25n46j145j769k105k447k646k162j219p97j109j127j50J069J619
51614F85489J969L023M198L914K002L22O43K847N601P829R072R150Q138O322L864
51599G54383R53j620k811k658k508l271l935k666Q51M785O928O653N065L500K137
51584G65786J69k731n692p797r332j1002j2280j1765r399o974n986n987n654m591
51570F66765l311k343k089k842m104m644l912k697j717n49J047J882Q82r59j787
51555F39622j537j571k047j572K95K062K402J706R00J12n67k50J614M100N767
51540F51036O368O787P770R389J1236J2420J1832R248N973L592K287J090l52j149
$$ plain form
51526 737527 737056 738237 740796 743972 747675 752548 758991 766547 774469 782502 790734 798940 806830 815031
51512 815031 825026 837581 851639 865277 877508 888662 899365 909849 920293 931290 943771 958639
51500 958639 976437 997055 1019833 1044117 1069540 1095394 1119990 1141237 1157978 1170526 1179922 1186928
51488 1186928 1191485 1192669 1189275 1180943 1168621 1153407 1135089 1112557 1085707 1056113 1025610 995144
51476 995144 965542 938467 915381 895777 877564 859412 841906 826042 811515 797349 783811
51465 783811 772551 764546 758662 752795 746002 738999 732914 728245 724863 722192 719137 714531 708109 700767
51451 700767 693727 687760 683288 680511 679079 678193 677459 677155 677352 677423 676944 676311 675762 674600 672440 670539
51435 670539 670500 671872 672473 671178 669102 667754 667289 667092 666976 667152 667715 668592 669258 668327 664560 658754 653468
$$ packed form
51526G37527m71J181K559L176L703M873O443P556P922Q033Q232Q206P890Q201
51512H15031R995J2555J4058J3638J2231J1154J0703J0484J0444J0997J2481J4868
51500I58639J7798K0618K2778K4284K5423K5854K4596K1247J6741J2548R396P006
51488A186928M557J184l394q332j2322j5214j8318k2532k6850k9594l0503l0466
51476I95144k9602k7075k3086j9604j8213j8152j7506j5864j4527j4166j3538
51465G83811j1260q005n884n867o793p003o085m669l382k671l055m606o422p342
51451G00767p040n967m472k777j432q86p34l04J97P1m79o33n49j162k160j901
51435F70539l9J372O01j295k076j348m65j97j16J76N63Q77O66r31l767n806n286
$$ plain form
51418 653468 650108 647422 643768 639674 636712 634769 632215 628474 624674 621585 618474 614602 610715 608259
51404 608259 607711 608235 608617 608216 607345 606914 607441 608437 609153 609807 611425 614525 618803 624299 631925 642206
51388 642206 654013 665198 674439 682325 690869 702001 715881 730276 741967 749102 752014 751844 749228
51375 749228 744760 739854 735962 732946 729081 722953 714895 706356 698221 690142 681507 672810 665678 661306
51361 661306 659050 657115 654658 652581 651910 652019 651258 649092 646889 646419 648078 650749 653037 654498 655961
51346 655961 658861 664034 670956 678261 685120 691967 699769 708602 717159 723730 727728 730236 733080 737529
51332 737529 743951 752363 762687 774397 786463 798232 810161 823344 838484 855655 874934 896807
51320 896807 921848 950220 981435 1014380 1047720 1080556 1112637 1143614 1172146 1196113 1213724
$$ packed form
51418F53468l360k686l654m094k962j943k554l741l800l089l111l872l887k456
51404F08259n48N24L82m01q71m31N27R96P16O54J618L100M278N496P626J0281
51388F42206J1807J1185R241P886Q544J1132J3880J4395J1691P135K912j70k616
51375G49228m468m906l892l016l865o128q058q539q135q079q635q697p132m372
51361F61306k256j935k457k077o71J09p61k166k203m70J659K671K288J461J463
51346F55961K900N173O922P305O859O847P802Q833Q557O571L998K508K844M449
51332G37529O422Q412J0324J1710J2066J1769J1929J3183J5140J7171J9279K1873
51320H96807K5041K8372L1215L2945L3340L2836L2081L0977K8532K3967J7611
$$ plain form
51309 1213724 1224189 1227448 1223752 1213581 1197566 1176320 1150594 1121629 1090890 1059229 1026627 992976
51297 992976 958905 925680 894507 866061 840409 817137 795748 776196 758967 744537 732762
51286 732762 722779 713312 703235 692334 681632 672475 665055 658214 650902 643377 636611 630954 625907
51273 625907 620893 615751 610730 606511 603959 603083 602395 600197 596744 594245 594286 595853 596636 595900 595226 596357
51257 596357 599035 601456 602531 603168 605109 608752 612448 614051 612968 610477 608186 606633 605501 604742 604905
51242 604905 606279 608178 609448 609628 609353 609502 610191 610755 610594 609761 608736 607888 607298 606996 607169 608148 610245
51225 610245 613547 617823 622568 627141 630920 633651 635904 638862 643075 647433 650027 650234 649339 648752 648354
51210 648354 647279 645747 645107 646166 648455 651242 654341 657569 660150 661189 660428 658299 655728 653969 653911
$$ packed form
51309A213724J0465L259l696j0171j6015k1246k5726k8965l0739l1661l2602l3651
51297I92976l4071l3225l1173k8446k5652k3272k1389j9552j7229j4430j1775
51286G32762r983r467j0077j0901j0702r157p420o841p312p525o766n657n047
51273F25907n014n142n021m219k552q76o88k198l453k499M1J567P83p36o74J131
51257E96357K678K421J075O37J941L643L696J603j083k491k291j553j132p59J63
51242F04905J374J899J270J80k75J49O89N64j61q33j025q48n90l02J73R79K097
51225F10245L302M276M745M573L779K731K253K958M213M358K594K07q95n87l98
51210F48354j075j532o40J059K289K787L099L228K581J039p61k129k571j759n8
$$ plain form
51195 653911 655080 655930 655648 655054 655100 655168 653803 650731 647023 643395 639622 635872 633374 632884 633183 632079
51179 632079 628765 624536 621301 619979 620318 621593 623036 623871 623413 621474 618655 616104 614742 614692 615554 617157
51163 617157 619681 623008 626372 629040 631048 632901 634702 636122 637221 638766 641486 645345 649772 654251
51149 654251 658334 661390 662933 663405 664259 666922 671712 677715 683565 688176 690942 691689 690692 688684 686652
51134 686652 685374 684977 684895 684365 683123 681577 680213 678906 677064 674538 672045 670386 669370 667910 665295
51119 665295 662012 659120 657044 655415 653957 653014 652885 652967 652070 649733 646955 645352 645628 647109 648787 650523
51103 650523 652949 656319 659826 662318 663552 664567 666779 670722 675542 679652 681997 682799 683019 683139 682803
51088 682803 681835 681035 681364 682572 683506 683782 684215 685138 685283 683316 679956 677474 677163 678295 679595 680668
$$ packed form
51195F53911J169Q50k82n94M6O8j365l072l708l628l773l750k498m90K99j104
51179F32079l314m229l235j322L39J275J443Q35m58j939k819k551j362n0Q62J603
51163F17157K524L327L364K668K008J853J801J420J099J545K720L859M427M479
51149F54251M083L056J543M72Q54K663M790O003N850M611K766P47r97k008k032
51134F86652j278l97q2n30j242j546j364j307j842k526k493j659j016j460k615
51119F65295l283k892k076j629j458r43j29Q2q97k337k778j603K76J481J678J736
51103F50523K426L370L507K492J234J015K212L943M820M110K345Q02K20J20l36
51088F82803r68q00L29J208R34K76M33R23J45j967l360k482l11J132J300J073
$$ plain form
51072 680668 681588 682197 682584 683520 685511 687887 689828 691937 695602 700676 704958 706517 705711 704172 702501
51057 702501 700072 696947 694794 695342 698574 703129 708133 713818 720317 726668 731658 735230 738317 741351
51043 741351 743689 744881 745890 748296 752372 756593 759318 760598 762041 765118 769938 775408 780098 782873
51029 782873 783469 783061 783980 787862 793699 798348 799503 797908 796279 796516 798634 801870 805674 809550 813014
51014 813014 816255 820059 824619 829117 833018 837099 842492 849260 856704 864666 873706 884317 896693 910943
51000 910943 926648 942507 957486 972272 988372 1005420 1020392 1030059 1033750 1033454 1032027 1031688 1033345
50987 1033345 1036316 1038824 1039495 1038570 1037464 1037139 1036875 1034514 1028152 1018166 1007705 1000513 997965 998459 999604
50972 999604 1000186 999840 997908 993732 987731 981383 976082 972450 970611 970658 972821 977425 984599 993851 1004135
$$ packed form
51072F80668R20O09L87R36J991K376J941K109L665N074M282J559q06j539j671
51057G02501k429l125k153N48L232M555N004N685O499O351M990L572L087L034
51043G41351K338J192J009K406M076M221K725J280J443L077M820N470M690K775
51029G82873N96m08R19L882N837M649J155j595j629K37K118L236L804L876L464
51014H13014L241L804M560M498L901M081N393O768P444P962R040J0611J2376J4250
51000I10943J5705J5859J4979J4786J6100J7048J4972R667L691k96j427l39J657
50987A033345K971K508O71r25j106l25k64k361o362r986j0461p192k548M94J145
50972I99604N82l46j932m176o001o348n301l632j839M7K163M604P174R252J0284
$$ plain form
50957 1004135 1014598 1025091 1035811 1046730 1057577 1068037 1077663 1085962 1092932 1099335 1106127 1113752
50945 1113752 1122101 1130792 1139276 1147062 1153991 1159966 1164450 1167100 1169250 1173764 1182586 1195017 1209117
50932 1209117 1224071 1240189 1257374 1275148 1294175 1316275 1342403 1371537 1402115 1433917 1468023
50921 1468023 1505287 1545208 1586093 1626212 1665034 1703397 1742416 1782620 1824569 1869777 1920073
50910 1920073 1976134 2037507 2104096 2176615 2255290 2339025 2426459 2517329 2612218 2711259 2813480
50899 2813480 2917237 3020964 3123391 3222995 3317282 3403197 3478838 3544493 3601429 3650063 3690160
50888 3690160 3722403 3748330 3768492 3781988 3788487 3789737 3788317 3785489 3780788 3773028 3761095 3744376
50876 3744376 3723215 3698714 3671760 3642651 3611766 3579560 3545152 3505744 3458531 3402993 3340757
$$ packed form
50957A004135J0463J0493J0720J0919J0847J0460R626Q299O970O403O792P625
50945A113752Q349Q691Q484P786O929N975M484K650K150M514Q822J2431J4100
50932A209117J4954J6118J7185J7774J9027K2100K6128K9134L0578L1802L4106
50921A468023L7264L9921M0885M0119L8822L8363L9019M0204M1949M5208N0296
50910A920073N6061O1373O6589P2519P8675Q3735Q7434R0870R4889R9041J02221
50899B813480J03757J03727J02427R9604R4287Q5915P5641O5655N6936M8634M0097
50888C690160L2243K5927K0162J3496O499J250j420k828m701p760j1933j6719
50876C744376k1161k4501k6954k9109l0885l2206l4408l9408m7213n5538o2236
$$ plain form
50865 3340757 3273743 3203138 3129576 3053202 2973659 2890894 2806015 2720800 2636612 2554447 2475722
50854 2475722 2402036 2334049 2271288 2213144 2159486 2110309 2065399 2024375 1986604 1951160 1917438
50843 1917438 1885689 1856418 1829504 1804668 1782656 1764862 1751525 1741137 1731973 1723537 1716178 1710121
50831 1710121 1705460 1702633 1702244 1704560 1709474 1716664 1725516 1735271 1745635 1757094 1770333 1785685 1803368
50818 1803368 1823886 1847664 1874447 1903446 1934056 1966177 2000060 2036220 2075463 2118520 2165455
50807 2165455 2215648 2268580 2324518 2384297 2448500 2517129 2590174 2668239 2752245 2842608 2939259
50796 2939259 3042688 3154419 3275984 3407911 3550295 3703913 3869730 4047292 4234695
50787 4234695 4430463 4634531 4846803 5065597 5288375 5513298 5738884 5962228 6178554
$$ packed form
50865C340757o7014p0605p3562p6374p9543q2765q4879q5215q4188q2165p8725
50854B475722p3686o7987o2761n8144n3658m9177m4910m1024l7771l5444l3722
50843A917438l1749k9271k6914k4836k2012j7794j3337j0388r164q436p359o057
50831A710121m661k827l89K316M914P190Q852R755J0364J1459J3239J5352J7683
50818A803368K0518K3778K6783K8999L0610L2121L3883L6160L9243M3057M6935
50807B165455N0193N2932N5938N9779O4203O8629P3045P8065Q4006R0363R6651
50796B939259J03429J11731J21565J31927J42384J53618J65817J77562J87403
50787D234695J95768K04068K12272K18794K22778K24923K25586K23344K16326
$$ plain form
50778 6178554 6382628 6569919 6736482 6878964 6995440 7085698 7150139 7188959 7203089 7195528
50768 7195528 7170874 7133538 7087031 7034902 6981414 6930714 6885567 6847011 6814553 6786110 6758280
50757 6758280 6727586 6691570 6648077 6593535 6523059 6433103 6323660 6197078 6054828 5896429
50747 5896429 5721939 5534705 5340603 5144577 4948704 4753868 4562374 4378065 4204225
50738 4204225 4042308 3892653 3755326 3629897 3515492 3411973 3320475 3241746 3174328 3115487
50728 3115487 3063869 3020044 2984219 2954619 2928763 2905398 2884376 2865304 2847277 2829672 2812338
50717 2812338 2795030 2777250 2758678 2739249 2718798 2696972 2673449 2648051 2620816 2592231 2563124
50706 2563124 2533981 2504622 2474902 2445407 2417065 2390434 2365812 2343703 2324559 2308435 2295568
$$ packed form
50778F178554K04074J87291J66563J42482J16476R0258O4441L8820J4130p561
50768G195528k4654l7336m6507n2129n3488n0700m5147l8556l2458k8443k7830
50757F758280l0694l6016m3493n4542p0476q9956j09443j26582j42250j58399
50747E896429j74490j87234j94102j96026j95873j94836j91494j84309j73840
50738D204225j61917j49655j37327j25429j14405j03519r1498p8729o7418n8841
50728C115487n1618m3825l5825k9600k5856k3365k1022j9072j8027j7605j7334
50717B812338j7308j7780j8572j9429k0451k1826k3523k5398k7235k8585k9107
50706B563124k9143k9359k9720k9495k8342k6631k4622k2109j9144j6124j2867
$$ plain form
50695 2295568 2286994 2283749 2285581 2291288 2300211 2312543 2328262 2346914 2368672 2394608 2425443 2460901
50683 2460901 2500836 2546162 2597845 2655582 2718299 2785739 2858844 2938732 3025892 3120233 3221234
50672 3221234 3327858 3438763 3552859 3669535 3788177 3907601 4026126 4142253 4255098
50663 4255098 4363777 4466306 4559693 4641511 4710855 4767023 4807707 4829779 4832060 4816344 4785632
50652 4785632 4742776 4691546 4637458 4585704 4538413 4495153 4455981 4422720 4396967 4377957 4363090
50641 4363090 4350003 4337475 4324496 4309063 4288182 4258911 4219188 4167697 4103456 4026311 3937962
50630 3937962 3841770 3741119 3638435 3536137 3437557 3345741 3261610 3184520 3114813 3054725 3006222
50619 3006222 2968716 2939685 2917255 2901603 2894044 2895329 2904945 2921635 2944275 2972196 3004782 3040960
$$ packed form
50695B295568q574l245J832N707Q923J2332J5719J8652K1758K5936L0835L5458
50683B460901L9935M5326N1683N7737O2717O7440P3105P9888Q7160R4341J01001
50672C221234J06624J10905J14096J16676J18642J19424J18525J16127J12845
50663D255098J08679J02529R3387Q1818O9344N6168M0684K2072K281j5716l0712
50652D785632m2856n1230n4088n1754m7291m3260l9172l3261k5753j9010j4867
50641D363090j3087j2528j2979j5433k0881k9271l9723n1491o4241p7145q8349
50630C937962r6192j00651j02684j02298r8580r1816q4131p7090o9707o0088m8503
50619C006222l7506k9031k2430j5652p559J285R616J6690K2640K7921L2586L6178
$$ plain form
50607 3040960 3079234 3118188 3156819 3194455 3230578 3264865 3297350 3328510 3359117 3389776 3420503
50596 3420503 3450801 3480202 3508470 3535222 3559777 3581770 3601677 3620399 3638628 3657137 3677434
50585 3677434 3701305 3729562 3761808 3797724 3838044 3883878 3935320 3990966 4048566 4105931 4161559
50574 4161559 4214843 4265694 4313744 4357904 4396907 4430309 4458872 4483879 4505987 4524546 4537758
50563 4537758 4543336 4539083 4523406 4496108 4459150 4416313 4371558 4327658 4286454 4249827 4219552 4196114
50551 4196114 4178429 4165092 4155359 4148544 4142858 4135556 4124247 4107786 4085819 4057655 4021548 3974985
50539 3974985 3915802 3843402 3759288 3666696 3569658 3471759 3374937 3279158 3183627 3088598 2995914
50528 2995914 2907812 2825573 2749402 2679022 2614024 2554137 2499832 2452416 2412759 2379938 2351808
$$ packed form
50607C040960L8274L8954L8631L7636L6123L4287L2485L1160L0607L0659L0727
50596C420503L0298K9401K8268K6752K4555K1993J9907J8722J8229J8509K0297
50585C677434K3871K8257L2246L5916M0320M5834N1442N5646N7600N7365N5628
50574D161559N3284N0851M8050M4160L9003L3402K8563K5007K2108J8559J3212
50563D537758N578m253j5677k7298l6958m2837m4755m3900m1204l6627l0275k3438
50551D196114j7685j3337r733o815n686p302j1309j6461k1967k8164l6107m6563
50539C974985n9183p2400q4114r2592r7038r7899r6822r5779r5531r5029r2684
50528B995914q8102q2239p6171p0380o4998n9887n4305m7416l9657l2821k8130
$$ plain form
50517 2351808 2327149 2306671 2291612 2282002 2276892 2275833 2279135 2286637 2297212 2310115 2326275 2347388
50505 2347388 2373795 2403857 2435580 2468351 2502957 2540480 2581544 2626153 2673703 2723302 2774615
50494 2774615 2828480 2886435 2949503 3017379 3088317 3159514 3228191 3293340 3356709 3421455 3489431
50483 3489431 3559945 3631215 3702544 3774910 3849985 3929162 4013327 4102994 4198399 4299550 4406318
50472 4406318 4518558 4636260 4759569 4888528 5022890 5162369 5307023 5457007 5611859
50463 5611859 5770235 5930253 6089647 6245381 6393750 6531439 6656415 6767279 6861766 6936270
50453 6936270 6987160 7012535 7012605 6988433 6940600 6869437 6776570 6665710 6541520 6407987 6268575
50442 6268575 6127766 5991415 5864989 5751802 5653239 5570159 5503520 5453990 5421650 5406024
$$ packed form
50517B351808k4659k0478j5059r610n110j059L302P502J0575J2903J6160K1113
50505B347388K6407L0062L1723L2771L4606L7523M1064M4609M7550M9599N1313
50494B774615N3865N7955O3068O7876P0938P1197O8677O5149O3369O4746O7976
50483C489431P0514P1270P1329P2366P5075P9177Q4165Q9667R5405J01151J06768
50472D406318J12240J17702J23309J28959J34362J39479J44654J49984J54852
50463E611859J58376J60018J59394J55734J48369J37689J24976J10864R4487P4504
50453F936270N0890K5375P0k4172m7833p1163r2867j10860j24190j33533j39412
50442F268575j40809j36351j26426j13187r8563q3080o6639m9530l2340j5626
$$ plain form
50432 5406024 5405856 5418603 5440244 5465545 5488576 5503455 5505211 5490066 5454968 5397356 5315982 5211904
50420 5211904 5088238 4948796 4797051 4636060 4468868 4298833 4129645 3964780 3806590
50411 3806590 3656038 3513653 3380510 3257887 3146260 3045316 2954838 2874699 2803732 2739477
50401 2739477 2680018 2625902 2579533 2542435 2513409 2489689 2469784 2454842 2447136 2447470 2454323 2465290
50389 2465290 2478764 2494245 2511902 2532499 2557237 2586720 2620115 2655931 2693503 2732692 2771878
50378 2771878 2807163 2834380 2851728 2860215 2862124 2859733 2855187 2850638 2848006 2848721 2853624 2862823 2875629
50365 2875629 2890955 2907981 2926432 2946506 2968969 2995369 3027485 3066028 3109932 3157374 3207538
50354 3207538 3261209 3319676 3383504 3452456 3526063 3603621 3683792 3764850 3845490 3925060 4002823
$$ packed form
50432E406024j68J2747K1641K5301K3031J4879J756j5145l5098n7612q1374j04078
50420E211904j23666j39442j51745j60991j67192j70035j69188j64865j58190
50411C806590j50552j42385j33143j22623j11627j00944r0478q0139p0967o4255
50401B739477n9459n4116m6369l7098k9026k3720j9905j4942p706L34O853J0967
50389B465290J3474J5481J7657K0597K4738K9483L3395L5816L7572L9189L9186
50378B771878L5285K7217J7348Q487J909k391m546m549k632P15M903R199J2806
50365B875629J5326J7026J8451K0074K2463K6400L2116L8543M3904M7442N0164
50354C207538N3671N8467O3828O8952P3607P7558Q0171Q1058Q0640P9570P7763
$$ plain form
50343 4002823 4077377 4146991 4210180 4265641 4311910 4347425 4370717 4380333 4374847 4353390 4316124 4263993
50331 4263993 4198223 4120360 4032586 3937601 3838192 3737144 3637365 3541739 3452838 3372788 3303048
50320 3303048 3244082 3195655 3157742 3130614 3113624 3104665 3101702 3104143 3111494 3121066 3128543 3130934 3127495
50307 3127495 3117476 3098747 3069727 3031522 2986799 2937207 2883126 2825463 2766221 2706948 2647386
50296 2647386 2585966 2521294 2453242 2383090 2312686 2243343 2175692 2110696 2050184 1995870 1948179
50285 1948179 1906475 1870046 1838330 1810663 1786602 1766319 1750060 1737403 1727593 1720247 1715037 1711100
50273 1711100 1707692 1705259 1704898 1706840 1710358 1715089 1721287 1728645 1736086 1743180 1750810 1759893 1770422 1782289
50259 1782289 1795958 1811377 1827190 1842279 1857428 1873909 1890664 1904678 1914745 1923446 1934360
$$ packed form
50343D002823P4554O9614O3189N5461M6269L5515K3292R616n486k1457l7266n2131
50331D263993o5770p7863q7774r4985r9409j01048r9779r5626q8901q0050o9740
50320C303048n8966m8427l7913k7128j6990q959k963K441P351R572P477K391l439
50307C127495j0019j8729k9020l8205m4723m9592n4081n7663n9242n9273n9562
50296B647386o1420o4672o8052p0152p0404o9343o7651o4996o0512n4314m7691
50285A948179m1704l6429l1716k7667k4061k0283j6259j2657r810p346n210l937
50273A711100l408k433l61J942L518M731O198P358P441P094P630R083J0529J1867
50259A782289J3669J5419J5813J5089J5149J6481J6755J4014J0067Q701J0914
$$ plain form
50248 1934360 1948166 1962707 1976390 1990096 2005560 2023177 2042199 2062312 2083917 2107153 2131605
50237 2131605 2157160 2184304 2213227 2243120 2272549 2299823 2322547 2337499 2341954 2335291 2319227 2296816
50225 2296816 2271518 2246515 2223880 2204249 2187659 2174540 2165489 2160534 2159413 2162408 2170076 2182155
50213 2182155 2197501 2215221 2235228 2257706 2282813 2310882 2342072 2375593 2409978 2444265 2478067
50202 2478067 2510340 2539180 2563486 2584102 2602800 2620808 2638636 2656218 2672207 2683859 2688746
50191 2688746 2686534 2678573 2666120 2649516 2628464 2602315 2570564 2534001 2495173 2457001 2421245 2388906
50179 2388906 2361186 2338528 2318945 2298784 2275513 2248744 2218679 2185173 2148998 2112532 2077967
50168 2077967 2045470 2014028 1983414 1954208 1926323 1898889 1871793 1846228 1823120 1801538 1779415
$$ packed form
50248A934360J3806J4541J3683J3706J5464J7617J9022K0113K1605K3236K4452
50237B131605K5555K7144K8923K9893K9429K7274K2724J4952M455o663j6064k2411
50225B296816k5298k5003k2635j9631j6590j3119r051m955j121K995P668J2079
50213B182155J5346J7720K0007K2478K5107K8069L1190L3521L4385L4287L3802
50202B478067L2273K8840K4306K0616J8698J8008J7828J7582J5989J1652M887
50191B688746k212p961j2453j6604k1052k6149l1751l6563l8828l8172l5756l2339
50179B388906k7720k2658j9583k0161k3271k6769l0065l3506l6175l6466l4565
50168B077967l2497l1442l0614k9206k7885k7434k7096k5565k3108k1582k2123
$$ plain form
50157 1779415 1755748 1731629 1708946 1688427 1669340 1651044 1634162 1619744 1607616 1596326 1584776
50146 1584776 1573140 1561847 1550465 1538379 1526196 1515553 1507371 1500948 1494971 1488882 1482928 1477395
50134 1477395 1472299 1467574 1462972 1457884 1451863 1445507 1440296 1437144 1435392 1433631 1431365 1429431 1428793 1429402
50120 1429402 1430347 1430899 1431172 1431904 1433663 1436294 1439235 1442469 1446872 1453163 1460740 1468188 1475046 1482485 1492046
50105 1492046 1504248 1518689 1534808 1552008 1569580 1587488 1607275 1631515 1662051 1698871 1740659
$$ packed form
50157A779415k3667k4119k2683k0519j9087j8296j6882j4418j2128j1290j1550
50146A584776j1636j1293j1382j2086j2183j0643q182o423n977o089n954n533
50134A477395n096m725m602n088o021o356n211l152j752j761k266j934o38O09
50120A429402R45N52K73P32J759K631K941L234M403O291P577P448O858P439R561
50105A492046J2202J4441J6119J7200J7572J7908J9787K4240L0536L6820M1788
$$ [...]
##END NTUPLES=NMR SPECTRUM
##END=
