
##TITLE=UV1030_TOFR01-ROVE100A_6099379_QJdLKFSn3O
##JCAMPDX= 6.0         $$ Bruker NMR JCAMP-DX V2.0
##DATA TYPE= NMR SPECTRUM
##DATA CLASS= NTUPLES
##ORIGIN= BRUKER
##OWNER= Administrator
$$ 1.72 TOPSPIN		Version 2.1
$$ 2012-05-12 20:07:24.812 -0500  Administrator@TOPSPIN
$$ Compression mode = diff/dup
##.OBSERVE FREQUENCY= 400.13188235
##.OBSERVE NUCLEUS= ^1H
##.ACQUISITION MODE= SIMULTANEOUS (DQD)
##.ACQUISITION SCHEME= undefined
##.AVERAGES= 8
##.DIGITISER RES= 22
##SPECTROMETER/DATA SYSTEM= spect
##.PULSE SEQUENCE= zg30
##.SOLVENT NAME= COFFEE_meoh
##.SHIFT REFERENCE= INTERNAL, COFFEE_meoh, 1, 14.98061
##AUDIT TRAIL= $$ (NUMBER, WHEN, WHO, WHERE, PROCESS, VERSION, WHAT)
$$ ##TITLE= Audit trail, TOPSPIN		Version 2.1
$$ ##JCAMPDX= 5.01
$$ ##ORIGIN= Bruker BioSpin GmbH
$$ ##OWNER= Administrator
$$ $$ C:\Bruker\TOPSPIN/data/COFFEE/nmr/UV1030_TOFR01-ROVE100A_6099379_QJdLKFSn3O/10/pdata/1/auditp.txt
$$ ##AUDIT TRAIL=  $$ (NUMBER, WHEN, WHO, WHERE, PROCESS, VERSION, WHAT)
(   1,<2012-05-12 20:07:17.656 -0500>,<Administrator>,<TOPSPIN>,<go>,<TOPSPIN 2.1>,
      <created by zg
	started at 2012-05-12 20:06:11.203 -0500,
	POWCHK enabled, PULCHK disabled,
       configuration hash MD5:
       AF F2 23 6B 01 CD 40 DD E5 A1 38 A0 06 EA F7 77
       data hash MD5: 64K
       44 A4 EC D1 1B 60 30 4B B1 CD 28 C0 D8 33 B6 1C>)
(   2,<2012-05-12 20:07:20.578 -0500>,<Administrator>,<TOPSPIN>,<proc1d>,<TOPSPIN 2.1>,
      <Start of raw data processing
       efp LB = 0 FT_mod = 6 PKNL = 1 PHC0 = 0 PHC1 = 0 SI = 32K 
       data hash MD5: 32K
       B2 CE D1 93 AA 37 7D 80 78 CA FD 24 A0 0E 43 48>)
(   3,<2012-05-12 20:07:20.937 -0500>,<Administrator>,<TOPSPIN>,<proc1d>,<TOPSPIN 2.1>,
      <pk PHC0 = 217.5677 PHC1 = 0 
       data hash MD5: 32K
       1D A9 14 10 41 77 3D DA C7 E0 3F C0 DF 87 F8 E2>)
(   4,<2012-05-12 20:07:21.015 -0500>,<Administrator>,<TOPSPIN>,<proc1d>,<TOPSPIN 2.1>,
      <abs ABSG = 1 
       data hash MD5: 32K
       6E 4C 7B 66 2C 26 D7 F8 A0 A8 5C 68 30 81 22 AC>)
(   5,<2012-05-12 20:07:21.046 -0500>,<Administrator>,<TOPSPIN>,<proc1d>,<TOPSPIN 2.1>,
      <abs ABSG = 2 
       data hash MD5: 32K
       77 E3 21 00 52 CF 4A 42 FB 37 C1 39 D8 FA B8 7B>)
(   6,<2012-05-12 20:07:21.078 -0500>,<Administrator>,<TOPSPIN>,<proc1d>,<TOPSPIN 2.1>,
      <abs ABSG = 3 
       data hash MD5: 32K
       8E 83 40 CC 63 C9 62 84 17 B5 48 B1 0B F0 E1 92>)
(   7,<2012-05-12 20:07:21.109 -0500>,<Administrator>,<TOPSPIN>,<proc1d>,<TOPSPIN 2.1>,
      <abs ABSG = 4 
       data hash MD5: 32K
       53 63 6D 7E 8A DA 94 14 27 49 4A 01 1F A8 BE 8C>)
(   8,<2012-05-12 20:07:21.140 -0500>,<Administrator>,<TOPSPIN>,<proc1d>,<TOPSPIN 2.1>,
      <abs ABSG = 5 
       data hash MD5: 32K
       8B A7 36 57 D0 42 C7 81 28 1A C2 B6 7E 99 CE 69>)
$$ ##END=
$$ 
$$ $$ hash MD5
$$ $$ 98 14 A7 4C 1E 91 12 E3 F7 37 4A 85 3D A9 7C C6
##$RELAX= 
##$RELAX= 
##$RELAX= 
##$RELAX= 
##$RELAX= 
##$RELAX= 
##$RELAX= 
$$ Bruker specific parameters
$$ --------------------------
$$ [...]
##$TP= (0..7)
150 150 150 150 150 150 150 150
##$TP07= 0
##$TPNAME0= <>
##$TPNAME1= <>
##$TPNAME2= <>
##$TPNAME3= <>
##$TPNAME4= <>
##$TPNAME5= <>
##$TPNAME6= <>
##$TPNAME7= <>
##$TPOAL= (0..7)
0.5 0.5 0.5 0.5 0.5 0.5 0.5 0.5
##$TPOFFS= (0..7)
0 0 0 0 0 0 0 0
##$TUNHIN= 0
##$TUNHOUT= 0
##$TUNXOUT= 0
##$USERA1= <user>
##$USERA2= <user>
##$USERA3= <user>
##$USERA4= <user>
##$USERA5= <user>
##$V9= 5
##$VALIST= <valist>
##$VCLIST= <CCCCCCCCCCCCCCC>
##$VD= 0
##$VDLIST= <DDDDDDDDDDDDDDD>
##$VPLIST= <PPPPPPPPPPPPPPP>
##$VTLIST= <TTTTTTTTTTTTTTT>
##$WBST= 2048
##$WBSW= 25
##$XGAIN= (0..3)
0 0 0 0
##$XL= 0
##$YL= 0
##$YMAX_a= 520306
##$YMIN_a= -602184
##$ZGOPTNS= <>
##$ZL1= 120
##$ZL2= 120
##$ZL3= 120
##$ZL4= 120
##$ABSF1= 14.98061
##$ABSF2= -5.57192
##$ABSG= 5
##$ABSL= 3
##$ALPHA= 0
##$AQORDER= 0
##$ASSFAC= 0
##$ASSFACI= 0
##$ASSFACX= 0
##$ASSWID= 0
##$AUNMP= <proc_prof1d_extract_pilot.lims>
##$AXLEFT= 0
##$AXNAME= <>
##$AXNUC= <1H>
##$AXRIGHT= 0
##$AXTYPE= 0
##$AXUNIT= <>
##$AZFE= 0.1
##$AZFW= 0.1
##$BCFW= 0
##$BC_mod= 0
##$BYTORDP= 0
##$COROFFS= 0
##$CY= 15
##$DATMOD= 1
##$DC= 0
##$DFILT= <>
##$DTYPP= 0
##$F1P= 0
##$F2P= 0
##$FCOR= 0.5
##$FTSIZE= 32768
##$FT_mod= 6
##$GAMMA= 0
##$GB= 0
##$INTBC= 1
##$INTSCL= 1
##$ISEN= 128
##$LB= 0
##$LEV0= 0
##$LPBIN= 0
##$MAXI= 10000
##$MC2= 0
##$MEAN= 0
##$ME_mod= 0
##$MI= 0
##$NCOEF= 0
##$NC_proc= -8
##$NLEV= 6
##$NOISF1= 0
##$NOISF2= 0
##$NSP= 0
##$NTH_PI= 0
##$NZP= 0
##$OFFSET= 14.98061
##$PC= 1
##$PHC0= 217.5677
##$PHC1= 0
##$PH_mod= 1
##$PKNL= yes
##$PPARMOD= 0
##$PPDIAG= 0
##$PPIPTYP= 0
##$PPMPNUM= 2147483647
##$PPRESOL= 1
##$PSCAL= 4
##$PSIGN= 0
##$PYNMP= <proc.py>
##$REVERSE= no
##$SF= 400.13
##$SI= 32768
##$SIGF1= 0
##$SIGF2= 0
##$SINO= 400
##$SIOLD= 32768
##$SPECTYP= <>
##$SREGLST= <1H.CDCl3>
##$SSB= 0
##$STSI= 32768
##$STSR= 0
##$SW_p= 8223.68421052632
##$SYMM= 0
##$S_DEV= 0
##$TDeff= 65536
##$TDoff= 0
##$TI= <>
##$TILT= no
##$TM1= 0
##$TM2= 0
##$TOPLEV= 0
##$USERP1= <user>
##$USERP2= <user>
##$USERP3= <user>
##$USERP4= <user>
##$USERP5= <user>
##$WDW= 1
##$XDIM= 32768
##$YMAX_p= 444212698
##$YMIN_p= -886652
##$CURPLOT= <Network HP LaserJet P1505>
##$CURPRIN= <$Network HP LaserJet P1505>
##$DFORMAT= <normdp>
##$LAYOUT= <+/1D_H.xwp>
##$LFORMAT= <normlp>
##$PFORMAT= <normpl>
##$SURQMSG= 1
$$ End of Bruker specific parameters
$$ ---------------------------------
##NTUPLES= NMR SPECTRUM
##VAR_NAME=  FREQUENCY,     SPECTRUM/REAL,   SPECTRUM/IMAG
##SYMBOL=    X,             R,               I
##VAR_TYPE=  INDEPENDENT,   DEPENDENT,       DEPENDENT
##VAR_FORM=  AFFN,          ASDF,            ASDF
##VAR_DIM=   32768,         32768,           32768
##UNITS=     HZ,            ARBITRARY UNITS, ARBITRARY UNITS
##FACTOR=    0.250966925370066, 1,           1
##FIRST=     8223.43324360095, -11007,       184834
##LAST=      0,             -48801,          -42243
##MIN=       0,             -886652,         0
##MAX=       8223.43324360095, 444212698,    0
$$ Real data points
##PAGE= N=1
##DATA TABLE= (X++(R..R)), XYDATA
$$ [...]
19555b02168k37574F3415a20071E1169K01160F1901i650q5305c0851r8195A2298
$$ -202168 -439742 63415 -120071 51169 252329 61901 -9650 -94955 -30851 -129046 12298
19543a21846A0103a99196B08813I8635K48168I8388g3473B95042c7352A50960
$$ -121846 10103 -199196 208813 98635 346803 98388 -73473 295042 -37352 150960
19532C2235J23155a85026I2547b48829e3557k68750C6900c07181J21761E7013
$$ 32235 155390 -185026 92547 -248829 -53557 -322307 36900 -307181 -185420 57013
19521B55729b24444c4661B01581m1494a83999j4539C1133a17645A26433g168I9903
$$ 255729 -224444 -34661 201581 160087 -183999 -198538 31133 -117645 126433 -7168 99903
19509c3189B86790d91672g1416o237e801k99459J24126d2410A18270b01811b7606
$$ -33189 286790 -491672 -71416 -77653 -5801 -305260 -181134 -42410 118270 -201811 -27606
19497a0326l4987k44244J35399A58533e0156m2423h070B63466F5196e6627A11675
$$ -10326 -45313 -289557 -154158 158533 -50156 -92579 -8070 263466 65196 -56627 111675
19485b48123B22493a1953n9581j95853e2457A4048a50962I2196a29062J7196F440
$$ -248123 222493 -11953 -71534 -267387 -52457 14048 -150962 92196 -129062 -111866 6440
19473b56009h266D10J29212G885N3112h6012j5629r6958l4415A34815B6892i2319
$$ -256009 -8266 410 129622 7885 60997 -86012 -101641 -198599 -233014 134815 26892 -92319
19460d0621C0278b45353H1166a32675a3545A91376D0352J65425D3073c65475a67386
$$ -40621 30278 -245353 81166 -132675 -13545 191376 40352 205777 43073 -365475 -167386
19448a29160J6175k7920B02516o3780d74880A4542f2448b8624J3870A74377a50521
$$ -129160 -112985 -140905 202516 138736 -474880 14542 -62448 -28624 -14754 174377 -150521
19436B40415a59922N087q4473d3507B18130a39491k1698n6277A8300Q7448a67491
$$ 240415 -159922 -154835 -239308 -43507 218130 -139491 -161189 -217466 18300 105748 -167491
19424a56283j67070A13748b29819j40701B24732a2012k62292C420a95010A06956
$$ -156283 -323353 113748 -229819 -370520 224732 -12012 -274304 3420 -195010 106956
19413C3586j5148a68721j37188l66759a06052q2958B2860J24472k4892b95914
$$ 33586 18438 -168721 -305909 -672668 -106052 -189010 22860 147332 122440 -295914
19402h1429A60569a08353b8402n3453I0349g8899E1239b41376Q2353N1406M7674
$$ -81429 160569 -108353 -28402 -81855 90349 -78899 51239 -241376 -159023 -107617 -59943
19391e9943j28621B0373i1469A5512J2153b29666A6868K45253d5902j09442b4851
$$ -59943 -188564 20373 -91469 15512 27665 -229666 16868 262121 -45902 -155344 -24851
19379H8011d0781r8594f5890r5153j79002a60701P8202K2395q1972A40273j5591
$$ 88011 -40781 -139375 -65890 -161043 -340045 -160701 -82499 -60104 -142076 140273 124682
19368A24682a62659b2099j80337L7118C2607j3560a37317f5022l0052A64794a98247
$$ 124682 -162659 -22099 -202436 -165318 32607 19047 -137317 -65022 -95074 164794 -198247
19356d5053a8090j16463G4006b75028O5203G9516a98121O2612a7062j76130E0939
$$ -45053 -18090 -134553 74006 -275028 -209825 79516 -198121 -135509 -17062 -193192 50939
19344b08631a02278A41195J27354a1510m7047j0158m2009j07576J00822q1835
$$ -208631 -102278 141195 268549 -11510 -58557 -68715 -110724 -218300 -117478 -199313
19334a99313d8415D6525O6683N6317d9064K1779j78658m0244I4366J47399Q5914
$$ -199313 -48415 46525 113208 169525 -49064 -27285 -205943 -246187 94366 241765 327679
19323C27679A1670R8472a80314f7319k7541C19002a01088F471M39824a12602a8634
$$ 327679 11670 110142 -180314 -67319 -94860 319002 -101088 6471 446295 -112602 -18634
19311d6884L251j62016N6672D6892h1145A30145g6534j41718P4301e8377p5726
$$ -46884 -43633 -205649 -148977 46892 -81145 130145 -76534 -218252 -143951 -58377 -134103
19300a34103j36067D38992C5897A2984Q3962F049Q2820d20057D40858F7151b21885
$$ -134103 -270170 438992 35897 12984 96946 6049 88869 -420057 440858 67151 -221885
19288A87304H4781J0584j2338L6104a01889G813J70250a50948A62602a40229k69775
$$ 187304 84781 95365 83027 119131 -101889 7813 178063 -150948 162602 -140229 -410004
19277d10004a1428m943A848J85135a35032A00789c1212j44478H833J40264a80074
$$ -410004 -11428 -16371 1848 186983 -135032 100789 -31212 -175690 8833 149097 -180074
19265b06532J8847l7197C818R3131c63015a20383a0601j13730p4073D363O1649
$$ -206532 -187685 -224882 3818 96949 -363015 -120383 -10601 -124331 -198404 4363 66012
19254F6012O3505a57542N8299C28400c46122J61862A2422J82271h7895p98757
$$ 66012 129517 -157542 -99243 328400 -346122 -184260 12422 194693 -87895 -886652
19244h86652B14196F4049a27366j17769A11901m375O8486b93220J11512d5459
$$ -886652 214196 64049 -127366 -245135 111901 107526 176012 -293220 -181708 -45459
19233a92122A57015E1670c6170l19834g8894G2158A111J73240B3021L2185i3164
$$ -192122 157015 51670 -36170 -356004 -78894 72158 1111 174351 23021 55206 -93164
19221A29284a81917o8484j79642a87243j01039q003J14778B37113f7543j09947
$$ 129284 -181917 -250401 -430043 -187243 -288282 -296285 -181507 237113 -67543 -177490
19211a77490r4494J33353J3545j5755d3418J8656l15760a57116k0233d3227B29720
$$ -177490 -271984 -138631 -125086 -140841 -43418 -24762 -340522 -157116 -177349 -43227 229720
19199a84447E8501i537p7863A07177D0404K15597c00402A57621a45347G1833A4061
$$ -184447 58501 -9537 -87400 107177 40404 256001 -300402 157621 -145347 71833 14061
19187C57015a33340b4664I8131i4683I8721K892f3530q2544B27444I6373m7821
$$ 357015 -133340 -24664 98131 -94683 98721 101613 -63530 -146074 227444 96373 48552
19176D8552b7551k20729N6768A45329a05152j08103I8565c55029d1089k2117l14866
$$ 48552 -27551 -248280 -191512 145329 -105152 -213255 98565 -355029 -41089 -63206 -378072
19165c78072J64890L6321B93558a22040A56600j6608g773l286F4461B5038K4858
$$ -378072 -213182 -176861 293558 -122040 156600 139992 -7773 -11059 64461 25038 49896
19154D9896b57703Q4534L3900c6819l71251J68898N3157Q6169d6741k46155i9878
$$ 49896 -257703 -173169 -139269 -36819 -408070 -239172 -186015 -99846 -46741 -292896 -99878
19142a47877C16869a7902I4016J28295E7294c57668C45696b53491J6722Q8141
$$ -147877 316869 -17902 94016 222311 57294 -357668 345696 -253491 -236769 -148628
19132a48628A43810d847k6790n4722k92833A61800b11692N2942l6644P5570j03195
$$ -148628 143810 -4847 -31637 -86359 -379192 161800 -211692 -158750 -195394 -119824 -223019
19121b23019A02796J0592l0231c18386Q4713j4368h9849j46114j2730i2672a8467
$$ -223019 102796 113388 83157 -318386 -233673 -248041 -89849 -235963 -248693 -92672 -18467
19109C943a42451B62765a82695m4305h8826C6597d83238A4091O9234b0787B06580
$$ 3943 -142451 262765 -182695 -227000 -88826 36597 -483238 14091 83325 -20787 206580
19097A34935e0685H928J4650M4011J39516c3237C17281A1077f0866E5358A9016
$$ 134935 -50685 8928 23578 67589 207105 -33237 317281 11077 -60866 55358 19016
19085d9067m5763j66765J07375k51842J53439k5081E311a55796A47342h1081a7779
$$ -49067 -94830 -261595 -154220 -406062 -252623 -277704 5311 -155796 147342 -81081 -17779
19073d6529D0425K03468c82761a46312C58484h4588k10228J30537P340j04367
$$ -46529 40425 243893 -382761 -146312 358484 -84588 -294816 -164279 -156939 -261306
19063b61306F9897J8775e0407D2773a48567N0156l5686j42170q6583a49788j57860
$$ -261306 69897 88672 -50407 42773 -148567 -98411 -134097 -276267 -362850 -149788 -307648
19052c07648c7654l9146m5691F7821a80350D975b36735A42479L6929B381b34890
$$ -307648 -37654 -76800 -122491 67821 -180350 4975 -236735 142479 179408 2381 -234890
19040a59825B53413D5525a87885B1516R9293a40021h805k17435H8694d10A43036
$$ -159825 253413 45525 -187885 21516 120809 -140021 -8805 -226240 88694 -410 143036
19028b72135B45170i8414A44490g8502N7G6943c11442J38226m8754D9305L1O9831
$$ -272135 245170 -98414 144490 -78502 -78445 76943 -311442 -173216 -221970 49305 49336 119167
19016A19167k7009c02374A87987a21710I9269K11151C949J763J82280Q7362a03946
$$ 119167 92158 -302374 187987 -121710 99269 310420 3949 5712 187992 275354 -103946
19004a13390j60459B96247a28436A34954J94694f4677D52381A77653J06202a62216
$$ -113390 -273849 296247 -128436 134954 329648 -64677 452381 177653 283855 -162216
18993C07013A3479c70489C6331b58964B23033H3981a59527A10139J03566a73884
$$ 307013 13479 -370489 36331 -258964 223033 83981 -159527 110139 213705 -173884
18982A97824D5667J22365C5541b69871k0910J31977P9328j50053R5910G3847b2635
$$ 197824 45667 168032 35541 -269871 -290781 -158804 -79476 -229529 -133619 73847 -22635
18970B87266g4630k8090B82939a01628j35981L7234A97103F7828b04575D3320
$$ 287266 -74630 -102720 282939 -101628 -237609 -200375 197103 67828 -204575 43320
18959E4975e36411A09496D5147c46884e9540k02679a25777B84457A33016h1675
$$ 54975 -536411 109496 45147 -346884 -59540 -262219 -125777 284457 133016 -81675
18948B40700b08704m0389A38009E4842h7826J9461K0969j24145j16186A80120
$$ 240700 -208704 -249093 138009 54842 -87826 -68365 -47396 -171541 -287727 180120
18937I063a81348k86183a31787b8825m9699G3936a42758K6987j07763J06885j35353
$$ 9063 -181348 -467531 -131787 -28825 -78524 73936 -142758 -115771 -223534 -116649 -252002
18926b52002n1571J45717j14914F1877a864A51694b33864F7160a81484m3118P6091
$$ -252002 -303573 -157856 -272770 61877 -1864 151694 -233864 67160 -181484 -224602 -148511
18915a48511m4268h4902h342c486j35033N4880D9325J0730a80011A2233L526b81041
$$ -148511 -192779 -84902 -8342 -3486 -138519 -83639 49325 60055 -180011 12233 15759 -281041
18902A25641Q2332a86417A53553E5335J8347K87839A39832a27118A68122F0233
$$ 125641 207973 -186417 153553 55335 73682 361521 139832 -127118 168122 60233
18891b07817i0031j13938f6819j54248R0725A57950p3959J62458J83001D7070
$$ -207817 -90031 -203969 -66819 -221067 -130342 157950 83991 246449 429450 47070
18880d86051a76962B1373L6316c37366G1004a99090B00619A9621a65907A98435
$$ -486051 -176962 21373 57689 -337366 71004 -199090 200619 19621 -165907 198435
18869a52228j11802A14537d5220K36j61132j05589G9768c37347F2456a68891H649
$$ -152228 -264030 114537 -45220 -44984 -206116 -311705 79768 -337347 62456 -168891 8649
18857a14993B9511a58574B7923a63959K2814j47268A10527i9307l5211J7304H399
$$ -114993 29511 -158574 27923 -163959 -141145 -288413 110527 -99307 -134518 -117214 8399
18845A96846a1508j47467O0989J8076a0879p1097A35726C7259b11517b2155K972
$$ 196846 -11508 -158975 -97986 -79910 -10879 -81976 135726 37259 -211517 -22155 -19183
18834a9183k4624j85111R4261F7186P9552b03045d8917k45587A31642B125R5652
$$ -19183 -43807 -228918 -134657 67186 146738 -203045 -48917 -294504 131642 2125 97777
18823I7777a85039e0208J4632r6084j85559a23960K0603m2084A2986J45974D6276
$$ 97777 -185039 -50208 -35576 -131660 -317219 -123960 -103357 -145441 12986 158960 46276
18811d7353j69582A93651b52038A42315b60614E3133O2861L2138m3568b55163
$$ -47353 -216935 193651 -252038 142315 -260614 53133 115994 148132 104564 -255163
18800A34348g7795A41108J5452L76793a13512b0586r6554j9037K4722G0881N832
$$ 134348 -77795 141108 156560 533353 -113512 -20586 -117140 -136177 -111455 70881 76713
18789G6713c34392A54923b62690b9509j69312A16287a05402j41965a02478N754
$$ 76713 -334392 154923 -262690 -29509 -198821 116287 -105402 -247367 -102478 -96724
18779i6724k48414k1118e0078l13325a02434a0023j14080j16862A1125a4887j18761
$$ -96724 -345138 -366256 -50078 -363403 -102434 -10023 -124103 -240965 11125 -14887 -133648
18768a33648o8224M9946C27472B1295a24016A34136K74653A5280J86363a49480
$$ -133648 -201872 -151926 327472 21295 -124016 134136 408789 15280 201643 -149480
18757d0232A64272c75403C36625D6499K759d15089I7327L6648Q6063a24730l17745
$$ -40232 164272 -375403 336625 46499 49258 -415089 97327 133975 220038 -124730 -442475
18746d42475a00249A50233d6592n9321l1811N0283E3699a57856e8863A62634J1541
$$ -442475 -100249 150233 -46592 -105913 -137724 -87441 53699 -157856 -58863 162634 174175
18735A74175a80835g5831j05855M2233L1130C669h0657j4096C4903b65280a30213
$$ 174175 -180835 -75831 -181686 -139453 -108323 3669 -80657 -94753 34903 -265280 -130213
18723a33195C25433j53467b26911a10670C2733b67204f1811C5016b51957i077
$$ -133195 325433 171966 -226911 -110670 32733 -267204 -61811 35016 -251957 -9077
18712h8704a6332A91547i7711E1695J880B0403i8256J0111Q162a3745k76278B9606
$$ -88704 -16332 191547 -97711 51695 53575 20403 -98256 -88145 -79983 -13745 -290023 29606
18699A08219f9637B4315d5785A4132b54531I5931h5004K464A30314A8686a96269
$$ 108219 -69637 24315 -45785 14132 -254531 95931 -85004 -82540 130314 18686 -196269
18687a75040J6692A5778J88003d7547B44477j20140b02814F5026C0634K3964f831
$$ -175040 -158348 15778 203781 -47547 244477 124337 -202814 65026 30634 54598 -6831
18675g1065l22123a12765A71407d1282j32952d328A53626c05246e6612B6907c9640
$$ -71065 -393188 -112765 171407 -41282 -174234 -4328 153626 -305246 -56612 26907 -39640
18663a09305A21721a83892k36731K04771q4818G127R0464a98176g4454L0177C3988
$$ -109305 121721 -183892 -420623 -215852 -300670 7127 97591 -198176 -74454 -44277 33988
18651a52046d7650I8716o893a33867m0742n5590k448m5735K7400H0457g3311A08208
$$ -152046 -47650 98716 91823 -133867 -174609 -230199 -232647 -278382 -250982 80457 -73311 108208
18638B4316b72635b0486j77515A58955a62888B70019e3945j50308D5511a24746
$$ 24316 -272635 -20486 -198001 158955 -162888 270019 -53945 -204253 45511 -124746
18627f147B75736a24817j11606O7633a5129B42709q5417F1768f4420p8191L4988
$$ -6147 275736 -124817 -236423 -168790 -15129 242709 157292 61768 -64420 -142611 -107623
18616a07623o9533P8217l189B82892a00031r457j27358a7262C0755N4900e1502
$$ -107623 -177156 -98939 -102128 282892 -100031 -109488 -236846 -17262 30755 85655 -51502
18604I5179c41170A92370H5120d6370o6641H5936L1085j8405P1529B9508e531
$$ 95179 -341170 192370 85120 -46370 -113011 85936 117021 98616 170145 29508 -5531
18592b66287j30630C3698O4385c22802J25451A25269E5417c8003l6557I8895a11035
$$ -266287 -396917 33698 98083 -322802 -197351 125269 55417 -38003 -74560 98895 -111035
18580I5736a37488c9060o0977A0915a38838K0430r7284B10023b2286m06947b291
$$ 95736 -137488 -39060 -100037 10915 -138838 -118408 -215692 210023 -22286 -429233 -2291
18568A69562a50476l482j76152j40449a06544A64208g6407B22859c17295a18551
$$ 169562 -150476 -153958 -330110 -470559 -106544 164208 -76407 222859 -317295 -118551
18557a27553b4960G0712a53432O60j19309c1011A17125h0478D0924N6811J89053
$$ -127553 -24960 70712 -153432 -152772 -272081 -31011 117125 -80478 40924 97735 286788
18546B86788F9735d8332j62661C40143j10624a496D4218J21338b87231J15762
$$ 286788 69735 -48332 -210993 340143 229519 -1496 44218 165556 -287231 -171469
18536a71469D4731J09993N9161b48823j00764a28204k873I3497h1555c9760A40572
$$ -171469 44731 154724 213885 -248823 -349587 -128204 -131077 93497 -81555 -39760 140572
18524g7571c6350B863e10245a02247D00619a90876R5023L6360B23443B1054a28590
$$ -77571 -36350 2863 -510245 -102247 400619 -190876 -95853 -59493 223443 21054 -128590
18512a78782H8771c68635g9169D85968i1505j23086j55666A64591D7667b4112
$$ -178782 88771 -368635 -79169 485968 -91505 -214591 -370257 164591 47667 -24112
18501c67926J11007A17261Q5436A3902k564i5185L9955I3269b22922H9447b307
$$ -367926 -256919 117261 202697 13902 11338 -95185 -55230 93269 -222922 89447 -2307
18489f6166A8003J3972i6020p219r595o8698j54813B15639F5016c5444j66560
$$ -66166 18003 31975 -96020 -103239 -112834 -181532 -336345 215639 65016 -35444 -202004
18478b02004g6986j22383j194k1972B0399d3236D9788a40848N816j4540A04050
$$ -202004 -76986 -199369 -200563 -222535 20399 -43236 49788 -140848 -135032 -149572 104050
18466a24520A09809c43350H6400o933g0748I0772k5276a96627f712k45586b2006
$$ -124520 109809 -343350 86400 79467 -70748 90772 65496 -196627 -6712 -252298 -22006
18454a08303C18395a30738E73095b97970f1993A5531a74017I8849a17180I0856
$$ -108303 318395 -130738 573095 -297970 -61993 15531 -174017 98849 -117180 90856
18443b20596E793J15546L5090a47234B50266d26828a06247c1847j84387A10970
$$ -220596 5793 121339 156429 -147234 250266 -426828 -106247 -31847 -216234 110970
18432b92634O1636J08759H7679R968D2658a29167L4209A56350c57321B03608a22544
$$ -292634 -230998 -122239 87679 97647 42658 -129167 -94958 156350 -357321 203608 -122544
18420a59050K6906M9009E3047a00949j4480d9446A94444a84762E1620k2339b0665
$$ -159050 -132144 -83135 53047 -100949 -115429 -49446 194444 -184762 51620 29281 -20665
18408e52246a62325B19753c06467a46627j10773O2145D240B92N7930c25123B9999
$$ -552246 -162325 219753 -306467 -146627 -257400 -195255 4240 292 58222 -325123 29999
18396a37230C1470c5547F5911K98001I2132a28844l0554A56831K211g2026I6249
$$ -137230 31470 -35547 65911 363912 92132 -128844 -159398 156831 159042 -72026 96249
18384F704b51118a23176l05333A2747L43427j54977C9914O0617K9411k9660J1205
$$ 6704 -251118 -123176 -428509 12747 356174 201197 39914 100531 129942 100282 111487
18373A11487c56061g7091G2148B1906a31264G4862J15742j2354E6216j9382J06048
$$ 111487 -356061 -77091 72148 21906 -131264 74862 190604 178250 56216 36834 142882
18362A42882b0316k52602p113q2287a9906j71665a1293j60741h4028B60943e6074
$$ 142882 -20316 -272918 -280031 -362318 -19906 -191571 -11293 -172034 -84028 260943 -56074
18350h9861r2084A48027M6745c4788D8320b0054q599l9531k28913d3521k1927
$$ -89861 -181945 148027 194772 -34788 48320 -20054 -28653 -68184 -297097 -43521 -65448
18339f5448l64696C0354a27666q5248e0958l6908j19566A94188b5509H1619d57653
$$ -65448 -430144 30354 -127666 -212914 -50958 -87866 -207432 194188 -25509 81619 -457653
18327F1938b28568k6093h1773j8001A28998O8833a95337k9127a09363C0160M9194
$$ 61938 -228568 -254661 -81773 -99774 128998 197831 -195337 -224464 -109363 30160 79354
18316G9354b1709F6773j1909b8386j6770A17557b53594a6198C1380c9311j5690
$$ 79354 -21709 66773 54864 -28386 -45156 117557 -253594 -16198 31380 -39311 -55001
18305e5001J2132A23007c63031m0484A13903g4642k05561A22428f5207G5526R5433
$$ -55001 -42869 123007 -363031 -403515 113903 -74642 -280203 122428 -65207 75526 170959
18294A70959J9108p7716M8734m1834R6993j06297a77460d0950n9852j27466A90551
$$ 170959 190067 112351 161085 119251 216244 109947 -177460 -40950 -100802 -228268 190551
18282a27642o502B0230b12306A95479a1880B4000e9858B28863j6289C5909a20013
$$ -127642 -134144 20230 -212306 195479 -11880 24000 -59858 228863 212574 35909 -120013
18270b0684j48937M2479o7427B88747f7177A91786b38625A36700a96400D7184
$$ -20684 -169621 -127142 -194569 288747 -67177 191786 -238625 136700 -196400 47184
18259d7845j3697j06278A33461a65940j3091J0971c4472p9993p72N7575A42366
$$ -47845 -61542 -167820 133461 -165940 -179031 -168060 -34472 -114465 -115237 -57662 142366
18247a81940D6998P5261b0130F3329b35095B7442d9113I641J28880g8225F0223
$$ -181940 46998 122259 -20130 63329 -235095 27442 -49113 9641 138521 -78225 60223
18235D29287d4953o5434N0354B11310B4708c58224E0296a32870O5145o7441q9944
$$ 429287 -44953 -110387 -60033 211310 24708 -358224 50296 -132870 -67725 -135166 -225110
18224b25110H8355K45287B1280b93674o3897J43541N3840j11686h3113j40462
$$ -225110 88355 333642 21280 -293674 -357571 -214030 -160190 -271876 -83113 -223575
18214b23575h0291A41142f1842r9134L4739r8614j32076h5838j70003F0114a94923
$$ -223575 -80291 141142 -61842 -160976 -126237 -224851 -356927 -85838 -255841 60114 -194923
18202B12946d6565j25526a3093j9366j98127F0025L5035a99104B57657j16163
$$ 212946 -46565 -172091 -13093 -32459 -230586 60025 95060 -199104 257657 141494
18192A41494m1904d03312B22848g696j80494g2905q5414f5191B97610A11135b54415
$$ 141494 99590 -403312 222848 -7696 -188190 -72905 -158319 -65191 297610 111135 -254415
18180b34438A62513D6816b67866F2912a33142d8605p8935A23644g4199A47976
$$ -234438 162513 46816 -267866 62912 -133142 -48605 -127540 123644 -74199 147976
18169a4678A67482e7321K417m17799D2303a79110H4164d5169p3097k0544m4537
$$ -14678 167482 -57321 -54904 -472703 42303 -179110 84164 -45169 -118266 -138810 -183347
18158a83347o2768A76198F593b36513a11636A5457b27180A13342a74089k5156
$$ -183347 -246115 176198 6593 -236513 -111636 15457 -227180 113342 -174089 -199245
18148a99245d8002j01458a6987E332J6585a01422j60675b9499A69384a44374H3414
$$ -199245 -48002 -149460 -16987 5332 21917 -101422 -262097 -29499 169384 -144374 83414
18136a94194b6283J1234A2882J64351b04888A04447B2292b43452e7222B03320
$$ -194194 -26283 -15049 12882 177233 -204888 104447 22292 -243452 -57222 203320
18125i9095F2458J87884b72046b2291A36619F1868a96371d7161a030A80c92533
$$ -99095 62458 250342 -272046 -22291 136619 61868 -196371 -47161 -1030 180 -392533
18113e5986k30762B66646e0124H0542b23556e8049j3212j73443j69130C36293
$$ -55986 -286748 266646 -50124 80542 -223556 -58049 -71261 -244704 -413834 336293
18102E4806c2317J4910j4605l4814A40583e3201j36310B9411g0877k87939d8145
$$ 54806 -32317 -17407 -32012 -66826 140583 -53201 -189511 29411 -70877 -358816 -48145
18090d3193I2312e7616k04304c6792b106B31995E5680b08495D88a05354B2445
$$ -43193 92312 -57616 -261920 -36792 -2106 231995 55680 -208495 488 -105354 22445
18078A5827J18689c91583J37709f5809n2724B8653a55514m9301A08249c8020F3270
$$ 15827 134516 -391583 -253874 -65809 -118533 28653 -155514 -204815 108249 -38020 63270
18066B50221l5969j7650e1841e264o2833A3481M4878g3860H0836k7253a69481
$$ 250221 214252 196602 -51841 -5264 -68097 13481 58359 -73860 80836 53583 -169481
18054B10062B0882R9681a56442G9843k2478r916L6270l0619b8588A15218f276
$$ 210062 20882 120563 -156442 79843 57365 47449 83719 53100 -28588 115218 -6276
18042A4705g6476j18176B42209c61439b8944k41926a09069A81930b23063I1857
$$ 14705 -76476 -194652 242209 -361439 -28944 -270870 -109069 181930 -223063 91857
18031A359K53482d24649A33754J0664g8310c410j80115E2102R4162K3286a873
$$ 1359 254841 -424649 133754 144418 -78310 -3410 -183525 52102 146264 169550 -1873
18019a09696l3124o1335h617j05277m232M3255A75179d98023a0470j48381N804
$$ -109696 -142820 -204155 -8617 -113894 -118126 -74871 175179 -498023 -10470 -158851 -153047
18008a53047K4592n0157f0824j019m53499i1973c5415A83937a62700A75266b03214
$$ -153047 -128455 -178612 -60824 -61843 -515342 -91973 -35415 183937 -162700 175266 -203214
17996F4481a86734Q8264M6331F4004e5494A03233J14714k795A9574q264a54922
$$ 64481 -186734 -98470 -52139 64004 -55494 103233 217947 215152 19574 11310 -154922
17984H4747b1841l94757B76690f6071k0126C7449q963K34331a04890j25693A19819
$$ 84747 -21841 -416598 276690 -66071 -86197 37449 28486 262817 -104890 -230583 119819
17972a55208A20442a15516G290B926b48096J18284j03187B02686f5360c367j72270
$$ -155208 120442 -115516 7290 2926 -248096 -129812 -232999 202686 -65360 -3367 -175637
17961a75637Q3060r4545B06061F1552c48263a4245H4142K56983j56822h9511B40473
$$ -175637 -92577 -187122 206061 61552 -348263 -14245 84142 341125 184303 -89511 240473
17949a04281j37796H4296a50750F97530B7786b20851H9745a71273A31940M7849
$$ -104281 -242077 84296 -150750 697530 27786 -220851 89745 -171273 131940 179789
17939A79789f2106A91893D4806E156K90013j9314a39764A30111F2790J1171b03036
$$ 179789 -62106 191893 44806 5156 295169 275855 -139764 130111 62790 73961 -203036
17927c9789k08372A51115b52496B76507b25031c2743E8529N5010B4326d3464D5774
$$ -39789 -248161 151115 -252496 276507 -225031 -32743 58529 113539 24326 -43464 45774
17915B63332a15012D3509M7420J46263A01666b22501a02209A6873J2959a73964
$$ 263332 -115012 43509 90929 237192 101666 -222501 -102209 16873 29832 -173964
17904h6888p8379C8565L5223p155b6868C32584r7952E8578J18313J1655b62014
$$ -86888 -165267 38565 73788 66633 -26868 332584 234632 58578 176891 188546 -262014
17892G1576i9281M5704j7930k13782E3394M1207c1750p2367a8215A23520l0173
$$ 71576 -99281 -53577 -71507 -285289 53394 94601 -31750 -104117 -18215 123520 93347
17881I3347i136A95357c08544B15683d04900b0927A75084c32681B28570A8257
$$ 93347 -9136 195357 -308544 215683 -404900 -20927 175084 -332681 228570 18257
17870d6319l7843M1096j46383C256N7455L3405e2874p9747H9572k7807K6568K66561
$$ -46319 -84162 -43066 -189449 3256 60711 94116 -52874 -132621 89572 61765 88333 354894
17858C54894b88976k33447A74281o110J18283A18661b68814F871b13974F399f4017
$$ 354894 -288976 -522423 174281 168171 286454 118661 -268814 6871 -213974 6399 -64017
17846b65405D8390O3163g170E4949a51023q2119o0434f2249A57789c41386A33669
$$ -265405 48390 111553 -7170 54949 -151023 -233142 -293576 -62249 157789 -341386 133669
17834i8631k28683d3310E0632J43584A8405a19711A11789J12689a88124m588A74810
$$ -98631 -327314 -43310 50632 194216 18405 -119711 111789 224478 -188124 -192712 174810
17822A25845d24598J90473A6149g0785k01089q209A02325J35213b00069A7809
$$ 125845 -424598 -234125 16149 -70785 -271874 -280083 102325 237538 -200069 17809
17811b25594D5318Q0667m2831j2386a37033B41264d6790O019A41869k5181k4832
$$ -225594 45318 125985 83154 70768 -137033 241264 -46790 -40771 141869 116688 91856
17800I1856b56381A15247b05143j88082J02343A8489M6802k8063c7428D28420
$$ 91856 -256381 115247 -205143 -393225 -290882 18489 65291 37228 -37428 428420
17789a70992C9541K62944i2253l0055b6498m7509B31524p0674i5710A2379L26307
$$ -170992 39541 302485 -92253 -122308 -26498 -74007 231524 160850 -95710 12379 338686
17778C38686f5938B92290g1076G721L8035i2830q5086g298k294k47655A74227
$$ 338686 -65938 292290 -71076 7721 45756 -92830 -177916 -7298 -9592 -257247 174227
17766g1279k07793j09751c1410C12298a21433A01002a9761k843A6220e1875l46934
$$ -71279 -279072 -388823 -31410 312298 -121433 101002 -19761 -22604 16220 -51875 -398809
17755c98809J77949A78805c1851j0375A27868j9123a36428o8871B5338A0107b71970
$$ -398809 -220860 178805 -31851 -42226 127868 108745 -136428 -205299 25338 10107 -271970
17743D20276C640a33341j50324d6812A05847b5754B68109n2341b67301i9967l2513
$$ 420276 3640 -133341 -283665 -46812 105847 -25754 268109 215768 -267301 -99967 -132480
17732a32480M6767A60890i8096N704j18202i349A80419b7479A43482c84973a9922
$$ -132480 -85713 160890 -98096 -92392 -210594 -9349 180419 -27479 143482 -384973 -19922
17720I5997m5459a10109D6850k2937a46630j14511A33478n3351A3364b74446J11064
$$ 95997 50538 -110109 46850 23913 -146630 -261141 133478 80127 13364 -274446 -163382
17709a63382h0247C3310a60947E3820K25494b6109B22950a05621F96K44498A08705
$$ -163382 -80247 33310 -160947 53820 279314 -26109 222950 -105621 696 245194 108705
17697D2715P5473a00F7891A7965b18901B56380A1046M0024a84010k65740C8i9775
$$ 42715 118188 -100 67891 17965 -218901 256380 11046 51070 -184010 -449750 38 -99775
17684a32603B49891b5299H8937M8449D1595K87165A30528n2659b02919d260B59611
$$ -132603 249891 -25299 88937 137386 41595 328760 130528 77869 -202919 -4260 259611
17672f9515A62956l0774a89616B58942J53513E3278d5270D6014K0923M815A812
$$ -69515 162956 132182 -189616 258942 412455 53278 -45270 46014 66937 71752 1812
17660C9310K2256a82261m4420H0611c26340a43730o4971Q5016q6013d0024B1323
$$ 39310 61566 -182261 -226681 80611 -326340 -143730 -208701 -123685 -209698 -40024 21323
17648c3085B7029J46907b44241a8496j31263q0216i9415p5570C2624K49784j08138
$$ -33085 27029 173936 -244241 -18496 -149759 -229975 -99415 -174985 32624 282408 174270
17637A74270b794A13460b97819b4985h680j0885A51024e6832B78606A06304J04133
$$ 174270 -2794 113460 -297819 -24985 -8680 -19565 151024 -56832 278606 106304 210437
17626B10437o3110k974a61388j9804d0716B72592a89198E1173a43216c4666j37660
$$ 210437 147327 144353 -161388 -181192 -40716 272592 -189198 51173 -143216 -34666 -172326
17615a72326H8384a43391L9874r8052A40086b3520C0010e2002B16658F5180q115
$$ -172326 88384 -143391 -103517 -201569 140086 -23520 30010 -52002 216658 65180 57065
17604E7065g3917B09788b76707B46887j05930D5814K9234L12056e1592B43890
$$ 57065 -73917 209788 -276707 246887 140957 45814 75048 387104 -51592 243890
17593b5792l67653a84041A67191l7303j1689O9052g9885B60553a74601N2292B068
$$ -25792 -393445 -184041 167191 129888 118199 187251 -79885 260553 -174601 -122309 2068
17581A83640a13326j09544C9053a29680e5757k9320b7802o1788b4596B01498h2556
$$ 183640 -113326 -222870 39053 -129680 -55757 -85077 -27802 -89590 -24596 201498 -82556
17569B61022f4923B73478e4851j77164J4573A55929C0657a32703b4067n5333C6877
$$ 261022 -64923 273478 -54851 -232015 -217442 155929 30657 -132703 -24067 -79400 36877
17557a19124A21227b53797B72417a23471k19801E9165a22656B97604j07162a74321
$$ -119124 121227 -253797 272417 -123471 -343272 59165 -122656 297604 190442 -174321
17546a93358P053B15941D2846r895P6044P0923b4007o0381A99915R1203D7307
$$ -193358 -186305 215941 42846 32951 108995 179918 -24007 -84388 199915 291118 47307
17534A28740O802K7626d1184D3395g5587A26807b03715e5938E0096J45084L7238
$$ 128740 135542 163168 -41184 43395 -75587 126807 -203715 -55938 50096 195180 232418
17523B32418b3136k99271a59970G4779a70057K4636k23834a80999D56296g5713
$$ 232418 -23136 -322407 -159970 74779 -170057 -145421 -369255 -180999 456296 -75713
17512h056j40779A94723E1713L01525a20506M2959b595k22604c8269j61114Q646
$$ -8056 -148835 194723 51713 353238 -120506 -77547 -2595 -225199 -38269 -199383 -190737
17501a90737A46902C739J30773K4689a60010A23840L2295J07818J7942d4482J5103
$$ -190737 146902 3739 134512 159201 -160010 123840 156135 263953 281895 -44482 -29379
17490b9379A76088F6849i5810D09679j20482k9736G5775C6158J45990d3448B20424
$$ -29379 176088 66849 -95810 409679 289197 259461 75775 36158 182148 -43448 220424
17478h6417B14339L5646h8700A71806E1715Q0894J1078e0495I1995J09684b01031
$$ -86417 214339 249985 -88700 171806 51715 132609 143687 -50495 91995 201679 -201031
17466a99355F231a91167H343J71491p4076K44551K9763c4871D5400L2373j7119
$$ -199355 6231 -191167 8343 179834 105758 350309 380072 -34871 45400 77773 60654
17455F0654R4680C7553M01515A22910a28560e1131E7489k2827R0189c8000B46728
$$ 60654 155334 37553 439068 122910 -128560 -51131 57489 34662 124851 -38000 246728
17443A51865l5666C4023a42786e5319C41634D2212K10294j00646J04161r1650
$$ 151865 116199 34023 -142786 -55319 341634 42212 252506 151860 256021 164371
17433A64371a3115A04949K9246L87505j69070F3442A8249K96505j9149b78891
$$ 164371 -13115 104949 134195 521700 352630 63442 18249 314754 295605 -278891
17422D66308j85580L10746k21701J08159J57451k23724a4225D10670E6319K67967
$$ 466308 280728 591474 369773 477932 635383 411659 -14225 410670 56319 324286
17412C24286o1157j07966K65398O6525j47701a02850C83589j78397E1675J02624
$$ 324286 263129 155163 420561 487086 339385 -102850 383589 205192 51675 154299
17402A54299L9755R0782K37958i8664C56107C5887L21271j46652g2387C08326
$$ 154299 194054 284836 522794 -98664 356107 35887 357158 210506 -72387 308326
17391f6511B48310l3775o1641K6478K9202K331J67438A73802F7341J91017m7871
$$ -66511 248310 214535 152894 179372 208574 210905 378343 173802 67341 258358 210487
17380B10487N787G7331k9503K16847d5228C16714J06279i9035o0200C98726F6056
$$ 210487 216274 77331 47828 264675 -45228 316714 422993 -99035 -159235 398726 66056
17368C42252A39340h2166A61317m1566J28442G9381P204O7368g6167A7195Q5916
$$ 342252 139340 -82166 161317 119751 248193 79381 86585 153953 -76167 17195 103111
17357A03111Q3607j898G6682J70798E5905Q8864J233m9635d0140A3527J29899
$$ 103111 186718 184820 76682 247480 55905 144769 146002 96367 -40140 13527 143426
17346A43426O6824I9234L3952C4137L67803G9916J02535d5230I8980Q4659o8327
$$ 143426 210250 99234 133186 34137 401940 79916 182451 -45230 98980 183639 115312
17335A15312g765E12313i4990j9775D04231J29762A80536q7559N9849a29519B26076
$$ 115312 -7765 512313 -94990 -114765 404231 533993 180536 92977 152826 -129519 226076
17323A7893L02986a87102J8163A2861M9571a80893A86406A6393R1594i097J893
$$ 17893 320879 -187102 -168939 12861 62432 -180893 186406 16393 107987 -9097 -7204
17312g204j49189k8672B03026c6405A91348C3082M6428a34841B23787A00482K89767
$$ -7204 -156393 -185065 203026 -36405 191348 33082 79510 -134841 223787 100482 390249
17301C90249j90342q0696e6022a7339C04404A39490m7236C4972M86866A42815
$$ 390249 199907 119211 -56022 -17339 304404 139490 92254 34972 521838 142815
17290C2322J43309K01200I5800K59542J15561B08624p392a07828a0812H6353K81963
$$ 32322 175631 376831 95800 355342 470903 208624 201232 -107828 -10812 86353 368316
17279C68316b34538A74106P9363Q8935H8820h1017B3621h3562H5689J85984J02373
$$ 368316 -234538 174106 253469 342404 88820 -81017 23621 -83562 85689 271673 374046
17268C74046h5609C75905A61766A789L92193c86177d2099C02702G2457B3863O6864
$$ 374046 -85609 375905 161766 1789 393982 -386177 -42099 302702 72457 23863 90727
17257I0727J82762a5153F2199h8994B9569A33L38357j6601F6783r963K06446j7798
$$ 90727 273489 -15153 62199 -88994 29569 133 338490 321889 66783 56820 263266 245468
17245B45468D1527g8085C51112H3444N95619c2951G2392J62611j02277R9708H9040
$$ 245468 41527 -78085 351112 83444 679063 -32951 72392 235003 132726 232434 89040
17233a44344M4801l3958D4979L17050A45620D7416J43110m5413L89297F4917J74654
$$ -144344 -99543 -133501 44979 362029 145620 47416 190526 145113 534410 64917 239571
17222B39571J37735m3641A39711F0063c3218C46362H7261L24564C8812J24377
$$ 239571 377306 333665 139711 60063 -33218 346362 87261 411825 38812 163189
17212A63189K51233A18882k7592J49733l7709K7140P2291n1999J5233c1367j763
$$ 163189 414422 118882 91290 241023 203314 230454 302745 250746 265979 -31367 -33130
17201c3130B81944K20988q6173j32647q1793k5652J1200O9365Q2632j24716o4183
$$ -33130 281944 502932 416759 284112 202319 176667 187867 257232 339864 215148 150965
17190A50965m4342a5939l08655B85209m203p9084O1158j384j5801e2428A61344
$$ 150965 106623 -15939 -324594 285209 281006 201922 263080 261696 245895 -52428 161344
17178B72859H3261B9758L2375R5987J16860J99938k5595j73845m9919k4912C9854
$$ 272859 83261 29758 62133 158120 274980 474918 449323 275478 225559 200647 39854
17166G2571J89210p2011r902K8358P4370m0095J85793b4028B91489k6597M5791
$$ 72571 261781 189770 179868 208226 282596 242501 428294 -24028 291489 264892 310683
17155C10683B0136K97394j07885b899j19924C11360J36233B15557J16459j35141
$$ 310683 20136 317530 209645 -2899 -122823 311360 447593 215557 332016 196875
17145A96875J85217J31791o6202i0204A54396L8525J8577K44230M7369b21701
$$ 196875 382092 513883 447681 -90204 154396 192921 211498 455728 503097 -221701
17134B31406M8259K1612e2600D39923p4940j34377L07386e6351C78090l2085J31115
$$ 231406 279665 301277 -52600 439923 364983 230606 537992 -56351 378090 346005 477120
17123D77120E7591K17082q0110J87686r0035j39539F2903M70796h6017D02255
$$ 477120 57591 274673 194563 382249 292214 152675 62903 533699 -86017 402255
17112C47728D7233L88152J242C5555K22508K29352A17668J16730K13190P9207
$$ 347728 47233 435385 436627 35555 258063 487415 117668 234398 447588 526795
17102E26795P3077A75643p1180L53970A82282K40950p3605K2504A08444n312K99810
$$ 526795 599872 175643 104463 458433 182282 423232 349627 372131 108444 103132 402942
17091D02942j71634m9844K37502j5772j71804O5940n1286O7062a76348C67319
$$ 402942 231308 181464 418966 403194 231390 297330 246044 313106 -176348 367319
17080C7461J03747L02832K9068R6841B38395L47301k65432m010P78M5910e2853
$$ 37461 141208 444040 473108 569949 238395 585696 320264 316254 317032 362942 -52853
17068C44703m2355J588K96501k25419l8161q0560M7194K74069j57408j98384r2035
$$ 344703 302348 303936 600437 375018 336857 256297 303491 577560 420152 221768 129733
17057A29733M95200A24934J16486J5302L32101R1520l12653K2518L31124k15880
$$ 129733 624933 124934 241420 256722 588823 680343 367690 390208 721332 505452
17047E05452j40503m3205M00525j16051A61345N0307J27990q7469K74950A3536
$$ 505452 364949 321744 722269 606218 161345 211652 339642 252173 527123 13536
17036D34967N2086J4423B41625p6160L84395M3316A00286M01518B04972M22181
$$ 434967 487053 501476 241625 165465 549860 593176 100286 501804 204972 627153
17026F27153j16919J24182o8658J83245o0174j10317o2847K5654j54726L69893
$$ 627153 510234 634416 565758 749003 688829 578512 515665 541319 386593 756486
17016G56486j61917B56721L94327j69077k31891K00978J84067J39052k43671j70397
$$ 756486 594569 256721 651048 481971 250080 451058 635125 774177 530506 360109
17006C60109J72060k37Q0306B28928O05252J38849k67864k81401J84779J74983
$$ 360109 532169 531932 612238 228928 834180 973029 705165 423764 608543 783526
16996G83526A36356L47776q4602L75939j78554Q7136k700m6590Q5027C18735L87769
$$ 783526 136356 484132 399530 775469 596915 684051 681351 634761 719788 318735 706504
16985G06504k5295K06154J0485j98207k5233o4852l6282K75485J7931l29720J27308
$$ 706504 681209 887363 897848 699641 674408 609556 573274 848759 866690 536970 664278
16974F64278j8232k21705J41603o3658K64359L51217l62090l18337K03049m5791
$$ 664278 646046 424341 565944 502286 766645 1117862 755772 437435 640484 594693
16964E94693L04564j97920K82958m68463J65240N87243n69688J06936j99481J8629
$$ 594693 899257 701337 984295 515832 681072 1268315 698627 805563 606082 624711
16954F24711K90715J13977j59052K27548l27501L3041k10826L88500J50395m34774
$$ 624711 915426 1029403 870351 1097899 770398 803439 592613 981113 1131508 696734
16944F96734N33442J37960p7069k87688k86657K62702J63580N9606J19923l96700
$$ 696734 1230176 1368136 1291067 1003379 716722 979424 1143004 1202610 1322533 925833
16934I25833L56768j211j84667j54187o585k9644L37595j42074j19484j16415
$$ 925833 1282601 1281390 1096723 942536 935951 906307 1243902 1101828 982344 865929
16924H65929M16371j77785J45551l34103K52712j21491N3273j825N2671L7615
$$ 865929 1282300 1104515 1250066 915963 1168675 1047184 1100457 1098632 1151303 1188918
16914A188918m6837J84734m8357j18540k54703L42669r0971J69814K48745k32723
$$ 1188918 1142081 1326815 1278458 1159918 905215 1247884 1156913 1326727 1575472 1342749
16904A342749J29514l91726K81523K2914K41008k55987k47616L0563L98117l71123
$$ 1342749 1472263 1080537 1362060 1384974 1625982 1369995 1122379 1152942 1551059 1179936
16894A179936N40625l11099L47369m84350o3254J04560J72760J60793l58591M66689
$$ 1179936 1720561 1409462 1756831 1272481 1209227 1313787 1486547 1647340 1288749 1755438
16884A755438j38816r7861K4526L36612J77620j51019j41696J33229J37679k57697
$$ 1755438 1616622 1518761 1543287 1879899 2057519 1906500 1764804 1898033 2035712 1778015
16874A778015R7357K53362m22479N36570j43975k78062K21322l8223j24600Q8164
$$ 1778015 1875372 2128734 1706255 2242825 2098850 1820788 2042110 2003887 1879287 1967451
16864A967451J75222O958j46888Q2973J02690P2707P231p0581M83315l49091p9597
$$ 1967451 2142673 2149631 2002743 2085716 2188406 2261113 2268344 2197763 2681078 2331987 2252390
16853B252390J78171m73078O98780l73804L56656j28584k01094L08316J10750
$$ 2252390 2430561 1957483 2656263 2282459 2639115 2510531 2309437 2617753 2728503
16844B728503Q9079j03499K54624l25062J60471o8296J66687J3629k52719N13628
$$ 2728503 2817582 2714083 2968707 2643645 2804116 2735820 2902507 2916136 2663417 3177045
16834C177045k90346M83746j00145J35549k22703K09292N3657N632J44742K3031
$$ 3177045 2886699 3370445 3270300 3405849 3183146 3392438 3446095 3451727 3596469 3619500
16824C619500r6563o6936J31764K81746Q617J18849K86277j20341M5950Q0947
$$ 3619500 3522937 3456001 3587765 3869511 3878128 3996977 4283254 4162913 4208863 4289810
16814D289810K05655m92033M45058L74447q709q8228o1399L10321Q7389j30334
$$ 4289810 4495465 4003432 4448490 4822937 4814228 4726000 4664601 4974922 5062311 4931977
16804D931977L46140K83826J5279k58583N88080k46775M55329k06382K31902K14967
$$ 4931977 5278117 5561943 5577222 5318639 5906719 5659944 6115273 5908891 6140793 6355760
16794F355760o8880L62366J01079j6807K82769N8989L53034Q2298L23876j54406
$$ 6355760 6286880 6649246 6750325 6733518 7016287 7075276 7428310 7510608 7834484 7680078
16784G680078M67083J66639R356O16715K916L62933J95623N03954k33254P56046
$$ 7680078 8147161 8313800 8323156 8939871 8942787 9305720 9501343 10005297 9772043 10528089
16774A0528089j90379J73730L30450N69548k830N61902M52168M65244N3596N78494
$$ 10528089 10337710 10511440 10841890 11411438 11408608 11970510 12422678 12887922 12941518 13520012
16764A3520012J15650O45509Q35144j44764Q41468M99318O35714M68395N16521
$$ 13520012 13635662 14281171 15116315 14971551 15813019 16312337 16948051 17416446 17932967
16755A7932967M80096Q08759J299572K74828J099006N70187Q88275R38416Q93921
$$ 17932967 18413063 19221822 20521394 20796222 21895228 22465415 23353690 24292106 25186027
16746B5186027J126280J085999J216426J563236Q29082J511456J390786J810072
$$ 25186027 26312307 27398306 28614732 30177968 31007050 32518506 33909292 35719364
16738C5719364J589219J682822J938526K138241K468042K297127K608361K742765
$$ 35719364 37308583 38991405 40929931 43068172 45536214 47833341 50441702 53184467
16730E3184467L292313K863723L221837L768528L973821L963819M747790M799300
$$ 53184467 56476780 59340503 62562340 66330868 70304689 74268508 79016298 83815598
16722H3815598N424851N567847N842875N949946O452431O549490P440421P170530
$$ 83815598 89240449 94808296 100651171 106601117 113053548 119603038 127043459 134213989
16714A34213989P514277P284532P616915P270114O880619O491925N470549N070947
$$ 134213989 141728266 149012798 156629713 163899827 170780446 177272371 182742920 187813867
16706A87813867L677004L181618J056401J25765j549585k435943l694966m732396
$$ 187813867 191490871 194672489 195728890 195854655 194305070 191869127 188174161 183441765
16698A83441765n684492o254074o926553p499400o797494p907909p166264p226537
$$ 183441765 177757273 171503199 164576646 157077246 150279752 142371843 135205579 127979042
16690A27979042p110266o492744o900571n887236o094913n727447n243461m752579
$$ 127979042 120868776 114376032 107475461 101588225 95493312 89765865 84522404 79769825
16682G9769825m492843m869183l705750m015791l333630l299216l137692l089664
$$ 79769825 75276982 70407799 66702049 62686258 59352628 56053412 52915720 49826056
16674D9826056k454714k513654k704933j960114k054955j642668j940027j760806
$$ 49826056 47371342 44857688 42152755 40192641 38137686 36495018 34554991 32794185
16666C2794185j234399j536989j680538r02323j420080j305823o34013j212040
$$ 32794185 31559786 30022797 28342259 27439936 26019856 24714033 24080020 22867980
16658B2867980q03998q14431p29952j080371o73051o12005n24198r05607n13039
$$ 22867980 22063982 21249551 20519599 19439228 18766177 18154172 17629974 16724367 16211328
16649A6211328n91351o57477q96481L87615r92496n48229l56716l14922m99498
$$ 16211328 15619977 14962500 14066019 14453634 13461138 12912909 12556193 12241271 11741773
16640A1741773j53638n23329k55602j12362l88045m87615m16934J07179k99237
$$ 11741773 11588135 11064806 10809204 10696842 10308797 9821182 9404248 9511427 9212190
16631I212190m40546j87478k40169n28454K61813m52361j0990n6191m85833n4753
$$ 9212190 8771644 8584166 8343997 7815543 8077356 7624995 7614005 7557814 7071981 7017228
16621G017228l30245p7351J05762o05620q9058j1370j9566k71460k28504q8993
$$ 7017228 6686983 6609632 6715394 6109774 6020716 6009346 5989780 5718320 5489816 5400823
16611E400823J31990k23538J0501l67560j01985J75860n37346J05414k34772K71399
$$ 5400823 5532813 5309275 5319776 4952216 4850231 5026091 4488745 4594159 4359387 4630786
16601D630786n30704J32756l07372L17834l10287J5932k8202m9792j4892k02180
$$ 4630786 4100082 4232838 3925466 4243300 3933013 3948945 3920743 3870951 3856059 3653879
16591C653879P826j17233j12845j36515K24927k84654j72129N51654o31787j20155
$$ 3653879 3661705 3544472 3431627 3295112 3520039 3235385 3063256 3614910 2983123 2862968
16581B862968J11902O0669j02784k08288k43926K97109J05740k99442J28075n37141
$$ 2862968 2974870 3035539 2932755 2724467 2480541 2777650 2883390 2583948 2712023 2174882
16571B174882L40808N0206J917j26557j13501J6890k92276P1030L01494k23562
$$ 2174882 2515690 2565896 2567813 2441256 2327755 2344645 2052369 2123399 2424893 2201331
16561B201331r1329L34300k89364j4360j25311l6248j50966J6829K2243p8449
$$ 2201331 2110002 2444302 2154938 2140578 2015267 1979019 1828053 1844882 1867125 1788676
16551A788676K0611j35412K06397P22441r35186P0059l1745j04705K82682j23125
$$ 1788676 1809287 1673875 1880272 2602713 1667527 1737586 1705841 1601136 1883818 1760693
16541A760693m9246N3884l43008J52907L0816r2372j07593M2970L75988k08746
$$ 1760693 1711447 1765331 1422323 1575230 1606046 1513674 1406081 1449051 1825039 1616293
16531A616293n7738R5697k42041k55173K16507J01286k13411l05717M97498O011
$$ 1616293 1558555 1654252 1412211 1157038 1373545 1474831 1261420 955703 1453201 1459212
16521A459212j82003J34808k22303K31717k60684r3344L5879K5557l5754L86k40585
$$ 1459212 1277209 1412017 1189714 1421431 1160747 1067403 1103282 1128839 1093085 1093471 852886
16510H52886M38688j57931r048J15517l57356R2249K05576Q8482E87766K27527
$$ 852886 1291574 1133643 1124595 1240112 882756 975005 1180581 1269063 587766 815293
16500H15293M17444j30207D30257L59969O5087j1249j89238n8037l0457K09084
$$ 815293 1232737 1102530 430257 790226 855313 844064 654826 596789 566332 775416
16490G75416j37474M65421j54946k13628O5126M7187j954J33570l04604L19341
$$ 775416 637942 1103363 948417 734789 799915 847102 845148 978718 674114 993455
16480I93455j92869M0064k74546K2976j7470K46085J91241j32599r9827L723R9627
$$ 993455 800586 840650 566104 589080 571610 817695 1008936 876337 776510 780233 879860
16469H79860r1920J01766j48279p4022K1424k18685L14677p4765j18755q7564
$$ 879860 787940 889706 741427 667405 688829 470144 784821 710056 591301 503737
16459E03737K00592J20157k82724J43494P8455k59315K26315J71758l46903k5749
$$ 503737 704329 824486 541762 685256 763711 504396 730711 902469 555566 529817
16449E29817K26772M500k85469Q013A19390M02982L36202B52980K77721K50675
$$ 529817 756589 761089 475620 483633 119390 522372 858574 252980 530701 781376
16439G81376C23054O70702m46266j5300k20389M89573l89749L61395B46698N51902
$$ 781376 323054 993756 547490 532190 311801 801374 411625 773020 246698 798600
16429G98600l41269j73375L16805j78101M12009C20184J41333J59715A95261N10687
$$ 798600 457331 283956 600761 422660 834669 320184 461517 621232 195261 705948
16419G05948o1930l14615K50214j30096j02865O1184j46176K1412K7038K61285
$$ 705948 644018 329403 579617 449521 346656 407840 261664 283076 310114 571399
16409E71399j81143m7245j58218K5663J54064r2940M28522l14141A07026K73995
$$ 571399 390256 343011 184793 210456 364520 271580 700102 385961 107026 381021
16399C81021J52227j73010l1826K01998l8259c9495C99003o3159J49088m3850
$$ 381021 533248 360238 328412 530410 492151 -39495 399003 335844 484932 441082
16389D41082A99642K37333Q521J54383B55344P6548j15322K04402K64159H3974
$$ 441082 199642 436975 445496 599879 255344 331892 216570 420972 685131 83974
16378B02053L38522r8015B04673J29363Q8297O401j0836J34676A88561K03869
$$ 202053 540575 442560 204673 334036 422333 428734 417898 552574 188561 392430
16368C92430A86129K07848m8292j27899J08899r9507L44311B4703K59426L0740
$$ 392430 186129 393977 345685 217786 326685 227178 571489 24703 284129 314869
16358C14869n5186r8589J85106o9090B7825F222e9661B84726m5112o9440E6551
$$ 314869 259683 161094 346200 277110 27825 6222 -59661 284726 239614 170174 56551
16346G4287A2030a15441G3721f0398A78829H4702P2253K52409I0251K38507n043
$$ 74287 12030 -115441 73721 -60398 178829 84702 156955 409364 90251 328758 323715
16335C23715J28892k13392l9072Q4635H2376R9109j26R5272g498D21244A66950
$$ 323715 452607 239215 200143 284778 82376 181485 181359 276631 -7498 421244 166950
16323F18769a42430C89406j60700q6874m1498K70781j60134n83o4489J31194H4396
$$ 618769 -142430 389406 228706 141832 100334 371115 210981 210398 145909 277103 84396
16311G9311R7837L0190P4932A0789O00230k72248A14633J90991l8871q7382J38653
$$ 79311 177148 207338 282270 10789 611019 338771 114633 305624 266753 179371 318024
16300C18024r5860f3281B21884K79604k39036J43161p405O6672j74336A30311
$$ 318024 222164 -63281 221884 501488 262452 405613 398208 464880 290544 130311
16289C66677b30577A67236J21410A01675b1070k601E7483E584J39671J81671N8796
$$ 366677 -230577 167236 288646 101675 -21070 -23671 57483 5584 145255 326926 385722
16278C85722L7044A05801a27754C50850j18895J65633A56417a18185B79555A20861
$$ 385722 422766 105801 -127754 350850 231955 397588 156417 -118185 279555 120861
16267i590j70903B01363B1473M47956j94534G6208J5869M8647l8148A7972M7516
$$ -9590 -180493 201363 21473 469429 274895 76208 92077 140724 102576 17972 65488
16256F5488Q8954Q9686b7450A37680O3398L0135J72369a9758A92964K0587a31435
$$ 65488 154442 244128 -27450 137680 201078 231213 403582 -19758 192964 213551 -131435
16244b9638B24665A5215J82457a1144q5978A28725J37388o3934C8946a85146A81657
$$ -29638 224665 15215 197672 -11144 -97122 128725 266113 202179 38946 -185146 181657
16232b045j84860B16993m3558b94225D9920J56710e2671A43407R414J24446e3289
$$ -2045 -186905 216993 173435 -294225 49920 206630 -52671 143407 152821 277267 -53289
16220A78540B0173J78191a71868k63732J04130a52184E9641b0265C17337a01978
$$ 178540 20173 198364 -171868 -435600 -331470 -152184 59641 -20265 317337 -101978
16209F7380k6644A9294c18472J37889K4493O2420j35091j3716J4548B61086c15879
$$ 67380 40736 19294 -318472 -180583 -156090 -93670 -228761 -242477 -227929 261086 -315879
16197E8103L3286b06679B91895a20974a3263C42250I0783K80315F904K25908f638
$$ 58103 91389 -206679 291895 -120974 -13263 342250 90783 371098 6904 232812 -6638
16185H067e9009j73317b6627B22158a26683k049I0161b50006B16304e5287B35653
$$ 8067 -59009 -232326 -26627 222158 -126683 -128732 90161 -250006 216304 -55287 235653
16173D9350J23804f7315n2557j48427c9957A71994o8191f473A09540i5203A16577
$$ 49350 173154 -67315 -119872 -268299 -39957 171994 103803 -6473 109540 -95203 116577
16161h3224j48609A6698K9861Q8966o157c6933j10886d33j49511g803B03924J49649
$$ -83224 -231833 16698 46559 135525 129368 -36933 -147819 -433 -149944 -7803 203924 353573
16149C53573q5554a0224F4768J25785d10625a86588B52409e9826m00205f728j29258
$$ 353573 268019 -10224 64768 190553 -410625 -186588 252409 -59826 -460031 -6728 -135986
16138a35986B03150h868j6557D0782K5310L0376k5549L8006a3114j1447H0084
$$ -135986 203150 -8868 -25425 40782 66092 96468 70919 108925 -13114 -24561 80084
16126c203k04641o9620C42531b2746A99018i93k98021i5189o7681B65920d3001
$$ -3203 -207844 -277464 342531 -22746 199018 -993 -299014 -95189 -162870 265920 -43001
16114D5871b6345A95507C5853b90969a11098A94793c8067J5028A43277A0237f0042
$$ 45871 -26345 195507 35853 -290969 -111098 194793 -38067 -23039 143277 10237 -60042
16102F8307k2596Q2448a84990A85052K90353e0188k13456H8162g4412k11175J20640
$$ 68307 45711 128159 -184990 185052 475405 -50188 -263644 88162 -74412 -285587 -164947
16091a64947E7424b16752L7885A70643n1806D8253f3953C06951r6202e6017B32957
$$ -164947 57424 -216752 -178867 170643 118837 48253 -63953 306951 210749 -56017 232957
16079A46338l7293k2808J1151Q3780a14934e6940l35535e1438A13191c3929D73458
$$ 146338 109045 86237 97388 181168 -114934 -56940 -392475 -51438 113191 -33929 473458
16067A50291N7204n5178a16861A38625b32995H8711N7363d3735G5116K16150a73486
$$ 150291 207495 152317 -116861 138625 -232995 88711 146074 -43735 75116 291266 -173486
16055C50778a62618D2508M0143b16676f6674A06206h1913n2896b5486p899H5253
$$ 350778 -162618 42508 82651 -216676 -66674 106206 -81913 -134809 -25486 -33385 85253
16043A78515q1389E358g0548n4587A08747i5316A02490a25744b5128m1524K2864
$$ 178515 97126 5358 -70548 -125135 108747 -95316 102490 -125744 -25128 -66652 -43788
16032d3788k08854l9191Q453e7706m74713b2494l02270P1565N7295D21971A72070
$$ -43788 -252642 -291833 -283380 -57706 -532419 -22494 -324764 -253199 -195904 421971 172070
16020A17298R9092a51458j13172B43984j02067a19579j26947D189K13018a07047
$$ 117298 216390 -151458 -264630 243984 141917 -119579 -246526 4189 217207 -107047
16009A31407Q7127c09638A43055K6144g9242E9692b44199A57285J04085r2909
$$ 131407 218534 -309638 143055 169199 -79242 59692 -244199 157285 261370 168461
15999A68461c316j98476m9830d1498l2622J7177k83897J04567f9813B26796l9070
$$ 168461 -3316 -201792 -251622 -41498 -74120 -56943 -340840 -236273 -69813 226796 187726
15988A87726E284J06667D1666a69416d7935o3155L8981A9289a1585n8303j15245
$$ 187726 5284 111951 41666 -169416 -47935 -111090 -72109 19289 -11585 -69888 -185133
15977a85133B54385D6507K18391b9936A49982l1059K2923R263J52688b9424I6459
$$ -185133 254385 46507 264898 -29936 149982 118923 141846 151109 303797 -29424 96459
15965C35803E7978a19686A60312i9185D3101e5294A25150n8293J31107o9386b0322
$$ 335803 57978 -119686 160312 -99185 43101 -55294 125150 66857 197964 128578 -20322
15953A15967d21003a15029j5114a3610k93952h5064B43282C6061J74609A04747
$$ 115967 -421003 -115029 -130143 -13610 -307562 -85064 243282 36061 210670 104747
15942G341a15265q3152R397a6855q9542A71803i2648B9859R3764b55817F5879
$$ 7341 -115265 -198417 -189020 -16855 -106397 171803 -92648 29859 123623 -255817 65879
15930F3009D721b13584B73333H987b97231f8346o7882A26776k8402N5510K57153
$$ 63009 4721 -213584 273333 8987 -297231 -68346 -136228 126776 98374 153884 411037
15919D11037C8972d5951A6554a57422g7072F7457B6339n366a22531H6784a69718
$$ 411037 38972 -45951 16554 -157422 -77072 67457 26339 20973 -122531 86784 -169718
15907a01895m3564A9982i8205B46705e6235C40557A10598b57251j9548B32157
$$ -101895 -145459 19982 -98205 246705 -56235 340557 110598 -257251 -276799 232157
15896A06222i209H6163K61155b65200g3305B9665b01201B1309a61843j4160l8770
$$ 106222 -9209 86163 347318 -265200 -73305 29665 -201201 21309 -161843 -176003 -214773
15885b14773c9387o462A21110l1285a51659N1714k2855e5720k55253a44702b1615
$$ -214773 -39387 -45849 121110 89825 -151659 -99945 -122800 -55720 -310973 -144702 -21615
15873h8576j48779b0933B03737q2072B8521a61863d0176B2344a10048A48853D974
$$ -88576 -237355 -20933 203737 121665 28521 -161863 -40176 22344 -110048 148853 4974
15861I748f1885B80609j40280e0012H3947J10566b44370h5136k0263j45086k5834
$$ 9748 -61885 280609 140329 -50012 83947 194513 -244370 -85136 -105399 -250485 -276319
15850b76319J24699M6096F1356B7822M7718i7024D9939K15523d6480k33562G7427
$$ -276319 -151620 -105524 61356 27822 75540 -97024 49939 265462 -46480 -280042 77427
15838A79333D6538O8450b7730A02060b1455j48411A19053e2641j12708C74514
$$ 179333 46538 114988 -27730 102060 -21455 -169866 119053 -52641 -165349 374514
15827a76350j39149h8995k52977A72983a24613j28445O4366I5662A7880a36692
$$ -176350 -315499 -88995 -341972 172983 -124613 -253058 -188692 95662 17880 -136692
15816e1337A1873c7012H2996f6266k17482a11433k85906b6414F0390P0628K5099
$$ -51337 11873 -37012 82996 -66266 -283748 -111433 -397339 -26414 60390 131018 156117
15805A56117l8771d18560b00909D9260a02894a7704F629c8392q7628e9965H6435
$$ 156117 117346 -418560 -200909 49260 -102894 -17704 6629 -38392 -126020 -59965 86435
15793a8782B4952c13319g3683c4995k91506c4916f388n5378E698a06973C65112
$$ -18782 24952 -313319 -73683 -34995 -326501 -34916 -6388 -61766 5698 -106973 365112
15781a01052L7548j38024H6224l5136b84474A12117M8253m1477K35089A57679
$$ -101052 -63504 -201528 86224 51088 -284474 112117 160370 118893 353982 157679
15770c08112J49331j00597E4417L17195A15346a83027d2632a6317F8086b3431
$$ -308112 -158781 -259378 54417 371612 115346 -183027 -42632 -16317 68086 -23431
15759E0272c45925C5373f3097l6372c8150I2426a5141e133A3687J13671K0183
$$ 50272 -345925 35373 -63097 -99469 -38150 92426 -15141 -5133 13687 127358 147541
15748A47541g4783K0538B83846B5707b52785P4793N3973r6403D9322g4963C7717
$$ 147541 -74783 -54245 283846 25707 -252785 -177992 -124019 -220422 49322 -74963 37717
15736C3180a0335j21381j80287B16687F0975b87067O4858B85014a38342A05909
$$ 33180 -10335 -131716 -312003 216687 60975 -287067 -222209 285014 -138342 105909
15725h4572E8109K8489e7279B68793b70252f4312L0103C5735b67940a00522j5921
$$ -84572 58109 86598 -57279 268793 -270252 -64312 -34209 35735 -267940 -100522 -116443
15714a16443L9455E5961k3527P8250c60319d7105A44018e8112B06858e6620C0282
$$ -116443 -76988 55961 32434 110684 -360319 -47105 144018 -58112 206858 -56620 30282
15702a42593A37413b97065a2355D9398a5463k28587j84514b00425j6198A59335
$$ -142593 137413 -297065 -12355 49398 -15463 -244050 -428564 -200425 -216623 159335
15691A11426a34190n1819b4370j17091j72628a00871c8999A35008M5555a71221
$$ 111426 -134190 -186009 -24370 -141461 -314089 -100871 -38999 135008 180563 -171221
15680F6352J01460n3357j0635J01216E8655K21312d2994G4246l6310O6668A6726
$$ 66352 167812 114455 103820 205036 58655 279967 -42994 74246 37936 104604 16726
15668A77584C7916b73066A55201A3668M12574a85995N4076A90808E5955J06289
$$ 177584 37916 -273066 155201 13668 426242 -185995 -131919 190808 55955 162244
15658A62244g0895A10318n2331b7187A11489K42957b99231a09005H5787a29857
$$ 162244 -70895 110318 57987 -27187 111489 354446 -299231 -109005 85787 -129857
15647H8523c14936c7563j45758l81344b10417A56120E894M9542J31800P6590a77896
$$ 88523 -314936 -37563 -183321 -564665 -210417 156120 5894 55436 187236 263826 -177896
15635a08699R627A24465a05910I8786K36262a9654n7963J6565k63114M83k0324
$$ -108699 -99072 124465 -105910 98786 335048 -19654 -77617 -61052 -324166 -323683 -344007
15624c44007C41515A1446f6310r2321F5001b02857E6700b5873k59904a31427B43356
$$ -344007 341515 11446 -66310 -158631 65001 -202857 56700 -25873 -285777 -131427 243356
15612g531A62800c8546D5514c05934I2020f3809j91872e5569m7325j09378B03851
$$ -7531 162800 -38546 45514 -305934 92020 -63809 -255681 -55569 -102894 -212272 203851
15600h1778A0363b62115F2663k4157b19667B3111a25546B9599J0887a47848J8639
$$ -81778 10363 -262115 62663 38506 -219667 23111 -125546 29599 40486 -147848 -129209
15589a29209j14002j3446A05503B1653f7002A35081e1952B71456e5912A92783
$$ -129209 -243211 -256657 105503 21653 -67002 135081 -51952 271456 -55912 192783
15578a95943G873J58389a3343B28588G3782J54967G0569J53426B1153a5207m3316
$$ -195943 7873 166262 -13343 228588 73782 228749 70569 223995 21153 -15207 -58523
15567e8523D01540I0492J0425b69813f2328C60691f4193l40422F5163c83162h7185
$$ -58523 401540 90492 100917 -269813 -62328 360691 -64193 -404615 65163 -383162 -87185
15555c2418o3866b0918A6292J21780A1415a38463r7048I5238p928g4100K06B6860
$$ -32418 -96284 -20918 16292 138072 11415 -138463 -235511 95238 87310 -74100 -73894 26860
15542d19865a22596b7484A32686e1437K903m3861A14566K3194g6301B10332b94851
$$ -419865 -122596 -27484 132686 -51437 -48534 -92395 114566 137760 -76301 210332 -294851
15530b35419a03602j07903B28165a05320q9315c1339k8696o312F1070b5614C59032
$$ -235419 -103602 -211505 228165 -105320 -194635 -31339 -60035 -66347 61070 -25614 359032
15518a86415i855I3707a85370a653j81625E0437a04634a3544j2048A13783a23192
$$ -186415 -9855 93707 -185370 -1653 -183278 50437 -104634 -13544 -25592 113783 -123192
15506C21160a30204j9280j83522B16265K06412c7165r8273f4378k47216d4882
$$ 321160 -130204 -149484 -333006 216265 422677 -37165 -135438 -64378 -311594 -44882
15495A71963d9353k6888j4695B22219a4239I4058e7435A44942a17019D616Q239
$$ 171963 -49353 -76241 -90936 222219 -14239 94058 -57435 144942 -117019 4616 12855
15484A2855d76847C1853b73613A02289J6553K6754f441k42910h4757k26030g2152
$$ 12855 -476847 31853 -273613 102289 118842 145596 -6441 -249351 -84757 -310787 -72152
15472c33843f2300j24455B14764a47166M8170G8117a79643E5557b73215J00596
$$ -333843 -62300 -186755 214764 -147166 -98996 78117 -179643 55557 -273215 -172619
15462a72619l63318B2274M8935b68438d6823A4336K25746I4175D2741G6d9611
$$ -172619 -535937 22274 71209 -268438 -46823 14336 240082 94175 42741 76 -49611
15450c14528B21518A02835J12864c47112j86046f1460n9865C23646d862r572j17351
$$ -314528 221518 102835 215699 -347112 -533158 -61460 -121325 323646 -4862 -14434 -131785
15439a31785M7130K1157B52960A1715K22208a76915o0300a16780q0844e4655c237
$$ -131785 -84655 -63498 252960 11715 233923 -176915 -237215 -116780 -197624 -54655 -3237
15427a93495i5999q1663d2205j36678A82510E2065A3228a4479j00469B6584c5857
$$ -193495 -95999 -177662 -42205 -178883 182510 52065 13228 -14479 -114948 26584 -35857
15415B80401L1111j1167d26383C0761b55945H4936J9797k4175c6687j17957A58558
$$ 280401 311512 300345 -426383 30761 -255945 84936 104733 80558 -36687 -154644 158558
15403C7636J42183a25773p6152g3551A08314J2189P834c26086c5980D8472L0024
$$ 37636 179819 -125773 -201925 -73551 108314 120503 128337 -326086 -35980 48472 78496
15392G8496e8888G2907K14952d1180k84235A7676L04173i0403L2063E5943A5797
$$ 78496 -58888 72907 287859 -41180 -325415 17676 321849 -90403 -58340 55943 15797
15380B29442k6729l0306d10993a32984j14583G1560a21732m8188i4I6787f8103
$$ 229442 202713 172407 -410993 -132984 -247567 71560 -121732 -169920 -94 96787 -68103
15368a16220n7516Q0479b0874j02167j42687f3351q1622K806B24441a40558D24484
$$ -116220 -173736 -93257 -20874 -123041 -265728 -63351 -144973 -142167 224441 -140558 424484
15356a32178r3660M3611F8280O9019a26803N4519j07299B1181J94111d4961A40904
$$ -132178 -225838 -182227 68280 137299 -126803 -72284 -179583 21181 215292 -44961 140904
15344d4473k3731j23185B65639a45720q5185B83097j41031J12126G3059M319b80118
$$ -44473 -68204 -191389 265639 -145720 -230905 283097 142066 254192 73059 77378 -280118
15332a29677d6442I2541a08063j8401A2279g8190L7173a27j2883o1086b8717p3906
$$ -129677 -46442 92541 -108063 -126464 12279 -78190 -41017 -127 -13010 -74096 -28717 -102623
15320a02623I3159O2226h2260B4202J4887N56112A15064k0264b08229E0078a83611
$$ -102623 93159 155385 -82260 24202 39089 595201 115064 94800 -208229 50078 -183611
15308g8061A04761f6688j57575B61034b43441l7318g0963A46890O5158B5794K38607
$$ -78061 104761 -66688 -224263 261034 -243441 -280759 -70963 146890 212048 25794 264401
15297B64401Q1260j61517Q5331H571c69039B50453E3378K30245j8968h5157B50605
$$ 264401 345661 184144 269475 8571 -369039 250453 53378 283623 264655 -85157 250605
15285A08592P9405G869J93385H2374f4905E875J41907b557m7469A68341f5066
$$ 108592 187997 7869 201254 82374 -64905 5875 147782 -2557 -50026 168341 -65066
15273B30575N0959a06832D12321A46499i6840B71698a35225B72703I6234M35838
$$ 230575 281534 -106832 412321 146499 -96840 271698 -135225 272703 96234 532072
15263E32072a52410F3482i0792D0191j4298a29015N9464E994e2544E4707J76183
$$ 532072 -152410 63482 -90792 40191 25893 -129015 -69551 5994 -52544 54707 230890
15252B30890p8185E336a6149j18641B09207f8867G2394K41900K16269k62011B9
$$ 230890 152705 5336 -16149 -134790 209207 -68867 72394 314294 530563 268552 29
15240A13437K0359K13352L1538r6387K15250K04603K30537k30039M49648n31217
$$ 113437 133796 347148 378686 282299 497549 702152 932689 702650 1152298 621081
15230F21081B63632j6273a11358A17835l0752J78355a05351C67938A38820a51804
$$ 621081 263632 247359 -111358 117835 87083 265438 -105351 367938 138820 -151804
15219I4903K87216b37413C5185J11892b06693k24901A32464K06573a08322A21493
$$ 94903 382119 -237413 35185 147077 -206693 -431594 132464 339037 -108322 121493
15208E1246B0719a11472j7908K3709D409d0086o1471q2237f7801a8396B32018
$$ 51246 20719 -111472 -129380 -105671 4409 -40086 -101557 -183794 -67801 -18396 232018
15196a12445J5407r5609N4315A05759J07534G8227e3662P51j8573B1286O5813
$$ -112445 -97038 -192647 -138332 105759 213293 78227 -53662 -52911 -71484 21286 87099
15185H7099d8733A42763D6164J54692i6629r1486q6461A2196b93234b3146k94953
$$ 87099 -48733 142763 46164 200856 -96629 -188115 -274576 12196 -293234 -23146 -318099
15174c18099A46656f3245k37331f9697C3369O4993f3160l4758A10651k403a48510
$$ -318099 146656 -63245 -300576 -69697 33369 98362 -63160 -97918 110651 108248 -148510
15162f918A36910B6404M2464b56285C28004D5535b48955E7594g1146c0226A09532
$$ -6918 136910 26404 68868 -256285 328004 45535 -248955 57594 -71146 -30226 109532
15150A01669K96733H7700Q5506c37714A07776d0444C43709a64032d9081A51280
$$ 101669 398402 87700 173206 -337714 107776 -40444 343709 -164032 -49081 151280
15139b5061L50A60529c9005E6701O2157K44701a70742D62L49263c50038B50390
$$ -25061 -24711 160529 -39005 56701 118858 363559 -170742 462 349725 -350038 250390
15127B52539j8228J1229g4662J1409A53453n4407f8642G3628a1754B13256q5618
$$ 252539 234311 245540 -74662 -63253 153453 99046 -68642 73628 -11754 213256 127638
15116A27638F0452K71037a34122C84382b69373B00552G5837a22800N8542B78028
$$ 127638 60452 331489 -134122 384382 -269373 200552 75837 -122800 -64258 278028
15105D25496A59145D617a02659k8309A15685Q504J5464k0726a2548B37813n3942
$$ 425496 159145 4617 -102659 -130968 115685 124189 139653 118927 -12548 237813 183871
15094A83871a04308A98770C4277K96233j07161r1725J53064L4182j34054F0367
$$ 183871 -104308 198770 34277 330510 223349 131624 284688 318870 184816 60367
15083B748R5868C4283Q1546J801J34212n2342D5491J02420l2278m3599M4744P1429
$$ 2748 98616 34283 115829 117630 251842 199500 45491 147911 115633 72034 116778 188207
15071A88207F9284j3871j1539K0764L24028E7035K28740g1024A78397G8608b27865
$$ 188207 69284 55413 43874 64638 388666 57035 285775 -71024 178397 78608 -227865
15059G4405L95059n1272j60439J24552b13211A96923q9126L8086p2145J24094
$$ 74405 469464 418192 257753 382305 -213211 196923 107797 145883 73738 197832
15049A97832a44368A39834O9246B3179c61808C83734l6887j4833m6431R2230j77663
$$ 197832 -144368 139834 209080 23179 -361808 383734 346847 332014 285583 377813 200150
15038B00150m4980l7293m8110J60484p7405l3792J8087L031J97177j52578K7593
$$ 200150 155170 117877 69767 230251 152846 119054 137141 140172 337349 184771 212364
15027B12364L9531r0033K32897A60439j5041Q3829a935j66691d6938C68299A28789
$$ 212364 251895 161862 394759 160439 145398 229227 -1935 -168626 -46938 368299 128789
15015d1213A57755A3408K1802L4240J83709j25150J04737m4023a44973B40586
$$ -41213 157755 13408 35210 69450 253159 128009 232746 188723 -144973 240586
15004a94325A26852J39701M6253A52518J28530l2179J41784A41551J48235j14625
$$ -194325 126852 266553 312806 152518 281048 248869 390653 141551 289786 175161
14994A75161N3469c95001A26561b12635D8034R4866N5580O9280c66938A50636
$$ 175161 228630 -395001 126561 -212635 48034 142900 198480 267760 -366938 150636
14983B35687A06875M5703M4746H6657J79701C7452R8110C2246P3539J51379J7894
$$ 235687 106875 152578 197324 86657 266358 37452 135562 32246 105785 257164 275058
14972B75058A09172Q7916q9977J52823l905J35956j50877n762K81533A17224A6272
$$ 275058 109172 197088 107111 259934 256029 391985 241108 235346 516879 117224 16272
14960B19392R1050p29M3087o8009R3222b4914A71319J30221B2232J44338p290
$$ 219392 310442 309713 352800 284791 378013 -24914 171319 301540 22232 166570 159280
14949A59280J34451F233K04415K76646G9995j9677J13864M0012e9588C34451H3875
$$ 159280 293731 6233 210648 487294 79995 60318 174182 214194 -59588 334451 83875
14937C2984L10846A50634J16508j16120J12015O8714P6954A09851K01403H9604
$$ 32984 343830 150634 267142 151022 263037 331751 408705 109851 311254 89604
14926G8930b9481B30063M9029K89730B51634O2951m603f9028D39616A76848O0975
$$ 78930 -29481 230063 279092 568822 251634 314585 309982 -69028 439616 176848 237823
14915B37823A16067c0085B29930J32348j36719J40511E2240j4894J43253L31321
$$ 237823 116067 -30085 229930 362278 225559 366070 52240 37346 180599 511920
14905E11920j36389J37661A12937K62848A87689Q5782J68136D1688L40779j00663
$$ 511920 375531 513192 112937 375785 187689 273471 441607 41688 382467 281804
14895B81804N95585B98894j49286J97069q0092K68784k03896q1969o9140J46356
$$ 281804 877389 298894 149608 346677 266585 535369 331473 249504 180364 326720
14885C26720I6634N50165k35004l3425H7886L19483M6379a7936C10242N9373J32694
$$ 326720 96634 646799 411795 378370 87886 407369 453748 -17936 310242 369615 502309
14874E02309Q2106k64656r8276J62500q3023L51996A85990K09850j62462J17107
$$ 502309 584415 319759 221483 383983 300960 652956 185990 395840 233378 350485
14864C50485O4056r9893A48905J31794A6509M21840K843k18970L7012N6296A54483
$$ 350485 414541 314648 148905 280699 16509 438349 441192 222222 259234 315530 154483
14852C42220N19911C45421K32745A33553M83831j54972O1834j72867J53911o6192
$$ 342220 862131 345421 578166 133553 617384 462412 524246 351379 505290 439098
14842D39098Q979J96968j24645G4143J97257G7176J49333J16706J03581K5464
$$ 439098 448077 645045 520400 74143 271400 77176 226509 343215 446796 472260
14832D72260k17921J26518J10484M295j16701K16475k79552A10277M15132j87805
$$ 472260 254339 380857 491341 495636 378935 595410 315858 110277 525409 337604
14822C37604A20491N10683C12618L15879A81261M18458R284A56719M5215K34944
$$ 337604 120491 631174 312618 628497 181261 599719 609003 156719 201934 436878
14812D36878K27709A78002L04821J04524B83960P1100J69877A88987K18864P3784
$$ 436878 664587 178002 482823 587347 283960 355060 524937 188987 407851 481635
14802D81635r2815K32813L54351C82974J45496j318J47325B79464K76122q0314
$$ 481635 388820 621633 975984 382974 528470 527152 674477 279464 555586 475272
14792D75272P0987j78458J13615N525M7709k21730L51082A91875K97420m1237
$$ 475272 546259 367801 481416 486941 534650 312920 664002 191875 489295 448058
14782D48058J34781j67347R7130k50362J79092N0716K5624k11666K86104O5923
$$ 448058 582839 415492 512622 262260 441352 492068 517692 306026 592130 658053
14772F58053K5711k73054L67237j46365j64827J43711n3979j35511K46793B79886
$$ 658053 683764 410710 777947 631582 466755 610466 556487 420976 667769 279886
14761I61878l41085j47196J45691n601A45951L03300K78587k8872k59147j94A87846
$$ 961878 620793 473597 619288 613687 145951 449251 727838 698966 439819 439625 187846
14749D16669K80145M797k47140M83692C97875L0278M42663j38505L4019Q1293
$$ 416669 696814 701611 454471 938163 397875 428153 870816 732311 766330 847623
14739H47623k12887K29350j21750k59756L24319r4444l04923M39172m1990j8554
$$ 847623 634736 864086 742336 482580 806899 712455 407532 846704 804714 786160
14729G86160N2366l07408L60260j63216C13271K66143J97756j08294k50469N24156
$$ 786160 838526 531118 891378 728162 313271 579414 777170 668876 418407 942563
14719I42563k21080K39471l84813J29722j04294J838P1241k57736M01893k02874
$$ 942563 721483 960954 576141 705863 601569 603407 674648 416912 818805 615931
14709F15931m1638O3590J89649n7358J00673j59365L01495m04936J81004j47439
$$ 615931 574293 637883 827532 770174 870847 711482 1012977 608041 789045 641606
14699F41606J21190K11332l86359Q9882J65724N5301k91831K11927J60585m02427
$$ 641606 762796 974128 587769 677651 843375 898676 606845 818772 979357 576930
14689E76930K35055J75176m34851L52447r7635j14180Q8123J91948j05522k7219
$$ 576930 811985 987161 552310 904757 807122 692942 781065 973013 867491 840272
14679H40272J91583j2661k15415l48839K22904L13964k15234Q485K31365j70742
$$ 840272 1031855 1019194 803779 454940 677844 991808 776574 785059 1016424 845682
14669H45682M28144n63388L27261j47842K67880j21294m04524O17839l59047J09302
$$ 845682 1273826 710438 1037699 889857 1157737 1036443 631919 1249758 890711 1000013
14659A000013J30044m15577O22683m31337k86828K34388J37071n3347N6011k19592
$$ 1000013 1130057 714480 1337163 905826 618998 853386 990457 937110 993121 773529
14649G73529N52406j33313J37639k49794J06434m99138L98445J20710E91391L00722
$$ 773529 1325935 1192622 1330261 1080467 1186901 687763 1086208 1206918 591391 892113
14639H92113J91913m5906l38031K49563K61590k32575N4153J06941J08077k70006
$$ 892113 1084026 1038120 700089 949652 1211242 978667 1032820 1139761 1247838 977832
14629I77832J39925J27110j05619L14329n6259k21666o3805L53037l24599j44340
$$ 977832 1117757 1244867 1139248 1453577 1397318 1175652 1111847 1464884 1140285 995945
14619I95945N89498l95752J06901l02012K36175M54652k12738k4346j26208m0124
$$ 995945 1585443 1189691 1296592 994580 1230755 1685407 1472669 1448323 1322115 1281991
14609A281991J5501J91466n7369P3265m21238L54116Q3956k5018J68002j52540
$$ 1281991 1297492 1488958 1431589 1504854 1083616 1437732 1521688 1496670 1664672 1512132
14599A512132p0807N0238Q1610j83704J22690k60174N6212N7385K69731n2524
$$ 1512132 1441325 1491563 1573173 1389469 1512159 1251985 1308197 1365582 1635313 1582789
14589A582789k27681k60524L95958q2651J92233o6785j78350K97611M6416J02750
$$ 1582789 1355108 1094584 1490542 1407891 1600124 1533339 1354989 1652600 1699016 1801766
14579A801766k99581j18892Q29409k36006l10983M15471l32442l06417J87655
$$ 1801766 1502185 1383293 2212702 1976696 1665713 2081184 1748742 1442325 1629980
14570A629980M17182J34894m54820J26004L27290k58943j10278L03589l47925
$$ 1629980 2047162 2182056 1727236 1853240 2180530 1921587 1811309 2114898 1766973
14561A766973J65912j41443K27627j23030L70480R6251L9105k50775M21949r882
$$ 1766973 1932885 1791442 2019069 1896039 2266519 2362770 2401875 2151100 2573049 2563167
14551B563167j52124o9155l12816M02135M9406O2562J44003N90812j01102K95096
$$ 2563167 2411043 2341888 2029072 2431207 2480613 2543175 2687178 3277990 3176888 3471984
14541C471984j94859M99757L23983J16562Q50784Q36163J387007J943077M252299
$$ 3471984 3277125 3776882 4100865 4217427 5068211 5904374 7291381 9234458 13486757
14532A3486757O631269J0003590O5162j2308523o565567l982624k040693r23120
$$ 13486757 20118026 30121616 30186778 17878255 11312688 7330064 5289371 4366251
14524D366251n75310o98261m18179K7433l22808L82137m11251K11085j9175j37117
$$ 4366251 3790941 3092680 2674501 2701934 2379126 2761263 2350012 2561097 2541922 2404805
14514B404805k26063K48449J44054k01576O5774J1718o5139L43269P4705l44874
$$ 2404805 2178742 2427191 2571245 2369669 2435443 2447161 2382022 2725291 2799996 2455122
14504B455122J62332j00812P1773L45717m09409J35948R000j07202K32925M19923
$$ 2455122 2617454 2516642 2588415 2934132 2524723 2660671 2669671 2562469 2795394 3215317
14494C215317l50468P8046j75738k1525p4719R0729K00955O5108Q1501J15149
$$ 3215317 2864849 2942895 2767157 2745632 2670913 2761642 2962597 3027705 3109206 3224355
14484C224355J6931N1642k24522K82436n8032j75185K42912j49408R6379M2557
$$ 3224355 3241286 3292928 3068406 3350842 3292810 3117625 3360537 3211129 3307508 3350065
14474C350065L17640L0974l59499N71706l55524K00072m7951K18404k01203n2691
$$ 3350065 3667705 3698679 3339180 3910886 3555362 3755434 3707483 3925887 3724684 3671993
14464C671993J44679J81384L08943k43384j87024J94142J73935k6084j36996J06148
$$ 3671993 3816672 3998056 4306999 4063615 3876591 4070733 4244668 4218584 4081588 4187736
14454D187736P1386L42699l11610J00058M4868j0998K00778M1907J60504M6971
$$ 4187736 4259122 4601821 4290211 4390269 4435137 4424139 4624917 4666824 4827328 4874299
14444D874299j13086L18850L6560J04504N1829Q7423P8896J06848k57013L06193
$$ 4874299 4761213 5080063 5116623 5221127 5272956 5360379 5439275 5546123 5289110 5595303
14434E595303l52101J15875J54672O5312K97446l02769Q0139K87681m3372p807
$$ 5595303 5243202 5359077 5513749 5579061 5876507 5573738 5653877 5941558 5898186 5890379
14424E890379K20832L2521K69882O0423l11870K62442K16295O9559L82632M156
$$ 5890379 6111211 6143732 6413614 6474037 6162167 6424609 6640904 6710463 7093095 7097251
14414G097251l48802L35777K43778j05309P6546K05086J63826j75219K18740M51374
$$ 7097251 6748449 7084226 7328004 7222695 7299241 7504327 7668153 7492934 7711674 8163048
14404H163048k72413K14583L57266k03550L58790N3763K37285k31251N11302m19864
$$ 8163048 7890635 8105218 8462484 8258934 8617724 8671487 8908772 8677521 9188823 8768959
14394H768959M64558J83942J38600n1861L35558K3549j01732K90559J71515M70142
$$ 8768959 9233517 9417459 9556059 9504198 9839756 9863305 9761573 10052132 10223647 10693789
14384A0693789J47355K49170k67727N63907J96908j93913P38841J19680J18452
$$ 10693789 10841144 11090314 10822587 11386494 11583402 11389489 12128330 12248010 12366462
14375A2366462j69649M02387L00218j44222N60196O34949k33515P31675R1870
$$ 12366462 12196813 12599200 12899418 12755196 13315392 13950341 13716826 14448501 14540371
14366A4540371N3489L35380O2465Q31854P7678J85641J03576K59162L87755N38098
$$ 14540371 14593860 14929240 14991705 15823559 15901237 16086878 16190454 16449616 16837371 17375469
14356A7375469J94921N83919K38591L46000M88536N66035J22324M71902K83771
$$ 17375469 17570390 18154309 18392900 18738900 19227436 19793471 19915795 20387697 20671468
14347B0671468P28688L81490O72015K68197L66006J059700Q3523M93763P16615
$$ 20671468 21400156 21781646 22453661 22721858 23087864 24147564 24231087 24724850 25441465
14338B5441465N16774O64903Q52085M85100Q19730L26151R68228N99366P59101
$$ 25441465 25958239 26623142 27475227 27960327 28780057 29106208 30074436 30673802 31432903
14329C1432903Q58570J005546O92639Q42384P91192J487009R14723P97466J301423
$$ 31432903 32291473 33297019 33989658 34832042 35623234 37110243 38024966 38822432 40123855
14320D0123855J069400J075788J536105J151999J488399J731452J224296J303614
$$ 40123855 41193255 42269043 43805148 44957147 46445546 48176998 49401294 50704908
14312E0704908J560110J986680J666222K030369K108752J596519K355032K040780
$$ 50704908 52265018 54251698 55917920 57948289 60057041 61653560 64008592 66049372
14304F6049372K475498K834738K139205L007984K881858L071770L373646L100932
$$ 66049372 68524870 71359608 73498813 76506797 79388655 82460425 85834071 88935003
14296H8935003L599473L668842M069899M367814M403088M469127M961077N398258
$$ 88935003 92534476 96203318 100273217 104641031 109044119 113513246 118474323 123872581
14288A23872581N457923N911955O066900O736554O752582P669505P738969Q084043
$$ 123872581 129330504 135242459 141309359 148045913 154798495 162468000 170206969 178291012
14280A78291012Q647510R281629R710335J0325788J0993577J1547317J1997030
$$ 178291012 186938522 196220151 205930486 216256274 227249851 238797168 250794198
14273B50794198J2166051J3257091J3469107J3691956J3818674J3255668J2492938
$$ 250794198 262960249 276217340 289686447 303378403 317197077 330452745 342945683
14266C42945683J1990272J2276014J1929548J1788183J1026712R489964Q743477
$$ 342945683 354935955 367211969 379141517 390929700 401956412 411446376 420189853
14259D20189853Q113641O903062M471966J900791K633385j723202n612859m226766
$$ 420189853 428303494 435206556 439678522 441579313 444212698 442489496 436876637 432649871
14251D32649871o642621q996143j0802745j0096109q944533j1190468j1715667
$$ 432649871 426007250 417011107 406208362 396112253 387167720 375977252 364261585
14244C64261585j2145656j2498625j3130086j1972945j1304001j2748961j2514499
$$ 364261585 352115929 339617304 326487218 314514273 303210272 290461311 277946812
14237B77946812j1797535j1546562j1460716j0727036j0626572j0007503r995203
$$ 277946812 266149277 254602715 243141999 232414963 221788391 211780888 201785685
14230B01785685r215753r627294q873389q510102q373118p227594p076696o789728
$$ 201785685 192569932 182942638 174069249 165559147 157186029 149958435 142881739 136092011
14222A36092011n965038n921068n485028n309193m681771m411605l887847m323131
$$ 136092011 130126973 124205905 118720877 113411684 108729913 104318308 100430461 96107330
14214I6107330l721444l917101l269479l167316l143562l117799k995717k303446
$$ 96107330 92385886 88468785 85199306 82031990 78888428 75770629 72774912 70471466
14206G0471466k462773k042883k468245j898353k429355k084869j395666j826906
$$ 70471466 68008693 65965810 63497565 61599212 59169857 57084988 55689322 53862416
14198E3862416j662532j555755j624844j438133j365016j210884r70770j223437
$$ 53862416 52199884 50644129 49019285 47581152 46216136 45005252 44034482 42811045
14190D2811045j210178j283325j555019j076485j089700m49191p62690j253457
$$ 42811045 41600867 40317542 38762523 37686038 36596338 36147147 35384457 34131000
14182C4131000j175459q22642o48093n45717n88952r17470p79770o41626p61221
$$ 34131000 32955541 32132899 31484806 30939089 30350137 29432667 28652897 28011271 27250050
14173B7250050m79048r37485o60863m14140l37105n59707p05334n96728k71459
$$ 27250050 26771002 25833517 25172654 24758514 24421409 23861702 23156368 22559640 22288181
14164B2288181o25363m1901q62299l40509l89498m91128k18358n03142n59083
$$ 22288181 21662818 21620917 20758618 20418109 20028611 19537483 19319125 18815983 18256900
14155A8256900J15084p25615n14680j84659l34952l99240Q4466m85789j93318
$$ 18256900 18371984 17646369 17131689 16947030 16612078 16212838 16297304 15811515 15618197
14146A5618197k23286m49896l79204k14709J28293l33507n90594R4991o85800
$$ 15618197 15394911 14945015 14565811 14351102 14479395 14145888 13555294 13650285 12964485
14137A2964485L03126m57765l06983o8995N7862m63603l7739l41247O9567k08774
$$ 12964485 13267611 12809846 12502863 12433868 12491730 12028127 11990388 11649141 11718708 11509934
14127A1509934m76178p5847J33677l11197l71103J90899o41527K04085j95151
$$ 11509934 11033756 10957909 11091586 10780389 10409286 10600185 9958658 10162743 9967592
14118I967592o28503K13023j27760R6914n44621J80297j55843n1546j6288k28582
$$ 9967592 9339089 9552112 9424352 9521266 8976645 9156942 9001099 8949553 8933265 8704683
14108H704683k70913l02399K35774j43352K8101l63265K11134n70971q1533q8342
$$ 8704683 8433770 8131371 8367145 8223793 8251894 7888629 8099763 7528792 7447259 7358917
14098G358917L4461P6106R078m15085m3565k9498j81717j39725R241P1611k65107
$$ 7358917 7393378 7469484 7478562 7063477 7019912 6990414 6808697 6668972 6678213 6749824 6484717
14087F484717j13312l8166K76188l29253j20027L0072N1837l01670N9063l38495
$$ 6484717 6371405 6333239 6609427 6280174 6160147 6190219 6242056 5940386 5999449 5660954
14077E660954K07142o464o4698m15903j679K49666k19994j46652j9105j4296l538
$$ 5660954 5868096 5861632 5796934 5381031 5379352 5629018 5409024 5262372 5243267 5228971 5225433
14066E225433j85032N6266K3838j34653l62140N46139m22349n7149k1265q3497
$$ 5225433 5040401 5096667 5120505 4985852 4623712 5169851 4747502 4690353 4669088 4585591
14056D585591K33754j02093j40294n4456k40106M48131n84707Q3902j49743K53058
$$ 4585591 4819345 4717252 4576958 4522502 4282396 4730527 4145820 4229722 4079979 4333037
14046D333037l7869K12618k84989k7090r0909l7164L14758m39929r6221j16250
$$ 4333037 4295168 4507786 4222797 4195707 4104798 4067634 4382392 3942463 3846242 3729992
14036C729992o6811J06771K07142o8152k68087R3143k13429M0584O5284J29950
$$ 3729992 3663181 3769952 3977094 3908942 3640855 3733998 3520569 3561153 3626437 3756387
14026C756387Q6562K1211m27545K25101j87988l12177J06130J50052k22362J54228
$$ 3756387 3842949 3864160 3436615 3661716 3473728 3161551 3267681 3417733 3195371 3349599
14016C349599m79298K97460J61779k10086j3450k26702p513K9287R8628j71523
$$ 3349599 2870301 3167761 3329540 3119454 3106004 2879302 2871789 2901076 2999704 2828181
14006B828181K21171k36930j16467J19229P1346P5144J01910o17350m2047R2849
$$ 2828181 3049352 2812422 2695955 2815184 2886530 2961674 3063584 2446234 2404187 2497036
13996B497036o1503K60772M783k47958O8847k04649K32286k538p2540Q2264k97265
$$ 2497036 2435533 2696305 2701088 2453130 2521977 2317328 2549614 2547076 2474536 2556800 2259535
13985B259535N92691m12626K20914k39849K37202k58456N86351O6617L39788M90409
$$ 2259535 2852226 2439600 2660514 2420665 2657867 2399411 2985762 3052379 3392167 3882576
13975C882576P41013R51420L312289O254506J0668325M861684r667699o506609
$$ 3882576 4623589 5575009 8887298 15141804 25810129 30671813 21004114 14497505
13967A4497505m094523k698884j256080j031324k52211p02320m42441l11670r3334
$$ 14497505 10402982 7704098 6448018 5416694 5164483 4462163 4019722 3708052 3614718
13958C614718n32398j06752K58437l08740k78608R2070M6084j58312J29194O2908
$$ 3614718 3082320 2975568 3234005 2925265 2646657 2738727 2784811 2626499 2755693 2818601
13948B818601n54371L49275m54737K11266j42476J24906J29970m05742L86973
$$ 2818601 2264230 2613505 2158768 2370034 2227558 2352464 2482434 2076692 2463665
13939B463665k56343K38828j56060n17486K32748K26605m83287K27613P5626j83891
$$ 2463665 2207322 2446150 2290090 1772604 2005352 2231957 1748670 1976283 2051909 1868018
13929A868018l42344J64954o196K14123J85828j87079j73131O5447r2374M36241
$$ 1868018 1525674 1690628 1684432 1898555 2084383 1897304 1724173 1789620 1697246 2133487
13919B133487o62287K68637K32083k01244j64425K96114l45856R779J05331K11374
$$ 2133487 1471200 1739837 1971920 1770676 1606251 1902365 1556509 1566288 1671619 1882993
13909A882993n2323l81203m9857K37833l5425R9826j7132M73632l56468M9200
$$ 1882993 1830670 1449467 1399610 1637443 1602018 1701844 1684712 2158344 1801876 1851076
13899A851076j28415m10519L90351m21560L71998j51303j50369J14911M2272m2351
$$ 1851076 1722661 1312142 1702493 1280933 1652931 1501628 1351259 1466170 1508442 1466091
13889A466091j32302j7940J19120M7411L6094R1126j90977J8652l53330M22054
$$ 1466091 1333789 1315849 1434969 1482380 1518474 1609600 1418623 1437275 1083945 1505999
13879A505999k25881O3535j40149L55900m94807K30629Q2726j60415r915J6246
$$ 1505999 1280118 1343653 1203504 1559404 1064597 1295226 1377952 1217537 1207622 1223868
13869A223868j7687n7316p3656N4268M11288k15238K08873l05775J43022k04745
$$ 1223868 1206181 1148865 1075209 1129477 1540765 1325527 1534400 1228625 1371647 1166902
13859A166902J07296J91101k99835L92670k71356r7315o7346J5028K27366J41427
$$ 1166902 1274198 1465299 1165464 1558134 1286778 1189463 1122117 1137145 1364511 1505938
13849A505938k76351j39710J86798m47087J07411L62823j38505r6789K503J6129
$$ 1505938 1229587 1089877 1276675 829588 936999 1299822 1161317 1064528 1067031 1083160
13839A083160j26810J21741K31764m68587M28152k06982j590J90222n2672j94485
$$ 1083160 956350 1078091 1309855 841268 1269420 1062438 1060848 1251070 1198398 1003913
13829A003913J92022m47408j9905K28963n4240O4482k6986O5659m4185q0755K37060
$$ 1003913 1195935 748527 728622 957585 903345 967827 940841 1006500 962315 881560 1118620
13818A118620n9114j17388M83000l77162N5034j08059P2272j07690M71205F91685
$$ 1118620 1059506 942118 1425118 1047956 1102990 994931 1067203 959513 1430718 691685
13807G97939J63756j18471J61357J30135J02992m83049K01648L4210j56023j97849
$$ 797939 961695 843224 1004581 1134716 1237708 754659 956307 990517 834494 636645
13797F36645N7617K22050L84429D04819M92886K6326N5710j29187n2420J82789
$$ 636645 694262 916312 1300741 404819 897705 924031 979741 850554 798134 980923
13787I80923k8122l8856K57244k99930q915q6138K31521Q8472l60502L8K96139
$$ 980923 952801 913945 1171189 871259 862344 776206 1007727 1096199 735697 735735 1031874
13776A031874k92554J11299l38256M93689m94535K49213K47334j77100p5903P3504
$$ 1031874 739320 850619 512363 1006052 511517 760730 1008064 830964 755061 828565
13766H28565k4944j29265P7824j4366j5697J67903j76697q4016P047J58061j28316
$$ 828565 803621 674356 752180 737814 722117 890020 713323 629307 636354 794415 666099
13755F66099L66668m69437K43892r3272J88628k89700K54612J59402m27410l2898
$$ 666099 1032767 563330 807222 713950 902578 612878 867490 1026892 599482 566584
13745E66584J33342J34160j64408J83102J12304l30674L9680R7399O6548J48238
$$ 566584 699926 834086 669678 852780 965084 634410 674090 771489 838037 986275
13735I86275j05713k34891l04403K72459Q2822j75729P2245L80973j71400j0764
$$ 986275 880562 645671 341268 613727 696549 520820 593065 974038 802638 791874
13725G91874N2916j26520j45851R5130J16676k37095K47509j78668k3617J92497
$$ 791874 844790 718270 572419 667549 784225 547130 794639 615971 592354 784851
13715G84851j44819n1576J07684j44290J54901k8968j84892Q9589J47900j07327
$$ 784851 640032 588456 696140 551850 706751 677783 492891 582480 730380 623053
13705F23053q1733J67419J16677M6147l82426N3718J84815k43526R0740P4941
$$ 623053 541320 708739 825416 871563 489137 542855 727670 484144 574884 649825
13695F49825m8770j84080J12682A92746M44872l10197M95257k59063R1605j11678
$$ 649825 601055 416975 529657 192746 637618 327421 822678 563615 655220 543542
13685E43542K01029l15913q9112N0942K55979j50266l9415j73058L50849j46475
$$ 543542 744571 428658 339546 390488 646467 496201 456786 283728 634577 488102
13675D88102J36251j74023k9647j90549l4390K50810J04172m3561L5052J36431
$$ 488102 624353 450330 420683 230134 195744 446554 550726 507165 542217 678648
13665F78648j12442B24203N18781l17470K63858M6679A98364M52282k96125J29982
$$ 678648 566206 224203 742984 425514 689372 736051 198364 650646 354521 484503
13655D84503R4683L9760j98296n3976Q5956J51720j61157L38301j05094j53843
$$ 484503 579186 618946 420650 366674 452630 604350 443193 781494 676400 522557
13645E22557A23503L61321J7914A09413M25744k1623P8886J4361q4198L8963P4042
$$ 522557 123503 484824 502738 109413 535157 513534 592420 606781 522583 561546 635588
13634F35588J05639C66916K85089B50675J03724K24272K8949B92406M13339l40562
$$ 635588 741227 366916 652005 250675 354399 578671 607620 292406 705745 365183
13624C65183J15050J8490j88663L4660r8695J85179J10158j26172K86948k33489
$$ 365183 480233 498723 310060 344720 246025 431204 541362 415190 702138 468649
13614D68649M2126q9949r1852J0185K73579o7917L6968n0796k59467L85422k31221
$$ 468649 510775 420826 328974 339159 612738 544821 581789 530993 271526 656948 425727
13603D25727L51931l72030J73869j53002r8249m0210j18749J72913L0869J52297
$$ 425727 777658 405628 579497 426495 328246 288036 169287 342200 373069 525366
13593E25366j35686j46237L51407I3995M06149k19459M21358A08275K51591J06859
$$ 525366 389680 243443 594850 93995 500144 280685 702043 108275 359866 466725
13583D66725j0296F1585M31831N2888r3790G1222J16272M17976j93002j4069A27068
$$ 466725 456429 61585 493416 546304 452514 71222 187494 605470 412468 398399 127068
13571D32428p0190J34472j10524K54229A99913M10863J89818B72507J84782J03305
$$ 432428 362238 496710 386186 640415 199913 610776 800594 272507 457289 560594
13561E60594N9291j70863j4250j14122L34086l16544A37910Q9722q0504N19314
$$ 560594 619885 449022 434772 320650 654736 338192 137910 227632 147128 666442
13551F66442B86997m6001m6528J60495a9941E88841B22408f0547B65169K4573
$$ 666442 286997 240996 194468 354963 -19941 588841 222408 -60547 265169 289742
13541B89742J65523j42839A10096L89621j44296j19678K7704J37814Q6096j65946
$$ 289742 455265 312426 110096 499717 355421 235743 263447 401261 487357 321411
13531C21411F0973J78312m0144K75926n3429J19437j16503j01219K4072L05687
$$ 321411 60973 239285 199141 475067 421638 541075 424572 323353 347425 653112
13521F53112F1685O76078B59358l5095O1058J77982K4238k05125J34772R2859
$$ 653112 61685 737763 259358 224263 285321 463303 487541 282416 417188 510047
13511E10047j21173J04545k24464L46001A61142K78023j65284j7542m624R4639
$$ 510047 388874 493419 268955 614956 161142 439165 273881 256339 251715 346354
13501C46354J35277B31814K54935L6254j63321N763o0240I672a56761B13804N9926
$$ 346354 481631 231814 486749 523003 359682 365445 305205 9672 -156761 213804 273730
13490B73730L77318A91953b8701C45231Q9515a45111A48748J11121j1043p07N6351
$$ 273730 651048 191953 -28701 345231 434746 -145111 148748 259869 248826 248119 304470
13479C04470L6148n5313J38869H2356L5889J12103n3200K1089L58011B33355J62431
$$ 304470 340618 285305 424174 82356 118245 230348 177148 198237 556248 233355 395786
13468C95786j96711L63134J7526A80721L1084J14277B599L7051j2679O5146L16240
$$ 395786 199075 562209 579735 180721 211805 326082 2599 39650 26971 92117 408357
13457D08357Q5061A88015L47118j46037F2036J43955J19561o5616K9373Q8803
$$ 408357 493418 188015 535133 389096 62036 205991 325552 259936 289309 378112
13447C78112a2888C68861o4612G9753L56972H1339c9899B47641r5529n7525L11126
$$ 378112 -12888 368861 304249 79753 436725 81339 -39899 247641 152112 94587 405713
13436D05713j60769M1260A28591A3592L6296L83396a7407C7370R2620J88213K68200
$$ 405713 244944 286204 128591 13592 49888 433284 -17407 37370 129990 318203 586403
13425E86403B65485A4751L61450j56816e6574J5940E77727I5365K15588O8394
$$ 586403 265485 14751 376201 219385 -56574 -40634 577727 95365 310953 379347
13415C79347j15684J05099k303E3361A1904J8100J99641k8494P6118q8512L01703
$$ 379347 263663 368762 366459 53361 11904 30004 229645 201151 277269 188757 490460
13404D90460l0595j04327K53j29164a67469C63797j15305f5765B10174J11664
$$ 490460 459865 355538 355791 226627 -167469 363797 248492 -65765 210174 321838
13394C21838K46158H0346K8435K85017A61202R3768K56395A4934J92053c67289
$$ 321838 567996 80346 108781 393798 161202 254970 511365 14934 206987 -367289
13383D06746A38038A0152N41607j07893k00322J19449j31801K30211D8540J88411
$$ 406746 138038 10152 551759 443866 243544 362993 231192 461403 48540 236951
13373B36951R9021A45490M75911j59459j71981d1258C67115j16321K04623k5772
$$ 236951 335972 145490 621401 461942 289961 -41258 367115 250794 455417 429645
13363D29645B04797l2393K53126B03284l8150j4262K99419j47296b9830A35730
$$ 429645 204797 172404 425530 203284 165134 150872 450291 302995 -29830 135730
13352B52780P3029C8855i3181D62229F2443L20163o1413A37051g3219C97442j05721
$$ 252780 325809 38855 -93181 462229 62443 382606 321193 137051 -73219 397442 291721
13341B91721q2193J65639j07785j12924O1294K06325j38962l1154n1303N5451
$$ 291721 209528 375167 267382 154458 215752 422077 283115 251961 200658 256109
13331B56109M34336A89131b1054C88216G9543J97689M0111Q0077j49938b23692
$$ 256109 690445 189131 -21054 388216 79543 277232 317343 397420 247482 -223692
13320F07351B81325Q044j25966E1900L35453B9881K07107m3537K09556I0461P1272
$$ 607351 281325 289369 163403 51900 387353 29881 236988 193451 403007 90461 161733
13309A61733O5997N847L55541k78816p8270n8052P2867l701j06520E788K55375
$$ 161733 227730 233577 589118 310302 232032 173980 246847 243146 136626 5788 261163
13298B61163K33546H9282M8597q045h8049E2935A9954L23537j361A07113R0073
$$ 261163 494709 89282 137879 129834 -88049 52935 19954 343491 342130 107113 197186
13287A97186K25050G4523K78355H1170J44336c2775A26575L32881F439L18463
$$ 197186 422236 74523 352878 81170 225506 -32775 126575 459456 6439 324902
13277C24902J03605A81691l036J9617n0182k8695d5926F4373N9523K17630A7803
$$ 324902 428507 181691 178655 198272 148090 119395 -45926 64373 123896 341526 17803
13265B25728R646D9824J09648R5076j6738a83160l9033B20231e993j72097H7372
$$ 225728 235374 49824 159472 254548 237810 -183160 -222193 220231 -5993 -178090 87372
13253C53419b00786o1213A12620K85801A58584L6273J8564j6839P6528P2692q7602
$$ 353419 -200786 -261999 112620 398421 158584 194857 213421 196582 273110 345802 258200
13242B58200I6691a9066H1105Q8555J54839f4445j7199A82735J48518F7019L65141
$$ 258200 96691 -19066 81105 169660 324499 -64445 -81644 182735 331253 67019 432160
13231D32160j47690R8720H2691K4440m8227J9147a08194B01248l6079d2345E8206
$$ 432160 284470 383190 82691 107131 58904 78051 -108194 201248 165169 -42345 58206
13219b52216B386Q0050b70079C94005D1937J1670M9799M53602j53785f821C47041
$$ -252216 2386 82436 -270079 394005 41937 53607 103406 557008 403223 -6821 347041
13207A88356O4204Q6665b7127B02282L4912L6129K8113f9446I7683L27365H1606
$$ 188356 252560 339225 -27127 202282 237194 273323 301436 -69446 97683 425048 81606
13195A23944a07121C37596a50649C0354L02346H5113a90554C11252i6113F6980
$$ 123944 -107121 337596 -150649 30354 332700 85113 -190554 311252 -96113 66980
13184D25800G8601M8954b6021E63246A68154J26213a30905B16690G8318a72522
$$ 425800 78601 127555 -26021 563246 168154 294367 -130905 216690 78318 -172522
13173C54918a67965C14921A6867K50832i594E35783A23961b3258A90485h825B73985
$$ 354918 -167965 314921 16867 267699 -9594 535783 123961 -23258 190485 -8825 273985
13161c35485D8674J84466a00861j31064B11285e3230j04773C97651H7407L4838
$$ -335485 48674 233140 -100861 -231925 211285 -53230 -158003 397651 87407 122245
13151A22245b79619A6252J95009H6538e5790C79638A02931K97235F5095j7798
$$ 122245 -279619 16252 211261 86538 -55790 379638 102931 400166 65095 47297
13141D7297L12015a52769B86815j23859M2855K43991A6916N97313k57393j13935
$$ 47297 359312 -152769 286815 162956 205811 449802 16916 614229 356836 242901
13131B42901J1003C4239N4057O3222c6999B0498b01506B59957D0581a81848P9058
$$ 242901 253904 34239 88296 151518 -36999 20498 -201506 259957 40581 -181848 -102790
13120a02790A2961a79364f8384B07332A757J92076q4441P6546r1597k1796K9402
$$ -102790 12961 -179364 -68384 207332 1757 193833 109392 185938 94341 72545 101947
13109A01947L4046a573A89746b30498a10270A14648L8197j4048O6472I4108J78982
$$ 101947 135993 -1573 189746 -230498 -110270 114648 152845 138797 205269 94108 273090
13098B73090L322b7620j0953j08376j0266B11669i0272A17447E0508r129J97974
$$ 273090 276412 -27620 -38573 -146949 -157215 211669 -90272 117447 50508 41379 239353
13087B39353c3020C82582A44335b46737B16990e5368A61441J63819A14831D2398
$$ 239353 -33020 382582 144335 -246737 216990 -55368 161441 325260 114831 42398
13076A91089J78751A15125J53976E0455d9566D74095a4267D8420J20103J80724
$$ 191089 369840 115125 269101 50455 -49566 474095 -14267 48420 168523 349247
13066C49247I5219J78099b6866A27607R9008m7953M0863a00014B51309A07817
$$ 349247 95219 273318 -26866 127607 226615 178662 219525 -100014 251309 107817
13055D21162f2984A81730J9870D8662M00562j94431j11578k4440b13687A99514
$$ 421162 -62984 181730 201600 48662 449224 254793 143215 118775 -213687 199514
13044A99363m7385B2224a09823J8305b5162A7013b9416A39058K01161H8365a27698
$$ 199363 151978 22224 -109823 -91518 -25162 17013 -29416 139058 340219 88365 -127698
13032B05110J04483A0733K185J66846H9317g1940A7606K56094A17896C1070R8996
$$ 205110 309593 10733 12918 179764 89317 -71940 17606 273700 117896 31070 130066
13021A30066O1996a8551k5977A11163A4229J33025m1708J37638j7999n6379A3657
$$ 130066 192062 -18551 -44528 111163 14229 147254 105546 243184 225185 168806 13657
13009B13996a3388j9078F7851b18106H0102a68967B0890M8701J44011K10960j82150
$$ 213996 -13388 -32466 67851 -218106 80102 -168967 20890 69591 213602 424562 242412
12998B42412l5665N9267i6609J5597j0751C18309H4676h4851A34662J30642J10099
$$ 242412 206747 266014 -96609 -81012 -91763 318309 84676 -84851 134662 265304 375403
12987C75403C3732J92207k1263a47711A83038D7078N3194A7235L18914p4988n0574
$$ 375403 33732 225939 204676 -147711 183038 47078 100272 17235 336149 261161 210587
12976B10587o3209k3146M0848b6552A56430L988G9429a63011A91778J59760A31153
$$ 210587 147378 124232 165080 -26552 156430 160418 79429 -163011 191778 351538 131153
12964B71004I2167K8463J58832A37839n7283L56475j48530j10116H8454J32176
$$ 271004 92167 120630 279462 137839 80556 437031 288501 178385 88454 220630
12954B20630p2450o836J78544H0627C7739a311C4289J50592G3526O2214Q9761
$$ 220630 148180 141344 319888 80627 37739 -1311 34289 184881 73526 135740 225501
12943B25501d1922A13843a0183A19925a02737e0640A37500K24072a27557c9058
$$ 225501 -41922 113843 -10183 119925 -102737 -50640 137500 361572 -127557 -39058
12932D1785Q1403L95230c32939J43731C9272J0803d5456G3296K32109C9479a46429
$$ 41785 123188 518418 -332939 -189208 39272 50075 -45456 73296 305405 39479 -146429
12920A04506b1172A17686a0961C1338K68176M8317e2586n6968b6132A32622m9612
$$ 104506 -21172 117686 -10961 31338 299514 347831 -52586 -109554 -26132 132622 83010
12909H3010a90099B33260q3345k3844Q23b9950A22034c31453A6820K62694d3472
$$ 83010 -190099 233260 149915 126071 126894 -29950 122034 -331453 16820 279514 -43472
12897I0476A8748e1651A19537m4118K3c37189A99715K16634e321F427a2111A62027
$$ 90476 18748 -51651 119537 75419 75442 -337189 199715 416349 -5321 6427 -12111 162027
12884b00987c9254A7732f9005a5517A46182B8742c81535B13147J78990A51084
$$ -200987 -39254 17732 -69005 -15517 146182 28742 -381535 213147 392137 151084
12873A77971P0088D8730K20239a98511C04369b02751A76996c8467l2356j83493
$$ 177971 248059 48730 268969 -198511 304369 -202751 176996 -38467 -70823 -254316
12863b54316E7624K21226a29961j05901e0639C53109p7283a32623B32576b47256
$$ -254316 57624 278850 -129961 -235862 -50639 353109 275826 -132623 232576 -247256
12852a50835N274A33873b10049A47946c7637A9663K36828I691N1421a34648a7432
$$ -150835 -145561 133873 -210049 147946 -37637 19663 256491 9691 61112 -134648 -17432
12840H4889a77938H4715N4916a81600A61409i8419A33908J20194F8333J57582
$$ 84889 -177938 84715 139631 -181600 161409 -98419 133908 254102 68333 225915
12830B25915K4388K9802A26366D3376a31831A96480H328K92786q9939j3535c837
$$ 225915 250303 280105 126366 43376 -131831 196480 8328 301114 211175 197640 -3837
12818G5983a65847b1743r2307j55524B16156k0230E1678J18026p6861J90168i1295
$$ 75983 -165847 -21743 -114050 -269574 216156 195926 51678 169704 92843 283011 -91295
12806I8690J00090b48402I9606K12895a54307q919B25754H3518c02478J25428
$$ 98690 198780 -248402 99606 312501 -154307 -163226 225754 83518 -302478 -177050
12796a77050h7954D273P2945J84964C4267b9709l77128a19462K8490o2806O9497
$$ -177050 -87954 4273 77218 262182 34267 -29709 -406837 -119462 -90972 -153778 -84281
12785h4281m1224A47881P1097b88459J29468E0231R9630c46950a68776c2473A97444
$$ -84281 -125505 147881 218978 -288459 -158991 50231 149861 -346950 -168776 -32473 197444
12773C3068b54539F047c6579A8330b951k13726D6286a03049A96409G4354j7291
$$ 33068 -254539 6047 -36579 18330 -2951 -216677 46286 -103049 196409 74354 57063
12762E7063K21624i1523D5863A5249g8873A29751a85181b517B92093D6411J44696
$$ 57063 278687 -91523 45863 15249 -78873 129751 -185181 -2517 292093 46411 191107
12751A91107g0846r6776f4549C17205h080j17491C00948E8591K6200J7224c24552
$$ 191107 -70846 -167622 -64549 317205 -8080 -125571 300948 58591 84791 102015 -324552
12739e0524A44320a15098l271B34764N8506O198M1251a43177F2562J05635a17515
$$ -50524 144320 -115098 -118369 234764 293270 299468 340719 -143177 62562 168197 -117515
12727F2352J61677m5903a7550E7204N3810D2193n430K6759e1457A12363b53053
$$ 62352 224029 178126 -17550 57204 111014 42193 36763 63522 -51457 112363 -253053
12715A96838D011d766m3447B54556h162A6213a06319j11456A46008a04432K2514
$$ 196838 4011 -4766 -48213 254556 -8162 16213 -106319 -217775 146008 -104432 -81918
12704h1918k58378M2845A21032a07617G4791L4025D9937M02769A06044J51719
$$ -81918 -340296 -297451 121032 -107617 74791 108816 49937 452706 106044 257763
12694B57763E0224N22747A1977K33877H9206K42856J53513B40191a9637D03082
$$ 257763 50224 572971 11977 245854 89206 332062 485575 240191 -19637 403082
12683C8222P2518l8802b83754D0000i6816I5356f8334m9654B20076d9026o0800
$$ 38222 110740 71938 -283754 40000 -96816 95356 -68334 -117988 220076 -49026 -109826
12672a09826C38866a04372H2282A420J67408g0027j1267D4303A6687b2704B6948
$$ -109826 338866 -104372 82282 1420 168828 -70027 -81294 44303 16687 -22704 26948
12660a93585B34347i0866A59048a1201B20427a28336I413a42574A06167a86471
$$ -193585 234347 -90866 159048 -11201 220427 -128336 9413 -142574 106167 -186471
12649A10135b74861A43824n7471J75538r8803J30798M69804F9004b5229A18914
$$ 110135 -274861 143824 86353 261891 163088 293886 763690 69004 -25229 118914
12638C01931D8369M9917O8449n3130B6930h5178b0576H0170J57628i4097F2704
$$ 301931 48369 98286 166735 113605 26930 -85178 -20576 80170 237798 -94097 62704
12626A88149d25029C49470j71386a25493j9249f7494B85262f0221C04462a47775
$$ 188149 -425029 349470 178084 -125493 -144742 -67494 285262 -60221 304462 -147775
12615B59590H0076J0144K93326n1177O2429h3583C62715g7133J9811C14455e942
$$ 259590 80076 90220 383546 332369 394798 -83583 362715 -77133 -57322 314455 -5942
12603A28145O993a14963j7667B83316j08719o6363d2632j4762A72970l6861R6191
$$ 128145 135138 -114963 -132630 283316 174597 108234 -42632 -57394 172970 136109 232300
12592B32300c51091O2868B48839A5299K62841j32482D0317R6861j8956O9300G9940
$$ 232300 -351091 -288223 248839 15299 278140 145658 40317 137178 118222 187522 79940
12580A40286e3052a3707I736L35190J9304a1272A95117c97133a60726B36724e0824
$$ 140286 -53052 -13707 9736 344926 364230 -11272 195117 -397133 -160726 236724 -50824
12568a10044A17472a13481L5306A69432h351j48590A67795o5321n1204K39730
$$ -110044 117472 -113481 -78175 169432 -8351 -156941 167795 102474 51270 291000
12558B91000A08850J94787A9466J15511J322k731H740a06609H1251d486A00347
$$ 291000 108850 303637 19466 134977 136299 133568 8740 -106609 81251 -4486 100347
12546a12587E73213B19243b49854B82228h3214l2850k88384A72252a20849E3782
$$ -112587 573213 219243 -249854 282228 -83214 -116064 -404448 172252 -120849 53782
12535C31748e1701j33147B64586a25411D61287A96600i0718a0009j23671j89882
$$ 331748 -51701 -184848 264586 -125411 461287 196600 -90718 -10009 -133680 -323562
12525c23562B21922h6132B6637a01445A97037e3661q6616I462O2914a50243F4829
$$ -323562 221922 -86132 26637 -101445 197037 -53661 -140277 9462 72376 -150243 64829
12513b4592A07975b6083k2769q3866A5979J03167m5616l2450J32319a98729d5799
$$ -24592 107975 -26083 -48852 -132718 15979 119146 73530 41080 173399 -198729 -45799
12501a59539C3493a02620r6210A70286a14391A26571A4594b13537a03600a6172
$$ -159539 33493 -102620 -198830 170286 -114391 126571 14594 -213537 -103600 -16172
12490a87618C58436O0196a69510D6037K46610E8028e7745o6875E4993M6898J41001
$$ -187618 358436 418632 -169510 46037 292647 58028 -57745 -124620 54993 101891 242892
12479B42892a94367r5526h5134o1055A54498R0706j4544F4157a68243n9010i2258
$$ 242892 -194367 -289893 -85134 -146189 154498 245204 230660 64157 -168243 -227253 -92258
12467a71926E5939a48200B16392D9570b07188B8696J28363h1019A8748J59692
$$ -171926 55939 -148200 216392 49570 -207188 28696 157059 -81019 18748 178440
12457A78440J53909j22745C0760h635D9930K07184a76213f0473B36021E637b43449
$$ 178440 332349 209604 30760 -8635 49930 257114 -176213 -60473 236021 5637 -243449
12445B18605c96659J97500H948e8165E6632J2304f8800k6887a4882A00450P881
$$ 218605 -396659 -199159 8948 -58165 56632 68936 -68800 -95687 -14882 100450 108331
12434A08331J47484c4338j21734j38769a09280q291E9442b39534P9407D6032b95061
$$ 108331 255815 -34338 -156072 -294841 -109280 -117571 59442 -239534 -160127 46032 -295061
12422b04656J1873F4391c25506O9749f2416b4372j49458B2444P5526c44029A12872
$$ -204656 -192783 64391 -325506 -255757 -62416 -24372 -173830 22444 97970 -344029 112872
12410A11262a00967L6340B60763f1817B09770j04823r878R8815f2421r5646E8267
$$ 111262 -100967 -64627 260763 -61817 209770 104947 95069 193884 -62421 -158067 58267
12398B80894d74378B3738R975d7554o9316p0060B02863a55569A73917D3662b65530
$$ 280894 -474378 23738 33713 -47554 -116870 -186930 202863 -155569 173917 43662 -265530
12386a59970G8902b37982A76535g6926l43921a49204A52938N3176e7544q795b4452
$$ -159970 78902 -237982 176535 -76926 -420847 -149204 152938 206114 -57544 -66339 -24452
12374A11458C1202J01401R9508L396c66311A09876J25497G2956O4017J47905a72041
$$ 111458 31202 132603 232111 235507 -366311 109876 235373 72956 136973 284878 -172041
12362A9672h4729k2652H4455b67605R3066A16154b53003B49220c55427E2889J42754
$$ 19672 -84729 -107381 84455 -267605 -174539 116154 -253003 249220 -355427 52889 195643
12351A95643l4708b59886A27795k5480d177I495g6661g797p032C3783Q1681j7877
$$ 195643 160935 -259886 127795 102315 -4177 9495 -76661 -7797 -14829 33783 115464 97587
12339I7587R1184M101F3026k8054K73072a46869E7507B6154d1222n2960A27220
$$ 97587 188771 192872 63026 34972 308044 -146869 57507 26154 -41222 -94182 127220
12327D01421a24797B29824q6219a15580A7695K09463e498B23222n257d5019j09547
$$ 401421 -124797 229824 143605 -115580 17695 227158 -5498 223222 217965 -45019 -154566
12316a54566D86398i0889L6126m11759A17253l4329b3865B17863F6252b74477
$$ -154566 486398 -90889 -54763 -466522 117253 82924 -23865 217863 66252 -274477
12305A50546b79514A0753J4240J71608b26241A16234a90304P7258B55529a93449
$$ 150546 -279514 10753 24993 196601 -226241 116234 -190304 -113046 255529 -193449
12294E0423a45928G140b25286A01036d0316A31840h7569F1275c4034D2284b76114
$$ 50423 -145928 7140 -225286 101036 -40316 131840 -87569 61275 -34034 42284 -276114
12282A29292n9750f2599E9524a32795C65235r1812a13300H6552m2648a0926I589
$$ 129292 69542 -62599 59524 -132795 365235 273423 -113300 86552 43904 -10926 9589
12270C7675R985J82831J4284g3819F345a2651A88924b21433d2885C4423J19782
$$ 37675 47660 230491 244775 -73819 6345 -12651 188924 -221433 -42885 34423 154205
12259A54205Q2979a642l0391A2915a8198j51327c1531C00683j7209A16906a55525
$$ 154205 237184 -1642 -32033 12915 -18198 -169525 -31531 300683 283474 116906 -155525
12247a0254j11575N3268C90002a53209A31867L0420j612b06294H9811J92029A30401
$$ -10254 -121829 -68561 390002 -153209 131867 162287 160675 -206294 89811 281840 130401
12235D0410J14070J03002A00069J18504b87010B178J1829a84951f5499l94257
$$ 40410 154480 257482 100069 218573 -287010 2178 14007 -184951 -65499 -459756
12225d59756A22441J63735q480B491L01865M380A43984R8868n3862O0447H9055
$$ -459756 122441 286176 277696 2491 304356 308736 143984 242852 188990 249437 89055
12213E3009O7974R9449n372J06219j10578g9566j49426B71891E2454L91141j09054
$$ 53009 120983 220432 215060 321279 210701 -79566 -228992 271891 52454 443595 334541
12202C34541A03747A7230E180h4884a2591J883m4288r1931B41620l5856n8830
$$ 334541 103747 17230 5180 -84884 -12591 -10708 -54996 -146927 241620 205764 146934
12191A46934N1804M8515l4641Q1887r9465b9817A40944F9070f0324D39620j52874
$$ 146934 198738 247253 212612 294499 195034 -29817 140944 69070 -60324 439620 286746
12180B86746j20833p4145Q9069M3680L446j8995F7397k0109Q6216J6734A4761
$$ 286746 165913 91768 180837 224517 227963 208968 67397 47288 133504 150238 14761
12168B66233o8332b19080g7263j29217A99613e5771A42489B3345K1916f046B00444
$$ 266233 197901 -219080 -77263 -206480 199613 -55771 142489 23345 45261 -6046 200444
12156A6433K39570H0434g3260A17363c2613H2092c1769A60850a33004E2009J1630
$$ 16433 256003 80434 -73260 117363 -32613 82092 -31769 160850 -133004 52009 63639
12145F3639b8536m19038B00619a84152G5079C0588K61103C2974b2080A06744J03458
$$ 63639 -28536 -447574 200619 -184152 75079 30588 291691 32974 -22080 106744 210202
12134B10202I632g3557j66031C6215L74940d3222A12036M0216b563A54469J84383
$$ 210202 9632 -73557 -239588 36215 411155 -43222 112036 152252 -2563 154469 338852
12123C38852G1471K011f6398B10093c17996g8938l32955B18883n7845p8062a03
$$ 338852 71471 73482 -66398 210093 -317996 -78938 -411893 218883 161038 82976 -103
12111B38142b09218A90298a41681C55061f9037B51514b35528a4759j45906D04722
$$ 238142 -209218 190298 -141681 355061 -69037 251514 -235528 -14759 -160665 404722
12100c17404A63791J26201g8235e247A69628f6845B77721a64915D2514D511J30650
$$ -317404 163791 289992 -78235 -5247 169628 -66845 277721 -164915 42514 4511 135161
12089A35161A8469d05822d9015j45999A0001N7601N8995O8934n766n164b69789
$$ 135161 18469 -405822 -49015 -195014 10001 67602 126597 195531 189765 184601 -269789
12077b76420A54243J19246j22246a91742Q2213A62717M0671b46771O7985B2501
$$ -276420 154243 273489 151243 -191742 -109529 162717 203388 -246771 -178786 22501
12066G6879a48566B8413O6811J34376M28149L55999J12534C76908K01825f7491
$$ 76879 -148566 28413 95224 229600 657749 1013748 1126282 376908 578733 -67491
12055F2045K3605O6502i3527K4407A45740c9076B3580P5578f8003A58118f3440
$$ 62045 85650 152152 -93527 -69120 145740 -39076 23580 99158 -68003 158118 -63440
12043C07886a37408e1803J25A09471b60270d1408F0122O9414J75889a35085k5408
$$ 307886 -137408 -51803 -51678 109471 -260270 -41408 60122 129536 305425 -135085 -160493
12032a60493k2563A85800f5510C10962H8555h5564D1513L024J58460D0296b10123
$$ -160493 -183056 185800 -65510 310962 88555 -85564 41513 44537 202997 40296 -210123
12020b79165I3909J14569b7658n5280M0004A8790J24258c65296J48901L1080f7686
$$ -279165 93909 208478 -27658 -82938 -42934 18790 143048 -365296 -216395 -185315 -67686
12008B09885a89421H2655a37306E4416d24723a4113j9841j79375A57617a1p3116
$$ 209885 -189421 82655 -137306 54416 -424723 -14113 -33954 -213329 157617 -11 -73127
11997g3127H9425a68892G9109b01493i9257c3060I6587K10851j9596a01200l66647
$$ -73127 89425 -168892 79109 -201493 -99257 -33060 96587 307438 287842 -101200 -467847
11986d67847c1964n3400k8302p9967B3065a16511E3553R065b48701j22105J78761
$$ -467847 -31964 -85364 -113666 -193633 23065 -116511 53553 62618 -248701 -370806 -192045
11975a92045E4999J26252c7727k97603A09420F737L1790J8329a73340j30568A92378
$$ -192045 54999 181251 -37727 -335330 109420 6737 38527 56856 -173340 -303908 192378
11963b92517A77469a03075j52063C2140K99099k8968H6591J20355L4736n9326
$$ -292517 177469 -103075 -255138 32140 331239 302271 86591 206946 241682 182356
11953A82356E7899J81217c8161a769k0865A38926a6658j95364G6927b29791F1739
$$ 182356 57899 239116 -38161 -1769 -22634 138926 -16658 -212022 76927 -229791 61739
11941I3796f9393B55414b62341I7236M5715k7024E4773J0591k6350a29173A81502
$$ 93796 -69393 255414 -262341 97236 142951 115927 54773 65364 39014 -129173 181502
11929a0004A91776F3909J57819c3374E9682L5493b19976p843I5440f1834m1121
$$ -10004 191776 63909 221728 -33374 59682 95175 -219976 -227819 95440 -61834 -102955
11918a02955k33293A50861e6149B34274c09774C29561A58701p8182c24817A62530
$$ -102955 -336248 150861 -56149 234274 -309774 329561 158701 80519 -324817 162530
11907a61523l2395h8683A55304b67984D5585b63473e4325o5269A9769a51204J5620
$$ -161523 -193918 -88683 155304 -267984 45585 -263473 -54325 -119594 19769 -151204 -135584
11896a35584c0367C70212C6632b8234E53758B37054g8140A82134D7650K76962
$$ -135584 -30367 370212 36632 -28234 553758 237054 -78140 182134 47650 324612
11886C24612c2240j22141a800j53503A71179a8635j37567A88510B8577o677J37641
$$ 324612 -32240 -154381 -1800 -155303 171179 -18635 -156202 188510 28577 21900 159541
11875A59541h8621A77503a71875A06610O5736l4951a55043D5979J29042j5000
$$ 159541 -88621 177503 -171875 106610 172346 137395 -155043 45979 175021 160021
11865A60021c9959j22259j18034J38230O7771j23863E6936a44906A22479E5728
$$ 160021 -39959 -162218 -280252 -142022 -74251 -198114 56936 -144906 122479 55728
11854B97059H1079Q4093c08337C7081K7117a77377A67675a21417j94585B13785
$$ 297059 81079 165172 -308337 37081 64198 -177377 167675 -121417 -316002 213785
11843a40434c9107B44917J55187j86390a88312J0079B43720H12J76895a91875
$$ -140434 -39107 244917 400104 213714 -188312 -178233 243720 812 177707 -191875
11832A23797a62176P044d7800k4507H6841J33049E7986a37304P766J5292M6455
$$ 123797 -162176 -155132 -47800 -72307 86841 219890 57986 -137304 -129538 -114246 -67791
11821f7791j29675e7552a9579b236q1856c9022o0579L0601A8612a64902q0405
$$ -67791 -197466 -57552 -19579 -2236 -84092 -39022 -99601 -69000 18612 -164902 -245307
11810b45307A97039a77609B05679e1483A31561P6977a79958A46037K6687G3598
$$ -245307 197039 -177609 205679 -51483 131561 208538 -179958 146037 172724 73598
11799b8377F903a83708A00147C6510J0166b51840A36700f7618B71880A1402a88261
$$ -28377 6903 -183708 100147 36510 46676 -251840 136700 -67618 271880 11402 -188261
11787E0954K18247A2726h7408k11251H3119c5020C8619f7820A59957b2222D3007
$$ 50954 269201 12726 -87408 -298659 83119 -35020 38619 -67820 159957 -22222 43007
11775a67636C51073b12008Q0078K1340F680J81144f496A2435b44331C09448q6834
$$ -167636 351073 -212008 -131930 -110590 6680 187824 -6496 12435 -244331 309448 222614
11764B22614A097c92356I3918c7882G9691a15393n4843j7215a456B13587q3633
$$ 222614 1097 -392356 93918 -37882 79691 -115393 -170236 -187451 -1456 213587 129954
11753A29954K2302c33436e251r2941B6928J41316a13206D6683a60880B7603K13052
$$ 129954 152256 -333436 -5251 -98192 26928 168244 -113206 46683 -160880 27603 240655
11742B40655j18101E3896f0222k39382d3480m1285L0181b0289B5435a15752A56680
$$ 240655 122554 53896 -60222 -299604 -43480 -84765 -54584 -20289 25435 -115752 156680
11730B33589b47356i066j31205A67951b96068P9566L0520B4094a59938c8903B862
$$ 233589 -247356 -9066 -140271 167951 -296068 -216502 -185982 24094 -159938 -38903 2862
11718A70200d3090j37052B24789a9678C71179F392K55552a47231F3175B4416b17359
$$ 170200 -43090 -180142 224789 -19678 371179 6392 261944 -147231 63175 24416 -217359
11706B79354E2575r091I424L1813h7988C28061c47457B86641a80261f5642b3503
$$ 279354 52575 43484 9424 41237 -87988 328061 -347457 286641 -180261 -65642 -23503
11694f7544q503q0770j50240c1893G832J70483o0296b9325j6403F3907a01637
$$ -67544 -76047 -156817 -307057 -31893 7832 178315 118019 -29325 -45728 63907 -101637
11682a12080B16688i6735B24345a63827J8837E6526J68070a94147D8870J77338
$$ -112080 216688 -96735 224345 -163827 -144990 56526 224596 -194147 48870 226208
11672B26208I4834a35840m6684G5810h1194L2537A37319n4487J19230q3253B3400
$$ 226208 94834 -135840 -182524 75810 -81194 -48657 137319 82832 202062 118809 23400
11660h0089n5868e9582A63233c10018D2116J1001O2505N4470J5975J52424b8107
$$ -80089 -135957 -59582 163233 -310018 42116 53117 115622 170092 186067 338491 -28107
11648b17416c1162m6495J8386n6578K9839A85291a22023A91732c2874F0166J30242
$$ -217416 -31162 -77657 -59271 -115849 -86010 185291 -122023 191732 -32874 60166 190408
11637A90408e449B28066H9121J42835B9431a0212j09843L3225j977K2759C33116
$$ 190408 -5449 228066 89121 231956 29431 -10212 -120055 -86830 -88807 -66048 333116
11625b1192A3000N6795a6091A05180d9536a2622r0429b571l4162m0543D3148b89822
$$ -21192 13000 69795 -16091 105180 -49536 -12622 -103051 -2571 -36733 -77276 43148 -289822
11612B14916a72101A14373b45278i5348j22974A21228f032k5351a755j35103e6506
$$ 214916 -172101 114373 -245278 -95348 -218322 121228 -6032 -31383 -1755 -136858 -56506
11600a52958c1737G6246M5484b28377P7317B1517a8348A05581E0199c3243q285
$$ -152958 -31737 76246 121730 -228377 -151060 21517 -18348 105581 50199 -33243 -41528
11589d1528K662C44398f8636D3990J73170L13876d2208A39271c12361g7111c5853
$$ -41528 -38866 344398 -68636 43990 217160 531036 -42208 139271 -312361 -77111 -35853
11577a52697A09925Q8458c83j91151A84885b11537e5817B86518C4911k053A072
$$ -152697 109925 198383 -383 -191534 184885 -211537 -55817 286518 34911 32858 1072
11565B8481K58514o1592c17701G7422J9559J07689n0686A4891N3029J13086B7684
$$ 28481 286995 225403 -317701 77422 96981 204670 153984 14891 67920 181006 27684
11553B42050F4139L64915A5997M2472i9509o737A11165R1926b12340g4699A2794
$$ 242050 64139 429054 15997 58469 -99509 -106246 111165 203091 -212340 -74699 12794
11541G1914J82126g7819j64322B8029P6927d7941F7198b2582l4483a5679A88416
$$ 71914 254040 -77819 -242141 28029 104956 -47941 67198 -22582 -57065 -15679 188416
11529b10793C92682E9062k7091R675K49483A28645j754f8957C8848c9514D76285
$$ -210793 392682 59062 31971 41646 291129 128645 126891 -68957 38848 -39514 476285
11517b62324A29514n5834N8752K02712D7305J97506m7868C5933m287P2351i7443
$$ -262324 129514 73680 132432 335144 47305 244811 196943 35933 31646 103997 -97443
11505g6383A31555l1694L8292d4442F7633N3947a09766L3923D63438a20478n0725
$$ -76383 131555 99861 138153 -44442 67633 121580 -109766 -75843 463438 -120478 -171203
11494a71203p761f9345A13725a26863B07792J68450j80064O1982B1749O3818J57568
$$ -171203 -178964 -69345 113725 -126863 207792 376242 196178 258160 21749 85567 243135
11483B43135a76440A8507K15398h856A00459j7672L2819J30858o3194k8697B1771
$$ 243135 -176440 18507 233905 -8856 100459 82787 115606 246464 183270 154573 21771
11471A59313d622A11042e0801B1777M86870A4418L65276a35528A61921q0173N2363
$$ 159313 -4622 111042 -50801 21777 508647 14418 379694 -135528 161921 81748 134111
11460A34111P9242I1889C0124b8577A80073D993b05238R7285A23842B5662j2139
$$ 134111 213353 91889 30124 -28577 180073 4993 -205238 -107953 123842 25662 13523
11449A3523c51816A89632J0985e6500b2163m7433B03199m9786B4065a6542B66411
$$ 13523 -351816 189632 200617 -56500 -22163 -69596 203199 153413 24065 -16542 266411
11437A33003k9038a71451A34372F017a57592A14021J76828j23103J28749g7425
$$ 133003 103965 -171451 134372 6017 -157592 114021 290849 167746 296495 -77425
11426a74405C16811A08411M0321l444a50834R346n5658B5085M2174b04425I0822
$$ -174405 316811 108411 148732 145288 -150834 -141488 -197146 25085 67259 -204425 90822
11414d3005p5286B07108I8317M6535f4138B09758C227J16600g1099J8937r7116
$$ -43005 -118291 207108 98317 144852 -64138 209758 3227 119827 -71099 -52162 -149278
11403a49278M3535k51529A16832b7560H8907C4643c11360A67283c3339J2204C23075
$$ -149278 -105743 -357272 116832 -27560 88907 34643 -311360 167283 -33339 -21135 323075
11391c7587G0137L51248F1552a00978j17500A61216C9582a40340c2062B09316
$$ -37587 70137 421385 61552 -100978 -218478 161216 39582 -140340 -32062 209316
11380B34211a3796A2043J05004g1382D7990R3012c9083k7308C15923p7802l7493
$$ 234211 -13796 12043 117047 -71382 47990 141002 -39083 -66391 315923 238121 200628
11369B00628b94568k3671A56833b15435D9674K02014C6890J80518g7043K3669
$$ 200628 -294568 -318239 156833 -215435 49674 251688 36890 217408 -77043 -53374
11359e3374A02183J73176B5870a22924E4163a6296l7605I5092M17166a14881d3379
$$ -53374 102183 275359 25870 -122924 54163 -16296 -53901 95092 512258 -114881 -43379
11347b08643M1184j75514D1818d7493k01240H374h3324E6944i8362C4887a85958
$$ -208643 -167459 -342973 41818 -47493 -248733 8374 -83324 56944 -98362 34887 -185958
11335A55674c66438K9402b6825B5448a55176B24886A2796a83266O5032B91619
$$ 155674 -366438 -337036 -26825 25448 -155176 224886 12796 -183266 -118234 291619
11324a2123k29723B49746a4694q0045a9152A90266a00020C9965f5356k47624A05412
$$ -12123 -241846 249746 -14694 -94739 -19152 190266 -100020 39965 -65356 -312980 105412
11312i2417D8640J32788H3494c99237J63008P2118G3461J9101J83561b77067B61356
$$ -92417 48640 181428 83494 -399237 -236229 -164111 73461 92562 276123 -277067 261356
11300A0721a11020D40708a88867k5314E4180P9025a68888F5908P2555e7940J3179
$$ 10721 -111020 440708 -188867 -214181 54180 133205 -168888 65908 138463 -57940 -44761
11289d4761j02490K9001B91662A3154f4234A79147G3844f1397A40472a04177A90585
$$ -44761 -147251 -118250 291662 13154 -64234 179147 73844 -61397 140472 -104177 190585
11277a57221p811o5667K1729C3740b46515B8886c98299G7034h3323A38580m1553
$$ -157221 -165032 -230699 -208970 33740 -246515 28886 -398299 77034 -83323 138580 97027
11266I7027f6667D058d8955p7336K7988j62535l5866A56605d83641i0948B28382
$$ 97027 -66667 4058 -48955 -126291 -98303 -260838 -296704 156605 -483641 -90948 228382
11254a69524q0108N205B15463J20369D4869b1520F7578L489b28589A10102c98766
$$ -169524 -249632 -244427 215463 335832 44869 -21520 67578 71067 -228589 110102 -398766
11242c4916j74128a7368j09653C498b6352B2453K88210I3297b58955F743a70509
$$ -34916 -209044 -17368 -127021 3498 -26352 22453 310663 93297 -258955 6743 -170509
11230b84663C65650b3391E127a18855D0826f9246l28179J74721b6561a2252A89593
$$ -284663 365650 -23391 5127 -118855 40826 -69246 -397425 -222704 -26561 -12252 189593
11218a07951l8810O8820B67495A9089b8389G1381a14486r4488f4345F45b01396
$$ -107951 -146761 -77941 267495 19089 -28389 71381 -114486 -208974 -64345 645 -201396
11206B89144G1560C1175e440B17453g1968A70516c5151l60387E2104g3399l124
$$ 289144 71560 31175 -5440 217453 -71968 170516 -35151 -395538 52104 -73399 -76523
11195g6523l3538p224j79616e0890j4550A54903b63018G8947K67054h1356A66788
$$ -76523 -110061 -117285 -296901 -50890 -65440 154903 -263018 78947 346001 -81356 166788
11183a6830A48443o9160J06377a88782b1801C480g5547d979k44066C28508d8487
$$ -16830 148443 79283 185660 -188782 -21801 3480 -75547 -4979 -249045 328508 -48487
11171b39645I3818c3437j57576b6933H3568j5238i4033j40972c9835A69954A8286
$$ -239645 93818 -33437 -191013 -26933 83568 68330 -94033 -235005 -39835 169954 18286
11159A76652a29126A28706b1507j87868g5345C3495K39614C6690i4712q8064K6173
$$ 176652 -129126 128706 -21507 -209375 -75345 33495 273109 36690 -94712 -182776 -156603
11148a56603j20734q988F5944b5738E4615a72594B78788f087m9298a0028C11239
$$ -156603 -277337 -286325 65944 -25738 54615 -172594 278788 -6087 -55385 -10028 311239
11136A55714L5616a26533A77514g276D12366a18852q6732G5415L89944B03643
$$ 155714 191330 -126533 177514 -7276 412366 -118852 -205584 75415 465359 203643
11125a64832H6911K33126H6544a02312E5172b81009j9837J46394C64894b64422
$$ -164832 86911 320037 86544 -102312 55172 -281009 -300846 -154452 364894 -264422
11114a79307D30831A04560a28311B85492a21517A58243n9000b8268A49887J45505
$$ -179307 430831 104560 -128311 285492 -121517 158243 99243 -28268 149887 295392
11104B95392a31882A51608F0342a0050m9233m1809E9746L04705c021A42857K19613
$$ 295392 -131882 151608 60342 -10050 -59283 -101092 59746 364451 -3021 142857 362470
11093C62470c4029j98072B71246e4958B50339F7109K24607r5121K42935N5548
$$ 362470 -34029 -232101 271246 -54958 250339 67109 291716 196595 439530 495078
11083D95078k37044F1832a90360B83537q5307K06192A10328L16665A86258J50784
$$ 495078 258034 61832 -190360 283537 198230 404422 110328 426993 186258 337042
11073C37042r5789o0223R1296m1007h0554B3985L5187L46887O8260j23641K43838
$$ 337042 241253 181030 272326 231319 -80554 23985 59172 406059 474319 350678 594516
11062E94516F5134J3740a33716B35805K33975k05563A29525L19342j00300m6105
$$ 594516 65134 78874 -133716 235805 469780 264217 129525 448867 348567 302462
11052C02462J73511f8357D99904r0330a86816A98163K32859K70305a10399D75703
$$ 302462 475973 -68357 499904 409574 -186816 198163 431022 701327 -110399 475703
11041C43449K34132P8060j12298O9299k06041J11226j33944J69794L45478m35431
$$ 343449 577581 655641 543343 612642 406601 517827 383883 553677 899155 463724
11031D63724J85580N3225o6490J79247j35757P5203j15540O2968J5190r9525P5509
$$ 463724 649304 702529 636039 815286 679529 754732 639192 702160 717350 617825 693334
11020F93334j56109M1357L39353j43295k26651R5299J61698n8818k64536J02250
$$ 693334 537225 578582 917935 774640 547989 643288 804986 746168 481632 583882
11010E83882R4455l38607J52646k508J33186J57289J0289n3053l1475r3923A82904
$$ 583882 678337 339730 492376 489868 623054 780343 790632 737579 706104 612181 182904
10998G82177o0160r9148j22205M3589m5737L02076H0991K11990J4121L77151j61891
$$ 782177 722017 622869 500664 544253 498516 800592 80991 292981 307102 684253 522362
10987E22362M0164M3747P814A38776K81390K96547j05322M4479j39196J47077
$$ 522362 562526 606273 614087 138776 420166 716713 611391 655870 516674 663751
10977F63751k0066j35000J63239J30849J6479P7293Q6719m78199N33435o7248
$$ 663751 643685 508685 671924 802773 819252 896545 983264 505065 1038500 971252
10967I71252J82846k20327J33612j84800N27773N696M70892J9000N40624k19644
$$ 971252 1154098 933771 1067383 882583 1410356 1416052 1886944 1905944 2446568 2226924
10957B226924P0899j88991k3141L5729m997l84325n3069q4555l97377K57083l19550
$$ 2226924 2297823 2108832 2085691 2121420 2116423 1732098 1679029 1594474 1197097 1454180 1134630
10946A134630M21892m9352l36435K49498k37416O19515n77118J33504o04219L05810
$$ 1134630 1556522 1507170 1170735 1420233 1182817 1802332 1225214 1358718 754499 1060309
10936A060309k42803j07808l30741K40070k02193D663L37656G0063J95606a47486
$$ 1060309 817506 709698 378957 619027 416834 4663 342319 70063 265669 -147486
10925f0493C47035C1537Q8764b8869A27462J62151r3254a96649b897l6348A63431
$$ -60493 347035 31537 120301 -28869 127462 289613 196359 -196649 -2897 -39245 163431
10913f8610J8727A59838P2303b56312E4863f183A62183G0261B7422J30471G962
$$ -68610 -49883 159838 232141 -256312 54863 -6183 162183 70261 27422 157893 7962
10901A87759b62589E074J652J36504h9978A57853i1738b745A20643a28842p4015
$$ 187759 -262589 5074 6726 143230 -89978 157853 -91738 -2745 120643 -128842 -202857
10890b02857C77837j02680i0521l5928j53957B44846c4958F6829a52665A56059
$$ -202857 377837 275157 -90521 -126449 -280406 244846 -34958 66829 -152665 156059
10879a19816K3739H308N1356a19400k86106a51105l0441A78298C9651L64847A40490
$$ -119816 -96077 8308 59664 -119400 -405506 -151105 -181546 178298 39651 404498 140490
10867A6484e60357H3663L24999i03m5020A36073a6134A61129i2475B45877G8871
$$ 16484 -560357 83663 408662 -903 -45923 136073 -16134 161129 -92475 245877 78871
10855F723a16638N6769p1163A93611e3582B66023p7534a40019O2756l891o0149
$$ 6723 -116638 -59869 -131032 193611 -53582 266023 188489 -140019 -77263 -81154 -141303
10844a41303R920j19727A11789a23211k98808d3846A84347G3879a43402G2282
$$ -141303 -131383 -251110 111789 -123211 -422019 -43846 184347 73879 -143402 72282
10833B69180H676J49104a96277e769r0649G1375O0865l9128d1483B5477a69921
$$ 269180 8676 157780 -196277 -5769 -96418 71375 132240 93112 -41483 25477 -169921
10821A25669D2228b70497k579A29124g8903q3857j04981I0021k9763R8320A6060
$$ 125669 42228 -270497 -273076 129124 -78903 -162760 -267741 90021 60258 158578 16060
10809a15621k08121a09907K9341A57169a04629M5396A38981n1851a28583A00167
$$ -115621 -323742 -109907 -80566 157169 -104629 -59233 138981 87130 -128583 100167
10798a09175j17499f2466I3569D4245a96462A47951E8498g5364n9891e085F1896
$$ -109175 -226674 -62466 93569 44245 -196462 147951 58498 -75364 -135255 -5085 61896
10786b44572B54299A17540B7040e8472a6977B6319b36655C61226f563H6833a90906
$$ -244572 254299 117540 27040 -58472 -16977 26319 -236655 361226 -6563 86833 -190906
10774f573C088f7097j4488m4100N8238j49709A06204m5994J26999c23691a38124
$$ -6573 3088 -67097 -81585 -125685 -67447 -217156 106204 60210 187209 -323691 -138124
10762A32743B9712K02189c52741h9308B38975n3385b28041c8219B14648F6448
$$ 132743 29712 231901 -352741 -89308 238975 185590 -228041 -38219 214648 66448
10751a79276m7427A08904a21237C17171a22288j19875H9428a83598j3157d8458
$$ -179276 -226703 108904 -121237 317171 -122288 -242163 89428 -183598 -196755 -48458
10740A31720c22569C04315c23995B06968J36619b11777I1695c20790a38561J1038
$$ 131720 -322569 304315 -323995 206968 343587 -211777 91695 -320790 -138561 -127523
10730a27523a3308j92077M4568Q0147k53746j49956A09682a58749p0816k20303
$$ -127523 -13308 -205385 -160817 -80670 -334416 -484372 109682 -158749 -229565 -449868
10720d49868B05185j410a09465l5995D4558a600j92711f5927C998a18413A8788
$$ -449868 205185 203775 -109465 -145460 44558 -1600 -194311 -65927 3998 -118413 18788
10708a59359A747J33687a0842J881j01802K347e023j49834H3372a03057J1257
$$ -159359 1747 135434 -10842 -8961 -110763 -108416 -5023 -154857 83372 -103057 -91800
10697i1800G1595N5999e1465G5858K2273D35a39424k5762a5274q0413B63997f5904
$$ -91800 71595 127594 -51465 75858 98131 435 -139424 -165186 -15274 -95687 263997 -65904
10684a10293l8298A66851A420i1687D2181K52461i6799B28279q2792a24846c1760
$$ -110293 -148591 166851 1420 -91687 42181 294642 -96799 228279 145487 -124846 -31760
10672C8710R5771B7133M3380B3273g303k59267J31400j6095m18475b69166k1898
$$ 38710 134481 27133 70513 23273 -7303 -266570 -135170 -151265 -569740 -269166 -291064
10661b91064a3014el94289R2192D6698Q6320J8147p1460b65701J06118j27338
$$ -291064 -13014 -5 -394294 -302102 46698 133018 151165 79705 -265701 -159583 -286921
10650b86921c5833B5384J90477q0173d18778H0040A2948f1191l02792I3210b15982
$$ -286921 -35833 25384 215861 135688 -418778 80040 12948 -61191 -363983 93210 -215982
10638A4990L3695F668d09099C4157J11831O0058f0658d848k01104r9794i374H6991
$$ 14990 48685 6668 -409099 34157 145988 206046 -60658 -4848 -205952 -305746 -9374 86991
10625F5492l0301a9839r736h050j90323d052j25263p5533a9590A59672J402N3626
$$ 65492 35191 -19839 -29575 -8050 -198373 -4052 -129315 -204848 -19590 159672 161074 214700
10613B14700I6381C6477a06333k76865B8173n726a54197b1988j26186E6959a42242
$$ 214700 96381 36477 -106333 -383198 28173 22447 -154197 -21988 -148174 56959 -142242
10601a97715Q4005D2197M6466O4510E5690b68371b9956F4098e54819a00517d2196
$$ -197715 -113710 42197 88663 153173 55690 -268371 -29956 64098 -554819 -100517 -42196
10589d6403L504B31173c65675G2037h3763k09762A64966a59169A68653k9032a18998
$$ -46403 -42899 231173 -365675 72037 -83763 -293525 164966 -159169 168653 139621 -118998
10577F5275c98607E2843a28452o031D35079c17582A58065a31853j47207J15605
$$ 65275 -398607 52843 -128452 -134483 435079 -317582 158065 -131853 -279060 -163455
10567a63455a8379k19529g4435k36792a54015E4783b68566l6978H7716a63283
$$ -163455 -18379 -237908 -74435 -311227 -154015 54783 -268566 -305544 87716 -163283
10556a15957A49024b18734A25819J04890e0473E2599b6558k3919A26899a24998
$$ -115957 149024 -218734 125819 230709 -50473 52599 -26558 -50477 126899 -124998
10545i5796J4344l6181D15072D6227e64605a7303r2477j55911e5288o3351k63697
$$ -95796 -81452 -117633 415072 46227 -564605 -17303 -109780 -265691 -55288 -118639 -382336
10534c82336i3028M3478j62735d2134n3610A60016a0188l68794a67973e9237A22878
$$ -382336 -93028 -49550 -212285 -42134 -95744 160016 -10188 -378982 -167973 -59237 122878
10522b3179J714C97082a98133P4997B60318j19811J38772b01838J2727g413A56732
$$ -23179 -21465 397082 -198133 -123136 260318 140507 279279 -201838 -189111 -7413 156732
10510a70561C8027c53396f0506k70652a19816o4756Q0102F1526b69953H468P885
$$ -170561 38027 -353396 -60506 -331158 -119816 -184572 -104470 61526 -269953 8468 16353
10499A6353O5323b64195j4193j2595d9337k67231D008L8838d17389i5702o176
$$ 16353 81676 -264195 -278388 -290983 -49337 -316568 4008 42846 -417389 -95702 -101878
10488a01878L5074E1922b23866C13946a39046C69948d7944A65907M0259A0442
$$ -101878 -66804 51922 -223866 313946 -139046 369948 -47944 165907 206166 10442
10477i5678J9147A92323q1223b83134B79600I3839a59382C91523h1558n4899B75838
$$ -95678 -76531 192323 111100 -283134 279600 93839 -159382 391523 -81558 -136457 275838
10465D71987j55174J06778A95562b70254C60774d1574B61895C1486O0659a26374
$$ 471987 316813 423591 195562 -270254 360774 -41574 261895 31486 92145 -126374
10454e7355C3320L49753a44272O2428g359j17808E5172b43405H7502h5404q1947
$$ -57355 33320 383073 -144272 -81844 -7359 -125167 55172 -243405 87502 -85404 -167351
10443a67351f9035j40311I346L8474O2132b08580m5792P4048j58377a57798B0598
$$ -167351 -69035 -209346 9346 47820 109952 -208580 -254372 -180324 -338701 -157798 20598
10431b68111K2045e2799a4265l03650H8496f412k85220A05958J33345d6002a3424
$$ -268111 -246066 -52799 -14265 -317915 88496 -6412 -291632 105958 239303 -46002 -13424
10419c42959J36129A70169p5893b49765C2852P4791d0751H6221j9436a06860L813
$$ -342959 -206830 170169 94276 -249765 32852 107643 -40751 86221 66785 -106860 -103047
10408a03047A27508L05695a97864B03912G166J42468F4651P8563a23913q9679
$$ -103047 127508 433203 -197864 203912 7166 149634 64651 143214 -123913 -213592
10398b13592Q9473C86987a28715D2983L202J47502b5896C9665a31932m10624B12918
$$ -213592 -124119 386987 -128715 42983 46185 193687 -25896 39665 -131932 -542556 212918
10386a38479A16667h5509A4212b8559A42106F6364h7758B05722a33433B44493
$$ -138479 116667 -85509 14212 -28559 142106 66364 -87758 205722 -133433 244493
10375c7674C83590j15447j03888J9390K8904A06184E0010J68012p5574J36542
$$ -37674 383590 268143 164255 183645 212549 106184 50010 218022 142448 278990
10365B78990k0187G9448a12741A63400N3194J10784J22998j55411Q4544j46230
$$ 278990 258803 79448 -112741 163400 216594 327378 450376 294965 379509 233279
10355B33279K4245j28082L00232L44329A18644J36560k4931J97975q6244m4939
$$ 233279 257524 129442 429674 774003 118644 255204 230273 428248 342004 297065
10345B97065M5922M1204j65119L1896a7197B25476G4246J3941R9426R2916K02501
$$ 297065 342987 384191 219072 250968 -17197 225476 74246 88187 187613 280529 483030
10334D83030j98320L71174B49869I1055L37621o6691J50392j08848A08664K10189
$$ 483030 284710 655884 249869 91055 428676 361985 512377 403529 108664 318853
10324C18853K9935A61156N2812e3735B52590b2751F5601J28754L562i307A43648
$$ 318853 348788 161156 213968 -53735 252590 -22751 65601 194355 197917 -9307 143648
10312a13923A31288a38307M3947A07478P9365I697f8967j87648f3264a0909H3423
$$ -113923 131288 -138307 -94360 107478 186843 9697 -68967 -256615 -63264 -10909 83423
10300A3761g4850q440G4781b51735b9415o860F7231d9817a1480j67673d9958A5941
$$ 13761 -74850 -83290 74781 -251735 -29415 -36275 67231 -49817 -11480 -179153 -49958 15941
10287g9981q2649g3856a9589j9618r4203n1568K8666g1378G9096a59278c5677
$$ -79981 -162630 -73856 -19589 -39207 -133410 -184978 -156312 -71378 79096 -159278 -35677
10275b5418k8738K0270C7311c1216C6847e9203q8984N0580A17777c4203H7269
$$ -25418 -54156 -33886 37311 -31216 36847 -59203 -148187 -97607 117777 -34203 87269
10263a03692J3919K6965B1429R5359b37383O0736J8086a6936k00244g9111k47194
$$ -103692 -89773 -62808 21429 116788 -237383 -176647 -158561 -16936 -217180 -79111 -326305
10252c26305j43995F8986b06340a01572A33443n8566L88595k06123M1274i1288
$$ -326305 -470300 68986 -206340 -101572 133443 74877 463472 257349 298623 -91288
10241A01884b03971M6298d149A80974c1770D9778g7994A19247a61453A07767L3226
$$ 101884 -203971 -157673 -4149 180974 -31770 49778 -77994 119247 -161453 107767 140993
10230A40993a46538M27A48319a78295B76836b61801J10442F9267O8822e954A36391
$$ 140993 -146538 -146111 148319 -178295 276836 -261801 -151359 69267 138089 -5954 136391
10218e0454A14098d3303l1656c3662B1456a81276G3169F021L76546c04272a08447
$$ -50454 114098 -43303 -74959 -33662 21456 -181276 73169 6021 382567 -304272 -108447
10206h0456n1160j72551A13590E1619N5109a76212Q5566K7896B21079a96511J6488
$$ -80456 -131616 -304167 113590 51619 106728 -176212 -90646 -62750 221079 -196511 -180023
10195a80023D3388d88644A70552D9876R8096M7804B2078J15680d17554d8828b1953
$$ -180023 43388 -488644 170552 49876 147972 195776 22078 137758 -417554 -48828 -21953
10183a76697E2513d4047k86533d0419A9075K33267b78721G6710f94k21081P3745
$$ -176697 52513 -44047 -330580 -40419 19075 252342 -278721 76710 -694 -221775 -148030
10172a48030k23952a61271A00496A0279J00490e9620D4675J9455b38948B29234
$$ -148030 -371982 -161271 100496 10279 110769 -59620 44675 64130 -238948 229234
10161c32467M4306J03808p6313i6540C4495a6514p4352c6775j51754m02312A83130
$$ -332467 -288161 -184353 -260666 -96540 34495 -16514 -90866 -36775 -188529 -590841 183130
10149a63776j2367A06802B4271C628Q640a27794K3830E5512f6141j19271q1629
$$ -163776 -176143 106802 24271 3628 12268 -127794 -103964 55512 -66141 -185412 -267041
10138b67041a8549I2212j0419N5436b16565R0067j13299P8489B7575K00076a35430
$$ -267041 -18549 92212 81793 137229 -216565 -126498 -239797 -161308 27575 227651 -135430
10126i969j57771j17648g4857j41706c5914A29125a17505A06645h3178A31005
$$ -9969 -167740 -285388 -74857 -216563 -35914 129125 -117505 106645 -83178 131005
10115c1476A49916N6916a48888A15002b48403A72709j9547b95737J42744c4140
$$ -31476 149916 206832 -148888 115002 -248403 172709 153162 -295737 -152993 -34140
10104E8814R9580J15393c32047A37565m8897i3081p7234F5337c8493k07438i3058
$$ 58814 158394 273787 -332047 137565 88668 -93081 -170315 65337 -38493 -245931 -93058
10092b9008e535k13219C88327g8552B8732h4123c7551o5044k13566N3640p9778
$$ -29008 -5535 -218754 388327 -78552 28732 -84123 -37551 -102595 -316161 -262521 -342299
10081c42299g9485k06213A82897J81071I7509C6738J8395a580A24135e4942j35058
$$ -342299 -79485 -285698 182897 363968 97509 36738 55133 -1580 124135 -54942 -190000
10070a90000F671a40711j30440B91697b91725J32830J8232e6619H1540J67329
$$ -190000 6671 -140711 -271151 291697 -291725 -158895 -140663 -56619 81540 248869
10060B48869j8823b12905g0416D09270a8277j08239G4900b26827J1298E5556j6886
$$ 248869 230046 -212905 -70416 409270 -18277 -126516 74900 -226827 -215529 55556 38670
10049C8670D292a30010l3948m3791h0550K6720q9149k30239h4511C2707J14233
$$ 38670 4292 -130010 -163958 -207749 -80550 -53830 -142979 -373218 -84511 32707 146940
10038A46940K7378D7652G588R324N4247J90905a95475B29691b23398q2863A08343
$$ 146940 174318 47652 7588 16912 71159 262064 -195475 229691 -223398 -306261 108343
10026b2369G8513d4031k64159A29010i0734I3913b15693O5957K2532p2256i0340
$$ -22369 78513 -44031 -308190 129010 -90734 93913 -215693 -149736 -127204 -199460 -90340
10014c08165a8820o6577C6021i36j9217A35434B5865a20581A04540a38638A9978
$$ -308165 -18820 -85397 36021 -936 -20153 135434 25865 -120581 104540 -138638 19978
10002a80826j11875R8407R2941n693d9138b950j11457A78077q5300b25920Q4088
$$ -180826 -292701 -194294 -101353 -107046 -49138 -2950 -114407 178077 92777 -225920 -141832
9991a41832k3916A8492b6524n6341I7077b64721d0099j21516a0825A4911O0207
$$ -141832 -165748 18492 -26524 -82865 97077 -264721 -40099 -161615 -10825 14911 75118
9980G5118q317c49406B0151e5130B05127a24221l5650P4021E9665K57450c5132
$$ 75118 66801 -349406 20151 -55130 205127 -124221 -159871 -85850 59665 317115 -35132
9968a07855j15661Q8930b3895k02961A57575J22261I0361b39479d1562G8457b12675
$$ -107855 -223516 -134586 -23895 -226856 157575 279836 90361 -239479 -41562 78457 -212675
9956a22356a1588A55083a66072A36615R6456a93765C28814a80737j7103k05139
$$ -122356 -11588 155083 -166072 136615 233071 -193765 328814 -180737 -197840 -402979
9946d02979B47063a33943A04582b55677g6648j9884r014A20707k6390m6344a51717
$$ -402979 247063 -133943 104582 -255677 -76648 -96532 -105546 120707 94317 47973 -151717
9934b7329H6043f0550A88640b22252b8896o6822j44942B08182h9541F0671b74082
$$ -27329 86043 -60550 188640 -222252 -28896 -95718 -240660 208182 -89541 60671 -274082
9922a41679M0350l7660L0199A24562D0125a84094G8771a97605h04n8205F4255
$$ -141679 -101329 -138989 -108790 124562 40125 -184094 78771 -197605 -804 -59009 64255
9910A55072G2518a53358j9354Q5760l4704A16746j5131b10625L651Q1437j79818
$$ 155072 72518 -153358 -172712 -86952 -121656 116746 101615 -210625 -206974 -125537 -305355
9899c05355B22722b7818o2388A2818a82204e0454k27704B50206C6916L09678c25680
$$ -305355 222722 -27818 -90206 12818 -182204 -50454 -278158 250206 36916 346594 -325680
9887a39340c7001k14020C2194d8522j26035N9689b9149I259b22493O0319n7141
$$ -139340 -37001 -251021 32194 -48522 -174557 -114868 -29149 9259 -222493 -162174 -219315
9876b19315L6121f1042A31852a35443o6659m5640A58848a06329b9410L654D9502
$$ -219315 -183194 -61042 131852 -135443 -202102 -247742 158848 -106329 -29410 -25756 49502
9864G3594a55323C54359A695g6938L4451F5439j3076J3424J29355c854l6887H7155
$$ 73594 -155323 354359 1695 -76938 -42487 65439 52363 65787 195142 -3854 -40741 87155
9851a89705a453j28764F7167r263J699a45905M0067J6185A9020J6844K810K02188
$$ -189705 -1453 -130217 67167 57904 59603 -145905 -105838 -89653 19020 35864 38674 240862
9839B40862J45738e7940j29292c8849l59843J17059a21899a4475B25848a48753
$$ 240862 386600 -57940 -187232 -38849 -398692 -281633 -121899 -14475 225848 -148753
9828a66455m6460p9119H0964m109A1563J69754b20638C57118f7280A26515h9478
$$ -166455 -212915 -292034 80964 76855 11563 181317 -220638 357118 -67280 126515 -89478
9816b16738J4004R2167j051a8729l5546A94916I0408J75472I0260Q458c83592
$$ -216738 -202734 -110567 -111618 -18729 -54275 194916 90408 265880 90260 98718 -383592
9804b50856N1892l10847B35318O6237a1232A20428a02169l31267A1048J16075
$$ -250856 -198964 -509811 235318 301555 -11232 120428 -102169 -433436 11048 127123
9794A27123f7938k465m9445n4455A54578P7228a24813B0350a58599m0957l814
$$ 127123 -67938 -70403 -119848 -174303 154578 231806 -124813 20350 -158599 -199556 -203370
9783b03370m7878J1260j3843g3024a3726D0510f651j12144A18395a87112A73234
$$ -203370 -251248 -239988 -253831 -73024 -13726 40510 -6651 -118795 118395 -187112 173234
9771d1588A45385a48047i931q8486k50894e2751r4315O9187A71263O2521a32865
$$ -41588 145385 -148047 -9931 -98417 -349311 -52751 -147066 -77879 171263 233784 -132865
9759b14903G5494i7443c0042E7620J7269e1411o5297A0390a61390d3258j37624
$$ -214903 75494 -97443 -30042 57620 74889 -51411 -116708 10390 -161390 -43258 -180882
9748a80882q5969f8344q4127k54420J05531J46139j6888d3392H3080b6883l07739
$$ -180882 -266851 -68344 -152471 -406891 -301360 -155221 -172109 -43392 83080 -26883 -334622
9737c34622A82667K1010b70920C015J88391D795J00886B9528a61294F0049b97523
$$ -334622 182667 203677 -270920 3015 191406 4795 105681 29528 -161294 60049 -297523
9725A57157H054c30381J63497M4203j9244j76936N3517A40468E6419a18222e0590
$$ 157157 8054 -330381 -166884 -122681 -141925 -318861 -265344 140468 56419 -118222 -50590
9713G6862a69790k26705C71922G5951K3538J19911b01645k19833J41617B29427
$$ 76862 -169790 -396495 371922 75951 99489 219400 -201645 -421478 -279861 229427
9702C6302J19619P0102i3054a0501k54092a28106J6350c1392k68003m1291a1065
$$ 36302 155921 226023 -93054 -10501 -264593 -128106 -111756 -31392 -299395 -340686 -11065
9690C01574d09080e3858g825m5816J3620k47784k8470B4794a62304E6779f4609
$$ 301574 -409080 -53858 -7825 -53641 -40021 -287805 -316275 24794 -162304 56779 -64609
9678A92261c01066j1675A8795e9909R038k17822H7433a02533B4262L16144r1592
$$ 192261 -301066 -312741 18795 -59909 -50871 -268693 87433 -102533 24262 340406 248814
9667B48814F7093R9571n3040N7851i5033A32740d2624q8754m1530N8406m3726
$$ 248814 67093 166664 113624 171475 -95033 132740 -42624 -131378 -172908 -114502 -158228
9656a58228j17021i8887j65722I3900i8819H255J05074l5116b20842b0629l4095
$$ -158228 -275249 -98887 -264609 93900 -98819 8255 113329 78213 -220842 -20629 -54724
9645e4724d163A57226e6009A29042a48766A48381Q0607a33388n1229A23245c38947
$$ -54724 -4163 157226 -56009 129042 -148766 148381 228988 -133388 -184617 123245 -338947
9633G1240a87049B6595a32589k04926A13397D5403a50628C95894C927J85478B3424
$$ 71240 -187049 26595 -132589 -337515 113397 45403 -150628 395894 3927 189405 23424
9621c22452E6951a07213n1844E5180P9789A8584a93211N0234B6415J48663j3434
$$ -322452 56951 -107213 -159057 55180 134969 18584 -193211 -142977 26415 175078 161644
9610A61644D6299b06391A61121g6195q6975I416J50273c72961f3396G885b51931
$$ 161644 46299 -206391 161121 -76195 -163170 9416 159689 -372961 -63396 7885 -251931
9598G5206B2863J5311i5708L3792k57337G3634a45176p6682a2295A81494c1715
$$ 75206 22863 38174 -95708 -61916 -319253 73634 -145176 -221858 -12295 181494 -31715
9586A39572a83722A62891d18543A75279H092b5883B6252g8977c5245o7586n3122
$$ 139572 -183722 162891 -418543 175279 8092 -25883 26252 -78977 -35245 -102831 -155953
9575a55953B57606b28684h7535n6917A234J94668F7625g2559j38513I9539C9188
$$ -155953 257606 -228684 -87535 -144452 1234 195902 67625 -72559 -211072 99539 39188
9563c46024B37817g4087p5623O25A68084N3020d99126H8890a92272B00999c79051
$$ -346024 237817 -74087 -149710 -149085 168084 221104 -499126 88890 -192272 200999 -379051
9551c36392c9211m1718D1193J6998L89626b83771C74824A85281a08026o098F1025
$$ -336392 -39211 -80929 41193 58191 447817 -283771 374824 185281 -108026 -114124 61025
9539d1981k67992J33740E5569a42442K3570F2050D698M8633R0242b35166N2689
$$ -41981 -309973 -176233 55569 -142442 -118872 62050 4698 53331 143573 -235166 -182477
9528a82477d5469J5248k6893j50983f0804j68109a421A63505a85461F5454a42506
$$ -182477 -45469 -30221 -57114 -208097 -60804 -228913 -1421 163505 -185461 65454 -142506
9516e81916b18179Q6211j4483O3840M188B8509b6400B09188I0414a08913F7726
$$ -581916 -218179 -131968 -146451 -82611 -78423 28509 -26400 209188 90414 -108913 67726
9504B64595q4105A2165O333b92209a08100B74994b15305A57819b03267n6907A91248
$$ 264595 180490 12165 18498 -292209 -108100 274994 -215305 157819 -203267 -260174 191248
9492b09537E1767e5267A37643B1980J0537K9980M3475D3483a11215A12620B051
$$ -209537 51767 -55267 137643 21980 32517 62497 105972 43483 -111215 112620 2051
9480b87585I3059a35894j30565C7009f3493L198j29141C1748J08829a46530j4151
$$ -287585 93059 -135894 -266459 37009 -63493 -60295 -189436 31748 140577 -146530 -160681
9469a60681j30132J40330q6649i0226m09956C0760c39858c1064j72731k955b3709
$$ -160681 -290813 -150483 -237132 -90226 -500182 30760 -339858 -31064 -203795 -206750 -23709
9457E9772b61541M6650a2131l30214F1996L1162F617h4737K6709C6809J86820
$$ 59772 -261541 -214891 -12131 -342345 61996 93158 6617 -84737 -58028 36809 223629
9446B23629a16629d4673A55706c9917A75839q1183a18557j14512B01526a82329
$$ 223629 -116629 -44673 155706 -39917 175839 94656 -118557 -233069 201526 -182329
9435C22877b8626F8597c18231j7404A45044a93253L4185j22974L5860E543a99804
$$ 322877 -28626 68597 -318231 -335635 145044 -193253 -159068 -282042 -246182 5543 -199804
9423h8864G4f0198c671j26360b1398j20166B10967n6687O4266n3508a27400B7421
$$ -88864 74 -60198 -3671 -130031 -21398 -141564 210967 154280 218546 165038 -127400 27421
9410a93950j52574a53382H3593a83789d5381K0652I0888K9088J60335l379a59597
$$ -193950 -346524 -153382 83593 -183789 -45381 -24729 90888 119976 280311 276932 -159597
9398d7275R161k8131A21062a04931M8769j63056M1134A00699L9854a2873k69779
$$ -47275 -38114 -66245 121062 -104931 -56162 -219218 -178084 100699 140553 -12873 -282652
9387b82652j2054Q3866c4053j66228A50814J23426e3089k05315g87k23602H5693
$$ -282652 -294706 -210840 -34053 -200281 150814 274240 -53089 -258404 -787 -224389 85693
9375A07537a77751O4438B39435a25900L4717a9635D11130c8675H6103R2652B8041
$$ 107537 -177751 -113313 239435 -125900 -91183 -19635 411130 -38675 86103 178755 28041
9363a77463L3858J4898c6748j26928b2851A11151a20674J6540b1164m7904k17297
$$ -177463 -143605 -128707 -36748 -163676 -22851 111151 -120674 -104134 -21164 -69068 -286365
9352b86365g6595j83278I8843p814C7416K90020E1563M4559O6568o4255c5012
$$ -286365 -76595 -259873 98843 91029 37416 327436 51563 96122 162690 98435 -35012
9340e7793n0604q0967B82488a53657e4438B1666a71392L7808A55176c50803a03515
$$ -57793 -108397 -189364 282488 -153657 -54438 21666 -171392 -133584 155176 -350803 -103515
9328C8889b24023b297j28209n7166l6734b5183A7245g4203H9454J01485a08853
$$ 38889 -224023 -2297 -130506 -187672 -224406 -25183 17245 -74203 89454 190939 -108853
9316c06915M9922J23915I9011h8735I1040J17855e0335H3507K8516B852O3750
$$ -306915 -256993 -133078 99011 -88735 91040 208895 -50335 83507 112023 2852 66602
9305F6602B1210b0355o0743A2992f4539k72484a00937J8011l0527q9169N4248
$$ 66602 21210 -20355 -81098 12992 -64539 -337023 -100937 -82926 -113453 -202622 -148374
9294a48374l412f7917k63425A19408a24926C0331d084j33018k90090i0851c3328
$$ -148374 -151786 -67917 -331342 119408 -124926 30331 -4084 -137102 -427192 -90851 -33328
9282g4429k20456a27842D1831P4205a62417k00191J75762B63867b43113A27792
$$ -74429 -294885 -127842 41831 116036 -162417 -362608 -186846 263867 -243113 127792
9271a45099M9141j18072O2698B19081E9041a64309j21597A19972m8976a64555
$$ -145099 -95958 -214030 -151332 219081 59041 -164309 -285906 119972 70996 -164555
9260a0915p7104A67881b65766g5454C19695g530m21674b5784m1590l71163D9727
$$ -10915 -88019 167881 -265766 -75454 319695 -7530 -429204 -25784 -67374 -438537 49727
9248a59332D9331d6683k70195H1036a92107A1902a85056j4466r4832P8684A76134
$$ -159332 49331 -46683 -316878 81036 -192107 11902 -185056 -199522 -294354 -215670 176134
9236d86991A67677B0168b59547A29431e5609N945G6924c95815a8582I4713a03554
$$ -486991 167677 20168 -259547 129431 -55609 -49664 76924 -395815 -18582 94713 -103554
9224A55928a13978A20170B779c2972j9800G0579a77151k5016A32936a23620j6093
$$ 155928 -113978 120170 2779 -32972 -52772 70579 -177151 -202167 132936 -123620 -139713
9213a39713A6115c84312B28196a26082B09774d7875B8715K8109a45455r2409A77997
$$ -139713 16115 -384312 228196 -126082 209774 -47875 28715 56824 -145455 -237864 177997
9201c04009K4378A89589D6133f4221C10572b27022B30037a22662C6804J92166
$$ -304009 -279631 189589 46133 -64221 310572 -227022 230037 -122662 36804 228970
9191B28970b15728k23360c9913B8085K256J6919j6811K5959N8941i4693I479a54533
$$ 228970 -215728 -439088 -39913 28085 30341 47260 30449 56408 115349 -94693 9479 -154533
9178D3641a971A8713J97162A05831m236f1574k12841f4772j50980n0344A64465
$$ 43641 -1971 18713 215875 105831 101595 -61574 -274415 -64772 -215752 -266096 164465
9166b03174h7652E7551c98885J83863o4723j18898G4076f098D417A602f0975j73413
$$ -203174 -87652 57551 -398885 -215022 -279745 -398643 74076 -6098 4417 1602 -60975 -234388
9154b34388A41787g558I7670a01651A27123a18762E0378a05541A8817a46657j40495
$$ -234388 141787 -7558 97670 -101651 127123 -118762 50378 -105541 18817 -146657 -287152
9143b87152B42055D4158a74936m4351k86200F7700f0851A76530B444a23997A13931
$$ -287152 242055 44158 -174936 -219287 -505487 67700 -60851 176530 2444 -123997 113931
9131c62544C49829g0330A28440L3796h0235A1118J29004k9283d12308a71211A95309
$$ -362544 349829 -70330 128440 162236 -80235 11118 140122 110839 -412308 -171211 195309
9119a10756B0998a75043l2916B4855P7550f3373j28616Q4412q5366A16536b18589
$$ -110756 20998 -175043 -207959 24855 102405 -63373 -191989 -107577 -192943 116536 -218589
9107b81136Q0912I3435h6670b9290l05309c8065A84910G9679a53512j56190H3261
$$ -281136 -200224 93435 -86670 -29290 -334599 -38065 184910 79679 -153512 -309702 83261
9095A06017c5406D0491J62146C0990a93089n8697I3371b5358B0815h7224r5082
$$ 106017 -35406 40491 202637 30990 -193089 -251786 93371 -25358 20815 -87224 -182306
9084a82306c2394D54719f129j97695b4236G498K16402M0462a3747r6209G8297
$$ -182306 -32394 454719 -6129 -203824 -24236 7498 223900 264362 -13747 -109956 78297
9072a59106P1154j48490a06988q3371M7007k71369a42093A18423O9048b2940k16804
$$ -159106 -87952 -236442 -106988 -190359 -143352 -414721 -142093 118423 187471 -22940 -239744
9061b39744g876r7914a7355j83803C6661g4622E2511c56903J18386i4931j39369
$$ -239744 -7876 -105790 -17355 -201158 36661 -74622 52511 -356903 -238517 -94931 -234300
9050b34300A50324c53820g7025l02787J56324D9607k3436a22980N3939m30466
$$ -234300 150324 -353820 -77025 -379812 -223488 49607 26171 -122980 -69041 -499507
9040d99507A3944P63c9858m5030o2761c6104k146q8491j52641a01933l90928C3809
$$ -499507 13944 14707 -39858 -84888 -147649 -36104 -38250 -126741 -279382 -101933 -492861 33809
9027B1236J10139a54828B55329g1727j34303A30170F3233H114b7184n6750k5881
$$ 21236 131375 -154828 255329 -71727 -206030 130170 63233 8114 -27184 -83934 -109815
9016a09815E3192c1418I1937a68356Q1036k12022B8922K39699D3072L0167K28541
$$ -109815 53192 -31418 91937 -168356 -87320 -299342 28922 268621 43072 73239 301780
9005C01780a85863M3401a1009D22958e4785k3261o8554D7760i4207B11158H2640
$$ 301780 -185863 -142462 -11009 422958 -54785 -78046 -146600 47760 -94207 211158 82640
8993d1006B6433b1853E9967b21229d3180j01503l0946H568K8131R9662K7591E5048
$$ -41006 26433 -21853 59967 -221229 -43180 -144683 -175629 8568 36699 136361 163952 55048
8980f6725A46828D0117e747j86972d8707j53658B8667N0879a03056D343K0441
$$ -66725 146828 40117 -5747 -192719 -48707 -202365 28667 79546 -103056 4343 24784
8969B4784h3915B7497a01297A77517f5102B8976L19832c29565a9993A82196q4864
$$ 24784 -83915 27497 -101297 177517 -65102 28976 348808 -329565 -19993 182196 97332
8958I7332i0237a8004B35542D4999a0523o3942k04882b0768A53433a23978j07992
$$ 97332 -90237 -18004 235542 44999 -10523 -74465 -279347 -20768 153433 -123978 -231970
8947b31970A68094b20072a02306F7271a5901B43384c42414B47171A16892a33250
$$ -231970 168094 -220072 -102306 67271 -15901 243384 -342414 247171 116892 -133250
8936A80110Q3452b55466J04249C8519b36797a18119M5976B64799b43044A30910
$$ 180110 263562 -255466 -151217 38519 -236797 -118119 -72143 264799 -243044 130910
8925e156o1664A31523a0139A99678I3635K79464J33846j99516A53274J33903E5865
$$ -5156 -66820 131523 -10139 199678 93635 373099 506945 307429 153274 287177 55865
8913f8189D17085A18894K35901K45354P29495L70052K379068M457874m13283l995311
$$ -68189 417085 118894 354795 600149 1329644 1699696 4078764 8536638 8123355 4128044
8903D128044j966465q75319k59060C58369J32313A87005Q3333M54801G6441Q3032
$$ 4128044 2161579 1286260 1027200 358369 490682 187005 270338 725139 76441 159473
8893A59473J88710i0212B5185J77034M5723c72267O3121a04424p3072k4677j8721
$$ 159473 348183 -90212 25185 202219 247942 -372267 -309146 -104424 -177496 -202173 -220894
8882b20894A18787d1792k1089j5792j07663A4026R4104a87616j14910J27298A34279
$$ -220894 118787 -41792 -62881 -78673 -186336 14026 108130 -187616 -302526 -175228 134279
8870a31189n0324n8429a15506b1749A04649m6739c55251A97326g432j32774B4099
$$ -131189 -181513 -239942 -115506 -21749 104649 57910 -355251 197326 -7432 -140206 24099
8858d859A20663d32800a29609r080A66883a73219j97522J64930a02382j78736
$$ -4859 120663 -432800 -129609 -138689 166883 -173219 -370741 -205811 -102382 -281118
$$ [...]
##END NTUPLES=NMR SPECTRUM
##END=
