
##TITLE=UV1030_TOFR01-ROVE100A_6099379_QJdLKFSn3O
##JCAMPDX= 6.0         $$ Bruker NMR JCAMP-DX V2.0
##DATA TYPE= NMR SPECTRUM
##DATA CLASS= NTUPLES
##ORIGIN= BRUKER
##OWNER= Administrator
$$ 1.72 TOPSPIN		Version 2.1
$$ 2012-05-12 20:20:27.578 -0500  Administrator@TOPSPIN
$$ Compression mode = diff/dup
##.OBSERVE FREQUENCY= 400.13188235
##.OBSERVE NUCLEUS= ^1H
##.ACQUISITION MODE= SIMULTANEOUS (DQD)
##.ACQUISITION SCHEME= undefined
##.AVERAGES= 64
##.DIGITISER RES= 22
##SPECTROMETER/DATA SYSTEM= spect
##.PULSE SEQUENCE= noesygpps1d.comp
##.SOLVENT NAME= COFFEE_meoh
##.SHIFT REFERENCE= INTERNAL, COFFEE_meoh, 1, 14.96679
##AUDIT TRAIL= $$ (NUMBER, WHEN, WHO, WHERE, PROCESS, VERSION, WHAT)
$$ ##TITLE= Audit trail, TOPSPIN		Version 2.1
$$ ##JCAMPDX= 5.01
$$ ##ORIGIN= Bruker BioSpin GmbH
$$ ##OWNER= Administrator
$$ $$ C:\Bruker\TOPSPIN/data/COFFEE/nmr/UV1030_TOFR01-ROVE100A_6099379_QJdLKFSn3O/12/pdata/1/auditp.txt
$$ ##AUDIT TRAIL=  $$ (NUMBER, WHEN, WHO, WHERE, PROCESS, VERSION, WHAT)
(   1,<2012-05-12 20:20:22.734 -0500>,<Administrator>,<TOPSPIN>,<go>,<TOPSPIN 2.1>,
      <created by zg
	started at 2012-05-12 20:08:52.328 -0500,
	POWCHK enabled, PULCHK disabled,
       configuration hash MD5:
       AF F2 23 6B 01 CD 40 DD E5 A1 38 A0 06 EA F7 77
       data hash MD5: 64K
       76 CE AB 2A DF 84 3A 41 27 93 22 4E 95 34 89 35>)
(   2,<2012-05-12 20:20:25.546 -0500>,<Administrator>,<TOPSPIN>,<proc1d>,<TOPSPIN 2.1>,
      <Start of raw data processing
       efp LB = 0.3 FT_mod = 6 PKNL = 1 PHC0 = 0 PHC1 = 0 SI = 128K 
       data hash MD5: 128K
       09 63 96 E9 A7 E2 0D 5B 42 33 1F 09 0D 8F 34 48>)
(   3,<2012-05-12 20:20:26.812 -0500>,<Administrator>,<TOPSPIN>,<proc1d>,<TOPSPIN 2.1>,
      <pk PHC0 = 39.62219 PHC1 = 0 
       data hash MD5: 128K
       12 3F 40 01 39 64 C5 0B EF D0 6F 7D 59 3B 84 60>)
(   4,<2012-05-12 20:20:27.265 -0500>,<Administrator>,<TOPSPIN>,<proc1d>,<TOPSPIN 2.1>,
      <abs ABSG = 1 
       data hash MD5: 128K
       31 62 8E 60 87 E0 B8 61 A3 4F 55 F2 2E 08 3A CD>)
(   5,<2012-05-12 20:20:27.343 -0500>,<Administrator>,<TOPSPIN>,<proc1d>,<TOPSPIN 2.1>,
      <abs ABSG = 2 
       data hash MD5: 128K
       B3 77 92 BC 54 22 DE 70 20 B7 9F C5 8A C7 71 ED>)
(   6,<2012-05-12 20:20:27.390 -0500>,<Administrator>,<TOPSPIN>,<proc1d>,<TOPSPIN 2.1>,
      <abs ABSG = 3 
       data hash MD5: 128K
       7C C2 89 18 30 73 00 87 C6 5B D3 1F 6D 22 F8 04>)
(   7,<2012-05-12 20:20:27.437 -0500>,<Administrator>,<TOPSPIN>,<proc1d>,<TOPSPIN 2.1>,
      <abs ABSG = 4 
       data hash MD5: 128K
       64 A0 8E E0 9F 6E 2C 2C 20 03 67 87 C5 0F 2B E2>)
(   8,<2012-05-12 20:20:27.484 -0500>,<Administrator>,<TOPSPIN>,<proc1d>,<TOPSPIN 2.1>,
      <abs ABSG = 5 
       data hash MD5: 128K
       05 4E D5 41 25 8B CA 87 DF 46 25 F1 CD DA D3 F8>)
$$ ##END=
$$ 
$$ $$ hash MD5
$$ $$ EA C8 84 20 98 5A 39 EF 5A F9 BD 98 14 9E 6C D7
##$RELAX= 
##$RELAX= 
##$RELAX= 
##$RELAX= 
##$RELAX= 
##$RELAX= 
##$RELAX= 
##$RELAX= 
$$ [...]
##$TP07= 0
##$TPNAME0= <>
##$TPNAME1= <>
##$TPNAME2= <>
##$TPNAME3= <>
##$TPNAME4= <>
##$TPNAME5= <>
##$TPNAME6= <>
##$TPNAME7= <>
##$TPOAL= (0..7)
0.5 0.5 0.5 0.5 0.5 0.5 0.5 0.5
##$TPOFFS= (0..7)
0 0 0 0 0 0 0 0
##$TUNHIN= 0
##$TUNHOUT= 0
##$TUNXOUT= 0
##$USERA1= <user>
##$USERA2= <user>
##$USERA3= <user>
##$USERA4= <user>
##$USERA5= <user>
##$V9= 5
##$VALIST= <valist>
##$VCLIST= <CCCCCCCCCCCCCCC>
##$VD= 0
##$VDLIST= <DDDDDDDDDDDDDDD>
##$VPLIST= <PPPPPPPPPPPPPPP>
##$VTLIST= <TTTTTTTTTTTTTTT>
##$WBST= 2048
##$WBSW= 25
##$XGAIN= (0..3)
0 0 0 0
##$XL= 0
##$YL= 0
##$YMAX_a= 11342401
##$YMIN_a= -5440186
##$ZGOPTNS= <>
##$ZL1= 120
##$ZL2= 120
##$ZL3= 120
##$ZL4= 120
##$ABSF1= 14.96679
##$ABSF2= -5.58574
##$ABSG= 5
##$ABSL= 3
##$ALPHA= 0
##$AQORDER= 0
##$ASSFAC= 0
##$ASSFACI= 0
##$ASSFACX= 0
##$ASSWID= 0
##$AUNMP= <proc_prof1d_extract.lims>
##$AXLEFT= 0
##$AXNAME= <>
##$AXNUC= <1H>
##$AXRIGHT= 0
##$AXTYPE= 0
##$AXUNIT= <>
##$AZFE= 0.1
##$AZFW= 0.1
##$BCFW= 0
##$BC_mod= 0
##$BYTORDP= 0
##$COROFFS= 0
##$CY= 15
##$DATMOD= 1
##$DC= 0
##$DFILT= <>
##$DTYPP= 0
##$F1P= 0
##$F2P= 0
##$FCOR= 0.5
##$FTSIZE= 131072
##$FT_mod= 6
##$GAMMA= 0
##$GB= 0
##$INTBC= 1
##$INTSCL= 1
##$ISEN= 128
##$LB= 0.3
##$LEV0= 0
##$LPBIN= 0
##$MAXI= 10000
##$MC2= 0
##$MEAN= 0
##$ME_mod= 0
##$MI= 0
##$NCOEF= 0
##$NC_proc= -3
##$NLEV= 6
##$NOISF1= 0
##$NOISF2= 0
##$NSP= 0
##$NTH_PI= 0
##$NZP= 0
##$OFFSET= 14.96679
##$PC= 1
##$PHC0= 39.62219
##$PHC1= 0
##$PH_mod= 1
##$PKNL= yes
##$PPARMOD= 0
##$PPDIAG= 0
##$PPIPTYP= 0
##$PPMPNUM= 2147483647
##$PPRESOL= 1
##$PSCAL= 4
##$PSIGN= 0
##$PYNMP= <proc.py>
##$REVERSE= no
##$SF= 400.130005529236
##$SI= 131072
##$SIGF1= 0
##$SIGF2= 0
##$SINO= 400
##$SIOLD= 131072
##$SPECTYP= <>
##$SREGLST= <1H.CDCl3>
##$SSB= 0
##$STSI= 131072
##$STSR= 0
##$SW_p= 8223.68421052632
##$SYMM= 0
##$S_DEV= 0
##$TDeff= 65536
##$TDoff= 0
##$TI= <>
##$TILT= no
##$TM1= 0
##$TM2= 0
##$TOPLEV= 0
##$USERP1= <user>
##$USERP2= <user>
##$USERP3= <user>
##$USERP4= <user>
##$USERP5= <user>
##$WDW= 1
##$XDIM= 131072
##$YMAX_p= 460918250
##$YMIN_p= -25765
##$CURPLOT= <Network HP LaserJet P1505>
##$CURPRIN= <$Network HP LaserJet P1505>
##$DFORMAT= <normdp>
##$LAYOUT= <+/1D_H.xwp>
##$LFORMAT= <normlp>
##$PFORMAT= <normpl>
##$SURQMSG= 1
$$ End of Bruker specific parameters
$$ ---------------------------------
##NTUPLES= NMR SPECTRUM
##VAR_NAME=  FREQUENCY,     SPECTRUM/REAL,   SPECTRUM/IMAG
##SYMBOL=    X,             R,               I
##VAR_TYPE=  INDEPENDENT,   DEPENDENT,       DEPENDENT
##VAR_FORM=  AFFN,          ASDF,            ASDF
##VAR_DIM=   131072,        131072,          131072
##UNITS=     HZ,            ARBITRARY UNITS, ARBITRARY UNITS
##FACTOR=    0.0627417313425165, 1,          1
##FIRST=     8223.62146879498, -4512,        -104165
##LAST=      0,             -1982,           -105681
##MIN=       0,             -25765,          0
##MAX=       8223.62146879498, 460918250,    0
$$ Real data points
##PAGE= N=1
##DATA TABLE= (X++(R..R)), XYDATA
$$ [...]
61388E64293K683J869Q62K18k3l06j006j961k463j921n90O55J477K441L979N600
61372E75807O533O642O142N115L762K521J405K1j228j034R02K882L336K884L019
61357F18709L657L617K872K506K728K678K141J830J855J427L57m61m17M9L14K00
61341F44062l35j218j908j982j932k356k569j418N90J548Q20r3J83J176J772J781
61325F38121J471O50p14j747j463P1K090M059N600O034M909K870J382J407K616
61310F67356L880M467M688N332O438P034O344M811L352K094O66n64o23O20K120
61295G18015K986L352L660L868L848L928M538N524O181N913M855L871L707M021
61281G78267L749K759K394L608N249N348L749K120J475J097K08o76o64K28J329
$$ y = [564293, 566976, 568845, 569707, 569925, 569902, 569596, 568590, 566629, 564166, 562245, 561655, 562310, 563787, 566228, 570207, 575807, 582340, 588982, 595124, 600239, 604001, 606522, 607927, 607948, 606720, 605686, 606588, 609470, 612806, 615690, 618709, 622366, 625983, 628855, 631361, 634089, 636767, 638908, 640738, 642593, 644020, 644377, 643916, 643499, 643548, 643862, 644062, 643727, 642509, 640601, 638619, 636687, 634331, 631762, 630344, 630934, 632482, 633302, 633209, 633392, 634568, 636340, 638121, 639592, 640242, 639528, 637781, 636318, 636389, 638479, 642538, 648138, 654172, 659081, 661951, 663333, 664740, 667356, 671236, 675703, 680391, 685723, 692161, 699195, 705539, 710350, 713702, 715796, 716462, 715898, 715275, 715895, 718015, 721001, 724353, 728013, 731881, 735729, 739657, 744195, 749719, 755900, 761813, 766668, 770539, 774246, 778267, 782016, 784775, 787169, 790777, 796026, 801374, 805123, 807243, 808718, 809815, 810023, 809347, 808683, 808911, 810240]
61266H10240K077J925L54k194l901l093j64K621L372K352J423J933L454M726N472
61251H30597O572Q394R898J0160J0079J1421J4380J7157J8183J7742J6978J6021
61239I87582J3823R676M403k09l050m518n568o314o260n682n783p112q835j0024
61225I52129j0638j0707r656p498n499m627m147l111k156k222k387j028J332K432
61211H92217J552M47O46J709K621L281L901M251M316M670N660O968Q313R559J0077
61196I60188R141P183N416M055K305L34l82P40K375L227L453L392K456M83j129
61181A003237j095r3K68m20j445k387l150l256k411j333p96l33Q71K303K700K155
61165I94815K115L234M573N284N800O729P609P589O677N541M547L813L849N196
$$ y = [810240, 812317, 814242, 814596, 812402, 808501, 805408, 805244, 807865, 811237, 813589, 815012, 816945, 820399, 825125, 830597, 837169, 845563, 855461, 865621, 875700, 887121, 901501, 918658, 936841, 954583, 971561, 987582, 1001405, 1011081, 1015484, 1015275, 1012225, 1007707, 1002139, 995825, 989565, 983883, 978100, 970988, 962153, 952129, 941491, 930784, 921128, 913630, 908131, 903504, 899357, 896246, 894090, 891868, 889481, 888453, 889785, 892217, 893769, 894216, 894862, 896571, 899192, 902473, 906374, 910625, 914941, 919611, 925271, 932239, 940552, 950111, 960188, 969329, 976512, 981928, 985983, 988288, 988622, 988240, 988980, 991355, 994582, 998035, 1001427, 1003883, 1004366, 1003237, 1002142, 1002049, 1002317, 1001897, 1000452, 998065, 994915, 991659, 989248, 987915, 987119, 986786, 987657, 989960, 992660, 994815, 996930, 1000164, 1004737, 1010021, 1015821, 1022550, 1030159, 1037748, 1044425, 1049966, 1054513, 1058326, 1062175, 1067371]
61151A067371P350Q902R070Q501Q113P689O350M171K528K676M587P258R602J0907
61137A165075J1155J1243J2302J4369J6239J6906J6492J5361J3169R650N822L396
61125A311179L033L725L897K784R70k48l21k07j131k700l517l620m641o883q198
61110A294122p075n130m777n829o494o596p423r028j0083j0239j0467j1078j1370
61097A188533j1207j1089j0754r600q321q161q535p647n326l060j275P13J968
61084A106239K64m012p369p997q101r684j0822q770m593j758j319j367n58M20
61070A040573Q44J211K202L917O398R603J2785J4916J5952J6976J8866K1415K3767
61057A189425K5375K6556K8138L0375L2417L3453L4055L5319L6809L6823L4925
$$ y = [1067371, 1074721, 1083623, 1092693, 1101194, 1109307, 1116996, 1123346, 1127517, 1130045, 1132721, 1137308, 1144566, 1154168, 1165075, 1176230, 1187473, 1199775, 1214144, 1230383, 1247289, 1263781, 1279142, 1292311, 1301961, 1307783, 1311179, 1314212, 1317937, 1321834, 1324618, 1325588, 1325340, 1325019, 1324812, 1323681, 1320981, 1317464, 1313844, 1309203, 1302320, 1294122, 1287047, 1281917, 1277140, 1271311, 1264817, 1258221, 1250798, 1241770, 1231687, 1221448, 1210981, 1199903, 1188533, 1177326, 1166237, 1155483, 1145883, 1137562, 1129401, 1120866, 1113219, 1107893, 1104833, 1103558, 1104271, 1106239, 1106503, 1102491, 1095122, 1087125, 1079024, 1069340, 1058518, 1049748, 1045155, 1043397, 1042078, 1040711, 1040153, 1040573, 1041417, 1042628, 1044830, 1048747, 1055145, 1064748, 1077533, 1092449, 1108401, 1125377, 1144243, 1165658, 1189425, 1214800, 1241356, 1269494, 1299869, 1332286, 1365739, 1399794, 1435113, 1471922, 1508745, 1543670]
61046A543670L2699L1453L0745K9878K9209K8901K7740K4578J9950J5133J0609
61035A824565O475L275J124r79l690o040p028p510q897j0703j1069r569p744o802
61021A755408o243n048l145j165N22K082L828N853Q014J0268J2838J5792J8637
61008A817641K0927K3102K5937K9239L1990L3857L5448L6961L7753L7676L7718
60997B168249L8822M0858M3048M4490M4315M2493M0517L9970M0423M0282L9678
60986B623145M0409M2795M4910M5736M6767M9364N2569N5037N7392O1157O6713
60975C185994P3453Q0624Q7026R1503R4722R8917J05147J12626J21294J32452
60965D183758J45991J59903J73911J90527K10748K31935K52214K73773K99510
$$ y = [1543670, 1576369, 1607822, 1638567, 1668445, 1697654, 1726555, 1754295, 1778873, 1798823, 1813956, 1824565, 1831040, 1834315, 1835439, 1834460, 1830770, 1824730, 1817702, 1810192, 1801295, 1790592, 1779523, 1769954, 1762210, 1755408, 1749165, 1744117, 1740972, 1739807, 1740329, 1742411, 1746239, 1752092, 1760106, 1770374, 1783212, 1799004, 1817641, 1838568, 1861670, 1887607, 1916846, 1948836, 1982693, 2018141, 2055102, 2092855, 2130531, 2168249, 2207071, 2247929, 2290977, 2335467, 2379782, 2422275, 2462792, 2502762, 2543185, 2583467, 2623145, 2663554, 2706349, 2751259, 2796995, 2843762, 2893126, 2945695, 3000732, 3058124, 3119281, 3185994, 3259447, 3340071, 3427097, 3518600, 3613322, 3712239, 3817386, 3930012, 4051306, 4183758, 4329749, 4489652, 4663563, 4854090, 5064838, 5296773, 5548987, 5822760, 6122270]
60956F122270L30164L67835M18383M86040N68847O63595P71612Q94807J030502
60947A1654055J176946J339504J523205J724361J940906K180954K429942K597100
60939B6566973K527905K119387J440090P15069J71717j00287j44650l7011J64348
60930C3423541L68071M11377J39756m54732j195937j842327k243993k394297k366730
60921B3844729k236455k054922j857986j668084j491257j325236j171300j033876
60913A1005613r12988q04531p06688o20763n46769m83002m29305l86480l52651
60904E762436l23722k97445k74149k53735k34900k17199k01105j85831j69826
60895C604524j53826j41040j33321j28825j24117j17303j08635r9464r1258q4744
$$ y = [6122270, 6452434, 6820269, 7238652, 7724692, 8293539, 8957134, 9728746, 10623553, 11654055, 12831001, 14170505, 15693710, 17418071, 19358977, 21539931, 23969873, 26566973, 29094878, 31214265, 32654355, 33369424, 33541141, 33440854, 33296204, 33259193, 33423541, 33791612, 34202989, 34342745, 33888013, 32692076, 30849749, 28605756, 26211459, 23844729, 21608274, 19553352, 17695366, 16027282, 14536025, 13210789, 12039489, 11005613, 10092625, 9288094, 8581406, 7960643, 7413874, 6930872, 6501567, 6115087, 5762436, 5438714, 5141269, 4867120, 4613385, 4378485, 4161286, 3960181, 3774350, 3604524, 3450698, 3309658, 3176337, 3047512, 2923395, 2806092, 2697457, 2597993, 2506735, 2421991]
60885B421991p9299p3695o7559o1577n6440n2402m9792m8919m9155m8897m6978
60874A787278m3811m0772l8616l6827l4594l2166l0725l0745l1103l0452k8978
60863A408489k7900k7543k7001k5569k3406k0832j8090j5932j5174j5429j5505
60852A176108j5118j4971j5002j4236j2768j2063j2564j2716j1439r900r439r181
60840A026711p448m636k920l576n887q399r996j0045q622o659n212m805n687q012
60826I34807j1113j3513j4481j4841j5449j5643j4370j2011r912q562p466o493
60814G90953o122o340o343n418l476q13J860L380K996J420L60P92K128L199L558
60799G82134L631L806L874L511L088L369M229M439L287J722R18L96j127l314m350
$$ y = [2421991, 2342692, 2268997, 2201438, 2139861, 2083421, 2031019, 1981227, 1932308, 1883153, 1834256, 1787278, 1743467, 1702695, 1664079, 1627252, 1592658, 1560492, 1529767, 1499022, 1467919, 1437467, 1408489, 1380589, 1353046, 1326045, 1300476, 1277070, 1256238, 1238148, 1222216, 1207042, 1191613, 1176108, 1160990, 1146019, 1131017, 1116781, 1104013, 1091950, 1079386, 1066670, 1055231, 1045331, 1035892, 1026711, 1019263, 1014627, 1011707, 1008131, 1002244, 993845, 983849, 973804, 965182, 958523, 953311, 948506, 942819, 934807, 923694, 910181, 895700, 880859, 865410, 849767, 835397, 823386, 813474, 804912, 797446, 790953, 784831, 778491, 772148, 766730, 763254, 762441, 764301, 767681, 770677, 772097, 772457, 773249, 775377, 778576, 782134, 785765, 789571, 793445, 796956, 800044, 803413, 807642, 812081, 815368, 817090, 818008, 818404, 817277, 813963, 809613]
60784H09613l468j799m14P50J546R18j492m363o206o815o584n769n202o186q511
60769G56018r921q850o591n415n638n999n856n451m720l515k574k752l616m043
60755F81077l874l760l817l778m100n503p496q716q745q443q388q096o958n074
60741E94329k902p92R17J886K012J413L01q24j195l56J350L072L989L537J915
60726F08652L99L31J467K304K261K250K669K422Q97n54m78N46J104J195J694K369
60710F29528K233J320N25J4p77j834k622l063l220k605j206n64k019m267m523
60695F06920k119Q10K235K084J070n24k250l166k879j928q01M37J404J379N18
60680F03190j63l62j042k898n190o645o735n652l809j822l55L90O30L67o59k357
$$ y = [809613, 806145, 804346, 803932, 804682, 806228, 807146, 805654, 801291, 795085, 788270, 781686, 775917, 770715, 764529, 756018, 746097, 737247, 730656, 725241, 719603, 713604, 707748, 702297, 697577, 694062, 691488, 688736, 685120, 681077, 677203, 673443, 669626, 665848, 661748, 656245, 648749, 640033, 631288, 622845, 614457, 606361, 599403, 594329, 591427, 590635, 591552, 593438, 595450, 596863, 597164, 596340, 595145, 594789, 596139, 599211, 603200, 606737, 608652, 609051, 609382, 610849, 613153, 615414, 617664, 620333, 622755, 623652, 623098, 622620, 623166, 624270, 625465, 627159, 629528, 631761, 633081, 633606, 633620, 632843, 631009, 628387, 625324, 622104, 619499, 618293, 617729, 615710, 611443, 606920, 604801, 605611, 607846, 609930, 611000, 610476, 608226, 605060, 602181, 600253, 599452, 599889, 601293, 602672, 603190, 603027, 602665, 601623, 598725, 593535, 586890, 580155, 574503, 570694, 568872, 568517, 568907, 569537, 569904, 569245, 566888]
60664E66888m155n451n625m036r47J829K450J313N92J393K634L041K910L145L700
60649E69681L912L729L680M020M487M675M216K897J005p02j608j612q62M88K027
60634F00033K996K778J424l91j892k764l250l605l469k320n41O43P20N28Q84J395
60618E93169J372J061Q38Q9j722l379k904k13K520L261J878m05k227k747k088
60603E88503j251q74m66L71P22l27j752j738m57K31j91j80J153K639L090L087
60587E92560L667M613M962M296K749O82j145k050k399l090l896l685k505j739
60573E93020j730j219N8L87j020k197j334K54L00o75l43J408K192Q95p38q46J29
60556E88541O49K78l46p98j192j604j839j593p51L56J120J427J913K977L845L418
$$ y = [566888, 562733, 557282, 551657, 547621, 546674, 548503, 550953, 552266, 552858, 554251, 556885, 559926, 562836, 565981, 569681, 573593, 577322, 581002, 585022, 589509, 594184, 598400, 601297, 602302, 601600, 599992, 598380, 597518, 598006, 600033, 603029, 605807, 607231, 606840, 604948, 602184, 598934, 595329, 591860, 589540, 588999, 589642, 590362, 590890, 591774, 593169, 594541, 595602, 596440, 596529, 594807, 591428, 588524, 588311, 590831, 594092, 595970, 595565, 593338, 590591, 588503, 587252, 586378, 585912, 586283, 587005, 586678, 584926, 583188, 582731, 582962, 582771, 582591, 583744, 586383, 589473, 592560, 596227, 600840, 605802, 610098, 612847, 613529, 612384, 610334, 607935, 604845, 600949, 597264, 594759, 593020, 591290, 590071, 590129, 590516, 589496, 587299, 585965, 586219, 586519, 585844, 585501, 586909, 589101, 589996, 589258, 588412, 588541, 589190, 589468, 589122, 588324, 587132, 585528, 583689, 582096, 581345, 581701, 582821, 584248, 586161, 589138, 592983, 596401]
60540E96401J883O12N20J312K360L386L996L494J792kn43L94J925L205M127M829
60524F29691N034M297K886J880K004K692K943L040M451P580J0457J0664Q354O386
60510G02359P240J0455J3523J4776J4726J4527J4011J2016Q401M745K407P60j651
60497H18295m556n991n050l344k860l369k969p84K003L834M680N922Q599J2049
60483H26459J4455J4842J4302J4837J7114K0043K2488K4375K5778K5985K4340
60472A045018K1335J7893J4021R102L358j896n515p423q290q830r395r766r425
60459A050187q291p015o123n251l817k048o26M49J863L943O404R029J1874J4825
60445A065403J7756K1122K5483L0346L4464L7568M0840M5201M9955N3663N5633
$$ y = [596401, 598284, 598896, 599416, 600728, 603088, 606474, 610470, 613964, 615756, 615754, 615211, 615605, 617530, 620735, 624862, 629691, 634725, 639022, 641908, 643788, 645792, 648484, 651427, 654467, 658918, 666498, 676955, 687619, 695973, 702359, 709599, 720054, 733577, 748353, 763079, 777606, 791617, 803633, 812034, 816779, 819186, 819946, 818295, 813739, 807748, 802698, 799354, 796494, 793125, 790156, 789372, 791375, 795209, 799889, 805811, 814410, 826459, 840914, 855756, 870058, 884895, 902009, 922052, 944540, 968915, 994693, 1020678, 1045018, 1066353, 1084246, 1098267, 1107369, 1110727, 1108831, 1103316, 1095893, 1087603, 1078773, 1069378, 1059612, 1050187, 1041896, 1034881, 1028758, 1023507, 1019690, 1017642, 1017016, 1017465, 1019328, 1023271, 1029675, 1038704, 1050578, 1065403, 1083159, 1104281, 1129764, 1160110, 1194574, 1232142, 1272982, 1318183, 1368138, 1421801, 1477434]
60434A477434N5806N4005N0247M5344M0204L4759K8406K1209J3702N621l998j5311
60422A807428k7173l8375m8385n6476o1332o2501o1375n9808n8100n5411n1637
60411A226855m7729m4237m0800l7179l3721l0518k7185k3874k1447k0092j8813
60400H81260j7088j5924j6097j6255j4361j0694p834p401q300q636q164p884q047
60387G34575p772o484m876m073m313m776m667m183m162m852n363m691l020j627
60373F69716j454k090k271j307J31O18m95k355l578l790l534k863j036J880M238
60358F51810M487L034J575J133J612K598L501L423K108O92K69J21j100k780k828
60343F69655q57J172K027K908M900O556N766L011R35J069K433L311L194K830L120
$$ y = [1477434, 1533240, 1587245, 1637492, 1682836, 1723040, 1757799, 1786205, 1807414, 1821116, 1826737, 1822739, 1807428, 1780255, 1741880, 1693495, 1637019, 1575687, 1513186, 1451811, 1392003, 1333903, 1278492, 1226855, 1179126, 1134889, 1094089, 1056910, 1023189, 992671, 965486, 941612, 920165, 900073, 881260, 864172, 848248, 832151, 815896, 801535, 790841, 783007, 775606, 767306, 758670, 750506, 742622, 734575, 726803, 720319, 715443, 711370, 707057, 702281, 697614, 693431, 689269, 684417, 679054, 674363, 671343, 669716, 668262, 666172, 663901, 662594, 662725, 663343, 662848, 660493, 656915, 653125, 649591, 646728, 645692, 647572, 651810, 656297, 659331, 660906, 662039, 663651, 666249, 669750, 673173, 675281, 675973, 676242, 676363, 675263, 672483, 669655, 668798, 669970, 671997, 674905, 679805, 686361, 692127, 695138, 696073, 697142, 699575, 702886, 706080, 708910, 712030]
60328G12030M160N095N033M218L813M246M528L652J927L50n82p22J82J838K983
60313G52751K730J843J715K582L726M787N657N688M496L307L837N822P189O834
60299H12964N749N057M594M110M254N345O408O676P000Q445J0194J0387Q605O089
60285I05877L683J056j887m271n475n987o360o246n218l789k705j906j142j017
60271H64613k166l656l721k368j736l125m960m858k730l97J179K499L504L053
60257H45131J106k12R91L964O609Q331J0045J1831J2509J1917J1853J3748J6375
60244I54198J7139J5146J1861Q926O415L473j79m015p448j0298j2692j4818j6672
60231I51036j7691j7018j4537j1470r401q662q194p002n153l211j397K02J081
$$ y = [712030, 716190, 721285, 726318, 730536, 734349, 738595, 743123, 746775, 748702, 749052, 748470, 747748, 747930, 749768, 752751, 755481, 757324, 759039, 761621, 765347, 770134, 775791, 781479, 785975, 789282, 793119, 798941, 806130, 812964, 818713, 823770, 828364, 832474, 836728, 842073, 848481, 855157, 862157, 870602, 880796, 891183, 899788, 905877, 909560, 910616, 908729, 904458, 898983, 892996, 886636, 880390, 875172, 871383, 868678, 866772, 865630, 864613, 862447, 858791, 855070, 852702, 850966, 847841, 842881, 838023, 835293, 834896, 836075, 838574, 842078, 845131, 846237, 846025, 847016, 850980, 857589, 865920, 875965, 887796, 900305, 912222, 924075, 937823, 954198, 971337, 986483, 998344, 1007270, 1013685, 1017158, 1016979, 1012964, 1005516, 995218, 982526, 967708, 951036, 933345, 916327, 901790, 890320, 880919, 872257, 864063, 857061, 851908, 848697, 847300, 847502, 848583]
60218H48583P02o07j743j907j367j011j345k018k337k221k392l398m700n279n019
60203H13941m648m312l285j611q32k001l799l973k247m90q8n00n88j04N80J237
60187G87280J689J664J275J019J022Q52M39M27J226K391L361M190M863M628K877
60172H19203M77p55j17J054Q81q32k306j799M77K892M562O031P544P866N991L255
60156H54424K215L576N648O990Q093R906J1916J2676J1492R047O939O827R077
60143I58826J1866J2667J1114R349Q964Q975P869O341O312P915R167Q475O134
60130A073974L370J161L5j09k37j250k737l536l618m263o013p587p667o923p178
60115A027422q960j0894j1568j1049j0129q880o837m447l214l944n412n701m486
$$ y = [848583, 849285, 848678, 846935, 845028, 843661, 842650, 841305, 839287, 836950, 834729, 832337, 828939, 824239, 818960, 813941, 809293, 804981, 801696, 800085, 799253, 797252, 793453, 789480, 787233, 786743, 786655, 786155, 785567, 785463, 786043, 787280, 788969, 790633, 791908, 792927, 793949, 794801, 795240, 795667, 796893, 799284, 802645, 806835, 811698, 816326, 819203, 819680, 818925, 818808, 819862, 820743, 819911, 817605, 815806, 816283, 819175, 823737, 829768, 837312, 845178, 851169, 854424, 856639, 860215, 865863, 872853, 880946, 890852, 902768, 915444, 926936, 935983, 942922, 949749, 958826, 970692, 983359, 994473, 1003822, 1012786, 1021761, 1029630, 1035971, 1042283, 1050198, 1059365, 1067840, 1073974, 1077344, 1078505, 1078540, 1078431, 1078194, 1076944, 1074207, 1070671, 1067053, 1062790, 1056777, 1049190, 1041523, 1034600, 1027422, 1018462, 1007568, 996000, 984951, 974822, 965942, 959105, 954658, 951444, 947500, 942088, 936387, 931901]
60102I31901l265l262m086m593m237l045j094J235K992L481L135K870K736J962
60088I26730L66j081j344n47M02J128K174L942N702O316N818N583O501P682P648
60073I77020O392N284N168N600N944O150O171N678M829M358M405M086K967K079
60059A046131K620M266N647O075N929N680N461N428N589N225L420M74j831j920
60045A098194k31J127N88j259k568k626k669m052o318p874q106p697p042n783
60031A043684m179l549m528n895o075n136m377m393m512l992k938j998j647j823
60017I88642k060j970j709j879k912m634o287o906o155n193n911q567j0927j0865
60003I12667r076p726p268o628o025o803q262p656m411j529j279j996j171O33
$$ y = [931901, 928636, 925374, 921288, 916695, 912458, 909413, 908319, 909554, 912546, 916027, 919162, 922032, 924768, 926730, 927096, 926015, 924671, 924124, 924526, 925654, 927828, 931770, 937472, 943788, 949606, 955189, 961690, 969372, 977020, 983412, 988696, 993864, 999464, 1005408, 1011558, 1017729, 1023407, 1028236, 1032594, 1036999, 1041085, 1044052, 1046131, 1048751, 1053017, 1058664, 1064739, 1070668, 1076348, 1081809, 1087237, 1092826, 1098051, 1101471, 1101945, 1100114, 1098194, 1097963, 1099090, 1099678, 1098419, 1095851, 1093225, 1090556, 1086504, 1080186, 1072312, 1064206, 1056509, 1049467, 1043684, 1039505, 1035956, 1031428, 1025533, 1019458, 1014322, 1009945, 1005552, 1001040, 997048, 994110, 992112, 990465, 988642, 986582, 984612, 982903, 981024, 978112, 973478, 967191, 960285, 954130, 948937, 943026, 934459, 923532, 912667, 903591, 895865, 888597, 881969, 875944, 869141, 860879, 853223, 848812, 847283, 846004, 844008, 842837, 843470]
59989H43470J491J800L218N062M940K709R74J500L473N506P143P943P143N181
59975I01553L911M411N621N857M755L168J944J271Q21R9j022k227l406m956o995
59960I14805q869j0039j0840j1709j2323j2315j2075j1945j1486j0512r788r551
59948G83353q547o128m095m445o159o543n168m058m124l995k742j440j257j756
59934G22896j906j361j78J510L111M025M591N448O123N703M625M037L686K486
59920G64796J109J466L318L935K028m23j333j242j612k445l158l961m746m328
59906G53404k392o88n86r44k09Q73P78R5L68J008L3k290l298j760M44J339J487
59889G47662K345L595L716K550J648K000K659K120L33j387k054j739o64J268L491
$$ y = [843470, 844961, 846761, 849979, 855041, 859981, 862690, 863664, 865164, 868637, 874143, 881286, 889229, 896372, 901553, 905464, 909875, 915496, 921353, 926108, 929276, 931220, 932491, 933312, 933411, 932389, 930162, 926756, 921800, 914805, 905936, 895897, 885057, 873348, 861025, 848710, 836635, 824690, 813204, 802692, 792904, 783353, 774806, 768678, 764583, 760138, 753979, 747436, 742268, 738210, 734086, 730091, 727349, 725909, 724652, 722896, 720990, 719629, 719451, 720961, 724072, 728097, 732688, 738136, 744259, 749962, 754587, 758624, 762310, 764796, 765905, 767371, 770689, 774624, 776652, 776229, 774896, 773654, 772042, 769597, 766439, 762478, 757732, 753404, 751012, 750324, 749738, 748794, 748585, 749458, 750236, 750331, 750699, 751707, 751740, 749450, 746152, 744392, 744836, 746175, 747662, 750007, 753602, 757318, 759868, 761516, 763516, 766175, 768295, 768628, 767241, 765187, 763448, 762784, 764052, 767543]
59874G67543M384K987O24n04j1P30J132K093L874N059M616L544L227L239K153
59859H04690j19k142k910k795k596k549k409j909r56L30J674K870L883M656M981
59844H04699M594L306J274n90j007L01J910K274J709J847L369N318O610O960O378
59829H48952N104M214M780O178O642N963N986P716R612R936R302R437J0367J0454
59815I54643Q716N845L180J712J790K836L488K719P91j195k277j950k76J792K874
59800I84688K585J932J911K412L005L925N579P682R543J0625J0434Q608N648K802
59786A061379O84j134k752l286k307r19n53j483l227n410p532q864r419r993j0485
59771I94699r490o568l453j752p74P10J956J500j47j305k011l619n796o434m944
$$ y = [767543, 771927, 774914, 775538, 775034, 775023, 775753, 776885, 778978, 782852, 787911, 792527, 796071, 799298, 802537, 804690, 804571, 802429, 799519, 796724, 794128, 791579, 789170, 787261, 786305, 786635, 788309, 791179, 795062, 799718, 804699, 809293, 812599, 813873, 813283, 812276, 812577, 814487, 816761, 818470, 820317, 823686, 829004, 835614, 842574, 848952, 854056, 858270, 863050, 869228, 875870, 881833, 887819, 895535, 905147, 915083, 924385, 933822, 944189, 954643, 963359, 969204, 972384, 974096, 975886, 978722, 982210, 984929, 985720, 984525, 982248, 980298, 980022, 981814, 984688, 987273, 989205, 991116, 993528, 996533, 1000458, 1006037, 1013719, 1023262, 1033887, 1044321, 1052929, 1058577, 1061379, 1062063, 1060929, 1058177, 1054891, 1052584, 1051665, 1051112, 1049629, 1046402, 1040992, 1033460, 1024596, 1015177, 1005184, 994699, 985209, 978641, 975188, 973436, 972662, 973372, 975328, 976828, 976681, 975376, 973365, 969746, 963950, 957516, 952572]
59756I52572l382l482m455m746m439m611n342n613m795l307k070j879k932m599
59742H96920n819o093n778n269m352k878j696k152m352o484o489m413k345j759
59728H37041j809j099k10r06l151m839m781m108l885l271j338Q25J659J640K385
59713H14153L913M687M067K994K355K162K364L072L827M023M119N198P215Q844
59699H72993R260Q858Q103O931N645N070N302N505N530O502Q840J0775J0160P284
59685I76758M618L871M381M640M363M367N052N853O048N429M080K258O79J34L92
59670A032923K19q22j454o00O36L41j262j994q27R68J902J790P73j208l185l297
59654A024903j213J129K256K808L377K795M93j387p24J165J455J78l03M20K58
$$ y = [952572, 949190, 945708, 941253, 936507, 932068, 927457, 922115, 916502, 911707, 908400, 906330, 904451, 901519, 896920, 891101, 885008, 879230, 873961, 869609, 866731, 865035, 862883, 858531, 852047, 845558, 841145, 838800, 837041, 835232, 834133, 833923, 833017, 829866, 825027, 820246, 816138, 812253, 808982, 807644, 808469, 810128, 811768, 814153, 818066, 822753, 826820, 829814, 832169, 834331, 836695, 839767, 843594, 847617, 851736, 856934, 864149, 872993, 882253, 891111, 899214, 906145, 911790, 916860, 922162, 927667, 933197, 939699, 948539, 959314, 969474, 976758, 981376, 985247, 989628, 994268, 998631, 1002998, 1008050, 1013903, 1019951, 1025380, 1029460, 1031718, 1032397, 1032531, 1032923, 1033142, 1032320, 1030866, 1030266, 1030902, 1031243, 1029981, 1027987, 1027160, 1028128, 1030030, 1031820, 1032593, 1031385, 1028200, 1024903, 1023690, 1024819, 1027075, 1029883, 1033260, 1036055, 1036548, 1035161, 1034437, 1035602, 1037057, 1037235, 1036932, 1037352, 1037610]
59639A037610j415k312p91J594K474J774J079J214J874K681L226K671N52k130
59625A050101l547k882j207l70j212k991m550n687o749p189n924l541k541m211
59611I97500o525o813n457m843n326m865k757j132j752l407l816k674j361o33
59597I46139q1O20J225J521J517J121K85m59k44J118K639K918J561k82j074n98
59581I57926j79j056l079n233o850p778p902p179n798l876j439Q85J864J047n87
59566I10766k009l375m964n887n137l389k343k632l581m608n511n728m703k987
59552H53912j750j394j536j934k259j558N09K430K484J202L76P3j059k639k395
59537H44462J28K218J619m39j359o99R8L45O03J124J381J075N71K76L09O14Q97
$$ y = [1037610, 1036195, 1033883, 1033092, 1034686, 1037160, 1038934, 1040013, 1041227, 1043101, 1045782, 1049008, 1051679, 1052231, 1050101, 1046554, 1043672, 1042465, 1042095, 1040883, 1037892, 1033342, 1027655, 1020906, 1013717, 1007793, 1004252, 1001711, 997500, 990975, 984162, 978705, 973862, 968536, 963671, 960914, 959782, 958030, 954623, 950807, 948133, 946772, 946139, 946058, 946678, 947903, 949424, 950941, 952062, 952347, 951888, 951644, 952762, 955401, 958319, 959880, 959598, 958524, 957926, 957747, 956691, 953612, 948379, 941529, 933751, 925849, 918670, 912872, 908996, 907557, 908442, 910306, 911353, 910766, 908757, 905382, 900418, 894531, 889394, 886005, 883662, 881030, 877449, 872841, 867330, 861602, 856899, 853912, 852162, 850768, 849232, 847298, 845039, 843481, 843990, 846420, 848904, 850106, 850482, 850555, 849496, 846857, 844462, 844590, 846808, 848427, 847988, 846629, 845930, 846028, 846373, 846976, 848100, 849481, 850556, 851127, 851403, 851712, 852326, 853223]
59520H53223N80o12k062k645j820k26P34Q4j765l353l633k785j516k50N15Rj653
59503H32825k827k057JJ577K135K331K104O95j348k087p09J264J979J431R29J349
59487H39592K570M027N289O333P477Q843J0207J1603J3533J6026J8355K0217K1867
59474I85939K1998J7436P310l746r522r112p043o813p464o959n556m286k751m02
59460I69029J854K998L293L081J809l93j835j498p52j272k650l618m355n701p115
59445I52875p335o665o688p841q707p857n519l318k791l898m818l826j510j39
59431H81963o28j490j400j164j954k975k395J18L122N094N318L807J592N38J666
59416H91212L925N528O068O407O906O926N961M382K962K202K125K413K793L284
$$ y = [853223, 853803, 853191, 851129, 848484, 846664, 846438, 847172, 847256, 845491, 842138, 838505, 835720, 834204, 833954, 834469, 834478, 832825, 829998, 827941, 827942, 829519, 831654, 833985, 836089, 836784, 835436, 833349, 832640, 833904, 835883, 837314, 838243, 839592, 842162, 846189, 851478, 857811, 865288, 874131, 884338, 895941, 909474, 925500, 943855, 964072, 985939, 1007937, 1025373, 1032683, 1028937, 1019415, 1010303, 1003260, 996447, 988983, 982024, 976468, 972182, 969431, 969029, 970883, 973881, 977174, 980255, 982064, 981671, 979836, 978338, 977586, 976314, 973664, 970046, 965691, 959990, 952875, 945540, 938875, 932187, 924346, 915639, 907782, 902263, 898945, 896154, 892256, 887438, 883612, 882102, 881963, 881335, 879845, 878445, 877281, 875327, 872352, 869957, 870075, 873197, 878291, 883609, 887416, 889008, 889546, 891212, 895137, 900665, 906733, 913140, 920046, 926972, 932933, 937315, 940277, 942479, 944604, 947017, 949810, 953094]
59402I53094L778L633K429J038Q95K116L411M056M651N589O147N897N769O812
59388A009315Q712J0326J0892J0145Q192N918M550M077L008L51k960n250n828
59375A061448n029l510k188j912k433k411j069Q92K298K724K529K656M300P678
59361A065973J1080J2687J3236J5100J8741K2157K4118K5631K7730L0277L3590
59350A300320L8167M1518L8408K6727J0911k481j0629j4121j3692j0293o195k622
59338A396018K314R866J5970J4154L205j1040k1764k6564k6916k5224k3330k1949
59326A284740k0444j7966j4911j2304j0291q545p527p690p964o819m564k829k164
59313A160722j793j485j792k616l135l117k872k208r14J87L02K20J063K105K001
$$ y = [953094, 956872, 960505, 962934, 963972, 964867, 966983, 970394, 974450, 979101, 984690, 990837, 996734, 1002503, 1009315, 1018027, 1028353, 1039245, 1049390, 1057582, 1063500, 1068050, 1072127, 1075135, 1075486, 1072526, 1067276, 1061448, 1056419, 1052909, 1050721, 1048809, 1046376, 1043965, 1042896, 1043788, 1046086, 1048810, 1051339, 1053995, 1058295, 1065973, 1077053, 1089740, 1102976, 1118076, 1136817, 1158974, 1183092, 1208723, 1236453, 1266730, 1300320, 1338487, 1380005, 1418413, 1445140, 1456051, 1453570, 1442941, 1428820, 1415128, 1404835, 1398640, 1396018, 1398332, 1408198, 1424168, 1438322, 1441527, 1430487, 1408723, 1382159, 1355243, 1330019, 1306689, 1284740, 1264296, 1246330, 1231419, 1219115, 1208824, 1200279, 1192752, 1185062, 1177098, 1170279, 1165715, 1162886, 1160722, 1158929, 1157444, 1155652, 1153036, 1149901, 1146784, 1143912, 1141704, 1140790, 1140977, 1141279, 1141499, 1142562, 1144667, 1146668]
59298A146668J643L303O856R447R447Q485Q710J0001J1041J1550J2166J3044J3721
59285A266082J3987J4228J4969J6167J6868J6094J4228J2767J2166J1203R244
59274A418003P452O304L755j775q009j1237j1414j1781j3789j5528j5553j5152
59262A331276j5806j6963j7527j7569j7400j6665j5376j4279j3358j1470q329
59251A166534n370l838l283k716j899q07R61L489O285R039J1310J1339P031j071
59237A197004r386j4835j7421j8530j8382j6540j3701j1463j0638j0724j0599
59226A044785r320o796m152k666k137j177P32K594L627M360N495O855Q053R172
59212A059425J0225J0981J1734J3138J4821J5529J5287J5840J7843J9080J7034
$$ y = [1146668, 1148311, 1151614, 1158470, 1167917, 1177364, 1185849, 1194559, 1204560, 1215601, 1227151, 1239317, 1252361, 1266082, 1280069, 1294297, 1309266, 1325433, 1342301, 1358395, 1372623, 1385390, 1397556, 1408759, 1418003, 1425455, 1431759, 1435514, 1433739, 1425730, 1414493, 1403079, 1391298, 1377509, 1361981, 1346428, 1331276, 1315470, 1298507, 1280980, 1263411, 1246011, 1229346, 1213970, 1199691, 1186333, 1174863, 1166534, 1161164, 1157326, 1154043, 1151327, 1149428, 1148621, 1149582, 1153071, 1159356, 1168395, 1179705, 1191044, 1198075, 1197004, 1187618, 1172783, 1155362, 1136832, 1118450, 1101910, 1088209, 1076746, 1066108, 1055384, 1044785, 1035465, 1028669, 1024517, 1021851, 1019714, 1018537, 1019269, 1021863, 1025490, 1029850, 1035345, 1042200, 1050253, 1059425, 1069650, 1080631, 1092365, 1105503, 1120324, 1135853, 1151140, 1166980, 1184823, 1203903, 1220937]
59201A220937J2387Q322O598N799L740L74k422l523l994n321o828o190k849N16
59187A227546J137k86q24O93K773L913M029L290J736N06J279L769N496M921L151
59172A263129J742O44o38j568j762k171l592n119n648n916p352r591j0796j0278
59158A201084r247q960r358r660r458q899q358q055p810p240o334n474m761l803
59144A093667k464j274o81m10o2J95P0k1P10K260L496L327K105J481K539M252
59128A109190M505K804R86P97J784K536K937L717M512M147K749J799J888J935
59114A146286J080mk91Q5J80n16j543j862q55P06J129q4j295q46O36J339R67O77
59096A145789Q52P01k38j907m677q590j1851j2322j0521r036q921q811p827o946
$$ y = [1220937, 1233324, 1241646, 1248244, 1254043, 1257783, 1258157, 1255735, 1252212, 1248218, 1242897, 1236069, 1229879, 1227030, 1227546, 1228683, 1228397, 1227573, 1228266, 1231039, 1234952, 1238981, 1242271, 1244007, 1244513, 1245792, 1249561, 1255057, 1259978, 1263129, 1264871, 1265515, 1264877, 1263309, 1261547, 1259376, 1255784, 1250665, 1245017, 1239101, 1231749, 1222158, 1211362, 1201084, 1191837, 1182877, 1173519, 1163859, 1154401, 1145502, 1137144, 1129089, 1121279, 1114039, 1107705, 1102231, 1097470, 1093667, 1091203, 1089929, 1089248, 1088838, 1088776, 1088971, 1089041, 1089020, 1089730, 1091990, 1095486, 1098813, 1100918, 1102399, 1104938, 1109190, 1113695, 1116499, 1117485, 1118282, 1120066, 1122602, 1125539, 1129256, 1133768, 1137915, 1140664, 1142463, 1144351, 1146286, 1147366, 1147362, 1147071, 1147156, 1147336, 1146820, 1145277, 1143415, 1142560, 1143266, 1144395, 1144311, 1143016, 1142170, 1142806, 1144145, 1145112, 1145789, 1146641, 1147342, 1147104, 1145197, 1140520, 1131930, 1120079, 1107757, 1097236, 1088200, 1079279, 1070468, 1062641, 1055695]
59082A055695o947p311p794q823r700q762o265m730n340o215n499l813k265l99
59068I71832K008L279K210M53M17K057L786N280P257R366J0490J0558J0315R892
59054A049200R154Q815R535J0467J0328R471R392J0475J1615J1836J1091R645
59042A171024P877O450N736N116L562P48k782n867o906m934j251J128O69r36j242
59027A178392j15P42L46q95k399l852m892n424n950o780p464p696p983q608q839
59012A108583q171p482p818q740q953p950o163m183k756k665l538l716k452j339
58998A032657k259m610o001n133k798n79K75o82k491l068j374J134K380K391K805
58983A012647M012M448K959O24m01P18K642L316K191Q33R87K427L576L915M411
$$ y = [1055695, 1048748, 1041437, 1033643, 1024820, 1015120, 1006358, 1000093, 995363, 990023, 983808, 978309, 974496, 972231, 971832, 973840, 977119, 979329, 979782, 980199, 982256, 986042, 991322, 998579, 1007945, 1018435, 1028993, 1039308, 1049200, 1058354, 1067169, 1076704, 1087171, 1097499, 1106970, 1116362, 1126837, 1138452, 1150288, 1161379, 1171024, 1178901, 1185351, 1191087, 1196203, 1199765, 1200513, 1197731, 1191864, 1184958, 1180024, 1178773, 1179901, 1180570, 1179634, 1178392, 1178277, 1179019, 1179365, 1178470, 1176071, 1172219, 1167327, 1161903, 1155953, 1149173, 1141709, 1134013, 1126030, 1117422, 1108583, 1100412, 1092930, 1085112, 1076372, 1067419, 1059469, 1053306, 1049123, 1046367, 1043702, 1040164, 1036448, 1033996, 1032657, 1030398, 1025788, 1019787, 1014654, 1011856, 1011277, 1011552, 1010870, 1008379, 1005311, 1003937, 1005071, 1007451, 1009842, 1012647, 1016659, 1021107, 1024066, 1024690, 1024289, 1025007, 1027649, 1030965, 1033156, 1033989, 1034976, 1037403, 1040979, 1044894, 1049305]
58968A049305N495O379O831P921J0011J1702J1947J1782J2574J3933J4729J5018
58956A177627J5384J5459J4650J3501J2752J1796R556O329L319R59j049k524k967
58943A274792k481j492o8J636K964L775M958O991Q922R776R940R973R302P475
58929A346463N569M882N170N637O522Q110R247Q738P397O934P475P955Q309R458
58915A447866J1603J4089J6459J8218J8358J6781J5385J6014J7979J9276J9463
58904A631491J9428J9146J7836J5859J4417J3621J2758J2013J1956J1757J0008
58893A790290O999M152J597j554m828o684p140p681q412p740n377l329l139m108
58879A743046n004n788o766p630q132q549q893q942r364j1198j3697j4390j2147
$$ y = [1049305, 1054800, 1061179, 1068010, 1075931, 1085942, 1097644, 1109591, 1121373, 1133947, 1147880, 1162609, 1177627, 1193011, 1208470, 1223120, 1236621, 1249373, 1261169, 1270725, 1277054, 1280373, 1281332, 1280283, 1277759, 1274792, 1272311, 1270819, 1270751, 1272387, 1275351, 1279126, 1284084, 1291075, 1299997, 1309773, 1319713, 1329686, 1338988, 1346463, 1352032, 1356914, 1362084, 1367721, 1374243, 1382353, 1391600, 1400338, 1407735, 1414669, 1422144, 1430099, 1438408, 1447866, 1459469, 1473558, 1490017, 1508235, 1526593, 1543374, 1558759, 1574773, 1592752, 1612028, 1631491, 1650919, 1670065, 1687901, 1703760, 1718177, 1731798, 1744556, 1756569, 1768525, 1780282, 1790290, 1797289, 1801441, 1803038, 1801484, 1796656, 1789972, 1782832, 1775151, 1766739, 1758999, 1753622, 1750293, 1747154, 1743046, 1738042, 1732254, 1725488, 1717858, 1709726, 1701177, 1692284, 1683342, 1673978, 1662780, 1649083, 1634693, 1622546]
58866A622546q928p532q668j0921j2525j2310r921o196k939j503j715k473l057
58853A533858l463l709l211j142K304N357O381O233P628J1516J5496J6956J6431
58840A610635J6194J6698J6541J5379J4522J4608J4544J3348J1526J0136R568
58829A763699R622R953J0140R889R184P920N905L751K814L383L731K047j331m791
58815A835916p632j0135j2215j3529j4376j5214j5840j6147j6782j7794j7747
58804A678505j5830j3785j3813j5361j5943j4627j2843j2247j3425j6083j8850
58793A515698j9626j7863j5630j4838j4576j3302j1991j2418j3502j2766j0721
58782A358465j0287j1931j2895j1802j0643j1193j2228j1706r615p376o050n906
$$ y = [1622546, 1613618, 1606086, 1597418, 1586497, 1573972, 1561662, 1551741, 1545545, 1542606, 1541103, 1539388, 1536915, 1533858, 1530395, 1526686, 1523475, 1522333, 1524637, 1529994, 1536375, 1542608, 1550236, 1561752, 1577248, 1594204, 1610635, 1626829, 1643527, 1660068, 1675447, 1689969, 1704577, 1719121, 1732469, 1743995, 1754131, 1763699, 1773321, 1783274, 1793414, 1803303, 1812487, 1820407, 1826312, 1830063, 1832877, 1836260, 1839991, 1842038, 1840707, 1835916, 1828284, 1818149, 1805934, 1792405, 1778029, 1762815, 1746975, 1730828, 1714046, 1696252, 1678505, 1662675, 1648890, 1635077, 1619716, 1603773, 1589146, 1576303, 1564056, 1550631, 1534548, 1515698, 1496072, 1478209, 1462579, 1447741, 1433165, 1419863, 1407872, 1395454, 1381952, 1369186, 1358465, 1348178, 1336247, 1323352, 1311550, 1300907, 1289714, 1277486, 1265780, 1256165, 1248789, 1242739, 1236833]
58770A236833o471o543n411m098l986m583m371l378k807k618j776o14l67o26N4
58755A189238J236J137J61O95L026M528L704K052J021r9k052l970n091n945o804
58740A182837p002o630o783p413p147n906n384o252p214p510p854q298p837o821
58726A084786o872p548o237k578K95N16L14J934L789L249R39n22l60L56J091J922
58710A075074K190J067j158l559n469o199n283l818l776n118n600m229k645k011
58696A029466j179N63J576O47o68o34p8k93l54J036K826L319L027L328L712K989
58680A049283J942K165L121L097K391K963N224P458Q363Q239P699O905O223O173
58666A121246O669P230P681P867P309O064N199N413N995O113O240P130Q221Q381
$$ y = [1236833, 1230362, 1223819, 1218408, 1214310, 1210324, 1205741, 1201370, 1197992, 1195185, 1192567, 1190791, 1190177, 1189810, 1189184, 1189238, 1190474, 1191611, 1191772, 1192467, 1195493, 1200021, 1203725, 1205777, 1206798, 1206699, 1204647, 1200677, 1195586, 1189641, 1182837, 1175835, 1169205, 1162422, 1155009, 1147862, 1141956, 1136572, 1130320, 1123106, 1115596, 1107742, 1099444, 1091607, 1084786, 1077914, 1070366, 1064129, 1061551, 1061846, 1062362, 1062676, 1064610, 1068399, 1071648, 1072587, 1072065, 1071705, 1072061, 1073152, 1075074, 1077264, 1078331, 1077173, 1073614, 1068145, 1061946, 1056663, 1052845, 1049069, 1043951, 1038351, 1034122, 1031477, 1029466, 1028287, 1028850, 1030426, 1031073, 1030405, 1029771, 1029693, 1029400, 1029046, 1030082, 1032908, 1036227, 1039254, 1042582, 1046294, 1049283, 1051225, 1053390, 1056511, 1059608, 1061999, 1064962, 1070186, 1077644, 1086007, 1094246, 1101945, 1108850, 1115073, 1121246, 1127915, 1135145, 1142826, 1150693, 1158002, 1164066, 1169265, 1174678, 1180673, 1186786, 1193026, 1200156, 1208377, 1216758]
58652A216758P589O691N973N106M066L220K672K126J069j029m136p212r238j0621
58638A223034j2510j4904j6833j8155j9327j9699j8242j6030j5321j5796j4592
58627A041625j0903p522o611o865o592o605p832q675p495n567m913m879l675j917
58613I51574j659k833l275j925K49K185L677M556M681M697N580P436R474J0715
58599I95132J0255P722M141J356r9j507l772o016o950o467n308m349m443n477
58585I74218n624l505j015j447m561o498n283l192k509k399j653j258j971k193
58571I31110p13Q72P61k28o21p14r34k21J619K378P08j377j624q29n04J95K338
58554I32216M412M664M140M421M504L060J749K781M969N649N029N145N844N292
$$ y = [1216758, 1224347, 1231038, 1237011, 1242117, 1246183, 1249403, 1252075, 1254201, 1255270, 1254241, 1250105, 1242893, 1233655, 1223034, 1210524, 1195620, 1178787, 1160632, 1141305, 1121606, 1103364, 1087334, 1072013, 1056217, 1041625, 1030722, 1023200, 1016589, 1009724, 1003132, 996527, 988695, 980020, 972525, 966958, 962045, 957166, 953491, 951574, 949915, 947082, 943807, 941882, 942131, 944316, 947993, 952549, 957230, 961927, 967507, 974943, 984417, 995132, 1005387, 1013109, 1017250, 1018606, 1018507, 1017000, 1013228, 1007212, 1000262, 993795, 988487, 984138, 979695, 974218, 968594, 965089, 964074, 962627, 958066, 951568, 946285, 943093, 940584, 938185, 936532, 935274, 933303, 931110, 930397, 931269, 932030, 931802, 931181, 930467, 929533, 929312, 930931, 933309, 934017, 932640, 931016, 930187, 929683, 929878, 932216, 936628, 941292, 945432, 949853, 954357, 957417, 959166, 961947, 966916, 972565, 977594, 982739, 988583, 993875]
58540I93875L508K070J172n1j136j108p24j061r34J271M198M993L541K302K530
58525A014446L394M281N398O536P436Q778J0837J2175J1652J0506J0412J0945
58513A116796J1157J1875J3946J5935J6271J6038J6952J8248J8547J9030K1600
58502A296395K5428K8445L0664L2801L3410L1058K7939K7340K8490K7607K3381
58491A612958J7863J2637P597L082lk049l923n059m776m480n908q453j0800j3573
58477A595113j7512k0936k2332k3436k6215k8747k8081k5338k3673k2816k0220
58466A335807j6312j3927j3428j2847j2038j2278j2585j0928q437p938q985q740
58454A197364p056o105n778m240k443l034n087m926k143P6N54J082J787O82j693
$$ y = [993875, 997383, 999453, 1000625, 1000574, 999438, 998330, 997606, 996545, 995611, 996882, 1001080, 1006073, 1009614, 1011916, 1014446, 1017840, 1022121, 1027519, 1034055, 1041491, 1050269, 1061106, 1073281, 1084933, 1095439, 1105851, 1116796, 1127953, 1139828, 1153774, 1169709, 1185980, 1202018, 1218970, 1237218, 1255765, 1274795, 1296395, 1321823, 1350268, 1380932, 1413733, 1447143, 1478201, 1506140, 1533480, 1561970, 1589577, 1612958, 1630821, 1643458, 1651055, 1654137, 1654134, 1652085, 1648162, 1643103, 1638327, 1633847, 1627939, 1619486, 1608686, 1595113, 1577601, 1556665, 1534333, 1510897, 1484682, 1455935, 1427854, 1402516, 1378843, 1356027, 1335807, 1319495, 1305568, 1292140, 1279293, 1267255, 1254977, 1242392, 1231464, 1223027, 1215089, 1206104, 1197364, 1190308, 1184203, 1178425, 1174185, 1171742, 1168708, 1163621, 1158695, 1156552, 1156628, 1157182, 1158264, 1160051, 1160733, 1159040]
58439A159040k199l45R77O18M93J222J090J12N98K801M197L908L821M746N530
58424A186609O254Q248J0727J1684J2082J4670J8761K1010K1244K2226K3713K2560
58412A379788J9144J7498J7925J5718Q954J741k406m855p286q250p057o144o723
58399A418047o380l579m58J274L123O193Q695R291R344R768R359P955P347P377
58385A487356N134j11n159p756r247j0797j1234j0394j0420j1761j1944j0063
58373A393604q338p606n667j909R25J539K163L962M932M503N476Q932J1671J1261
58359A425448R460Q171O327L242Q55K4j439m598p164p664p774q541q399p059o874
58344A394015q251q143n367k859k432j951j01Q98l6k72J641L108K378J722K872
$$ y = [1159040, 1156841, 1156496, 1157473, 1158091, 1158584, 1159806, 1160896, 1161008, 1161606, 1164407, 1168604, 1172512, 1176333, 1181079, 1186609, 1192863, 1201111, 1211838, 1223522, 1235604, 1250274, 1269035, 1290045, 1311289, 1333515, 1357228, 1379788, 1398932, 1416430, 1434355, 1450073, 1459027, 1460768, 1458362, 1453507, 1446221, 1437971, 1430914, 1424770, 1418047, 1411667, 1408088, 1407630, 1408904, 1412027, 1418220, 1426915, 1436206, 1445550, 1455318, 1464677, 1472632, 1479979, 1487356, 1492490, 1492379, 1487220, 1479464, 1470217, 1459420, 1448186, 1437792, 1427372, 1415611, 1403667, 1393604, 1385266, 1377660, 1371993, 1370084, 1371009, 1372548, 1374711, 1378673, 1383605, 1388108, 1393584, 1402516, 1414187, 1425448, 1434908, 1443079, 1449406, 1452648, 1453503, 1453527, 1452088, 1447490, 1440326, 1432662, 1424888, 1416347, 1407948, 1400889, 1394015, 1385764, 1377621, 1372254, 1369395, 1366963, 1365012, 1364911, 1365809, 1365773, 1365501, 1367142, 1370250, 1372628, 1374350, 1377222]
58329A377222L786K908K313L693N315N682O118P416Q074P932R048J1135J1141
58316A461783R158R180J2008J3496J2158J1999J4833J6531J4459J2073J2089J1659
58304A611426Q724O920R175J2296J2783J2576J4207J5708J5118J4696J5869J5508
58292A765006J2088R884J1898J4139J2346Q999Q106Q302O910N864P706J0146J0230
58279A891624R671J0870J2179J1997J2789J6041J8389J7762J7940K1727K5144
58268B066133K4230K2048K2914K4949K4524K2957K2694K1861J8764J6669J8088
58257B305831J9482J7620J5793J7511J9746J8906J7735J9515K1137J9135J7001
58246B509412J9069K2535K2898K2159K4169K7070K7705K8421L2052L5452L5292
$$ y = [1377222, 1381008, 1383916, 1386229, 1389922, 1395237, 1400919, 1407037, 1414453, 1422527, 1430459, 1439507, 1450642, 1461783, 1470941, 1480121, 1492129, 1505625, 1517783, 1529782, 1544615, 1561146, 1575605, 1587678, 1599767, 1611426, 1620150, 1627070, 1636245, 1648541, 1661324, 1673900, 1688107, 1703815, 1718933, 1733629, 1749498, 1765006, 1777094, 1786978, 1798876, 1813015, 1825361, 1834360, 1842466, 1850768, 1857678, 1863542, 1871248, 1881394, 1891624, 1901295, 1912165, 1924344, 1936341, 1949130, 1965171, 1983560, 2001322, 2019262, 2040989, 2066133, 2090363, 2112411, 2135325, 2160274, 2184798, 2207755, 2230449, 2252310, 2271074, 2287743, 2305831, 2325313, 2342933, 2358726, 2376237, 2395983, 2414889, 2432624, 2452139, 2473276, 2492411, 2509412, 2528481, 2551016, 2573914, 2596073, 2620242, 2647312, 2675017, 2703438, 2735490, 2770942, 2806234]
58235B806234L4991L8479M2620M3277M3052M5393M7078M4617M2153M4685M9279
58224C281858N1089N2072N5514N8272N6983N5646N8567O2418O3670O6341P3458
58213C935888P8862P7521P5920Q1582R0214R4301R6512J02828J10134J12850J14621
58202D971233J21175J28803J32055J35242J43937J53186J56990J60944J71896
58193F275461J83933J89046J92837K04434K19685K30154K39925K57009K77037
58184H269521K92623L09709L36712L66823L90022M13015M47016M85023N12848
58175A1823312N34084N61922N94524O21399O46089O78603P13179P38434P62103
58166A7673649Q00564Q51115R00259R51282J016322J089402J156250J223404J308273
$$ y = [2806234, 2841225, 2879704, 2922324, 2965601, 3008653, 3054046, 3101124, 3145741, 3187894, 3232579, 3281858, 3332947, 3385019, 3440533, 3498805, 3555788, 3611434, 3670001, 3732419, 3796089, 3862430, 3935888, 4014750, 4092271, 4168191, 4249773, 4339987, 4434288, 4530800, 4633628, 4743762, 4856612, 4971233, 5092408, 5221211, 5353266, 5488508, 5632445, 5785631, 5942621, 6103565, 6275461, 6459394, 6648440, 6841277, 7045711, 7265396, 7495550, 7735475, 7992484, 8269521, 8562144, 8871853, 9208565, 9575388, 9965410, 10378425, 10825441, 11310464, 11823312, 12357396, 12919318, 13513842, 14135241, 14781330, 15459933, 16173112, 16911546, 17673649, 18474213, 19325328, 20225587, 21176869, 22193191, 23282593, 24438843, 25662247, 26970520]
58157B6970520J408471J511590J626214J770345J937869K110668K294167K504852
58149D2134696K733919K963159L205532L487900L807185M150974M547691N044219
58141G2075275N648688O353470P198948Q248663R516152J0986345J2685837J4642799
58133A47356177J6795831J9042240K1358053K3771086K6280692K8954133L1924111
58126C15482323L4790391L5859170L2545878K3297934R336954n757611j8349547
58119D27205492k6683149l0957169l2214549l1486529k9600614k7180501k4594707
58112B24488274k2010792j9547548j7313194j5331821j3552036j1945229j0527046
58105A14260608r291540q200681p241270o429085n754592n179076m684575m277793
$$ y = [26970520, 28378991, 29890581, 31516795, 33287140, 35225009, 37335677, 39629844, 42134696, 44868615, 47831774, 51037306, 54525206, 58332391, 62483365, 67031056, 72075275, 77723963, 84077433, 91276381, 99525044, 109041196, 120027541, 132713378, 147356177, 164152008, 183194248, 204552301, 228323387, 254604079, 283558212, 315482323, 350272714, 386131884, 418677762, 441975696, 451312650, 445555039, 427205492, 400522343, 369565174, 337350625, 305864096, 276263482, 249082981, 224488274, 202477482, 182929934, 165616740, 150284919, 136732883, 124787654, 114260608, 104969068, 96768387, 89527117, 83098032, 77343440, 72164364, 67479789, 63201996]
58097F3201996l945127l650793l380499l144780k939200k741076k545853k368946
58089C8485722k210437k052708j893804j749771j622777j498448j376458j273440
58081B4807879j192805j119329j046180r81307r25165q67423q08612p61406p27654
58072A6377998o95821o62775o36626o16672n91929n61388n35095n13484m85931
58063A1078277m51946m23666m04471l84377l59850l39567l26630l12619k93823
58054G781328k77224k66087k54622k40804k30287k24118k16102k05205j97427
58045E669452j93122j85750j75196j68974j68000j64683j57317j52791j52350
58036D151269j48346j38561j30694j28567j26195j19717j13559j10424j06080
$$ y = [63201996, 59256869, 55606076, 52225577, 49080797, 46141597, 43400521, 40854668, 38485722, 36275285, 34222577, 32328773, 30579002, 28956225, 27457777, 26081319, 24807879, 23615074, 22495745, 21449565, 20468258, 19543093, 18675670, 17867058, 17105652, 16377998, 15682177, 15019402, 14382776, 13766104, 13174175, 12612787, 12077692, 11564208, 11078277, 10626331, 10202665, 9798194, 9413817, 9053967, 8714400, 8387770, 8075151, 7781328, 7504104, 7238017, 6983395, 6742591, 6512304, 6288186, 6072084, 5866879, 5669452, 5476330, 5290580, 5115384, 4946410, 4778410, 4613727, 4456410, 4303619, 4151269, 4002923, 3864362, 3733668, 3605101, 3478906, 3359189, 3245630, 3135206, 3029126]
58027C029126r8553r2419q9871q6927q2039p9189p9197p7061p1213o6627o5659
58016B140371o4269o0153n6351n4205n0833m5938m3240m3174m1961l9442l9507
58005A601298m1474l9819l4105l0366l0593k9758k5564k2279k2319k2426k1001
57994A281594k0972k2636k1685j7284j4375j5193j5840j4009j2623j3253j3282
57983A100442j2080j2755j5297j5357j2216j0608j2114j2383r556p762r150j0020
57971I61144q375q065j1629j5575j6476j5652j4600j2009q500q046j1279j3314
57959H17624j1405q976r002r424q251p407q120q050o114m990n944o445n503n706
57945G12287p517p378m324k462l794m557j976R94J225K63J14n03k250k508j62
$$ y = [3029126, 2930573, 2838154, 2748283, 2661356, 2579317, 2500128, 2420931, 2343870, 2272657, 2206030, 2140371, 2076102, 2015949, 1959598, 1905393, 1854560, 1808622, 1765382, 1722208, 1680247, 1640805, 1601298, 1559824, 1520005, 1485900, 1455534, 1424941, 1395183, 1369619, 1347340, 1325021, 1302595, 1281594, 1260622, 1237986, 1216301, 1199017, 1184642, 1169449, 1153609, 1139600, 1126977, 1113724, 1100442, 1088362, 1075607, 1060310, 1044953, 1032737, 1022129, 1010015, 997632, 988076, 980314, 971164, 961144, 952769, 944704, 933075, 917500, 901024, 885372, 870772, 858763, 850263, 842217, 830938, 817624, 806219, 797243, 788241, 778817, 770566, 763159, 755039, 746989, 740875, 735885, 729941, 723496, 717993, 712287, 704770, 697392, 693068, 690606, 686812, 682255, 680279, 681273, 682498, 682761, 682875, 682372, 680122, 677614, 677452]
57930F77452J645O79r97j548k315l686l232q54m50l407n839n303m739o377p419
57915F33610n641l874m656n540l967k082k316k742j182L11n27j630m86J174P26
57900F01178p12r57q61j959l157l123k872l062k085L23J321l21j713r41l17j452
57884E79290j693P68K800J417j084j291q8L33J080L719O170N913M266L497K735
57869F07832P03o65M27J689L13k270l220l204m400o193o678o259o157n773m736
57854E61409m799o527p098m766k336k675m103l950l286m081m795l172n67O18J036
57839E10908J960J819o04k517j120J533K088J389J959K870K101J203K540M270
57825E30399L309J065R39K165J608K9Q94M083O147O101N913N890M450K084R58
$$ y = [677452, 679097, 679776, 678779, 677231, 674916, 671230, 667998, 667144, 666694, 663287, 657448, 652145, 647406, 641029, 633610, 627969, 624095, 619439, 613899, 609932, 607850, 605534, 602792, 601610, 601921, 601394, 599764, 599278, 600452, 601178, 600466, 599509, 598648, 596689, 593532, 590409, 587537, 584475, 582390, 582713, 584034, 583713, 582000, 581059, 580742, 579290, 577597, 578365, 581165, 582582, 581498, 580207, 580119, 580452, 581532, 585251, 591421, 597334, 601600, 605097, 607832, 608535, 607870, 608297, 609986, 610299, 608029, 604809, 601605, 597205, 591012, 584334, 578075, 571918, 566145, 561409, 556610, 550083, 542985, 538219, 535883, 533208, 529105, 525155, 521869, 517788, 512993, 509821, 509254, 509872, 510908, 512868, 514687, 514083, 511566, 510446, 511979, 514067, 515456, 517415, 520285, 522386, 523589, 526129, 530399, 533708, 534773, 535712, 537877, 539485, 539514, 540408, 544491, 550638, 556739, 562652, 568542, 572992, 575076, 576034]
57810E76034J010N73J98J621L635L300P64j173j738k300k561r43J587K222P44
57795E82973m94o20o65m43J229L575M676M688M879M341J500j973k889j610j389
57780E97778k976l971l295k356j779p91J21m79j904k017q08m4K61J565L391L791
57764E86487K932K674L056K671K039K805M072L435J334K98J98j574n197p944q815
57749E88471r517j0472r975p856o166n673n340n366o829q210o615k906j059j849
57735E00638j822L78J676K49j156l8J890K201J715K103K530J562J03j28P21J605
57719E14227K606M226O038P224P179N130J109k409k393N94K763K206P65J08p25
57704E48648k379l137j861l43m90j423j432q93j009j343o55R65K513L644M412
$$ y = [576034, 577044, 577617, 577815, 579436, 583071, 586371, 587135, 585962, 584224, 581924, 579363, 578420, 580007, 582229, 582973, 582479, 581859, 581194, 580751, 581980, 585555, 590231, 594919, 599798, 604139, 605639, 603666, 600777, 599167, 597778, 594802, 590831, 587536, 585180, 583401, 582610, 582731, 582252, 580348, 578331, 577523, 577479, 577740, 579305, 582696, 586487, 589419, 592093, 595149, 597820, 599859, 602664, 606736, 610171, 611505, 611803, 612001, 610427, 605230, 597286, 588471, 578954, 568482, 558507, 550651, 544485, 538812, 533472, 528106, 521277, 513067, 506452, 503546, 502487, 500638, 498816, 499194, 500870, 501119, 499963, 499925, 501815, 504016, 505731, 507834, 510364, 511926, 512029, 511901, 512622, 514227, 516833, 521059, 527097, 534321, 541500, 546630, 547739, 545330, 542937, 543531, 546294, 548500, 549265, 549373, 548648, 546269, 543132, 541271, 540928, 540438, 539015, 537583, 536690, 535681, 534338, 533683, 534648, 537161, 540805, 545217]
57689E45217M447L583K544K119K448L392M620N102M014K253J559K000K043J098
57675E86439R5n39j288j764q35J071J994J301L36q5n87j263j197m78l11o78l30
57658E81881M56j56k134k919j210J205K313K114J099p21k237j592N62J013j261
57643E78413l114j738J467L608M390N175N879N348L654K003J194J428K531L369
57629F13607K497J91j598k093k491l285l168j681n18o67o06J024L197M719O508
57614F15636R593J2863J5046J7268K1283K6492L0976L4303L7083L8339L5478K6843
57602I21203J3282k287j6128k5458l0054l1562l1105k8833k5812k4042k3775k2927
57590F72502k0248j7015j4534j2120r029o283m864l965k671j649j571j571q66
$$ y = [545217, 549664, 553247, 555791, 557910, 560358, 563750, 568370, 573472, 577486, 579739, 581298, 583298, 585341, 586439, 586534, 585995, 584707, 582943, 582108, 583179, 585173, 586474, 586810, 586725, 586138, 584875, 583678, 583200, 582889, 582211, 581881, 582337, 582181, 580047, 577128, 575918, 577123, 579436, 581550, 582649, 581928, 579691, 578099, 578661, 579674, 578413, 575299, 573561, 575028, 578636, 583026, 588201, 594080, 599428, 603082, 605085, 606279, 607707, 610238, 613607, 616104, 616295, 614697, 612604, 610113, 606828, 603660, 601979, 601461, 600794, 600188, 601212, 604409, 609128, 615636, 625229, 638092, 653138, 670406, 691689, 718181, 749157, 783460, 820543, 858882, 894360, 921203, 934485, 932198, 916070, 890612, 860558, 828996, 797891, 769058, 743246, 719204, 695429, 672502, 652254, 635239, 620705, 608585, 599556, 593273, 588409, 584444, 581773, 580124, 578553, 576982, 576116]
57577E76116j77n9L47J337J420j40j545j279p37j842l755m351l579k919k743k505
57561E53589k450k944l042j876m84l43j001j144r45j290j668j020J12L98L1J87
57545E36110P92P20j30p80p49l44J80N15J74l92K57K288L590K615P68J96O33N83
57527E47026K00O74J650J692P41l1l30p59j262j353j300j478j288l57K61j61k81
57510E43644J163K716K117Pr60K4J385K089K526K744K222J382J221J551J490J254
57494E66575J573J940J688J933L845N625M347O85j504o09R09R34P66K269M606
57479E95582N704N192M125L105K142J455J094N73k32n19L89K027L357L751L134
57464F30879J878Q67R93K274L984N563O796P313O824N780M981M570M188L808L669
$$ y = [576116, 575939, 575880, 576227, 577564, 578984, 578844, 577299, 576020, 575283, 573441, 569686, 565335, 561756, 558837, 556094, 553589, 551139, 548195, 545153, 543277, 542793, 542450, 541449, 540305, 539360, 538070, 536402, 535382, 535494, 535892, 535923, 536110, 536902, 537622, 537492, 536712, 535963, 535619, 535799, 536314, 536488, 536096, 536353, 538641, 542231, 544846, 545614, 545810, 546443, 547026, 547226, 547900, 549550, 551242, 551983, 551952, 551622, 550863, 549601, 548248, 546948, 545470, 544182, 543825, 544086, 543925, 543644, 544807, 547523, 549640, 549647, 548687, 548711, 550096, 552185, 554711, 557455, 559677, 561059, 562280, 563831, 565321, 566575, 568148, 570088, 571776, 573709, 577554, 583179, 587526, 588211, 586707, 586098, 587007, 587941, 588707, 590976, 595582, 601286, 606478, 610603, 613708, 615850, 617305, 618399, 618972, 618740, 618221, 618610, 620637, 623994, 627745, 630879, 632757, 633624, 634617, 636891, 640875, 646438, 653234, 660547, 667371, 673151, 678132, 682702, 686890, 690698, 694367]
57449F94367L667L586L613L725L225J825O66J062K647L911M061L298J884J92q65
57434G30864p84l63n26q56n70m0M3L35J946M456O333O796O012M293K614K728M960
57417G68241O929O473M742M119M376L613K175K238L988N339N515N797O456N998
57403H35999M070K303J640J464J822L616N939O198M007K148K453L509L857M541
57389H83566O603Q478Q209O449N253N268N897O785P512P135N689M897N852P191
57375I74784P105O030N773O899Q403R234Q893P375N650N300O638Q069Q255P763
57361A076171P632P509O651N665N805P157Q751R938J0581J0590J0154R766R179
57348A185549P271L987J475K005N185Q388R559Q867P936Q098R159R588Q399O709
$$ y = [694367, 698034, 701620, 705233, 708958, 712183, 714008, 714674, 715736, 718383, 722294, 726355, 729653, 731537, 731729, 730864, 730080, 729717, 729191, 728335, 727765, 727725, 727768, 728103, 730049, 734505, 740838, 747634, 753646, 757939, 760553, 763281, 768241, 775170, 781643, 786385, 790504, 794880, 798493, 800668, 802906, 806894, 812233, 817748, 823545, 830001, 835999, 840069, 842372, 844012, 845476, 847298, 850914, 856853, 863051, 867058, 869206, 871659, 875168, 879025, 883566, 890169, 898647, 906856, 913305, 918558, 923826, 929723, 936508, 944020, 951155, 956844, 961741, 967593, 974784, 981889, 987919, 993692, 1000591, 1008994, 1018228, 1027121, 1034496, 1040146, 1045446, 1052084, 1060153, 1068408, 1076171, 1083803, 1091312, 1097963, 1103628, 1109433, 1116590, 1125341, 1135279, 1145860, 1156450, 1166604, 1176370, 1185549, 1192820, 1196807, 1198282, 1200287, 1205472, 1213860, 1223419, 1232286, 1240222, 1248320, 1257479, 1267067, 1275466, 1282175]
57334A282175O443P580Q240P670P285Q063Q975R119R497J1089J2837J3375J3348
57321A405696J4025J4747J3989J2124J0875J0443R487P968P571Q869J0059R545
57309A535398Q239Q092R294J0269J0056R472R730J0819J1780J2137J2282J2542
57297A660110J2664J2534J2623J3104J3334J2961J2817J3645J4620J4550J3950
57286A806912J4277J5416J5848J5241J4907J5383J5543J4710J3813J3628J3622
57275A969300J3318J3221J3492J3333J2639J2607J3785J5056J5523J5781J6263
57264B124318J6102J5004J4396J5221J6170J5837J5186J5925J7736J8982J9167
57253B304044J8851J8073J6791J6121J7234J9492K1252K1860K1498K0042J7875
$$ y = [1282175, 1288618, 1296198, 1304438, 1312108, 1319393, 1327456, 1336431, 1345550, 1355047, 1366136, 1378973, 1392348, 1405696, 1419721, 1434468, 1448457, 1460581, 1471456, 1481899, 1491386, 1499354, 1506925, 1515794, 1525853, 1535398, 1543637, 1551729, 1561023, 1571292, 1581348, 1590820, 1600550, 1611369, 1623149, 1635286, 1647568, 1660110, 1672774, 1685308, 1697931, 1711035, 1724369, 1737330, 1750147, 1763792, 1778412, 1792962, 1806912, 1821189, 1836605, 1852453, 1867694, 1882601, 1897984, 1913527, 1928237, 1942050, 1955678, 1969300, 1982618, 1995839, 2009331, 2022664, 2035303, 2047910, 2061695, 2076751, 2092274, 2108055, 2124318, 2140420, 2155424, 2169820, 2185041, 2201211, 2217048, 2232234, 2248159, 2265895, 2284877, 2304044, 2322895, 2340968, 2357759, 2373880, 2391114, 2410606, 2431858, 2453718, 2475216, 2495258, 2513133]
57242B513133J6919J8739K2044K3953K3609K2717K2724K3243K3344K2888K2283
57231B755596K1981K2230K2649K2360K1276K0635K1247K2150K2088K1463K1450
57220B995125K2082K2691K3385K4476K5257K5145K5294K7151K9958L1586L1507
57209C283657L1066L1226L1783L2419L2695L1568K8987K7344K8852L1849L2421
57198C623867K9787K7162K6695K6556K4478K1645K0993K3176K6083K7546K7024
57187C905012K5297K3697K3321K4091K4852K4844K4568K4752K5063K4443K2485
57176D172425K0065J8665J8966K0075K0490K0027K0020K1155K2241K2168K1872
57165D398169K2839K4547K5459K5972K8056L1882L5001L5591L4727L4646L6058
$$ y = [2513133, 2530052, 2548791, 2570835, 2594788, 2618397, 2641114, 2663838, 2687081, 2710425, 2733313, 2755596, 2777577, 2799807, 2822456, 2844816, 2866092, 2886727, 2907974, 2930124, 2952212, 2973675, 2995125, 3017207, 3039898, 3063283, 3087759, 3113016, 3138161, 3163455, 3190606, 3220564, 3252150, 3283657, 3314723, 3345949, 3377732, 3410151, 3442846, 3474414, 3503401, 3530745, 3559597, 3591446, 3623867, 3653654, 3680816, 3707511, 3734067, 3758545, 3780190, 3801183, 3824359, 3850442, 3877988, 3905012, 3930309, 3954006, 3977327, 4001418, 4026270, 4051114, 4075682, 4100434, 4125497, 4149940, 4172425, 4192490, 4211155, 4230121, 4250196, 4270686, 4290713, 4310733, 4331888, 4354129, 4376297, 4398169, 4421008, 4445555, 4471014, 4496986, 4525042, 4556924, 4591925, 4627516, 4662243, 4696889, 4732947]
57154D732947L8001L9354L9772L9726L9864M0026L9222L7231L5553L5507L6204
57143E153407L5936L4939L4840L5774L6211L5532L4598L3706L2156L0180K8993
57132E526272K8530K7380K5564K5105K6822K8794K9200K8830K9418L1049L2638
57121E839602L3619L3889L3177L1589L0039K9300K9356L0023L1117L1833L1278
57110F184822K9979K9376K9748L0191L0668L1889L2863L0987K5521J8854J3347
57099F488245Q917M724J072j551l387m145k645J084N210Q523J1636J4830J7047
57086F549560J8136J9778K2865K6272K9463L3715L9313M4305M7801N1583N6383
57075F939174N9465N8472N4903N1102M6394L9251L0870K3352J6368Q709J210m803
$$ y = [4732947, 4770948, 4810302, 4850074, 4889800, 4929664, 4969690, 5008912, 5046143, 5081696, 5117203, 5153407, 5189343, 5224282, 5259122, 5294896, 5331107, 5366639, 5401237, 5434943, 5467099, 5497279, 5526272, 5554802, 5582182, 5607746, 5632851, 5659673, 5688467, 5717667, 5746497, 5775915, 5806964, 5839602, 5873221, 5907110, 5940287, 5971876, 6001915, 6031215, 6060571, 6090594, 6121711, 6153544, 6184822, 6214801, 6244177, 6273925, 6304116, 6334784, 6366673, 6399536, 6430523, 6456044, 6474898, 6488245, 6497162, 6501886, 6502958, 6501407, 6498020, 6493875, 6491230, 6492314, 6497524, 6506047, 6517683, 6532513, 6549560, 6567696, 6587474, 6610339, 6636611, 6666074, 6699789, 6739102, 6783407, 6831208, 6882791, 6939174, 6998639, 7057111, 7112014, 7163116, 7209510, 7248761, 7279631, 7302983, 7319351, 7328060, 7329270, 7324467]
57063G324467r921j4452j6112j3224q177m319j507J763M231L885K176K153M082
57050G275045O600J0396J6897K5488L5776N0289P1411R8928J34678J85679K57814
57039H169001L50806M64760O05811P77912R74052J182777J396551J605155J789588
57030A7316413J934213K037020K100215K132122K174711K282268K396896K252874
57022C4626732J520330J45779j465315k681375l091989k729172j908009r45553
57014B3471428m3881O67503J095879J209198J046926O85248K03616l20538q14544
57005B7200835j223983j517240j676953j699148j602147j423349j200964r63283
56997A5893768p32975n29275l61594k28579j27078n6515j3454J0383K1278K0187
$$ y = [7324467, 7314546, 7300094, 7283982, 7270758, 7262581, 7258262, 7256755, 7258518, 7262749, 7266634, 7268810, 7270963, 7275045, 7281645, 7292041, 7308938, 7334426, 7370202, 7420491, 7491902, 7590830, 7725508, 7911187, 8169001, 8519807, 8984567, 9590378, 10368290, 11342342, 12525119, 13921670, 15526825, 17316413, 19250626, 21287646, 23387861, 25519983, 27694694, 29976962, 32373858, 34626732, 36147062, 36292841, 34827526, 32146151, 29054162, 26324990, 24416981, 23471428, 23427547, 24095050, 25190929, 26400127, 27447053, 28132301, 28335917, 28015379, 27200835, 25976852, 24459612, 22782659, 21083511, 19481364, 18058015, 16857051, 15893768, 15160793, 14631518, 14269924, 14041345, 13914267, 13857752, 13844298, 13854681, 13875959, 13896146]
56987A3896146Q675p174k1706l3928m4185n0689n2107n0197m7282m3620l8811
56976A3515122l3181k6369j7227n877P057K3578M5980O9127P8841O1745J6180
56965A3734976m7018j11952j65124j99782k17086k22816k21669k15190k04638
56956A2129701j92790j81687j71134j60862j52044j45305j39407j33495j28827
56947A0724150j26813j27092j28858j32318j37337j42386j46337j49889j54010
56938I479110j58386j62586j67184j72504j77875j83226j89765j97800k05475
56929G864309k10976k14286k15625k14183k10093k05837k03692k03180k02938
56920E983499k03738k07444k13892k20835k26438k30223k32206k32606k31889
$$ y = [13896146, 13904821, 13897647, 13875941, 13842013, 13797828, 13747139, 13695032, 13644835, 13597553, 13553933, 13515122, 13481941, 13455572, 13438345, 13432468, 13439525, 13463103, 13509083, 13578210, 13657051, 13718796, 13734976, 13687958, 13576006, 13410882, 13211100, 12994014, 12771198, 12549529, 12334339, 12129701, 11936911, 11755224, 11584090, 11423228, 11271184, 11125879, 10986472, 10852977, 10724150, 10597337, 10470245, 10341387, 10209069, 10071732, 9929346, 9783009, 9633120, 9479110, 9320724, 9158138, 8990954, 8818450, 8640575, 8457349, 8267584, 8069784, 7864309, 7653333, 7439047, 7223422, 7009239, 6799146, 6593309, 6389617, 6186437, 5983499, 5779761, 5572317, 5358425, 5137590, 4911152, 4680929, 4448723, 4216117, 3984228]
56911C984228k29819k25078k16975k06668j95659j84083j71635j59040j47202
56902B248069j35824j24301j12861j01577q9533p6736o5802n9698n8476n9808
56892A363453o1898o4009o5009o3791o0953n8071n5266n1251m5788m0354l6080
56881G60983l2555k9033k5535k2256j8772j4455r257l915N39L705O305Q994J0571
56868F35319Q571K229o271j4204k0627k5500k8300k9032k9117k9402k8475k4891
56856D10300k0076j6931j6283j6694j6967j6704j5038j1411p499n912o708p270
56844B52807n959l898k701k296j762q77o1L51L25L39J161K557K870J230m61L94
56828B44019L444N856O200N717N522M907L074N06k271n512q834j0524r446o613
$$ y = [3984228, 3754409, 3529331, 3312356, 3105688, 2910029, 2725946, 2554311, 2395271, 2248069, 2112245, 1987944, 1875083, 1773506, 1683973, 1607237, 1541435, 1481737, 1423261, 1363453, 1301555, 1237546, 1172537, 1108746, 1047793, 989722, 934456, 883205, 837417, 797063, 760983, 728428, 699395, 673860, 651604, 632832, 618377, 609120, 605205, 605744, 609449, 615754, 624748, 635319, 643890, 646119, 639848, 625644, 605017, 579517, 551217, 522185, 493068, 463666, 435191, 410300, 390224, 373293, 357010, 340316, 323349, 306645, 291607, 280196, 272697, 266785, 260077, 252807, 246848, 242950, 240249, 237953, 236191, 235314, 235253, 235604, 235929, 236268, 237429, 239986, 242856, 244086, 243625, 244019, 247463, 253319, 259519, 265236, 270758, 275665, 278739, 279245, 276974, 271462, 262628, 252104, 242658, 236045]
56814B36045l992k591k202k012q60K035O081R912J3234J6938K1180K4847K7390
56801C46005K9854L3218L6764L8655L7167L1090K0279O701o221j6004k2214k4997
56789E10297k4207k0701j6829j4147j1590p293j378M408R298J4201J9897K5942
56777D87898L1755L7769M4676N1809N6935N7788N3439M3979K9611J1159q529k5137
56765H73152l5877m1291m3455m3365m1040l7102l2551k7426k1242j4492q297k781
56753E24233K854Q690J3900J8052K1426K4151K6229K7867K8361K5290J6702M047
56741G41802q835j9432k7570l3292l6248l7200l7496l6537l2260k4990j8360j5067
56729D14515j3681j1000o011k76M257O713P658Q798J1165J3301J2658Q956M227
$$ y = [236045, 232053, 229462, 227260, 225248, 224388, 226423, 232504, 242416, 255650, 272588, 293768, 318615, 346005, 375859, 409077, 445841, 484496, 521663, 552753, 573032, 579733, 573512, 557508, 535294, 510297, 486090, 465389, 448560, 434413, 422823, 415530, 414152, 418560, 427858, 442059, 461956, 487898, 519653, 557422, 602098, 653907, 710842, 768630, 822069, 866048, 895659, 906818, 898289, 873152, 837275, 795984, 752529, 709164, 668124, 631022, 598471, 571045, 549803, 535311, 527014, 524233, 527087, 535777, 549677, 567729, 589155, 613306, 639535, 667402, 695763, 721053, 737755, 741802, 732967, 713535, 685965, 652673, 616425, 579225, 541729, 505192, 472932, 447942, 429582, 414515, 400834, 389834, 383823, 383547, 387804, 394517, 402175, 410973, 422138, 435439, 448097, 457053, 461280]
56716D61280n66o420j3196j8554k1314k3188k5419k6259k4057k0632j8897j8695
56704B44083j7685j5166j2522j0655r405q945r632j0656j0621r240p135m700k496
56691A15225j798k946m054l301j728j789l643n064m695l308j913o73R2k88j558
56676G8559k546k731k633k437j680n07j4q08k172k941k576j359k24k69j556k664
56660E1442k286j046o47j423j967j268%P14Q19J086J828K382J738l11k583l411
56644D5067k356o20N21J058J619K250K646K967L550M097L947K966J624M88J00
56629F9924Q47K412L713L966L397K650K050J750J875K073J716R84P94J311J602
56614A01064J268J078J160J28k743n646o061l694l94K019K648J272j163k500j444
$$ y = [461280, 460714, 454294, 441098, 422544, 401230, 378042, 352623, 326364, 302307, 281675, 262778, 244083, 226398, 211232, 198710, 188055, 178650, 169705, 160073, 149417, 138796, 129556, 122421, 117721, 115225, 113427, 110481, 106427, 103126, 101398, 99609, 95966, 90902, 86207, 82899, 80986, 80313, 80405, 80117, 78559, 76013, 73282, 70649, 68212, 66532, 66025, 66011, 65203, 63031, 60090, 57514, 56155, 55931, 55662, 54106, 51442, 49156, 48110, 47463, 46040, 44073, 42805, 42805, 43519, 44338, 45424, 47252, 49634, 51372, 51061, 48478, 45067, 42711, 42091, 42612, 43670, 45289, 47539, 50185, 53152, 56702, 60799, 64746, 67712, 69336, 69824, 69924, 70771, 73183, 76896, 80862, 84259, 86909, 88959, 90709, 92584, 94657, 96373, 97357, 98151, 99462, 101064, 102332, 103410, 104570, 104698, 101955, 96309, 90248, 86554, 86160, 88179, 90827, 92099, 90936, 88436, 86992]
56599H6992O59J425M75m79k00P32J210R18L26J32P58J833K341J631O8j439j982
56582I5400q37J706L694L192J044J96J608K908K148P51J013K576L485L178K294
56567A24356Q59j056j949n91J641K311J242K67L23P99J190J382Q15p22j999j806
56551A27062r43q85j288p98N04J561K419L494L643J596j197j903k83J269J500
56536A35751J389J494J097K81K08P60L35j410k918l298l339l352k345j25J867
56521A26395K800L531M633N128M193K572J430J060J325K082K672K309J335Q34
56507A62299R80J152J600L132N164O037N529N218O013P111P649P593O716M610
56493B30803K010K59p06j927k986k255J00J721J204m88k223l948n229m950l373
$$ y = [86992, 87651, 89076, 89551, 89072, 88872, 89604, 90814, 91732, 92058, 92190, 92948, 94781, 97122, 98753, 98821, 97382, 95400, 94563, 96269, 99963, 103155, 104199, 104395, 106003, 108911, 111059, 111810, 112823, 115399, 118884, 122062, 124356, 125215, 124159, 122210, 121619, 123260, 125571, 126813, 127080, 127403, 128202, 129392, 130774, 131589, 130867, 128868, 127062, 126119, 125234, 123946, 123148, 123652, 125213, 127632, 131126, 134769, 136365, 135168, 133265, 132982, 134251, 135751, 137140, 138634, 139731, 140012, 140220, 140980, 141315, 139905, 136987, 133689, 130350, 126998, 124653, 124528, 126395, 129195, 132726, 137359, 142487, 146680, 149252, 150682, 151742, 153067, 155149, 157821, 160130, 161465, 162299, 163279, 164431, 166031, 169163, 174327, 180364, 185893, 191111, 197124, 204235, 211884, 219477, 226193, 230803, 232813, 233072, 232366, 230439, 227453, 225198, 225298, 227019, 228223, 227735, 225512, 221564, 216335, 211385, 208012]
56478B08012k243k085j579l58O5q34j311k31J071J261J197K049L173L460L211
56463B14858L091K775J940J176P38r2j351j790j113q97j936k483r09J528K363
56448B17898J194m86j675k557l408m087m126k809j00K241J987n48k543k304j058
56433A97619k66N57K027K970K218P72L10O96N88l47j238j289l35J037J427o9k010
56416B04667j862L56J721N89j140j158J29J321K570M324N284L973J246p74j306
56401B19940r28o5R56J349Q06M4n96j726l109l126j306M86R16J254K777M155L733
56384B25560K549K541L143K428O25k04M72J056L81j065k158j934J00K917M007
56369B40418K052j113k707k264j207k07J145K733L870M373M320L365J656O33J399
$$ y = [208012, 205769, 203684, 202105, 201747, 201812, 200978, 199667, 199436, 200507, 201768, 202965, 205014, 208187, 211647, 214858, 217949, 220724, 222664, 223840, 224578, 224486, 223135, 221345, 220232, 219335, 217399, 214916, 214007, 215535, 217898, 219092, 218606, 216931, 214374, 210966, 206879, 202753, 199944, 199844, 202085, 204072, 203524, 200981, 198677, 197619, 197353, 197910, 199937, 202907, 205125, 205897, 206207, 206903, 207491, 207144, 205906, 204617, 204282, 205319, 206746, 206677, 204667, 202805, 203161, 204882, 205471, 204331, 203173, 203302, 204623, 207193, 211517, 216801, 220774, 222020, 221246, 219940, 219012, 218947, 219903, 221252, 222058, 222102, 221506, 219780, 216671, 213545, 212239, 212725, 213641, 214895, 217672, 221827, 225560, 228109, 230650, 233793, 236221, 236846, 236642, 237114, 238170, 238551, 237486, 235328, 233394, 233494, 236411, 240418, 242470, 241357, 238650, 236386, 235179, 234972, 236117, 238850, 242720, 247093, 251413, 254778, 256434, 257067, 258466]
56354B58466L025L751L056J386r72l344m174k761m95R91J823K712L153K511J487
56339B70615P64m75k747m294l135o3K470L547L867L668K756J826J670J717J124
56324B83310M30L98K05j108k456k091l53J078J955L207M622M957M070K970K101
56309C03295J301R11J329J994K353K896L828L866K138Qq55j018j763k423j625
56294C16235n4O62Q51K035L836M308K936J082j19l53P22K839M369M192L473L612
56278C50626L766K723J845L282O219P919P820P687Q097P821O468N165M575M444
56264D28457M760N234M362J329j914k922k183j733j447K24K682L717L137K746
56250D46449K982K704K089K696M540N971O397O552O340N164M026M510O083P026
$$ y = [258466, 261491, 265242, 268298, 269684, 268712, 265368, 261194, 258433, 257938, 258929, 260752, 263464, 266617, 269128, 270615, 271379, 270904, 268157, 263863, 260728, 260665, 263135, 266682, 270549, 274217, 276973, 278799, 280469, 282186, 283310, 283740, 284138, 284343, 283235, 280779, 278688, 278335, 279413, 281368, 284575, 289197, 294154, 298224, 301194, 303295, 304596, 305507, 306836, 308830, 311183, 314079, 317907, 321773, 323911, 323919, 323064, 322046, 320283, 317860, 316235, 316181, 316843, 317694, 319729, 323565, 327873, 330809, 331891, 331772, 331419, 332141, 334980, 339349, 343541, 347014, 350626, 354392, 357115, 358960, 362242, 368461, 376380, 384200, 391887, 399984, 407805, 414273, 419438, 424013, 428457, 433217, 438451, 442813, 444142, 442228, 439306, 437123, 435390, 433943, 434167, 436849, 440566, 443703, 446449, 449431, 452135, 454224, 456920, 461460, 467431, 473828, 480380, 486720, 491884, 495910, 500420, 506503, 513529]
56236E13529P430Q414R251Q562P499Q179R611R007O576N066M951M451M136O725
56222F13387J1864J5649J6441J6753J8272J9271J8575J8045J9176K0697K1450
56211H09580K2442K4342K5898K6487K7401K9115L0141L0030L0743L3570L7416
56200A127165M1339M6040N1527N6262O0028O4821P1460P8089Q3510Q9284R6959
56189A866484J05848J14958J24496J33926J41140J45234J47782J49970J50727
56180C080565J48938J44986J38758J28601J13761R5707P5905N4440L1798R519
56170D022978j1959l3611n5067p4076q9524j02299j12436j18612j21428j23784
56160C180182j26522j26991j23588j18563j14419j10639j06055j01549r7927r3594
$$ y = [513529, 520959, 529373, 538624, 547186, 554685, 562864, 572475, 581482, 588058, 593124, 598075, 602526, 606662, 613387, 625251, 640900, 657341, 674094, 692366, 711637, 730212, 748257, 767433, 788130, 809580, 832022, 856364, 882262, 908749, 936150, 965265, 995406, 1025436, 1056179, 1089749, 1127165, 1168504, 1214544, 1266071, 1322333, 1382361, 1447182, 1518642, 1596731, 1680241, 1769525, 1866484, 1972332, 2087290, 2211786, 2345712, 2486852, 2632086, 2779868, 2929838, 3080565, 3229503, 3374489, 3513247, 3641848, 3755609, 3851316, 3927221, 3981661, 4013459, 4022978, 4011019, 3977408, 3922341, 3848265, 3758741, 3656442, 3544006, 3425394, 3303966, 3180182, 3053660, 2926669, 2803081, 2684518, 2570099, 2459460, 2353405, 2251856, 2153929, 2060335]
56150B060335q6892p9013p2458o7947o4446o0877n6742n2303m8695m6364m3626
56139A380972l8979l4307l2589l2722l0590k5559k1586k0980k1337k0102j7927
56128A084294j5856j3192j0116q625q923q557o843o199p271p053m122j426j125
56115I84986r05J464L896L789K510K683L993M939N829P000P060N857O165R339
56101A048605J2439J2817J2448J4304J7399J9040J9426K0449K2210K4007K6668
56090A249812L0816L4978L8144M1836M7135N2452N7030O3600P4250Q6480R6552
56079A873085J04162J10342J13416J10849J03148R2614Q0267O7031N5790M8945
56069B759649M5498M3082M0868L8200L3011K4483J5101P581J887k963p224j2652
$$ y = [2060335, 1973443, 1894430, 1821972, 1754025, 1689579, 1628702, 1571960, 1519657, 1470962, 1424598, 1380972, 1341993, 1307686, 1275097, 1242375, 1211785, 1186226, 1164640, 1143660, 1122323, 1102221, 1084294, 1068438, 1055246, 1045130, 1036505, 1027582, 1019025, 1012182, 1005983, 998712, 991659, 987537, 986111, 984986, 984081, 985545, 989441, 993230, 995740, 998423, 1002416, 1007355, 1013184, 1020184, 1027244, 1033101, 1039266, 1048605, 1061044, 1073861, 1086309, 1100613, 1118012, 1137052, 1156478, 1176927, 1199137, 1223144, 1249812, 1280628, 1315606, 1353750, 1395586, 1442721, 1495173, 1552203, 1615803, 1690053, 1776533, 1873085, 1977247, 2087589, 2201005, 2311854, 2415002, 2507616, 2587883, 2654914, 2710704, 2759649, 2805147, 2848229, 2889097, 2927297, 2960308, 2984791, 2999892, 3007473, 3009360, 3006397, 2999173, 2986521]
56057B986521k2708l7776n3396o5941p6456q6274r2962r4118r1422q7310q1196
56046B196962p2663o4608n9224n4231m6979l9049l2973k7923k2526j8378j6688
56035A741720j4977j1095p068m994k970P61L654L399K660M550P280Q180R071J2468
56021A752639J6122J6725J5584J5553J5880J5085J5145J7598J9479J8493J8017
56010A936320K1312K5112K5220K4051K5920K8904K8643K6606K7217K9919L1237
55999B230461L1827L4322L7169L7676L8162M1989M6457M7004M5383M6084M7701
55988B684235M5865M2116M1624M4178M5415M5135M6703M9851N1574N2444N4917
55977C204057N7531N7710N7826O1390O6103O7975O9223P4327Q1564Q6321Q9451
$$ y = [2986521, 2963813, 2926037, 2872641, 2806700, 2730244, 2643970, 2551008, 2456890, 2365468, 2278158, 2196962, 2124299, 2059691, 2000467, 1946236, 1899257, 1860208, 1827235, 1799312, 1776786, 1758408, 1741720, 1726743, 1715648, 1708580, 1703586, 1700616, 1701377, 1705031, 1708430, 1711090, 1715640, 1722920, 1731100, 1740171, 1752639, 1768761, 1785486, 1801070, 1816623, 1832503, 1847588, 1862733, 1880331, 1899810, 1918303, 1936320, 1957632, 1982744, 2007964, 2032015, 2057935, 2086839, 2115482, 2142088, 2169305, 2199224, 2230461, 2262288, 2296610, 2333779, 2371455, 2409617, 2451606, 2498063, 2545067, 2590450, 2636534, 2684235, 2730100, 2772216, 2813840, 2858018, 2903433, 2948568, 2995271, 3045122, 3096696, 3149140, 3204057, 3261588, 3319298, 3377124, 3438514, 3504617, 3572592, 3641815, 3716142, 3797706, 3884027, 3973478]
55966C973478R4135R8263R8668R9231J05437J14296J19218J21422J26844J35216
55956E086208J42356J49837J61820J75496J85306J93630K06583K22503K35520
55947F759259K47123K62913K81463K97891L14774L37563L63244L85851M08757
55938I658838M38367M70369M96372N19505N48540N81117O08576O32857O62165
55929A4616706O94241P21508P48581P86590Q33804Q80546R29030R88732J056379
55920B2256117J121742J189330J272625J370765J473956J587631J726442J888193
55912C3886801K059600K243570K453149K683252K918937L167788L452302L775498
55904E6640897M129729M534778N028514N625243O326819P169570Q210423R469070
$$ y = [3973478, 4067613, 4165876, 4264544, 4363775, 4469212, 4583508, 4702726, 4824148, 4950992, 5086208, 5228564, 5378401, 5540221, 5715717, 5901023, 6094653, 6301236, 6523739, 6759259, 7006382, 7269295, 7550758, 7848649, 8163423, 8500986, 8864230, 9250081, 9658838, 10097205, 10567574, 11063946, 11583451, 12131991, 12713108, 13321684, 13954541, 14616706, 15310947, 16032455, 16781036, 17567626, 18401430, 19281976, 20211006, 21199738, 22256117, 23377859, 24567189, 25839814, 27210579, 28684535, 30272166, 31998608, 33886801, 35946401, 38189971, 40643120, 43326372, 46245309, 49413097, 52865399, 56640897, 60770626, 65305404, 70333918, 75959161, 82285980, 89455550, 97665973, 107135043]
55896A07135043J0935618J2628479J4582609J6788286J9215914K1891670K4854260
55889B28031879K8038893L1289394L4377859L6684178L6757510L2644762K3285496
55882D51109971R808279m750874j7215080k5874345l0691615l2485698l2187525
55875C17713113l0593214k8321522k5767335k3139028k0578425j8204884j6067074
55868A55041631j4143984j2417857j0899674r584892q441156p449162o611744
55861H5493162n916554n329292m828684m412628m066578l760110l479146l230948
55853E0469222l013704k809968k613165k432681k268819k108244j948092j800446
55845C1474103j669206j544952j425938j322188j235057j153319j073178j002626
$$ y = [107135043, 118070661, 130699140, 145281749, 162070035, 181285949, 203177619, 228031879, 256070772, 287360166, 321738025, 358422203, 395179713, 427824475, 451109971, 460918250, 456167376, 438952296, 413077951, 382386336, 349900638, 317713113, 287119899, 258798377, 233031042, 209892014, 189313589, 171108705, 155041631, 140897647, 128479790, 117580116, 107995224, 99554068, 92104906, 85493162, 79576608, 74247316, 69418632, 65006004, 60939426, 57179316, 53700170, 50469222, 47455518, 44645550, 42032385, 39599704, 37330885, 35222641, 33274549, 31474103, 29804897, 28259945, 26834007, 25511819, 24276762, 23123443, 22050265, 21047639]
55837B1047639r42690q83688q24034p74251p37808p05107o70712o40198o15504
55828A4253647n89308n58764n30489n07439m84239m59298m38320m22083m03592
55819I860115l81071l61416l47246l32507l14429k98153k86133k74182k61262
55810G003716k52133k47002k39425k27655k17492k10911k02586j90956j81974
55801E033582j78119j73926j66428j60016j56926j52493j44330j37156j34003
55792C630185j30986j25170j19793j17333j14834j10039j05278j01718r6703r0049
55782B518282q6048q5886q4791p9783p3788o9419o5243o0849n8679n8189n5008
55771A740599m8697m4454m4318m3664l9506l5310l4221l4152l3190l3372l5453
$$ y = [21047639, 20104949, 19221261, 18397227, 17622976, 16885168, 16180061, 15509349, 14869151, 14253647, 13664339, 13105575, 12575086, 12067647, 11583408, 11124110, 10685790, 10263707, 9860115, 9479044, 9117628, 8770382, 8437875, 8123446, 7825293, 7539160, 7264978, 7003716, 6751583, 6504581, 6265156, 6037501, 5820009, 5609098, 5406512, 5215556, 5033582, 4855463, 4681537, 4515109, 4355093, 4198167, 4045674, 3901344, 3764188, 3630185, 3499199, 3374029, 3254236, 3136903, 3022069, 2912030, 2806752, 2705034, 2608331, 2518282, 2432234, 2346348, 2261557, 2181774, 2107986, 2038567, 1973324, 1912475, 1853796, 1795607, 1740599, 1691902, 1647448, 1603130, 1559466, 1519960, 1484650, 1450429, 1416277, 1383087, 1349715, 1314262]
55760A314262l5916l2917k9669k8601k7609k5131k3243k2695k0634j6443j4105
55749A037299j5438j6621j4834j2715j2613j2095r013n921n331n293l570j809
55737I22046j922k452k063k416m270m900k714m18m62j323j297j766l688n002m763
55722H82590n752r746j4067j5960j6546j7461j7623j6412j5972j7051j6532j2513
55710G06955p938n768m512k238j126l867q698j2023j3360j4092j3937j2142r877
55697E97377q380o893m933l911m159l511j349p81l854p845r284q605p867p071
55683E18934n876n796p329p882n861l974n044p403p964p163p145p476o416m521
55669D29084l520l316l133l750n682p112o473n212n298o135o376o386o339m559
$$ y = [1314262, 1278346, 1245429, 1215760, 1187159, 1159550, 1134419, 1111176, 1088481, 1067847, 1051404, 1037299, 1021861, 1005240, 990406, 977691, 965078, 952983, 943970, 938049, 932718, 927425, 923855, 922046, 920124, 917672, 915609, 913193, 908923, 904023, 901309, 900891, 900429, 899106, 897809, 896043, 892355, 887353, 882590, 876838, 867092, 853025, 837065, 820519, 803058, 785435, 769023, 753051, 736000, 719468, 706955, 699017, 693249, 688737, 686499, 685373, 681506, 672808, 660785, 647425, 633333, 619396, 607254, 597377, 588997, 582104, 577171, 573260, 569101, 565590, 564241, 563460, 559606, 551761, 542477, 533872, 526005, 518934, 513058, 507262, 499933, 492051, 486190, 482216, 477172, 469769, 461805, 454642, 447497, 440021, 433605, 429084, 425564, 422248, 419115, 415365, 409683, 402571, 396098, 390886, 385588, 379453, 373077, 366691, 360352, 355793]
55655C55793o80K287K145J085J960L704L952L411L738L687J562o84k97J180N2
55640C82895l630o647p962r127j0185r540p575o503o524n752l901k749k720k220
55626B97860o46O95R54P11M53K42P18K366M056M339L701L521L454K078l88k303
55610C21811l165l735m004l252j966j576k242k666k110j076j36O04J042J136J179
55595B99844J240J050Q95J496K471K466J495J154J669J112j099k597j833p47j295
55580C07321j958n73J493J356q35k643l425m499o166p450q107q349p477n237l426
55565B50025l574m186l014r09m88j962l327l913m599n098m110j958l56R4k32j734
55549B10659m424n923l978n05K99k173m312l706j857r19q62r08j153j628j717
$$ y = [355793, 355113, 357400, 359545, 360630, 362590, 366294, 370246, 373657, 377395, 381082, 382644, 381960, 381663, 382843, 382895, 379265, 372618, 364656, 355529, 345344, 335804, 328229, 321726, 315202, 309450, 305549, 302800, 300080, 297860, 297214, 297909, 298863, 299574, 300027, 300269, 300987, 303353, 307409, 311748, 315449, 318970, 322424, 324502, 324114, 321811, 318646, 314911, 310907, 307655, 305689, 304113, 301871, 299205, 297095, 296019, 295883, 296487, 297529, 298665, 299844, 301084, 302134, 303029, 304525, 306996, 309462, 310957, 312111, 313780, 314892, 313793, 311196, 309363, 308616, 307321, 305363, 304790, 306283, 307639, 306804, 304161, 300736, 296237, 290071, 282621, 274514, 266165, 258688, 253451, 250025, 246451, 242265, 239251, 238342, 237854, 235892, 232565, 228652, 224053, 218955, 214845, 212887, 212531, 212625, 212393, 210659, 206235, 200312, 196334, 195829, 196128, 193955, 189643, 185937, 184080, 183161, 182299, 181391, 180238, 178610, 176893]
55534A76893j417j454j752j447o54l77n03J36J486K017J120k1l55r7L07Q54J388
55517A76124J676K065K786L049K269J647K710M845O196O465O682O651N103K321
55503B30589J92o09j333k781m219m956n217n145m522l596k774j804o38l86j576
55488A91225k388r88J202J318m96j563j325j902l639l840j230J467J274j156l113
55473A74846l271k034j97J174J042j87p84k05J02p79j627j227m59p12j542j551
55457A62589p42m60j416k901l687l135j707p79j366k771l189j948l90j07j122
55442A36869k098j879n80M71l9j723k518j159R79J598N53k60K04Q61L73j026j865
55425A28761r71J291K807J497j937m116l000n75J39o64o85K94M00n55n35J052
$$ y = [176893, 175476, 174022, 172270, 170823, 170169, 169792, 169289, 169425, 170911, 172928, 174048, 174027, 173672, 173575, 173882, 174736, 176124, 177800, 179865, 182651, 185700, 187969, 189616, 192326, 197171, 203367, 209832, 216514, 223165, 228268, 230589, 230781, 230172, 228839, 226058, 221839, 216883, 211666, 206521, 201999, 198403, 195629, 193825, 193187, 192801, 191225, 188837, 187849, 189051, 190369, 189873, 188310, 186985, 185083, 181444, 177604, 176374, 177841, 179115, 177959, 174846, 171575, 169541, 169344, 170518, 171560, 171373, 170589, 170384, 170486, 169707, 168080, 166853, 166394, 165682, 164140, 162589, 161847, 161387, 159971, 157070, 153383, 150248, 148541, 147762, 146396, 143625, 140436, 138488, 138098, 137991, 136869, 134771, 132892, 132312, 132783, 132744, 131021, 128503, 127344, 128323, 129921, 130474, 130214, 130418, 131279, 131652, 130626, 128761, 127790, 129081, 131888, 133385, 131448, 127332, 124332, 123757, 123896, 123232, 122547, 122841, 123241, 122686, 122151, 123203]
55409A23203K029P82j415k519k259j609j272j530k307k854k439j477p68J0J413
55394A06988K398J530k81p44J35J36j247j820l27J678K529K439J908P39l45K63
55378A15979K228L037J852Q19J183J167m00j395K0J852J374m15p71M1m49k301
55362A23821k964j510J10L18k79q43j606k507k535j355j39J41K7M81J419K118
55346A14697K303K116J476J86j374k143j305P20K463K849K193J349L63j118k418
55331A22357k196m81R22P34k07l80L62R80P83p2j077j737j753j333r54o01J37
55314A15484J058J250L14j096k276l180l706l225j442Q35K333K417J349no56k55
55298A09199O44J435K174K764K327O25o94m2J458J370l57j450r88l50j63Q13K757
$$ y = [123203, 125232, 126014, 124599, 122080, 119821, 118212, 116940, 115410, 113103, 110249, 107810, 106333, 105565, 105575, 106988, 109386, 110916, 110635, 109891, 110026, 110162, 108915, 107095, 106768, 108446, 110975, 113414, 115322, 116061, 115716, 115979, 118207, 121244, 123096, 123915, 125098, 126265, 125865, 124470, 124490, 126342, 127716, 127301, 126530, 126571, 126122, 123821, 120857, 119347, 119457, 119775, 119496, 118653, 117047, 114540, 112005, 110650, 110511, 110652, 110679, 111160, 112579, 114697, 117000, 119116, 120592, 120778, 119404, 117261, 115956, 116676, 119139, 121988, 124181, 125530, 125893, 124775, 122357, 120161, 119680, 120602, 121336, 121129, 120749, 121111, 122091, 122874, 122802, 121725, 119988, 118235, 116902, 115948, 115347, 115484, 116542, 117792, 118106, 117010, 114734, 111554, 107848, 104623, 103181, 104016, 106349, 108766, 110115, 110110, 109454, 109199, 109843, 111278, 113452, 116216, 118543, 119168, 118474, 118432, 119890, 121260, 120903, 119453, 118465, 118115, 117952, 118765, 121522]
55281A21522L527J831o46j912k252k482j776M96K561K259K36j056o68L80J128
55266A23148J341Q30k65j035r82r67j716k344j809q40q52j663j917j067M64K288
55250A12614L721L294M18k991m257k958q73M86Q11J37j146j767p44J062J887J395
55234A11089P56P56J154J692K292K473J826R61R03J686K446K504J528o25l008
55219A28433l483j065K134L016J157j097j769r39L85J325J209Q9p29m8J427J984
55203A32029J298N13J51l04q25o78k1%q10j237o98k77j039k467l287k919j522
55186A17907M60K163K565J492o3j057j349j266q00K73J781K994L152K174Q45k9
55170A31242o08j599k730k708j147N47J015N88J65l88j337j756q38K55j94j675
$$ y = [121522, 125049, 126880, 126234, 124322, 122070, 119588, 117812, 118308, 120869, 123128, 123364, 122308, 121640, 122020, 123148, 124489, 125319, 125054, 124019, 123037, 122070, 120354, 118010, 116201, 115361, 114509, 112846, 110929, 109862, 110326, 112614, 116335, 119629, 120047, 117056, 112799, 109841, 108968, 109454, 110265, 110402, 109256, 107489, 106745, 107807, 109694, 111089, 111845, 112601, 113755, 115447, 117739, 120212, 122038, 122999, 123902, 125588, 128034, 130538, 132066, 131441, 128433, 124950, 123885, 126019, 129035, 130192, 129095, 127326, 126387, 126772, 128097, 129306, 129395, 128666, 128618, 130045, 132029, 133327, 133840, 133991, 133687, 132862, 132184, 132163, 132163, 131353, 130116, 129418, 129141, 128102, 125635, 122348, 119429, 117907, 118367, 120530, 123095, 124587, 124524, 123467, 122118, 120852, 120052, 120325, 122106, 125100, 128252, 130426, 131271, 131242, 130634, 129035, 126305, 123597, 122450, 122997, 124012, 124600, 124765, 124377, 123040, 121284, 120446, 120701, 120507, 118832]
55154A18832k057p03Q86J562J668J495N29j132k276k172j440p66n0P06R00L68
55138A16350j86l44n31r11q32J06J283J988K216K169J740J039N59L84O5l23J21
55121A24893J705L248L299J758k73j769k348j973o98J169K872L418K396P74J99
55106A38670Q98J048q54l548m382k760q10m40j143j197J02J972L070K476L83j773
55090A31712k562j954r88k43N20J312J657J454J090O29j09p09n54o7k12p24l71
55073A29881P56R40m20j484m99J701K996K847K383K336K288J780R23q8j216k196
55057A42928k618k520k412k502k259j057P79J901J306k69r25J20J516J609N87
55042A36184l6M22J298J926K265K311J939J344P76j8j130j666q19N93J123R59
$$ y = [118832, 116775, 116072, 116958, 118520, 120188, 121683, 122212, 121080, 118804, 116632, 115192, 114426, 114376, 115082, 115982, 116350, 116164, 115820, 115289, 114378, 113546, 113652, 114935, 116923, 119139, 121308, 123048, 124087, 124646, 125030, 125095, 124772, 124893, 126598, 129846, 133145, 134903, 134630, 132861, 130513, 128540, 127842, 129011, 131883, 135301, 137697, 138471, 138670, 139568, 140616, 139762, 136214, 131832, 129072, 128262, 127822, 126679, 125482, 125584, 127556, 130626, 133102, 133485, 131712, 129150, 127196, 126208, 125965, 126485, 127797, 129454, 130908, 131998, 132627, 132518, 131809, 131255, 131188, 130976, 130252, 129881, 130637, 131577, 131157, 129673, 129174, 130875, 133871, 136718, 139101, 141437, 143725, 145505, 146428, 146340, 145124, 142928, 140310, 137790, 135378, 132876, 130617, 129560, 130339, 132240, 133546, 133277, 132352, 132472, 133988, 135597, 136184, 136148, 136570, 137868, 139794, 142059, 144370, 146309, 147653, 148429, 148411, 147281, 145615, 144796, 145389, 146512, 147471]
55026A47471J535K910L505K634J357L54j081l130m418l939k395p03J162K736K523
55011A50521L65j318n12J510K145J120J35j62n66j120q00N76J866K218J764P10
54995A58452q23j953j618k68L19p28k386l210k815j600r3J103J572J503J258N58
54979A49271r63k487k608j323k02j37l28r0k11j335k204j136J287K691K004O19
54963A42848R1P7n34j455j207O59K663L028J629j28q81m71L18P47P21O27O56M66
54945A49854k91j318j904j800j365p88J31J149J323K32j105j330m94K09K06J57
54929A42866P92J967L075L720L788L327K559J729R57M21L37L51m43k155l301k436
54913A57554k52J107P15m05j080j120n13Q48K206K166O76m84j40O20K46q36r71
$$ y = [147471, 149006, 151916, 155421, 158055, 159412, 159766, 158685, 155555, 151137, 147198, 144803, 144100, 145262, 147998, 150521, 150886, 149568, 149056, 150566, 152711, 153831, 153966, 153804, 153238, 152118, 151318, 151894, 153760, 155978, 157742, 158452, 157629, 155676, 154058, 153790, 154109, 153381, 150995, 147785, 144970, 143370, 143277, 144380, 145952, 147455, 148713, 149271, 148308, 145821, 143213, 141890, 141688, 141551, 141223, 141133, 140922, 139587, 137383, 136247, 137534, 140225, 142229, 142848, 142939, 143016, 142482, 141027, 139820, 140479, 143142, 146170, 147799, 147671, 146790, 146319, 146637, 147384, 148105, 148732, 149388, 149854, 149563, 148245, 146341, 144541, 143176, 142388, 142519, 143668, 144991, 145223, 144118, 142788, 142294, 142503, 142709, 142866, 143658, 145625, 148700, 152420, 156208, 159535, 162094, 163823, 164780, 165201, 165538, 165889, 165446, 163291, 159990, 157554, 157302, 158409, 159124, 158719, 157639, 156519, 156006, 156854, 159060, 161226, 161902, 161418, 161278, 161898, 162144, 161308, 160337]
54896A60337K23J489J912J915K135K220J334n18k139k367j484r31j360j690q28
54881A60248M22M54n78r45p7P11N49K51M14K34o89j002L79K184K409J152J60L28
54863A66604J222K517M204N522N343L742K063J402J850L121M832O275O846O764
54849B22307O606O271N048K596o86l933o043o287n254m470m421l973k522j404
54835B03835j834k696k246j004q03j702k117j867k457m079m725l056j75K286M021
54820A81381N022M549K503N57M83K092L832M629M379L531L052L879N619O642O196
54805B38346N286M603L053k30l614m680l665l164m515o332o871o206n332m555
54791B02124l764l346l633l958l264j588j73m3j040k315l207l412k826j698p01
$$ y = [160337, 160560, 162049, 163961, 165876, 168011, 170231, 171565, 171047, 168908, 166541, 165057, 164126, 162766, 161076, 160248, 160670, 161124, 160546, 159601, 159524, 160235, 160784, 161035, 161449, 161683, 160994, 159992, 160371, 162555, 164964, 166116, 166276, 166604, 167826, 170343, 174547, 180069, 185412, 189154, 191217, 192619, 194469, 197590, 202422, 208697, 215543, 222307, 228913, 235184, 240232, 242828, 242142, 238209, 232166, 225879, 220625, 216155, 211734, 207761, 205239, 203835, 202001, 199305, 197059, 196055, 195252, 193550, 191433, 189566, 187109, 183030, 178305, 175249, 175074, 177360, 181381, 186403, 190952, 193455, 194012, 194495, 196587, 200419, 205048, 209427, 212958, 216010, 219889, 225508, 232150, 238346, 243632, 248235, 251288, 251058, 247444, 242764, 239099, 235935, 231420, 225088, 218217, 212011, 206679, 202124, 198360, 195014, 191381, 187423, 184159, 182571, 182398, 182355, 181315, 179000, 175793, 172381, 169555, 167857, 167156]
54776A67156l82m78k49M38P28j39j672k473j735j28R07N28p72j726j519n04L89
54759A58369P80R56J036P13rn55p65j283k243k376n79K131L546K935J492L23n26
54742A63945q49M7J719K237P08j037o96J305K379J146j209k824l033k142o30R78
54726A62044K130K699K878K552J446Q3l25N83J660J751J274J470K524L451L632
54711A89852L535L611L486K783K189K780M448N647N012K947J336J735L922O206
54697B39489P069O402N142L880K260j90l067n318o253n995n074m057l453l473
54683B27362l692l397k457j611j668k592l486l341j845K91J819K074J591J298
54669B10346J243P17l92j256j328j156j409j651r17Q52K619L440L351L084L311
$$ y = [167156, 166774, 166296, 166047, 166485, 167213, 167074, 165402, 162929, 161194, 161066, 161973, 162501, 161729, 160003, 158484, 157980, 158369, 159149, 160105, 161141, 161854, 161845, 161290, 160525, 159242, 156999, 154623, 154044, 156175, 159721, 162656, 164148, 164471, 163945, 163096, 163143, 164862, 167099, 167807, 166770, 166074, 167379, 169758, 170904, 169695, 166871, 163838, 161696, 161066, 162044, 164174, 166873, 169751, 172303, 173749, 173832, 173507, 174090, 175750, 177501, 178775, 180245, 182769, 186220, 189852, 193387, 196998, 200484, 203267, 205456, 208236, 212684, 218331, 223343, 226290, 227626, 229361, 233283, 239489, 246558, 252960, 258102, 261982, 264242, 264052, 260985, 255667, 249414, 243419, 238345, 234288, 230835, 227362, 223670, 220273, 217816, 216205, 214537, 211945, 208459, 205118, 203273, 203564, 205383, 207457, 209048, 210346, 211589, 212306, 211914, 210658, 209330, 208174, 206765, 205114, 204197, 205049, 207668, 211108, 214459, 217543, 220854]
54654B20854M131N085N665N767N425M226J693j562l957m744m880n483o142n822
54640B20256m709l851l408k698j872j907k677k667j360m47j447l199l255j219
54626A85540P96J056N6q24j249j707k185k199j802j560j486q96L77J399J302M65
54610A77083j64m69j046j826j892q53M18Q94N99J80j66p06j421j882j808j321
54594A65620p01j83R7K55O24J309J865J635L91j311k308j602N14K343K525J770
54578A72843J846K829K780P35j520j844o92j37p71j337j096o85n30l2J113K112
54562A75614K249J851J447Q34l18j554k083j895j892k845m470n505m815k556m2
54547A54020J654K566L011K736J665P49R67J801J913J112L88J81J1q6O39K006
$$ y = [220854, 224985, 230070, 235735, 241502, 246927, 251153, 252846, 251284, 247327, 242583, 237703, 232220, 226078, 220256, 215547, 211696, 208288, 205590, 203718, 201811, 199134, 196467, 195107, 194660, 193213, 190014, 186759, 185540, 186336, 187392, 187448, 186624, 185375, 183668, 181483, 179284, 177482, 175922, 174436, 173540, 173917, 175316, 176618, 177083, 176919, 176450, 175404, 173578, 171686, 170833, 171251, 172145, 172744, 172924, 172758, 172052, 170631, 168749, 166941, 165620, 164919, 164736, 164833, 165088, 165712, 167021, 168886, 170521, 170912, 169601, 167293, 165691, 166205, 168548, 171073, 172843, 174689, 177518, 180298, 181033, 179513, 177669, 176977, 176840, 176069, 174732, 173636, 172951, 172421, 172389, 173502, 175614, 177863, 179714, 181161, 181995, 181677, 180123, 178040, 176145, 174253, 171408, 166938, 161433, 156618, 154062, 154020, 155674, 158240, 161251, 163987, 165652, 166401, 167368, 169169, 171082, 172194, 172582, 172763, 172774, 172688, 173327, 175333]
54531A75333K558J569K23l8O41J099P88k4r32j566j627j394j526j968j755n25
54515A70856O96R52O79P27Q44L27m72m42O94K072K756K289N50j915l639l431j783
54498A71760k11O93J494K294K193Q83m28m99L07P41O09R35K285L785M047K628
54482A93516K92j667k177r51J121K412J969N26l08J88J346K142K067R59r43k492
54466A98000k257l63J130O67p76j141l4J262J878J914J308j06j403j232O2O25
54450A99534k37j249j485j623k007j503L40J655O56j544k369j246K76J230K022
54435A92450K759K655J424k00j579k624l049k448j276n17j87N56J660K006J384
54420A93014J151K004K472R74j614k866j873N2J580K770L850L952K269j12q43
$$ y = [175333, 177891, 179460, 179683, 179645, 180286, 181385, 182173, 182149, 181217, 179651, 178024, 176630, 175104, 173136, 171381, 170856, 171552, 172504, 173183, 173910, 174754, 175081, 174609, 174167, 174861, 176933, 179689, 181978, 182528, 180613, 176974, 173543, 171760, 171549, 172242, 173736, 176030, 178223, 179106, 178678, 178179, 178486, 179227, 179836, 180771, 183056, 186841, 190888, 193516, 193808, 192141, 189964, 189013, 190134, 192546, 194515, 195041, 194733, 194921, 196267, 198409, 200476, 201435, 200492, 198000, 195743, 195380, 196510, 197177, 196401, 195260, 195226, 196488, 198366, 200280, 201588, 201482, 200079, 198847, 198909, 199534, 199297, 198048, 196563, 194940, 192933, 191430, 191770, 193425, 194081, 192537, 190168, 188922, 189198, 190428, 192450, 195209, 197864, 199288, 199088, 197509, 194885, 191836, 189388, 188112, 187595, 187408, 187964, 189624, 191630, 193014, 194165, 196169, 198641, 199615, 198001, 195135, 193262, 193314, 194894, 197664, 201514, 205466, 207735, 207623, 206780]
54405B06780R21L272L728K091K90k65j04k31m42J2Q63J104O59O35J616K680K631
54388B26240J612P87P69J072J012M74m52j875l544m275k984m21J054J60j645k055
54372B15929r52k35r06j848j850j316j151j131n96J27J90k61k22O71J642J827
54356B09918J125J57j50P04K007K167N52j585k650k580k251j658j54J930L309
54341B10841L494L162K833K379K025K346L010K969K303K319L193L206J404m66
54327B45018k93J249J748N92n73p38q43j669k186j067J188K860L084K350J318
54312B52038J83q46j293r21J1J134K188K802K556J626R21J170K057K584K108P31
54296B69049j045k528k894j749K16J622J773J170M84l89j794l216l473k069O6
$$ y = [206780, 207701, 210973, 214701, 216792, 217082, 216817, 216713, 216482, 216040, 216052, 216915, 218019, 218678, 219313, 220929, 223609, 226240, 227852, 228639, 229408, 230480, 231492, 231966, 231514, 229639, 226095, 221820, 218836, 218415, 219469, 219629, 217984, 215929, 214977, 214742, 213836, 211988, 210138, 208822, 207671, 206540, 205944, 206071, 206261, 206000, 205778, 206449, 208091, 209918, 211043, 211200, 211050, 211754, 213761, 215928, 216480, 214895, 212245, 209665, 207414, 205756, 205602, 207532, 210841, 214335, 217497, 220330, 222709, 224734, 227080, 230090, 233059, 235362, 237681, 240874, 244080, 245484, 245018, 244725, 245974, 247722, 248314, 247741, 247003, 246160, 244491, 242305, 241238, 242426, 245286, 248370, 250720, 252038, 252221, 251375, 250082, 249161, 249172, 250306, 252494, 255296, 257852, 259478, 260399, 261569, 263626, 266210, 268318, 269049, 268004, 265476, 262582, 260833, 261049, 262671, 264444, 265614, 266098, 265709, 263915, 260699, 257226, 255157, 255223]
54281B55223J306O74j406l472m241l732l065k941k626r37J930M147M066J947l51
54266B46522j263r10o75j565l129m084l766k667j529n61J76K00p95j981j866l4
54250B22073K118K761J508l31j197o41O11J522J539Q07q0n74p12j126k129k895
54234B23254k151p6J334O01j044j038J109L096K788P19j040j382p09J93O79J89
54218B26522j286k705k787j317Q04K530L145K232Q9j974k514j276P79K568L503
54203B28313L380K411J289N56N4n44q93l99P74J913K813L717M279L602J562p16
54187B52111k085k503k618k751k611j722jJ890K830K355J347J105J767K187J380
54172B52681m28k207l047k773k018j681j922j890q78O95J900K418K304J403J7
$$ y = [255223, 256529, 257203, 255797, 252325, 248084, 244352, 241287, 238346, 235720, 234783, 236713, 240860, 244926, 246873, 246522, 245259, 244349, 243674, 242109, 238980, 234896, 231130, 228463, 226934, 226373, 226549, 226749, 225954, 223973, 222107, 222073, 224191, 226952, 228460, 228129, 226932, 226291, 226902, 228424, 229963, 230770, 230690, 230116, 229404, 228278, 226149, 223254, 221103, 221027, 222361, 222962, 221918, 220880, 221989, 225085, 227873, 228592, 227552, 226170, 225461, 225654, 226333, 226522, 225236, 222531, 219744, 218427, 219231, 221761, 224906, 227138, 227227, 225253, 222739, 221463, 222242, 224810, 228313, 231693, 234104, 235393, 235949, 236003, 235459, 234566, 234167, 234941, 236854, 239667, 243384, 247663, 251265, 252827, 252111, 250026, 247523, 244905, 242154, 239543, 237821, 237820, 239710, 242540, 244895, 246242, 247347, 249114, 251301, 252681, 252253, 250046, 246999, 244226, 242208, 240527, 238605, 236715, 235837, 236532, 238432, 240850, 243154, 244557, 244574]
54157B44574m53Q60K455J995k96j736j043q5q36k526l273l016k973l100k153M1
54141B28435K086K908K756K196J336L45l08o14j085j673j465j05J202J030k81
54126B36763r51r8J164J441J036J326K579L561L490L167L487L849L111J420j47
54111B65198j361k806m175m286l035j841j493j002M66J775J259q07k485k559j463
54096B41385k45L96J96m57n26N05J577J146n87j664q27R42J772J055l94j685k617
54079B39972l208l174j999M35L298M883L832O54k278k869j412o0j98j006r41J22
54063B36051J031J191J121J104N43p09j363j55K254L932L991L180K364J640J079
54048B57254J190K037K823K892K438J877J295J029J853L744N251N053L692K650
$$ y = [244574, 244121, 244981, 247436, 249431, 249135, 247399, 246356, 246271, 245435, 242909, 239636, 236620, 233647, 230547, 228394, 228435, 230521, 233429, 236185, 238381, 239717, 240062, 239754, 239140, 238055, 236382, 234917, 234812, 236014, 237044, 236763, 235812, 235714, 236878, 238319, 239355, 240681, 243260, 246821, 250311, 253478, 256965, 260814, 263925, 265345, 265198, 263837, 261031, 256856, 252570, 249535, 247694, 246201, 245199, 245665, 247440, 248699, 247892, 245407, 242848, 241385, 241140, 241536, 241732, 241275, 240749, 241254, 242831, 243977, 243390, 241726, 240899, 241841, 243613, 244668, 244274, 242589, 239972, 236764, 233590, 231591, 232026, 235324, 240207, 244039, 244693, 242415, 239546, 238134, 238074, 237876, 236870, 235929, 236051, 237082, 238273, 239394, 240498, 241041, 240332, 238969, 238814, 241068, 245000, 248991, 252171, 254535, 256175, 257254, 258444, 260481, 263304, 266196, 268634, 270511, 271806, 272835, 274688, 278432, 283683, 288736, 292428, 295078]
54034B95078K113R02j323l217l535k776k145j689o02Q89J311N3j385j159N30J909
54018B84954K143K014J961J117q85k520k161m34O54M47J8O3P4k61l52J79Q63J285
54000B89159J593J700J178K83O9Q79J804K046J782J252J64j312k117j540PJ973
53984B98920M242O135O361M930L765M254N426N810N684N957O097N233M356N149
53970C72319P012P535N866L654K440K010J753J834K251K173J092k82r91r60p62
53955D06944q94j533k333k458j683j315k834n550p039o231m622l855l624k968
53941C60005k293k572l365l245k012j060j330k045j968j101n18r21j966k973l670
53926C28966m038l910l223k382j798j174nJ218J329L53n4J242L251M364M555M814
$$ y = [295078, 297191, 298093, 296770, 293553, 290018, 287242, 285097, 283408, 282806, 283695, 285006, 285059, 283674, 282515, 283045, 284954, 287097, 289111, 291072, 292189, 291304, 288784, 286623, 286189, 286843, 287290, 287308, 287371, 287445, 287184, 286832, 287011, 287874, 289159, 290752, 292452, 293630, 293913, 293982, 294861, 296665, 298711, 300493, 301745, 301909, 300597, 298480, 296940, 296947, 298920, 303162, 309297, 315658, 320588, 324353, 328607, 334033, 339843, 345527, 351484, 357581, 362814, 367170, 372319, 379331, 386866, 392732, 396386, 398826, 400836, 402589, 404423, 406674, 408847, 409939, 409657, 408666, 407706, 406944, 406050, 404517, 402184, 399726, 398043, 396728, 393894, 388344, 381305, 375074, 370452, 366597, 362973, 360005, 357712, 355140, 351775, 348530, 346518, 345458, 344128, 342083, 340115, 339014, 338496, 337575, 335609, 332636, 328966, 324928, 321018, 317795, 315413, 313615, 312441, 312436, 313654, 314983, 315336, 315282, 316524, 319775, 324139, 328694, 333508]
53910C33508N156M845M179M298N139N396M771M522N023M555J667k398n051n414
53896C70196m842m749n083m832l241n20K161L483L176K230J616J244O15J6L13
53881C61783J676L203L975M056M136M425M246L026J457J121K625M793O180O836
53867D13538P628Q401Q195P162O632O882O432M462K526K578M237N485N552N567
53853D95277O473P747Q501Q754Q975R057Q386O701M458K361P16p46k333l745m263
53838E56319l711k915k831l546m481n367o499q001r311r594q600p107o432p262
53824D70662q844r588q699o922n463m718m404m532n378o549o865n555l215j304
53810C88626q62j829l391m636n055m696l962l270k829k647k599k445j968j252
$$ y = [333508, 338664, 343509, 347688, 351986, 357125, 362521, 367292, 371814, 376837, 381392, 383059, 380661, 375610, 370196, 365354, 360605, 355522, 350690, 347449, 346929, 349090, 352573, 355749, 357979, 359595, 360839, 361454, 361470, 361783, 363459, 366662, 370637, 374693, 378829, 383254, 387500, 390526, 391983, 393104, 395729, 400522, 406702, 413538, 421166, 429567, 437762, 444924, 451556, 458438, 464870, 469332, 471858, 474436, 478673, 484158, 489710, 495277, 501750, 509497, 517998, 526752, 535727, 544784, 553170, 559871, 564329, 566690, 567406, 566660, 564327, 560582, 556319, 552608, 549693, 546862, 543316, 538835, 533468, 526969, 518968, 509657, 500063, 491463, 484356, 477924, 470662, 461818, 452230, 443531, 436609, 431146, 426428, 422024, 417492, 412114, 405565, 398700, 393145, 389930, 388626, 387764, 385935, 382544, 377908, 372853, 368157, 364195, 360925, 358096, 355449, 352850, 350405, 348437, 347185]
53796C47185p78r56j585j986j826j552j693k014j854j156n88n68q13r77j085j022
53780C26732m45L29J60j356k765k289j61J665J938J249P30P51J103J549J719J232
53764C32141K51o32j240j901k501k256p84J256K918L774L737K941K144K446L888
53749C46182M985M432K826J977K676L870M003K808J638K151M538P088P766O189
53735D03129L818K343K436L778N443O168N330L906L542M253M190K300M4n98J0
53720D50092l40k658n458o683n930m477l649l582l502k897k167j953k174k336
53706D02286k618l685n317o230n677m329l114k142j435j610k860m044l961k936
53692C52328k112j668q73L84J277J194L90m60o90N3J233J591O40m18k20R24J662
$$ y = [347185, 346407, 345451, 343866, 341880, 340054, 338502, 336809, 334795, 332941, 331785, 331197, 330629, 329816, 328839, 327754, 326732, 326287, 326616, 326776, 325420, 322655, 320366, 320205, 321870, 323808, 325057, 325787, 326538, 327641, 329190, 330909, 332141, 332392, 331760, 330520, 328619, 326118, 323862, 323078, 324334, 327252, 331026, 334763, 337704, 339848, 342294, 346182, 351167, 355599, 358425, 360402, 363078, 366948, 370951, 373759, 375397, 377548, 382086, 389174, 396940, 403129, 406947, 409290, 411726, 415504, 420947, 427115, 432445, 436351, 439893, 444146, 448336, 450636, 450680, 450082, 450092, 449752, 447094, 441636, 434953, 429023, 424546, 420897, 417315, 413813, 410916, 408749, 406796, 404622, 402286, 399668, 395983, 390666, 384436, 378759, 374430, 371316, 369174, 367739, 366129, 363269, 359225, 355264, 352328, 350216, 348548, 347675, 348059, 349336, 350530, 350920, 350460, 349770, 349823, 351056, 352647, 353287, 352869, 352649, 353573, 355235]
53675C55235J612J427J256O02k97m29M09J256J527J764K412K923K655J846J235
53660C75433J288K017K967L330K823K320K688L167K347O80K74J706K952K570K060
53645D08622L452N876O704N401M096M287N027M798L678K806K789L443M386N102
53631D70467M916L672K249J865K773L865L590J354j661l262k358l38K99j138k784
53616D83509k723j349m18n06o77m40n29j454k438k577k180k125k371j993m69J648
53600D62908L229L231J381j231k641j836K04J941L105M158M574L314R24o01l06
53585D82354Q44J977L409M905M821K525K63O79L380N746O581O922P447P281N832
53570E44966M121L419L689M096M130L664K740J893K072L563N469O662O811O260
$$ y = [355235, 356847, 358274, 359530, 360132, 359835, 359406, 359815, 361071, 362598, 364362, 366774, 369697, 372352, 374198, 375433, 376721, 378738, 381705, 385035, 387858, 390178, 392866, 396033, 398380, 399060, 399334, 401040, 403992, 406562, 408622, 412074, 417950, 424654, 430055, 434151, 438438, 443465, 448263, 451941, 454747, 457536, 460979, 465365, 470467, 475383, 479055, 481304, 483169, 485942, 489807, 493397, 494751, 493090, 489828, 487470, 487132, 487431, 486293, 483509, 480786, 479437, 479019, 478513, 477836, 477396, 476867, 475413, 472975, 470398, 468218, 466093, 463722, 461729, 461260, 462908, 466137, 469368, 470749, 469518, 466877, 465041, 465245, 467186, 470291, 474449, 479023, 482337, 483261, 482660, 482354, 483198, 485175, 488584, 493489, 498310, 500835, 501098, 501777, 505157, 510903, 517484, 524406, 531853, 539134, 544966, 549087, 552506, 556195, 560291, 564421, 568085, 570825, 572718, 574790, 578353, 583822, 590484, 597295, 603555]
53556F03555N453M910N175O301P625Q368Q281P569O557N587M836M093L033J844
53542F83187J213J467K095K256J637O99K50O94J532J784J101Q5p38j700l182m635
53526F87745n201m889m204l129j584m40o88j772k232j973k324l621m498m125l374
53511F43691k964k049j7J757J548k49j745j994j375k03J495L031L387K554J427
53496F48294M21p00j581j135J019L841N917O585O006M930M593N905Q353J0330
53482G02778J0895J0657J0630J0924J1077J1048J1290J1984J2840J3626J4563
53471H32312J6103J8297K0406K1290K0577J9442J9749K2116K5137K6890K7007
53460A069326K6822K7603K9226L0854L2324L4192L6598L8852M0387M1428M2332
$$ y = [603555, 609008, 613918, 619093, 625394, 633019, 641387, 649668, 657237, 663794, 669381, 674217, 678310, 681343, 683187, 684400, 685867, 687962, 690218, 691855, 692554, 692804, 693498, 695030, 696814, 697915, 698000, 697262, 695562, 692380, 687745, 682544, 677655, 673451, 670322, 668738, 668298, 667610, 665838, 663606, 661633, 659309, 655688, 651190, 647065, 643691, 640727, 638678, 638661, 640418, 641966, 641717, 639972, 637978, 636603, 636400, 637895, 640926, 644313, 646867, 648294, 648715, 648015, 646434, 645299, 646318, 650159, 656076, 662661, 668667, 673597, 678190, 684095, 692448, 702778, 713673, 724330, 734960, 745884, 756961, 768009, 779299, 791283, 804123, 817749, 832312, 848415, 866712, 887118, 908408, 928985, 948427, 968176, 990292, 1015429, 1042319, 1069326, 1096148, 1123751, 1152977, 1183831, 1216155, 1250347, 1286945, 1325797, 1366184, 1407612, 1449944]
53449A449944M2841M2829M3105M4408M5721M5000M1873L8400L6551L6045L5624
53438A902341L5261L5659L6262L5642L3833L2593L2804L3114L2114L0633L0461
53427B270717L1515L1850L0433K8416K7163K6286K4522K1763J9048J6871J4718
53416B543302J2300R980P668M374k84n017q302j0319j2431j5159j7898k0413k3285
53403B464516k6473k8746k9090k8059k7163k7493k9144l1301l2647l2480l1664
53392B140256l1625l2219l1774k9746k7850k7494k7495k5815k2645j9872j7999
53381A845722j5552j1720p722m964l211j390Q32L095N184P027Q384R273J0374
53368A845332J2387J5215J8209K1025K3754K6465K9035L1422L3725L5935L7951
$$ y = [1449944, 1492785, 1535614, 1578719, 1623127, 1668848, 1713848, 1755721, 1794121, 1830672, 1866717, 1902341, 1937602, 1973261, 2009523, 2045165, 2078998, 2111591, 2144395, 2177509, 2209623, 2240256, 2270717, 2302232, 2334082, 2364515, 2392931, 2420094, 2446380, 2470902, 2492665, 2511713, 2528584, 2543302, 2555602, 2565582, 2573250, 2577624, 2577340, 2572323, 2564021, 2553702, 2541271, 2526112, 2508214, 2487801, 2464516, 2438043, 2409297, 2380207, 2352148, 2324985, 2297492, 2268348, 2237047, 2204400, 2171920, 2140256, 2108631, 2076412, 2044638, 2014892, 1987042, 1959548, 1932053, 1906238, 1883593, 1863721, 1845722, 1830170, 1818450, 1810728, 1805764, 1802553, 1801163, 1801995, 1805090, 1810274, 1817301, 1825685, 1834958, 1845332, 1857719, 1872934, 1891143, 1912168, 1935922, 1962387, 1991422, 2022844, 2056569, 2092504, 2130455]
53357B130455L9876M2096M4859M7842N0392N2341N4368N7276O0967O4596O7647
53346B712715P0273P2605P4529P6531P9742Q4261Q8280Q9991Q9904Q9975R0819
53335C619625R1246R0672R0248R0929R1771R1174Q8918Q5911Q2706P9315P5996
53324D578511P2851O8894O2770N4749M6931M0946L6084L0260K2391J3169L855
53313E031411m970j3351k1368k9100l6942m5392n4377o3151p1004p7799q3599
53302D530358q8072r0688r1383r0737q9588q8787q9033r0194r0768q8840q4130
53291C548138p8723p5193p4191p4200p3462p1623o9486o7736o6204o4167o1037
53280B772116n6803n1924m6941m2200l7959l4585l2433l1310l0362k8742k6491
$$ y = [2130455, 2170331, 2212427, 2257286, 2305128, 2355520, 2407861, 2462229, 2519505, 2580472, 2645068, 2712715, 2782988, 2855593, 2930122, 3006653, 3086395, 3170656, 3258936, 3348927, 3438831, 3528806, 3619625, 3710871, 3801543, 3891791, 3982720, 4074491, 4165665, 4254583, 4340494, 4423200, 4502515, 4578511, 4651362, 4720256, 4783026, 4837775, 4884706, 4925652, 4961736, 4991996, 5014387, 5027556, 5031411, 5026441, 5013090, 4991722, 4962622, 4925680, 4880288, 4825911, 4762760, 4691756, 4613957, 4530358, 4442286, 4351598, 4260215, 4169478, 4079890, 3991103, 3902070, 3811876, 3721108, 3632268, 3548138, 3469415, 3394222, 3320031, 3245831, 3172369, 3100746, 3031260, 2963524, 2897320, 2833153, 2772116, 2715313, 2663389, 2616448, 2574248, 2536289, 2501704, 2469271, 2437961, 2407599, 2378857, 2352366]
53269B352366k4471k3307k2667k1819k0584j9306j7981j6098j3532j1118r915
53258B151568j0007j0334r632p509m753k585j318J04K845O563R842J2230J4755
53245B151769J7926K0490K1287K1465K3275K6990L0675L3038L4916L7291L9392
53234B458514L9897L9139L8783L9582M0456L9876L7354L3462K9072K4963K1786
53223B842884J9817J8533J6683J3134P852J815m089r812j5563k0929k5112k7931
53211B817282l0003l2087l4722l8280m2557m6372m8445m8896m9110m9907n0771
53200B346132n1185n1720n2995n4342n4451n2985n0774m8706m7165m6394m6527
53189A788888m7199m7625m7261m6061m4314m2493m1068l9986l8490l5882l2473
$$ y = [2352366, 2327895, 2304588, 2281921, 2260102, 2239518, 2220212, 2202231, 2186133, 2172601, 2161483, 2151568, 2141561, 2131227, 2121595, 2114086, 2109333, 2106748, 2105430, 2105534, 2108379, 2114942, 2124784, 2137014, 2151769, 2169695, 2190185, 2211472, 2232937, 2256212, 2283202, 2313877, 2346915, 2381831, 2419122, 2458514, 2498411, 2537550, 2576333, 2615915, 2656371, 2696247, 2733601, 2767063, 2796135, 2821098, 2842884, 2862701, 2881234, 2897917, 2911051, 2918903, 2920718, 2916629, 2906817, 2891254, 2870325, 2845213, 2817282, 2787279, 2755192, 2720470, 2682190, 2639633, 2593261, 2544816, 2495920, 2446810, 2396903, 2346132, 2294947, 2243227, 2190232, 2135890, 2081439, 2028454, 1977680, 1928974, 1881809, 1835415, 1788888, 1741689, 1694064, 1646803, 1600742, 1556428, 1513935, 1472867, 1432881, 1394391, 1358509, 1326036]
53178A326036k9354k7333k6324k5614k4398k2283j9692j7585j6456j5807j5022
53167A086168j4358j4537j5592j6845j7772j8299j8400j8141j8000j8344j8697
53156H97183j8360j7707j7837j8741j8893j7201j4488j2384j1468j1149j0815
53145G28140j0394j0086j0147j0670j1175j0954j0222j0270j1737j3444j3921
53134F05120j3457j3391j3685j2747r921o832n537o326p922r062r097p803n596
53121D83744l692l165l813m416m135l291k791l101l717l615k478j391j827l722
53107D38590n280n027l322j438n1O00P5j471k543j851k99J04q58j478r69n08q64
53090D13410q99L69J807J767N81k22l75r09k036k681k220j291o75m93o92j292
$$ y = [1326036, 1296682, 1269349, 1243025, 1217411, 1193013, 1170730, 1151038, 1133453, 1116997, 1101190, 1086168, 1071810, 1057273, 1041681, 1024836, 1007064, 988765, 970365, 952224, 934224, 915880, 897183, 878823, 861116, 843279, 824538, 805645, 788444, 773956, 761572, 750104, 738955, 728140, 717746, 707660, 697513, 686843, 675668, 664714, 654492, 644222, 632485, 619041, 605120, 591663, 578272, 564587, 551840, 541919, 535087, 529550, 523224, 515302, 506240, 497143, 489340, 483744, 480052, 476887, 473074, 468658, 464523, 461232, 458441, 455340, 451623, 448008, 445530, 444139, 442312, 438590, 433310, 428283, 424961, 423523, 423472, 424072, 424147, 422676, 420133, 418282, 417983, 418087, 417229, 415751, 414782, 414274, 413410, 412511, 412880, 414687, 416454, 417035, 416813, 416438, 415529, 413493, 410812, 408592, 407301, 406626, 406133, 405441, 404149]
53074D04149j919j964j473j091r86o59N9P14J166J849K807L314K889J951J002
53059D11808L9q33r66p0J129J758J751J390O33l71p66p4P23L11r63j425n00L99
53041D13973j10j454k033j465r38j405k329k500j623n51j08k41m85p39j170j510
53025C95312j130P2J282J504M53j376l133l870k890n44J508J545m77k832l850
53010C81574l458k716k312k086j786j445r29J58J602K325J669M43k19o34j948
52995C70238l731l870j457J610L006K846K757L001K383P86k11L79J448J360p8
52980C80467j815k940l201k827k300j846j016N41J942J806M17k30Q72K172J704
52965C73746j79j458j115N5R44J233J059N69L4j54K90J364K653L268K543R77k32
$$ y = [404149, 402230, 400266, 398793, 397702, 396716, 396057, 396116, 396830, 397996, 399845, 402652, 405966, 408855, 410806, 411808, 411847, 411014, 410048, 409978, 411107, 412865, 414616, 416006, 416639, 416268, 415502, 415428, 416151, 416462, 415499, 414074, 413574, 413973, 413863, 412409, 410376, 408911, 407973, 406568, 404239, 401739, 400116, 399565, 399457, 399216, 398731, 397992, 396822, 395312, 394182, 394254, 395536, 397040, 397493, 396117, 392984, 389114, 386224, 385680, 387188, 388733, 388256, 385424, 381574, 378116, 375400, 373088, 371002, 369216, 367771, 366842, 367000, 368602, 370927, 372596, 373039, 372820, 372186, 370238, 366507, 362637, 361180, 362790, 365796, 368642, 371399, 374400, 376783, 377569, 377358, 377737, 379185, 380545, 380467, 378652, 375712, 372511, 369684, 367384, 365538, 364522, 365063, 367005, 368811, 369228, 368998, 369870, 372042, 373746, 373567, 372109, 370994, 371049, 371993, 373226, 374285, 374854, 374888, 374734, 375024, 376388, 379041, 382309, 384852, 385829, 385597]
52948C85597p73j344j817p98K041M489M199J637q70k269l186l871l717k827k105
52933C74386j651p52L15L14o33o64J006K585K234P48K91J415K745L147K870K752
52917C91108L244M173M843M516L227J870J128Q22O03N58O04J40r08j402m50J001
52901D15077J171j78j409j085M96J836J649j50k183k528p78J011M22k268m339
52886D06744m042k501j692j866j950j551j121o38L83J484J264o71k731l196k388
52871C85528k057k927l770l169j320L89J081J112J236J584J623R29j38o06J33
52856C79628J471K032J169k79j078j087j175j766k192j595L1J936L340L819L354
52841C87608K384J500P92k96k073l751l994k362J20J931K382J779P38k67p61l21
$$ y = [385597, 384824, 383480, 381663, 380865, 382906, 387395, 391594, 393231, 392361, 390092, 386906, 383035, 379318, 376491, 374386, 372735, 371983, 372298, 372612, 371979, 371315, 372321, 374906, 377140, 377888, 378179, 379594, 382339, 385486, 388356, 391108, 394352, 398525, 403368, 407884, 411111, 412981, 414109, 414931, 415534, 416092, 416696, 416836, 415928, 414526, 414076, 415077, 416248, 416070, 414661, 413576, 414072, 415908, 417557, 417407, 415224, 412696, 411918, 412929, 413351, 411083, 406744, 402702, 400201, 398509, 396643, 394693, 393142, 392021, 391383, 391766, 393250, 394514, 393843, 391112, 387916, 385528, 383471, 380544, 376774, 373605, 372285, 372674, 373755, 374867, 376103, 377687, 379310, 380239, 380101, 379495, 379628, 381099, 383131, 384300, 384021, 382943, 381856, 380681, 378915, 376723, 375128, 375159, 377095, 380435, 384254, 387608, 389992, 391492, 392284, 391988, 389915, 386164, 382170, 379808, 379928, 381859, 384241, 386020, 386758, 386491, 385730, 385409]
52825C85409Q30J702J566R82J145K149K740K104J062R02J564J936J459N58l54
52810D05754j245j839j576n11M95P38L06k88m66K56J637K359J445j6m1J175J126
52793D09309j258l644l563k054j958l556m353k970j003n39j704l338m556m772
52779C70041l479j059J009J498N06j187k865l685k800n53J398J923J675J696J725
52764C65843R94j78q37r96j355j674q62J196L072L398K160J95j661k666k335j065
52748C63229K2K17j66m40k52L80J050J009O8o30J66J629J379j266l992m474l331
52731C54598k728l079k919j616k30L65O22J114J425Q89l08j204p87J234L715M406
52715C55497K205j097k566j639m20m90j203j588j912k258j543N18K082J703P86
$$ y = [385409, 386239, 387941, 389507, 390489, 391634, 393783, 396523, 398627, 399689, 400591, 402155, 404091, 405550, 406108, 405754, 404509, 402670, 401094, 400583, 401078, 401816, 402122, 401834, 401368, 401624, 403261, 405620, 407065, 407049, 407008, 408183, 409309, 408051, 404407, 400844, 398790, 396832, 393276, 388923, 385953, 384950, 384411, 382707, 379369, 374813, 370041, 366562, 365503, 366512, 368010, 368516, 367329, 364464, 360779, 357979, 357426, 358824, 360747, 362422, 364118, 365843, 366837, 366659, 365822, 364826, 363471, 361797, 360935, 362131, 365203, 368601, 370761, 370956, 369295, 366629, 364294, 363229, 363251, 363468, 363302, 362862, 362610, 362990, 364040, 365049, 365117, 364487, 364653, 366282, 367661, 366395, 362403, 357929, 354598, 351870, 348791, 345872, 344256, 344026, 344391, 345013, 346127, 347552, 348441, 348133, 346929, 346142, 347376, 351091, 355497, 357702, 356605, 354039, 352400, 351980, 351490, 350287, 348699, 346787, 344529, 342986, 343504, 345586, 347289, 348075]
52700C48075J351K506J778o12j686j51J895K419K153K567L224K877J777J118J161
52685C70452J431J950K674K441K96k483l352j620R12K523L242L529K898J022p93
52670C85122p59J035K565K378J228P67J285J510L37j929m092n073m284j834J000
52655C79256K183Q73j308j888m59J021R95K08K43J158J593P86m18o59L58J468
52639C85410J206m79j775r51J289K363J040j054j877j647j817k387k061p64j38
52624C76358j137k584k765j445L53J720K332K200J568P97N7n68p01q5N84J91j179
52607C75696k152k003j590j599j082R51L349L951K691J836K774M127L894K341
52593C93184J541K579M388N259M620L121J660O82N1p60k179m001n356n371l915
$$ y = [348075, 349426, 351932, 353710, 353098, 351412, 351261, 353156, 355575, 357728, 360295, 363519, 366396, 368173, 369291, 370452, 371883, 373833, 376507, 378948, 379244, 376761, 373409, 371789, 372701, 375224, 378466, 381995, 384893, 385915, 385122, 384363, 385398, 387963, 390341, 391569, 392336, 393621, 395131, 395468, 393539, 389447, 384374, 380090, 378256, 379256, 381439, 382312, 381004, 379116, 378657, 379678, 380673, 380881, 381124, 382282, 383875, 384661, 384243, 383584, 383942, 385410, 386616, 386137, 384362, 383411, 384700, 387063, 388103, 387049, 385172, 383525, 381708, 379321, 377260, 376496, 376358, 375221, 372637, 369872, 368427, 368780, 370500, 372832, 375032, 376600, 377397, 377454, 376886, 376185, 376100, 376684, 376875, 375696, 373544, 371541, 369951, 368352, 367270, 368221, 371570, 375521, 378212, 380048, 382822, 386949, 390843, 393184, 394725, 397304, 401692, 406951, 411571, 414692, 416352, 417034, 417085, 416325, 414146, 410145, 404789, 399418, 395503]
52578C95503j710J98J112J056N80J84p3l07l01L56J637K920L684L964L946L511
52562D16260K595J651J162R15K97p42j644k168k636l174l326k701j525l09M87
52547D05142M39m85j326q15Q50J775P56r86j434n42k0o82j396r52K56R68O49k01
52529D01996q37q66l37M16J140J875K640L169L306L357L464L048J789P48J166
52514D26074K225J645j086l624l818k364j264r18m33J53M6l34M29K205K883J250
52498D23069j166k153j615j121j449j862j643j169j148j575j784j293l97N0n06
52483D04238j563j898r07O47J521J340P49M30M31M33K20j52k94K15J157J489N22
52466D08578q84j173k17M22j85q60l0J911L205L234K989L076K719J260n38j439
$$ y = [395503, 393793, 393991, 395103, 396159, 396739, 396923, 396850, 396543, 396242, 396598, 398235, 401155, 404839, 408803, 412749, 416260, 418855, 420506, 421668, 422583, 422880, 422138, 420494, 418326, 415690, 412516, 409190, 406489, 404964, 404655, 405142, 405581, 405096, 403770, 402955, 403805, 405580, 406336, 405350, 403916, 403374, 403354, 402672, 401276, 400324, 400580, 401548, 402197, 401996, 401159, 400293, 399956, 400372, 401512, 403387, 406027, 409196, 412502, 415859, 419323, 422371, 424160, 424908, 426074, 428299, 429944, 428858, 425234, 421416, 419052, 417788, 416870, 416437, 416590, 416636, 416302, 416731, 418936, 421819, 423069, 421903, 419750, 418135, 417014, 415565, 413703, 412060, 410891, 409743, 408168, 406384, 405091, 404694, 404744, 404238, 402675, 400777, 399870, 400517, 402038, 403378, 404127, 404557, 404988, 405421, 405641, 405489, 405195, 405410, 406567, 408056, 408578, 407694, 406521, 406304, 406726, 406541, 405681, 405651, 407562, 410767, 414001, 416990, 420066, 422785, 424045, 423507, 422068]
52450D22068j138j7J716L820N446N766M950L831K934K365K207K165J296q35k955
52435D53619l249j807p70j754m047n741n717m096j696K99Q35K3p70l91Q50J851
52419D27439K033J470L25j008j666j125p1L21j29n94n28j14N73J803L324M026
52403D36079L184J537O79J541L699N843O682N719L618J689P14K60o11k134l649
52388D64850m486m678m711m836m856m472l585k265o98P52J547J265M7j401k338
52373D30135k601k615k712k568j496M96K425L441L952M843N684M790J667j627
52359D43814k607j263M04J263J899K649K607J320O2L40K057M097N880P319Q023
52344D77864P783P279P128O699N007K415J45j492l049m308m393l613l468m301
$$ y = [422068, 420930, 420913, 422629, 426449, 431895, 437661, 442611, 446442, 449376, 451741, 453948, 456113, 457409, 456574, 453619, 450370, 448563, 447793, 446039, 441992, 436251, 430534, 426438, 424742, 425041, 425876, 425899, 425129, 424738, 425588, 427439, 429472, 430942, 431267, 430259, 428593, 427468, 427397, 427718, 427589, 426995, 426467, 426353, 426926, 428729, 432053, 436079, 439263, 440800, 441479, 443020, 446719, 452562, 459244, 464963, 468581, 470270, 470984, 471244, 470633, 468499, 464850, 460364, 455686, 450975, 446139, 441283, 436811, 433226, 430961, 430263, 431015, 432562, 433827, 433874, 432473, 430135, 427534, 424919, 422207, 419639, 418143, 418639, 421064, 424505, 428457, 433300, 438984, 443774, 445441, 443814, 441207, 439944, 440348, 441611, 443510, 446159, 448766, 450086, 450148, 450488, 452545, 456642, 462522, 469841, 477864, 485647, 492926, 500054, 506753, 511760, 514175, 514320, 512828, 509779, 505471, 501078, 497465, 493997, 489696]
52330D89696m474k742j39J524J950J985J815R84j45l17R92K749L444K575Q60n80
52314E00177j061m90J074L600O522Q433Q276O802N898O196O499N979N598O228
52300E69731O604M888J685l61m2J066J117L88L00J206K265K865L130L283L410
52285F01535L742M510N474O106O278O415O957P990R389J0902J2122J2783J3222
52272G07425J4118J5579J6846J7373J7859J9575K2582K5312K6311K5960K5895
52261I34835K7055K8884L0311L0819L0496K9732K9104K9014K9070K8302K6297
52250A253919K3664K1154J8823J6480J4392J2957J2102J1569J1404J1626J1717
52239A419807J1103R818Q172O147L839K086J606J773J179o57l023n379p828j0133
$$ y = [489696, 485222, 482480, 482341, 483865, 485815, 487800, 489615, 490599, 490454, 490137, 491129, 493878, 497322, 499897, 500757, 500177, 499116, 498626, 499700, 503300, 509822, 518255, 526531, 533333, 539231, 545427, 551926, 557905, 563503, 569731, 576335, 581223, 582908, 582547, 582505, 583571, 584688, 585076, 585376, 586582, 588847, 591712, 594842, 598125, 601535, 605277, 609787, 615261, 621367, 627645, 634060, 641017, 649007, 658396, 669298, 681420, 694203, 707425, 721543, 737122, 753968, 771341, 789200, 808775, 831357, 856669, 882980, 908940, 934835, 961890, 990774, 1021085, 1051904, 1082400, 1112132, 1141236, 1170250, 1199320, 1227622, 1253919, 1277583, 1298737, 1317560, 1334040, 1348432, 1361389, 1373491, 1385060, 1396464, 1408090, 1419807, 1430910, 1440728, 1448900, 1455047, 1458886, 1460972, 1462578, 1464351, 1465530, 1464873, 1461850, 1456471, 1448643, 1438510]
52225A438510j1388j1021r276o394k473J542L959M320M325N847Q663J1172J2630
52212A450416J3521J4169J4312J4145J4625J6255J8288J9467J9167J7632J5551
52201A627548J3731J2755J2570J2502J1799J0144P725N064K872J781J894K554
52189A722939K721J700l95k888n198p150q755j0138j1728j3973j6525j8283j8746
52176A613581j8778j9278j9709j9025j7569j6579j6038j4694j2439j0781j0374
52165A438317r792p864n603m439l970k974j571o43l5R17J759J704J475K370L873
52150A413524M181L105K367K890L726M088M505N244N350M180K518J381Q74Q59
52136A458792J528K631L367L649M235N107N211M438M196M979N122L407J258O99
$$ y = [1438510, 1427122, 1416101, 1406825, 1400431, 1397958, 1399500, 1403459, 1407779, 1412104, 1417951, 1426614, 1437786, 1450416, 1463937, 1478106, 1492418, 1506563, 1521188, 1537443, 1555731, 1575198, 1594365, 1611997, 1627548, 1641279, 1654034, 1666604, 1679106, 1690905, 1701049, 1708774, 1713838, 1716710, 1718491, 1720385, 1722939, 1725660, 1727360, 1726965, 1724077, 1718879, 1711729, 1702974, 1692836, 1681108, 1667135, 1650610, 1632327, 1613581, 1594803, 1575525, 1555816, 1536791, 1519222, 1502643, 1486605, 1471911, 1459472, 1448691, 1438317, 1428525, 1420661, 1415058, 1410619, 1406649, 1403675, 1402104, 1401461, 1401426, 1402343, 1404102, 1405806, 1407281, 1409651, 1413524, 1417705, 1420810, 1423177, 1426067, 1429793, 1433881, 1438386, 1443630, 1448980, 1453160, 1455678, 1457059, 1457933, 1458792, 1460320, 1462951, 1466318, 1469967, 1474202, 1479309, 1484520, 1488958, 1493154, 1498133, 1503255, 1506662, 1507920, 1508619]
52122A508619J374J371J59j230k262l251m108m470m935o443q448r195p982n862
52108A453337m078k996k648k969l265k499m82J999M214N840O452N787M570M035
52094A467297M431M897M876M697M672M624M472M485M689M796M770M791M806M929
52080A533232N948Q319J0787J1425J0206R162R696J1047J1991J2683J4117J6696
52068A665309K0138K3952K7341K9462L0421L1452L3482L6145L8466L9840L9942
52057B015950L8644L6548L4806L3838L2926L1377K9245K6520K2823J8482J4736
52046B335895J1983Q922M489m63m598q149j2014j5539j6999j6159j4676j3759
52034B258933j2895j1327r657r244j0567j2748j4525j5344j5646j6087j6500j5951
$$ y = [1508619, 1509993, 1511364, 1511523, 1510293, 1508031, 1504780, 1500672, 1496202, 1491267, 1484824, 1476376, 1467181, 1459199, 1453337, 1449259, 1446263, 1443615, 1440646, 1437381, 1434882, 1434400, 1436399, 1440613, 1446453, 1452905, 1458692, 1463262, 1467297, 1471728, 1476625, 1481501, 1486198, 1490870, 1495494, 1499966, 1504451, 1509140, 1513936, 1518706, 1523497, 1528303, 1533232, 1539180, 1547499, 1558286, 1569711, 1579917, 1589079, 1598775, 1609822, 1621813, 1634496, 1648613, 1665309, 1685447, 1709399, 1736740, 1766202, 1796623, 1828075, 1861557, 1897702, 1936168, 1976008, 2015950, 2054594, 2091142, 2125948, 2159786, 2192712, 2224089, 2253334, 2279854, 2302677, 2321159, 2335895, 2347878, 2356800, 2361289, 2360826, 2356228, 2348079, 2336065, 2320526, 2303527, 2287368, 2272692, 2258933, 2246038, 2234711, 2225054, 2215810, 2205243, 2192495, 2177970, 2162626, 2146980, 2130893, 2114393, 2098442]
52022B098442j3985j1291q790o647m606k661p12J805N029P985R853J1380J3804
52009B099606J6649J8058J7387J6059J5398J4979J3788J1966J0394R258Q029O538
51997B258109N209M254L237J606p61l484n924p559q486r545j1583j4492j7264
51984B193317j9210k0769k2727k4935k6555k7545k8900l0875l1917l0578k7754
51973A901552k5551k4242k2156j8838j6302j6116j7026j6878j5608j4557j4046
51962A700232j3605j3917j6134j9254k0424j8494j5472j3710j3261j3024j3037
51951A529900j4141j6047j7331j7312j6934j7514j9116k0572k0949k0743k1180
51940A328061k2326k2596k0713j7697j5942j6461j7948j8458j7129j4300j1035
$$ y = [2098442, 2084457, 2073166, 2064376, 2057729, 2053123, 2050462, 2049750, 2051555, 2056584, 2064569, 2074422, 2085802, 2099606, 2116255, 2134313, 2151700, 2167759, 2183157, 2198136, 2211924, 2223890, 2234284, 2243542, 2251571, 2258109, 2263318, 2267572, 2270809, 2272415, 2271654, 2268170, 2262246, 2254687, 2246201, 2236656, 2225073, 2210581, 2193317, 2174107, 2153338, 2130611, 2105676, 2079121, 2051576, 2022676, 1991801, 1959884, 1929306, 1901552, 1876001, 1851759, 1829603, 1810765, 1794463, 1778347, 1761321, 1744443, 1728835, 1714278, 1700232, 1686627, 1672710, 1656576, 1637322, 1616898, 1598404, 1582932, 1569222, 1555961, 1542937, 1529900, 1515759, 1499712, 1482381, 1465069, 1448135, 1430621, 1411505, 1390933, 1369984, 1349241, 1328061, 1305735, 1283139, 1262426, 1244729, 1228787, 1212326, 1194378, 1175920, 1158791, 1144491, 1133456]
51929A133456q602p533p060o298n771o524p948q227p338p560j0131j3145j4155
51916A023164j3473j3191j3971j4599j4112j2725j0950r383r019j0177j1183r751
51904H80630n891k107k73M53K133N481R281J1659J1558R578P528O605O063M502
51890I47200K170O97M97O6j593l270l269j524J046M179P880J1322J3756J6021
51876I95178J9522K3860K7029K8028K7790K7162K5469K1654J5677Q150l58q823
51864A210338j5736k0507k4131k7476k9774l0023k9030k8537k8715k8215k6596
51853I21598k4933k3718k1946j9022j6086j4275j2948j0878q250o088m399k438
51841G56617l25J144K201L994O548Q333Q322P296O442N728M416K263n07l711o840
$$ y = [1133456, 1124854, 1117321, 1110261, 1103963, 1098192, 1091668, 1083720, 1075493, 1068155, 1060595, 1050464, 1037319, 1023164, 1009691, 996500, 982529, 967930, 953818, 941093, 930143, 920760, 911741, 901564, 890381, 880630, 874739, 872632, 872359, 872812, 874945, 880426, 889707, 901366, 912924, 922502, 930030, 936635, 942698, 947200, 949370, 950067, 950564, 950630, 949037, 945767, 942498, 940974, 942020, 946199, 954079, 965401, 979157, 995178, 1014700, 1038560, 1065589, 1093617, 1121407, 1148569, 1174038, 1195692, 1211369, 1219519, 1219161, 1210338, 1194602, 1174095, 1149964, 1122488, 1092714, 1062691, 1033661, 1005124, 976409, 948194, 921598, 896665, 872947, 851001, 831979, 815893, 801618, 788670, 777792, 769542, 763454, 759055, 756617, 756292, 757436, 759637, 763631, 770179, 778512, 786834, 794130, 800572, 806300, 810716, 812979, 812472, 808761, 801921]
51826H01921q834r193q765q559q123o241l034k64O48N4o60n51N34K385M611O645
51810G62574P882P882O473M055J741N48K39m60k146l844m379m062m168n013n537
51795G61785m906l509k086o90P79J847K058J921K273K936K883J748K69q53j684
51780G64771k423k973l590n044p411r330r375p843o385o101o589o749n880m033
51766F81045j823j7J066J595J541L85k029m699o222o103m894l348k037j411j514
51751F51535j777j707j485j333p88O35K508M059N136N598M534J559j552k418j155
51736F63349j38o25j530j923k542l840m558l607j879p81k67K95N31q8q88j058
51720F40451j075j453j123J029L684M301K492K86p78r18m74Q33K642L742L830
$$ y = [801921, 793087, 783894, 775129, 766570, 758447, 752206, 749172, 748908, 749556, 749610, 748950, 748399, 748933, 751318, 755929, 762574, 770456, 778338, 784811, 788866, 790607, 791155, 791394, 790934, 788788, 784944, 780565, 776503, 772335, 767322, 761785, 756879, 753370, 751284, 750594, 751373, 753220, 755278, 757199, 759472, 762408, 765291, 767039, 767308, 766455, 764771, 762348, 759375, 755785, 750741, 743330, 734000, 724625, 716782, 710397, 704296, 697707, 690958, 685078, 681045, 679222, 679205, 680271, 681866, 683407, 683792, 681763, 677064, 670842, 664739, 659845, 656497, 654460, 653049, 651535, 649758, 648051, 646566, 645233, 644445, 645080, 647588, 651647, 656783, 662381, 666915, 668474, 666922, 664504, 663349, 663211, 662586, 661056, 659133, 656591, 652751, 648193, 644586, 642707, 641926, 641659, 641954, 642485, 642397, 641509, 640451, 639376, 637923, 636800, 637829, 641513, 645814, 648306, 648592, 647814, 646896, 646422, 647255, 649897, 653639, 657469]
51705F57469M007N045O575Q411J0957J3587J4324J2275R080O651M715J939j487
51692G53548m109n562o984r003j0734j1166j0534r779r261q627p594o359n214
51679F48622m053k477l91J708L200L993M478M958N484N983O129N244L129R48L82
51664F87337J603K850K481P48r28j771k066k382l191m746o538p250o222m698m490
51649F50737n309m792j759J696K509N15j272l64K409M377M369L481K930K495J447
51634F63469M0p61n42K94J205J777J580N62n34r12q84j375k275k247p11R13P39
51617F60338j258l189l325j601P76K604L541M096M908N882O217N525M626M696
51603F93836N673O166N113L062J388N18m67k434m938o596o370m178o18L236O045
$$ y = [657469, 661476, 666521, 673096, 681507, 692464, 706051, 720375, 732650, 741730, 748381, 753096, 755035, 753548, 749439, 743877, 736893, 727890, 717156, 705990, 695456, 685677, 676416, 667789, 660195, 653836, 648622, 644569, 642092, 641701, 643409, 646609, 650602, 655080, 660038, 665522, 671505, 677634, 682878, 686007, 686955, 687337, 688940, 691790, 694271, 695019, 694091, 692320, 690254, 687872, 684681, 679935, 673397, 666147, 659925, 655227, 650737, 645428, 640636, 638877, 640573, 643082, 643597, 642325, 641961, 644370, 648747, 653116, 656597, 659527, 662022, 663469, 663509, 662748, 662206, 662500, 663705, 665482, 667062, 667624, 667090, 666178, 665294, 663919, 661644, 659397, 658686, 659599, 660338, 659080, 655891, 652566, 650965, 651741, 654345, 657886, 661982, 666890, 672772, 678989, 684514, 689140, 693836, 699509, 705675, 710788, 713850, 715238, 715756, 715289, 712855, 707917, 701321, 694951, 690773, 690155, 693391, 699436]
51588F99436P029O716O149N242K873j059m721o333o135n449m744l917l655m718
51574F86714o121n948m069k359j986k223k388k976l957l872k054k85n92k562m394
51559F40928n597o852p986q088p206o125m647j934J329L044K310M49r85j715j880
51544E95045j197K38J489J980K205K690L270L940N302P385R086R660R853J0555
51530F61501J1125J0105P086K922j290m559n996n497m036k397j82K912N636O456
51516F83786N952O315Q463J1163J3148J4587J5975J7039J7617J8497K0286K2218
51504H55046K2987K2287K0774J9119J7909J8063K0274K4151K8592L2900L6903
51493A119005M0173M1857M1319L8441L3245K5874J7043Q058R5o535j2430j8460
$$ y = [699436, 706465, 713181, 719330, 724572, 727445, 726386, 721665, 715332, 709197, 703748, 699004, 695087, 691432, 686714, 680593, 674645, 670576, 668217, 666231, 664008, 661620, 658644, 654687, 650815, 648761, 648476, 647884, 645322, 640928, 635331, 628479, 620493, 612405, 605199, 599074, 594427, 592493, 593822, 596866, 599176, 599625, 598640, 596925, 595045, 593848, 594086, 595575, 597555, 599760, 602450, 605720, 609660, 614962, 622347, 631433, 641093, 650946, 661501, 672626, 682731, 689817, 692739, 691449, 686890, 680894, 675397, 671361, 668964, 668782, 671694, 677330, 683786, 689738, 696053, 704516, 715679, 728827, 743414, 759389, 776428, 794045, 812542, 832828, 855046, 878033, 900320, 921094, 940213, 958122, 976185, 996459, 1020610, 1049202, 1082102, 1119005, 1159178, 1201035, 1242354, 1280795, 1314040, 1339914, 1356957, 1365015, 1365110, 1358575, 1346145, 1327685]
51481A327685k4778l0212l3111l3120l1630k9991k8002k5032k1969k0562k0907
51470A028371k1081j9753j7942j7391j8265j9331j9684j9257j8084j6207j4240
51459H27136j3066j2805j2670j2016j1092j0526j0414j0199r428q526q488r524
51447F98382j0307r356p056n278m847m611l665l049l887n090m743l202k540l018
51433F27733k429L25L141L514J869N10M22P94J005J210J151R9j686k841k692k106
51417F30019k156k790l402l798l956l573k743k438l376m612m460k903j943l010
51403E84859m922n402m066k619k209j972q94K08j64j610j934J4K906M720M998
51388E71913M663M542M979O333Q725J1308J2745J2600J1772J1360J1650J2232
$$ y = [1327685, 1302907, 1272695, 1239584, 1206464, 1174834, 1144843, 1116841, 1091809, 1069840, 1049278, 1028371, 1007290, 987537, 969595, 952204, 933939, 914608, 894924, 875667, 857583, 841376, 827136, 814070, 801265, 788595, 776579, 765487, 754961, 744547, 734348, 724920, 716394, 707906, 698382, 688075, 678719, 671663, 666385, 661538, 656927, 653262, 650213, 646326, 641236, 636493, 633291, 630751, 627733, 625304, 625629, 628770, 632284, 634153, 634663, 635085, 635879, 636884, 638094, 639245, 639344, 637658, 634817, 632125, 630019, 627863, 625073, 621671, 617873, 613917, 610344, 607601, 605163, 601787, 597175, 592715, 589812, 587869, 584859, 579937, 574535, 570469, 567850, 565641, 563669, 562775, 562983, 562819, 561209, 559275, 559289, 562195, 566915, 571913, 576576, 581118, 586097, 592430, 601155, 612463, 625208, 637808, 649580, 660940, 672590, 684822]
51376F84822J2570J2074J0144O727K906M35K65J505K030M18k781n857p759q777
51362G08722r449r540q562o877n666n741o682p206o331m292k414j784j984j508
51348F30686M11K848M420M814M612M123L292K501K414L020L614L883M177M559
51334F79374M468L852L833N424Q106J0409J1660J2407J3193J3853J4317J5401
51322G96297J8119K2391K6976L0813L3975L7058M0119M2892M5981N0695N6853
51311A202169O1414O0636N3845M4083L4689K6204J7374P963r90r309j8161k7944
51299A451973l7058m3698m7842n0508n1862n1400m9526m7515m5808m3589m0275
51288I42892l6309l2108k7484k2656j8741j6372j4839j3453j2765j3153j3251
$$ y = [684822, 697392, 709466, 719610, 726337, 729243, 729678, 729943, 731448, 733478, 733896, 731115, 725258, 717499, 708722, 699273, 689733, 681171, 674294, 668628, 662887, 656205, 648999, 642668, 638376, 635962, 634178, 632194, 630686, 631097, 633945, 638365, 643179, 647791, 651914, 655206, 657707, 660121, 663141, 666755, 670638, 674815, 679374, 683842, 687694, 691527, 696951, 705057, 715466, 727126, 739533, 752726, 766579, 780896, 796297, 814416, 836807, 863783, 894596, 928571, 965629, 1005748, 1048640, 1094621, 1145316, 1202169, 1263583, 1324219, 1378064, 1422147, 1456836, 1483040, 1500414, 1508377, 1507387, 1498078, 1479917, 1451973, 1414915, 1371217, 1323375, 1272867, 1221005, 1169605, 1120079, 1072564, 1026756, 983167, 942892, 906583, 874475, 846991, 824335, 805594, 789222, 774383, 760930, 748165, 735012, 721761]
51277G21761j1451q486o622o404o102m670l264l112l643l855m098n119o420o979
51263F41536o844o678o334n263l848l051k989l050l050l053k447o67J330J901
51249E97493J105O47J178J313m8k000l173l606l879l444j447J319K848K307P91
51234E91404m94j634l117m326l895j488J424K997K953K598K906L322L003K563
51220E98216L382N370O656N988M323L298K997K240O79n75m87N94J470J500J143
51205F36794J152J490J330K43r88j342j098j488k753l683l555l349m118n065m574
51190F08996k661r74n51q59j192j698k542l150k912j919n81Q14J733J449J80n87
51174E93546J84J409J029j323l702m067k340J4J651K113J396k77k248l555l653
$$ y = [721761, 710310, 701824, 695202, 688798, 682696, 678026, 674762, 671650, 668007, 664152, 660054, 654935, 648515, 641536, 634692, 628014, 621680, 616417, 612569, 609518, 606529, 603479, 600429, 597376, 594929, 594262, 595592, 597493, 598598, 599245, 600423, 601736, 601688, 599688, 596515, 592909, 589030, 585586, 584139, 585458, 588306, 590613, 591404, 590910, 589276, 586159, 581833, 577938, 576450, 577874, 580871, 583824, 586422, 589328, 592650, 595653, 598216, 601598, 606968, 613624, 619612, 623935, 627233, 630230, 632470, 633149, 632574, 632087, 632681, 634151, 635651, 636794, 637946, 639436, 640766, 641009, 640021, 638679, 637581, 636093, 633340, 629657, 626102, 622753, 618635, 613570, 608996, 606335, 605361, 604810, 603951, 602759, 601061, 598519, 595369, 592457, 590538, 589957, 590771, 592504, 593953, 594133, 593546, 593730, 595139, 596168, 594845, 591143, 587076, 584736, 584750, 586401, 588514, 589910, 589633, 587385, 583830, 580177]
51159E80177k856j901j254r16n92J38J624L664N261N327L741J526j47p43k51J187
51143E93985L117M685N203M783M061L459K967K566K488K968L848M309L139r5l966
51128F37517n930m835k232n52m68q45p25j50P49J981K806K102K57o27O75K719
51112F32442L215J775k52j931l300m175l929k670j438q87n83M2Q39J353J459J240
51096F23200P27J1p65j570k280k318j224L73J138N54o13j490j951k088j701q11
51080F09192Q3P89J685K807L377K904J923J013j38j704k650j848J71J806K462
51065F21872K848L450L911L930L587K701J027o94j111j03Q53P13K32O89K071L304
51049F49280L644L180K419J962K205K883L368L571L910M157L376J604M89J235
$$ y = [580177, 577321, 575420, 574166, 573250, 572658, 572796, 574420, 578084, 583345, 588672, 592413, 593939, 593792, 593049, 592798, 593985, 597102, 601787, 606990, 611773, 615834, 619293, 622260, 624826, 627314, 630282, 634130, 638439, 641578, 641483, 637517, 631587, 626752, 624520, 623968, 623500, 622655, 621930, 621780, 622529, 624510, 627316, 629418, 629675, 629048, 629723, 632442, 635657, 637432, 637180, 635249, 631949, 627774, 623845, 621175, 619737, 618850, 618267, 618309, 619148, 620501, 621960, 623200, 623927, 623938, 623173, 621603, 619323, 617005, 615781, 616154, 617292, 617846, 617233, 615743, 613792, 611704, 610003, 609192, 609275, 610064, 611749, 614556, 617933, 620837, 622760, 623773, 623635, 621931, 619281, 617433, 617604, 619410, 621872, 624720, 628170, 632081, 636011, 639598, 642299, 643326, 642632, 641521, 641418, 642271, 642984, 643216, 643905, 645976, 649280, 652924, 656104, 658523, 660485, 662690, 665573, 668941, 672512, 676422, 680579, 683955, 685559, 686048, 687283]
51035F87283K791L336K852K775L473L710K716J333O33N82O31P35J024J195R56
51020G16025O76Q99J524K006K182K394K810L031K553J458O10R80K654M617N857
51005G50276O552P644R212J0148R893R757J1587J5366J9089K1145K1800K1881
50993I14350K0956J7993J3527R885Q763R447J0048R780R115Q226O477L643N24
50980A042734k110m546p411j0378j2180j1846r703p209n980o687q653j0681j2247
50967I33103j3567j4626j4725j3269j0554p491m841k754p22J931M994P084P276
50954H71839O755P576R854J1761J2523J3489J5365J6503J5518J3849J3582J4172
50942A022786J3692J2406J2318J3464J3488J1212Q103N585L248P52o30J38J997
$$ y = [687283, 690074, 693410, 696262, 699037, 702510, 706220, 708936, 710269, 710902, 711484, 712115, 712850, 713874, 715069, 716025, 716701, 717600, 719124, 721130, 723312, 725706, 728516, 731547, 734100, 735558, 736168, 737148, 739802, 744419, 750276, 756828, 764472, 773684, 783832, 793725, 803482, 815069, 830435, 849524, 870669, 892469, 914350, 935306, 953299, 966826, 976711, 985474, 994921, 1004969, 1014749, 1023864, 1032090, 1038567, 1042210, 1042734, 1040624, 1036078, 1028667, 1018289, 1006109, 994263, 984560, 977351, 971371, 964684, 956031, 945350, 933103, 919536, 904910, 890185, 876916, 866362, 858871, 854030, 851276, 850554, 852485, 857479, 864563, 871839, 878594, 886170, 896024, 907785, 920308, 933797, 949162, 965665, 981183, 995032, 1008614, 1022786, 1036478, 1048884, 1061202, 1074666, 1088154, 1099366, 1107469, 1113054, 1116302, 1117054, 1116424, 1116562, 1118559]
50929A118559L208L539L853M596N777P646J0261J3082J5705J8262K0445K1213
50917A246146K0393J9470J9764K0790K1530K2431K4760K8702L3318L8008M2809
50906A538121M7654N2398N7267O2319O6851P0282P3198P6496P9953Q2594Q4021
50895B291154Q4285Q2966P9650P5042P0220O4895N7775M8738L9495L1716K5567
50884B951503K0161J4676Q844L251p48k396k919m734q844j3923j8142k1036k3229
50871B902464k5228k7116k8869l0475l2090l4332l7871m2376m6359m8583m9487
50860B499678n0755n3537n7190n9858o0276n8909n7016n4849n1601m7350m3938
50849A904399m2816m2798m1304l7586l3339l0153k7861k5771k4080k3112k2195
$$ y = [1118559, 1121767, 1125306, 1129159, 1133755, 1139532, 1147178, 1157439, 1170521, 1186226, 1204488, 1224933, 1246146, 1266539, 1286009, 1305773, 1326563, 1348093, 1370524, 1395284, 1423986, 1457304, 1495312, 1538121, 1585775, 1638173, 1695440, 1757759, 1824610, 1894892, 1968090, 2044586, 2124539, 2207133, 2291154, 2375439, 2458405, 2538055, 2613097, 2683317, 2748212, 2805987, 2854725, 2894220, 2925936, 2951503, 2971664, 2986340, 2995184, 2998435, 2997687, 2995291, 2992372, 2987638, 2978794, 2964871, 2946729, 2925693, 2902464, 2877236, 2850120, 2821251, 2790776, 2758686, 2724354, 2686483, 2644107, 2597748, 2549165, 2499678, 2448923, 2395386, 2338196, 2278338, 2218062, 2159153, 2102137, 2047288, 1995687, 1948337, 1904399, 1861583, 1818785, 1777481, 1739895, 1706556, 1676403, 1648542, 1622771, 1598691, 1575579, 1553384]
50838A553384k0340j7717j5528j4540j4189j3153j0625p139m275l186l404l383
50826A425905k262n80P64J643K486L515M581N506O199O665P099P852R236J1385
50812A489994J4173J7018J9084K0079K0785K2269K4753K7638L0479L3335L6348
50801A755955L9618M3418M7882N2575N7033O1518O6546P1926P7263Q3213R1074
50790B448021J00890J11139J20622J29684J39085J48628J57470J65196J71940
50781C692675J77870J82763J85814J85954J82893J77393J69614J57741J39952
50772E252669J17517R4062P1575M9231K6679N959j1210k5766l8993m9610n5549
50761E436564n7219n6626n4161m8963m2020l6179l3033l2101l3364l8036m6172
$$ y = [1553384, 1533044, 1515327, 1499799, 1485259, 1471070, 1457917, 1447292, 1440153, 1435878, 1432692, 1429288, 1425905, 1423643, 1423063, 1423827, 1425470, 1427956, 1431471, 1436052, 1441558, 1447757, 1454422, 1461521, 1469373, 1478609, 1489994, 1504167, 1521185, 1540269, 1560348, 1581133, 1603402, 1628155, 1655793, 1686272, 1719607, 1755955, 1795573, 1838991, 1886873, 1939448, 1996481, 2057999, 2124545, 2196471, 2273734, 2356947, 2448021, 2548911, 2660050, 2780672, 2910356, 3049441, 3198069, 3355539, 3520735, 3692675, 3870545, 4053308, 4239122, 4425076, 4607969, 4785362, 4954976, 5112717, 5252669, 5370186, 5464248, 5535823, 5585054, 5611733, 5617692, 5606482, 5580716, 5541723, 5492113, 5436564, 5379345, 5322719, 5268558, 5219595, 5177575, 5141396, 5108363, 5076262, 5042898, 5004862, 4958690]
50750D958690n5815o5649p6489q8968j01500j12156j21150j29692j37354j42426
50740C927491j44285j43771j41257j36011j27772j17777j07706r8320q9420q0588
50730B740584p1566o2318n3141m4604l7207l1209k6623k3238k0613j8265j5888
50719B335912j3458j1303j0077j0272j1492j2576j2848j2847j3402j4282j4599
50708B198756j4479j5353j8097k1532k3660k4099k4350k5543k6862k6763k5097
50697A952921k3107k1621k0215j8253j5836j3262j0339o810k926R98N163R796
50685A836509J4476J8630K2377K6149K9794L2993L6395M1110M6973N2383N6281
50674B214070N9312O2518O6019O9728P4389Q0523Q6796R0921R2299R2648R3546
$$ y = [4958690, 4902875, 4837226, 4760737, 4671769, 4570269, 4458113, 4336963, 4207271, 4069917, 3927491, 3783206, 3639435, 3498178, 3362167, 3234395, 3116618, 3008912, 2910592, 2821172, 2740584, 2669018, 2606700, 2553559, 2508955, 2471748, 2440539, 2413916, 2390678, 2370065, 2351800, 2335912, 2322454, 2311151, 2301074, 2290802, 2279310, 2266734, 2253886, 2241039, 2227637, 2213355, 2198756, 2184277, 2168924, 2150827, 2129295, 2105635, 2081536, 2057186, 2031643, 2004781, 1978018, 1952921, 1929814, 1908193, 1887978, 1869725, 1853889, 1840627, 1830288, 1823478, 1820552, 1821550, 1826713, 1836509, 1850985, 1869615, 1891992, 1918141, 1947935, 1980928, 2017323, 2058433, 2105406, 2157789, 2214070, 2273382, 2335900, 2401919, 2471647, 2546036, 2626559, 2713355, 2804276, 2896575, 2989223, 3082769]
50663C082769R4365R3341R0049Q5785Q1558P6635O9461N9468M7374L3922J9150
50652C833877L200j2770k7001l8299m6184n0304n0497m7652m3595l9641l5648
50641C445486l0875k5283j9652j4882j1789j1100j2996j6851k2006k8548l6638
50630C214866m5399n3260n9439o4153o7331o8166o6430o3268n9911n6112n0715
50619B560682m3497l5601k8202k1385j4496o995J165R595J7561K4325K9605L3667
50607B526424L6983L9808M1984M2870M1713L8626L5279L3923L5227L7465L8439
50596B948741L8085L8457M0988M4596M7157M8461N0575N5026O0531O4508O6435
50585C503560O8546P2984P9144Q4550Q7726Q9342R0815R2675R4389R5054R4094
$$ y = [3082769, 3177134, 3270475, 3360524, 3446309, 3527867, 3604502, 3673963, 3733431, 3780805, 3814727, 3833877, 3837077, 3824307, 3797306, 3759007, 3712823, 3662519, 3612022, 3564370, 3520775, 3481134, 3445486, 3414611, 3389328, 3369676, 3354794, 3343005, 3331905, 3318909, 3302058, 3280052, 3251504, 3214866, 3169467, 3116207, 3056768, 2992615, 2925284, 2857118, 2790688, 2727420, 2667509, 2611397, 2560682, 2517185, 2481584, 2453382, 2431997, 2417501, 2410506, 2411671, 2421266, 2438827, 2463152, 2492757, 2526424, 2563407, 2603215, 2645199, 2688069, 2729782, 2768408, 2803687, 2837610, 2872837, 2910302, 2948741, 2986826, 3025283, 3066271, 3110867, 3158024, 3206485, 3257060, 3312086, 3372617, 3437125, 3503560, 3572106, 3645090, 3724234, 3808784, 3896510, 3985852, 4076667, 4169342, 4263731, 4358785, 4452879]
50574D452879R1691Q8691Q5482Q1024P3751O3751N3226M4253L6876K9947K2856
50563E124427J5008M152j2519l4580n6794p2612p9162p8221p3025o5424n6075
50552D615175m5798l5555k5617j5831o784M6L607M047J824l592j3391k7791m5122
50539D405218o2687p8333r1262j01709j10024j15976j18930j18843j16822j14270
50529C376362j11503j07754j02688r7273r2635q8445q3093p5508o6392n7517n0097
50518B443457m4074l8791l3916k9474k5146k0289j4895j0029o617m147j362K060
50506B216777N493Q967J3417J8949K4108K7688L0249L3015L6187L9423M2951M6863
50494B544087N0037N1397N1828N3231N5868N8330O0056O1971O4372O6175O7079
$$ y = [4452879, 4544570, 4633261, 4718743, 4799767, 4873518, 4937269, 4990495, 5034748, 5071624, 5101571, 5124427, 5139435, 5143587, 5131068, 5096488, 5039694, 4967082, 4887920, 4809699, 4736674, 4671250, 4615175, 4569377, 4533822, 4508205, 4492374, 4485590, 4485636, 4489243, 4493290, 4495114, 4491522, 4478131, 4450340, 4405218, 4342531, 4264198, 4172936, 4071227, 3961203, 3845227, 3726297, 3607454, 3490632, 3376362, 3264859, 3157105, 3054417, 2957144, 2864509, 2776064, 2692971, 2617463, 2551071, 2493554, 2443457, 2399383, 2360592, 2326676, 2297202, 2272056, 2251767, 2236872, 2226843, 2220226, 2216079, 2214717, 2216777, 2222270, 2231237, 2244654, 2263603, 2287711, 2315399, 2345648, 2378663, 2414850, 2454273, 2497224, 2544087, 2594124, 2645521, 2697349, 2750580, 2806448, 2864778, 2924834, 2986805, 3051177, 3117352, 3184431]
50483C184431O8660P2103P6309P9769Q3221Q8824R7233J07027J16815J26522J36674
50472D237588J47580J59440J72277J85526J98274K10051K20839K30348K37935
50463E999858K43331K46819K48456K47556K43161K34733K22182K05402J83932
50454H075430J57273J25846R1579N6886K2637j2266m8675q4946j17630j44132
50444H122002j64055j78090j86561j89195j85538j75270j58498j36220j10250
50435F638325q2561n4671k7610k221K0365L8312M9359N1907M5653L0933P900k2825
50423F692866n8856r6345j31851j63356j89433k08505k19768k24375k24771k22597
50413D953009k17730k09461j98163j85412j72738j60807j49847j40141j31395
$$ y = [3184431, 3253091, 3325194, 3401503, 3481272, 3564493, 3653317, 3750550, 3857577, 3974392, 4100914, 4237588, 4385168, 4544608, 4716885, 4902411, 5100685, 5310736, 5531575, 5761923, 5999858, 6243189, 6490008, 6738464, 6986020, 7229181, 7463914, 7686096, 7891498, 8075430, 8232703, 8358549, 8450128, 8507014, 8529651, 8517385, 8468710, 8383764, 8266134, 8122002, 7957947, 7779857, 7593296, 7404101, 7218563, 7043293, 6884795, 6748575, 6638325, 6555764, 6501093, 6473483, 6471262, 6491627, 6529939, 6579298, 6631205, 6676858, 6707791, 6715691, 6692866, 6634010, 6537665, 6405814, 6242458, 6053025, 5844520, 5624752, 5400377, 5175606, 4953009, 4735279, 4525818, 4327655, 4142243, 3969505, 3808698, 3658851, 3518710, 3387315]
50404C387315j22178j11166r9158q8782q1513p5828o9140o0809n2233m4526l7580
50393B544402l1347k6414k2714j8892j3824q037k752J823O320J0685J3963J5779
50381B468992J7113J9048K1158K1803K0016J6588J3046R941O759L489J474K149
50369B621576N329R391J3061J6305J9556K2856K6051K9297L2855L6716M0831M5464
50357B919288N0953N7273O4088P1239P8853Q7029R5556J03982J11874J18922J24723
50346C883780J28622J29988J28852J25865J21358J14802J05712R4775Q3189P0812
50336D987755N5864L6957J4827q366l0979n2573p3061r1826j07558j18621j23889
50325D488530j23748j20038j14338j06364r4765p9491o2658m6715l2449j9194
$$ y = [3387315, 3265137, 3153971, 3054813, 2966031, 2884518, 2808690, 2739550, 2678741, 2626508, 2581982, 2544402, 2513055, 2486641, 2463927, 2445035, 2431211, 2423174, 2420422, 2422245, 2428565, 2439250, 2453213, 2468992, 2486105, 2505153, 2526311, 2548114, 2568130, 2584718, 2597764, 2607705, 2614464, 2617953, 2619427, 2621576, 2626905, 2636296, 2649357, 2665662, 2685218, 2708074, 2734125, 2763422, 2796277, 2832993, 2873824, 2919288, 2970241, 3027514, 3091602, 3162841, 3241694, 3328723, 3424279, 3528261, 3640135, 3759057, 3883780, 4012402, 4142390, 4271242, 4397107, 4518465, 4633267, 4738979, 4833754, 4916943, 4987755, 5043619, 5080576, 5095403, 5087037, 5056058, 5003485, 4930424, 4838598, 4731040, 4612419, 4488530, 4364782, 4244744, 4130406, 4024042, 3929277, 3849786, 3787128, 3740413, 3707964, 3688770]
50315C688770o562M740J3492J8719J9840J6599R039k610j7846l5323n2695o7799
50303C588364q0126r0476r8926j04087j04842j02092r7876r3298q8280q2981p8150
50292B567230p3870o9123o3208n6936n2002m9661n0224n3007n6231n7636n5956
50281A929376n1618m5774l9266l2900k7796k4451k1828j8406j4032j0041p492
50270A635772o007m476k472p63m81j741l172l224j934o93j98K88J266J884J478
50255A615527Q94J053J175J84r42m19J215J556J55n52J095L617M986N633P086
50240A642263R092J0221J0621J1974J4817J7750J9572K0819K2582K4908K7107
50229A831726K8869L0466L2231L4457L7514M1203M3629M1232L0969J3359o678
$$ y = [3688770, 3682208, 3686948, 3700440, 3719159, 3738999, 3755598, 3764637, 3762027, 3744181, 3708858, 3656163, 3588364, 3508238, 3417762, 3318836, 3214749, 3109907, 3007815, 2909939, 2816641, 2728361, 2645380, 2567230, 2493360, 2424237, 2361029, 2304093, 2252091, 2202430, 2152206, 2099199, 2042968, 1985332, 1929376, 1877758, 1831984, 1792718, 1759818, 1732022, 1707571, 1685743, 1667337, 1653305, 1643264, 1635772, 1629765, 1625289, 1622817, 1622054, 1621573, 1619832, 1616660, 1613436, 1611502, 1610809, 1610611, 1610899, 1612165, 1614049, 1615527, 1616421, 1617474, 1618649, 1618833, 1617891, 1617472, 1618687, 1620243, 1620398, 1619846, 1620941, 1624558, 1629544, 1635177, 1642263, 1651355, 1661576, 1672197, 1684171, 1698988, 1716738, 1736310, 1757129, 1779711, 1804619, 1831726, 1860595, 1891061, 1923292, 1957749, 1995263, 2036466, 2080095, 2121327, 2152296, 2165655, 2158977]
50218B158977k2855l1975l5467l6640l7131l6288l3240k8511k3669j9978j7631
50207A835592j5957j4113j1663q586n016j253K080M521O487R025J2499J5965J8175
50194A847756J8777J8328J7566J7194J7736J8988J9808J9198J7412J5351J3095
50183B041209R769N034j42m686q829j3595j8939k3141k4573k3678k2488k2074
50171A893867k1304j8764j5300j3686j5803k1073k7730l4421m0175m3831m4615
50160A597165m2982m0165l7063l3986l1092k8419k5702k2674j9514j6645j4298
50149A284625j2503j1180r964q353o432m998m520m501m420m727o050p768q383
50136A190826p299n423l916l083k634k399k484l102m343n916p156p621p513p137
$$ y = [2158977, 2136122, 2104147, 2068680, 2032040, 1994909, 1958621, 1925381, 1896870, 1873201, 1853223, 1835592, 1819635, 1805522, 1793859, 1785273, 1780257, 1779004, 1781084, 1785605, 1792092, 1801117, 1813616, 1829581, 1847756, 1866533, 1884861, 1902427, 1919621, 1937357, 1956345, 1976153, 1995351, 2012763, 2028114, 2041209, 2050978, 2056012, 2055870, 2051184, 2042355, 2028760, 2009821, 1986680, 1962107, 1938429, 1915941, 1893867, 1872563, 1853799, 1838499, 1824813, 1809010, 1787937, 1760207, 1725786, 1685611, 1641780, 1597165, 1554183, 1514018, 1476955, 1442969, 1411877, 1383458, 1357756, 1335082, 1315568, 1298923, 1284625, 1272122, 1260942, 1250978, 1242625, 1236193, 1231195, 1226675, 1222174, 1217754, 1213027, 1206977, 1199209, 1190826, 1183527, 1178104, 1174188, 1171105, 1168471, 1166072, 1163588, 1160486, 1156143, 1150227, 1143071, 1135450, 1127937, 1120800]
50122A120800o318m935l730l606m202m165l035j908j738j818p45J573L707M449
50108A094329M079L747L995M276L853K918K539L500N482P600R416J1030J2417
50095A169181J3397J4319J6144J9348K3078K5832K7030K7598K8960L1611L4806
50084A431304L7554L9619M1376M2888M3710M3646M3166M2643M1676L9777L7502
50073A884861L6190L6495L7779L8934L9119L7590L3478K6419J7133O981l038j2575
50061B179366k1445k9209l5391l9906m3066m5165m6119m5672m3893m1350l8709
$$ y = [1120800, 1114482, 1109547, 1105817, 1102211, 1098009, 1093844, 1090809, 1088901, 1087163, 1085345, 1084600, 1086173, 1089880, 1094329, 1098408, 1102155, 1106150, 1110426, 1114279, 1117197, 1119736, 1123236, 1128718, 1136318, 1145734, 1156764, 1169181, 1182578, 1196897, 1213041, 1232389, 1255467, 1281299, 1308329, 1335927, 1364887, 1396498, 1431304, 1468858, 1508477, 1549853, 1592741, 1636451, 1680097, 1723263, 1765906, 1807582, 1847359, 1884861, 1921051, 1957546, 1995325, 2034259, 2073378, 2110968, 2144446, 2170865, 2187998, 2194979, 2191941, 2179366, 2157921, 2128712, 2093321, 2053415, 2010349, 1965184, 1919065, 1873393, 1829500, 1788150, 1749441]
$$ [...]
##END NTUPLES=NMR SPECTRUM
##END=
