
##TITLE=UV1031_TOFR01-ROVE100A_6099335_rKhOTGkKPq
##JCAMPDX= 6.0         $$ Bruker NMR JCAMP-DX V2.0
##DATA TYPE= NMR SPECTRUM
##DATA CLASS= NTUPLES
##ORIGIN= BRUKER
##OWNER= Administrator
$$ 1.72 TOPSPIN		Version 2.1
$$ 2012-05-12 20:41:19.203 -0500  Administrator@TOPSPIN
$$ Compression mode = diff/dup
##.OBSERVE FREQUENCY= 400.13188235
##.OBSERVE NUCLEUS= ^1H
##.ACQUISITION MODE= SIMULTANEOUS (DQD)
##.ACQUISITION SCHEME= undefined
##.AVERAGES= 8
##.DIGITISER RES= 22
##SPECTROMETER/DATA SYSTEM= spect
##.PULSE SEQUENCE= zg30
##.SOLVENT NAME= COFFEE_meoh
##.SHIFT REFERENCE= INTERNAL, COFFEE_meoh, 1, 14.98061
##AUDIT TRAIL= $$ (NUMBER, WHEN, WHO, WHERE, PROCESS, VERSION, WHAT)
$$ ##TITLE= Audit trail, TOPSPIN		Version 2.1
$$ ##JCAMPDX= 5.01
$$ ##ORIGIN= Bruker BioSpin GmbH
$$ ##OWNER= Administrator
$$ $$ C:\Bruker\TOPSPIN/data/COFFEE/nmr/UV1031_TOFR01-ROVE100A_6099335_rKhOTGkKPq/10/pdata/1/auditp.txt
$$ ##AUDIT TRAIL=  $$ (NUMBER, WHEN, WHO, WHERE, PROCESS, VERSION, WHAT)
(   1,<2012-05-12 20:41:11.937 -0500>,<Administrator>,<TOPSPIN>,<go>,<TOPSPIN 2.1>,
      <created by zg
	started at 2012-05-12 20:40:04.906 -0500,
	POWCHK enabled, PULCHK disabled,
       configuration hash MD5:
       AF F2 23 6B 01 CD 40 DD E5 A1 38 A0 06 EA F7 77
       data hash MD5: 64K
       08 9C 1D 1D 94 49 FD 8B 0F 4C EB 59 8E 48 8E 78>)
(   2,<2012-05-12 20:41:15.000 -0500>,<Administrator>,<TOPSPIN>,<proc1d>,<TOPSPIN 2.1>,
      <Start of raw data processing
       efp LB = 0 FT_mod = 6 PKNL = 1 PHC0 = 0 PHC1 = 0 SI = 32K 
       data hash MD5: 32K
       D6 5F 5C 5D 10 5E BA 21 57 AC 5F 5F F2 01 61 7B>)
(   3,<2012-05-12 20:41:15.343 -0500>,<Administrator>,<TOPSPIN>,<proc1d>,<TOPSPIN 2.1>,
      <pk PHC0 = 212.1515 PHC1 = 0 
       data hash MD5: 32K
       03 62 70 35 41 3C 14 72 AC 7A 49 D2 AB CA 5D 89>)
(   4,<2012-05-12 20:41:15.421 -0500>,<Administrator>,<TOPSPIN>,<proc1d>,<TOPSPIN 2.1>,
      <abs ABSG = 1 
       data hash MD5: 32K
       9D C8 7B 3A A2 E8 2E 18 A9 97 CE AE D9 D2 F5 79>)
(   5,<2012-05-12 20:41:15.453 -0500>,<Administrator>,<TOPSPIN>,<proc1d>,<TOPSPIN 2.1>,
      <abs ABSG = 2 
       data hash MD5: 32K
       BE 90 0E 8B 73 DA 97 24 EE 66 F7 88 F7 02 B1 12>)
(   6,<2012-05-12 20:41:15.484 -0500>,<Administrator>,<TOPSPIN>,<proc1d>,<TOPSPIN 2.1>,
      <abs ABSG = 3 
       data hash MD5: 32K
       13 62 10 3A E0 36 23 79 02 A4 EE 8B CC 44 47 1B>)
(   7,<2012-05-12 20:41:15.515 -0500>,<Administrator>,<TOPSPIN>,<proc1d>,<TOPSPIN 2.1>,
      <abs ABSG = 4 
       data hash MD5: 32K
       F1 8E E0 21 4F D7 F8 27 BE 32 28 C6 C1 B5 D0 6D>)
(   8,<2012-05-12 20:41:15.578 -0500>,<Administrator>,<TOPSPIN>,<proc1d>,<TOPSPIN 2.1>,
      <abs ABSG = 5 
       data hash MD5: 32K
       80 FC BA 58 7A 90 74 25 9A CD 27 21 2B CD 2D 5D>)
$$ ##END=
$$ 
$$ $$ hash MD5
$$ $$ DB 4E B3 45 A5 9C 57 03 9E 44 C1 18 DD 02 C2 72
##$RELAX= 
##$RELAX= 
##$RELAX= 
##$RELAX= 
##$RELAX= 
##$RELAX= 
##$RELAX= 
$$ Bruker specific parameters
$$ --------------------------
$$ [...]
##$TP= (0..7)
150 150 150 150 150 150 150 150
##$TP07= 0
##$TPNAME0= <>
##$TPNAME1= <>
##$TPNAME2= <>
##$TPNAME3= <>
##$TPNAME4= <>
##$TPNAME5= <>
##$TPNAME6= <>
##$TPNAME7= <>
##$TPOAL= (0..7)
0.5 0.5 0.5 0.5 0.5 0.5 0.5 0.5
##$TPOFFS= (0..7)
0 0 0 0 0 0 0 0
##$TUNHIN= 0
##$TUNHOUT= 0
##$TUNXOUT= 0
##$USERA1= <user>
##$USERA2= <user>
##$USERA3= <user>
##$USERA4= <user>
##$USERA5= <user>
##$V9= 5
##$VALIST= <valist>
##$VCLIST= <CCCCCCCCCCCCCCC>
##$VD= 0
##$VDLIST= <DDDDDDDDDDDDDDD>
##$VPLIST= <PPPPPPPPPPPPPPP>
##$VTLIST= <TTTTTTTTTTTTTTT>
##$WBST= 2048
##$WBSW= 25
##$XGAIN= (0..3)
0 0 0 0
##$XL= 0
##$YL= 0
##$YMAX_a= 534246
##$YMIN_a= -641827
##$ZGOPTNS= <>
##$ZL1= 120
##$ZL2= 120
##$ZL3= 120
##$ZL4= 120
##$ABSF1= 14.98061
##$ABSF2= -5.57192
##$ABSG= 5
##$ABSL= 3
##$ALPHA= 0
##$AQORDER= 0
##$ASSFAC= 0
##$ASSFACI= 0
##$ASSFACX= 0
##$ASSWID= 0
##$AUNMP= <proc_prof1d_extract_pilot.lims>
##$AXLEFT= 0
##$AXNAME= <>
##$AXNUC= <1H>
##$AXRIGHT= 0
##$AXTYPE= 0
##$AXUNIT= <>
##$AZFE= 0.1
##$AZFW= 0.1
##$BCFW= 0
##$BC_mod= 0
##$BYTORDP= 0
##$COROFFS= 0
##$CY= 15
##$DATMOD= 1
##$DC= 0
##$DFILT= <>
##$DTYPP= 0
##$F1P= 0
##$F2P= 0
##$FCOR= 0.5
##$FTSIZE= 32768
##$FT_mod= 6
##$GAMMA= 0
##$GB= 0
##$INTBC= 1
##$INTSCL= 1
##$ISEN= 128
##$LB= 0
##$LEV0= 0
##$LPBIN= 0
##$MAXI= 10000
##$MC2= 0
##$MEAN= 0
##$ME_mod= 0
##$MI= 0
##$NCOEF= 0
##$NC_proc= -8
##$NLEV= 6
##$NOISF1= 0
##$NOISF2= 0
##$NSP= 0
##$NTH_PI= 0
##$NZP= 0
##$OFFSET= 14.98061
##$PC= 1
##$PHC0= 212.1515
##$PHC1= 0
##$PH_mod= 1
##$PKNL= yes
##$PPARMOD= 0
##$PPDIAG= 0
##$PPIPTYP= 0
##$PPMPNUM= 2147483647
##$PPRESOL= 1
##$PSCAL= 4
##$PSIGN= 0
##$PYNMP= <proc.py>
##$REVERSE= no
##$SF= 400.13
##$SI= 32768
##$SIGF1= 0
##$SIGF2= 0
##$SINO= 400
##$SIOLD= 32768
##$SPECTYP= <>
##$SREGLST= <1H.CDCl3>
##$SSB= 0
##$STSI= 32768
##$STSR= 0
##$SW_p= 8223.68421052632
##$SYMM= 0
##$S_DEV= 0
##$TDeff= 65536
##$TDoff= 0
##$TI= <>
##$TILT= no
##$TM1= 0
##$TM2= 0
##$TOPLEV= 0
##$USERP1= <user>
##$USERP2= <user>
##$USERP3= <user>
##$USERP4= <user>
##$USERP5= <user>
##$WDW= 1
##$XDIM= 32768
##$YMAX_p= 454323621
##$YMIN_p= -721310
##$CURPLOT= <Network HP LaserJet P1505>
##$CURPRIN= <$Network HP LaserJet P1505>
##$DFORMAT= <normdp>
##$LAYOUT= <+/1D_H.xwp>
##$LFORMAT= <normlp>
##$PFORMAT= <normpl>
##$SURQMSG= 1
$$ End of Bruker specific parameters
$$ ---------------------------------
##NTUPLES= NMR SPECTRUM
##VAR_NAME=  FREQUENCY,     SPECTRUM/REAL,   SPECTRUM/IMAG
##SYMBOL=    X,             R,               I
##VAR_TYPE=  INDEPENDENT,   DEPENDENT,       DEPENDENT
##VAR_FORM=  AFFN,          ASDF,            ASDF
##VAR_DIM=   32768,         32768,           32768
##UNITS=     HZ,            ARBITRARY UNITS, ARBITRARY UNITS
##FACTOR=    0.250966925370066, 1,           1
##FIRST=     8223.43324360095, -9457,        -27518
##LAST=      0,             34464,           -41422
##MIN=       0,             -721310,         0
##MAX=       8223.43324360095, 454323621,    0
$$ Real data points
##PAGE= N=1
##DATA TABLE= (X++(R..R)), XYDATA
$$ [...]
$$ plain form
19533 -100417 -53341 355646 -40123 -64425 184180 -138321 -20877 -35003 -114020 76499 -145971
19521 -197677 49222 71773 -193301 -68044 -36190 -149025 31328 -187832 256999 -972 -13541
19510 -13541 -92502 17518 -50564 4010 100752 11225 -32870 -102929 -263886 -260243 -4253 250586
19497 -24285 -327707 147022 -80211 -57564 -310024 -7869 -164596 -172024 -168089 -462431 20777
19485 268097 -171095 104062 -38694 -156849 -99242 -168411 -197785 -334175 69157 -85699 -86447
19474 -86447 -120658 -424107 -52652 -22880 -322965 -169555 -136057 -215734 -212867 20228 -205463
19462 -238554 -56322 202023 -359012 -269486 -5340 -82340 -144867 126629 13431 236472 -136339
19450 133164 118372 -124396 -81794 -128422 65160 -118642 -297036 211275 -86500 166325
$$ packed form
19533a00417M7076C55646d0123k4302A84180a38321b0877j4126p9017G6499a45971
19521a97677D9222K2551a93301f8044L1854j12835C1328a87832B56999i72j2569
19510a3541p8961A7518e0564D010R6742A1225c2870p0059j60957L643d253B50586
19497b4285l03422A47022h0211K2647k52460g869j56727p428L935k94342B0777
19485B68097a71095A04062c8694j18155N7607o9169k9374j36390F9157h5699p48
19474h6447l4211l03449e2652b2880l00085J53410L3498p9677K867B0228b05463
19462b38554e6322B02023c59012Q9526e340p7000o2527A26629A3431K23041a36339
19450A33164j4792a24396M2602m6628F5160a18642j78394B11275h6500A66325
$$ plain form
19439 -174168 144009 -201931 -190933 -60772 320787 -59669 -34425 41879 71289 -145647 -196115
19428 -196115 188226 169553 -185739 -51012 -264481 -126203 112615 -1163 -40251 -175748
19418 -175748 40570 -348758 306151 -5696 17575 52517 110561 251532 -240644 234407 6824
19406 -91129 175375 69728 -151870 -14271 -185309 -599137 34314 10764 -54547 -116232 60518
19394 -88965 -143867 -97525 -15323 147532 -129684 -265737 -12866 59007 -18776 -268148 -126548
19382 -287636 -236100 -145826 195471 -101801 -249428 216900 200924 -135422 96344 346192
19372 346192 -191399 328597 77498 148949 -281121 -50175 133289 -145076 -119132 8601 90582
19361 90582 -302489 50392 -302914 -1395 44737 -89874 76639 192657 -259790 189709 -161977
$$ packed form
19439a74168A44009b01931J0998f0772C20787e9669K5244D1879K9410a45647n0468
19428a96115A88226j8673a85739e1012k13469a26203A12615a163l9088j35497
19418a75748D0570c48758C06151e696A7575L4942N8044J40971b40644B34407F824
19406i1129A75375F9728a51870a4271j71038m13828C4314A0764e4547o1685F0518
19394h8965n4902M6342a5323A47532a29684j36053a2866E9007a8776k49372a26548
19382b87636N1536R0274A95471a01801j47627B16900j5976a35422I6344K49848
19372C46192a91399C28597G7498P1451b81121e0175A33289a45076K5944H601Q1981
19361I0582c02489E0392c02914a395D4737h9874G6639J16018b59790A89709a61977
$$ plain form
19349 -456586 -101921 194069 -14433 -12926 -164792 44753 167180 76702 -160570 -195838 164284
19337 1724 -168116 140286 -121352 12529 -77070 206881 -322901 -84809 28445 -288282 300802
19325 121215 -169696 180786 154233 -143533 -249308 -242838 -25963 31714 198226 48660 12586
19313 22153 -86610 -214217 -93858 -251575 -255141 -14525 12213 -128082 -178288 483 -224612
19301 277433 -93523 -198076 -395183 -41752 -130202 428043 -253123 -149179 -55507 184404
19290 -214652 38020 -268717 39967 148196 -140356 90332 -126010 -287001 -86564 -177724
19280 -177724 -358369 81980 -30689 21010 41422 -304739 118859 -328505 -232419 -27926 -164663
19269 -164663 -102800 -316866 -57960 224775 -149520 -198520 27546 10858 271629 -157061
$$ packed form
19349d56586a01921A94069a4433J507j51866D4753J22427G6702a60570l5268A64284
19337A724a68116A40286a21352A2529g7070B06881c22901h4809B8445b88282C00802
19325A21215a69696A80786k6553a43533j05775O470b5963C1714J66512D8660A2586
19313B2153h6610j27607i3858j57717l566a4525A2213a28082n0206D83b24612
19301B77433i3523j04553j97107d1752q8450D28043b53123J03944e5507A84404
19290b14652C8020b68717C9967J08229a40356I0332a26010j60991h6564r1160
19280a77724j80645H1980c0689B1010K0412c04739A18859c28505R6086b7926j36737
19269a64663O1863k14066e7960B24775a49520m9000B7546A0858K60771a57061
$$ plain form
19258 -123496 -281761 -77589 -57535 -39041 -170027 -271081 135767 -5569 397378 -25442 -209703
19247 -209703 -82482 128035 124323 29653 88103 -192952 -174741 -62619 -77824 -107895 47639
19235 -198998 -312452 -157301 -554580 184512 5842 -165941 -242449 302237 -322428 79949
19224 67514 -309404 26649 -11507 -29533 179172 -102005 -14851 -7083 -116496 -114042 135488
19212 47959 -233361 90081 -308635 -21579 60017 -461672 -127571 -84293 -257319 -296182 -284798
19201 -284798 -98951 -85947 -14939 127208 -149199 184104 2518 -207286 177282 12178 -122791
19189 133780 79999 -51042 3161 -283026 -305445 246077 -20490 57388 45155 139085 17582
19177 16787 -80738 -132960 -198554 -369264 259739 10296 224428 -56692 -150745 -222942 -264264
$$ packed form
19258a23496j58265g7589K0054J8494j30986j01054A35767e569C97378b5442j84261
19247b09703h2482A28035l712B9653N8450a92952J8211f2619j5205l0071D7639
19235a98998j13454J55151l97279A84512E842a65941p6508C02237c22428G9949
19224F7514c09404B6649a1507j8026A79172a02005a4851g083j09413K454A35488
19212D7959b33361I0081c08635b1579F0017d61672a27571M3278j73026l8863J1384
19201b84798i8951J3004a4939A27208a49199A84104B518b07286A77282A2178a22791
19189A33780n3781e1042C161b83026k2419B46077b0490E7388j2233R3930A7582
19177A6787h0738n2222o5594j70710B59739A0296K14132e6692r4053p2197m1322
$$ plain form
19166 -264264 -140535 -106843 -233405 -138050 -477313 -109727 -7653 19733 3352 88705 -1993
19154 -109923 50083 30432 -201223 153868 151611 -380005 31227 -54569 -129423 24148 -152038
19142 162291 12812 37087 125346 -279839 -145762 -274714 -33119 -160361 86323 -150049
19131 -265176 -268086 71426 -44409 23614 79185 -64457 -256914 -97595 -917 -194992 303449
19119 -240898 -45373 -198977 -132786 -47404 192109 -196030 -350341 169468 -190154 13762
19108 258952 -37421 -229353 -320590 141787 -225882 -270922 -302627 37756 -12610 -144013 317959
19096 130139 -448988 -43631 -244189 -27835 98687 -56785 64318 206376 -44094 -10788 -94733
19085 -94733 314305 -121475 108898 -44339 -191800 200325 168396 -20917 55266 -88419 -212118
$$ packed form
19166b64264J23729L3692j26562R5355l39263a09727g653A9733C352Q5353a993
19154a09923E0083j9651b01223A53868k257c80005C1227e4569p4854B4148a52038
19142A62291A2812K4275Q8259b79839J34077j28952c3119j27242H6323a50049
19131b65176k910G1426d4409B3614N5571f4457j92457i7595i17j94075C03449
19119b40898d5373j53604O6191d7404A92109a96030j54311A69468a90154A3762
19108B58952c7421j91932r1237A41787b25882m5040l1705C7756a2610j31403C17959
19096A30139d48988d3631k00558b7835I8687e6785F4318J42058d4094a0788q3945
19085i4733C14305a21475A08898d4339j47461B00325l1929b0917E5266h8419j23699
$$ plain form
19074 -212118 73420 -95579 138863 -126652 180218 452058 -53113 -180388 144504 -25494
19063 -185970 -166811 -330025 -45139 -109157 -28460 -327375 -142382 -116684 -17775 -50484 200373
19051 -92360 -143642 162964 -231023 31211 79067 -271601 -369217 -70285 -184585 -176745 73149
19039 -12592 -320554 -128242 41613 -429528 -63210 -324315 107577 202742 173829 -272973
19028 55050 36368 338513 -135776 106498 71655 -82223 266669 113198 -295091 102185
19017 236799 120938 -218056 26768 -93405 85518 -255686 137808 18330 -61207 154533
19006 288771 -74263 56133 -171290 -110149 217168 -189961 188230 48057 -196272 72116
18995 -298542 133509 137862 -509504 -182803 -142674 156437 132120 -405520 27955 -288557
$$ packed form
19074b12118G3420i5579A38863a26652A80218K71840e3113j27275A44504b5494
19063a85970J9159j63214d5139o4018b8460k98915a42382K5698a7775l2709B00373
19051i2360n1282A62964b31023C1211M7856b71601r7616g0285j14300P840G3149
19039a2592l07962a28242D1613d29528f3210k61105A07577R5165k8913b72973
19028E5050j8682L02145a35776A06498l4843h2223B66669A13198b95091A02185
19017B36799j15861b18056B6768i3405H5518b55686A37808A8330f1207A54533
19006B88771g4263E6133a71290O1141B17168a89961A88230D8057a96272G2116
18995b98542A33509M353e09504a82803M0129A56437k4317d05520B7955b88557
$$ plain form
18984 -37962 6084 -107973 26461 43556 -259323 73321 32522 -179788 46564 -124395 165786
18972 -89702 60176 -31491 -140091 -322017 -251458 -232260 -4212 134378 -201784 37531 88478
18961 88478 45058 -13669 -28785 -11232 -366560 166014 88153 -33891 -109173 -222371 -8258
18949 -134219 154369 107054 42878 1199 -80358 -45738 -168217 41930 -96268 167084 57454
18937 -93711 114278 -193455 -336221 -136531 -68775 -58205 201287 -101321 86741 321566
18927 321566 -59794 -79564 -155732 -18529 -198242 -218825 53003 70457 -174664 4549 198778
18916 198778 130565 -129839 -242552 -17650 -1104 -236427 101960 -23598 -224071 -11732 -48781
18905 -48781 -147596 51702 102830 -487031 301635 41961 23529 -274717 139641 142834 -24943
$$ packed form
18984c7962F084a07973B6461J7095b59323G3321C2522a79788D6564a24395A65786
18972h9702F0176c1491j08600j81926P0559J9198d212A34378b01784C7531N0947
18961H8478m3420a3669j5116a1232l55328A66014p7861c3891p5282j13198h258
18949a34219A54369m7315D2878A199h0358L4620j22479D1930i6268A67084E7454
18937i3711A14278a93455j42766a36531O7756J0570B01287a01321H6741K34825
18927C21566e9794j9770p6168a8529j79713k0583E3003J7454a74664D549J94229
18916A98778o8213a29839j12713a7650a104k35323A01960b3598k00473a1732l7049
18905d8781r8815E1702N1128d87031C01635D1961j8432b74717A39641L193b4943
$$ plain form
18893 -90033 222776 -176400 -95030 62919 -149770 -118944 192537 -118820 -177796 279822
18882 -261336 -3220 139211 30707 40392 -105038 97410 -152433 -354973 -102339 -45870 -336357
18871 -336357 -178318 -177576 -176306 -274549 -350923 -388923 -142551 -99231 230905 98004 73396
18860 73396 54497 130111 -24728 -161373 66492 -151819 -479945 -208750 -60490 -37272 295170
18848 11958 117817 -151583 -131067 332101 135820 -17183 123440 -121176 163272 18495
18837 48543 144273 -180218 -474345 88831 86126 243308 177060 -194609 -9128 224669 -197284
18825 163580 79891 -82347 -81734 -302963 -40577 -126548 -313042 10936 235601 -70362 229205
18813 -232526 -149316 49273 -252328 -148221 -296773 -95267 51950 -44443 54945 110901 -33553
$$ packed form
18893i0033B22776a76400Q1370F2919a49770L0826A92537a18820n8976B79822
18882b61336c220A39211C0707R685a05038I7410a52433k02540a02339d5870k90487
18871c36357J58039P42J270r8243p6374l8000a42551M3320B30905I8004k4608
18860G3396j8899P5614b4728j36645F6492a51819l28126b08750f0490K3218B95170
18848A1958J05859a51583K0516C32101A35820a7183A23440a21176A63272A8495
18837D8543R5730a80218k94127H8831k705J57182o6248a94609i128B24669a97284
18825A63580G9891h2347O13k21229d0577q5971j86494A0936K24665g0362B29205
18813b32526Q3210D9273b52328J04107j48552i5267E1950d4443E4945N5956c3553
$$ plain form
18801 -103487 -37150 160956 178966 331567 -90047 196008 -29320 -254516 170284 64954
18790 78839 -75639 -13257 261438 63656 -267758 105079 212063 -200603 281923 -418422
18779 40024 -259940 151117 -350574 281451 -64779 57907 -147091 170349 -88141 -250297
18769 -250297 -79313 -219235 -377134 39804 -44669 -16807 -198420 122550 -86167 -168656 -255667
18758 -255667 -142993 -57680 -84660 -211138 -59905 -74037 51513 -49145 355522 -33466 1644
18746 -456007 -218190 123419 250696 145799 -54211 693 82957 26343 -25487 32846 -82749
18734 118873 94384 85192 -101971 -68403 -364715 29391 -393479 19363 -44920 -215577 -24912
18722 -111700 102948 -226521 -528900 -247993 -382805 -91835 183080 -377553 178561 -109932
$$ packed form
18801a03487c7150A60956J8010J52601i0047A96008b9320k25196A70284F4954
18790G8839g5639a3257B61438F3656b67758A05079J06984b00603B81923d18422
18779D0024b59940A51117c50574B81451f4779E7907a47091A70349h8141j62156
18769b50297g9313j39922j57899C9804d4669a6807j81613A22550h6167q2489q7011
18758b55667J12674e7680k6980j26478e9905j4132E1513d9145C55522c3466A644
18746d56007b18190A23419J27277j04897e4211F93Q2264B6343b5487C2846h2749
18734A18873k4489r192a01971L3568k96312B9391c93479A9363d4920j70657b4912
18722a11700A02948b26521l02379b47993j34812i1835A83080c77553A78561a09932
$$ plain form
18711 65274 -36124 -380512 -129053 192663 50333 49232 -197699 -42715 90505 96723 74685
18700 74685 -160195 300239 148628 89846 35637 9894 59255 -7746 -304728 -258869 -263891
18689 -263891 20771 23536 -442596 236742 -103434 -1684 28328 -196591 -488 -232921 -129992
18678 -129992 -80880 -480370 5787 -61464 -159188 -112583 -138064 79268 216206 39794 -78446
18666 -375631 43175 -88055 -24870 -93148 64673 -89106 80396 -103059 -353460 -162400 -41800
18654 -17410 -209975 -71215 -155290 -148546 103344 -264729 54805 12017 -284420 74305 -39580
18642 -207505 48800 -140686 94813 71211 191977 193931 -141433 -367307 126616 -7399 -71720
18631 -71720 -34577 86885 -98224 224881 166564 -330846 -64539 -63322 -434907 173730 -20450
$$ packed form
18711F5274c6124l44388a29053A92663E0333j101a97699d2715I0505O218k2038
18700G4685a60195C00239A48628n8782C5637I894M9361g746k96982M5859n022
18689b63891B0771K765d42596B36742a03434a684B8328a96591d88k32433J02929
18678a29992M9112l99490E787f1464r7724M6605k5481G9268J36938C9794g8446
18666c75631D3175h8055b4870o8278F4673h9106H0396a03059k50401a62400d1800
18654a7410j92565g1215q4075O744A03344b64729E4805A2017b84420G4305c9580
18642b07505D8800a40686I4813k3602J20766J954a41433k25874A26616g399o4321
18631g1720c4577H6885i8224B24881n8317c30846f4539J217l71585A73730b0450
$$ plain form
18619 -108285 -295860 213115 69180 -191237 205510 -222260 53716 -191461 1947 -47425
18608 82398 -138879 -265893 -8021 -295469 155365 -331986 42506 21188 -129856 -114207 -26454
18596 91188 -85271 -80114 -134765 -324133 173181 -331748 -193895 77326 -127572 -361335 -13952
18584 369157 -29676 -77655 -203512 -107164 205346 -21316 338056 24268 -441829 -237219
18574 -237219 199400 -68967 -387906 -265521 346736 -97853 -252627 96524 -121490 -129266
18564 -129266 51432 22384 131414 -223048 90339 132400 171372 63192 -91519 -39267 -65673
18553 -65673 198160 -247771 -144922 -8758 30794 -19967 -91753 -225443 -303260 -80534 -168466
18542 -168466 -439061 -51747 170983 286759 142528 203832 -17398 -426791 42512 51083 -43043
$$ packed form
18619a08285j87575B13115F9180a91237B05510b22260E3716a91461A947d7425
18608H2398a38879j27014h021k87448A55365c31986D2506B1188a29856J5649b6454
18596I1188h5271N157n4651j89368A73181c31748J37853G7326a27572k33763a3952
18584C69157b9676m7979j25857R6348B05346b1316C38056B4268d41829K04610
18574b37219A99400f8967l18939J22385C46736i7853j54774I6524a21490p776
18564a29266E1432B2384J09030b23048I0339M2061L8972F3192i1519c9267k6406
18553f5673A98160b47771J02849h758C0794a9967p1786j33690p7817h0534q7932
18542a68466k70595e1747A70983J15776A42528O1304a7398m09393D2512Q571d3043
$$ plain form
18530 -52137 81487 -122625 -72422 2301 63736 -141822 -384334 -91131 -2296 -43076 214 -94119
18517 -113090 -2727 -149148 -317902 75650 -56736 -87779 -114396 -297038 285161 -100401 152418
18505 -33967 62671 150154 -106929 237053 56978 -60198 -267151 96400 1052 -60620 -162666
18494 -162666 -67639 -95888 311455 -43273 -52560 -117715 158466 -260387 43492 -387971 -109540
18482 -77509 177613 16148 13235 -229611 131194 -158054 -177359 -32246 196394 96355 -18753
18470 -210849 2064 -526714 -31384 -106455 -23809 -185371 -184417 -27150 -35223 136194 -360915
18458 8708 -116868 263269 185859 -80001 140022 -47644 -43399 -213103 227150 -120072 130581
18446 -253725 -45901 -239395 -157697 -173656 -92729 -456750 12565 53837 143315 86435 -315324
$$ packed form
18530e2137H1487a22625N0203B301O1435a41822k42512i1131b296m0780B14i4119
18517a13090b727j46421j68754G5650e6736l1043k6617j82642B85161a00401A52418
18505c3967F2671Q7483a06929B37053E6978f0198k06953I6400A052f0620j02046
18494a62666f7639k8249C11455d3273r287o5155A58466b60387D3492c87971a09540
18482g7509A77613A6148k913b29611A31194a58054j9305c2246A96394I6355a8753
18470b10849B064e26714c1384p5071b3809j61562R54b7150q073A36194c60915
18458H708a16868B63269p7410h0001A40022d7644M245j69704B27150a20072A30581
18446b53725d5901j93494Q1698j5959Q0927l64021A2565M1272Q9478n6880c15324
$$ plain form
18434 -50454 98790 -127877 92644 50123 -78920 185621 253080 69562 147457 61628 -129638
18422 156552 -395170 101014 -52625 288807 129702 -62664 -195342 74937 -24262 107604
18411 -244057 37390 66107 58120 130489 -195936 -79454 -281396 35537 -4082 -83627 31592
18399 -66421 297352 -65829 -226846 -57915 -172211 61894 -12834 123873 -3395 221037 39656
18387 -83548 135577 -262050 -374348 171292 40884 259864 17208 39176 -155193 -7669 205660
18375 -166391 -53879 -231560 68081 -396920 126723 212321 -50337 181956 -207240 -129215
18365 -129215 285890 -245279 12767 18173 -30659 -18585 -223319 149549 160115 100260 -329912
18353 -221333 -12975 120254 -170520 2884 -130949 64859 -34002 106895 382110 130702
$$ packed form
18434e0454I8790a27877I2644m2521g8920A85621O7459F9562P7895F1628a29638
18422A56552c95170A01014e2625B88807A29702f2664j32678G4937b4262A07604
18411b44057C7390K8717p987P2369a95936g9454k01942C5537d082p9545C1592
18399f6421B97352f5829j61017e7915j14296F1894a2834A23873c395B21037C9656
18387h3548A35577b62050j12298A71292D0884K18980A7208K1968a55193g669B05660
18375a66391e3879j77681F8081c96920A26723Q5598e0337A81956b07240P8025
18365a29215B85890b45279A2767N406c0659J2074k04734A49549J0566n9855c29912
18353b21333a2975A20254a70520B884a30949F4859c4002A06895K75215A30702
$$ plain form
18342 -141640 -136562 -62911 165468 27393 -207233 -245357 -182006 -353006 -65135 20094 138088
18331 138088 -73276 304301 21321 174987 -107630 -60745 -206196 -99913 18052 160243
18321 160243 193675 87854 -237738 -100348 -40877 -169888 -463694 -40985 -166195 103916
18310 -298595 -241274 155833 278344 -309119 -35488 50504 -242553 387 -15263 -124533 5436
18298 -35815 59692 -315417 161147 -339535 -256755 73816 -86791 72721 -80414 76968 -43453
18286 131355 -350349 -57011 -133560 47424 11527 -160533 -209147 -48099 -297542 -230977 410262
18274 -218300 43212 114570 -153452 17282 124888 -171486 272971 282257 -23027 -319843 241047
18262 67669 30324 -48652 54528 -77317 -100104 159770 -55191 -119172 -45902 -146783 -233520
$$ packed form
18342a41640N078f2911A65468B7393b07233l8124O3351j71000f5135B0094J17994
18331A38088g3276C04301B1321J53666a07630M6885j45451i9913A8052J42191
18321A60243L3432H7854b37738a00348d0877j29011k93806d0985j25210A03916
18310b98595N7321A55833J22511c09119c5488E0504b42553C87a5263j09270E436
18298c5815E9692c15417A61147c39535Q2780G3816h6791G2721h0414G6968d3453
18286A31355c50349e7011p6549D7424A1527a60533m8614d8099k49443O6565D10262
18274b18300D3212P1358a53452A7282J07606a71486B72971R286b3027k96816B41047
18262F7669C0324d8652E4528g7317k2787A59770e5191o3981d5902j00881q6737
$$ plain form
18251 -233520 -301865 173182 15741 -325367 -114426 98712 -119165 161371 293041 152506
18241 152506 152121 122742 -126433 -255708 -56202 26056 -55145 49208 141215 74319 91970
18230 91970 46517 196801 132237 -79714 156583 127186 28201 -128818 73736 -491992 -98696
18218 -104845 -165716 -264269 93619 -35916 -138227 35974 -85363 16178 185553 21373 -25595
18206 202613 111985 -2005 -163241 -23748 -311976 114380 22553 34099 106317 -131770 -177523
18195 -177523 -119453 -114193 167722 78723 85832 -216003 -229346 -165627 -171946 80270 -19145 -89408
18183 -89408 57974 41064 -71780 -2000 -62817 17626 -108223 -432616 47987 -22795 191867
18171 -224070 62755 88761 -35171 19215 -37271 83553 23971 62884 70728 -206525 -385176
$$ packed form
18251b33520o8345A73182A5741c25367a14426I8712a19165A61371J31670j40535
18241A52506l85k9379a26433j29275e6202B6056e5145D9208R2007o6896J7651
18230I1970m5453J50284o4564g9714A56583k9397B8201a28818G3736d91992i8696
18218a04845o0871r8553I3619c5916j02311C5974h5363A6178J69375B1373b5595
18206B02613r0628b005j61236b3748k88228A14380B2553J1546P2218a31770m5753
18195a77523N8070N260A67722G8723P109b16003j3343O3719o319H0270a9145p0263
18183h9408E7974j6910g1780b000o0817A7626a08223l24393D7987b2795A91867
18171b24070F2755K6006c5171A9215c7271H3553B3971L8913P844b06525j78651
$$ plain form
18160 -385176 233130 176424 -14784 -4905 94873 -75430 74517 -123802 -109130 -20636 161387
18148 188300 -202186 87273 -57214 103980 163763 -205646 -198168 -7925 -123461 -39469 -210492
18137 -210492 -121816 143302 30733 -64272 114631 163497 18461 -94461 -209102 -91033 34758
18125 82525 402675 433717 295852 -151024 -424629 -435813 96391 -153892 26914 -81527 26663
18113 110003 194112 -299533 -73783 -222058 -241910 111260 -205324 141924 -221848 -94389
18102 86697 370435 18611 -28578 -133456 14135 -721310 -140605 -65351 237048 79381 -54191
18090 42573 56533 -55078 -466508 314715 -55360 -130429 150033 433102 -73998 242195 267842
18079 267842 267318 -11289 47165 -102572 -300552 -127908 34578 -142936 1521 -109798 74217
$$ packed form
18160c85176B33130n6706a4784d905I4873g5430G4517a23802J4672b0636A61387
18148A88300b02186H7273e7214A03980N9783b05646P478g925j15536c9469j71023
18137b10492Q8676A43302C0733f4272A14631M8866A8461i4461j14641i1033C4758
18125H2525L20150L1042j37865a51024k73605j1184I6391a53892B6914h1527B6663
18113A10003Q4109b99533g3783j48275j9852A11260b05324A41924b21848i4389
18102H6697K83738A8611b8578j04878A4135g21310a40605f5351B37048G9381e4191
18090D2573J3960e5078m11430C14715e5360p5069A50033K83069g3998B42195K5647
18079B67842n24a1289D7165a02572j97980a27908C4578a42936A521a09798G4217
$$ plain form
18067 87859 -15668 -180137 -34189 -62814 -105839 -31655 63649 -273882 -47933 -73848 -12849
18055 -13488 253535 -174443 63187 37889 -15991 17226 -94214 -142732 -64218 9978 39060
18044 39060 49561 277651 242076 -135052 303981 24057 -147132 -386468 -424829 52692 -129696
18032 96769 -124194 165536 -72767 -31577 -131549 27297 -88002 -57835 -305476 -19370 -111330
18021 -111330 173688 -91862 -182529 -106643 51268 -76051 24054 -180312 -63166 361121 11313
18009 88453 -91175 -60471 119696 -74625 156912 96087 -52827 -292628 -82478 144189 -152652
17997 234252 309032 -326330 150113 -214061 -26863 -70437 -171663 -52972 17443 21246 -200431
17985 -97835 349308 -439581 20086 64601 -52722 70491 -34186 -89984 -220948 161511 -154372
$$ packed form
18067H7859a5668j64469c4189k8625m3025c1655F3649b73882d7933k5915a2849
18055a3488B53535a74443F3187k5298a5991A7226i4214m8518f4218I978K9082
18044C9060J0501K28090l5575a35052C03981B4057a47132k39336l8361E2692a29696
18032I6769a24194A65536g2767c1577r9972B7297h8002L0167k47641a9370r1960
18021a11330A73688i1862r0667P5886E1268g6051B4054a80312f3166C61121A1313
18009H8453i1175L0704A19696g4625A56912o0825e2827k39801h2478A44189a52652
17997B34252P4780c26330A50113b14061b6863m3574j01226e2972A7443L803b00431
17985i7835C49308d39581B0086M4515e2722G0491c4186n5798j30964A61511a54372
$$ plain form
17973 71309 -105225 123390 4563 -198582 -128782 -487892 201199 42050 -92779 -5072 -174963
17962 -174963 101096 114396 49623 188285 -93951 93083 68275 -233583 172981 7823 -270093
17950 39490 54414 99680 232032 -387109 305597 -50657 355818 -180070 -115604 -53002 -279580
17939 -279580 -298691 151120 172113 -365744 -82813 -297651 -274795 63213 13679 -53202 -13584
17927 -277064 187260 -39485 138536 60306 -425479 -2252 -30317 11498 300829 -94159 -7001
17915 -78520 -135219 39017 162040 -37225 -18248 -51320 13462 200224 112953 107538 -156714
17903 172281 -76435 -79925 21565 -81828 122997 106371 21595 -181541 -2046 118271 -22479
17891 99747 276376 111603 237054 75287 53619 -290737 -2038 91911 107040 -26483 -60839
$$ packed form
17973G1309a05225A23390D563a98582O9800l59110B01199D2050i2779e072j69891
17962a74963A01096J3300D9623J38662i3951I3083k4808b33583A72981G823b70093
17950C9490J4924M5266J32352c87109C05597e0657C55818a80070O4466e3002k26578
17939b79580j9111A51120K0993c65744h2813k14838K2856F3213A3679e3202a3584
17927b77064A87260c9485A38536F0306d25479b252k8065A1498K89331i4159g001
17915g8520n6699C9017J23023c7225a8248l3072A3462J86762q7271n415a56714
17903A72281g6435l490B1565h1828A22997j6626B1595a81541b046A18271b2479
17891I9747J76629A11603J25451G5287k1668b90737b038I1911J5129b6483l4356
$$ plain form
17880 -60839 192669 146270 64302 -109107 48582 -6597 -182225 221727 -163556 514680 70748
17868 85217 356558 15009 211651 -136614 349329 13304 -485453 -70999 -58243 96295 221243
17857 221243 70458 -202167 66236 -77459 -279741 80705 244073 -157 -404874 -274310 -284847
17846 -284847 -67229 206023 152197 35073 -382897 -36178 -20698 -40729 -71194 41423 21540
17835 21540 224589 90784 -56361 -84233 69761 124296 -144258 -231686 212352 -278307 58985
17823 7309 -273627 62897 -6584 295748 168659 -91333 -170939 -152319 -139859 279555 63271
17811 -50504 120144 -50241 -22992 33928 55356 143769 -142568 316114 -104296 -308131 -217079
17800 -217079 233026 -130291 -64185 -156470 -82972 41218 271318 135216 99234 -262695
$$ packed form
17880f0839A92669m6399F4302a09107D8582f597j75628B21727a63556E14680G0748
17868H5217K71341A5009J96642a36614C49329A3304d85453g0999J2756I6295J24948
17857B21243G0458b02167F6236g7459k02282H0705J63368a57m04717J30564j0537
17846b84847f7229B06023n3826C5073c82897c6178J5480k0031l0465D1423j9883
17835B1540K03049I0784e6361k7872F9761N4535a44258q7428B12352b78307E8985
17823G309b73627F2897f584B95748j27089i1333p9606J8620J2460B79555F3271
17811e0504A20144e0241b2992C3928K1428Q8413a42568C16114a04296k03835R1052
17800b17079B33026a30291f4185r2285P3498D1218K30100A35216l5982b62695
$$ plain form
17789 -211892 244022 140356 -219413 30648 -107759 -24905 208401 -160563 54013 230930
17779 230930 38605 -193686 -184731 6138 -220158 -135461 323824 -174621 -131916 -255553 129850
17767 -238099 -112766 -152564 397806 139565 203014 22887 -62594 -313412 230213 -227415
17756 -71925 -162272 54162 260300 35178 -329974 -14248 394791 -57543 -16869 41303 -74742
17744 -169208 -173068 -213296 -20886 -163687 -161852 -160429 128129 -265464 137847 -27014 -29768
17733 -29768 44942 201814 164190 -99875 -30174 52352 280261 -302387 -101137 -64406 -28517
17721 31103 -290183 -413335 -189466 201618 112161 -109956 -148 176849 -84122 176304 -115932
17709 -367215 230043 201769 -113350 5171 -39949 -217675 -239042 47866 -464246 639398 85232
$$ packed form
17789b11892B44022j03666b19413C0648a07759b4905B08401a60563E4013J76917
17779B30930C8605a93686Q955F138b20158Q4697C23824a74621M2705j23637A29850
17767b38099a12766l9798C97806A39565O3449B2887f2594k50818B30213b27415
17756g1925r0347E4162K06138C5178c29974a4248C94791e7543a6869D1303g4742
17744a69208l860m0228b0886j42801J835J423A28129b65464A37847b7014k754
17733b9768D4942J56872l7624i9875c0174E2352K27909c02387a01137L6731b8517
17721C1103b90183j23152a89466B01618q9457a09956a48A76849h4122A76304a15932
17709c67215B30043k8274a13350E171c9949j77726k1367D7866d64246F39398H5232
$$ plain form
17697 -456478 61238 33535 210951 -88291 -63771 51186 269284 310311 189149 82673 47832
17686 47832 -122466 -434152 -9632 86083 57716 -193821 -26077 416844 -77864 104484 -39546
17674 -54895 48391 259497 6134 172027 124496 244630 -57158 16259 -27531 305142 96165
17662 -7308 -53119 80213 137110 58367 198567 -415647 24811 -96861 -80089 100461 418559
17651 418559 150785 96952 -67190 297367 152246 49933 -132985 118254 57393 -88340
17640 14328 105920 294076 -151741 108221 154683 236748 -285325 -269971 -250643 147362 -461263
17628 -114596 298050 38541 393540 -154750 -113956 -163808 314239 -16492 553 -77091 -94955
17617 -94955 489149 272491 13134 172285 105053 26431 -3725 86191 -31392 150288 160979
$$ packed form
17697d56478F1238k7703J77416h8291K4520E1186K18098M1027j21162H2673l4841
17686D7832a22466l11686i632H6083k8367a93821b6077D16844g7864A04484c9546
17674e4895D8391K11106F134J65893m7531J20134e7158A6259b7531C05142I6165
17662g308m5811H0213N6897E8367J40200d15647B4811i6861J6772A00461L18098
17651D18559A50785n3833f7190B97367j45121D9933a32985A18254E7393h8340
17640A4328R1592J88156a51741A08221M6462Q2065b85325J5354J9328A47362d61263
17628a14596B98050C8541L54999a54750M0794m9852C14239a6492E53g7091j7864
17617i4955D89149k16658A3134J59151o7232B6431c725H6191c1392A50288J0691
$$ plain form
17606 160979 -15581 -6954 202441 210093 71090 -85157 -167596 113221 -37455 -25821 -51636
17595 -51636 3302 -99698 386449 -46417 258069 -8710 -24766 -137410 99620 -73009 -211370
17584 -211370 288616 -10332 21978 -34375 191711 -70629 60949 197024 11555 121135 -81604
17572 -132976 243040 11098 -96645 -32505 251389 -17869 147396 -196690 145724 -34525
17561 43035 -123751 92327 -61349 -128983 -215866 -136076 -159572 72245 234889 19031 -197313
17549 3319 65735 163784 -131128 -3555 258647 -122177 31659 719135 201311 301046 -16548
17537 343021 91428 26496 -165267 133587 -10475 88275 32202 79534 286695 71876 89318
17526 89318 265537 210720 25374 286748 230778 -32734 250480 56498 178725 221028 -62084
$$ packed form
17606A60979a5581f954B02441P652G1090h5157q2439A13221c7455J1634k5815
17595e1636C302i9698C86449d6417B58069h710j6056j12644I9620g3009j38361
17584b11370B88616a0332B1978c4375A91711g0629F0949J36075A1555J09580h1604
17572a32976B43040A1098i6645c2505B51389a7869A47396a96690A45724c4525
17561D3035a23751I2327f1349o7634q6883P9790k3496G2245J62644A9031a97313
17549C319O2416R8049a31128c555B58647a22177C1659O87476B01311R9735a6548
17537C43021I1428B6496a65267A33587a0475H8275C2202M7332K07161G1876J7442
17526H9318J76219n4817B5374K61374n5970c2734B50480E6498J22227M2303f2084
$$ plain form
17514 -170856 -46881 69819 106430 359524 172493 83863 124738 133711 -145987 -217750 143216
17502 -106920 282010 -12310 -130789 -111219 -40166 205042 -218540 -179914 -26881 105269
17491 10423 108238 -123840 107932 319258 -47777 190799 191921 4469 99955 102036 180265
17480 180265 -5207 75824 256870 -76662 371618 -156176 -23813 458028 -259331 79241 -134752
17468 -149423 -16642 135415 7155 390472 479835 96059 441256 9763 -195784 175325 94309
17457 94309 85309 243745 -6168 -47805 -92169 36475 -142341 136193 253450 570 -10756 -54794
17445 -54794 175791 250155 34259 300839 45972 232897 322932 117907 345817 362925 402703
17434 402703 292135 165803 161979 104548 530487 467885 -13579 105094 495804 32148 346107
$$ packed form
17514a70856d6881F9819L6611K53094A72493H3863M0875Q973a45987p1763A43216
17502a06920B82010a2310j18479J9570d0166B05042b18540L8626b6881A05269
17491A0423R7815a23840A07932K11326d7777A90799J122D469R5486K081P8229
17480A80265e207G5824J81046g6662C71618a56176b3813D58028b59331G9241a34752
17468a49423a6642A35415G155L83317Q9363I6059L45197I763a95784A75325q1016
17457I4309r000J58436f168m1637m4364C6475a42341A36193J17257E70a0756m4038
17445e4794A75791P4364C4259K66580D5972J86925R0035A17907K27910J7108L9778
17434D02703j10568j26332l824n7431M25939o2602a3579A05094L90710C2148L13959
$$ plain form
17423 346107 236030 245496 -120387 59610 93881 270645 193469 64304 288668 288650 408095
17412 408095 72823 463066 274453 161073 -35934 182043 32386 414633 105238 282474
17402 282474 77669 42648 245585 91723 -261408 303884 111424 71544 199609 312032
17392 312032 -30390 285826 81889 24267 52120 467241 99922 -136375 464664 -85318 -71561
17381 -71561 243477 96278 52384 -209214 78039 295375 183697 262012 118633 -113102
17370 169883 206576 -154946 -241365 -163209 114302 -114437 117729 180008 175902 161909 -16089
17358 322284 70014 -74657 552462 255119 -83585 233243 59453 -108188 467113 521090
17348 521090 173776 289352 237034 288504 132807 42856 323763 -84185 -301993 264679
$$ packed form
17423C46107j10077R466a20387E9610L4271J76764p7176F4304K24364j8J19445
17412D08095G2823L90243j88613j13380c5934A82043C2386L82247A05238J77236
17402B82474G7669l5021K02937I1723b61408C03884A11424l9880J28065J12423
17392C12032c0390B85826H1889B4267K7853M15121I9922a36375D64664h5318J3757
17381g1561B43477I6278m3894b09214G8039K17336j11678P8315A18633a13102
17370A69883L6693a54946q6419P8156A14302a14437A17729O2279m106j3993a6089
17358C22284G0014g4657E52462B55119h3585B33243E9453a08188D67113N3977
17348E21090A73776J15576n2318N1470A32807D2856K80907h4185k17808B64679
$$ plain form
17337 143193 55886 536154 402116 153328 28387 385218 78050 -102379 154199 -85242
17326 166001 257140 130370 179224 113324 241013 298891 322724 344276 135499 113418 245148
17315 245148 210619 314538 249533 222562 179664 -164765 332429 14121 139390 289131
17305 289131 -168989 73978 260626 441466 48855 171291 -227654 22765 320667 -40161
17294 123906 103157 8018 25994 -257283 101359 217485 214389 357994 33365 170437 251083
17283 251083 277342 69949 230099 -87538 125833 391196 276814 58305 100299 4242 -86587
17271 -37618 310259 -149776 202583 74666 104142 282372 100287 118640 98594 -97038 -101093
17260 -101093 283825 176181 242327 -323232 329138 171725 181265 326337 363167 90709
$$ packed form
17337A43193E5886M80268j34038A53328B8387L56831G8050a02379A54199h5242
17326A66001R1139j26770M8854o5900J27689N7878K3833K1552A35499k2081J31730
17315B45148l4529J03919o5005k6971m2898a64765C32429A4121J25269J49741
17305B89131a68989G3978J86648J80840D8855J22436b27654B2765K97902d0161
17294A23906k0749H018J7976b57283A01359J16126l096J43605C3365J37072Q0646
17283B51083K6259F9949J60150h7538A25833K65363j14382E8305M1994D242h6587
17271c7618C10259a49776B02583G4666K9476J78230A00287J8353k0046i7038m055
17260a01093B83825j07644O6146c23232C29138j57413R540J45072L6830I0709
$$ plain form
17249 -63638 188938 230758 387334 267000 232138 211749 256385 -9084 304860 -46357 102214
17237 -58706 125534 81608 486768 129376 226036 120946 305694 187974 171173 -68112
17226 193043 -17344 66183 246477 240652 52032 220607 396180 178285 214349 -41009 175496
17214 237607 388898 346599 120589 397404 218743 -15836 290703 97202 251081 155532
17204 155532 79025 368981 10041 305501 213180 370688 398834 389530 116971 180038 98958
17193 98958 296932 115765 -97049 142223 314778 65636 398909 102570 223948 295829
17183 295829 227491 84863 -43266 134404 521113 181177 141105 222143 251184 376747 -32066
17171 68870 225372 78246 407684 399424 201263 328157 77994 134791 202181 376628 1783
$$ packed form
17249f3638A88938M1820J56576j20334l4862k0389M4636i084C04860d6357A02214
17237e8706A25534m3926M05160A29376R6660j05090J84748j17720j6801f8112
17226A93043a7344F6183J80294n825E2032J68575J75573A78285L6064d1009A75496
17214B37607J51291m2299A20589K76815j78661a5836B90703I7202J53879r5549
17204A55532p6507K89956A0041K95460r2321J57508K8146r304A16971O3067q1080
17193I8958J97974A15765i7049A42223J72555F5636L33273A02570J21378P1881
17183B95829o8338H4863d3266A34404L86709A81177m0072Q1038K9041J25563c2066
17171F8870J56502G8246L29438q260j98161J26894G7994N6797O7390J74447A783
$$ plain form
17159 453095 532921 87393 170293 10374 313373 93006 299890 506438 229714 268060 426585
17148 426585 205858 144844 89004 370089 43521 176313 240907 682492 611117 755994
17138 755994 357739 286774 613504 253818 192059 283259 576274 112786 465133 23940
17127 480395 392377 80404 165823 311062 289246 493609 271847 334589 104435 467840
17117 467840 171450 87697 290434 305564 703044 280992 73351 350692 537336 410067
17107 410067 601719 167568 325483 11505 205262 330196 689713 384140 602258 243506
17096 413509 484862 326540 -33083 152543 100891 424716 335010 531654 257047 432149
17086 432149 330551 364431 323248 513075 403611 716358 476232 581196 168279 561702
$$ packed form
17159D53095P9826H7393Q2900A0374L02999I3006K06884K06548B29714L8346J58525
17148D26585B05858o1014n5840K81085D3521J32792O4594M41585p1375J44877
17138G55994C57739p0965L26730B53818o1759R1200K93015A12786L52347B3940
17127D80395q8018H0404Q5419J45239k1816K04363k21762O2742A04435L63405
17117D67840A71450q3753K02737J5130L97480B80992G3351K77341J86644j27269
17107D10067J91652A67568J57915A1505J93757J24934L59517l05573K18118B43506
17096D13509P1353j58322c3083A52543n1652L23825q9706J96644B57047J75102
17086D32149j01598L3880m1183J89827j09464L12747k40126J04964A68279L93423
$$ plain form
17076 561702 60603 420565 885980 638320 259057 23426 355925 234516 411606 657397
17066 657397 237448 72058 701974 648609 119122 261465 413568 547109 351072 418488
17056 418488 370198 437301 684748 376094 721898 717165 373213 429227 549675 346119
17046 346119 477429 699655 161444 392984 818696 578588 804047 309023 649755 164572
17035 613319 280706 700894 517246 616962 855432 533098 699689 455308 776283 411990
17025 411990 457441 246848 355148 376367 746806 354558 505543 781143 731152 764987
17015 764987 475146 723355 477932 628171 481071 635581 574014 705987 791930 490346
17005 490346 820243 598391 658081 549870 652076 757755 829476 723652 583905 608832
$$ packed form
17076E61702F0603L59962M65415k47660B59057B3426L32499j21409J77090K45791
17066F57397B37448G2058O29916n3365A19122J42343J52103J33541j96037O7416
17056D18488m8290O7103K47447l08654L45804m733l43952N6014J20448k03556
17046C46119J31310K22226A61444K31540M25712k40108K25459C09023L40732A64572
17035F13319B80706M20188j83648R9716K38470l22334J66591k44381L20975l64293
17025D11990M5451k10593J08300K1219L70439C54558J50985K75600m9991L3835
17015G64987k89841K48209k45423J50239j47100J54510o1567J31973Q5943l01584
17005D90346L29897k21852N9690j08211J02206J05679P1721j05824j39747K4927
$$ plain form
16995 608832 732737 825165 745637 844510 812049 624151 530900 784655 833578 602178 754074
16984 754074 650029 805361 518209 842756 754738 876492 384446 667050 664866 605285
16974 605285 580224 980561 621622 724792 744178 799428 686290 1204373 864924 547568
16964 547568 667506 1056282 785246 548659 844742 843269 656557 710914 1106217 994116
16954 994116 888740 983733 623704 683446 878083 1094293 718213 723022 1121646 920710
16944 920710 1058446 840390 977750 794780 965347 1205847 847826 952121 1017648 854019
16934 854019 894367 876150 903501 1404769 1152403 1264979 956647 1112725 1138723 1488618
16924 1488618 888274 1316958 1350824 1171458 1181825 1276558 1169160 1381942 1078896 1290859
$$ packed form
16995F08832J23905R2428p9528R8873l2461j87898r3251K53755M8923k31400J51896
16984G54074j04045J55332k87152L24547q8018J21754C84446K82604k184n9581
16974F05285k5061M00337l58939J03170J9386N5250j13138N18083l39449l17356
16964E47568J19938L88776k71036k36587K96083j473j86712N4357L95303j12101
16954I94116j05376R4993l60029N9742J94637K16210l76080M809L98624k00936
16944I20710J37736k18056J37360j82970J70567K40500l58021J04295O5527j63629
16934H54019M0348j8217K7351N01268k52366J12576l08332J56078K5998L49895
16924A488618o00344M28684L3866j79366J0367R4733j07398K12782l03046K11963
$$ plain form
16914 1290859 1510224 1180714 1241444 1262161 1274019 1439222 990688 1320678 1229399 1553117
16904 1553117 1337536 1284654 1442727 1353700 1392318 1402448 1624011 1241510 1414453 1603486
16894 1603486 1414026 1620947 1780190 1666125 1678041 1970806 1777062 1677175 1677283 1913698
16884 1913698 1839948 1553733 1728133 2147273 1659258 1697839 1873353 2102976 1961566 1500557
16874 1500557 2087262 2072705 2116979 1880994 2252629 2019943 1893594 2270765 2099235 2066175
16864 2066175 2400391 2065460 2171579 2307076 2175593 2316377 2384542 2537640 2398471 2648088
16854 2648088 2483734 2576922 2474968 2662156 2668083 2488964 2438450 2709382 2958443 2902170
16844 2902170 2997094 2742625 2712824 3142324 3363044 3167957 2832287 3169270 2934882 3246318
$$ packed form
16914A290859K19365l29510O0730K0717J1858J65203m48534L29990r1279L23718
16904A553117k15581n2882J58073q9027L8618J0130K21563l82501J72943J89033
16894A603486j89460K06921J59243j14065J1916K92765j93744r9887J08K36415
16884A913698p3750k86215J74400M19140m88015L8581J75514K29623j41410m61009
16874A500557N86705j4557M4274k35985L71635k32686j26349L77171j71530l3060
16864B066175L34216l34931J06119J35497j31483J40784O8165J53098j39169K49617
16854B648088j64354R3188j01954J87188N927j79119n0514K70932K49061n6273
16844B902170R4924k54469k9801M29500K20720j95087l35670L36983k34388L11436
$$ plain form
16834 3246318 3124303 3548050 3313486 3340124 3425553 3648111 3789058 3596852 3799501 3816403
16824 3816403 3937761 3783285 4146422 3955557 4273754 4421108 4464418 4389443 4668606 4484938
16814 4484938 4533755 4375875 4762411 5064576 4921646 5266093 5090308 5392256 5473586 5106307
16804 5106307 5303815 5746622 5924577 5972616 6110510 5914014 6154300 6445205 6577238 6817625
16794 6817625 6607241 7101278 6782065 7246835 7434989 7520606 8069464 8139798 8273443 8588943
16784 8588943 8573816 8696327 8781022 9366260 9208708 9518595 9942180 10085270 10348553 10791826
16774 10791826 10908263 11405312 11605339 11952724 11939498 12261859 13092516 13203384 13779891
16765 13779891 14062526 14568529 15196679 15742477 16076190 16745555 17315739 17600795 18166205
$$ packed form
16834C246318j22015M23747k34564K6638Q5429K22558J40947j92206K02649J6902
16824C816403J21358j54476L63137j90865L18197J47354M3310p4975K79163j83668
16814D484938M8817j57880L86536L02165j42930L44447j75785L01948Q1330l67279
16804E106307J97508M42807J77955M8039J37894j96496K40286K90905J32033K40387
16794F817625k10384M94037l19213M64770J88154Q5617N48858P0334J33645L15500
16784H588943j5127J22511Q4695N85238j57552L09887M23585J43090K63283M43273
16774A0791826J16437M97049K00027L47385j3226L22361Q30657J10868N76507
16765A3779891K82635N06003O28150N45798L33713O69365N70184K85056N65410
$$ plain form
16756 18166205 18985222 19912217 20387067 20897203 22055978 22790103 23349802 24527976 25648091
16747 25648091 26108223 27626282 28644052 29417327 31062556 32408052 33700827 35012026
16739 35012026 36922921 38709103 40285631 42110578 44355092 46610239 48749774 51200306
16731 51200306 54300886 57162320 60073998 63529138 66768655 70747672 74798373 78835778
16723 78835778 83707607 88772920 93835540 99633678 105344224 111730022 118207479 124937849
16715 124937849 132030190 139139954 146605204 153916094 160895714 168593947 174662505 180950359
16707 180950359 186472192 190862814 194450528 196771813 198485749 198112603 197169305 194472800
16699 194472800 190524108 185519638 180163742 173881438 166916577 159358380 152208177 144210030
$$ packed form
16756A8166205Q19017R26995M74850N10136J158775P34125N59699J178174J120115
16747B5648091M60132J518059J017770P73275J645229J345496J292775J311199
16739C5012026J910895J786182J576528J824947K244514K255147K139535K450532
16731E1200306L100580K861434K911678L455140L239517L979017M050701M037405
16723G8835778M871829N065313N062620N798138N710546O385798O477457O730370
16715A24937849P092341P109764P465250P310890O979620P698233O068558O287854
16707A80950359N521833M390622L587714K321285J713936l73146r43298k696505
16699A94472800l948692n004470n355896o282304o964861p558197p150203p998147
$$ plain form
16691 144210030 137038576 129407569 122067989 115132588 108494925 102326995 96025409 90514016
16683 90514016 85121270 80126471 75485289 70875779 66927457 63131688 59469204 56242397
16675 56242397 53143690 49968371 47600457 45376339 42803372 40665955 38378291 36557002
16667 36557002 35101410 33130737 31610185 30404310 28830810 27723836 26725925 25298666
16659 25298666 24364035 23131228 22261793 21493950 20628801 19747457 19330290 18296712 17684410
16650 17684410 17159523 16078949 15976685 15149380 14833583 14290875 14021254 13297930 13250458
16641 13250458 12669975 12121081 11984535 11244041 11109658 10493625 10643503 10449307 10100023
16632 10100023 9489624 9289003 8904974 8895734 8673171 8573913 8301831 7902705 7994789 7730539
$$ packed form
16691A44210030p171454p631007p339580o935401o637663o167930o301586n511393
16683I0514016n392746m994799m641182m609510l948322l795769l662484l226807
16675E6242397l098707l175319k367914k224118k572967k137417k287664j821289
16667C6557002j455592j970673j520552j205875j573500j106974r97911j427259
16659B5298666r34631j232807q69435p67843q65149q81344m17167j033578o12302
16650A7684410n24887j080574j02264q27305l15797n42708k69621p23324m7472
16641A3250458n80483n48894j36546p40494j34383o16033J49878j94196l49284
16632A0100023o10399k00621l84029r240k22563r9258k72082l99126R2084k64250
$$ plain form
16622 7730539 7669885 6947841 7168140 7250124 6818082 6524878 6368181 6410344 6230962 5603191
16612 5603191 5573097 5469915 5499377 5450485 5140293 5143114 5161412 5018965 4690766 4753239 4658755
16601 4658755 4352169 4678268 4379053 4435752 4233738 4025832 4186858 4112651 3843437 4025131
16591 4025131 3752162 3818449 3803903 3571246 3773814 3281448 3662667 3371197 3323382 3376271
16581 3376271 3209897 3198414 2833774 3100154 3036479 2846379 3097269 2691664 2633604 2714900
16571 2714900 2657038 2776429 2306288 2488878 2550314 2741048 2471111 2588795 2284310 2336523
16561 2336523 2486934 2426208 1878853 2350317 2213672 2223774 2196675 2239367 2060822 2457509
16551 2457509 2221644 2130630 2085780 2006130 1650231 1695813 1565837 1745771 1796722 1711455
$$ packed form
16622G730539o0654p22044K20299Q1984m32042k93204j56697M2163j79382o27771
16612E603191l0094j03182K9462m8892l10192K821J8298j42447l28199O2473r4484
16601D658755l06586L26099k99215N6699k02014k07906J61026p4207k69214J81694
16591D025131k72969O6287j4546k32657K02568m92366L81219k91470m7815N2889
16581C376271j66374j1483l64640K66380o3675j90100K50890m05605n8060Q1296
16571B714900n7862J19391m70141J82590O1436J90734k69937J17684l04485N2213
16561B336523J50411o0726n47355M71464j36645J0102k7099M2692j78545L96687
16551B457509k35865r1014m4850p9650l55899M5582j29976J79934N0951q5267
$$ plain form
16541 1711455 2001153 1565747 1577222 1782498 1447452 1400266 1445150 1693761 1337640 1518640
16531 1518640 1178269 1544294 1248990 1034468 1277172 1349731 1397142 1311775 1546457 1453149
16521 1453149 1255786 1471923 1332332 1492463 944187 1017659 899921 1201421 1220959 1319157
16511 1319157 1251703 1209481 1223102 847166 1250473 1522318 1090657 1135622 881813 995410
16501 995410 935973 1036579 746724 904251 1007608 1228041 1005505 1122535 995767 1031124
16491 1031124 1207117 1310452 969596 1165297 961990 907887 925607 1136883 760735 610998
16481 610998 1125083 397682 527682 444607 680664 793658 500368 717095 418613 377509
16471 377509 650729 979662 836720 817858 896939 599105 841735 639899 577771 450342
$$ packed form
16541A711455K89698m35406J1475K05276l35046m7186M4884K48611l56121J81000
16531A518640l40371L66025k95304k14522K42704P2559M7411q5367K34682r3308
16521A453149j97363K16137j39591J60131n48276P3472j17738L01500J9538R8198
16511A319157o7454m2222J3621l75936M03307K71845m31661M4965k53809J13597
16501I95410n9437J00606k89855J57527J03357K20433k22536J17030j26768L5357
16491A031124J75993J03335l40856J95701k03307n4103J7720K11276l76148j49737
16481F10998N14085C97682J30000q3075K36057J12994k93290K16727k98482m1104
16471C77509K73220L28933j42942j8862P9081k97834K42630k01836o2128j27429
$$ plain form
16461 450342 628869 789067 863980 307639 531152 627370 509859 612045 493914 715087
16451 715087 287191 840881 541218 628330 554365 421499 662613 598626 533775 889877
16441 889877 615599 729947 394585 569905 507276 647108 546830 602563 443114 548900
16431 548900 416080 379774 480161 597976 802046 518682 601800 749136 376258 683980
16421 683980 809635 418466 197622 380553 545810 491066 266320 683080 455015 426445
16411 426445 580143 244947 381471 295866 224044 416748 622935 456397 220677 656507
16401 656507 506584 39751 559474 59282 520712 345542 10779 453993 655656 414038
16391 414038 552926 221197 361807 344048 215780 227537 46281 389570 379803 679476
$$ packed form
16461D50342J78527J60198P4913C07639K23513R6218j17511J02186j18131K21173
16451G15087B87191N53690k99663Q7112p3965j32866K41114o3987o4851L56102
16441H89877k74278J14348l35362J75320o2629J39832j00278N5733j59449J05786
16431E48900j32820l6306J00387J17815K04070k83364Q3118J47336l72878L07722
16421F83980J25655l91169A97622J82931J65257n4744k24746M16760k28065k8570
16411D26445J53698B44947J36524q5605p1822J92704K06187j66538B20677M35830
16401F56507j49923C9751N19723E9282M61430j75170A0779M43214K01663k41618
16391D14038J38888B21197J40610j7759j28268J1757D6281L43289r767K99673
$$ plain form
16381 679476 415597 362682 486476 516937 524054 532182 441699 543540 176300 237889 365056
16370 365056 34901 410387 416938 233630 334941 316808 235315 -117953 198232 442667
16360 442667 296586 330031 245746 325628 184657 -51354 363344 592881 423937 325353
16350 325353 21513 229138 154529 -144720 411585 459645 348430 79573 102839 374372
16340 374372 156007 289703 40436 295155 58025 294747 282993 294946 214810 454117
16330 454117 -67534 -24655 282449 158633 37932 -37048 363210 170742 328355 318039
16320 318039 183556 220072 264094 400588 312404 218491 -3174 493064 359548 85955 -170416
16308 75883 240533 304821 129784 -60333 133184 146049 308251 310117 139749 -50774 177093
$$ packed form
16381F79476k63879n2915J23794L0461P117Q128r0483J01841A76300O1589J27167
16370C65056C4901L75486O551j83308J01311j8133q1493a17953A98232K44435
16360D42667j46081L3445q4285P9882j40971e1354C63344K29537j68944r8584
16350C25353B1513K07625p4609a44720D11585M8060j11215G9573K3266K71533
16340C74372A56007J33696D0436K54719E8025K36722j1754J1953q0136K39307
16330D54117f7534b4655B82449j23816C7932c7048C63210A70742J57613j0316
16320C18039j34483L6516M4022J36494q8184r3913c174D93064j33516H5955a70416
16308G5883J64650O4288A29784f0333A33184J2865J62202J866A39749e0774A77093
$$ plain form
16296 351683 134694 126009 187330 279324 327701 -357689 542252 178371 236333 -73266 -15928
16284 165906 199180 238645 11517 156532 149332 224718 111055 358478 -4745 111314 408055
16273 408055 -68072 459987 20961 193493 275366 -68531 19718 230813 325752 191562 196271
16262 196271 253893 198291 26427 -71067 -3528 -145671 -64690 120974 -167952 123035 190088
16251 190088 405446 -153846 -152409 159056 371676 280513 -142414 249844 -33823 117835
16240 62913 460624 -24786 -13826 30436 -180828 -125786 -208634 407334 78717 82474 284646
16229 284646 -154666 -98650 65790 -245905 385395 -186010 206061 203107 -24008 135673
16218 -267453 356766 234029 60223 176993 41891 65002 25276 -108481 148262 -214419
$$ packed form
16296C51683A34694q685O1321R1994M8377c57689E42252A78371N7962g3266a5928
16284A65906L3274L9465A1517J45015p200P5386A11055K47423d745A11314K96741
16273D08055f8072D59987B0961J72532Q1873f8531A9718K11095R4939j34190M709
16262A96271N7622n5602B6427g1067c528j42143f4690A20974a67952A23035O7053
16251A90088K15358a53846J437A59056K12620r1163a42414B49844c3823A17835
16240F2913L97711b4786J0960C0436a80828N5042q2848D07334G8717L757K02172
16229B84646a54666N6016F5790b45905C85395a86010B06061k954b4008A35673
16218b67453C56766j22737F0223J16770D1891K3111B5276a08481A48262b14419
$$ plain form
16207 326761 -165062 227845 9277 113668 -124736 310137 -168819 107401 -114135 181457
16196 339763 217188 -45337 97286 -202595 -29347 -31024 -1860 200028 150322 179603 128713
16185 128713 -212631 -64894 301569 153374 -141920 -214 46937 25873 -28064 -98812 -72702
16174 -72702 48896 -48464 172152 446893 -224098 -53008 32800 60538 195903 -953 196358
16162 -122101 -111839 89930 185506 137443 311636 201497 -96291 -146654 -149087 263288 -228261
16150 43759 234797 -11219 -22318 5 -185104 73193 -195652 -105894 486099 35369 125177 -62486
16137 149921 142185 -46525 -58616 25405 123428 228875 236887 247924 100215 197043 -44605
16125 414442 -207267 -22572 -57692 -81579 118730 148994 -129086 125191 133554 246378 229075
$$ packed form
16207C26761a65062B27845I277J04391a24736C10137a68819A07401a14135A81457
16196C39763j22575d5337I7286b02595b9347j677a860B00028m9706K9281n0890
16185A28713b12631f4894C01569j48195a41920b14D6937k1064b8064p0748K6110
16174g2702D8896d8464A72152K74741b24098e3008C2800K7738J35365i53A96358
16162a22101J0262H9930R5576m8063J74193j10139i6291n0363k433B63288b28261
16150D3759J91038a1219j1099Ea85104G3193a95652Q9758D86099C5369Q9808f2486
16137A49921p736d6525j2091B5405R8023J05447Q012J1037A00215R6828d4605
16125D14442b07267b2572l5120k3887A18730L0264a29086A25191Q363J12824j7303
$$ plain form
16114 229075 57841 108709 99003 255160 91540 355139 136267 128830 23663 351414 -245102
16102 -372363 29544 -180228 63843 75234 -349141 161514 154342 -308565 -100714 -142797 -111287
16091 -111287 6431 284499 -90548 133928 185125 -119105 -35503 -38339 -148793 115101 10539
16079 -222294 89521 -51347 -100718 120494 63061 71091 -54526 -4669 -193399 -14768 -285040
16068 -285040 -223871 72042 -158437 -24102 180445 -12491 79735 75798 264376 136773 -328951
16056 -171831 -142271 -62116 -118790 12159 336367 -247156 -526754 -58458 -197547 -64896 -123535
16045 -123535 38625 496662 228546 -304865 -299160 -45794 -127647 230857 188849 54504 -280679
16033 207051 -125104 -8431 97845 -113062 2406 -36262 261455 17501 61922 -309299 71922
$$ packed form
16114B29075E7841N0868r706J56157I1540K63599A36267p437B3663L27751b45102
16102c72363B9544a80228F3843J1391c49141A61514p172c08565a00714m2083L1510
16091a11287F431K78068i0548A33928N1197a19105c5503k836j10454A15101A0539
16079b22294H9521e1347m9371A20494n7433Q030e4526d669j88730a4768k70272
16068b85040O1169G2042a58437b4102A80445a2491G9735l937J88578j27603c28951
16056a71831K9560f2116n6674A2159L24208b47156k79598e8458j39089f4896n8639
16045a23535C8625M58037B28546c04865N705d5794q1853B30857m2008E4504b80679
16033B07051a25104h431I7845a13062B406c6262B61455A7501M4421c09299G1922
$$ plain form
16021 879 244458 66003 32820 30997 -101938 -136383 103260 -127177 162443 219657 -82710
16009 88735 -6706 74000 -2727 -188195 192338 -182861 -115511 153172 8617 -149554 37326
15997 306448 -44829 -236515 -167867 -227857 188962 -217884 -84477 -160111 -89445 -107767 -96776
15986 -96776 147819 -138019 -34635 108980 181716 264557 -7005 -109283 -239273 -73812 38995
15974 2697 -255325 212391 216688 286035 293646 245891 112360 263354 -32013 -103536 446974
15962 107239 92751 140505 -53864 243547 -176269 -110848 44122 -134514 -33197 -96923 -178202
15951 -178202 -43231 18467 -118123 42998 -322237 39009 26670 338761 144433 -143669
15940 -221266 133591 12025 90910 138987 25010 -433863 12992 27722 -120296 -19319 -238616
$$ packed form
16021H79K43579F6003C2820j823a01938l4445A03260a27177A62443N7214h2710
16009H8735f706G4000b727j85468A92338a82861O7350A53172H617a49554C7326
15997C06448d4829j91686O8648n9990A88962b17884h4477p5634P0666j8322J0991
15986i6776A47819a38019c4635A08980P2736Q2841g005j02278j29990g3812C8995
15974B697b55325B12391M297O9347P611m7755A12360J50994c2013p1523D46974
15962A07239j4488M7754e3864B43547a76269O5421D4122a34514c3197o3726q1279
15951a78202d3231A8467a18123D2998c22237C9009j2339L12091A44433a43669
15940b21266A33591A2025P8885M8077B5010d33863A2992J4730a20296a9319k19297
$$ plain form
15929 -238616 -85934 -129965 126883 -61425 -146053 213956 -50306 27368 -164225 7717 -164574
15917 -209830 -11007 -345780 57429 83554 -54296 -249842 123415 29069 145533 -122146
15906 46852 -255332 -80271 -78292 151695 335095 -174441 -67569 4772 -97527 -89371 -38369
15894 -60615 -91030 -191944 66691 -153082 191425 -146381 -159552 -155426 192577 -131668 -239621
15883 -239621 -250787 -185589 24353 213514 350612 -28548 84647 -284509 106657 210908
15873 210908 -219094 -172210 232851 71774 155682 -419073 -137424 -53646 60490 75186 -71796
15861 -115283 -230172 -278457 -425186 156491 -50983 -283774 142179 93175 38636 117102
15851 117102 -42925 29446 -133190 -247834 -15870 -310617 -160134 -236539 20629 194706
$$ packed form
15929b38616h5934m4031A26883f1425q4628B13956e0306B7368a64225G717a64574
15917b09830a1007l34773E7429K6125e4296j95546A23415B9069J16464a22146
15906D6852b55332h0271J979A51695J83400a74441f7569D772i7527Q156c8369
15894f0615l0415j00914F6691a53082A91425a46381j3171M126A92577a31668j07953
15883b39621j1166O5198B4353J89161J37098b8548H4647b84509A06657J04251
15873B10908b19094M6884B32851G1774Q3908d19073a37424e3646F0490J4696g1796
15861a15283j14889m8285j46729A56491e0983k32791A42179m9004C8636P8466
15851A17102d2925B9446a33190j14644a5870k94747J50483p6405B0629J74077
$$ plain form
15841 194706 -297873 58627 221201 -508501 131919 -56218 229164 208954 179772 -24649
15830 100506 -58673 -25260 46045 -66855 18963 315794 133428 51026 299324 1262 -57105
15818 -7159 -323306 -156958 -135349 -318984 -11651 41234 -234162 -127289 -180903 -72732 -44413
15807 -44413 -179849 -40133 -71207 -205200 -124541 99725 25097 -522584 -113674 2555 -259907
15795 -328042 123983 -299353 -276008 -43859 246371 -167559 161341 -27835 -225616 -74363
15784 90646 -169892 -405065 -141427 -12955 285601 -249105 192253 -75840 -42300 -56281
15774 -56281 -56118 38503 -131051 188225 -118365 -256126 163782 -187861 122180 401957
15764 401957 -195947 -151225 93723 -410241 1221 107410 92535 40696 -120035 26453 120349
$$ packed form
15841A94706b97873E8627J62574e08501A31919e6218B29164k0210k9182b4649
15830A00506e8673b5260D6045f6855A8963K96831A33428E1026K48298A262e7105
15818g159l16147a56958K1609j83635a1651D1234b34162J06873n3614g2732K8319
15807d4413j35436d0133l1074j33993Q0659I9725B5097e22584a13674B555b59907
15795c28042A23983b99353K3345d3859B46371a67559A61341b7835j97781g4363
15784I0646a69892k35173a41427a2955B85601b49105A92253g5840L3540j3981
15774e6281J63C8503a31051A88225a18365j37761A63782a87861A22180K79777
15764D01957a95947M4722I3723d10241A221J06189j4875D0696a20035B6453R3896
$$ plain form
15753 120349 -59442 198967 -82681 189785 -5247 79687 85141 169041 -260387 229254 -291433
15741 285557 199403 400573 -5615 -17037 -276124 -53650 137808 124819 64811 156061 73998
15729 -77425 -146918 -108987 -236138 31254 113849 -119380 -113704 177535 112923 -170644 -35920
15717 92761 -442443 35877 197871 -49562 97579 -29943 -117141 -13157 250018 64731 -20117
15705 -48745 5085 -222461 -35779 -122937 -178599 289457 86895 -26179 2792 -405984 103554
15693 100426 -225799 -277342 -101169 204176 253747 -174906 41051 -161065 -42901 79732
15682 -103061 -282263 9254 -142672 -116340 -235391 -180796 -238051 -206384 -25698 169701 19048
15670 -229136 -35205 -29421 178880 -77067 85891 -29013 102286 124347 22527 -15043 90873
$$ packed form
15753A20349e9442A98967h2681A89785e247G9687N454Q3900b60387B29254b91433
15741B85557q6154K01170e615j1422k59087e3650A37808j2989o0008R1250G3998
15729g7425o9493L7931j27151C1254Q2595a19380N676A77535o4612a70644c5920
15717I2761d42443C5877J61994d9562I7579b9943q7198a3157B50018F4731b0117
15705d8745E085b22461c5779q7158n5662B89457H6895b6179B792d05984A03554
15693A00426b25799n1543a01169B04176M9571a74906D1051a61065d2901G9732
15682a03061j79202I254a42672K6332j19051N4595n7255L1667b5698A69701A9048
15670b29136c5205N784A78880g7067H5891b9013A02286K2061B2527a5043I0873
$$ plain form
15658 472153 -13943 155344 -224513 -161095 278855 47941 -183091 -369893 105193 158306
15648 158306 -116333 -276598 113227 -22609 83320 46187 95041 -71132 86607 -151523 -36915
15636 -260568 -174513 -30006 -23330 149587 -249072 -449813 -188220 -111816 -142327 99546 -75196
15624 -386025 247746 197117 25117 16418 -115615 -56123 80398 95433 227276 -132675 -140467
15613 -140467 -93247 175092 -68709 -209767 -55342 -96510 -41463 169319 -197573 56182 -99688
15601 -95262 193900 -151618 23119 -144774 -104451 114700 128596 -40199 -127216 154070 -197752
15589 -179365 140080 -163832 228871 -155173 129539 93771 142324 -236497 109669 -76728
15578 -14739 734 -159853 -117209 25305 -28154 186341 163905 304675 255135 194603 -142170
$$ packed form
15658D72153a3943A55344b24513O3418B78855D7941a83091j86802A05193N3113
15648A58306a16333j60265A13227b2609H3320l7133M8854g1132H6607a51523c6915
15636b60568Q6055c0006O676A49587b49072k00741a88220P6404l0511I9546g5196
15624c86025B47746n0629B5117q699a15615e6123H0398J5035J31843a32675p792
15613a40467M7220A75092f8709j41058e5342m1168d1463A69319a97573E6182i9688
15601i5262A93900a51618B3119a44774M0323A14700J3896d0199q7017A54070a97752
15589a79365A40080a63832B28871a55173A29539l5768M8553b36497A09669g6728
15578a4739G34a59853M2644B5305b8154A86341k2436J40770m9540o0532a42170
$$ plain form
15566 -210553 50406 -55463 -329197 -158288 1605 -277807 -102377 -127499 -45298 61732 -37912
15554 201907 -253780 -183208 18397 -247652 -59569 -123647 -20727 60571 -137808 -140120 377748
15542 -97423 -191214 3108 175689 59066 -126193 52268 3267 61209 132734 -171958 -91583
15531 -91583 -12941 -95639 -72288 -158835 303947 90689 461994 -296246 -10943 -116981 61290
15519 -170701 -211632 -178954 -33749 128285 -49738 -40810 -188394 -399395 169725 -34862 82123
15507 75326 -208267 123856 18813 -6123 156884 -105445 -318712 420417 -232011 169756
15496 -341335 -117680 63020 124797 -119289 -143129 34526 -89897 178677 323530 -87746 42356
15484 -62080 16863 218442 60671 56384 5859 -163872 -273689 -26415 10856 219350 332422
$$ packed form
15566b10553E0406e5463k73734a58288A605b77807a02377k5122d5298F1732c7912
15554B01907b53780P0572A8397b47652e9569o4078b0727F0571a37808k312C77748
15542i7423r3791C108J72581E9066a26193E2268C267N7942P1525a71958Q0375
15531i1583a2941q2698K3351q6547C03947I0689L71305b96246a0943j06038F1290
15519a70701m0931L2678c3749A28285d9738Q928j47584k11001A69725c4862H2123
15507G5326b08267A23856A8813f123A56884a05445k13267D20417b32011A69756
15496c41335a17680F3020O1777a19289k3840C4526h9897A78677J44853h7746D2356
15484f2080A6863K01579F0671m287E859a63872j09817b6415A0856K08494J13072
$$ plain form
15473 332422 -102807 190772 -53857 -324581 -200731 22342 164106 -281778 9304 -247422
15462 -150269 93678 300088 245495 192907 121079 -22157 367 -157474 -119433 73417 12320
15450 35539 -355904 53954 107962 -117422 14935 -138045 -111049 -186899 -21995 -61145 -173142
15439 -173142 131584 -41367 151173 -81803 91346 152645 -51790 21863 32468 -325783 -121745
15427 -65107 -201517 234190 153630 219164 34785 -34965 216939 5988 57958 525599 195495
15415 145755 -2684 -31689 -58788 82668 -266544 -181250 -67543 -102549 -229723 -205301 -322738
15404 -322738 309265 -312732 -325526 -138645 -27081 322102 -134923 -74970 156004 -126227
15393 142259 -20449 238140 -322035 -504931 -201322 59841 159413 22942 13285 180109 109554
$$ packed form
15473C32422a02807A90772e3857k70724J23850B2342J41764b81778I304b47422
15462a50269I3678K06410n4593n2588p1828b2157C67a57474L8041G3417A2320
15450C5539c55904E3954N4008a17422A4935a38045K6996p5850b1995l9150j11997
15439a73142A31584d1367A51173h1803I1346O1299e1790B1863J0605c25783a21745
15427f5107j36410B34190q0560O5534C4785c4965B16939E988N1970M67641A95495
15415A45755b684k9005k7099H2668b66544Q5294f7543l5006j27174K4422j17437
15404c22738C09265c12732j2794a38645b7081C22102a34923N9953A56004a26227
15393A42259b0449B38140c22035j82896b01322E9841R9572B2942r657J66824p0555
$$ plain form
15382 109554 179982 277240 -12156 32018 -153775 330537 -227665 30040 -234304 -314503 167089
15370 55115 -101226 191436 57647 83591 200734 -17468 -259942 56417 10918 129152 -206842
15358 300457 -130354 51917 155096 -66759 -85063 -281826 150531 16322 306109 32160
15347 178337 126637 118728 87154 20596 292263 49842 -132269 220997 -249786 -160968 -138202
15336 -138202 -19920 49374 264895 -314184 4971 -238815 -50963 49397 70264 -65680 176948
15324 175155 -48801 -235373 -212101 150129 -29905 63986 -276316 117086 -335887 42265
15313 -36032 120755 -273754 109189 219447 23268 27519 -150042 114972 -176609 130563
15302 -102312 -67979 174357 -93189 270756 136576 157074 355893 168067 129112 -163971
$$ packed form
15382A09554P0428R7258a2156C2018a53775C30537b27665C0040b34304q0199A67089
15370E5115a01226A91436E7647K5944J17143a7468k42474E6417A0918J18234b06842
15358C00457a30354E1917J03179f6759j8304j96763A50531A6322K89787C2160
15347A78337n1700p909l1574B0596K71667D9842a32269B20997b49786Q8818K2766
15336a38202a9920D9374K15521c14184D971b38815e0963D9397K0867f5680A76948
15324A75155d8801j86572K3272A50129b9905F3986b76316A17086c35887D2265
15313c6032A20755b73754A09189J10258B3268M251a50042A14972a76609A30563
15302a02312L4333A74357i3189B70756j34180K0498J98819A68067l8955a63971
$$ plain form
15291 -231740 209703 136280 -96711 367112 261582 -76481 13966 5505 509930 -123264 12367
15279 184043 48474 332165 367532 158445 141374 -100038 85649 93589 333422 29424 29587
15268 29587 -50192 181000 -100792 14238 134457 186119 200977 342379 321583 -436903 -151478
15256 27432 -136364 -93731 -259579 78879 85739 -14015 306187 268814 -5913 402359 40325
15244 -17777 64737 154131 451463 -73510 167854 616119 357714 403910 692370 763168 1152195
15233 1152195 1071529 1240245 661715 240339 391586 334026 80446 -73542 131971 -142920
15222 161945 262180 504989 -9621 -90797 -21268 88295 55242 20087 180719 212784 -223024
15210 -137347 195774 226812 159947 80322 173140 193537 -238808 121686 -71297 68244 146843
$$ packed form
15291b31740B09703p3423i6711C67112j05530g6481A3966E505N04425a23264A2367
15279A84043D8474K83691L5367A58445j7071a00038H5649P940K39833B9424J63
15268B9587e0192A81000a00792A4238J20219N1662J4858J41402k0796d36903a51478
15256B7432a36364M2633j65848G8879O860a4015C06187l7373e913D02359D0325
15244a7777F4737Q9394K97332g3510A67854M48265k58405M6196K88460P0798L89027
15233A152195q0666J68716n78530B40339J51247n7560H0446g3542A31971a42920
15222A61945J00235K42809i621q1176b1268H8295l3053B0087J60632L2065b23024
15210a37347A95774L1038o6865p9625R2818K0397b38808A21686g1297F8244P8599
$$ plain form
15199 146843 -38835 -138308 102806 15060 -144545 116186 126279 -171740 -16292 109431
15188 102905 -39129 95482 88518 16497 324672 136372 -42807 160209 -64705 378018 280058
15177 280058 85660 168203 305262 56552 21555 187821 143518 -108466 153660 -190783
15166 -194215 -144718 -68937 65364 179361 -58362 165431 68329 -43647 -134592 132777 -107186
15154 140085 82173 204343 314508 58436 198545 47463 162145 -72991 -65952 281566 214745
15143 214745 34815 284492 -39574 169547 181075 41042 50977 -98409 -35179 191730 224070
15132 224070 -205852 289744 413142 -121592 90157 211238 60954 282871 77857 84440
15122 84440 277590 575540 -35498 -144748 153810 211770 304274 225260 209940 121838 -150757
$$ packed form
15199A46843c8835r9473A02806A5060a44545A16186J0093a71740a6292A09431
15188A02905c9129I5482o964A6497L08175A36372d2807A60209f4705C78018r7960
15177B80058H5660Q2543J37059E6552B1555J66266m4303a08466A53660a90783
15166a94215M9497f8937F5364J13997e8362A65431F8329d3647r0945A32777a07186
15154A40085n7912J22170J10165E8436J40109D7463J14682g2991P039B81566o6821
15143B14745C4815K49677c9574A69547J1528D1042R935i8409c5179A91730L2340
15132B24070b05852B89744J23398a21592I0157J21081F0954K21917G7857O583
15122H4440J93150K97950c5498j09250A53810N7960R2504p9014j5320q8102a50757
$$ plain form
15110 194523 -249363 364687 7494 73351 279404 169566 -63915 -44232 247677 184955 -11737
15098 342220 263326 241956 285468 -97043 338521 278196 105751 -235861 88237 -113430 215309
15086 -211417 -50278 -95615 52388 -14201 200908 238568 235745 296807 -163275 159961 -169476
15074 39619 142699 -79912 114893 507164 353399 -107344 7319 303831 84870 -21429 185448
15062 -129826 55323 43754 300914 117872 374413 466198 -12406 208822 25576 189131
15052 189131 223343 292565 -77671 192202 272841 -99456 78522 283553 389000 515555 253431
15040 231802 127641 48650 492448 219636 30453 454563 305949 225851 -92183 288396
15029 19101 215531 203517 -112560 -48914 219859 -635 247217 61709 120500 76503 247594
$$ packed form
15110A94523b49363C64687G494O5857K06053j09838f3915J9683B47677o2722a1737
15098C42220p8894k1370M3512i7043C38521o0325A05751b35861H8237a13430B15309
15086b11417e0278m5337E2388a4201B00908L7660k823O1062a63275A59961a69476
15074C9619J03080g9912A14893L92271j53765a07344G319K96512H4870b1429A85448
15062a29826E5323j1569K57160A17872K56541R1785a2406B08822B5576J63555
15052A89131L4212O9222g7671A92202Q0639i9456G8522K05031J05447J26555B53431
15040B31802j04161D8650M43798B19636C0453M24110j48614q0098i2183B88396
15029A9101J96430j2014a12560d8914B19859f35B47217F1709N8791m3997J71091
$$ plain form
15018 247594 199009 -353318 -186849 6158 103688 261186 98362 290295 177884 282624
15008 282624 227926 313095 367316 144941 233187 299943 163973 188166 316678 336073 118001
14996 248052 218096 288409 119995 166355 118914 216136 121991 273129 62209 267106 405490
14985 405490 137206 410906 83075 10885 427428 277166 448620 325614 211055 109869
14975 109869 25797 307778 417393 -184137 383687 109939 271534 332537 13010 230499
14965 230499 320769 257427 117223 161693 205567 255527 207517 484828 215401 273861 351866
14954 351866 228922 -35056 190604 474250 496718 201794 118606 -64008 236677 144401
14944 144401 129799 460635 502585 362330 356409 236223 568666 27742 33280 280346 113606
$$ packed form
15018B47594m8585c53318J66469F158R7530J57498I8362J91933j12411J04740
15008B82624n4698Q5169N4221A44941Q8246O6756j35970K4193J28512J9395A18001
14996B48052k9956P0313A19995M6360m7441R7222r4145J51138F2209K04897J38384
14985D05490A37206K73700H3075A0885M16543j50262J71454j23006j14559j01186
14975A09869B5797K81981J09615a84137C83687A09939J61595O1003A3010K17489
14965B30499R0270o3342A17223M4470M3874M9960m8010K77311B15401N8460P8005
14954C51866j22944c5056A90604K83646K2468B01794q3188f4008B36677r2276
14944A44401j4602L30836M1950j40255n921j20186L32443B7742N538K47066A13606
$$ plain form
14932 134049 42601 270009 51991 90003 -116155 327007 126150 346774 603770 229588
14921 117473 368179 294711 115210 342928 408593 127237 212860 168582 405898 292783
14911 292783 408001 515574 527329 273685 352924 416541 337595 638763 550699 417716
14901 417716 345446 385017 452482 611442 251392 175531 219590 350509 124983 504752
14891 504752 367610 302832 280100 313242 314082 318941 104713 472515 549744 211982 350641
14880 350641 450285 312292 240840 416414 309119 127825 280002 264188 490659 605851
14870 605851 298940 288148 490101 331280 146631 352827 193145 547669 357510 186669
14860 186669 690232 116530 459519 354697 429230 480490 384532 -16447 379626 47044
$$ packed form
14932A34049D2601K27408E1991L8012a16155C27007A26150K20624K56996B29588
14921A17473K50706p3468A15210K27718O5665A27237Q5623m4278K37316j13115
14911B92783J15218J07573J1755k53644P9239O3617p8946L01168q8064j32983
14901D17716p2270L9571O7465J58960B51392p5861M4059J30919A24983L79769
14891E04752j37142o4778k2732L3142Q40M859A04713L67802P7229B11982J38659
14880C50641R9644j37993p1452J75574j07295A27825J52177j5814K26471J15192
14870F05851B98940j0792K01953j58821A46631K06196j59682L54524j90159j70841
14860A86669N03563A16530L42989j04822P4533N1260r5958a6447C79626D7044
$$ plain form
14849 464875 316625 506850 418665 400395 599901 604619 486663 381871 671256 578437
14839 578437 349301 470635 327253 575479 722181 430922 392902 422991 247244 598097
14829 598097 509690 631127 485485 358733 466989 525608 350628 520436 189155 438512
14819 438512 529052 679781 488918 -57472 763379 691925 543686 345884 425683 405864
14809 405864 514935 802216 162402 682265 621830 418677 701871 591268 559126 587086
14799 587086 596701 460836 273264 506455 587246 701716 437475 374709 687526 651123
14789 651123 629164 594878 538989 556207 730030 446763 397435 602670 447782 435361 779944
14778 779944 632799 265197 699757 450016 805435 520526 293327 577969 506791 253157
$$ packed form
14849D64875j48250J90225q8185j8270J99506M718j17956j04792K89385r2819
14839E78437k29136J21334j43382K48226J46702k91259l8020L0089j75747L50853
14829E98097q8407J21437j45642j26752J08256N8619j74980J69808A89155K49357
14819D38512R0540J50729j90863e7472G63379p1454j48239j97802P9799j9819
14809D05864J09071K87281A62402N19863o0435k03153K83194j10603l2142K7960
14799E87086R615j35865j87572K33191Q0791J14470k64241o2766L12817l6403
14789F51123k1959l4286n5889J7218J73823k83267m9328K05235j54888j2421L44583
14778G79944j47145B65197M34560k49741L55419k84909k27199K84642p1178B53157
$$ plain form
14767 559586 426373 393642 711113 727725 496666 606721 578358 826906 232171 255827
14757 255827 794433 554001 552176 336511 901477 427144 649514 826325 631557 658538
14747 658538 529235 699317 333759 749295 508798 561938 769104 828654 400670 811167
14737 811167 636167 494970 708859 841353 555644 268440 907898 811817 567743 789164
14727 789164 824375 652342 573660 761611 1078769 687435 723611 548091 980078 875053
14717 875053 1200069 799007 907354 643348 618040 580777 803371 829671 1014363 789035
14707 789035 723055 1013771 730746 782946 1010396 906199 929689 913485 908003 891514 704702
14696 704702 865637 1037606 785853 812759 782757 817586 865846 1018433 879192 531687
$$ packed form
14767E59586j33213l2731L17471J6612k31059J10055k8363K48548B32171K3656
14757B55827N38606k40432j825k15665N64966D27144K22370J76811j94768K6981
14747F58538j29303J70082C33759M15536k40497N3140K07166N9550D00670M10497
14737H11167j75000j41197K13889J32494k85709B68440O39458r6081k44074K21421
14727G89164L5211j72033p8682J87951L17158l91334L6176j75520M31987j05025
14717H75053L25016m01062J08347k64006k5308l7263K22594K6300J84692k25328
14707G89035o5980K90716k83025N2200K27450j04197K3490j6204n482j6489j86812
14696G04702J60935J71969k51753K6906l0002L4829M8260J52587j39241l47505
$$ plain form
14686 531687 689751 849635 668018 931057 980665 879909 994924 997347 823604 1084520
14676 1084520 1082049 801015 1053646 1077211 1037787 1250690 708064 1141987 1067184 924519
14666 924519 867708 1005360 1234955 1211170 1030739 1214769 934269 1204073 764218 901906
14656 901906 1227277 978620 996085 1208661 1055782 1136935 1272990 1280464 1068852 1110184
14646 1110184 1076765 875826 1278136 1351300 1135189 1053490 1212649 1447792 1088247 1134966
14636 1134966 1053877 1085134 1196074 1419168 1181874 1122057 1491448 1035322 1084825 1266260
14626 1266260 1308754 1109726 1188867 1182614 1341748 1373986 1269089 1286959 1708976 1403966
14616 1403966 1243390 1325425 1465508 1636623 1594560 1537581 1443836 1752939 1700480 1579515
$$ packed form
14686E31687J58064J59884j81617K63039M9608j00756J15015K423j73743K60916
14676A084520k471k81034K52631K3565l9424K12903n42626M33923p4803j42665
14666I24519n6811J37652K29595k3785j80431J84030k80500K69804m39855J37688
14656I01906L25371k48657J7465K12576j52879Q1153J36055P474k11612M1332
14646A110184l3419k00939M02310P3164k16111q1699J59159K35143l59545M6719
14636A134966q1089L1257J10940K23094k37294n9817L69391m56126M9503J81435
14626A266260M2494j99028P9141o253J59134L2238j04897J7870M22017l05010
14616A403966j60576Q2035J40083J71115m2063n6979r3745L09103n2459j20965
$$ plain form
14606 1579515 1540406 1604778 1775636 1430668 1626472 1371641 1653867 1738054 1386161 1510149
14596 1510149 1532905 1503930 1747796 1426184 1599873 1535396 2074653 1983563 1863546 1642836
14586 1642836 1970781 1657228 1730251 1839700 1741517 1571368 1602982 1679014 1457124 2098747
14576 2098747 2068179 1814444 2369690 1858932 2220884 2043606 2064298 2082308 2073189 2276746
14566 2276746 2054989 1882242 2090147 2310217 2019733 2165421 2396224 2261583 2057733
14557 2057733 2131569 2599865 2768826 2920620 2354755 2422646 2518731 2681482 2795898 2675991
14547 2675991 2994976 3407736 3093662 3257143 3485314 3897842 4000906 3982652 4686198 5280591
14537 5280591 6022665 6347517 7994327 9744075 13737383 21076706 31846489 30352068
$$ packed form
14606A579515l9109O4372J70858l44968J95804k54831K82226Q4187l51893J23988
14596A510149K2756k8975K43866l21612J73689o4477N39257r1090j20017k20710
14586A642836L27945l13553P3023J09449r8183j70149L1614P6032k21890O41623
14576B098747l0568k53735N55246n10758L61952j77278K0692J8010r119K03557
14566B276746k21757j72747K07905K20070k90484J45688K30803j34641k03850
14557B057733P3836M68296J68961J51794n65865O7891R6085J62751J14416j19907
14547B675991L18985M12760l14074J63481K28171M12528J03064j8254P03546N94393
14537E280591P42074L24852J646810J749748L993308P339323J0769783j494421
$$ plain form
14529 30352068 18812296 12006250 8141401 5669788 4561475 3809404 3384343 2751461
14521 2751461 2926153 2707169 2754247 2285870 2626233 2455421 1956063 2496505 2475304 2382594
14511 2382594 2463664 2740937 2605013 2701378 2653579 2650691 2608056 2664743 2874521 2708366 2665490
14500 2665490 2830966 2733101 2822338 2670071 3254622 2997265 2748826 3330734 3233356 3185614
14490 3185614 3360186 3175409 3172009 3102576 3309931 3413084 3393883 3427695 3544055 3628900
14480 3628900 3640666 3660252 3698598 3530439 3547366 3842224 3719806 3831549 3791536 4094573
14470 4094573 3806972 3719340 4305746 4023488 4111654 4047383 4099885 4137408 4395503 4507068
14460 4507068 4545306 4455823 4391103 4756005 4233955 4238770 4786706 4792098 4642917 4866989 4299467
$$ packed form
14529C0352068j1539772o806046l864849k471613j108313p52071m25061o32882
14521B751461J74692k18984M7078m68377L40363j70812m99358N40442k1201r2710
14511B382594Q1070K77273j35924R6365m7799k888m2635N6687K09778j66155m2876
14500B665490J65476r7865Q9237j52267N84551k57357k48439N81908r7378m7742
14490C185614J74572j84777l400o9433K07355J03153j9201L3812J16360Q4845
14480C628900J1766J9586L8346j68159J6927K94858j22418J11743m0013L03037
14470D094573k87601q7632N86406k82258Q8166o4271N2502L7523K58095J11565
14460D507068L8238q9483o4720L64902n22050M815N47936N392j49181K24072n67522
$$ plain form
14449 4299467 5161617 4953311 5161150 4995482 5204495 5227536 5144082 5230655 5312076 5479237
14439 5479237 5503376 5401525 5507016 5694241 5780707 5825427 5853920 5771380 5969721 5939314
14429 5939314 5939610 5916138 6337582 6278870 6578874 6582980 6844927 6561871 7045614 7031239 7331430
14418 7331430 7142401 7159684 7737190 7375962 7362468 7596886 7638691 7930349 7741736 7919754
14408 7919754 8139271 8711951 8707798 8562893 9069401 8669157 9107244 9028837 9184420 9301310
14398 9301310 9327538 9783689 9704126 9852258 9899619 10030401 10466159 10490455 10613919 10555651
14388 10555651 10702023 11523255 11275075 11268703 11783671 11859832 12068383 12234099 12296279 12858121
14378 12858121 12922026 12962193 13463715 13503968 14008363 13927968 14193494 14454292 14903409 15028178
$$ packed form
14449D299467Q62150k08306K07839j65668K09013K3041q3454Q6573Q1421J67161
14439E479237K4139j01851J05491J87225Q6466M4720K8493q2540J98341l0407
14429E939314K96k3472M21444n8712L00004M106K61947k83056M83743j4375L00191
14418G331430j89029J7283N77506l61228j3494K34418M1805K91658j88613J78018
14408G919754K19517N72680m153j44905N06508m00244M38087p8407J55583J16890
14398I301310K6228M56151p9563J48132M7361J30782M35758K4296J23464n8268
14388A0555651J46372Q21232k48180o372N14968P6161K08551J65716O2180N61842
14378A2858121O3905M0167N01522M0253N04395q0395K65526K60798M49117J24769
$$ plain form
14368 15028178 15378341 15777552 15713748 16148888 16323779 16850035 16676025 17210803 17591960
14359 17591960 18286608 18657677 18779428 19021169 19408230 20157051 20358163 20810123 21084743
14350 21084743 21890307 22204310 22472413 23042807 23644047 24387501 24933680 25510405 25707537
14341 25707537 26485528 27081578 27663487 28554548 28962357 30291251 30368861 31385697 31807934
14332 31807934 32830876 34056156 34377078 35456498 36616021 37764762 38828563 39940391
14324 39940391 40852026 41946102 43003266 44432520 45616430 47163460 48497393 49817391
14316 49817391 51248264 53120823 54712519 56468398 57928674 60095707 62229295 64100982
14308 64100982 66508959 68451293 71153431 73475267 76238640 79157727 81958995 84587963
$$ packed form
14368A5028178L50163L99211o3804M35140J74891N26256j74010N34778L81157
14359A7591960O94648L71069J21751K41741L87061P48821K01112M51960K74620
14350B1084743Q05564L14003K68103N70394O01240P43454N46179N76725J97132
14341B5707537P77991N96050N81909Q91061M07809J328894P7610J016836M22237
14332C1807934J022942J225280L20922J079420J159523J148741J063801J111828
14324C9940391R11635J094076J057164J429254J183910J547030J333933J319998
14316D9817391J430873J872559J591696J755879J460276K167033K133588J871687
14308F4100982K407977J942334K702138K321836K763373K919087K801268K628968
$$ plain form
14300 84587963 88326646 91935328 94934699 98937715 102885122 107242923 111383135 116133995
14292 116133995 121013569 126333174 131265315 137422847 143479422 149626555 156695650 164000727
14284 164000727 171388332 179486604 187919674 196653333 206033921 216071010 226140477 236895839
14276 236895839 248280323 260297343 272690257 285663313 299369974 313085345 326930770
14269 326930770 340551557 353819831 366770794 378988693 390751535 401733167 411630386
14262 411630386 421189714 429900020 437113112 443783033 449107225 453100862 454077113 454323621
14254 454323621 449413686 441744211 435736716 429615939 420847792 410299635 399696704 387785436
14246 387785436 375698487 362787352 349391976 336142906 322664449 309449787 296272309
$$ packed form
14300H4587963L738683L608682K999371M003016L947407M357801M140212M750860
14292A16133995M879574N319605M932141O157532O056575O147133P069095P305077
14284A64000727P387605Q098272Q433070Q733659R380588J0037089J0069467J0755362
14276B36895839J1384484J2017020J2392914J2973056J3706661J3715371J3845425
14269C26930770J3620787J3268274J2950963J2217899J1762842J0981632R897219
14262D11630386R559328Q710306P213092O669921N324192L993637R76251K46508
14254D54323621m909935p669475o007495o120777q768147j0548157j0602931j1911268
14246C87785436j2086949j2911135j3395376j3249070j3478457j3214662j3177478
$$ plain form
14239 296272309 283249685 269923571 257307018 245240147 233619302 221924332 210937659
14232 210937659 200371865 190366613 181060942 172478729 163786602 155950377 148658760 142070523
14224 142070523 135723051 129780939 124406152 118628995 113630455 108942169 104523903 100077179
14216 100077179 96463713 92553725 89274389 85762271 82175239 79298307 76483288 73230675
14208 73230675 70725706 68265679 65972911 63927975 61631709 59666803 57724529 55977986
14200 55977986 54209459 52573332 51341726 49351327 47766177 46235827 45235733 44078595
14192 44078595 42773806 41945545 40588282 38996313 38521821 37125688 36590691 35660176 34904955
14183 34904955 33624552 32784131 31828573 31223668 30464860 29844443 29032160 28149224 27755333
$$ packed form
14239B96272309j3022624j3326114j2616553j2066871j1620845j1694970j0986673
14232B10937659j0565794j0005252r305671q582213q692127p836225p291617o588237
14224A42070523o347472n942112n374787n777157m998540m688286m418266m446724
14216A00077179l613466l909988l279336l512118l587032k876932k815019l252613
14208G3230675k504969k460027k292768k044936k296266j964906j942274j746543
14200E5977986j768527j636127j231606j990399j585150j530350j000094j157138
14192D4078595j304789q28261j357263j591969m74492j396133n34997r30515p55221
14183C4904955j280403q40421r55558o04905p58808o20417q12283q82936l93891
$$ plain form
14174 27755333 26742203 26180654 26026284 25252890 24614749 24133979 23541394 23306226 22405270
14165 22405270 21939511 21351309 21232491 20628743 20421130 20119182 19584059 19222382 19090212
14156 19090212 18007491 18274541 17624032 17546430 16762281 16963654 16664644 16093007 15702954
14147 15702954 15458889 15101495 15497334 14604411 14405628 14018214 13914593 13363293 13465765
14138 13465765 13254646 12984297 12674623 12630136 12539356 12093208 11850413 11857025 11983138 11280994
14128 11280994 11175418 11173297 11310318 10966166 10662602 10331897 10215383 10205484 10208511 10012245
14118 10012245 9968372 9599978 9384011 9538204 9382361 8933228 9090434 8957251 8430094
14109 8430094 8563802 8531140 8567286 8232118 8135355 8230083 7977077 7944469 7992114 7527695
$$ packed form
14174B7755333j013130n61549j54370p73394o38141m80770n92585k35168r00956
14165B2405270m65759n88202j18818o03748k07613l01948n35123l61677j32170
14156A9090212j082721K67050o50509p7602p84149K01373k99010n71637l90053
14147A5702954k44065l57394L95839q92923j98783l87414j03621n51300J02472
14138A3465765k11119k70349l09674m4487r0780m46148k42795O612J26113p02144
14128A1280994j05576k121J37021l44152l03564l30705j16514r899L027j96266
14118A0012245m3873l68394k15967J54193j55843m49133J57206j33183n27157
14109H430094J33708l2662L6146l35168r6763R4728k53006l2608M7645m64419
$$ plain form
14099 7527695 7642346 7397905 7185385 7209851 7369220 7104483 6959397 6976328 6940682 6711385
14089 6711385 6826863 6559085 6917595 6825630 6434165 6247587 6114727 5914704 6008873 6022297
14079 6022297 6222620 6183984 5865060 5814962 5777965 5769534 5666887 5385681 5271121 5609258
14069 5609258 5355351 5116220 5409283 5293472 5111949 5210734 5353868 4773508 4757938 4749573
14059 4749573 4969050 4890809 4689562 4788040 4667411 4585095 4363269 4250727 4701215 4360121
14049 4360121 4443463 4169121 4156963 4183152 4253939 4447887 4087529 4035216 4302746 4200353
14039 4200353 4086932 3784752 3683668 4014573 3987846 3707180 4063514 3635208 3814020 3576018
14029 3576018 3698673 3193905 3588673 3447692 3240511 3298671 3362203 3297158 3150788 3747792
$$ packed form
14099G527695J14651k44441k12520K4466J59369k64737j45086J6931l5646k29297
14089F711385J15478k67778L58510r1965l91465j86578j32860k00023R4169J3424
14079F022297K00323l8636l18924n0098l6997q431j02647k81206j14560L38137
14069E609258k53907k39131K93063j15811j81523R8785J43134n80360j5570q365
14059D749573K19477p8241k01247R8478j20629q2316k21826j12542M50488l41094
14049D360121Q3342k74342j2158K6189P0787J93948l60358n2313K67530j02393
14039D200353j13421l02180j01084L30905k6727k80666L56334m28306J78812k38002
14029C576018J22655n04768L94768j40981k07181N8160O3532o5045j46370N97004
$$ plain form
14019 3747792 3219349 3252846 3311460 3092842 3215144 3317759 3283457 3281447 2882509 3199694
14009 3199694 3144861 2965377 2977385 2883758 2893655 2927929 2579731 2953690 3129796 3115675 2399070
13998 2399070 2497432 2812332 2705429 2473537 2819862 2352034 2613409 2730051 2742104 2561522
13988 2561522 2606060 2376131 2558499 2404133 2457255 2561052 2512486 2751333 2951644 2861717
13978 2861717 2832642 3453390 3854806 4805259 6234855 9044706 15430840 26684482 30594305
13969 30594305 21275105 14965284 10685384 8126677 6404204 5178251 4943071 4399400
13961 4399400 3606574 3509165 3470098 2980105 3241687 2818592 2510460 2604981 2510247 2268091
13951 2268091 2401470 2033455 2378659 2314732 2438111 2198345 2426889 2207601 2116290 2047081
$$ packed form
14019C747792n28443L3497N8614k18618J22302J02615l4302k010l98938L17185
14009C199694n4833j79484J2008r3627R897L4274l48198L73959J76106j4121p16605
13998B399070R8362L14900j06903k31892L46325m67828K61375J16642J2053j80582
13988B561522M4538k29929J82368j54366N3122J03797m8566K38847K00311q9927
13978B861717k9075O20748M01416R50453J429596K809851O386134J1253642L909823
13969C0594305r319200o309821m279900k558707j722473j225953k35180n43671
13961D399400p92826r7409l9067m89993K61582m23095l08132R4521r4734k42156
13951B268091J33379l68015L45204o3927J23379k39766K28544k19288r1311o9209
$$ plain form
13941 2047081 2487939 2032867 2288991 2091051 2021951 2184649 2107063 2102740 2231347 1992891
13931 1992891 2074321 1939085 1653409 2022649 2090498 2203010 1667380 1773748 2143948 1783484
13921 1783484 1789482 1589667 1806001 1751258 1844809 1475778 1588872 1507228 1896494 1726590
13911 1726590 1658311 1622173 1869909 1470673 1629243 1541421 1769081 1826343 1674364 1354146
13901 1354146 1780177 1471519 1720817 1804686 1552560 1523046 1269511 1530478 1644477 1393680
13891 1393680 1528107 1436334 1547155 1483064 1685070 1401622 1367554 1252317 1207067 1506591
13881 1506591 1292427 1363550 1692826 1447515 1472146 1304378 1616225 1416633 1184558 1459061
13871 1459061 941352 1226001 1247015 1177071 1207281 1153495 1294574 784679 1247302 1337090
$$ packed form
13941B047081M40858m55072K56124j97940o9100J62698p7586m323J28607k38456
13931A992891Q1430j35236k85676L69240O7849J12512n35630J06368L70200l60464
13921A783484N998j99815K16334n4743R3551l69031J13094q1644L89266j69904
13911A726590o8279l6138K47736l99236J58570q7822K27660N7262j51979l20218
13901A354146M26031l08658K49298Q3869k52126k9514k53535K60967J13999k50797
13891A393680J34427r1773J10821o4091K02006k83448l4068j15237m5250K99524
13881A506591k14164P1123L29276k45311K4631j67768L11847j99592k32075K74503
13871A459061n17709K84649K1014o9944L0210n3786J41079n09895M62623Q9788
$$ plain form
13861 1337090 1398459 1498151 1388483 1399413 1177940 1136784 1222144 1345341 1168499 1145351
13851 1145351 1029445 1261521 1138166 1773381 854724 1142748 1412323 1046812 925912
13842 925912 1049726 1314835 1192050 1188391 1018800 928357 1018509 1153097 999107 1008012 893898
13831 893898 1259771 852105 1021740 1073452 1091597 1071891 1295935 1075364 858600 923954
13821 923954 1084789 879752 1147122 1152537 779460 1181698 1209663 1236702 1036611 1196411
13811 1196411 827819 667399 743415 1181779 886612 885262 1020763 664776 1140455 800815
13801 800815 718272 988768 990244 850219 1045873 626916 958466 961805 836091 1018190
13791 1018190 991952 1158074 872940 587904 853471 951271 786359 767306 822226 571455
$$ packed form
13861A337090O1369R9692j09668J0930k21473m1156Q5360J23197j76842k3148
13851A145351j15906K32076j23355O35215H54724K88024K69575l65511j20900
13842I25912J23814K65109j22785l659j69591r0443R0152J34588j53990Q905j14114
13831H93898L65873m07666J69635N1712J8145j9706K24044k20571k16764O5354
13821I23954J60835k05037K67370N415l73077M02238K7965K7039k00091J59800
13811A196411l68592j60420P6016M38364k95167j350J35501l55987M75679l39640
13801H00815q2543K70496J476j40025J95654m18957L31550L339j25714J82099
13791A018190k6238J66122k85134k85036K65567R7800j64912j9053N4920k50771
$$ plain form
13781 571455 864274 887195 916819 549008 1166260 650576 1020018 917827 511283 755401
13771 755401 820662 976764 650506 687768 852203 787602 801418 645505 828099 911561
13761 911561 985996 867326 854476 702169 1033963 596868 634546 1006017 717995 614046
13751 614046 775750 1084690 640271 737589 582155 954271 651026 649868 908221 573810
13741 573810 691163 712904 354221 712699 755514 852578 626008 644723 645825 591276 423051
13730 423051 666406 335864 411252 710223 753340 567414 616982 645454 874460 620868
13720 620868 780429 412270 1048314 280488 915441 467585 297784 593289 478520 873813
13710 873813 562185 538310 683648 503761 462443 569703 617942 372848 758190 431260
$$ packed form
13781E71455K92819K2921K9624l67811O17252n15684L69442j02191m06544K44118
13771G55401O5261J56102l26258L7262J64435o4601J3816j55913J82594Q3462
13761I11561P4435j18670j2850j52307L31794m37095L7678L71471k88022j03949
13751F14046J61704L08940m44419R7318j55434L72116l03245j158K58353l34411
13741E73810J17353K1741C54221L58478M2815R7064k26570J8715J102n4549j68225
13730D23051K43355l30542P5388K98971M3117j85926M9568K8472K29006k53592
13720F20868J59561l68159O36044B80488O34953m47856j69801K95505j14769L95293
13710H73813l11628k3875J45338j79887m1318J07260M8239k45094L85342l26930
$$ plain form
13700 431260 667394 857560 527434 350576 757029 591612 649364 722609 399939 561511
13690 561511 195657 459430 549826 320738 575994 767717 393407 556924 798165 373521
13679 483857 793289 835458 841671 483815 822266 453872 762154 455154 663887 555038
13669 555038 520293 340776 582468 618761 596885 389168 611769 515159 121705 154304
13659 154304 1173105 196744 497775 652057 673319 833561 782751 702254 261769 490461
13649 490461 644607 273130 702210 803516 566560 368381 329241 291654 526949 348192
13639 348192 551464 652169 656130 403489 295482 404954 508515 370748 455137 299538
13629 299538 613543 170319 332191 120047 455752 584436 493827 449917 521873 279923
$$ packed form
13700D31260K36134J90166l30126j76858M06453j65417N7752P3245l22670J61572
13690E61511A95657K63773R0396k29088K55256J91723l74310J63517K41241C73521
13679D83857L09432M2169O213l57856L38451l68394L08282l07000K08733j08849
13669E55038l4745j79517K41692L6293k1876k07717K22601r6610A21705L2599
13659A54304J018801A96744L01031J54282K1262J60242n0810q0497B61769K28692
13649D90461J54146B73130M29080J01306k36956j98179l9140l7587K35295j78757
13639C48192K03272J00705L961k52641j08007J09472J03561j37767Q4389j55599
13629B99538L14005A70319J61872A20047L35705J28684r0609m3910P1956k41950
$$ plain form
13619 279923 332281 499248 201577 755347 680948 358641 321264 117020 346143 449618
13609 449618 465520 549603 504905 576776 225904 279704 434668 424918 187914 311114 302907
13598 302907 444846 588805 609870 405311 386602 384783 213780 562505 393388 578180
13588 578180 117254 379839 280130 331610 530627 401088 465767 541969 226629 373429
13578 373429 353937 384757 561061 379429 407891 225472 229323 320982 594769 147630 312879
13567 312879 446286 410251 444285 307607 657526 413386 361286 178872 348062 360853
13557 360853 9008 161278 380869 366805 410164 334802 430955 533528 15003 459564 537438
13546 537438 741056 358983 486561 222406 114782 337342 324400 139745 61523 525645
$$ packed form
13619B79923N2358J66967B01577N53770p4399l22307l7377A17020K29123J03475
13609D49618J5902Q4083m4698P1871B25904N3800J54964r750A87914J23200q207
13598C02907J41939J43959K1065k04559j8709j819j71003L48725j69117J84792
13588E78180A17254K62585r9709N1480J99017j29539O4679P6202B26629J46800
13578C73429j9492L0820J76304j81632K8462j82419L851R1659K73787A47630J65249
13567C12879J33407l6035L4034j36678L49919k44140n2100A78872J69190J2791
13557C60853I008J52270K19591j4064M3359p5362R6153J02573A5003M44561P7874
13546E37438K03618C58983J27578B22406j07624K22560j2942A39745F1523M64122
$$ plain form
13536 525645 206081 419956 223678 410685 491993 282375 499658 247849 -24964 443968
13525 52771 349818 3351 364455 202351 691754 299594 501695 476386 190287 269801
13515 269801 394371 -150822 61400 21374 72010 317325 49237 188567 -59571 320537
13504 154501 431735 318588 350955 273940 340667 309080 531748 292364 98171 -67104 432334
13492 719587 378137 196185 95664 165747 410550 406044 189642 503013 183739 256527
13482 256527 350551 522255 549583 729608 402199 371252 423788 402041 232474 252975 430632
13471 430632 381044 492360 208504 366798 298107 -166728 -96071 494497 229014 130804
13461 130804 166826 9770 283548 345182 220755 405705 375884 86298 199356 252331 9273
$$ packed form
13536E25645B06081K13875j96278J87007Q1308k09618K17283B47849b4964D43968
13525E2771K97047C351L61104j62104M89403B99594K02101k5309A90287P9514
13515B69801J24570a50822F1400B1374N0636K45315D9237J39330e9571C20537
13504A54501K77234j13147L2367p7015O6727l1587K22668k39384I8171f7104D32334
13492G19587l41450j81952I5664P0083K44803m506A89642L13371A83739P2788
13482B56527R4024J71704K7328J80025l27409l0947N2536k1747j69567K0501J77657
13471D30632m9588J11316B08504J58294o8691a66728P0657D94497B29014r8210
13461A30804L6022I770K73778O1634j24427J84950k9821H6298J13058N2975I273
$$ plain form
13449 183720 314230 209233 166109 110103 204966 188023 95407 299165 -114429 217092
13438 344565 273718 194033 630209 -19164 113134 293088 216468 244540 291151 224262 534118
13427 534118 -87425 311589 197699 300208 249583 142264 264456 227475 390315 365190
13417 365190 431278 406417 -65374 56433 179180 90649 273947 461944 90371 230840 63197
13405 108102 285328 11720 126362 97748 495829 353774 210578 200096 292892 -35261
13394 94287 293560 365658 51616 213886 303580 357034 381885 101458 312272 342869 357477
13383 357477 88233 351135 346502 228381 121010 73746 52980 89803 294020 279867 230431
13372 230431 -1943 221340 138716 406527 45063 136291 311848 466244 559097 181771 142718
$$ packed form
13449A83720J30510j04997m3124n6006R4863j6943r2616K03758a14429B17092
13438C44565p0847p9685M36176a9164A13134J79954p6620K8072M6611o6889L09856
13427E34118h7425C11589j13890J02509n0625j07319J22192l6981J62840k5125
13417C65190O6088k4861f5374E6433J22747q8531J83298J87997I0371J40469F3197
13405A08102J77226A1720J14642k8614L98081j42055j43196j0482R2796c5261
13394I4287J99273P2098E1616J62270Q9694N3454K4851A01458K10814L0597J4608
13383C57477H8233K62902m633j18121j07371m7264k0766L6823K04217j4153m9436
13372B30431a943B21340q2624K67811D5063R1228J75557J54396R2853A81771l9053
$$ plain form
13361 142718 56471 568777 495397 384108 132980 728643 14501 75830 -351742 30942
13350 362390 180024 235570 309281 286606 163449 456933 422210 63101 -63 177933 -282119
13338 43275 29484 401026 150024 234324 250207 400607 -28457 256658 414621 454962 137400
13326 335604 169212 281037 282643 212365 236895 149104 341648 212905 273396 56581 213327
13315 213327 179462 103496 196281 -19106 -133103 193421 549476 27601 52044 237305 391080
13304 391080 124653 248471 39373 474192 58102 529563 205522 121426 17748 200730
13294 200730 419919 104817 393540 386653 66946 430053 348047 -10930 267050 -111707
13283 203818 274261 260399 165008 -120656 -109501 -126559 24986 81241 75360 158716 108392
$$ packed form
13361A42718E6471N12306p3380j11289A32980N95663A4501O1329c51742C0942
13350C62390A80024N5546P3711k2675j23157K93484l4723F3101f3A77933b82119
13338D3275j3791L71542A50024Q4300J5883J50400b8457B56658J57963M0341A37400
13326C35604j66392J11825J606p0278K4530q7791J92544j28743O0491E6581J56746
13315B13327l3865p5966R2785a9106j13997A93421L56055B7601K4443J85261J53775
13304C91080A24653J23818C9373M34819E8102M71461B05522q4096A7748J82982
13294B00730K19189A04817K88723o887F6946L63107q2006a0930B67050a11707
13283B03818P0443j3862r5391a20656J1155j7058B4986N6255n881Q3356n0324
$$ plain form
13272 108392 -5062 225049 351969 -25260 -58698 -92854 215349 -127944 174518 -4593 450235
13260 159016 253809 312506 376110 -245873 432549 -107861 106970 312328 -178507 387253
13249 339734 -151093 341037 62606 266783 107533 318715 216343 114749 401214 137326
13238 167570 237032 544073 200132 470729 233273 160485 199413 358867 34014 192965
13228 192965 215913 161048 6179 -174238 93289 144518 186683 55569 79250 -108293 -105939
13217 -105939 158381 25102 172980 196833 134295 -175932 267306 136528 305833 36396
13206 252186 -181451 159770 106233 227767 -43879 32309 281538 -161872 475950 55832
13195 -100822 60910 413656 167562 284277 -8036 28443 271382 252836 -168040 17527 -234167
$$ packed form
13272A08392e062B25049J26920b5260l3438l4156B15349a27944A74518d593D50235
13260A59016R4793N8697O3604b45873D32549a07861A06970K05358a78507C87253
13249C39734a51093C41037F2606K04177A07533K11182j02372j01594K86465A37326
13238A67570O9462L07041B00132K70597B33273p2788L8928J59454C4014J58951
13228A92965K2948n4865F179a74238I3289N1229M2165E5569K3681a08293K354
13217a05939A58381B5102J47878K3853o2538a75932B67306j30778J69305C6396
13206B52186a81451A59770n3537J21534d3879C2309K49229a61872D75950E5832
13195a00822F0910L52746A67562J16715h036B8443K42939j8546a68040A7527b34167
$$ plain form
13183 466651 -155232 77719 122163 444854 67587 227144 116825 50006 -95282 76273 167274
13172 167274 270600 342619 31643 49494 146988 33261 48163 40515 93637 157383 233945
13161 233945 231720 270128 280866 55794 131681 156832 267520 66540 449641 267295 83842
13149 55198 -146282 -207921 300620 233778 162000 -23423 95125 114433 477615 7810 397262
13138 397262 350789 32833 -13640 24812 156966 -91726 99587 189220 143019 79943 59593
13127 59593 41033 17075 226228 -33685 -110767 117139 268536 53082 -33521 202999 -191792
13115 -47332 -28277 395126 75945 171195 109283 68735 143634 85225 143830 75759 136945
13104 136945 -164322 269772 237255 340103 280396 -93093 -169621 32115 38247 -86148 -319083
$$ packed form
13183D66651a55232G7719M4444L22691F7587J59557j10319E0006i5282G6273R1001
13172A67274J03326P2019C1643J7851R7494C3261J4902p648N3122O3746P6562
13161B33945k225L8408J0738E5794P5887K5151J10688F6540L83101j82346H3842
13149E5198a46282o1639C00620o6842p1778b3423I5125J9308L63182G810L89452
13138C97262m6473C2833a3640B4812J32154i1726I9587Q9633m6201o3076k0350
13127E9593j8560A7075K09153c3685p7082A17139J51397E3082c3521B02999a91792
13115d7332J9055C95126G5945R5250o1912m0548P4899n8409N8605o8071O1186
13104A36945a64322B69772l2517J02848n9707i3093p6528C2115O132h6148k32935
$$ plain form
13093 -319083 214589 22630 -53937 316055 -27969 -52124 32983 160278 158575 253806 74602
13081 -240394 -15867 330114 122747 -197202 111774 173904 236648 227612 -49517 -79795 19997
13069 -192770 -150594 85305 174533 -22272 57063 -277553 -20054 172108 168965 192814 -53151
13057 343277 209148 90674 48331 27079 65309 91023 -234533 -45419 -139274 55879 217427
13046 217427 225917 233985 189509 84532 -90977 202768 -27126 -311309 -15401 158608 252429
13035 252429 94842 290226 51115 79718 45277 84350 177459 -33294 133067 19611 -104412
13023 -90707 239097 -48130 177349 -21997 125998 349780 196951 33081 12353 83011 -112199
13011 -12243 252258 49528 393769 186671 127832 130243 6628 444325 129286 138925 147364
$$ packed form
13093c19083B14589B2630e3937C16055b7969k4155C2983J27295j703R5231G4602
13081b40394a5867C30114A22747a97202A11774O2130O2744r036d9517l0278A9997
13069a92770M2176H5305Q9228b2272E7063b77553b0054A72108l143K3849e3151
13057C43277j34129I0674m2343k1252L8230K5714b34533d5419r3855E5879J61548
13046B17427Q490Q068m4476H4532i0977B02768b7126k84183a5401A58608R3821
13035B52429I4842J95384E1115K8603l4441L9073R3109c3294A33067A9611a04412
13023i0707B39097d8130A77349b1997A25998K23782j52829C3081A2353P0658a12199
13011a2243B52258D9528L44241A86671n8839K411F628M37697A29286R639Q439
$$ plain form
13000 147364 -70512 226313 62580 71621 -65324 -72261 -72754 19202 347659 -133616 317707
12988 233235 166897 -84891 -247876 204521 207244 178287 235795 350530 167619 -168019 160012
12976 -27247 -76443 -69695 -50558 100501 239147 -49245 216083 162411 149853 92929 -16711
12964 142608 -19234 -21280 98675 -158568 4400 -52493 98799 -35391 133518 -82343 186862
12952 -122739 279963 -64748 -174709 -32858 -129787 112311 163811 113315 212769 199856 211253
12941 211253 -23962 -84425 94400 7083 -149405 135497 -24635 -479495 -108098 -303467 57838
12929 -93777 -210483 -282354 183679 109493 -67150 -83308 -292563 58665 -253253 133298 73583
12918 73583 309050 32277 -107556 85320 -86639 -126166 96802 76059 -59787 93836 -14229
$$ packed form
13000A47364g0512B26313F2580R041f5324o937m93A9202L28457a33616C17707
12988B33235o6338h4891j62985B04521K723k8957N7508J14735A67619a68019A60012
12976b7247m9196O748J9137A00501J38646d9245B16083n3672j2558n6924a6711
12964A42608a9234k046I8675a58568D400e2493I8799c5391A33518h2343A86862
12952a22739B79963f4748j09961c2858r6929A12311N1500n0496R9454j2913J1397
12941B11253b3962o0463I4400G083a49405A35497b4635m54860a08098j95369E7838
12929i3777j16706p1871A83679p4186f7150j6158k09255E8665b53253A33298n9715
12918G3583K35467C2277a07556H5320h6639l9527I6802k0743e9787I3836a4229
$$ plain form
12906 302188 -124269 321196 -14271 -111581 33042 209765 -58636 -173045 -25742 8854 271210
12895 271210 277473 62320 67061 -96712 -205667 -39222 226120 101903 -26540 209932 27296
12883 28240 -80949 179669 174033 81573 270582 6353 -356631 25313 12860 182339 81419
12871 75324 -49841 270299 4145 95725 188805 103990 -21063 418862 489338 151256 203973
12860 203973 -64836 -115835 -175354 -34001 -12967 -39733 79565 -241274 -172796 -133530 123977
12848 85295 -192707 -60251 105594 273906 -136526 347717 -62986 231953 -74614 537851
12837 -162586 -57458 -31365 -23506 394520 -144166 25273 -178731 -93834 -39818 41558 10472
12825 176841 -69217 -164668 16448 -197779 -132040 356005 36554 -653 -246835 42064 358963
$$ packed form
12906C02188a24269C21196a4271r7310C3042J76723e8636j14409b5742H854K62356
12895B71210O263F2320M741i6712j08955c9222B26120A01903b6540B09932B7296
12883B8240h0949A79669n636H1573J89009F353c56631B5313j2453J69479H1419
12871G5324d9841B70299D145R1580R3080q4815b1063D18862P0476A51256N2717
12860B03973f4836n0999n9519c4001a2967k6766G9565b41274O8478L9266A23977
12848H5295a92707f0251A05594J68312a36526C47717f2986B31953g4614E37851
12837a62586e7458K6093P859C94520a44166B5273a78731Q4897c9818D1558A0472
12825A76841f9217r5451A6448a97779O5739C56005C6554f53k46182D2064L16899
$$ plain form
12814 358963 152075 -102793 -95499 -181422 106849 62191 306924 209828 156721 134303 140903
12803 140903 137216 -93004 -1736 -141830 46281 -288595 341011 -118891 -97749 -66463 31223
12791 -86622 158244 -104301 -29507 250806 221339 -94523 151720 88147 219095 108449
12780 -104188 243939 73707 208305 -72049 -19212 135614 -29710 406815 -134621 186129
12769 60334 79006 -42132 108030 -22406 68217 -114782 59903 -93511 141998 -24288 253204
12757 -20143 97022 297130 134585 75699 208343 261614 84724 -103507 -21046 -157201 -52648
12745 -200998 50683 -36600 -108353 -246344 155421 130617 285238 -158992 -332415 -220462
12735 -220462 -129268 219771 117719 -365 -21006 29975 -38246 225645 168420 -71678 113573
$$ packed form
12814C58963A52075a02793P294q5923A06849m4658K44733r7096n3107k2418O600
12803A40903l687i3004a736j40094D6281b88595C41011a18891K1142L1286C1223
12791h6622A58244a04301b9507B50806k9467i4523A51720o3573J30948A08449
12780a04188B43939G3707J34598g2049a9212A35614b9710D06815a34621A86129
12769F0334J8672d2132A08030b2406F8217a14782E9903i3511A41998b4288B53204
12757b0143I7022K00108A34585n8886J32644N3271H4724a03507b1046j36155e2648
12745b00998E0683c6600p1753j37991A55421k4804J54621a58992j73423J11953
12735b20462R1194B19771j02052c65k0641B9975c8246B25645n7225g1678A13573
$$ plain form
12723 -815 171714 -201267 -21003 217 378864 -234495 18230 80885 6843 317736 78150 42213
12711 42213 415828 265434 -213889 -93039 302601 -33170 -128520 252509 -49689 4530 -293297
12699 290873 34859 69280 360403 8531 -308040 -179 249823 -52430 -146172 154658 -72251
12687 490838 229728 -69267 215514 -90538 -194991 -315905 195995 -149250 -102 358319
12676 -71573 -13946 -57907 -118262 121528 70733 121959 -54699 -122545 397691 141938 824
12664 329883 18423 170824 137836 97747 63658 117767 202438 5762 -87920 -261599 197690
12652 374434 -94534 142484 330059 -120154 504934 -14316 -94711 -114058 -17205 238431
12641 430996 -157524 224220 134218 -180838 10672 52087 143041 126266 43464 -106738 255458
$$ packed form
12723h15A71714b01267b1003B17L78647b34495A8230O2655F843L10893G8150l5937
12711D2213L73615j50394b13889i3039C02601c3170r5350B52509d9689D530b93297
12699B90873C4859L4421K91123H531c08040a79B49823e2430r3742A54658g2251
12687D90838B29728f9267B15514i0538j04453j20914A95995a49250a02C58319
12676g1573a3946m3961o0355A21528n0795N1226e4699o7846C97691A41938H24
12664C29883A8423J52401l2988m0089l4089N4109Q4671E762h7920j73679A97690
12652C74434i4534A42484J87575a20154E04934a4316q0395j9347a7205B38431
12641D30996a57524B24220r0002a80838A0672M1415R0954j6775D3464a06738B55458
$$ plain form
12629 181118 4522 -313765 -90651 48835 112375 335128 118436 250382 -211382 397856
12618 599580 212380 39388 164257 98371 296294 129475 367390 419158 239464 -233197
12607 7637 215395 -48745 159934 317904 81054 17014 213598 123679 -222993 2582 -212526
12595 50541 -27034 -41228 174587 240647 85511 62862 126579 82926 58908 122891 47194
12583 18893 336251 312063 -234845 -47003 147077 39804 50537 198691 -165804 231023
12572 -118374 353607 -143140 122213 56892 -191402 -392571 48598 78756 -247851 255687
12561 -194368 -65234 40583 -50792 164774 -151617 212740 -46197 77971 -181510 86316 -191967
12549 106 414262 -260369 103151 217320 58217 156393 -188778 -230066 -49355 287432 -12980
$$ packed form
12629A81118D522c13765i0651D8835O3540K22753A18436J31946b11382C97856
12618E99580B12380C9388J24869o5886J97923A29475K37915N1768j79694b33197
12607G637K07758d8745A59934J57970H1054A7014J96584q9919b22993B582b12526
12595E0541b7034j4194A74587O6060H5511k2649O3717m3653k4018O3983D7194
12583A8893L17358k4188b34845d7003A47077C9804J0733J48154a65804B31023
12572a18374C53607a43140A22213E6892a91402k01169D8598L0158b47851B55687
12561a94368f5234D0583e0792A64774a51617B12740d6197G7971a81510H6316a91967
12549A06M14156b60369A03151J14169E8217R8176a88778m1288d9355B87432a2980
$$ plain form
12537 -75086 169445 -63293 87399 53896 77836 478567 163578 304781 228530 105055 38325
12525 -13711 9138 -269338 5585 404217 15551 11198 555263 -102048 80220 68264 35382
12514 35382 -170739 -38268 86310 13378 19118 -175257 -11809 70713 254157 228250 106825
12502 87661 -275877 -132930 -37030 -166322 -205839 1255 -25012 -379528 12860 -182464 287982
12490 -29201 -206723 15720 128165 329733 -122678 15495 190854 -52123 -222715 133245
12479 54943 22562 -125419 201506 -62941 -43146 -53627 -383210 -28805 -114208 -2986 -167176
12468 -167176 105730 -7214 -156404 103024 -132764 -221988 -326777 45562 83022 -151005
12457 146216 10008 -192685 -12293 146559 -31649 35060 25621 -276582 -116007 -103080 71663
$$ packed form
12537g5086A69445f3293H7399l3503K3940M00731A63578J41203p6251A05055C8325
12525a3711I138b69338E585L98632A5551m353N44065a02048H0220j1956l2882
12514C5382a70739c8268H6310A3378N740a75257a1809G0713J83444k5907A06825
12502H7661b75877a32930c7030j29292l9517A255b5012l54516A2860a82464B87982
12490b9201j77522A5720J12445K01568a22678A5495J75359e2123j70592A33245
12479E4943B2562a25419B01506f2941J9795j0481l29583b8805q5403b986j64190
12468a67176A05730g214j49190A03024a32764q9224j04789D5562L7460a51005
12457A46216A0008a92685a2293A46559c1649C5060r439b76582a16007J2927G1663
$$ plain form
12445 -94668 214680 -358810 39965 104969 168693 105827 -121881 -133512 -155945 -367245 -21046
12433 28016 -177078 -32134 444230 -198936 -232568 368349 22524 -388621 -159936 -147633
12423 -147633 -346308 45553 -186692 -27460 -37441 375679 125876 104223 211888 52911 375126
12412 375126 16155 -110540 34974 351351 279784 66321 -256704 5071 76366 -162518 239859
12400 249901 37858 28139 -275902 139930 -75129 -45060 -87373 -132577 -39368 -63084 -149165
12389 -149165 169377 -154216 173200 132903 363530 -28915 208511 102170 -43610 -294650
12379 -294650 -24903 115709 -67958 -72412 422192 136068 -69033 -67082 158342 -215891 60339
12367 118214 119164 -216318 92014 -160324 -29654 5023 38679 273033 4892 223859 -248719
$$ packed form
12445i4668B14680c58810C9965O5004O3724o2866a21881j1631k2433k11300b1046
12433B8016a77078c2134D44230a98936l3632C68349B2524c88621a59936J2303
12423a47633j98675D5553a86692b7460r981C75679A25876k1653J07665E2911L22215
12412C75126A6155a10540C4974L16377p1567F6321b56704E071P1295a62518B39859
12400B49901C7858r719b75902A39930g5129L0069m2313m5204c9368k3716q6081
12389a49165A69377a54216A73200m0297K30627b8915B08511A02170d3610k51040
12379b94650b4903A15709f7958m454D22192A36068f9033J951A58342b15891F0339
12367A18214R50b16318I2014a60324b9654E023L3656K34354D892K18967b48719
$$ plain form
12355 209198 104119 -39658 -344536 86446 34122 234215 3613 11400 7570 22563 289469
12344 289469 38852 276790 -68244 -174485 -132759 95783 5860 67689 30836 -161739 -126249
12333 -126249 -174531 138897 -98117 -336397 224057 33403 169232 140878 -217524 106700
12322 228765 -262533 -97089 62469 -76297 -32071 26843 -149085 89755 -389004 128518 69959
12311 69959 88219 -60984 -11550 62967 52774 379444 2980 5674 109770 246151 -143482
12299 68933 -17451 -182357 -165701 80553 22472 321346 166901 2344 -112179 -67434 149637
12287 380745 129781 -79333 22255 -395626 -104185 -31237 269530 5125 -163495 -145483 -44534
12275 127265 -138143 448 -55828 -321548 -213001 -259097 69227 -113357 49981 -287033 -13521
$$ packed form
12355B09198A04119c9658l04878H6446C4122K00093C613P787l830J4993K66906
12344B89469C8852K37938f8244j06241M1726I5783E860O1829C0836a61739L5490
12333a26249m8282A38897i8117k38280B24057C3403J35829k8354b17524A06700
12322B28765b62533i7089F2469g6297c2071B6843a49085H9755c89004A28518n8559
12311F9959J8260f0984a1550F2967j0193L26670B980K694J04096J36381a43482
12299F8933a7451j64906J6656H0553B2472K98874j54445B344a12179M4745A49637
12287C80745A29781g9333B2255c95626a04185c1237B69530E125a63495J8012d4534
12275A27265a38143D48e5828k65720J08547m6096F9227a13357D9981b87033a3521
$$ plain form
12263 -29954 -282917 -164567 -169921 -78224 106327 -57727 -36792 318480 9142 245048 -83839
12251 199291 -322683 186363 104344 18858 -14165 45017 111422 -238078 -33864 131198 -47391
12239 160047 -128706 112002 101666 -104172 98624 229672 137524 -54594 326380 54771
12228 33748 470175 -28281 80499 100679 2169 134685 -53156 -44673 6402 94167 328905 -123493
12215 559476 141761 411705 26022 251275 101748 72528 -43675 99680 232792 52717
12204 373814 21805 -160223 465549 -5619 -267961 352730 185523 -21858 -14796 166244 129286
12193 129286 247933 -54645 134678 213064 442625 111972 -63350 230078 158955 317300
12183 317300 -3331 325704 259715 -101792 262484 3228 -102170 150139 6248 249932 225971
$$ packed form
12263b9954k52963J18350n354g8224A06327e7727K0935C18480I142K35906h3839
12251A99291c22683A86363q2019A8858a4165D5017O6405b38078c3864A31198d7391
12239A60047a28706A12002j0336a04172I8624J31048r2148e4594C26380E4771
12228C3748M36427b8281H0499K0180B169J32516e3156Q483F402Q7765K34738a23493
12215E59476A41761K69944B6022K25253A01748k9220d3675I9680J33112E2717
12204C73814B1805a60223D65549e619k62342C52730j67207b1858P062A66244l6958
12193A29286J18647e4645A34678P8386K29561A11972f3350B30078p1123J58345
12183C17300c331C25704o5989a01792B62484C228a02170A50139F248K43684k3961
$$ plain form
12172 225971 53101 287284 22969 26943 -90988 149255 -39921 -136326 -205243 124173 140832
12161 140832 46558 -313927 107007 66205 272876 339385 49995 92604 28596 574 5852
12150 5852 306512 455982 245987 189492 -13806 432029 136207 -10594 487594 4646 -111515
12138 216552 105990 -145761 258542 258531 -229581 -72040 229109 -52360 184504 84656 -171266
12126 168467 -65895 241692 -9708 -92202 4375 -74888 76086 -67648 -54713 308944 144677
12114 249060 1744 198833 31627 -288528 -35830 212191 -16687 91254 -132762 133003 -147422
12102 250229 258603 192584 -24367 81327 -289558 68640 -119392 -289193 -80857 -121273 -28638
12090 121474 45986 -159205 -90193 -299571 -181223 105377 -62429 6542 201902 157427 325619
$$ packed form
12172B25971E3101K34183B2969L974i0988A49255c9921r6405o8917A24173J6659
12161A40832D6558c13927A07007m0802K06671O6509D9995M2609B8596E74N278
12150E852L00660J49470k09995n6495a3806D32029A36207a0594D87594D646a11515
12138B16552A05990a45761B58542j1b29581g2040B29109e2360A84504H4656a71266
12126A68467f5895B41692i708q2494D375g4888G6086f7648J2935C08944A44677
12114B49060A744J97089C1627b88528c5830B12191a6687I1254a32762A33003a47422
12102B50229Q374o6019b4367H1327b89558F8640a19392j69801h0857m0416b8638
12090A21474D5986a59205O9012k09378J18348A05377f2429F542J95360m4475J68192
$$ plain form
12079 325619 55838 -208306 -130334 226284 -47676 134595 177260 -123115 -290363 -55186
12068 -83693 -36111 -123971 101646 -106258 -42700 488596 110607 537572 1043141 761587
12058 761587 342756 498542 250827 215871 194696 -16569 -66270 53299 -133506 163727
12047 209370 -7191 7771 120145 131799 6594 14834 -136416 -82017 225350 103015 -34791
12035 -11283 -101258 -40555 -225571 -108749 174236 -155778 261624 106005 46301 -89903
12024 -76278 -33400 161711 -24064 83787 215591 -31532 138766 -197375 -48190 -243824 12334
12012 281758 -157877 100860 33872 -357730 -141996 -276662 102579 -254384 337952 -208157
12001 18273 -82732 11570 236932 -539119 -38548 -108247 255806 253206 -533 59398 75606 -25723
$$ packed form
12079C25619E5838b08306P7972B26284d7676A34595M2665a23115j67248e5186
12068h3693c6111q7860A01646a06258d2700D88596A10607M26965N05569k81554
12058G61587C42756J55786k47715l4956k1175a6569m9701E3299a33506A63727
12047B09370g191G771J12374J1654F594Q240a36416N4399B25350A03015c4791
12035a1283q9975d0555j85016a08749A74236a55778B61624A06005D6301h9903
12024g6278c3400A61711b4064H3787J31804c1532A38766a97375d8190j95634A2334
12012B81758a57877A00860C3872c57730a41996j34666A02579b54384C37952b08157
12001A8273h2732A1570K25362e39119c8548o9699B55806k600e33E9398J6208b5723
$$ plain form
11988 19096 370336 37648 -223099 -123867 71823 410544 -279700 -20897 18414 245932 -389413
11976 10472 -217489 120174 216709 -70014 193668 26511 3681 160323 -129108 200261 -246801
11964 -141534 -69821 -49232 8746 60459 -294781 -117865 119051 -228964 220109 -102244
11953 -312485 45414 -61999 -138439 159047 -43322 22910 -98387 28862 -18383 -268308 110131
11941 80891 106739 -53354 -67293 22057 196310 -398565 -29847 176544 -198711 146680 -121440
11929 17243 68843 62499 -40459 -61276 -52320 -325557 229587 165916 265037 333521 -169510
11917 -224931 -11307 -190419 103591 48450 -190008 290909 12508 108454 183826 21144 128032
11906 128032 -353934 75283 -417832 -172450 -120746 141147 53099 -198249 112120 362903
$$ packed form
11988A9096L51240C7648b23099R9232G1823L38721b79700b0897A8414K27518c89413
11976A0472b17489A20174R6535g0014A93668B6511C681J56642a29108B00261b46801
11964a41534f9821K0589H746N1713b94781a17865A19051b28964B20109a02244
11953c12485D5414f1999p6440A59047d3322B2910i8387B8862a8383k49925A10131
11941H0891K5848e3354j3939B2057J74253c98565b9847A76544a98711A46680a21440
11929A7243N1600o344d0459k0817Q956k73237B29587o3671R9121O8484a69510
11917b24931a1307j79112A03591D8450a90008B90909A2508R5946P5372B1144J06888
11906A28032c53934G5283d17832a72450N1704A41147E3099a98249A12120K50783
$$ plain form
11896 362903 208507 -48473 -27626 -165042 -450220 51455 -290421 69785 147979 -205809
11885 -147640 98205 -96083 -247310 -41732 35975 59258 170476 -257256 93861 83136 79470
11874 79470 -189143 11574 226537 -197887 293262 -196323 70445 -309497 -94654 159419
11863 125121 -92035 -14030 -103881 188126 -295844 -113045 -174050 -126992 -61874 -257901 85022
11851 -271827 -311605 286502 168290 80450 140253 42620 -376 -265900 -174470 20051 -158761
11839 -34480 -240972 80859 -104572 -97189 63811 139676 -83301 175510 -96269 -186229 -374815
11828 -374815 266428 -43532 -88895 -8354 91061 134072 342010 -34638 -182013 122650 5694
11816 -73190 -204364 144894 -463012 75442 -85879 -134000 128792 -250954 -59340 56525 20366
$$ packed form
11896C62903j54396d8473K0847j37416k85178E1455b90421F9785P8194b05809
11885a47640I8205i6083j51227d1732C5975K3283J11218b57256I3861j0725l666
11874G9470a89143A1574K14963a97887B93262a96323G0445c09497i4654A59419
11863A25121i2035a4030q9851A88126b95844a13045o1005M7058f1874j96027H5022
11851b71827l9778B86502j18212H0450N9803D2620c76k65524R1430B0051a58761
11839c4480k06492H0859a04572P383F3811P5865h3301A75510i6269q9960j88586
11828c74815B66428d3532m5363h354I1061M3011K07938c4638j47375A22650E694
11816g3190j31174A44894d63012G5442h5879m8121A28792b50954e9340E6525B0366
$$ plain form
11804 85817 -126423 178768 76106 240700 -28916 -95825 -344259 -90525 -269457 424103
11793 -32694 -58913 -314179 -69944 -133680 -183793 -86590 -122674 -30681 -144431 -268403 126559
11781 30437 -155203 -133206 -191673 7643 -272114 53278 176171 317190 -265502 -106836 -374378
11770 -374378 -192982 -12396 -245222 -140055 194486 -35029 17159 33605 207015 -298148
11759 40952 421699 -16177 182438 55557 50360 63199 -158718 77096 217715 -169043 81049
11747 -145404 89299 -159731 -113706 104148 416126 -40612 -96178 215688 46696 -5804 9068
11735 46869 -20565 -48226 -17314 -104104 52297 -204264 283682 127440 194651 50873 198055
11724 198055 152656 145810 -254386 210464 -226034 295710 -58296 183019 -177395 107469
$$ packed form
11804H5817a26423A78768G6106J64594b8916o6909k48434i0525j78932D24103
11793c2694k6219k55266f9944o3736n0113h6590l6084c0681j13750j23972A26559
11781C0437a55203K1997n8467G643b72114E3278J22893J41019b65502a06836k67542
11770c74378J81396a2396k32826J05167A94486c5029A7159J6446J73410b98148
11759D0952L80747a6177A82438E5557n197J2839a58718G7096J40619a69043H1049
11747a45404H9299a59731M6025A04148L11978d0612n5566B15688D6696e804I068
11735D6869b0565k7661a7314q6790E2297b04264B83682A27440O7211E0873J47182
11724A98055m5399o846b54386B10464b26034B95710e8296A83019a77395A07469
$$ plain form
11713 -243338 238518 -59723 54502 -55309 149563 78560 80001 -25572 181481 133539 -42294
11701 22845 242950 90394 263262 -12156 -276297 353822 -377055 -130411 -104704 -34210
11690 -25936 17496 81905 26260 -168255 79795 176819 -78620 331221 10165 100058 -154586
11678 -276681 71955 70768 12616 70661 -92796 29590 139967 -11791 448485 -6144 -22937
11667 -22937 188729 189296 -281069 -20092 -111813 53208 231981 164445 131112 -238726 -124613
11656 -124613 20737 -285160 -229734 15194 98705 41845 -198345 -16359 -56359 -60206 29269
11644 11573 242698 35806 96471 47561 -118070 70414 193278 -41663 2647 88194 113674
11633 113674 -168620 43308 142564 209469 283677 -73464 185613 -214068 -191007 -95802 -1377
$$ packed form
11713b43338B38518e9723E4502e5309A49563p1003J441b5572A81481m7942d2294
11701B2845K20105I0394J72868a2156k64141C53822c77055a30411K5707c4210
11690b5936A7496O4409B6260a68255G9795R7024g8620C31221A0165Q9893a54586
11678b76681G1955j187A2616N8045i2796B9590J10377a1791D48485f144j6793
11667b2937A88729N67b81069b0092r1721E3208J78773o7536l3333b38726J14113
11656a24613B0737b85160N5426A5194Q3511D1845a98345a6359m0000l847B9269
11644A1573K31125C5806O0665D7561a18070G0414J22864d1663B647Q5547K5480
11633A13674a68620D3308R9256O6905P4208g3464A85613b14068K3061R5205a377
$$ plain form
11621 176077 163598 -57047 -98367 33023 186314 -268152 -141528 -234516 99626 -33774 54208
11609 115425 94523 227597 -59972 80446 144269 6368 -22723 -46413 163886 -94925 39055
11597 -236798 -90690 -69708 -121702 -4322 -60913 -98352 187901 -204064 185277 80115 15674
11585 -34957 203906 113227 149625 132358 23218 305832 56999 144279 -62437 -53644 270183
11573 -13486 -34740 139670 -215109 -42728 -28436 -347885 -166767 170981 389692 74386
11562 12958 44172 155544 3283 -201619 185475 90236 -12469 67791 39564 -4560 297671
11550 158448 -204746 -68777 -90463 -69672 144371 77830 -118758 140999 79528 51083 52845
11539 52845 106475 -35329 -338899 136632 -373747 269726 91089 -41263 480651 63686 167548
$$ packed form
11621A76077j2479e7047m1320C3023J53291b68152J26624r2988I9626c3774E4208
11609A15425k0902J33074e9972H0446O3823F368b2723k3690A63886i4925C9055
11597b36798i0690K0982n1994d322n6591l7439A87901b04064A85277H0115A5674
11585c4957B03906r0679L6398j7267B3218K82614E6999Q7280f2437Q793B70183
11573a3486k1254A39670b15109d2728J4292l19449a66767A70981K18711G4386
11562A2958L1214J11372C283b01619A85475I0236a2469F7791k8227d560B97671
11550A58448b04746f8777k1686K0791A44371o6541a18758A40999o1471k8445J762
11539E2845N3630c5329l03570A36632c73747B69726I1089d1263D80651F3686J03862
$$ plain form
11528 167548 79572 112794 138766 123931 -8911 -467755 88004 133042 96563 240833 293456
11517 293456 428479 -172110 143435 -281737 -9783 82288 94078 -67986 -64818 -73258 33174
11505 287090 184220 278309 196815 463746 95815 36942 -11400 -105225 -121140 305740 44999
11493 -20894 47180 169034 223078 -18941 -116958 -126615 -108313 82436 -39985 170663 -176042
11481 83335 177952 180891 159791 42257 -147905 -294507 147406 115862 -77710 220462 25548
11469 18864 131182 243489 227120 -7428 160101 270712 59848 -144046 346315 313071 290228
11458 290228 211244 -19371 226975 44186 -28535 -7198 73182 258757 340880 23090 64708
11447 64708 -25066 -20263 -180584 -52452 185569 160364 62159 563200 66870 13487 309150
$$ packed form
11528A67548G9572L3222K5972j4835h911m58844H8004M5038l6479J44270N2623
11517B93456J35023a72110A43435b81737i783H2288J1790f7986L168q440C3174
11505B87090j02870R4089q1494K66931I5815C6942a1400r3825j5915C05740D4999
11493b0894D7180J21854N4044a8941r8017r657J8302H2436c9985A70663a76042
11481H3335R4617K939k1100D2257a47905j46602A47406l1544g7710B20462B5548
11469A8864J12318J12307j6369g428A60101J10611E9848a44046C46315l3244k2843
11458B90228p8984a9371B26975D4186b8535g198G3182J85575Q2123B3090M1618
11447F4708b5066M803j60321e2452A85569k5205F2159N01041F6870A3487K95663
$$ plain form
11436 309150 13259 86105 -461836 55591 -68131 60678 65826 37540 -95304 128186 239804
11425 239804 -253159 190189 72561 343790 -175721 193914 61471 7379 96644 -193747
11414 -201634 24161 -154350 -181786 146140 -72688 9133 -46129 -2273 130724 -113134 -158587
11403 -158587 103176 113228 363347 -224874 170962 163601 -169394 292544 -50582 -20985
11392 -50498 167809 -61492 -161142 69980 -176067 88872 -324058 516002 200114 60417 -419190
11380 199842 61629 45103 196070 87889 102721 -25580 -181468 -636605 97159 -44254 177373
11368 187787 -140281 -164229 -3077 175584 127344 -24329 -149587 43275 63835 120322 -12718
11356 50796 -153183 -71036 -65860 -413681 -182163 -112418 -179814 -43215 86120 -138224 -124779
$$ packed form
11436C09150A3259P2846d61836E5591f8131F0678N148k8286i5304A28186J11618
11425B39804b53159A90189G2561K71229a75721A93914F1471G379Q9265a93747
11414b01634B4161a54350k7436A46140g2688I133d6129b273A30724a13134m5453
11403a58587A03176J0052K50119b24874A70962p361a69394B92544e0582b0985
11392e0498A67809f1492r9650F9980a76067H8872c24058E16002B00114F0417d19190
11380A99842F1629j6526J50967H7889J4832b5580j55888m55137I7159d4254A77373
11368A87787a40281k3948c077A75584m8240b4329j25258D3275K0560N6487a2718
11356E0796a53183g1036N176l47821a82163O9745o7396d3215H6120a38224J3445
$$ plain form
11345 -124779 103708 -6220 16074 -81170 120604 170430 -216139 177057 -111780 -54024 -162953
11334 -162953 -314069 87761 -44659 43594 -37539 156559 -4788 -180644 158684 23808 268741
11323 268741 7732 -160150 157729 73941 -84014 -44832 431773 149580 -15649 183531 32927
11311 42027 53753 -232503 -15688 215723 12435 -109019 -18692 67113 -89121 -5921 -49420
11300 -49420 237379 74148 -124653 -245854 -46426 -20486 39636 -29335 -212464 363126 -101963
11288 -259901 28198 53787 -68202 -36546 -262434 -14478 -110029 -232568 318591 -200728 -35707
11276 184168 -444790 -55228 -105797 -75939 -275834 3106 150798 -22985 -222521 -269294 257428
11264 -11921 138136 -71220 381554 173190 -43337 -44322 -27067 74387 136420 -255676 -198058
$$ packed form
11345a24779A03708f220A6074h1170A20604M9826b16139A77057a11780e4024j08929
11334a62953j51116H7761d4659D3594c7539A56559d788j75856A58684B3808K44933
11323B68741G732a60150A57729G3941h4014L9182D31773A49580a5649A83531C2927
11311D2027J1726b32503a5688B15723A2435a09019a8692F7113h9121e921m3499
11300d9420B37379G4148a24653j21201d6426b0486C9636b9335j83129C63126a01963
11288b59901B8198K5589f8202L1656k25888a4478r5551j22539C18591b00728c5707
11276A84168d44790e5228n0569K9858j99895C106J47692b2985j99536m6773B57428
11264a1921A38136g1220C81554A73190d3337r85J7255G4387O2033b55676N7618
$$ plain form
11253 -198058 -42091 -144035 -113475 18891 -191209 80832 71468 -70868 -110196 -71111 -24462
11241 185041 89174 -179288 -104365 316177 132353 -200234 -64945 -104276 194858 215159
11231 215159 -9604 -371659 1578 -581 -236222 -8459 135008 -52695 84524 156601 -157795 -53251
11218 -267160 75423 205448 -153444 -221859 -242617 -279780 175631 119364 27258 -5058 6782
11206 -24853 -266978 -295417 -238867 1598 169915 70666 -183331 66763 145906 15505 99306
11195 99306 -78412 206197 -338189 126373 21589 -78668 -226045 -155895 109563 -157986
11184 131793 -122997 -225163 154412 -86005 -286423 -246689 191561 -114647 40509 72736
11174 72736 88339 -232412 -80147 -18371 149009 75713 -259072 -202802 -128055 -314648 -53693
$$ packed form
11253a98058d2091j01944L0560A8891a91209H0832r364g0868l9328L9085b4462
11241A85041H9174a79288P4923C16177A32353b00234f4945l9331A94858K0301
11231B15159i604l62055A578e81k35641h459A35008e2695H4524P2077a57795e3251
11218b67160G5423J30025a53444o8415k0758l7163A75631n6267B7258e058F782
11206b4853k42125k8439N6550A598J68317G0666a83331F6763P9143A5505Q3801
11195I9306g8412B06197c38189A26373B1589g8668j47377P0150A09563a57986
11184A31793a22997j02166A54412h6005k00418L9734A91561a14647D0509L2227
11174G2736J5603b32412h0147a8371A49009p3296b59072N6270P4747j86593e3693
$$ plain form
11162 -177879 274970 -59548 -159638 -240100 -145767 30662 312154 -64539 -108989 -319759 124506
11150 77292 -215549 -82849 -293830 18083 98660 101887 114180 242739 202314 64585 31178
11138 -168339 160321 86760 -39431 -120063 -73565 -338943 373546 -254166 41772 10564 44099
11127 44099 152216 51440 211090 45084 296955 -99061 93848 37641 58741 -236858 60675
11115 35731 52273 96367 195187 -267230 54506 22050 159 38176 137563 -79547 183291 148956
11103 148956 79016 -208180 109659 289580 85718 78612 120909 -99679 169534 231072 291221
11092 291221 58314 34456 -52986 388085 185488 -194170 198150 150334 87489 71725 349216
11081 349216 157708 -59347 166736 181150 -72503 247757 63472 187056 262510 192725 377243
$$ packed form
11162a77879B74970e9548j00090q0462R4333C0662K81492f4539m4450k10770A24506
11150G7292b15549h2849k10981A8083Q0577L227J2293J28559m0425F4585C1178
11138a68339A60321p3561c9431q0632M6498k65378C73546b54166D1772A0564L3535
11127D4099J08117E1440J59650D5084K51871i9061I3848C7641K1100b36858F0675
11115C5731J6542M4094R8820b67230E4506B2050A59L8017R9387g9547A83291l4335
11103A48956o9940b08180A09659J79921H5718p106M2297i9679A69534O1538O0149
11092B91221E8314k3858e2986C88085A85488a94170A98150m7816o2845j5764K77491
11081C49216A57708e9347A66736J4414g2503B47757F3472J23584P5454o9785J84518
$$ plain form
11070 377243 44777 -60393 183292 -104410 268367 144000 181097 209167 330515 314490
11060 314490 208401 361332 404442 -65978 266214 529095 -1490 568858 254472 265950
11050 265950 423067 550519 191590 430884 388416 589848 584485 220674 496690 628393
11040 628393 514904 890849 348942 585047 327225 645592 346795 432728 607583 675140
11030 675140 761835 728581 546117 304882 308569 576671 770744 708581 269170 938311
11020 938311 623796 734339 427283 260894 417817 467519 509683 675986 675803 632320 552069
11009 552069 476302 366742 533892 328791 546736 361362 512867 603515 647871 569347
10999 569347 352382 540433 307771 470865 507435 807930 825765 361585 495810 435550
$$ packed form
11070C77243D4777f0393A83292a04410B68367j24367L7097K8070J21348j6025
11060C14490j06089J52931M3110f5978B66214K62881a490E68858B54472J1478
11050B65950J57117J27452A91590K39294m2468K01432n363B20674K76016J31703
11040F28393j13489L75945C48942K36105k57822L18367k98797Q5933J74855O7557
11030F75140Q6695l3254j82464k41235L687K68102J94073o2163B69170O69141
11020I38311l14515J10543l07056j66389J56923M9702M2164J66303j83m3483q0251
11009E52069p5767j09560J67150k05101K17945j85374J51505R0648M4356p8524
10999E69347k16965J88051k32662J63094L6570L00495J7835C61585J34225o0260
$$ plain form
10989 435550 592711 441707 987134 648644 651548 571864 702334 514449 840415 559277
10979 559277 636161 695210 613842 540950 847324 912886 704179 864395 851386 775432 832315
10968 832315 835745 1151230 1044550 1490955 1271371 1153636 1830238 1594304 1942882 2098497
10958 2098497 2365522 2601387 2313864 2314353 2409320 1812583 1855180 1732432 1461810 1562940
10948 1562940 1554941 1348173 1459370 1450397 1208736 1599030 1181865 1080657 1162681 1046764
10938 1046764 1061416 788326 1010267 577233 440072 1024049 500671 270190 269200 375432
10928 375432 89548 82161 23016 -46024 286014 -125996 321600 105599 55536 -36176 157839
10916 135692 -292091 -219619 84858 -298398 260287 124069 -120429 -250978 13692 109548
$$ packed form
10989D35550J57161j51004N45427l38490K904p9684J30470j87885L25966k81138
10979E59277P6884N9049q1368p2892L06374O5562k08707J60216j3009p5954N6883
10968H32315L430L15485j06680M46405k19584j17735O76602k35934L48578J55615
10958B098497K67025K35865k87523M89R4967n96737M2597j22748k70622J01130
10948A562940p999k06768J11197q973k41661L90294m17165j01208Q2024j15917
10938A046764J4652k73090K21941m33034j37161N83977E00671k30481r90J06232
10928C75432H9548p387B3016d6024B86014a25996C21600A05599n0063c6176A57839
10916A35692b92091P2472H4858b98398B60287A24069a20429j30549A3692R5856
$$ plain form
10906 109548 43154 274898 136395 -309968 3555 187140 164460 -237465 -25312 -225942
10896 -225942 -73143 7816 124420 36446 -115666 -91858 7986 -345428 260699 86774 -264785
10884 31467 -36335 -257585 -57355 -88417 -270367 47348 -223684 191025 171170 189430 48667
10872 109715 220149 213290 -24459 347155 -349974 -166533 50069 -4372 102664 74044 45160
10861 45160 311391 150725 -304114 -232766 -302917 198059 -123130 -115540 14870 -36483 -95381
10850 -95381 -212529 -219851 -8795 79690 -77740 192416 -211209 -27712 37997 -132278 115129
10838 146048 -234883 89905 110953 -102315 -122434 -119536 -11189 22022 -30159 -22899 32487
10826 -335888 149380 259464 210061 -11570 17573 68352 -115384 -214819 -223777 -188174 205259
$$ packed form
10906A09548D3154K31744A36395c09968C555J83585k2680b37465b5312k00630
10896b25942g3143G816J16604C6446a15666K3808G986c45428B60699H6774b64785
10884C1467c6335k21250e7355l1062j81950D7348b23684A91025j9855J8260D8667
10872A09715J10434o859b4459C47155c49974a66533E0069d372A02664k8620k8884
10861D5160K66231A50725c04114P1348p0151A98059a23130P590A4870c6483n8898
10850i5381j17148p322h795G9690g7740A92416b11209b7712C7997a32278A15129
10838A46048b34883H9905K1048a02315k0119K898a1189B2022c0159P260C2487
10826c35888A49380J10084m9403a1570A7573N0779a15384r9435q958L5603B05259
$$ plain form
10814 -46116 -198568 -104011 25830 -70110 286048 -257518 202906 237093 -192668 -278466 -21599
10802 -55864 286784 228280 78278 -143353 161418 131078 279108 -70079 -39180 33224 23530
10791 23530 -202754 14081 -190053 -218098 -488163 -220248 -171114 -48726 -46174 -33573 -69816
10780 -69816 -65484 -155157 -457127 303405 69199 43000 -158893 58088 -96165 92168 -266046
10768 -85188 -328247 -269142 18131 -68344 124946 27004 -67870 224798 -82799 200789 61221
10756 -76541 -205980 -59727 354054 -126902 -112382 -125789 35794 -12714 -280020 -187896 -111644
10745 -111644 -27610 -433346 98954 -291641 -247991 102962 4865 -121733 -244228 -175724 -269557
10734 -269557 -135135 153623 -356256 15294 -110408 174604 -68839 129467 -154145 -42029
$$ packed form
10814d6116j52452R4557B5830g0110B86048b57518B02906L4187a92668q5798b1599
10802e5864B86784n8504G8278a43353A61418l0340J48030g0079L0899C3224r694
10791B3530b02754A4081a90053k8045k70065b20248M9134d8726K552J2601l6243
10780f9816M332q9673l01970C03405F9199k6199a58893E8088i6165I2168b66046
10768h5188k43059N9105A8131f8344A24946B7004f7870B24798h2799B00789F1221
10756g6541j29439e9727C54054a26902J4520j3407C5794a2714k67306R2124P6252
10745a11644b7610m05736I8954b91641M3650A02962D865a21733j22495O8504r3833
10734b69557J34422A53623c56256A5294a10408A74604f8839A29467a54145d2029
$$ plain form
10723 140552 -102469 96370 -41599 -382151 -131288 -256017 -47644 29547 -101287 8959 -334874
10711 -131951 -57500 -117740 -94888 323833 65534 -116722 67566 -1377 12276 -156646 17904
10699 -74226 -276028 -202562 127853 -251775 197890 -209717 -164898 188217 -122524 75643
10688 -189124 -187922 -39168 -140260 -58826 42048 -313892 -155914 -386488 -223876 -275506 63019
10676 159068 514276 -209528 -62239 -106843 -260722 -64193 -288228 -209927 -16486 231626
10665 -32450 82411 -188547 -54456 -80682 140564 158786 -133419 243548 55305 -93463 -268546
10654 -268546 180697 293019 -174025 128302 -174471 138965 314625 -90995 240304 99741
10643 34912 -241145 58635 60528 -15598 220887 -77075 121340 -77710 -290895 -338068 22734
$$ packed form
10723A40552a02469I6370d1599l40552a31288j24729d7644B9547a01287H959c34874
10711a31951e7500o0240K2852C23833F5534a16722F7566a377A2276a56646A7904
10699g4226k01802P3466A27853b51775A97890b09717M4819A88217a22524G5643
10688a89124J202c9168j01092e8826D2048c13892a55914k30574J62612n1630F3019
10676A59068L55208b09528f2239m4604j53879f4193k24035P8301a6486B31626
10665c2450H2411a88547e4456k6226A40564J8222a33419B43548E5305i3463j75083
10654b68546A80697J12322a74025A28302a74471A38965J75660i0995B40304I9741
10643C4912b41145E8635J893a5598B20887g7075A21340g7710k13185m7173B2734
$$ plain form
10631 -53760 -165043 -27453 128835 -341607 -270451 93740 -155046 15905 -87037 69099 221303
10620 221303 -61117 -459653 290998 -61799 -189545 -42778 79870 -268228 -17832 -170824
10610 -170824 -10902 10600 118026 92533 -201427 175063 182606 311500 -474409 -44451 -249376
10599 -249376 -125164 -69122 -32009 71020 -47985 31713 -230772 86055 -239780 -98722 -130716
10588 -130716 48396 -134227 -314223 -183725 100006 -19182 51295 -200073 -21955 423290
10577 -298379 -60254 71484 -126337 41507 492 -191848 -159546 400591 -52199 43046 282851
10566 282851 53056 -178448 188091 -220425 67805 -103694 52761 -111579 -166130 87106
10555 -125596 79813 -111440 97848 156130 214450 -85092 -115537 29785 -150113 38909 -239665
$$ packed form
10631e3760j11283b7453A28835c41607P1156I3740a55046A5905h7037F9099J52204
10620B21303f1117l98536B90998f1799j27746d2778G9870b68228a7832j52992
10610a70824a0902A0600J07426k5493b01427A75063P543J28894d74409d4451k04925
10599b49376J24212N6042c2009G1020d7985C1713b30772H6055b39780i8722l1994
10588a30716D8396a34227j79996J30498A00006a9182E1295b00073b1955D23290
10577b98379f0254G1484a26337D1507D92a91848L2302D00591e2199D3046K39805
10566B82851E3056a78448A88091b20425F7805a03694E2761a11579n4551H7106
10555a25596G9813a11440I7848N8282N8320h5092l0445B9785a50113C8909b39665
$$ plain form
10543 -80708 325751 -383699 -340456 126744 17853 -142317 -353605 -301676 -13209 -65222 60173
10531 41157 92133 99429 -28742 -439809 159275 -176832 -272882 -21741 -38498 205923 30305
10519 -168195 -234127 -19534 -191226 110064 -159123 -62349 1101 -246834 -3747 -227199 -312908
10508 -312908 -264103 44597 10867 -285533 264631 61457 -198508 -389287 -281769 -113403
10497 -212308 -5329 -133683 93265 26858 -128284 74214 -3862 200742 -201579 20748 -81700
10485 33409 60968 63948 -164697 157410 116009 -150016 372290 -261571 -43229 -59563 127481
10473 183207 30707 246249 -356627 100864 168080 57914 288497 285332 -6582 398040 407080
10462 407080 352683 25448 220691 -137189 108801 285207 -98020 113853 -64739 -74487 184284
$$ packed form
10543h0708C25751c83699M3243A26744A7853a42317k11288N1929a3209n2013F0173
10531D1157N0976P296b8742m11067A59275a76832r6050b1741j6757B05923C0305
10519a68195o5932a9534j71692A10064a59123f2349A101b46834c747k23452q5709
10508c12908M8805D4597A0867b85533B64631F1457a98508j90779J07518a13403
10497b12308e329j28354I3265B6858a28284G4214c862B00742b01579B0748h1700
10485C3409K7559K980a64697A57410m1401a50016C72290b61571d3229j6334A27481
10473A83207C0707K15542c56627A00864O7216E7914K30583l165f582C98040R040
10462D07080n4397B5448J95243a37189A08801J76406i8020A13853f4739r748A84284
$$ plain form
10450 272668 -135008 109191 -212885 -23474 88929 -196843 -391820 73319 1117 131061
10440 131061 -47978 59885 190941 45035 222539 -170373 33176 -226050 155424 116766
10430 116766 -233045 -52663 113607 -109174 199382 174225 57383 18573 55204 -74362 237545
10418 -72188 -189887 74229 48411 -24594 -150398 -109150 137811 -81331 -153935 -68455 -74327
10407 -74327 -44336 45197 -186611 -141552 -277731 15221 25666 -113607 224963 -1075 56911
10395 52398 -20495 -116854 80958 -134172 -32518 -129984 -5872 3234 255293 186067 -327331
10383 -167128 -76021 141911 237573 107187 -112541 -44145 362599 -65980 -272240 -115645
10372 -45243 79587 243245 398216 -280924 -99575 143212 -109751 155517 -117493 -192911
$$ packed form
10450B72668a35008A09191b12885b3474H8929a96843j94977G3319A117J29944
10440A31061d7978E9885J31056D5035J77504a70373C3176b26050A55424l8658
10430A16766b33045e2663A13607a09174A99382k5157E7383A8573L6631g4362B37545
10418g2188j17699G4229k5818b4594j25804M1248A37811h1331p2604f8455n872
10407g4327K9991D5197a86611M5059j36179A5221J0445a13607B24963a075E6911
10395E2398b0495r6359H0958a34172c2518r7466e872C234K52059o9226c27331
10383a67128g6021A41911R5662A07187a12541d4145C62599f5980k06260a15645
10372d5243G9587J63658J54971b80924i9575A43212a09751A55517a17493p5418
$$ plain form
10362 -192911 432358 493416 -240271 113449 50328 -10403 423138 445397 447030 384387 377469
10351 377469 461138 111935 442577 372226 -117263 190096 4080 -124532 223046 357970
10341 357970 -37403 54239 598553 -2926 219923 396472 606623 119045 522222 173293
10330 103229 105321 -50021 376185 98825 437737 90680 138617 395578 344564 178709 123996
10319 123996 234552 16937 19214 -30960 -116441 516798 135693 -112015 -142380 -97622 279213
10307 32055 342584 103492 59450 45682 222196 -137216 -337195 53344 56640 19290 -125104
10295 -123881 50794 -217573 31913 -71364 67560 228646 -180756 -45493 -187036 -264232 179574
10283 117943 216316 165565 -37577 144420 153647 48928 -111711 -341973 118982 -124240 -63217
$$ packed form
10362a92911D32358O1058b40271A13449E0328a0403D23138K2259J633o2643o918
10351C77469Q3669A11935L30642p0351a17263A90096D080a24532B23046J34924
10341C57970c7403E4239N44314b926B19923J76549K10151A19045M03177A73293
10330A03229K092e0021C76185I8825L38912I0680M7937K56961n1014j65855n4713
10319A23996J10556A6937K277c0960q5481E16798A35693a12015l0365M4758B79213
10307C2055L10529A03492m4042j3768J76514a37216j99979E3344L296A9290a25104
10295a23881E0794b17573C1913g1364F7560J61086a80756d5493j41543p7196A79574
10283A17943R8373n0751c7577A44420R227D8928a11711k30262A18982a24240O1023
$$ plain form
10272 -63217 -57701 33099 -112312 31355 75191 80300 -190507 -268065 -478281 -158605 -166702
10261 -166702 -81918 -236942 -54548 95138 122423 -132796 205605 230782 -288777 46288 -75577
10249 10127 22510 274872 88425 207495 222041 93663 231656 317588 422768 -66383 -89753
10238 -89753 -2526 -202302 112014 -73313 -17372 18059 -141308 -30772 -151324 -111858 -214935
10227 -214935 99330 -254639 -43904 129511 38486 217465 162295 -169132 -162453 86347 -125263
10215 37861 -3259 -325969 -305686 28632 25872 -73638 -219603 -225668 107671 360929 195915
10204 195915 95264 -89953 -119430 -259438 -172873 -168451 -56354 178464 -365248 -49989 -52365
10193 -52365 -74086 -382119 -118315 163738 72458 -18131 -71498 -149254 -33104 21995 31837
$$ packed form
10272f3217N516C3099a12312C1355M3836N109a90507p7558k10216a58605q097
10261a66702h1918j55024e4548I5138K7285a32796B05605K5177b88777D6288g5577
10249A0127J2383K52362H8425J19070J4546I3663J37993Q5932J05180f6383k3370
10238h9753b526j99776A12014g3313a7372A8059a41308c0772j20552L9466j03077
10227b14935I9330b54639d3904A29511C8486J78979n5170a69132O679H6347a25263
10215C7861c259l22710K0283B8632k760g3638j45965o065A07671K53258j65014
10204A95915I5264h9953k9477j40008Q6565M422e6354A78464c65248d9989k376
10193e2365k1721l08033a18315A63738G2458a8131n3367p7756c3104B1995R842
$$ plain form
10182 31837 -35843 -71395 -20242 -86393 45790 115169 66832 -68821 93487 -172992 49915
10170 -141666 -110045 -95882 -112051 48519 241201 -183003 149680 -321577 -31682 -77313 -214633
10159 -214633 -112774 -275351 -86856 32969 36611 30262 -249022 167318 23820 -365938 -122201
10147 307668 -275632 48328 15579 -140306 -361 -146069 -137775 -199891 -74004 67027 95759
10136 95759 -64475 67652 5227 -171 -186826 -125395 -43368 132742 -255104 10368 103829 -98270
10123 -269852 236944 291162 254681 -154290 207052 -50350 -34091 56049 24892 -128726 -10746
10111 3788 184377 47569 -113882 -170934 152074 -313810 -72086 -184978 281771 -154037
10100 159165 -203272 26441 204427 -8562 226505 84761 257321 407663 115145 -338897
$$ packed form
10182C1837c5843l5552b0242o6151D5790O9379m8337f8821I3487a72992D9915
10170a41666L1621J4163j6169D8519J92682a83003A49680c21577c1682m5631j37320
10159b14633J01859j62577h6856C2969L642o349b49022A67318B3820c65938a22201
10147C07668b75632D8328A5579a40306c61j45708Q294o2116g4004F7027K8732
10136I5759f4475F7652E227a71j86655O1431d3368A32742b55104A0368R3461i8270
10123b69852B36944N4218l6481a54290B07052e0350J6259E6049B4892a28726a0746
10111C788J80589D7569a13882n7052A52074c13810g2086j12892B81771a54037
10100A59165b03272B6441J77986h562B26505H4761J72560J50342A15145c38897
$$ plain form
10089 140817 -133311 248491 -21097 192627 83766 -186953 359651 27934 -120868 -136246
10079 -136246 -241307 -115682 -191510 53432 2870 -292390 39234 -176865 -279089 -90592 -147466
10068 -147466 -125550 -209042 -10954 313281 -122349 99334 1218 -482490 97825 -189603 25525
10056 -326681 -80527 -161580 -73160 94638 -351259 95977 -58420 -348330 -95461 -40368 -97669
10045 -97669 -546071 -42947 -14021 -190788 182957 -73587 -134691 92075 -152061 -350747 -109841
10033 105076 -177294 -277662 -197064 76214 -140462 21432 -23980 -12587 218083 291555 -46617
10021 -144922 -247066 22449 259438 -151443 -165175 -233606 -368125 -42451 -172037 16128
10010 -348320 164987 -48204 -339851 -125435 -237450 47906 -181786 212415 -135605 -64324
$$ packed form
10089A40817a33311B48491b1097A92627H3766a86953C59651B7934a20868j5378
10079a36246j05061a15682p5828E3432B870b92390C9234a76865j02224i0592n6874
10068a47466K1916q3492a0954C13281a22349I9334A218d82490I7825a89603B5525
10056c26681h0527q1053g3160I4638c51259I5977e8420k89910i5461d0368n7301
10045i7669m48402d2947a4021j76767A82957g3587o1104I2075a52061j98686a09841
10033A05076a77294j00368Q0598G6214a40462B1432b3980J1393B18083P3472d6617
10021a44922j02144B2449K36989a51443j3732o8431j34519d2451j29586A6128
10010c48320A64987d8204k91647a25435j12015D7906a81786B12415a35605f4324
$$ plain form
9999 -218097 121957 -114018 -77545 -218058 -64589 -126001 92040 15851 15353 -10518 180053
9987 56040 100402 175716 -378699 -191054 8371 -380023 -30326 148737 166374 115789 -14031
9975 -97516 -96197 -26863 -294675 101686 86112 -70962 101097 56480 -101554 -83458 237061
9963 -225248 99476 385178 89096 -224713 -12637 6480 -332215 -212673 -151130 172200 126850
9952 126850 110142 -96285 -233092 -213132 -350856 -48919 -169351 -103050 145368 -187800 2927
9940 -37352 -123872 -52669 -66353 261508 -307482 48412 -49404 73880 -186396 -95536 -238255
9929 -238255 -202509 -43521 21958 258773 -108450 -160331 181774 -234733 -264924 108142 84301
9918 84301 198740 5128 -123889 94804 345855 50984 -159980 -21196 -55814 -158947 -82938
$$ packed form
9999b18097A21957a14018L6473j40513f4589o1412I2040A5851m98a0518A80053
9987E6040M4362P5314c78699J87645H371c80023c0326A48737J7637n0585a4031
9975i7516J319b6863k67812A01686j5574g0962A01097m4617a01554J8096B37061
9963b25248I9476K85702H9096b24713a2637F480c32215J19542O1543A72200m5350
9952A26850j6708i6285j36807J9960j37724d8919j20432O6301A45368a87800B927
9940c7352q6520e2669j3684B61508c07482D8412d9404G3880a86396R0860j42719
9929b38255L5746d3521B1958K36815a08450n1881A81774b34733l0191A08142k3841
9918H4301J14439E128a23889I4804K51051E0984a59980b1196l4618j03133P6009
$$ plain form
9907 -82938 -17780 -504964 175934 24081 206205 2515 -196915 -16595 62652 -54365 52916
9895 -174200 -251886 -263532 64389 -167978 286150 -116861 -228942 -82175 -236025 -114129
9884 -62486 -124057 -152713 87101 108020 -275674 -328275 347559 287934 24230 -159844 -228028
9873 -228028 118055 -196008 -60808 -189145 70997 97201 -69948 -164899 -190754 -65808 -118141
9862 -118141 11619 -103679 -24481 -240210 4098 -339942 55353 -54683 -286808 -113085 -44217
9850 112903 165959 136404 -27228 -66608 84126 -377322 80990 -54784 -22148 330474 1004
9838 174422 -133952 -85542 -3173 -111834 75247 39767 -152371 -4393 36579 5229 -112185
9826 -254065 17120 -63064 -439872 -113358 85534 383198 102580 -91538 -67286 -162652 -36094
$$ packed form
9907h2938a7780m87184A75934B4081J82124B515a96915a6595F2652e4365E2916
9895a74200p7686j1646F4389a67978B86150a16861j12081h2175j53850a14129
9884f2486o1571k8656H7101K0919b75674n2601C47559n9625B4230a59844o8184
9873b28028A18055a96008f0808j28337G0997K6204f9948r4951k5855f5808n2333
9862a18141A1619a03679b4481k15729D098c39942E5353e4683k32125a13085d4217
9850A12903N3056k9555b7228l9380H4126c77322H0990e4784b2148C30474A004
9838A74422a33952M8410c173j08661G5247l5480a52371d393C6579E229a12185
9826b54065A7120f3064l76808a13358H5534K97664A02580i1538K4252r5366c6094
$$ plain form
9814 38542 119080 122243 114025 61946 193420 243271 -36947 32144 180801 174895 -32628 78442
9801 -66482 11793 -76787 171244 -252517 -118480 73954 -122682 -227905 -42884 -120025 -82696
9790 -82696 -318322 42040 -385242 -50232 164050 85663 -10062 -70329 72802 -130849 145107
9778 -309607 -148187 162729 -71330 -123023 -115581 -603603 -279954 -260708 154268 220733 -47623
9766 87912 -314685 20008 -75446 -308150 8422 -95623 18858 -12358 -148869 -175696 -221202
9755 -221202 -66363 -96473 43062 -63113 -415219 -2282 -42748 133636 -74476 242579 -21203
9743 -21398 -90800 36975 263700 -53518 177779 104503 -102718 337629 -158925 43762 -392224
9731 -168720 175394 -152953 166378 92543 -155525 -156148 -118963 211482 -337846 -51778 -316450
$$ packed form
9814C8542Q0538L163q218n2079J31474M9851c6947C2144J48657n906c2628G8442
9801f6482A1793g6787A71244b52517a18480G3954a22682j05223d2884p7141L7329
9790h2696k35626D2040c85242e0232A64050p8387a0062o0267G2802a30849A45107
9778c09607a48187A62729g1330n1693P442m88022b79954J9246A54268O6465d7623
9766H7912c14685B0008g5446k32704H422i5623A8858a2358j36511k6827m5506
9755b21202f6363l0110D3062f3113l52106b282m0466A33636g4476B42579b1203
9743b1398o9402C6975K26725e3518A77779p3276a02718C37629a58925D3762c92224
9731a68720A75394a52953A66378p3835a55525o23L7185B11482c37846e1778k64672
$$ plain form
9720 -316450 144857 30873 -390112 76538 -124573 -106285 -77455 -32438 -92249 -58539 -200750
9709 -200750 63565 -272094 -213312 -183602 -282859 -175649 -79455 -209211 125886 24460 -192268
9697 -279345 -69030 -266541 97482 -484301 -425865 -321918 -91875 138784 -196372 -81919 -255097
9686 -255097 30278 111529 -177001 59018 -55924 -27693 88143 431788 133745 190327 -216288
9674 231742 166592 132113 179492 82953 -93063 -17511 -203091 -333995 -31372 -278972 103436
9662 -103742 -56920 120745 -274494 -45689 -235093 -147104 -170515 -83753 -96452 -69696 151153
9650 -15067 -156653 -13634 -245478 -317717 -234177 -170115 -117943 36158 -115769 686 408375
9639 408375 333356 115595 -69623 -367160 -216697 148732 -139284 -206288 88244 -312102
$$ packed form
9720c16450A44857C0873c90112G6538a24573J8288K8830c2438n9811L3710j42211
9709b00750F3565b72094N8782K9710r9257J07210g9455j29756A25886B4460a92268
9697b79345f9030j97511I7482d84301N8436J03947i1875A38784a96372h1919j73178
9686b55097C0278Q1251a77001E9018e5924b7693H8143L43645A33745N6582b16288
9674B31742o5150l4479M7379H2953i3063a7511j85580j30904c1372k47600A03436
9662a03742M6822A20745b74494d5689j89404Q7989k3411h3753j2699K6756A51153
9650a5067j41586a3634k31844p2239Q3540O4062N2172C6158a15769F86M07689
9639D08375p5019A15595f9623k97537J50463A48732a39284o7004H8244c12102
$$ plain form
9628 -184973 -191020 -125280 71526 193887 -267299 -57642 193493 181183 109397 -157763 -41448
9616 -12700 171848 68125 -133967 -98796 -9997 -281544 -200607 -374892 -67837 13881 66861
9605 66861 -411634 -110168 262600 -86912 60706 -308030 153854 35594 -86094 335135 19685
9593 96487 -233266 -154930 -97641 353470 -197144 263996 178063 -163438 103402 76489 -45617
9581 -305693 -116729 65019 -207784 -539542 -86848 -19372 8374 -136097 191952 -80668 -189177
9570 -189177 203002 -120597 72560 275821 66885 70650 7926 -191238 -343016 97479 213852
9559 213852 39525 -89909 -7666 93226 -396275 20953 123798 141550 -43266 -187083 -85924
9547 -89483 13469 6076 -190661 -6110 -385113 -247371 -65504 -257001 8963 -170589 -31100
$$ packed form
9628a84973o047O5740G1526J22361b67299e7642A93493j2310p1786a57763d1448
9616a2700A71848F8125a33967L5171i997k71547Q0937j74285f7837A3881N2980
9605F6861d11634a10168B62600h6912F0706c08030A53854C5594h6094C35135A9685
9593I6487b33266P8336N7289C53470a97144B63996q5933a63438A03402k6913d5617
9581c05693a16729F5019b07784l31758h6848a9372H374a36097A91952h0668j08509
9570a89177B03002a20597G2560K03261F6885L765G926a91238j51778I7479J16373
9559B13852C9525h9909g666I3226c96275B0953J02845J7752d3266j43817h5924
9547h9483A3469F076a90661f110l79003J37742f5504j91497H963a70589c1100
$$ plain form
9535 -114798 28985 -119303 -361226 132622 -120077 105694 -362604 77642 -130689 -5020
9524 73945 -47402 -219892 22401 -73210 -309757 -135517 -110867 94917 -257835 76383 -176590
9512 334229 -57276 -71304 17197 -401635 -53101 -40269 62314 -185102 66477 42951 34088
9501 34088 -79787 -48212 34484 -46825 -235926 -117665 -131477 -148657 -382523 62020 33855
9490 33855 -166814 -271547 106463 119162 97708 153614 55790 -91680 -242681 -252450 -5016
9478 210629 53700 179030 -79071 71168 -9614 185415 -130216 -107411 54672 -81464 -69238
9467 -69238 -217410 -283249 -117959 -21925 -80777 -213107 62411 -314972 52683 76817 55057
9456 55057 -69210 -55981 56666 108748 -287065 105524 22068 126343 287280 -13607 -178603
$$ packed form
9535a14798B8985a19303k41923A32622a20077A05694c62604G7642a30689e020
9524G3945d7402j72490B2401g3210k36547a35517K4650I4917b57835G6383a76590
9512C34229e7276j4028A7197d01635e3101J2832F2314a85102F6477k3526q863
9501C4088g9787L1575C4484d6825j89101a17665j3812j7180k33866F2020k8165
9490C3855a66814j04733A06463J2699k1454N5906E5790i1680j51001r769e016
9478B10629E3700J25330g9071G1168i614A85415a30216K2805E4672h1464J2226
9467f9238j48172o5839a17959b1925n8852j32330F2411c14972E2683K4134k1760
9456E5057f9210J3229E6666N2082b87065A05524B2068J04275J60937a3607j64996
$$ plain form
9445 -178603 -48207 -60376 -41532 -150154 -93999 -31700 -119317 54159 327027 -168831 -211604
9434 -211604 89880 172516 -143282 43894 -272489 -206244 -107176 298778 282517 248567 107133
9422 175412 -18603 -47919 -214107 -138811 1463 -54589 146501 243623 97046 -234825 103225
9410 -88392 -204517 17764 -24953 -130179 -69787 38307 -158126 -45790 125106 145853 8236
9398 172423 -155856 -233645 59457 -338804 -233060 41114 -141194 82445 -2494 -62940 44647
9386 -19982 80072 -177688 18972 -32650 -65435 1823 -173203 -254797 44780 46374 -48062 105130
9373 -85482 -53532 18286 93734 -71617 173033 -294471 8858 -48387 -66097 -75170 -190813 -199604
9361 -199604 -234592 173501 -290929 50203 -41712 76316 -65449 -214116 -240659 82143 -253983
$$ packed form
9445a78603d8207j2169J8844j08622N6155c1700q7617E4159K72868a68831m2773
9434b11604H9880Q2636a43282D3894b72489O6245R9068B98778j6261l3950A07133
9422A75412a8603k9316j66188P5296A463e4589A46501R7122I7046b34825A03225
9410h8392j16125A7764b4953j05226O0392C8307a58126d5790A25106K0747H236
9398A72423a55856p7789E9457c38804J05744D1114a41194H2445b494o0446D4647
9386a9982H0072a77688A8972c2650l2785A823a73203q1594D4780J594d8062A05130
9373h5482L1950A8286P5448g1617A73033b94471H858d8387j7710r073j15643q791
9361a99604l4988A73501b90929E0203d1712G6316f5449j48667k6543H2143b53983
$$ plain form
9349 -286246 135627 -26690 -1365 -107339 -283329 109462 22433 -280064 -426252 -221911
9339 -221911 -34895 156860 61502 -207347 124557 -91810 -267401 -293847 88401 -165595 -120024
9328 -120024 140827 -82537 -244410 106383 -25991 -122165 -190583 228001 437455 -216152
9317 345329 51220 -329396 -102889 2897 81564 94654 -167477 -56551 -153891 -152572 -181192
9306 -181192 -15000 191016 -50254 -141602 -302288 -112558 -233219 -167990 -200460 22922 -145553
9294 -150976 -419869 52909 -131439 -63426 -26793 78649 -53606 -191950 22301 64067 -71809
9282 127431 -67107 -156240 -13438 143302 -37838 -98686 -530 -141897 -16884 -101561 -119256 -352494
9270 -352494 303593 -149298 -497866 -339193 -309830 -289789 -50630 10727 -256136 -166576 -25665
$$ packed form
9349b86246A35627b6690a365j05974j75990A09462B2433b80064j46188K04341
9339b21911c4895A56860F1502b07347A24557i1810j75591k6446H8401a65595M5571
9328a20024A40827h2537j61873A06383b5991r6174o8418B28001K09454b16152
9317C45329E1220c29396a02889B897P8667J3090a67477e6551r7340J319k8620
9306a81192a5000A91016e0254r1348j60686a12558j20661O5229l2470B2922a45553
9294a50976k68893E2909a31439f3426b6793G8649e3606j38344B2301M1766g1809
9282A27431f7107q9133a3438A43302c7838o0848e30j41367a6884q4677j7695k33238
9270c52494C03593a49298l48568J58673K9363K0041e0630A0727b56136Q9560b5665
$$ plain form
9258 119236 -180488 199856 186275 -190712 -367877 50021 107040 160135 -152615 234405
9247 88390 -245973 -204288 -167048 222829 159728 -94793 -161222 -115463 -219585 -90716 -442 -437696
9235 -437696 28669 119431 -157556 43120 177631 -96226 -281208 -59370 -197517 167656 -96835
9223 53628 22716 -32246 -35397 -12617 252829 -213491 -121326 -151665 -186770 -105197 115353
9211 -209592 -85714 17240 -155586 126417 -14693 -291187 -127930 173045 239113 -165771
9200 -234987 105418 -175843 126131 284851 -57620 -364663 135827 49368 -284253 180434
9189 -113608 87972 -191827 -57578 253127 -185910 199299 -174948 -79659 155266 75825
9178 215580 -270803 -225282 -253118 -151097 -267423 67205 -187206 -102304 -195346 -47026 232654
$$ packed form
9258A19236a80488A99856j3581a90712j77165E0021N7019N3095a52615B34405
9247H8390b45973M1685L7240B22829o3101i4793o6429M5759j04122i0716d42m37254
9235d37696B8669R0762a57556D3120J34511i6226j84982e9370j38147A67656i6835
9223E3628B2716c2246l151a2617B52829b13491R2165l0339l5105Q1573A15353
9211b09592h5714A7240a55586A26417a4693k76494a27930A73045O6068a65771
9200b34987A05418a75843A26131J58720e7620l07043A35827D9368b84253A80434
9189a13608H7972a91827e7578B53127a85910A99299a74948g9659A55266G5825
9178B15580b70803M5521k7836J02021j16326F7205a87206Q4902r3042d7026B32654
$$ plain form
9166 17278 29382 -128420 -215583 300087 -219678 361327 -184159 -134589 124425 -53609 8263
9154 -55507 -32038 11856 -437687 -110149 195182 -52580 23974 -123967 -64747 -159434 -49419
9142 -39011 327532 4402 -2396 -25591 29373 -225297 205060 -111237 -170940 266327 -261814
9130 -1641 -256262 85201 304612 -125158 -226802 -31914 -27382 140014 1633 159483 -167531
9118 10905 166186 7396 10044 -226109 73064 -165404 -303888 -33438 -283111 -34642 -201542
9107 -201542 -250891 -514241 1540 -39333 118219 279855 -138764 -331860 -63770 -19689 -252005
9096 -252005 -149376 88805 153566 -213175 -19243 -384006 225906 -217522 152459 261130
9086 261130 -233497 -279863 -304664 -240071 -65100 -6748 44774 64952 92445 -179037 90517
$$ packed form
9166A7278J2104a28420q7163C00087b19678C61327a84159M9570A24425e3609H263
9154e5507K3469A1856d37687a10149A95182e2580B3974a23967N9220r4687d9419
9142c9011C27532D402b396k3195B9373b25297B05060a11237n9703B66327b61814
9130a641k54621H5201K19411a25158j01644c1914M532A40014A633J57850a67531
9118A0905J55281G396K648b26109G3064a65404j38484c3438k49673c4642j66900
9107b01542m9349k63350A540c9333A18219J61636a38764j93096f3770a9689k32316
9096b52005J02629H8805O4761b13175a9243l64763B25906b17522A52459J08671
9086B61130b33497m6366k4801O4593f5100f748D4774K0178K7493a79037I0517
$$ plain form
9074 -80314 -109191 5913 -16007 69147 -67081 -234553 159761 -31384 148692 76954 -2374 56649
9061 -45968 200385 945 -955 201593 -84262 12267 106620 -41165 -63302 51186 -54148 -254635
9049 -254635 -2202 -163193 -298347 129884 50400 73966 -174613 -202681 10990 -205884 -149783
9038 -149783 -14849 -75149 22684 -32422 129406 -151733 -203751 -105059 -166118 66633 21730
9026 -12270 -671 -19608 -160349 -219717 -206635 242503 -373278 -266570 455 104534 113807 139448
9014 139448 223224 -82077 -118531 -25133 -56896 -155810 -4348 -409978 87945 -10625 207562
9002 -185996 -185375 142649 -39839 -307094 -177061 -71267 -134197 -105555 -101982 -109414 107257 -233547
8989 2454 -63060 128099 159925 51247 -91270 -157529 -85790 25958 35547 152338 -45072 -424197
$$ packed form
9074h0314k8877E913a6007F9147f7081j67472A59761c1384A48692p1738b374E6649
9061d5968B00385I45i55B01593h4262A2267R4353d1165k2137E1186e4148k00487
9049b54635b202j60991j35154A29884E0400K3566a74613k8068A0990b05884N6101
9038a49783a4849o0300B2684c2422A29406a51733n2018R8692o1059F6633B1730
9026a2270f71j8937j40741n9368J3082B42503c73278J06708D55J04079R273K5641
9014A39448Q3776h2077l6454b5133l1763r8914d348m05630H7945a0625B07562
9002a85996O21A42649c9839k67255J30033g1267o2930K8642L573p432A07257b33547
8989B454f3060A28099L1826E1247i1270o6259P1739B5958R589J16791d5072l79125
$$ plain form
8977 -424197 110634 -65828 104478 -66802 53894 270100 170361 -27135 190415 107149 68194
8966 68194 -188411 -126908 -255212 29066 -299356 -212719 -202361 -18367 147686 207097 17432
8954 -150358 -43563 133625 -38649 244784 -132580 179483 -342995 -45793 -101627 -89594 -143649
8943 -143649 43895 113567 -54357 297886 -101212 -220960 -179729 -340357 -190817 -45254 150528
8931 20741 246395 -156386 296786 153143 205732 -17317 -23457 -38637 -143946 376032 -41498
8919 41030 363448 181962 -66661 59298 103779 61158 -54330 797815 289679 656411 858295
8908 858295 1938350 3766710 9357331 7574463 4039783 2616441 1412907 880382 816835
8899 816835 165298 390418 380334 327433 232148 222335 377465 241375 504151 -178990 57286
$$ packed form
8977d24197A10634f5828A04478f6802E3894K16206r9739b7135A90415q3266l8955
8966F8194a88411O1503j28304B9066b99356Q6637J0358a8367A47686N9411A7432
8954a50358d3563A33625c8649B44784a32580A79483c42995d5793n5834J2033n4055
8943a43649D3895O9672e4357B97886a01212j19748M1231j60628J49540d5254A50528
8931B0741K25654a56386B96786j43643N2589a7317o140j5180j05309C76032d1498
8919D1030L22418j81486f6661E9298M4481m2621e4330G97815B89679L66732K01884
8908H58295J080055J828360N590621j782868l534680j423342j203534n32525o3547
8899H16835A65298K25120j0084n2901r5285r813J55130j36090K62776a78990E7286
$$ plain form
8887 -66416 -45117 -34175 -136324 -95087 9669 -218200 78531 18315 17260 -1618 -150551 36949
8874 -33710 -107277 105994 -162135 -4741 -197609 -288036 -165924 -48137 181133 -43915 -112127
8863 -112127 -203268 -75780 52254 474590 -25395 -271390 -263834 -11370 -443350 -307662 -324852
8852 -324852 -40212 -25246 33129 278962 236211 -16117 -129057 81720 54272 -90749 -87085
8841 -87085 -145636 -50729 -9961 126927 -109002 30631 -188836 264847 -79567 194671 142531
$$ packed form
8887f6416K1299J0942j02149M1237I669b18200G8531A8315j055a618j48933C6949
8874c3710p3567A05994a62135d741j92868r0427J22112d8137A81133d3915o8212
8863a12127r1141g5780E2254M22336b5395k45995P556a1370m31980J35688j7190
8852c24852d0212J4966C3129K45833m2751a6117j12940H1720k7448i0749L664
8841h7085n8551e0729i961A26927a09002C0631a88836B64847g9567A94671n2140
$$ [...]
##END NTUPLES=NMR SPECTRUM
##END=
