
##TITLE=UV1031_TOFR01-ROVE100A_6099335_rKhOTGkKPq
##JCAMPDX= 6.0         $$ Bruker NMR JCAMP-DX V2.0
##DATA TYPE= NMR SPECTRUM
##DATA CLASS= NTUPLES
##ORIGIN= BRUKER
##OWNER= Administrator
$$ 1.72 TOPSPIN		Version 2.1
$$ 2012-05-12 20:54:21.906 -0500  Administrator@TOPSPIN
$$ Compression mode = diff/dup
##.OBSERVE FREQUENCY= 400.13188235
##.OBSERVE NUCLEUS= ^1H
##.ACQUISITION MODE= SIMULTANEOUS (DQD)
##.ACQUISITION SCHEME= undefined
##.AVERAGES= 64
##.DIGITISER RES= 22
##SPECTROMETER/DATA SYSTEM= spect
##.PULSE SEQUENCE= noesygpps1d.comp
##.SOLVENT NAME= COFFEE_meoh
##.SHIFT REFERENCE= INTERNAL, COFFEE_meoh, 1, 14.96676
##AUDIT TRAIL= $$ (NUMBER, WHEN, WHO, WHERE, PROCESS, VERSION, WHAT)
$$ ##TITLE= Audit trail, TOPSPIN		Version 2.1
$$ ##JCAMPDX= 5.01
$$ ##ORIGIN= Bruker BioSpin GmbH
$$ ##OWNER= Administrator
$$ $$ C:\Bruker\TOPSPIN/data/COFFEE/nmr/UV1031_TOFR01-ROVE100A_6099335_rKhOTGkKPq/12/pdata/1/auditp.txt
$$ ##AUDIT TRAIL=  $$ (NUMBER, WHEN, WHO, WHERE, PROCESS, VERSION, WHAT)
(   1,<2012-05-12 20:54:16.781 -0500>,<Administrator>,<TOPSPIN>,<go>,<TOPSPIN 2.1>,
      <created by zg
	started at 2012-05-12 20:42:46.625 -0500,
	POWCHK enabled, PULCHK disabled,
       configuration hash MD5:
       AF F2 23 6B 01 CD 40 DD E5 A1 38 A0 06 EA F7 77
       data hash MD5: 64K
       08 05 E9 52 7A 22 C3 9A CB 94 EE EC C6 7D 31 6B>)
(   2,<2012-05-12 20:54:19.625 -0500>,<Administrator>,<TOPSPIN>,<proc1d>,<TOPSPIN 2.1>,
      <Start of raw data processing
       efp LB = 0.3 FT_mod = 6 PKNL = 1 PHC0 = 0 PHC1 = 0 SI = 128K 
       data hash MD5: 128K
       DF 0E 5A 34 2B 11 4F 0C BB 68 07 A7 95 D5 E7 B1>)
(   3,<2012-05-12 20:54:21.078 -0500>,<Administrator>,<TOPSPIN>,<proc1d>,<TOPSPIN 2.1>,
      <pk PHC0 = 33.63464 PHC1 = 0 
       data hash MD5: 128K
       DD 0A AF D9 12 46 C0 BC 6E 17 B7 83 81 52 21 31>)
(   4,<2012-05-12 20:54:21.531 -0500>,<Administrator>,<TOPSPIN>,<proc1d>,<TOPSPIN 2.1>,
      <abs ABSG = 1 
       data hash MD5: 128K
       14 C2 D6 CA 4C 9C 19 3C 92 BA 3C C8 B0 F1 3C 2D>)
(   5,<2012-05-12 20:54:21.625 -0500>,<Administrator>,<TOPSPIN>,<proc1d>,<TOPSPIN 2.1>,
      <abs ABSG = 2 
       data hash MD5: 128K
       7B 22 10 6F 23 92 C0 07 2B 54 16 AF 34 8E 9C 20>)
(   6,<2012-05-12 20:54:21.687 -0500>,<Administrator>,<TOPSPIN>,<proc1d>,<TOPSPIN 2.1>,
      <abs ABSG = 3 
       data hash MD5: 128K
       31 EC BA 1A 8F 66 81 EC DD 8E 9F F1 8E 9A 11 E5>)
(   7,<2012-05-12 20:54:21.750 -0500>,<Administrator>,<TOPSPIN>,<proc1d>,<TOPSPIN 2.1>,
      <abs ABSG = 4 
       data hash MD5: 128K
       0D 58 FE 13 B2 97 7A 09 86 D4 2B D3 55 6D A6 5B>)
(   8,<2012-05-12 20:54:21.812 -0500>,<Administrator>,<TOPSPIN>,<proc1d>,<TOPSPIN 2.1>,
      <abs ABSG = 5 
       data hash MD5: 128K
       BE 8A 9B 57 9C 67 8B 5D 6E E8 B1 72 41 CD 4C 72>)
$$ ##END=
$$ 
$$ $$ hash MD5
$$ $$ CB 7D 50 4D 85 90 E1 8C A2 10 B3 17 80 67 FE AF
##$RELAX= 
##$RELAX= 
##$RELAX= 
##$RELAX= 
##$RELAX= 
##$RELAX= 
##$RELAX= 
##$RELAX= 
$$ [...]
##$TP07= 0
##$TPNAME0= <>
##$TPNAME1= <>
##$TPNAME2= <>
##$TPNAME3= <>
##$TPNAME4= <>
##$TPNAME5= <>
##$TPNAME6= <>
##$TPNAME7= <>
##$TPOAL= (0..7)
0.5 0.5 0.5 0.5 0.5 0.5 0.5 0.5
##$TPOFFS= (0..7)
0 0 0 0 0 0 0 0
##$TUNHIN= 0
##$TUNHOUT= 0
##$TUNXOUT= 0
##$USERA1= <user>
##$USERA2= <user>
##$USERA3= <user>
##$USERA4= <user>
##$USERA5= <user>
##$V9= 5
##$VALIST= <valist>
##$VCLIST= <CCCCCCCCCCCCCCC>
##$VD= 0
##$VDLIST= <DDDDDDDDDDDDDDD>
##$VPLIST= <PPPPPPPPPPPPPPP>
##$VTLIST= <TTTTTTTTTTTTTTT>
##$WBST= 2048
##$WBSW= 25
##$XGAIN= (0..3)
0 0 0 0
##$XL= 0
##$YL= 0
##$YMAX_a= 10919087
##$YMIN_a= -5757554
##$ZGOPTNS= <>
##$ZL1= 120
##$ZL2= 120
##$ZL3= 120
##$ZL4= 120
##$ABSF1= 14.96676
##$ABSF2= -5.585771
##$ABSG= 5
##$ABSL= 3
##$ALPHA= 0
##$AQORDER= 0
##$ASSFAC= 0
##$ASSFACI= 0
##$ASSFACX= 0
##$ASSWID= 0
##$AUNMP= <proc_prof1d_extract.lims>
##$AXLEFT= 0
##$AXNAME= <>
##$AXNUC= <1H>
##$AXRIGHT= 0
##$AXTYPE= 0
##$AXUNIT= <>
##$AZFE= 0.1
##$AZFW= 0.1
##$BCFW= 0
##$BC_mod= 0
##$BYTORDP= 0
##$COROFFS= 0
##$CY= 15
##$DATMOD= 1
##$DC= 0
##$DFILT= <>
##$DTYPP= 0
##$F1P= 0
##$F2P= 0
##$FCOR= 0.5
##$FTSIZE= 131072
##$FT_mod= 6
##$GAMMA= 0
##$GB= 0
##$INTBC= 1
##$INTSCL= 1
##$ISEN= 128
##$LB= 0.3
##$LEV0= 0
##$LPBIN= 0
##$MAXI= 10000
##$MC2= 0
##$MEAN= 0
##$ME_mod= 0
##$MI= 0
##$NCOEF= 0
##$NC_proc= -3
##$NLEV= 6
##$NOISF1= 0
##$NOISF2= 0
##$NSP= 0
##$NTH_PI= 0
##$NZP= 0
##$OFFSET= 14.96676
##$PC= 1
##$PHC0= 33.63464
##$PHC1= 0
##$PH_mod= 1
##$PKNL= yes
##$PPARMOD= 0
##$PPDIAG= 0
##$PPIPTYP= 0
##$PPMPNUM= 2147483647
##$PPRESOL= 1
##$PSCAL= 4
##$PSIGN= 0
##$PYNMP= <proc.py>
##$REVERSE= no
##$SF= 400.130005541
##$SI= 131072
##$SIGF1= 0
##$SIGF2= 0
##$SINO= 400
##$SIOLD= 131072
##$SPECTYP= <>
##$SREGLST= <1H.CDCl3>
##$SSB= 0
##$STSI= 131072
##$STSR= 0
##$SW_p= 8223.68421052632
##$SYMM= 0
##$S_DEV= 0
##$TDeff= 65536
##$TDoff= 0
##$TI= <>
##$TILT= no
##$TM1= 0
##$TM2= 0
##$TOPLEV= 0
##$USERP1= <user>
##$USERP2= <user>
##$USERP3= <user>
##$USERP4= <user>
##$USERP5= <user>
##$WDW= 1
##$XDIM= 131072
##$YMAX_p= 455723426
##$YMIN_p= -41393690
##$CURPLOT= <Network HP LaserJet P1505>
##$CURPRIN= <$Network HP LaserJet P1505>
##$DFORMAT= <normdp>
##$LAYOUT= <+/1D_H.xwp>
##$LFORMAT= <normlp>
##$PFORMAT= <normpl>
##$SURQMSG= 1
$$ End of Bruker specific parameters
$$ ---------------------------------
##NTUPLES= NMR SPECTRUM
##VAR_NAME=  FREQUENCY,     SPECTRUM/REAL,   SPECTRUM/IMAG
##SYMBOL=    X,             R,               I
##VAR_TYPE=  INDEPENDENT,   DEPENDENT,       DEPENDENT
##VAR_FORM=  AFFN,          ASDF,            ASDF
##VAR_DIM=   131072,        131072,          131072
##UNITS=     HZ,            ARBITRARY UNITS, ARBITRARY UNITS
##FACTOR=    0.0627417313425165, 1,          1
##FIRST=     8223.62146879498, 469,          -103852
##LAST=      0,             3298,            -104024
##MIN=       0,             -41393690,       0
##MAX=       8223.62146879498, 455723426,    0
$$ Real data points
##PAGE= N=1
##DATA TABLE= (X++(R..R)), XYDATA
$$ [...]
67424 161522 159446 156242 153922 153696 154290 153544 151306 149606 149916 151373 152122 151571 150745 150920 152433 154523
67408 154523 155980 156195 155791 155938 156909 157829 158128 158643 160641 164052 167414 169527 170464 170811 170625 169692 168384
67391 168384 167424 166815 165703 163723 161869 161483 162658 164336 165788 167238 168933 170402 171079 171134 171292 172086
67375 172086 173556 175341 176887 178009 179314 181485 183997 185398 185214 184653 184769 184943 184183 183046 182864 183485
67359 183485 183245 181171 177909 174474 171407 169424 169403 170989 172261 171769 170311 169862 171095 172740 173246 172485
67343 172485 171749 172338 174242 176199 177110 177167 177351 178112 179152 180331 181935 183942 185723 186764 187104 186943
67327 186943 186474 186325 187385 189676 191959 192953 192519 191354 190050 188939 188257 187861 187133 185828 184768 185104
67311 185104 186971 189326 191083 192071 192963 194580 197239 200539 203776 206576 208961 210817 211733 211550 210665
67296 210665 209531 208173 206530 204960 204009 203782 203833 203598 202872 202122 202504 205191 210240 216190 221064 223799
67280 223799 224703 224716 224414 223684 222292 220767 220468 222408 226055 229702 232079 233325 234467 236364 239130 242023
67264 242023 243806 243778 242648 241962 242547 243924 245262 246226 246758 246756 246417 246346 246831 247403 247494 247196 247041 247422 248517
67245 248517 250426 253021 255902 258714 261220 263044 263828 263797 263693 263921 264256 264496 264762 264953 264564 263417 262042
67228 262042 261108 261035 262273 265134 268980 272391 274531 275656 276050 275497 274315 273704 274228 274854 274441 273419
67212 273419 273105 274094 276198 279169 282482 285181 287071 289357 292921 296623 298627 298799 298395 297904 296830
67197 296830 295368 294674 295358 297024 299341 302243 305125 307180 308583 310003 310999 310489 308972 308473 309792
67182 309792 311509 312461 313528 315840 318677 320556 321401 322170 323052 323457 323368 323379 323499 323122 322280 321959 322870 324525
67164 324525 325893 326691 327794 330342 334319 338116 339898 339495 338513 338460 339370 340539 341820 343478 345242 346379
67148 346379 346730 347100 348480 351065 354088 356590 358462 360563 363495 366482 368170 368544 369126 371044 373864
67133 373864 376849 380274 384434 388131 389593 388804 387729 387972 389194 390195 390756 391720 393652 396055 397991
67118 397991 399212 400541 402994 406399 409098 409459 407773 406271 406960 409687 412632 414531 415867 417765 420286
67103 420286 422439 423709 424783 426481 428688 430927 433491 437037 441176 444497 446369 447927 450656 454451
67089 454451 457801 459688 460624 461682 463115 464330 464944 465252 465609 465936 466295 467494 470186 473492 475671 476649
67073 476649 478759 483926 490827 496154 498265 498337 498185 498568 499886 502871 507595 512801 517118 520354 522967
67058 522967 525029 526442 527616 529167 531319 534096 537538 541135 543718 544665 544771 545171 545956 546620 547411 549194
67042 549194 552175 555691 559148 562345 564977 566720 567939 569601 572315 575948 580126 584523 588708 592406
67028 592406 596011 600189 604866 609224 612883 616436 620544 624947 628740 631288 632686 633587 634767 636630
67014 636630 639024 641728 644965 649022 653433 657116 659539 661245 663021 664963 666682 668057 669426 671268
67000 671268 674012 677988 683198 689151 695131 700660 705651 710242 714592 718714 722429 725622 728650 732268
66986 732268 736937 742332 747794 753119 758517 763771 767948 770384 771754 773732 777525 783096 789812 797323
66972 797323 805466 813741 821498 828502 834881 840625 845582 849911 853943 857627 860655 863236 866157 869915
66958 869915 874390 879591 886100 894293 903561 912757 921067 928112 933674 937918 941623 945696 950511 956015
66944 956015 962191 969153 977065 986237 996850 1008251 1019029 1028310 1036593 1044810 1053069 1060946 1068578
66931 1068578 1076628 1085372 1094612 1104310 1114560 1125047 1135320 1145572 1156392 1167799 1179251 1190601
66919 1190601 1202241 1214221 1226128 1238040 1250798 1264955 1280096 1295572 1311283 1327384 1343747
66908 1343747 1360156 1376612 1393118 1409609 1426335 1443784 1461859 1479675 1496682 1513564 1531541
66897 1531541 1551065 1571637 1592507 1613000 1632576 1651316 1670297 1690852 1713308 1736956 1761314
66886 1761314 1786897 1814458 1843822 1873884 1903698 1933333 1963584 1994987 2027250 2059684 2092148
66875 2092148 2125447 2160701 2198288 2237480 2277205 2317177 2358034 2400225 2443092 2485603 2527943
66864 2527943 2571617 2617500 2664442 2710567 2755634 2801227 2848716 2897982 2948357 2999937 3053381
66853 3053381 3108966 3166353 3224905 3283742 3341907 3399187 3456675 3515971 3577758 3641414 3705901
66842 3705901 3770566 3835059 3898997 3962063 4024316 4086174 4147991 4209698 4270855 4331093 4390414
66831 4390414 4448943 4506445 4562281 4615886 4667083 4715930 4762592 4807453 4850906 4892566 4930924
66820 4930924 4964340 4992404 5015924 5035451 5050270 5059179 5061992 5059826 5053992 5045040 5032917 5017522
66808 5017522 4998600 4975357 4946849 4913062 4875265 4834933 4792370 4746530 4696183 4641120 4582332
66797 4582332 4521149 4458281 4393700 4327464 4260366 4193363 4126397 4058303 3988127 3916137 3843255
66786 3843255 3769974 3696337 3622623 3549345 3476598 3404059 3331700 3259945 3188957 3118404 3048374
66775 3048374 2980047 2914816 2852655 2791886 2730866 2669641 2609610 2551720 2495641 2440927 2388214
66764 2388214 2338394 2290876 2243830 2196343 2149303 2103689 2058986 2014161 1969399 1925729 1883387
66753 1883387 1841732 1800583 1760480 1721549 1683196 1645225 1608444 1573851 1541804 1512069 1483962
66742 1483962 1456389 1428507 1400514 1373110 1346157 1318808 1290983 1263597 1237035 1210724 1184831
66731 1184831 1161016 1140348 1121438 1102019 1081807 1062415 1044653 1027283 1008675 988592 968021
66720 968021 948099 929634 912947 897523 882129 865843 849018 833000 818851 806407 794510
66709 794510 782025 768578 754437 740085 726195 713743 703412 694746 686341 677222 667668 658504
66697 658504 650022 641926 633904 625754 617198 608001 598261 588353 578798 570249 563194 557317 551497 544763
66683 544763 537003 528559 519620 510445 501690 493932 487153 481202 476331 472680 469554 465998 461975 458278
66669 458278 455243 452167 448078 442604 436037 429042 422421 416763 412175 408523 405775 403709 401488 398036
66655 398036 392945 386683 379937 373078 366267 359739 353963 349646 347246 346150 344636 341285 336329 331194
66641 331194 326960 323842 321839 320833 319860 317248 312159 305699 300083 296812 295735 295520 294829 293214 291115
66626 291115 289078 287182 285301 283529 281949 280283 278261 276029 273668 270647 266630 262580 260064 259335
66612 259335 258936 257355 254233 249852 244605 239485 236084 235169 235715 236023 235420 234344 233271 232297 231491 230951
66596 230951 230574 230144 229518 228508 226943 225150 223919 223569 223404 222499 220621 217988 214753 211315 208600 207173
66580 207173 206523 206016 206085 207351 208927 208974 207038 204519 202442 200141 196931 193876 192645 193216 193972 193843
66564 193843 193208 192693 192204 191572 191263 191794 192869 193624 193415 191901 188695 183669 177594 171900 167573 164715
66548 164715 163257 163495 165422 168024 169973 170894 171307 171446 170931 169801 168960 169060 169576 169639 169223 168702 167768
66531 167768 165932 163947 163318 164070 164228 162394 159866 159075 160419 161818 161318 158982 156066 153431 151357
66516 151357 150097 149739 149776 149579 149299 149793 151515 153774 155239 155010 153150 150300 146981 143401 139986 137775
66500 137775 137831 140070 143009 144912 145116 144228 143383 143445 144450 145441 145210 143699 142339 142470 143710 144533 144212
66483 144212 143257 142027 140031 137032 133837 131273 129031 126335 123321 120908 119540 118887 118738 119370 120796
66468 120796 122263 122928 122816 122849 123951 126159 128584 130352 131512 132629 133459 132721 129792 126065 123718 123324
66452 123324 123590 123378 122927 122805 122758 122340 121887 121900 121813 120369 117356 114264 112962 114010 116425 118714 119986
66435 119986 120392 120790 121903 123526 124580 124160 122577 121169 120895 121302 121147 119940 118451 117628 117510 117482 117243
66418 117243 117063 117331 118233 119623 120808 120819 119475 117872 117093 116682 115320 112927 110924 110207 110049 109600 109330
66401 109330 110086 111547 112749 113524 114292 114825 114556 113969 114366 115928 117174 116850 115505 114590 114687 115253 115630
66384 115630 115587 115223 114949 115426 116835 118249 118290 116612 114413 113309 113907 115623 117582 119362 120792 121480
66368 121480 120968 119353 117321 115328 113137 110513 108034 106574 106102 105713 105010 104719 105556 107072 108221 108687
66352 108687 108984 109415 109655 109449 109183 109391 109980 110217 109451 107673 105442 103423 102095 101784 102645 104323 105839
66335 105839 106310 105936 105931 107293 109877 112719 114853 115758 115657 115752 117374 120149 121658 119952 116133 113278
66319 113278 112822 113218 112391 110243 108105 106850 106539 107137 108444 109650 110060 110130 110905 112445 113588 113329 111698
66302 111698 109324 106956 105587 106071 108027 109659 109381 107560 106178 106761 108851 110584 110648 109504 108545 108296
66286 108296 107937 106695 105006 103819 103365 103303 103569 104100 104087 102750 100899 100569 102697 106068 108794 109930
66270 109930 109454 107877 106487 106785 108776 110666 111040 110484 110204 110117 109514 108741 108565 108394 106855 104074 101779
66253 101779 100962 100911 100927 101523 103186 105156 106363 106735 106677 105925 103967 101319 99489 99566 101262 103346 104798
66236 104798 105637 106806 109079 112033 114403 115464 115637 115608 115361 114414 112610 110384 108467 107454 107316 107242
66220 107242 106390 104970 104095 104359 105058 105100 104237 103102 102458 102734 103933 105617 107229 108539 109427 109339 107755
66203 107755 105411 104082 104605 105851 106282 105745 104943 103937 102354 100623 99746 99896 100202 100015 99548 99280 99607
66186 99607 101012 103560 105992 106346 104046 100685 98254 97260 97086 97585 99373 102634 106321 108762 108882 106877
66170 106877 104012 101877 101657 103737 107567 111730 114543 115190 114307 113119 112053 110651 108743 106935 105644
66155 105644 104315 102157 99363 96999 95880 95991 96891 98113 99092 99162 98006 95999 93969 92712 92747 94254
66139 94254 96981 100244 103238 105398 106437 106221 104979 103646 103509 105101 107663 110062 111954 113539 114451
66124 114451 113937 112308 111201 111650 112655 112588 111529 111042 111760 112486 112073 111174 111393 113287 115952 118261 119828
66107 119828 120793 121224 120939 119787 118081 116706 116414 116903 116955 115807 113995 112465 111249 109642 107472 105442
66091 105442 104178 103665 103782 104714 106424 108255 109614 110668 111859 113010 113519 113273 112778 112394 112014 111527
66075 111527 110977 110123 108470 106040 103658 102214 102053 103255 105841 109278 112401 114445 115737 116818 117493
66060 117493 117472 117345 117931 119028 119915 120737 122054 123170 122503 119979 117569 116790 116942 116605 115741 115312 115807
66043 115807 117158 119293 121718 123343 123871 124658 126964 129982 131913 132408 132404 131977 130206 127258 124942 124698
66027 124698 126288 128777 131437 133313 133314 131490 129183 127311 125548 123738 122805 123322 124309 124574 124419 124897
66011 124897 126104 127476 129183 131829 134998 137391 138424 138615 138365 137484 136188 135527 136215 137679 138770
65996 138770 138999 138679 138230 137837 137596 137607 137832 138030 137868 137152 136116 135459 135895 137424 139045 139387 137892 135526
65978 135526 134071 134454 135892 137014 137617 138687 140764 143126 144907 146202 147528 148894 150276 152513 156613
65963 156613 162178 167376 170694 172096 172317 171801 170754 169681 169181 169287 169477 169437 169525 170326 171844 173390 174337
65946 174337 174768 175276 176426 178686 182481 187617 192708 196099 197623 198787 200894 203773 206771 210043 213950
65931 213950 217952 221267 224271 227987 232293 235827 237799 238777 239316 238880 236779 233475 230254 227893 226127
65916 226127 224158 221300 217453 213299 209887 207796 206712 205793 204197 201501 198183 195707 195384 196847 198168
65901 198168 197727 195534 192650 190022 188158 187102 186197 184564 182453 181611 183540 187763 192382 195935 198099
65886 198099 199216 200175 202435 206882 212561 217466 220762 223409 226480 229874 232957 235414 236916 236999 236170
65871 236170 236262 238467 241455 242792 242169 241893 243841 247204 250063 252271 255550 260932 267267 272599 276323
65856 276323 279500 283381 288055 292516 295875 298493 301890 307362 314583 321765 327221 330547 332276 332835
65842 332835 332295 330910 329324 328035 326939 325617 323950 322234 320712 319187 317274 314930 312472 309957
65828 309957 306860 302678 297638 292344 286822 280581 273792 267689 263231 259818 255931 250798 244881 239109
65814 239109 234342 231391 230590 231096 231214 229780 226907 223451 220286 218110 217173 216895 216334 215326 214614 214598
65798 214598 214655 214122 213268 212646 212047 210862 209125 207474 206283 205455 204875 204416 203730 202755 202240 203036 204855
65781 204855 206476 207227 207600 208391 210004 212720 216729 221446 225499 227932 229036 229669 230304 231164 232733 235399
65765 235399 238852 242351 245480 248285 251045 254333 258940 264992 271409 276961 281768 286867 292161 295768
65751 295768 295959 293111 289069 285017 280841 276412 272437 269592 267506 265305 262881 260907 259689 258790 257975
65736 257975 257695 258006 257634 255179 251181 247968 247196 248243 249475 250346 251648 254182 257899 262038 265497
65721 265497 267438 268276 269845 273699 279293 284667 288913 292957 297599 301935 304509 305215 305128 304834 303982 302423
65705 302423 300921 300380 300703 300551 298049 292059 283364 274656 268824 266915 267770 269406 270497 270966 271877 274779
65689 274779 280439 288083 296373 305113 315242 327097 339700 352229 365192 379223 393359 405595
65677 405595 414947 421999 427437 431007 432106 430625 426785 420604 411872 400425 386373 370409 353902
65664 353902 338272 324179 311653 300818 291666 283216 273983 263855 254573 247615 242327 237057 231528
65651 231528 226845 223421 220248 216564 213097 211015 210225 209346 207093 203385 199450 197099 197373 199403 200976
65636 200976 200695 199332 198590 198918 199333 199389 200443 204381 211286 218808 223953 225524 224971 225005 227455 232319
65620 232319 238560 245218 251516 256502 259639 262032 266371 274844 287069 300465 312694 323426 333792
65607 333792 344822 356895 370225 384987 400778 416540 431437 445412 458466 469771 478189 483678
65595 483678 487644 491739 496604 501845 506773 510997 514551 517695 520491 522590 523704 524145 524451 524504 523629
65580 523629 521621 518957 515680 510820 503433 493539 481456 466916 449792 431230 413061 396175 380315
65567 380315 365239 351101 337718 324503 311390 298987 287680 277321 267939 259817 252644 245533
65555 245533 238271 231681 226285 221604 217373 214458 213641 214147 214301 213218 211113 208507 205981 204175 203111
65540 203111 201846 199720 197527 196573 196968 197944 199427 201985 205395 208665 211545 214626 217778 220033 221576
65525 221576 224233 228900 233694 236081 236185 236699 239865 245727 253216 261681 271009 281118 291884 303262
65511 303262 315192 327627 340749 354861 369845 384836 398548 409915 418547 424743 429139 432194
65499 432194 433900 433748 430924 424784 415516 404304 392507 380675 368635 356394 344517 333619 323969
65486 323969 315508 307648 299170 289204 278574 269314 262456 257067 251902 247117 243692 241939 241441 241846
65472 241846 242786 243488 243451 243167 243200 242886 241056 237917 235089 233562 232535 230483 226731 221900 217533 215228
65456 215228 215257 215864 214786 211626 207939 204969 202393 199531 196531 193710 190872 188242 187201 188910 192623
65441 192623 196334 198743 199654 198858 196021 191997 189173 189675 193555 199104 204683 209810 214552 218475 220758
65426 220758 221426 221934 223889 227190 229959 230520 229040 227074 225978 226003 226447 226287 225084 223646 223442 224976
65410 224976 227014 227713 226143 222585 218115 214387 212949 213749 214845 214505 213123 212038 211055 208740 205061
65395 205061 201998 201007 201332 201552 201439 201342 200854 199478 197858 197072 197099 197242 197697 199343 202077 204707 206660
65378 206660 208504 210486 211984 213171 215926 221738 229332 235659 239032 240242 240725 240880 240451 239436 237944
65363 237944 235803 233024 230255 228146 226483 224542 222203 220194 219195 219103 219242 218954 217956 216502 215404 215630
65347 215630 217636 220977 224554 227233 228524 228982 229809 231694 234121 236210 238059 240635 244305 248292 251865
65332 251865 255264 258822 261864 263400 263556 263428 263629 263936 264359 265438 267033 267802 266691 264449 262839 262625
65316 262625 263052 263154 262791 262258 261602 260865 260656 261926 264993 269064 272940 276246 279767 284419 290012 295413
65300 295413 299949 304271 309596 316505 324856 334471 345167 356066 365669 373114 379030 384652 390226 394721
65286 394721 397178 397911 398054 398150 397624 395746 392711 389306 385624 380674 373564 364822 356232 349405 344599
65271 344599 340670 335968 329543 321826 314013 306624 299096 291213 284388 280447 279162 278015 274872 270131
65257 270131 265695 262606 260453 258538 256606 254569 252429 250556 249252 247860 245066 240492 235533 232131
65243 232131 231014 231451 232417 233523 234873 236487 238128 239615 241133 243103 245720 248662 251180 252410 251692
65228 251692 249116 245960 244092 244386 245965 247420 248413 249426 250395 250754 250843 251876 254043 255817 256034 255731
65212 255731 256715 258854 260091 259025 256293 253321 250834 248987 248033 248071 248524 248408 247051 244477 241403 238938
65196 238938 237795 237563 237101 235835 234282 233224 232863 233082 233916 235265 236553 237199 237247 237094 236855 236376 235599
65179 235599 234435 232541 229813 226977 225057 224208 223561 222276 220296 218074 216098 214809 214458 214811 215376
65164 215376 216020 216861 217540 217380 216593 216491 217741 219088 218795 217021 215629 215713 216472 216806 216841 217187 217642 217689
65146 217689 217754 218830 220923 222887 224067 225279 227687 231205 234528 236422 236555 235282 233224 231217 230231
65131 230231 230818 232538 234158 234821 235088 236525 240004 244603 248460 250569 251324 251487 251245 250593 250117 250818
65115 250818 253096 256231 258997 260750 261873 263245 265404 268357 272039 276491 281417 286068 290022 293829
65101 293829 298308 303411 308411 313120 318264 324637 332475 341644 351695 361786 371419 381359 392850
65088 392850 405735 418582 431097 444987 461475 479256 496346 512917 530600 549556 568111
65077 568111 585225 601547 617797 633719 649124 664418 679257 691901 700804 705951 707795 705910
65065 705910 699803 690451 679841 669169 658277 646575 633617 618866 601812 582638 562373 542204
65053 542204 522825 504445 487228 471640 458168 446391 434492 420519 404445 388378 374374
65042 374374 362670 352430 343314 335352 327960 320359 312940 307117 303580 301496 299670 297763 295985 294226
65028 294226 292122 289715 287496 285709 283886 281237 277474 273114 268951 265421 262719 261241 261249 262060 262327
65013 262327 261531 260537 260152 259846 258738 257320 256987 257984 258942 258667 257375 255767 253803 251108 248026 245563
64997 245563 244492 244983 246884 249907 253570 257232 260202 261861 262071 261599 261619 262408 262872 261819 259346 256492
64981 256492 253833 251176 248511 246371 244946 243571 241609 239372 237599 236388 235332 234465 234196 234232 233497
64966 233497 231583 229590 228846 229277 229796 229984 230474 231713 233273 234620 235721 236511 236440 235176 233363 232195
64950 232195 232489 234453 237840 241836 245212 247306 248746 250687 253464 256500 259314 261971 264582 267051
64936 267051 269406 271862 274305 276173 277107 277438 277841 278720 280063 281657 283239 284584 285596 286304 286834 287486
64920 287486 288747 290935 293802 296751 299401 301657 303127 302845 299968 294827 289041 284333 281124 278461
64906 278461 275405 272175 269547 267390 264557 260371 255601 251630 249168 248133 248174 248750 249062 248507 247036
64891 247036 244787 241886 239052 237642 238188 239353 239376 238326 237821 238685 240163 241602 243582 246680 250088
64876 250088 252364 253085 252971 252616 251716 249627 246297 242556 239488 237526 236297 235472 235351 236164 237237 237676
64860 237676 237697 238382 240091 242086 243812 245435 246838 247275 246763 246797 248649 251662 254255 256122 258347 261562
64844 261562 265170 268461 271587 275053 278898 282843 286975 291938 298469 306807 316404 326167 335014 342302
64830 342302 347938 352355 356313 360263 363841 366401 368078 369743 371701 373141 373306 372668 372351 372802 373568
64815 373568 373987 373445 371324 367513 362899 358709 355322 352252 349222 346671 345096 344294 343255 340582 335409
64800 335409 328567 322587 319617 319055 317959 314118 308145 302224 297503 293447 289343 285416 282192 279468
64786 279468 276538 273266 270301 268078 266124 263831 261609 260572 261027 261874 261833 260868 260053 260395 262101 264625
64770 264625 266901 267805 267010 265472 264702 265440 267289 269548 272076 275228 279148 283294 286769 289244 291405
64755 291405 294188 297608 300881 303801 307367 312672 319733 327852 336583 345685 354666 363169 371481 379818
64741 379818 387406 393156 397049 399765 401005 399424 394613 388054 381480 375175 368603 362007 356314 351869
64727 351869 348225 345198 343266 342727 342994 343070 342435 341253 340013 339260 339533 341136 343756 346503 348677 350509
64711 350509 352840 355996 359443 362873 367170 373536 381828 390536 398504 405907 413287 420469 427076 433425
64697 433425 440023 446426 451560 455171 458159 461272 464298 466933 469702 473254 477109 479928 481042 481081 480956
64682 480956 480759 479820 477245 472113 463819 452926 441411 431285 422970 415469 407968 400522 393205 385672
64668 385672 378178 372268 369436 369157 369036 367210 364249 362480 363599 367089 370899 373438 374767 375924 377563
64653 377563 379658 382153 385038 387706 389157 389333 389588 391094 393170 393920 392257 388658 384129 379309 374658
64638 374658 370687 367484 364328 360209 354824 348990 344077 340825 338645 336288 333391 331003 330280 331036 332017
64623 332017 332384 332422 332944 334489 336999 339861 342331 344332 346719 350407 355465 361519 368639 377108 386370
64608 386370 394981 401848 407156 411948 417038 422162 425921 426830 424860 421607 418493 415299 411113 406067
64594 406067 401138 396706 392581 389148 387082 385963 384679 383357 383339 384831 386271 386824 387922 391181 396125
64579 396125 401364 406965 414062 422769 432067 441504 451558 462433 473725 485315 497417 509560 520554
64566 520554 529701 537136 542814 546042 546471 544762 541834 537954 533051 527528 522248 517720 513488 508380
64552 508380 501512 493203 484777 477243 470440 463788 457534 452679 449824 448615 448257 448003 447178 445276 442217
64537 442217 438160 433065 426836 419851 412894 406522 400844 395860 391565 387786 384419 381820 380479 380276
64523 380276 380552 380938 381653 382977 385009 387985 392213 397418 402691 407333 411397 415189 418626 421327 423028
64508 423028 423780 423996 424249 424523 423657 420151 413740 405660 397309 389313 382017 375875 370726 365447 359137
64493 359137 352211 345698 340035 335299 332032 330690 330521 330238 329832 330576 332937 335614 337337 338702 341220
64478 341220 344941 348032 348788 347389 345444 344194 343448 342194 340003 337598 335929 334928 333672 331772 329963
64463 329963 329004 328590 327953 327093 326653 326788 327142 327922 330042 333675 337477 340002 341482 343411 346508 349854
64447 349854 352249 353904 356396 361108 368007 375903 383669 390985 397978 404642 411064 417936 426035 434958
64433 434958 443011 448704 451952 453542 454154 454445 455270 456771 457638 456360 453068 449178 445359 441070 436166
64418 436166 431578 427924 424675 421491 419285 418901 419450 419137 417399 415306 414027 413707 413682 413081 411422 409399
64402 409399 408860 411179 415679 420355 424042 427110 430266 433802 438073 443439 449133 453284 455040 456074
64388 456074 459043 464710 471453 477543 483182 490080 499571 511467 524492 537476 550223 563506 578350
64375 578350 595239 613932 634027 655641 679438 705919 734950 766211 800015 837410 879535
64364 879535 927263 981360 1042259 1109408 1181444 1257533 1338000 1423119 1511701 1601562 1690882
64353 1690882 1778158 1861147 1937095 2004228 2061970 2109393 2144487 2165651 2173131 2168233 2151691 2123610
64341 2123610 2084532 2035470 1976937 1908919 1832192 1749061 1662369 1574133 1485490 1397622 1312115
64330 1312115 1230336 1152971 1080523 1013950 954244 901331 853997 811161 772685 738485 707432
64319 707432 678101 650532 626303 606616 590959 577859 566092 554714 542741 529734 516378
64308 516378 503795 492447 482126 472591 463518 454255 444595 435665 428968 424283 419537 413309 406693
64295 406693 402019 400284 400619 401820 403432 405438 407919 411298 416090 421902 427340 431603 435688 441173
64281 441173 447850 453376 455437 453679 449393 444057 438673 433858 429650 425276 419849 413490 407454 403065
64267 403065 400828 400487 401364 402464 402787 402040 400914 400338 400493 400760 400556 399954 399434 399118 398411 396554 393586
64250 393586 390594 388738 388053 387462 385947 383355 380009 376085 371789 367845 365118 363588 362056 359190 354789
64235 354789 349917 345980 343860 343734 345224 347463 349302 349989 349802 349818 350976 353448 356857 360782 365001
64220 365001 369544 374671 380520 386619 392118 396836 401837 408573 417534 427966 438653 448613 457239 464242
64206 464242 469555 473068 474590 474335 473252 472516 472700 473663 474957 476005 476238 475546 474394 472956 470449 465974
64190 465974 459778 452840 445406 436911 427493 418510 411113 405028 399310 393827 389487 387249 387063 387547 386855
64175 386855 384436 381786 380635 380645 380035 378498 377811 378927 380060 378932 375717 372277 369313 366068 362605
64160 362605 360614 361470 364489 367536 368766 367719 365383 363359 362544 362590 362855 363351 364214 364880 364720 364059 363555
64143 363555 363022 362098 361707 363170 365808 367160 366238 365183 366756 371259 376805 381746 385853 389897 395162
64128 395162 402971 413619 425859 438145 450265 463034 476525 489283 499451 506324 510633 513352
64116 513352 514134 511151 503072 491247 479173 469359 461365 453247 444047 434108 423824 413345 403249
64103 403249 394369 386929 380629 375503 371849 369415 367536 366086 365291 364512 362436 359093 356715 357596 361472
64088 361472 365781 368336 369189 369993 372150 375700 379613 382938 385627 388221 390858 392994 394156 394516 394426
64073 394426 393846 392731 391699 391739 393288 396031 399414 402834 405434 406558 406697 407359 409486 412462 415203
64058 415203 417894 421957 428408 436890 446388 456272 466452 477104 488615 501251 514389 526543 536697
64045 536697 545298 553283 560463 565836 569488 573174 578514 585352 592417 599009 605409 612122 619407 627110
64031 627110 634184 638624 638854 635182 629195 621780 612677 601920 590449 578780 566291 552824 540117
64018 540117 530284 523200 516610 508752 499772 490575 481682 473679 467506 463347 460063 456722 454122 453727
64004 453727 455477 457812 459751 461702 464077 466329 467969 469599 472088 475320 478566 481778 485666 490528
63990 490528 495686 500268 504232 508503 514269 522068 531439 541628 552612 564885 577981 590050 599695
63977 599695 607698 615886 624551 632146 637563 641357 644346 646316 647011 647384 648612 650341 651073 650130 648220
63962 648220 646130 643906 641562 639685 638828 638857 639248 639457 638652 635671 629936 622196 613924 606153 599281 593673
63946 593673 589804 587741 586998 586981 587085 586397 584047 580339 577071 576051 577416 579936 582908 587045 593291
63931 593291 601406 610226 618977 627811 637266 647821 659957 674001 689608 705791 721813 737935
63919 737935 755050 773685 793514 813825 834432 856137 880155 906827 935057 963454 992094
63908 992094 1022774 1057426 1096720 1140284 1187626 1238344 1291886 1347824 1406376 1468335 1534711
63897 1534711 1606780 1686178 1774255 1871455 1977987 2095210 2225712 2371753 2534031 2712240
63887 2712240 2906368 3116862 3343443 3584112 3835667 4095313 4361662 4633740 4908807
63878 4908807 5181395 5444721 5692747 5920569 6123416 6296388 6435488 6538377 6603827 6630867
63868 6630867 6618668 6566884 6475839 6346794 6182453 5987126 5766212 5525520 5270805 5007338
63858 5007338 4739551 4471290 4206366 3948417 3700120 3463105 3238979 3029946 2837968
63849 2837968 2663615 2506056 2363851 2235396 2118990 2013146 1916915 1829697 1750898 1680015
63839 1680015 1616743 1560553 1510211 1464016 1420428 1378377 1337256 1297035 1258199 1221308 1186732
63828 1186732 1154855 1126049 1100056 1075823 1052550 1030647 1011216 994936 981984 972615 966980 964457
63816 964457 964010 965296 968803 974896 983315 993552 1005010 1016716 1027682 1037817 1047937 1058634 1069672
63803 1069672 1080561 1090984 1100402 1107993 1113373 1116792 1118254 1117032 1112605 1105517 1096776 1086755 1075188
63790 1075188 1061905 1047035 1030669 1012687 992773 970526 945938 919917 893764 867912 841906
63779 841906 815912 791235 768654 747200 725668 704568 685186 667200 648891 629747 611283
63768 611283 594740 579331 563549 547183 531171 516239 502681 490901 481050 472330 463649 455073
63756 455073 447863 442834 439279 435811 431816 427725 424152 421207 418638 416319 414383 412918 411715 410477
63742 410477 409294 408735 409225 410267 410437 408382 403944 398275 392824 388262 384406 380966 377994 375680 374007
63727 374007 372753 371568 369886 367125 363314 359390 356519 355152 354888 355082 355320 355478 355707 356323 357392 358444
63711 358444 358804 358044 355930 352315 347769 344074 343102 344812 347092 348163 348564 350077 353038 355720 356527
63696 356527 355982 355948 357344 359371 360893 361759 362309 362195 360604 357706 355055 354106 354839 356382 358624 362469
63680 362469 368402 375429 381822 386684 390491 394153 397772 400586 402160 403286 405188 407939 410462 412323
63666 412323 414696 418830 424295 429779 435195 441635 449172 456002 460401 462647 464337 466453 468825 471055
63652 471055 473155 475266 477198 478285 477556 474322 468984 463205 458973 457323 457796 458924 459384 459072 459047 460106
63636 460106 461617 462354 462404 463351 466394 471038 475941 480166 483079 484052 483338 482784 484507 488763 493776 497674
63620 497674 500056 501702 503420 505418 507529 509788 512663 516561 521143 525617 529751 533985 538261 541515
63606 541515 542923 543092 543208 543416 542847 540963 537966 534049 529175 523775 518891 515369 513242 511985 510950
63591 510950 509614 507913 506400 505743 506131 507450 509766 513116 517146 521630 527085 534059 541868 548934 554534
63576 554534 559552 565433 573093 582851 594615 607828 621918 636983 653408 670714 687715 704149
63564 704149 721288 740390 761347 783561 807514 834556 865362 899311 935334 972951 1012532
63553 1012532 1054852 1100276 1148213 1197677 1248483 1301330 1356308 1411718 1464796 1513138 1554919
63542 1554919 1588326 1611940 1625918 1632170 1633014 1629859 1623304 1614129 1603632 1592749 1580930 1566260
63530 1566260 1547011 1522859 1494271 1461128 1422983 1380809 1337330 1294881 1253625 1212758 1172935
63519 1172935 1136402 1104820 1078010 1054997 1035369 1019134 1005980 995439 987556 982800 981243 982238
63507 982238 985094 989890 997358 1007924 1021065 1035833 1051923 1069918 1090423 1113309 1138058 1164668
63495 1164668 1193961 1227002 1264260 1305192 1348643 1394017 1442186 1494860 1552621 1613712 1674812
63484 1674812 1732490 1783552 1824689 1853155 1868361 1872349 1868303 1858703 1844940 1828149 1809719 1790839
63472 1790839 1771814 1752058 1730737 1707186 1680559 1649448 1612413 1569181 1521025 1469814 1416984
63461 1416984 1363583 1310658 1258883 1208001 1157442 1107609 1060034 1016041 975732 938537 904310
63450 904310 873449 846065 821395 798284 776297 756333 739806 726862 715628 703794 690984
63439 690984 678906 669031 660860 653029 645398 639141 635006 632565 631284 631331 632751 634557 635456 635239 634834
63424 634834 635103 636108 637435 638650 639442 639937 641006 643609 647567 651476 654120 655424 655739 654957 653066
63409 653066 651008 649896 649536 648696 646936 645204 644359 644035 643536 643107 643542 644975 646825 648803 651285 654678
63393 654678 659012 664314 671036 679854 691101 704365 718650 733235 748627 766293 787044 809938
63381 809938 833410 857399 883631 913662 947393 983931 1023127 1065322 1109666 1153662 1194715
63370 1194715 1231720 1265035 1295650 1324969 1354848 1386832 1421233 1457576 1496027 1537757 1583789
63359 1583789 1634317 1689515 1750078 1815905 1884609 1952197 2015082 2070617 2115945 2147845 2164669
63348 2164669 2168078 2162340 2151911 2139560 2126025 2110746 2092881 2071855 2047135 2017872 1983233 1942924
63336 1942924 1896962 1845247 1788202 1727799 1666998 1607922 1551300 1497758 1448423 1403642 1362242
63325 1362242 1322992 1286143 1252682 1222849 1196489 1174191 1156687 1143360 1132737 1124695 1120963 1123063
63313 1123063 1130637 1142191 1156677 1173841 1193674 1216213 1241682 1270433 1302831 1339219 1379624
63302 1379624 1423401 1469658 1518289 1570253 1626484 1686706 1749458 1812873 1875111 1934220 1988098
63291 1988098 2034797 2072826 2101045 2118413 2124225 2119010 2105074 2085535 2062545 2036843 2009085 1980629
63279 1980629 1952042 1921436 1885593 1842928 1794524 1742276 1687050 1629104 1569254 1508854 1449193
63268 1449193 1391772 1338748 1292010 1251518 1215173 1180899 1148732 1120523 1097364 1077413 1056605
63257 1056605 1031801 1003227 973740 945938 920274 895655 871101 846552 822590 799924 779079
63246 779079 760221 743223 727922 714319 702492 692391 683701 675828 668122 660302 652662 645674 639429
63233 639429 633571 627767 622110 617094 613103 609720 605562 599292 591073 582634 575590 570108 565547 561720
63219 561720 558777 556322 553663 550816 548447 546885 546031 546137 547700 550436 553342 556021 559003 562400 565196
63204 565196 566500 566821 567538 569742 573985 580353 587972 595042 600291 604187 608199 613185 619097 625841 633638
63189 633638 642748 653456 666155 680754 696221 711507 726917 743796 762690 782500 801857 821008
63177 821008 841887 866390 894628 924798 954689 983379 1011545 1040308 1070014 1100086 1129605
63166 1129605 1157878 1184820 1211064 1237403 1263961 1290252 1316163 1342228 1368515 1393941 1417284
63155 1417284 1438299 1456975 1472162 1481973 1485394 1482522 1473348 1457644 1436379 1412033 1386568 1359776
63143 1359776 1330504 1299128 1267919 1239049 1213011 1189144 1167146 1147715 1131973 1120505 1112897
63132 1112897 1108066 1105143 1104109 1105585 1110080 1117493 1127144 1137998 1148889 1159050 1168824 1179588 1192445
63119 1192445 1206964 1221639 1235643 1249606 1264456 1280072 1295497 1309931 1322822 1333429 1341225
63108 1341225 1346635 1350343 1351788 1349222 1341530 1329051 1312344 1291298 1266200 1238584 1209943 1180311
63096 1180311 1149320 1118021 1088227 1060266 1032966 1006058 981094 959370 940105 921525 902960
63085 902960 885069 868721 854582 843246 834668 827594 820477 813015 806086 800247 795238 791135 788885
63072 788885 788898 789764 789440 787729 786726 788532 793106 798748 804163 809435 815155 821289 827150 832136 836305
63057 836305 840393 845269 851130 857184 862493 867127 872058 877803 883790 889401 895011 901290 907816 913242
63043 913242 916905 919601 922568 926246 930375 934837 939896 945603 951205 955260 956581 955399 953611 953455
63029 953455 955642 958873 961306 962371 963071 964750 967813 971570 975181 978718 983380 990603 1000886 1013453
63015 1013453 1027047 1040972 1055404 1070853 1087510 1105176 1123664 1143029 1163361 1184668 1207329
63004 1207329 1232416 1260943 1292664 1326284 1361290 1399062 1441556 1489171 1540515 1594071 1649429
62993 1649429 1707026 1767448 1831034 1897402 1965106 2032467 2099154 2166418 2235344 2305343 2374828
62982 2374828 2442946 2510087 2576982 2643877 2710448 2775988 2839686 2901031 2959748 3014881 3064070
62971 3064070 3104269 3133229 3149897 3153685 3144244 3122272 3089755 3048683 2999731 2942673 2877855 2806853
62959 2806853 2731910 2655356 2579536 2506557 2437713 2373418 2314051 2260613 2214303 2175591 2143982
62948 2143982 2118564 2098533 2083405 2073125 2068167 2069183 2076303 2088736 2105076 2124003 2144818 2167473
62936 2167473 2192094 2218310 2245065 2271064 2295309 2317135 2336159 2352517 2366886 2379649 2390072
62925 2390072 2396677 2398279 2394014 2382546 2362317 2333022 2296030 2252798 2203678 2149004 2090477 2030370
62913 2030370 1969754 1908710 1847993 1789101 1732647 1678088 1625602 1576856 1532982 1492777 1454143
62902 1454143 1416752 1382037 1350764 1321799 1293417 1264886 1236506 1208976 1183144 1159604 1137889
62891 1137889 1116455 1094105 1071212 1049156 1028790 1009911 991867 974042 955891 937357 919464
62880 919464 903788 890857 879501 868255 856983 846566 837243 828047 817966 807185 797004 788890
62868 788890 783594 780594 778108 774155 768163 761384 755570 751530 749165 748294 748640 749247 748830 746960 744297
62853 744297 741380 737833 733314 728803 726057 725633 726107 725577 723500 720567 717095 712468 706446 700285 695766
62838 695766 693313 691890 690764 690537 691962 694430 696356 696806 696076 694849 693507 692330 691598 691155 690434 689326
62822 689326 688566 688771 689480 689762 689532 689414 689222 687550 683646 679205 677291 679314 683723 687914 690731 692617
62806 692617 694013 694604 694122 692939 691520 689914 688237 687108 687039 687650 688123 688401 689378 691824 695542 699744
62790 699744 703776 707159 709246 709513 708369 707300 707746 709839 712472 714497 715508 715574 714898 714055 713916 714641
62774 714641 715152 714428 713101 712868 714333 716434 718220 720147 722995 726392 729274 731436 733835 737522 742781
62759 742781 749128 755690 761805 767635 774075 781768 790540 799943 809797 819873 829721 839386 849732 861538
62745 861538 874886 890011 907766 928132 949080 968492 986966 1007218 1030667 1056110 1082058
62734 1082058 1108940 1138356 1171272 1207705 1247251 1289159 1332627 1377890 1426724 1481355 1543223
62723 1543223 1612911 1690314 1774098 1861803 1951569 2043657 2139463 2239072 2340202 2439348 2533341
62712 2533341 2619916 2697467 2764467 2818926 2858454 2881222 2886911 2876583 2851761 2813745 2763610
62701 2763610 2702427 2631371 2551817 2465391 2373980 2279700 2184770 2091116 1999990 1912077 1827837
62690 1827837 1747472 1670651 1596784 1525871 1458831 1396886 1340683 1290031 1244161 1202222 1163772
62679 1163772 1128853 1097476 1069306 1044140 1022288 1003758 987301 971187 955027 939985 927079
62668 927079 916195 906995 899700 894475 891147 890269 893306 900473 909059 915408 918605 921237 926649 936450
62654 936450 950480 967758 986926 1006928 1028104 1052016 1079518 1109665 1141476 1176261 1216908
62643 1216908 1264661 1317725 1373652 1432152 1494556 1561048 1629782 1698730 1767075 1834321 1899219
62632 1899219 1960508 2017763 2070350 2116159 2152652 2178797 2194706 2199686 2192305 2172616 2142764 2104760
62620 2104760 2058905 2005122 1944694 1879776 1812038 1742708 1673237 1604989 1538780 1475380 1415809
62609 1415809 1360327 1307762 1256789 1207485 1160881 1117462 1076968 1039211 1004211 971903 942540
62598 942540 916945 895419 876725 859182 842438 827124 813000 798744 783680 768611 754660
62587 754660 742231 731423 722628 716123 711510 707858 704198 699986 695573 692179 690804 691088 691685 691625 690864
62572 690864 689731 688597 688014 688333 689108 689443 688948 687816 686252 684730 684565 686997 691562 696532 701293 707129
62556 707129 715111 724364 733263 741526 750160 759999 771224 783894 797936 812794 828035 844356 863293
62543 863293 885758 911327 939049 968510 1000035 1034295 1071872 1112848 1156528 1201688 1247322
62532 1247322 1293150 1339231 1385068 1429207 1469789 1505351 1534921 1557504 1572026 1577978 1575719 1565781
62520 1565781 1548278 1523514 1492860 1458287 1420997 1381056 1338462 1294041 1249204 1205311 1163382
62509 1163382 1123874 1086484 1050636 1016407 984597 955611 928763 903142 878865 856918 837880
62498 837880 821296 806506 793618 783214 775090 767848 760109 751890 744260 737795 732083 726876 722796
62485 722796 720400 719351 719192 720193 722485 724954 726297 726867 728210 730844 733793 736463 739575 743816 748835
62470 748835 754236 760515 768186 776883 786259 797090 810576 826974 845749 866670 889919 915317
62458 915317 942218 970229 999699 1031700 1067648 1108279 1152444 1197435 1241127 1283367 1324717
62447 1324717 1364482 1400876 1432588 1459087 1479726 1493864 1501984 1505534 1505370 1501381 1493967 1484737 1474908
62434 1474908 1463860 1450394 1435199 1421263 1411832 1408470 1410875 1417762 1427792 1440342 1455870 1475360
62422 1475360 1499257 1527152 1558538 1593339 1631309 1671284 1711480 1750276 1786230 1817615 1842785
62411 1842785 1861096 1872808 1877826 1875199 1864065 1844417 1816578 1780768 1737995 1690669 1641243 1590363
62399 1590363 1537210 1481492 1424289 1367240 1312020 1260633 1214855 1174717 1138395 1104189 1072165
62388 1072165 1043511 1019025 998700 982015 967859 954696 941689 929602 920023 913750 910285 908643
62376 908643 908134 908352 908869 909113 908484 906578 903262 898460 892080 884349 875938 867180 857385 845747 832937
62361 832937 820892 810843 802360 794598 787441 780898 774396 767504 760637 754321 748550 743662 740871 740605
62347 740605 740999 739621 736584 734516 735262 737899 740294 741384 741354 740816 740805 742844 747773 754491 760702 765124
62331 765124 768503 772365 777246 782599 788103 794328 801867 810472 819710 830124 842833 857978 874559
62318 874559 892045 911075 931957 953510 974414 995067 1017033 1041191 1067547 1096435 1128547
62307 1128547 1163938 1202290 1244245 1291119 1343015 1398618 1457434 1521007 1591026 1667263 1748431
62296 1748431 1834337 1925779 2022329 2121185 2218373 2310498 2395128 2469958 2532146 2578934 2609378
62285 2609378 2625407 2630401 2626213 2611901 2585618 2547113 2497937 2439945 2374598 2303381 2227932 2149725
62273 2149725 2070467 1992725 1919098 1850475 1785962 1724934 1668334 1617298 1571269 1528376 1487372
62262 1487372 1448310 1411402 1376130 1341774 1308225 1275908 1245193 1216051 1188075 1160742 1133897
62251 1133897 1108023 1083776 1061248 1039991 1019707 1000507 982553 966143 952265 942254 936298
62240 936298 932669 928944 923792 917511 911462 907369 906340 907734 909428 909989 910207 911860 915601 921021 928145
62225 928145 937424 948509 960532 973650 988828 1005885 1023333 1040620 1058952 1079147 1100311 1121852
62213 1121852 1145405 1173067 1204546 1237659 1271243 1306035 1342987 1382384 1424842 1471685 1523651
62202 1523651 1580003 1639504 1701875 1768061 1839481 1917166 2001149 2090391 2183310 2278087 2372202
62191 2372202 2462184 2544612 2617381 2679485 2729776 2766607 2788752 2796178 2789867 2771195 2741240 2700178
62179 2700178 2647481 2583243 2509249 2428326 2342849 2254365 2164419 2074941 1987686 1903732 1823596
62168 1823596 1747632 1676407 1610787 1551287 1497231 1447298 1401216 1359969 1323665 1290393 1258434
62157 1258434 1228642 1203017 1181544 1162371 1144893 1130486 1119747 1110869 1101661 1091744 1081906 1072565
62145 1072565 1063920 1056679 1051539 1048425 1046925 1046977 1048667 1052052 1057494 1065214 1074035 1081815 1088109 1095455
62131 1095455 1106713 1121721 1137730 1152773 1167446 1183487 1201766 1221914 1243111 1264822 1286971
62120 1286971 1309588 1332342 1354740 1376854 1399372 1422799 1447250 1473164 1501349 1531986 1564716
62109 1564716 1600537 1642426 1692736 1750688 1813839 1881344 1953844 2030175 2106205 2177658 2242512
62098 2242512 2299675 2346842 2381567 2403971 2416707 2421885 2419179 2407357 2386555 2358027 2322263 2278648
62086 2278648 2227243 2169946 2109406 2047515 1985629 1925567 1869174 1816938 1768046 1721962 1679110
62075 1679110 1639884 1604125 1572108 1545008 1523434 1506043 1490589 1476114 1463513 1454233 1449011 1447431
62063 1447431 1447842 1447868 1445751 1441256 1434971 1427156 1417960 1408281 1399368 1391646 1384836 1379084 1374797 1371143 1365742
62048 1365742 1356497 1343148 1326852 1309120 1291690 1276430 1264343 1254936 1247289 1241369 1237538 1235221
62036 1235221 1233219 1231492 1231577 1234770 1240569 1247480 1254744 1262652 1271584 1281641 1293157 1306751 1322550
62023 1322550 1339859 1357841 1376187 1395116 1415286 1437841 1463869 1493359 1525244 1558833 1594511
62012 1594511 1632478 1671716 1711296 1752104 1795928 1842983 1891765 1941455 1992986 2047191 2103077
62001 2103077 2158683 2212513 2263102 2307941 2344144 2370183 2386317 2393443 2391959 2381570 2361801 2332848
61989 2332848 2295990 2252588 2202563 2144772 2079347 2008826 1936315 1863364 1790475 1718814 1650149
61978 1650149 1585422 1524462 1466830 1412028 1359312 1308540 1261141 1219123 1183037 1151754 1124051
61967 1124051 1099270 1076449 1054309 1032694 1012997 996497 982885 970828 959218 947379 934822
61956 934822 921616 908710 897223 887420 878641 870091 861579 853699 847378 842970 839725 836499 832994
61943 832994 830034 828676 829377 831906 835507 839160 842226 844881 847499 849745 850934 851198 851397 851751 851323
61928 851323 849157 845221 840018 833992 827583 820988 813446 803651 791566 779168 768606 760102 752443
61915 752443 745119 739027 735053 732717 730517 727309 723166 718923 714924 710467 704856 698753 693757 690588
61901 690588 688524 686938 686421 687733 690431 693458 696541 700054 703829 707133 709853 712895 717258 723258
61887 723258 730644 738994 748012 757949 769638 783666 799624 816694 834716 854011 874297 894658
61875 894658 914642 934673 955227 976323 997881 1019712 1040768 1059297 1074409 1086975 1098325
61864 1098325 1108420 1115970 1120052 1120948 1119496 1116280 1111501 1105234 1097728 1089780 1082803 1078129 1076136 1076357
61850 1076357 1078518 1083107 1090723 1101101 1112986 1124888 1135964 1146324 1156532 1166524 1174945 1179871
61838 1179871 1180427 1177396 1171949 1164095 1152921 1138218 1121219 1103630 1086484 1070239 1055352 1042195
61826 1042195 1030548 1019712 1009000 997852 985799 972900 960130 948678 938730 929431 920028 910494
61814 910494 900920 891092 881150 872063 864845 859601 855889 853690 853338 854691 857161 860733 866281 874496
61800 874496 884885 896175 907538 919246 932373 948132 967307 989930 1015375 1042875 1071966
61789 1071966 1102418 1133769 1165198 1196051 1226425 1256919 1287524 1316854 1342738 1363537 1378665
61778 1378665 1387959 1391248 1388929 1382548 1374264 1365778 1358022 1351511 1346381 1342240 1338825 1337027 1338665 1344792
61764 1344792 1354425 1365180 1374919 1382709 1388705 1393467 1397089 1398567 1396200 1388926 1377053 1361375 1341915
61751 1341915 1318112 1290189 1259829 1229279 1200005 1172107 1144753 1117223 1089830 1063815 1040100
61740 1040100 1018340 997595 977717 959443 943182 928450 914668 901769 889727 878237 867369
61729 867369 857818 849843 842516 834803 826933 819758 813117 806015 798436 791778 787057 783617 780263 776927
61715 776927 774425 772967 771671 769547 766433 762913 759587 756440 752862 748490 744057 740941 739654 739237
61701 739237 738574 737932 738553 740855 743726 745738 746717 747889 750649 755249 760659 765603 769541 772383 773518
61686 773518 771894 767354 761231 755123 749634 744935 741896 741520 743315 745265 745716 744636 742948 741393 740368
61671 740368 740066 740166 739818 738488 736634 735232 734876 735551 736879 738217 738908 739015 739653 742001 745870 749592
61655 749592 751545 751662 751372 752147 754209 756627 758443 759377 759300 757563 753542 747872 742327 738020 734126 728850
61639 728850 721489 713041 704949 697767 691211 685007 679211 673754 668108 661800 655241 649705 646234 644662
61625 644662 643946 643228 642155 640262 636719 631133 624268 617563 612028 607902 605208 604113 604478 605346 605382 603983
61609 603983 601762 599702 597994 596197 594467 593924 595325 597933 600358 602208 604039 605917 607077 607301 607656
61594 607656 609302 612225 615736 619642 624104 628598 631914 633334 633437 633688 635442 639132 643971 648428 651374
61579 651374 652882 653849 655006 656386 657433 657253 655099 651199 647143 644801 644547 644744 643289 639630 635094
61564 635094 631217 627950 623869 618244 612385 608286 606135 604067 600628 596600 593794 592717 592270 591310 589537
61549 589537 587018 583785 580047 576049 571560 566151 560151 554647 550160 545959 541110 535750 530800 526722
61535 526722 523133 519527 515806 511992 507809 502916 497544 492683 489390 487779 486753 484902 481696 477806
61521 477806 474360 471986 470414 468815 466649 464357 463119 463594 464918 465232 463317 459682 456205 454813 456162
61506 456162 459146 461776 462967 463467 464763 467246 470007 472266 474269 476560 479033 481114 482453 483110 483378
61491 483378 483722 484507 485532 486188 486355 486787 488225 490524 492990 495179 496811 497328 496277 494105 491996 490887
61475 490887 490983 492064 493749 495578 497470 500044 503768 507725 509991 509676 508078 507405 508726 511460 514251
61460 514251 515770 515123 512441 509095 506643 505353 504138 502032 499222 496506 494359 492962 492745 494217 497223
61445 497223 500756 503628 505219 505754 506148 507405 509661 511728 512066 510445 508263 506984 506672 506523 506412 507122
61429 507122 509028 511311 512753 512779 511418 508923 506099 504570 505718 509158 512930 515548 517460 520180 524317
61414 524317 528890 532383 534055 534222 533618 532738 531697 530531 529371 528262 527013 525514 524159 523541 523687
61399 523687 524013 524202 524730 526180 528449 531004 533581 536090 538103 539180 539616 540180 541040 541568 541439 541158
61383 541158 541166 541117 540660 540381 541156 542724 543740 543399 542451 542341 543722 546114 548807 551651 554816 557985 560268
61366 560268 561218 561715 563231 566155 569365 571752 573543 575658 578330 581128 583997 587286 590787 593654 595533
61351 595533 596994 598468 599417 599031 597282 594846 592490 590966 590882 591897 592398 590927 587893 585093 583524
61336 583524 582559 581567 581299 582803 585535 587623 588010 587480 587378 588042 588877 589434 589895 590818 592779 595921 599397
61319 599397 601658 601914 601127 600945 601933 603532 605516 608390 612249 616373 620372 624773 629867 634940 639454
61304 639454 644137 649883 656128 661396 665149 668121 671074 674258 677965 682572 688015 694044 700940 709148
61290 709148 718351 727769 737156 746392 754324 759510 762242 764362 766666 768097 768161 768491 770749 774127 776411
61275 776411 776816 776451 776526 777356 778745 780049 780040 777975 774871 772672 771993 771554 770064 767881 766465 766740 768262
61258 768262 769706 770106 769908 770739 773954 779547 786646 794591 803044 811642 820364 830069 841866 855904
61244 855904 871181 886291 899966 911434 921046 930130 939267 946973 951022 950885 947952 943669 938752
61231 938752 934043 930389 927172 922405 915207 907117 900071 894015 887590 880541 874195 869686 866708 864202
61217 864202 861650 859429 858183 858100 858957 860935 864912 871161 877885 882309 883772 884760 887959 893074 897745
61202 897745 901149 905246 912233 921866 931847 940187 946557 951744 956380 960353 963207 964996 966500 968373
61188 968373 970270 971291 971248 970961 971119 971364 970899 969623 968089 966508 964425 961595 958722 956934 956587 956813
61172 956813 956284 954356 951610 949395 948745 949508 950539 950893 950790 951317 953332 956912 961668 967123 972740 978043
61156 978043 983026 988238 994377 1001901 1010845 1020476 1029203 1035606 1039995 1044344 1050266 1057455 1064530 1070828
61142 1070828 1076887 1083647 1091754 1101167 1110876 1119603 1127553 1136961 1150020 1166716 1185419 1204734 1223355
61129 1223355 1238910 1249249 1255218 1260209 1266248 1272028 1275574 1277114 1278024 1278395 1277458 1275650 1274432 1274138
61115 1274138 1273423 1270954 1266627 1261090 1255087 1249341 1244197 1239083 1232935 1225251 1216234 1206099 1194997 1183585
61101 1183585 1172719 1162329 1151303 1138831 1125317 1111773 1098946 1087392 1077773 1070502 1065336 1061654
61089 1061654 1058924 1056664 1054336 1051710 1049076 1046609 1043513 1038293 1030191 1020318 1011073 1004198 999381 994965
61075 994965 989969 985085 981669 980419 981430 984783 990065 995724 1000313 1004651 1011514 1022431 1035820 1049211
61061 1049211 1062528 1077865 1096416 1117149 1138744 1161530 1186767 1214846 1244971 1276147 1307775
61050 1307775 1339567 1371440 1403330 1434735 1464825 1493515 1521955 1551113 1580121 1606829 1629884
61039 1629884 1649311 1665124 1676544 1683118 1685637 1685180 1681884 1675301 1665466 1653006 1638782 1624095 1610555
61026 1610555 1598677 1587015 1573781 1559222 1545287 1533048 1521689 1510281 1499295 1489716 1481752 1475366
61014 1475366 1471379 1470921 1473946 1479114 1485188 1491970 1499925 1509578 1521604 1537029 1556746 1580610 1607156
61001 1607156 1634629 1662603 1692570 1726652 1765695 1808869 1855010 1903780 1955353 2009550 2065986
60990 2065986 2125003 2187886 2255842 2328927 2406274 2487360 2572722 2663167 2758552 2857971 2961150
60979 2961150 3068920 3181965 3299824 3421837 3548465 3680778 3818945 3962207 4110163
60970 4110163 4263129 4421203 4584054 4751874 4925846 5107608 5299129 5503109 5722351
60961 5722351 5958372 6211466 6482453 6773755 7089183 7434423 7818327 8252467 8749244
60952 8749244 9321966 9986922 10763012 11668544 12721040 13941366 15354505 16983790 18847232
60943 18847232 20957355 23303935 25805814 28267868 30410879 31990524 32925277 33327197
60935 33327197 33418328 33419130 33492649 33735392 34153532 34618297 34870277 34621481 33700931 32132655
60925 32132655 30094988 27814376 25480887 23221266 21107203 19169219 17409432 15816012
60917 15816012 14375120 13074938 11904769 10855198 9919152 9090263 8359452 7714085 7140743
60908 7140743 6628230 6168091 5753480 5378369 5037686 4727645 4445566 4189276 3956642
60899 3956642 3745554 3554049 3380095 3221242 3074731 2938112 2809841 2689400 2576799
60890 2576799 2471845 2373858 2282368 2197813 2120844 2050760 1985473 1923538 1865477 1812266 1763240
60879 1763240 1716585 1671474 1628419 1587579 1548067 1509307 1471937 1436754 1403470 1371039 1338651
60868 1338651 1306162 1274294 1244741 1219145 1197232 1176695 1155765 1135305 1117331 1101970 1087182
60857 1087182 1071558 1056018 1042117 1029683 1017201 1004131 991700 981268 972760 965175 958130 952290
60845 952290 948515 947046 947333 948070 947544 944689 940123 935653 932502 930348 928190 925585 922692 919636 916267
60830 916267 912160 906462 898170 887079 874223 861028 848318 836473 825913 816790 808574 800613 792888
60817 792888 785657 778809 772176 766070 760736 755683 750432 745533 741796 738877 735870 733291 733014 735759
60803 735759 739707 742244 742453 741495 741253 742973 746528 750527 753541 755508 757499 760108 762745 764556 765189
60788 765189 764536 762769 760945 760494 761489 762432 762464 762799 764947 768293 770525 769977 766534 760722 753209 745133
60772 745133 737763 731519 726102 721668 718953 717809 716473 713087 707714 702239 698185 695047 691020 685156
60758 685156 678335 671979 666276 660274 653437 646358 639797 633799 628111 622747 617583 612007 605721 599598
60744 599598 594969 592132 590202 588364 586675 585544 584954 584438 583503 581932 579909 577969 576728 576506 577154
60729 577154 578072 578445 577768 576355 575026 574155 573442 572927 573650 576515 580750 584383 586397 587643 589289 591140
60713 591140 592214 592598 593780 596888 601192 604799 606602 607090 607331 607657 607562 606614 605080 603663 602762 602096
60697 602096 601095 599735 598757 598759 599143 598600 596842 595217 595070 595906 595777 593301 588809 583863 580249 579044
60681 579044 579700 580060 578049 573531 567957 562443 557070 552043 548339 546697 546697 547181 546993 545263 542001 538733
60665 538733 537432 538105 538304 535838 531252 526929 524557 524280 525431 526862 527133 525833 524585 525487 528462
60650 528462 531278 532321 532257 532639 534068 536502 540479 546707 554387 560934 564027 563838 562852 563458 566063 569614
60634 569614 573305 576990 580198 581886 581654 580399 579164 577906 576052 573773 571897 570823 570244 569828 569528
60619 569528 569331 569284 569746 571154 573631 577136 581651 586711 591089 593663 594309 593364 590632 585906 580223 575327
60603 575327 571704 568249 564300 560967 559730 560438 561534 561919 561835 562065 562897 564000 564934 565590 566213 567107 568500
60586 568500 570795 574630 580158 586234 590870 592798 592296 590427 587945 585204 582536 580030 577109 572924
60572 572924 567374 561472 556666 553887 553177 553804 554581 554347 552607 549941 547766 547424 549236 552315 555344
60557 555344 557623 559338 560999 562866 565023 567606 570466 572627 572799 570931 568926 569039 571516 574388 575799
60542 575799 575846 575863 576706 578541 581565 585690 589679 591958 592612 593498 595900 599045 601596 603661 606299 609649
60526 609649 612688 614715 616078 617404 618961 621097 624547 629772 636197 642493 647655 651831 656182 662024
60512 662024 670085 680482 693140 707861 724043 740739 757096 772428 785976 797171 806184 813545
60500 813545 818953 821198 819716 815586 810575 805747 801539 798432 796643 795534 794184 792458 791069 791032 793653
60485 793653 800484 812241 827850 845335 863510 882207 901359 920927 941616 964379 988894 1013336
60473 1013336 1035838 1055380 1071127 1081918 1087135 1087549 1084797 1080287 1074775 1068483 1061228 1052778 1043444
60460 1043444 1034097 1025450 1017682 1010991 1006124 1003887 1004154 1005722 1007338 1008992 1012194 1018846 1029776 1044458
60446 1044458 1062121 1082760 1106972 1135367 1168443 1206538 1249335 1295756 1344827 1396273 1449782
60435 1449782 1504215 1558244 1611296 1662903 1711370 1754124 1789350 1816368 1834415 1842182 1838895 1825011
60423 1825011 1801434 1768666 1727081 1677527 1621339 1560244 1496471 1432456 1370038 1310112 1253094
60412 1253094 1199371 1149328 1103394 1062032 1025179 991739 960271 930297 902479 877448 854980
60401 854980 834322 814765 795895 777924 761915 749090 739589 732191 725285 717898 710027 702478 696170
60388 696170 691005 685659 679108 672053 666047 661498 657515 653488 649705 646351 643032 639425 635509 631128
60374 631128 626321 622017 619211 617415 615281 612885 611831 612654 613771 613713 612934 612474 612290 612125 612740 614709
60358 614709 616798 617046 615134 612481 610404 609272 609154 610093 611701 613273 614403 615123 615785 617111 619762
60343 619762 623342 626563 629100 632370 637470 643069 646700 647841 648477 650662 654564 658967 662756 665734
60329 665734 668590 672255 676946 681996 686875 691846 697130 702110 706174 709782 713678 717516 720360 722264
60315 722264 724213 726640 729189 731907 735455 739847 744053 747264 749791 752321 754971 757415 759336 760559
60301 760559 761253 762244 764572 768544 773616 779268 785462 792222 799476 807509 816829 827163 836992 844530
60287 844530 848962 850700 850818 850361 849728 848367 845302 840267 834305 829232 826474 826050 826388 825402 822314 818406
60271 818406 815636 814636 814395 813575 811514 808028 803098 797046 790742 785407 782262 781987 784066 786970 789673
60256 789673 792915 798343 806488 816291 826647 837641 850011 863978 878853 893527 907290 920440
60244 920440 933858 947402 959073 966638 970012 970966 970344 966637 957852 944006 927291 910548 895999
60231 895999 884476 874966 865412 854854 844494 836022 829414 823307 817202 812182 809257 807972 807062 805799
60217 805799 804237 802612 801093 799870 798986 798077 796639 794649 792683 791282 790321 789043 786607 782614 777295
60202 777295 771368 765601 760343 755504 751088 747581 745496 744573 743781 742359 740634 739558 739521 739859 739665 738943
60186 738943 738784 740228 743085 746223 749028 751988 755449 758501 759981 760287 761020 762730 764141 764048 762993
60171 762993 762417 763022 764797 767828 771958 776013 778521 779280 779560 780767 783427 787265 791674 796281 801557
60156 801557 808568 817504 826858 834803 841082 846776 852660 858876 865954 874776 885324 896554 907873
60143 907873 919736 932357 944725 955530 964458 972138 979354 986661 994161 1001213 1006809 1010654 1013456
60130 1013456 1015930 1017978 1019122 1019240 1018520 1017102 1015043 1012262 1008406 1003212 997056 990493 983254 974554
60116 974554 964647 955083 946956 939806 932918 926756 922156 918772 915419 911613 907847 904626 902062 900116
60102 900116 898333 895612 891322 886503 882931 881054 879959 879310 879871 881674 883147 883100 882480 882983 884598 885863
60086 885863 886076 885896 885914 886123 886966 889472 893783 898680 903287 908157 913912 920038 926150 933334 942533 952331
60070 952331 960308 966435 973019 980989 988330 993100 996158 999616 1004062 1008773 1013438 1017908 1021197 1022675
60056 1022675 1023790 1026734 1031532 1036179 1039582 1042504 1045430 1047405 1047693 1046983 1046091 1044811 1042902 1040933 1039081
60041 1039081 1036226 1031481 1025773 1020608 1015968 1010835 1005318 1000753 997674 995071 991907 988263 984564 980597
60027 980597 975848 970138 963402 955553 947292 940547 937088 936671 937235 937051 935941 934205 931404 927133 922300
60012 922300 918250 914597 909278 901273 892086 883741 876276 868373 859697 851209 843543 836523 830317 825589
59998 825589 822173 818826 814847 810907 807707 804703 800969 796714 793254 791840 792915 795955 799601 802575
59984 802575 805031 808570 814359 821654 828709 834662 839947 845266 850823 856370 861383 865275 867846 869459
59970 869459 870474 870742 869873 867752 864546 860568 856429 852838 849780 846186 840857 833437 824187 813332
59956 813332 801220 788745 776926 766169 756354 747356 738957 730546 721648 712805 705371 700271 697203
59943 697203 694880 691810 687177 681606 676983 674877 674954 675455 675322 675345 676908 680136 683823 687043 690157 693971
59927 693971 698361 702315 705326 708033 711120 714128 716054 716905 717839 719629 721633 722547 721725 719619 717419
59912 717419 716527 717762 720540 723003 723412 721464 718282 715412 713898 713880 714692 715384 715287 714211 712527 711264
59896 711264 711527 713154 714411 714005 712995 713520 715749 717559 717489 716497 716187 716740 717484 718175 718621 718186 716958
59879 716958 716505 718003 720272 721103 720053 718528 717543 717058 717385 719499 723564 728530 733693 739489 746197
59864 746197 752918 758637 763491 768150 772403 775179 775830 774788 772998 771104 769343 767902 766998 766422 765327
59849 765327 763081 760471 759490 761521 766026 771333 776176 780060 782780 784454 785830 787786 790520 793716
59835 793716 797277 801359 805956 811047 816896 823657 830983 838603 846905 856178 865656 874206 881704 888877
59821 888877 896020 902867 909519 916376 923178 929235 934709 940554 946824 952043 954642 954327 951928 948901
59807 948901 947148 948112 951356 954790 956821 957664 958304 959185 960516 962880 966574 970884 974836 978430 982606
59792 982606 988298 995744 1004081 1011296 1015419 1016388 1016051 1015706 1014538 1011372 1007071 1003793 1002206 1000748 997563
59777 997563 991979 984080 974208 963346 952959 943791 935542 928204 922938 920869 921490 923044 924251 924944
59763 924944 925167 924492 922475 919329 915763 912327 909082 905771 902138 898140 893849 889174 883770 877440 870611
59748 870611 864121 858509 853667 849212 844895 840532 835898 830929 825817 820678 815484 810592 806918 804983
59734 804983 804024 802693 800554 798263 796340 794537 792583 790766 789407 788405 787676 787491 787954 788632 789133 789558
59718 789558 789997 790158 789973 789937 790205 789975 788683 787403 788112 791625 797012 802882 808410 813202 817173 820812
59702 820812 824819 829228 833448 837402 841979 848003 855140 862161 868035 872638 876638 880819 885341 889702
59688 889702 893629 897813 903372 910640 918906 927234 935087 942162 948292 953753 959275 965347 971560 976736
59674 976736 979741 980406 979804 979438 979956 980833 981420 981792 982226 982387 981690 980204 978559 977187 976228 975942 976537
59657 976537 977651 978539 978676 977798 975732 972815 970141 968565 967724 966715 965432 964422 963693 962678 961249
59642 961249 959850 958731 957958 957941 958890 959887 959822 959304 960310 963620 967814 971198 973477 974998 975559 974771 972854
59625 972854 970392 967865 965740 964291 962995 960966 958242 955659 953196 949661 944532 938844 933536 928180
59611 928180 922317 916835 912790 909655 905976 901155 895625 889942 884790 881169 879328 878031 876093 874172
59597 874172 873815 875170 877085 879178 882144 885844 888798 890272 891666 894833 899669 904204 906765 907335 906835
59582 906835 905709 903601 900257 896267 892520 889141 885602 881815 878381 875558 872851 870014 867502 865204
59568 865204 861733 856131 849692 844806 842272 840874 839317 837265 834532 830710 826025 821415 817251 812895
59554 812895 807975 803167 799065 795147 790771 786596 783969 783002 782170 780104 777262 775431 775758 777633 779526
59539 779526 780631 781404 782650 784670 787525 791555 796954 803020 808465 812482 814995 815895 814836 812127 809246
59524 809246 807768 807797 807825 806280 803084 799615 797218 795893 794511 792183 789087 785892 782833 779768 776934
59509 776934 775102 774806 775626 776411 776217 775099 774025 773981 775143 777026 779244 781646 783803 785069 785567 786425
59493 786425 788354 790406 790998 790099 789564 791176 795024 800126 805972 812866 821035 830092 839517 849403 860593
59478 860593 874350 891869 913480 937424 959384 974253 979441 976532 969340 960699 951687 943222 936728
59465 936728 932698 929887 926853 923651 921266 920002 919374 919177 919727 921126 923024 925025 926707 927384 926480
59450 926480 924092 920742 916683 912009 907085 902115 896431 889101 880392 871893 864912 859339 854361 849791
59436 849791 846150 843591 841178 837526 832281 826900 823521 822895 823805 824826 826014 828202 831185 833754 835556
59421 835556 837850 841881 847197 852216 856105 859594 864040 870125 877512 885431 893274 900540 906502 910453
59407 910453 912472 913633 915178 917619 920671 923621 925524 925648 924360 923339 924311 927637 932481 938076 944286
59392 944286 951147 958488 966087 973822 981687 989952 999009 1008588 1017316 1023559 1026605 1026769 1024759 1021554
59378 1021554 1018369 1015811 1013214 1009643 1005384 1001501 998141 994536 990846 988656 988983 990867 992800 994820
59364 994820 998258 1004055 1012362 1023463 1037787 1054784 1072774 1090549 1108711 1128974 1152564 1179881
59352 1179881 1211346 1247255 1285917 1322485 1350786 1366925 1371067 1366170 1355939 1343958 1333276 1325559
59340 1325559 1321197 1321065 1327345 1340868 1357574 1369214 1368757 1354955 1331706 1304065 1275585 1248483
59328 1248483 1224483 1204584 1188310 1174004 1160285 1147299 1136376 1128487 1123291 1119700 1116920 1114626
59316 1114626 1112677 1111205 1110677 1111195 1111915 1111844 1111047 1110418 1110348 1110534 1111161 1113202 1116874 1120454 1121477 1119149 1115157
59299 1115157 1112100 1111365 1112515 1114471 1116979 1120798 1126617 1134210 1142779 1151761 1161044 1170690 1180821 1191539
59285 1191539 1202744 1214368 1226904 1241064 1256459 1271409 1284882 1297933 1312057 1326550 1338931
59274 1338931 1347897 1354411 1359536 1362613 1362363 1358720 1352619 1344695 1335144 1324383 1312848 1300268 1285976
59261 1285976 1270066 1253638 1237815 1222944 1208866 1195537 1183055 1171367 1160398 1150513 1142427 1136389
59249 1136389 1131744 1127693 1124287 1122282 1122303 1124875 1130862 1140426 1151129 1158387 1158793 1152329 1140811 1125523
59235 1125523 1107490 1088697 1070937 1053972 1036663 1019715 1005381 994464 985577 977781 971946 968612
59223 968612 966266 963109 959519 957454 958052 960789 964517 968454 972549 977588 984715 994357 1005908 1018671
59209 1018671 1032484 1047121 1061758 1075611 1088710 1101639 1114847 1128339 1141470 1152929 1161642
59198 1161642 1167840 1172447 1175291 1174980 1171051 1165330 1160429 1157538 1156099 1155010 1153635 1152273 1152018 1153532
59184 1153532 1155806 1156961 1156501 1155720 1155640 1155868 1156060 1157117 1160044 1164725 1170659 1177684 1184975 1190665 1193846
59169 1193846 1195894 1198338 1200418 1200296 1197847 1194369 1190085 1183912 1175590 1166242 1156677 1146817 1137096 1128793
59155 1128793 1122328 1116384 1109358 1100806 1091034 1080261 1068936 1058251 1049623 1043773 1040535 1039172 1038715
59142 1038715 1038277 1037285 1035523 1033248 1031405 1031134 1032550 1034400 1035449 1035754 1036142 1037235 1039696 1044472 1051447
59127 1051447 1058512 1063505 1066833 1070615 1075470 1079908 1083044 1086021 1090020 1094495 1098398 1101879 1105574 1109061
59113 1109061 1111237 1111764 1111273 1110584 1110416 1111355 1113210 1114744 1114886 1113979 1113234 1113182 1113431 1113659 1113956 1114078 1113201 1110813
59095 1110813 1107366 1103571 1099267 1093491 1085791 1077124 1069013 1061815 1054331 1045464 1035814 1026994 1019533 1012275
59081 1012275 1003995 994921 986248 978749 972384 966964 962551 959126 956227 953102 949295 945148 941628 939436
59067 939436 938384 937892 937930 938877 940615 942547 944771 948404 954250 961838 970420 980198 991601 1003738 1014840
59052 1014840 1024342 1033484 1043531 1054281 1064807 1074812 1084522 1093876 1102692 1111145 1119159 1125663 1129605
59039 1129605 1131732 1134158 1137770 1141070 1142135 1140852 1138499 1136032 1133799 1132280 1131828 1131921 1131801 1131693 1132195
59024 1132195 1132486 1130520 1125409 1118409 1111045 1103466 1095429 1087740 1081368 1075648 1068665 1059452 1048908 1038522
59010 1038522 1029079 1020856 1014435 1010547 1009072 1008518 1006883 1003248 998397 993643 989348 985019 980506 976217
58996 976217 972270 968448 965261 963916 964607 965697 965294 963092 960160 957662 956429 956958 958864 960873 962148
58981 962148 963157 964626 966374 968052 970202 973389 976949 979984 983238 988437 995888 1004068 1011679 1018812
58967 1018812 1025956 1033192 1040759 1049238 1058681 1068449 1078358 1089110 1101188 1114182 1127621 1141586 1156005
58954 1156005 1170162 1183482 1195950 1207155 1215694 1220449 1221971 1221877 1221282 1220548 1220159 1220845 1222846 1225895
58940 1225895 1230118 1236255 1244618 1254234 1263469 1271446 1278528 1285491 1292656 1300022 1307809 1316094 1323994 1330127
58926 1330127 1334410 1338710 1344862 1352435 1359434 1365012 1370419 1377168 1385391 1394487 1404412 1415522 1427729
58913 1427729 1440665 1454478 1469762 1486759 1505117 1524388 1544259 1564297 1583935 1602847 1621065
58902 1621065 1638620 1655335 1671084 1686016 1700332 1713957 1726496 1737319 1745630 1750772 1752885 1753111
58890 1753111 1752607 1751329 1748272 1743050 1736652 1730412 1724909 1720316 1716918 1714390 1711198 1705980 1699181 1692119
58876 1692119 1684739 1675854 1665513 1655200 1645211 1633774 1619796 1604803 1590869 1578130 1565905 1554894
58864 1554894 1546216 1539230 1532457 1526167 1521764 1518681 1514168 1506720 1497915 1490199 1484405 1480192 1477447 1476237
58850 1476237 1476361 1477872 1481315 1486724 1493102 1499644 1506896 1516137 1528158 1543126 1560936 1580944 1601764
58837 1601764 1621905 1640426 1656720 1670340 1681640 1692132 1703406 1715653 1727602 1737748 1745410
58826 1745410 1750893 1755203 1759605 1764873 1770503 1774677 1775541 1773051 1769421 1766943 1765171 1761060 1752460 1740681
58812 1740681 1728697 1717467 1705191 1689927 1671606 1651511 1631149 1612047 1595465 1581462 1568818
58801 1568818 1556342 1543717 1530736 1516539 1500474 1483362 1467096 1452771 1439521 1425336 1408901
58790 1408901 1390646 1372169 1355031 1340172 1327868 1317343 1306614 1293987 1280132 1267564 1257457
58779 1257457 1248109 1237417 1225652 1214526 1204600 1195289 1186612 1179051 1172114 1164966 1158339 1153849 1151290
58766 1151290 1148508 1144337 1139940 1136722 1134566 1132753 1131123 1129603 1127918 1126438 1126082 1126747 1127156 1126914 1127314
58751 1127314 1129280 1131910 1134014 1135793 1137792 1139238 1138834 1136519 1133274 1129603 1125163 1119623 1113121 1106133
58737 1106133 1099268 1092771 1085983 1077973 1068889 1059801 1051008 1041749 1032063 1023598 1017726 1013993 1011352 1009771
58723 1009771 1009497 1009808 1009878 1010260 1012158 1015611 1019543 1023261 1026909 1030589 1033923 1036416 1037639 1037259 1035279
58708 1035279 1031930 1027109 1020556 1012937 1005840 1000157 995463 991656 989937 990842 992169 990613 985361 978867
58694 978867 974012 971613 970827 970912 971910 974005 976813 979543 981803 983895 986048 987802 988835 990013 992593
58679 992593 996579 1001114 1006480 1014029 1023670 1033048 1040226 1045904 1051960 1059002 1066639 1075083 1084927 1095655
58665 1095655 1105627 1113552 1119364 1123989 1128693 1134230 1140168 1145622 1150727 1156501 1163186 1170069 1177201 1185546
58651 1185546 1194711 1202415 1207450 1211502 1216434 1221278 1223635 1222845 1219830 1214866 1207522 1198207 1187807 1176147
58637 1176147 1162378 1146444 1128743 1109155 1088114 1067913 1050884 1036721 1023510 1010935 1000301
58626 1000301 991551 982693 972530 961976 952122 942859 933996 926049 919155 912649 906505 901930 899713
58613 899713 898961 898183 896810 895143 893751 893574 895889 901379 909415 918400 926565 932780 937442 942468 949412
58598 949412 957445 964016 967535 968424 967572 965067 960971 956230 951946 948264 944542 940245 935286 929935 924835
58583 924835 920783 917938 915349 911693 906755 901995 899258 898759 898775 897735 896102 895319 895395 894876 893256 891752
58567 891752 891132 890236 887611 883500 879259 875752 873133 871269 869655 867909 866952 868335 871830 875396 878467
58552 878467 883159 890672 898639 904154 907673 911504 916017 920111 924139 929297 934823 938885 941863 945779
58538 945779 950602 954141 955776 957369 959993 962446 963703 964357 964914 965072 965516 968194 973892 981403 989743
58523 989743 999112 1009126 1018501 1027494 1038297 1051704 1065386 1076841 1086286 1095319 1104540 1113949 1124163
58510 1124163 1135668 1148027 1161050 1175497 1191566 1208154 1224911 1243592 1265881 1291135 1317821
58499 1317821 1345985 1376504 1408671 1440239 1469442 1495600 1518217 1537045 1552869 1566803 1578534
58488 1578534 1586245 1588616 1586356 1581518 1575632 1568746 1560235 1550224 1539525 1528037 1514248 1497266 1478410
58475 1478410 1459443 1439915 1418092 1394126 1370142 1347138 1324074 1300624 1278635 1259804 1243710
58464 1243710 1229320 1216759 1206246 1196690 1186823 1176834 1167746 1160083 1154071 1150114 1147902 1145888 1142766
58451 1142766 1138734 1134489 1129845 1124384 1118682 1113842 1110359 1108159 1107071 1106492 1105406 1103650 1102578 1103596
58437 1103596 1106435 1109471 1111373 1112088 1112738 1114816 1118858 1123805 1128470 1133454 1140343 1149031 1157550 1165011
58423 1165011 1172969 1182997 1194590 1206577 1219142 1232955 1247410 1261266 1274534 1288548 1304420
58412 1304420 1322022 1339865 1355458 1366587 1372889 1375580 1375519 1372756 1368149 1363651 1360141 1356620 1352720
58399 1352720 1350361 1351325 1354496 1357448 1360037 1364620 1372958 1384454 1397315 1410065 1421777 1431820 1439795
58386 1439795 1445281 1447703 1446786 1442947 1436971 1429540 1421183 1412242 1402796 1393192 1384591 1378137 1373530 1369372
58372 1369372 1365066 1361348 1358723 1356600 1354507 1353243 1354301 1358805 1367106 1378448 1390924 1402688 1413271
58359 1413271 1422777 1430164 1433994 1434849 1435242 1436706 1438538 1439604 1439574 1437928 1433742 1427360 1420688 1414961 1409556
58344 1409556 1403653 1397657 1392310 1387757 1384085 1381552 1379897 1378784 1379021 1381742 1386331 1391020 1395611 1401359
58330 1401359 1408021 1413504 1417031 1420184 1424198 1428744 1434037 1441315 1450199 1458345 1464958 1472030 1480890 1490395
58316 1490395 1499900 1511022 1524576 1538569 1551215 1563288 1575501 1586401 1595405 1605392 1619482 1637042
58304 1637042 1655350 1673322 1691333 1709282 1727239 1746335 1766844 1787137 1806484 1826681 1848631
58293 1848631 1869581 1886506 1900305 1913947 1928236 1942171 1955840 1970090 1984547 1998514 2012689
58282 2012689 2027910 2043575 2059216 2075851 2093785 2111121 2126789 2142987 2162187 2183633 2205292
58271 2205292 2227141 2250021 2273444 2297294 2323490 2352974 2383139 2411133 2437555 2463931 2489021
58260 2489021 2511074 2531458 2552420 2573382 2593176 2613710 2637334 2662478 2686249 2709701 2736104
58249 2736104 2765384 2794846 2824475 2856978 2892986 2930320 2967776 3006021 3045144 3084785 3126208
58238 3126208 3171002 3218312 3266331 3315479 3367057 3420066 3472776 3526163 3582382 3641152 3701015
58227 3701015 3762607 3826997 3892491 3957119 4022887 4093591 4169541 4248061 4327700 4408383 4489334
58216 4489334 4570882 4656365 4748206 4844131 4941308 5041574 5147936 5258813 5371166 5486703
58206 5486703 5609111 5737578 5869389 6006855 6154962 6313678 6479275 6651924 6835216
58197 6835216 7029196 7230710 7439936 7660046 7891322 8132207 8385107 8654122 8937817
58188 8937817 9231324 9534891 9853395 10188549 10539326 10909413 11306158 11731999 12184208
58179 12184208 12662651 13170217 13706387 14268721 14860396 15488064 16152647 16850670 17584282
58170 17584282 18361242 19185464 20056445 20977257 21953469 22984698 24067319 25205511 26409870
58161 26409870 27685975 29035055 30465247 31990955 33621698 35363159 37228184 39234384
58153 39234384 41392276 43709399 46204736 48904731 51827056 54984694 58404582 62124932
58145 62124932 66176466 70587038 75405553 80703255 86556400 93054653 100329238 108552405
58137 108552405 117916664 128646169 141022965 155361943 171954935 191061669 212919926
58130 212919926 237691442 265411317 296045158 329428446 364684803 399318602 429009242
58123 429009242 448896326 455723426 449206946 431686511 406669975 377530249 346937079
58116 346937079 316774770 288194318 261739358 237555515 215584217 195669810 177623783
58109 177623783 161282489 146524150 133238216 121303809 110602321 101025495 92461804
58102 92461804 84794326 77920111 71756724 66226366 61250094 56761653 52711118 49049860
58094 49049860 45724957 42691377 39916270 37368211 35015237 32836848 30825662 28973240
58086 28973240 27264209 25685753 24230670 22887404 21637526 20466746 19369512 18340483
58078 18340483 17371046 16456954 15600048 14799194 14047516 13340792 12680011 12062977 11481697
58069 11481697 10931188 10413354 9929280 9474805 9046315 8643876 8265762 7906427 7562618
58060 7562618 7235581 6925234 6628382 6344633 6077457 5826949 5587766 5356695 5136221
58051 5136221 4928063 4729190 4537236 4354486 4183510 4023525 3873331 3732977 3600360
58042 3600360 3471254 3345041 3225485 3113684 3005451 2898245 2795538 2701075 2613383 2529215
58032 2529215 2448386 2371929 2299049 2229032 2163196 2102255 2044520 1988837 1936513 1888417 1843134
58021 1843134 1799648 1758897 1721094 1684713 1649540 1617336 1587968 1558434 1527502 1497817 1471503
58010 1471503 1447061 1422533 1398454 1375596 1352970 1330127 1308557 1288872 1269502 1249830 1231583
57999 1231583 1215438 1199450 1182585 1166381 1151099 1133824 1113089 1092262 1075384 1062101 1049331
57988 1049331 1035558 1020952 1005523 989824 975650 963745 952543 941028 930639 922250 913530 901812
57976 901812 887887 874597 863123 852727 842645 832251 820582 807453 794018 781069 768234
57965 768234 755706 744774 735554 726475 717230 709778 704817 699843 692682 684644 678141 673367 669433 666560
57951 666560 664693 661920 656849 651056 646756 643573 639932 636280 634397 634535 635395 636078 636189 635178 633499
57936 633499 633300 635998 640155 643440 645475 646971 647445 645908 642797 639184 634977 629677 623867 618221 612335
57921 612335 606464 602941 603401 605605 605548 602046 596906 591294 584729 577515 571513 567879 565827 563982 561548
57906 561548 558026 553297 548266 544323 542052 541177 541323 541750 540941 537939 533920 531259 531116 532791 534929
57891 534929 536369 536349 535116 533949 533528 532768 530353 526823 523949 522570 522295 522843 524374 526825 530107 534692
57875 534692 540962 548259 555594 562819 570079 576670 581632 585045 587582 589184 589276 587854 585226 581150 575450
57860 575450 569085 563323 558176 552831 547276 542177 537436 532227 526447 520876 515909 511244 506793 502853
57846 502853 499348 495950 492994 491268 490769 490532 489778 488545 487256 486480 487051 489496 493150 496529 498729
57831 498729 499991 500986 502222 504083 506766 509959 513025 515676 518250 521400 525611 530796 536109 540446
57817 540446 543282 544730 544760 543009 539623 535649 532244 529935 528761 528359 527750 525985 523385 521225 519861
57802 519861 518277 515908 513684 512530 512070 511773 512221 514070 516677 519058 521466 524802 529014 533181 536652
57787 536652 539201 540684 541548 542998 545506 547761 548177 546927 545462 544529 543821 543087 542475 542014 541629 541335
57771 541335 540740 539085 536618 535060 535598 537192 538126 538478 539659 542041 544502 545987 546185 545038 542905
57756 542905 540928 539846 538595 535302 529516 522351 514721 506732 498568 490633 482879 475087 467698 461228
57742 461228 455110 448458 441852 437018 434603 433454 432277 430957 430106 430257 431598 433660 435169 435035 433537
57727 433537 431947 431272 432008 434543 438718 443322 447107 450137 453336 457257 462219 468816 476835 484321 489408
57712 489408 492782 496670 501592 505882 508394 509787 510926 511754 512259 512989 514058 514903 515437 516149 516741 516131
57696 516131 514339 513029 513602 515961 519581 524393 529836 534381 537064 538694 540703 543450 546186 547930
57682 547930 547866 545699 542208 538782 535974 533222 530197 527433 525153 522565 519085 515538 513415 513501 515671
57667 515671 519301 523327 526543 528502 529799 531107 532469 533786 535345 537468 540139 543273 546839 550431
57653 550431 553258 554740 554736 553331 551149 549698 550306 552537 554635 555698 556384 557376 558404 559186 559959 560494
57637 560494 559865 558081 556845 557623 559755 561492 562212 562585 563059 563320 563071 562486 561843 561271 560840 560670 561088
57620 561088 562765 566201 570918 575782 580455 586025 593955 604959 619227 637134 659279 686185 718156
57607 718156 754876 794789 834994 871610 899949 915338 915561 902812 882065 857235 829939 801608
57595 801608 774526 749891 726815 704552 684242 667062 652102 637842 624643 613924 605626 598457
57583 598457 592200 587777 585163 583181 581652 581951 584680 588140 589994 589618 588131 586772 585952 585486 585132
57568 585132 584928 585216 586274 587894 589375 589787 588262 584631 580206 577339 577341 579100 580439 580591 580493 580881 581283
57551 581283 581135 580941 581739 583852 586638 589195 591064 592447 593947 596098 599130 603179 608282 613888 618793
57536 618793 622178 624466 626594 628681 630086 630567 630522 630147 629294 628323 628169 629109 630304 631099 632122 634338
57520 634338 637520 640498 642747 644851 647331 649792 651656 653167 655132 657803 660543 662675 664387 666650
57506 666650 670394 675722 681694 686825 690167 692191 694435 698005 702530 706800 710249 713492 717600 723268
57492 723268 730601 739089 747680 755343 761864 767791 773463 778457 782249 785168 788480 793629 801336 811083
57478 811083 821316 830510 838179 844625 849848 853372 855394 857428 861146 866818 873289 879352 884792 890291
57464 890291 896659 903958 911111 916624 920137 923079 927331 933244 939356 944061 947216 950125 954379 960936
57450 960936 969885 980481 991288 1000760 1008256 1014548 1020988 1028204 1035886 1043785 1052200 1061102 1069476 1076179
57436 1076179 1081074 1084723 1087547 1090212 1094382 1101689 1111750 1122257 1131402 1139382 1147383 1156082 1165559
57423 1165559 1175658 1185719 1194716 1202312 1209285 1216462 1223917 1231599 1239892 1248817 1257458 1264968 1271611
57410 1271611 1278101 1284612 1291289 1299016 1308459 1318736 1328205 1336483 1344639 1353486 1362771 1372202 1382155 1392873
57396 1392873 1403767 1414137 1424167 1434642 1445842 1457218 1468205 1479072 1490653 1503184 1515788
57385 1515788 1527549 1538916 1551314 1565192 1579199 1591767 1602928 1613997 1625942 1638661 1651543
57374 1651543 1664163 1676645 1689716 1704039 1719179 1733867 1747838 1762666 1779860 1798689 1816971
57363 1816971 1833690 1849650 1865654 1881267 1895588 1908326 1919843 1931031 1943419 1958530 1976585
57352 1976585 1996328 2016489 2036869 2057761 2078939 2099848 2120373 2140841 2161407 2181904 2202351
57341 2202351 2223219 2244958 2267331 2289490 2310942 2332314 2354806 2378887 2403984 2429530 2455680
57330 2455680 2482695 2510160 2537295 2563495 2588235 2611170 2633071 2655941 2681258 2708465 2736074
57319 2736074 2763714 2792054 2821208 2850611 2880237 2910475 2940682 2969348 2996092 3022248 3049020
57308 3049020 3076219 3103283 3130300 3157331 3183891 3210044 3237039 3265863 3295834 3325495 3354196
57297 3354196 3381922 3408414 3433808 3459798 3488755 3521473 3556523 3591814 3626059 3658919 3690684
57286 3690684 3722018 3753371 3784464 3814905 3845238 3876653 3909507 3942776 3975251 4006680 4037448
57275 4037448 4067714 4097330 4126255 4154547 4182043 4208491 4234075 4259758 4287073 4317448 4351354
57264 4351354 4387847 4425016 4461215 4496053 4530383 4565429 4601744 4638696 4674823 4708960 4741219
57253 4741219 4772869 4805194 4838557 4872486 4906243 4938987 4969712 4997765 5023747 5049546 5077044
57242 5077044 5106818 5138238 5170503 5203155 5235746 5267838 5299594 5331796 5364822 5398101 5431143
57231 5431143 5464695 5500033 5537162 5574493 5610468 5644809 5678001 5710310 5741908 5773508 5806191
57220 5806191 5840628 5876809 5914415 5953174 5993027 6034201 6077016 6121431 6166956 6213106 6259628
57209 6259628 6305975 6351042 6393986 6435128 6475407 6514959 6552851 6588377 6622067 6654957 6687095
57198 6687095 6717238 6744186 6768327 6791732 6816623 6843805 6872771 6903271 6936233 6972841 7013174
57187 7013174 7056299 7101369 7147991 7195715 7244085 7293282 7343836 7395349 7446176 7494818 7540971
57176 7540971 7584710 7625327 7661748 7693679 7721494 7745209 7764360 7778908 7789594 7797444 7803506 7809067
57164 7809067 7815418 7823287 7832948 7844805 7859238 7875947 7894316 7914529 7937423 7962998 7990016 8017630
57152 8017630 8046470 8077320 8109418 8141227 8172679 8205597 8241698 8280857 8321629 8362937 8404792
57141 8404792 8447442 8490164 8531176 8568765 8602241 8631463 8655879 8674805 8688596 8698527 8705008 8706666
57129 8706666 8701825 8690424 8673996 8654126 8631404 8605431 8575551 8542180 8507737 8475385 8446288
57118 8446288 8419019 8392522 8368672 8350746 8340214 8336387 8338473 8346152 8358257 8372526 8386715 8398465
57106 8398465 8404024 8398890 8380463 8348943 8305194 8249174 8181289 8104170 8022039 7938805 7857330 7779692
57094 7779692 7707181 7640309 7579382 7524828 7476702 7434386 7397122 7364282 7334668 7306061 7276137
57083 7276137 7243762 7209066 7172274 7132542 7087956 7036811 6978992 6915666 6847349 6772775 6690107
57072 6690107 6598608 6498446 6389571 6271689 6144685 6007957 5859952 5699578 5527652 5345568
57062 5345568 5152925 4947532 4726963 4488544 4228670 3944464 3636080 3305321 2951779
57053 2951779 2571911 2161725 1718456 1239663 722692 165256 -435110 -1082108 -1779458
57044 -1779458 -2529132 -3332560 -4192880 -5113653 -6095670 -7136528 -8231193 -9369875 -10537274
57035 -10537274 -11717723 -12898623 -14063603 -15184185 -16224247 -17152194 -17947066 -18604698
57027 -18604698 -19154381 -19663120 -20198090 -20782774 -21428264 -22240869 -23477722 -25435481 -28231890
57018 -28231890 -31664069 -35249888 -38393730 -40559680 -41393690 -40785822 -38862853 -35914706
57010 -35914706 -32298443 -28368002 -24434075 -20733677 -17410508 -14522101 -12066879 -10005776
57002 -10005776 -8271450 -6779836 -5449460 -4216583 -3039240 -1896631 -788032 272662
56993 1266747 2178038 2995602 3715364 4340707 4879058 5337249 5721261 6038664 6297994
56984 6297994 6506381 6670660 6800038 6904363 6989915 7059678 7117266 7167505 7213277 7254708
56974 7254708 7291402 7323105 7349144 7370739 7393034 7419554 7442414 7441316 7395409 7296418 7151291
56963 7151291 6975592 6785618 6593526 6405706 6224017 6048171 5876793 5707558 5538504
56954 5538504 5369510 5201421 5034362 4868677 4706888 4552084 4404086 4259362 4115175
56945 4115175 3971830 3830525 3691212 3553266 3416230 3278995 3140035 2999489 2859584
56936 2859584 2722189 2587384 2455108 2326558 2202848 2083562 1967746 1855480 1747626
56927 1747626 1644930 1548133 1458211 1375711 1300255 1230940 1166688 1106256 1048917 995260 946319
56916 946319 901757 859902 819682 781468 745937 713341 684137 659127 638526 621723 608121
56905 608121 597331 588776 582336 579390 581763 589494 600887 614704 630639 647408 662137 672301
56893 672301 677009 676071 669429 658093 644159 629160 613606 598465 585346 574516 564434 554288
56881 554288 545460 539367 535369 532189 530215 530876 534606 540846 549393 560454 573774 588644 604125
56868 604125 618211 627482 628974 622392 609613 592390 571437 547468 522008 496934 473712 453149
56856 453149 435456 420472 407974 397688 389041 381306 374130 367672 362297 358478 356716 356886 357897
56843 357897 358876 360549 364480 371012 378934 386988 394452 400391 404189 407357 413164 423450 436896 451188
56829 451188 465702 481099 497495 514245 530760 546318 559503 568863 574019 575641 574622 571609
56817 571609 566839 560190 552000 543925 538091 535203 534435 535278 538264 543645 550979 560642 574177 592179
56803 592179 613349 636731 663440 694687 729118 763358 794112 818445 833400 837504 832320 820943
56791 820943 805294 786265 765813 746955 731617 719992 712128 708784 710463 716777 727238 742047
56779 742047 762038 788462 822602 864705 913290 966113 1021387 1077025 1128782 1170348 1195883
56768 1195883 1202484 1190831 1164430 1128133 1086348 1042110 997739 955652 917782 884631 855801
56757 855801 831272 811438 796309 785796 780769 782791 792566 809281 831610 858571 888981 920429
56745 920429 949078 970569 981410 979990 966535 942417 910027 873016 835406 799652 766159 735098
56733 735098 707694 684958 666144 649713 635313 623701 615175 609382 606411 606857 610791 617719 627482
56720 627482 639993 653749 665556 672157 671749 664052 649876 630950 609502 587356 565383 543765
56708 543765 522552 502091 483148 466356 451379 437098 422985 409794 398335 388155 378185 368310
56696 368310 359542 352802 348079 344457 340474 335034 328642 323290 320312 318826 317051 314581 312270 310351
56682 310351 307981 304616 300704 296918 293593 291067 289723 289356 288995 287495 284187 279298 274126 270304 268298
56667 268298 267038 265538 264121 263264 262156 259733 256658 254901 255438 257505 259877 261704 262259 261248 259599
56652 259599 258884 259664 261075 261988 261844 260630 258973 258064 258578 259886 261179 262737 264842 266133 264794 261190
56636 261190 257635 255543 254534 254346 255573 257954 259820 260193 260056 260741 262410 264882 268494 272942 276445
56621 276445 277349 275932 273728 271701 269890 268185 266637 265524 265608 267636 271064 274073 275502 276027 276831
56606 276831 277996 279007 279954 281276 282881 284412 285875 287140 287446 286394 285072 285142 286841 288678 289139
56591 289139 288085 286467 285096 283812 281759 278646 275655 274487 275312 276358 275987 274512 273447 273615 274744
56576 274744 276360 278155 279766 281037 282476 284660 287142 288593 288257 286873 285970 286510 288321 290552 292480
56561 292480 293934 295156 296411 297774 299052 299726 299112 296915 293637 290241 287472 285605 284531 283822 283013
56546 283013 282206 282087 282904 283844 283928 283130 281980 280593 278990 277870 277919 278567 278625 277964 277375 276878 275700 274024
56528 274024 273274 274184 275950 277752 279680 281520 282175 281377 280805 282291 285668 289330 292115 293716 294090 293607
56512 293607 293200 293414 293840 294241 295474 298272 301952 305494 309232 314064 319598 324746 329943 336898 345767
56497 345767 354139 359682 362563 364330 365390 364926 362956 361022 360464 360962 361435 361680 362129 362289 360724 357023
56481 357023 352755 349681 347741 345709 343161 340641 338391 336338 335070 335253 335885 334734 331075 326703 323588
56466 323588 321767 320325 319331 319807 322415 326868 331988 335935 337369 337044 337268 339159 341415 342461 342500 342453
56450 342453 342194 341257 340253 339905 339350 337084 333323 329886 327858 326806 326245 326433 327392 328348 328663 328630 329034
56433 329034 330384 332467 334117 333682 330556 326148 322526 320231 318310 316363 315416 316396 318641 320502 320965
56418 320965 320397 320047 321023 323411 326132 327882 328281 327996 327846 328094 328565 329113 329804 330674 331405 331563 331371 331933
56400 331933 334006 336710 338256 338027 337051 336305 335673 334982 334892 335912 337494 338907 340208 341530 342260 341974
56384 341974 341412 341426 341618 341170 340430 340263 340229 338875 335943 333128 332438 334556 338720 343370 346904 348685 349406
56367 349406 350033 350657 350932 351108 351696 352492 352973 353446 354664 356404 357424 356923 355104 352325 348742 345018
56351 345018 342483 342110 343643 345867 347423 347606 346818 346053 345571 344637 343139 342692 345012 349652 354627 359019
56335 359019 363539 368412 372124 372928 370846 367725 365859 366644 369828 373637 376095 376528 375742 374915 374782 375598
56319 375598 377232 379321 381730 384716 388309 391882 394787 397037 398827 399968 400453 400962 401960 402838 402909 402718
56303 402718 403337 404729 405974 406789 407700 408907 410110 411356 413086 415386 418048 421112 424501 427574 430020
56288 430020 432656 436136 439415 440924 440841 440677 440984 441250 441932 444641 449921 456405 462520 467681 471645 474393
56272 474393 477075 481400 487427 493323 497883 501879 506285 510683 514372 517674 521051 523966 525821 527214
56258 527214 529171 531678 533953 535731 537407 539135 540564 541452 542137 543363 545706 549106 553088 557581 562997
56243 562997 569083 574539 578784 583413 590398 599064 606492 611069 614175 618105 623803 631140 639856 649292
56229 649292 658251 666087 673405 681245 690251 700891 713546 727903 743022 758385 774248 790762
56217 790762 807640 824861 842787 861336 879968 898766 918598 939831 961717 983482 1005455
56206 1005455 1028925 1055412 1085851 1119808 1155758 1192971 1232683 1276450 1324017 1374264 1427645
56195 1427645 1485963 1550165 1620292 1697239 1782241 1874631 1972542 2076175 2187954 2308770 2436362
56184 2436362 2568240 2703865 2842781 2982636 3120349 3253466 3379178 3493727 3594064
56175 3594064 3678691 3746069 3794002 3821551 3829612 3818552 3787505 3737383 3672295 3596014 3508965
56164 3508965 3410704 3303581 3191609 3077060 2960506 2843228 2727274 2613741 2502968 2395938
56154 2395938 2293863 2196892 2104703 2017616 1935787 1858131 1783627 1712977 1647550 1587487 1532229
56143 1532229 1481958 1436941 1396253 1358729 1324466 1293968 1266556 1241053 1217146 1194642 1172515
56132 1172515 1150486 1130580 1114999 1103028 1091984 1080842 1071036 1063947 1059408 1056597 1054700 1052623
56120 1052623 1049447 1045435 1041751 1039290 1038394 1039141 1041119 1043573 1046512 1050794 1056518 1062651 1069057 1077163
56106 1077163 1087328 1097474 1106128 1115047 1126587 1140134 1153773 1168004 1184631 1202871 1219987 1235747
56094 1235747 1253186 1274552 1299183 1325898 1354950 1386868 1421630 1459970 1503755 1554119 1610589
56083 1610589 1672815 1741927 1819536 1906232 2001233 2102426 2206441 2309511 2408506 2500804 2583946
56072 2583946 2656682 2719938 2775693 2825328 2869953 2911101 2949223 2982094 3006654 3022240 3030636
56061 3030636 3033547 3031788 3026187 3016839 3001207 2974794 2934163 2878490 2808998 2728818 2643074 2557045
56049 2557045 2473844 2394992 2322482 2258213 2201686 2150483 2103413 2061579 2026248 1997191 1973314
56038 1973314 1953562 1937092 1923611 1913335 1905816 1899680 1894615 1892377 1894157 1898271 1902498 1907466 1915308
56025 1915308 1926061 1938194 1951799 1968230 1986997 2006029 2024879 2044742 2065491 2085860 2106697
56014 2106697 2130720 2158287 2186384 2212804 2238774 2266467 2296312 2327866 2361160 2395982 2431419
56003 2431419 2467089 2503605 2541462 2580762 2622035 2665755 2711235 2757684 2806030 2857698 2911972
55992 2911972 2966669 3021025 3075606 3129960 3183157 3236419 3292312 3351239 3411446 3472516 3535983
55981 3535983 3602373 3670546 3740188 3812073 3885569 3958871 4032154 4107801 4187114 4269636 4356002
55970 4356002 4448471 4547973 4653234 4763190 4877662 4995561 5115426 5238184 5366795 5503023
55960 5503023 5647053 5799689 5961662 6131193 6305900 6487145 6679036 6883361 7099188
55951 7099188 7327122 7569689 7827416 8098578 8383002 8682289 8996760 9326583 9675387
55942 9675387 10047746 10443378 10859120 11296311 11760263 12252450 12769731 13311942 13883566
55933 13883566 14486785 15119691 15783113 16482700 17222492 18002990 18827272 19702029 20630385
55924 20630385 21610664 22644567 23739568 24901036 26129780 27430523 28815488 30296468
55916 30296468 31880596 33576696 35397893 37354871 39454829 41710755 44144109 46776139
55908 46776139 49625784 52718954 56089963 59771296 63793806 68201635 73057348 78432378
55900 78432378 84409184 91099065 98645830 107212839 116988521 128209693 141156054 156114194
55892 156114194 173369291 193229252 216006382 241932696 271055706 303052302 336800414
55885 336800414 369841452 398347099 418105668 426159468 421972890 407336346 385283170
55878 385283170 358928061 330819998 302773652 275918244 250835814 227748697 206684363
55871 206684363 187568233 170273908 154666211 140622126 128019435 116725368 106606894
55864 106606894 97541520 89413267 82111942 75544480 69637435 64323217 59533290 55207969
55856 55207969 51300577 47765573 44552135 41615056 38923168 36451609 34174116 32068583
55848 32068583 30122450 28326203 26666755 25131291 23711291 22397983 21179086 20044098
55840 20044098 18987720 18004349 17084328 16219381 15407052 14646199 13932555 13261884 12633037
55831 12633037 12044523 11492131 10972899 10487372 10034899 9610437 9208599 8827062 8463657
55822 8463657 8114377 7777275 7454595 7148219 6856359 6576985 6310552 6056639 5811860
55813 5811860 5574239 5346149 5129739 4922683 4721747 4527631 4342925 4167757 4000618
55804 4000618 3841409 3690661 3547524 3411037 3281736 3159894 3043935 2932538 2826455
55795 2826455 2726522 2631893 2541906 2457543 2379246 2305430 2234765 2167701 2104151 2042252 1981321
55784 1981321 1923532 1870541 1820777 1772238 1725646 1682512 1642251 1603723 1567751 1535573 1506348
55773 1506348 1478427 1451707 1426653 1402497 1378428 1355161 1333448 1312479 1291548 1271719 1253902
55762 1253902 1236821 1218800 1200036 1181244 1161750 1141028 1120586 1102000 1084375 1065992 1047244
55751 1047244 1029770 1013842 998898 985597 974902 965821 956444 946762 938365 931700 925784 920470 916983
55738 916983 915853 915734 914636 911580 907099 902766 899863 898117 896368 894702 894625 896526 898506 898774 897708
55723 897708 896305 893947 889112 881061 869598 854539 836946 819552 804315 790667 777670 766488
55711 766488 758815 754125 750605 747804 746051 743950 738861 729876 718474 706380 694432 683353 673922
55698 673922 666235 659999 655289 651922 648678 644515 639968 635852 631239 624450 615647 606647 598456 590751
55684 590751 583570 577484 571899 565107 556585 547770 540110 533654 527948 522923 518253 513004 506738 500254
55670 500254 494608 489948 485673 481120 475708 468923 460649 451334 441709 432545 424626 418677 415208 414405
55656 414405 415810 418061 419597 419996 420112 420677 421539 422650 424726 427908 430584 430749 428211 424559 421286
55641 421286 418795 416875 415041 412523 408725 403782 398167 392070 385726 379967 375695 373047 371611 371057
55627 371057 370921 370260 368392 365778 363560 362425 362411 363412 365270 367620 370111 372519 374508 375904 377269
55612 377269 379175 380510 378879 373599 367156 362593 360430 359334 358725 359063 360110 360613 359814 358200 356824
55597 356824 356513 357300 357998 357069 354765 353319 353993 355164 354922 354324 355858 359387 362116 362515 361857 361485 360914
55580 360914 359529 358146 357486 356516 353774 349502 345143 341192 336719 330927 324216 317543 311293 305190 299149
55565 299149 293777 289771 286996 284566 281768 278396 274358 269897 266300 265127 266183 267320 266917 265331
55551 265331 263232 260110 255863 252376 251475 252116 251702 249701 247906 247419 247524 247480 247271 246314 243645 240037
55535 240037 237880 237940 237953 235627 231603 228094 225711 223244 220044 217238 216444 218050 220851 223125 224160
55520 224160 224853 226515 229188 231726 233541 235468 238490 242260 245381 246947 247528 248794 252163 257519 263320
55505 263320 268166 271905 274828 276381 275636 272724 268796 264519 259485 253243 246185 239339 233830 230401
55491 230401 228831 227976 227013 226253 226084 225745 224430 223130 223807 226663 229597 230558 229213 226187 222154 218191
55475 218191 215658 214913 214957 214911 215074 216105 218036 220628 223955 228078 232579 236668 239332 239551 237318 234407
55459 234407 232997 233241 233217 231534 228838 226340 224146 221800 219457 217509 215678 213371 210629 208106 206337
55444 206337 205364 204802 203976 202268 199492 195758 191189 186259 182045 179296 177389 175051 172004 169056 166747
55429 166747 164991 163916 163867 164563 165428 166720 169021 171624 172951 172829 172771 173618 174529 174815 175084 175677 175534
55412 175534 173755 171122 169054 168152 168515 170179 172135 172256 169593 165889 163597 163201 163611 164280 165505 167254
55396 167254 169015 170484 171438 171369 170234 169061 168960 169961 171531 173504 175624 176979 177032 176629 176912 177677
55380 177677 177828 176924 175275 173004 170081 166914 163987 161324 159098 158136 158890 160556 162172 163819 165671
55365 165671 166791 166348 165210 164584 163675 160738 156239 152886 152182 152881 153373 153843 155147 157075 158924 160731
55349 160731 162741 164268 164216 162454 159913 157614 156206 156123 157393 159191 160265 160186 159958 161083 163853 166692
55333 166692 167494 165810 163483 162847 164409 166540 167316 166345 164776 163824 163537 163097 162102 161060 160367 159452 157731
55316 157731 156016 155846 157376 159138 160143 160895 161779 161852 160410 158692 158575 160067 161345 161039 159427 157622
55300 157622 156646 157189 159203 161536 162644 161887 159850 157643 156211 155943 156454 157095 157967 159762 162197 163655
55284 163655 163314 162722 163979 166905 169269 169478 167823 165409 163125 161625 161210 161606 162528 164095 165931 166504
55268 166504 164686 161541 159219 158345 157883 157220 156710 156193 154843 152962 152313 153958 156940 159664 161444 162138
55252 162138 161465 159508 157052 154753 152630 150831 150064 150709 152038 152759 151870 149067 145194 142380 142606 145711
55236 145711 149652 152929 155739 158549 160936 162511 163805 165294 166478 166827 166840 167285 168025 168359 167972 166860
55220 166860 164994 162838 161633 162299 164348 166436 167530 167065 164758 161162 157893 156383 156559 157359 158102
55205 158102 158774 159446 160222 161401 162918 163912 163661 162639 161893 161682 161633 162048 163977 167755 172228 175715 177184
55188 177184 176444 173926 170624 167697 165699 164377 163425 163008 163244 163591 163344 162567 161977 161766 161086 159101 156173
55171 156173 153479 151657 150626 150744 153084 157883 163389 167236 168721 168911 168761 168156 166853 165320 164145
55156 164145 163265 162253 161009 159833 159165 159396 160586 162218 163543 164213 164314 163919 163131 162408 162264 162687 163369
55139 163369 164295 165422 166146 166059 165987 167058 168799 169560 168944 168287 168345 168138 166892 165550 165211 165389 165129 164758
55121 164758 165086 165784 166160 166832 168889 171675 173112 172278 170257 168388 167050 166473 167307 169585 172033 173209
55105 173209 173010 172582 172935 173901 174329 173315 171311 169786 169590 170173 170818 171876 173836 175786 176122 174759
55089 174759 173363 173066 173066 171982 169747 167576 166620 167160 168682 170292 171359 172047 172902 173815 173898 172696 171041
55072 171041 170271 170830 171916 172267 171132 168803 166514 165594 166359 167891 168976 169113 168529 167583 166533 165768
55056 165768 165845 167018 168671 169505 168601 166385 164271 163292 163375 164092 165570 168192 171729 175360 178402 180610
55040 180610 182026 183090 184635 187051 189513 190807 190923 190979 191441 191342 189765 187341 185533 184872 184681 184422
55024 184422 184602 186076 188818 191660 193337 193701 193774 194490 195577 195944 195030 193358 191841 191058 191247 192400
55008 192400 194033 195329 195823 195605 194687 192764 190075 187842 187050 187107 186547 184956 183309 182339 181659 180941 180997
54991 180997 182675 185133 186342 185353 183207 181412 180285 179190 177649 175625 173277 171212 170634 172326 175407
54976 175407 177857 178464 177606 176019 173660 170309 166719 164347 164045 165470 167692 169989 172088 174049 176033
54961 176033 178057 179971 181647 183035 184002 184531 185212 187070 190325 193556 194641 192678 188832 185306 183626
54946 183626 183708 184339 184517 184327 184380 184597 184207 183042 182035 181931 182231 182205 182348 183759 186351 188780 190098 190431
54928 190431 189912 188170 185425 183102 182528 183585 185314 187319 189788 192478 194558 195479 195463 195121 195076 195834
54912 195834 197442 199227 200333 200648 200773 201057 201180 200892 200569 200617 200784 200628 200444 201038 202551 204111 204848
54895 204848 204795 204516 204205 203612 202648 201633 201023 201172 202286 204204 206183 207162 206376 203737 199796 195578 192272
54878 192272 190636 190542 191193 191714 191590 190972 190851 192438 195724 199030 200731 201241 202428 205158 208391 210784
54862 210784 212098 212769 213270 214516 217793 223260 229234 234024 238093 243475 251331 260865 270323 278120 283060
54847 283060 284542 282974 279660 276039 273030 270716 268302 264740 259934 254981 250838 247185 243275 239303
54833 239303 235970 233034 229449 225001 220798 217926 216433 215856 215931 216343 216476 216011 215499 215928 217732 220326
54817 220326 222589 223909 224780 226152 228197 230366 232913 237313 244241 251924 257841 261691 265308 269719
54803 269719 273786 275921 275721 273520 269724 265300 261595 258708 254985 249151 242198 236137 231650 228103
54789 228103 225325 223812 223166 221738 218466 214222 210582 207685 204169 199329 194606 192249 192584 193428 192539
54774 192539 190038 187749 186690 186281 185845 185649 186127 187091 188222 189533 190797 191305 190829 190129 189812 189349 188175
54757 188175 187222 188134 191002 193850 194735 193716 192501 192615 194170 196108 197293 197499 197568 198679 201313 204767
54741 204767 207610 208787 208536 208134 208485 209115 208838 207236 205003 203037 201887 202004 203569 205778 207122 206968
54725 206968 206307 206488 207677 208999 209607 209106 207556 205812 205466 207525 211153 214332 215805 215988 216154 217270
54709 217270 219622 223089 227498 232732 238479 244027 248781 253085 257970 263750 269344 273507 276398 279387
54695 279387 283504 288436 292771 294871 293792 289962 284903 279923 275175 270139 264676 259275 254591 251126
54681 251126 249075 248017 246963 245030 241957 237974 233695 230403 229588 231444 234268 236036 236245 235648 234815
54666 234815 233890 233374 233910 235178 235973 235674 234988 235066 236520 239482 243895 249328 254963 260161 264829 268983
54650 268983 272180 273668 273051 270720 267657 264769 262318 259973 257323 254101 250068 245255 240493 237061
54636 237061 235346 234234 232245 228965 225044 221360 218659 217452 217493 217691 217157 216061 214973 213846 212368
54621 212368 210771 209458 208211 206717 205501 205304 205782 205961 205810 206092 206660 206328 204848 203701 204140 205364
54605 205364 205444 203511 200347 197301 195323 194827 195791 197837 200393 202900 205085 207256 210051 213441 216233
54590 216233 217095 215930 213722 211374 209377 208225 208073 208120 207462 206611 206926 208443 209586 209435 208873 208814 208643
54573 208643 207602 206624 207335 209605 211350 210725 207684 203557 199954 198046 198059 199153 200173 200661 200954 201423
54557 201423 201956 202221 202256 202708 204390 207333 210401 212267 212751 212738 212917 213298 213866 214698 215170 214224 212005 210270
54539 210270 210293 211204 211305 210353 209444 209137 208961 208708 209006 210302 212017 213102 213082 212438 212218 213199 215139 216926
54521 216926 217626 217117 215564 212921 209440 206140 204027 203125 202785 202623 202583 202507 202334 202392 202861 203384 203907 205255
54503 205255 207868 210506 211649 211867 213243 216256 218859 219328 218676 219168 221327 223505 223988 222562 220262
54488 220262 218458 218198 219761 222513 225318 227198 227763 227398 227154 228085 230361 233138 235347 236280 235471 232644
54472 232644 228242 223618 220191 218430 217874 217917 218379 219491 221558 224439 227209 228615 228202 226786 225506
54457 225506 224541 223040 220225 216285 212231 209193 207891 208504 210702 213664 216346 218076 219085 220209 221834
54442 221834 223345 223922 223623 223250 223336 223814 224644 226063 227979 229690 230517 230391 229572 228222 226531 224863 223532
54425 223532 222752 223016 224992 228641 232871 236500 239178 241042 242046 242327 242745 244147 246227 247902 248730
54410 248730 249126 249269 248782 247775 247210 247675 248528 248968 249346 250663 253072 255700 257830 259512 260899 261645
54394 261645 261258 259717 257534 255425 253943 253189 252806 252459 252307 252715 253595 254431 254955 255305 255408 254751 253107
54377 253107 251122 249784 249502 249895 250155 249443 247443 245036 244017 245481 248608 251551 253301 254076 254104 252960
54361 252960 250341 246782 243224 240429 239041 239592 241890 244776 246972 248053 248266 247786 246655 245340 244821
54346 244821 245905 248527 251716 254386 256336 258378 261104 263736 264881 264504 264217 265178 266584 266964 266196
54331 266196 265281 264673 264045 263427 263259 263183 262030 259529 257096 256348 257486 259650 262096 264334 265693 265776 265301
54314 265301 265737 267888 271197 274511 277221 279546 281881 284077 285490 285867 285970 286918 288847 290725 291660
54299 291660 291915 292270 292834 293035 292518 291397 289792 287839 286148 285406 285145 283655 279850 274873 271061 269404
54283 269404 268794 267876 266719 266115 266019 265650 264871 264397 264554 264734 264415 263909 263629 263420 263171 263273 263638 262950 260094
54264 260094 255985 252750 251154 250007 248232 246291 245171 245041 245563 246665 248342 250371 252758 255735 258780
54249 258780 260486 260183 258876 257732 256460 254372 252248 251533 251971 251807 250546 249863 251121 253391 254872
54234 254872 255194 255102 254562 252637 249261 246027 244762 245775 247750 249084 249214 248892 249372 251268 254200 257365
54218 257365 260148 262148 263129 263364 263626 264270 264491 263131 260341 257862 257390 258994 261414 263510 264964 265850
54202 265850 266315 266991 269084 273195 278054 281117 280958 278787 277198 277641 279471 281142 281593 280600 278744 277351
54186 277351 277578 278880 279025 276463 272317 269207 268328 268622 268687 268376 268108 267660 266506 264833 263425 262582 261763
54169 261763 260353 258507 257236 257693 259995 262546 263061 260883 257987 256995 258351 260109 260394 259075 256897
54154 256897 254075 250678 247709 246618 247629 249377 250503 251087 252121 253971 255975 257493 258867 261016
54140 261016 264196 267458 269477 269758 268765 266992 264384 261042 258088 257065 258261 260188 261151 261047 261117 262224
54124 262224 264046 265953 267884 269895 271471 271971 271564 271087 271033 271249 271600 272251 273097 273537 273227 272667 272589 273068
54106 273068 273504 273260 271974 269644 266852 264627 263579 263282 262924 262285 261569 260563 258797 256620 255393 256304
54090 256304 259291 263151 266310 267585 266851 265169 263832 263191 262784 262495 262899 264440 266961 270053 273025
54075 273025 274563 273651 271237 269816 270619 272324 273337 274127 275953 278274 279141 277817 275418 273084 271127
54060 271127 270077 270913 273576 276433 277884 277686 276389 274573 273188 273485 275691 278546 280967 283379 286465
54045 286465 289396 290620 290138 289771 291021 293540 295939 297483 298779 301135 305267 310311 314298 316084 316655
54030 316655 317928 320414 322708 323210 321650 318864 315904 313669 312524 311681 309607 305964 302808 302813 306171
54015 306171 310098 311779 311038 309529 308156 306523 304663 303795 304744 306788 309035 312053 316792 322392 326684
54000 326684 329016 330980 333707 335825 335276 332225 328916 327116 326908 327641 328744 329482 329223 328467 328828 331403
53984 331403 335674 340337 344675 348686 352473 356140 360068 364656 369846 375284 380924 387055 393677 400134
53970 400134 405551 409550 412493 415058 417622 420036 422114 424312 427593 432264 437058 439885 439864 438355 437491
53955 437491 437681 437092 433869 428391 422843 418834 416039 413057 408784 402905 395854 388823 383143 378949 374782
53940 374782 369143 362305 356128 352381 351675 353504 356418 358339 357782 355107 351859 348742 345083 340616 336785
53925 336785 335394 336449 338215 339189 339246 338833 337895 336054 333478 331169 330334 331481 333934 336235 337318 337485
53909 337485 338047 339861 342397 344576 346376 349118 353891 360146 366380 372082 378330 386232 395318 403895
53895 403895 410609 415147 417674 418197 416563 412738 407161 401063 396172 393476 392351 391403 390064 388712 387470
53880 387470 386013 384829 385539 389154 394748 400612 406092 411419 416341 420194 423246 426873 432134 438913
53866 438913 446573 454659 462701 470131 476789 482970 488720 493759 498389 503660 510013 516418 521663 526027
53852 526027 530897 536979 543759 550508 556879 562491 566795 569662 571464 572349 572064 570715 569042 567476 565447
53837 565447 562055 557039 550680 543312 535485 528214 522360 517794 513550 508574 502022 493414 483277 473331
53823 473331 465118 458443 451855 444551 437007 429905 423607 418802 416267 415188 412843 407221 399506 392843
53809 392843 388871 386475 383849 380694 377977 376292 375096 373366 370663 367497 364659 362199 359335 355609
53795 355609 351797 349198 348114 347464 345886 342898 339152 335966 334514 334962 336337 337525 338277 338939 339569
53780 339569 339965 340327 341121 342387 343902 345866 348467 350769 351237 349762 348041 347448 347606 347767 348314 349626
53764 349626 350404 348873 345439 342578 341930 342778 343680 344329 345166 346220 347260 348557 350753 354248 359101 365081
53748 365081 371336 376552 380175 383182 386961 391564 395759 398757 401194 404255 408402 413225 418103 422670
53734 422670 426941 431307 436246 441700 446818 450588 452750 453848 454371 454142 452832 450923 449598 449402 449306
53719 449306 447689 444193 440064 436483 433254 429632 425847 422803 420459 417534 413138 407835 402645 397763
53705 397763 393030 389072 386882 386207 385229 382164 376873 370791 365727 362830 362160 362836 363737 364250 364367 364222
53689 364222 363945 363868 364278 364800 364566 363406 362465 363201 365897 369436 372310 373569 373053 371242 369038 367525
53673 367525 367742 370277 374637 379106 381956 383106 384051 385879 388030 389550 390805 393015 396453 400103 403000
53658 403000 404969 406120 406598 407090 408593 411197 413834 415722 417540 420651 425601 431767 438000 443115 446228
53643 446228 447369 447709 448665 450755 453570 456635 459836 463098 466221 469199 472359 475910 479516 482620 485214
53628 485214 487978 491309 494368 495620 494652 492886 491991 492000 491743 490794 489842 489138 487884 485646 483284 481686
53612 481686 480560 479473 479172 480542 482769 484088 484215 484518 485560 486056 484994 483410 482898 483236 482893 481520
53596 481520 480517 480928 481932 481955 480567 478619 476975 475814 475141 475343 476951 480048 484121 488472 492720
53581 492720 496936 501342 505917 510342 514394 518282 522464 527158 532113 536818 540898 544413 547910 551992
53567 551992 556564 560714 563718 566079 568973 572672 576277 579354 582926 588085 594269 599995 605061 610860
53553 610860 618396 627010 635332 642629 648766 653712 657860 662271 667841 674313 680479 685164 687771 688394
53539 688394 687913 687694 688636 690596 692926 695167 696842 697116 695477 692658 690243 689202 689080 688632 687032 684591
53523 684591 682438 681295 680362 677912 673347 668217 664570 662630 660881 658315 655676 654159 653530 652183 649106
53508 649106 645429 643634 645065 648453 651277 652273 652036 651429 650675 650284 651499 654824 659121 663183 667330
53493 667330 672126 676469 678847 680164 683295 689446 696735 703108 709146 716849 726638 736755 745279 751933
53479 751933 758172 766013 776561 789324 803166 817768 833568 850435 867526 884776 903350 923958
53467 923958 945718 967522 989697 1013325 1038539 1064586 1091260 1119207 1148861 1179854 1211519
53456 1211519 1243488 1275936 1309686 1345762 1384258 1423861 1463128 1502075 1541917 1583416 1626078
53445 1626078 1668858 1710979 1752059 1792036 1831207 1869928 1908020 1944630 1978852 2010612 2041039
53434 2041039 2071782 2103537 2135303 2165657 2194685 2223800 2253516 2282546 2309715 2335672 2361725
53423 2361725 2387824 2412884 2436418 2458480 2478342 2494722 2507332 2517019 2524273 2528717 2530149 2528870
53411 2528870 2524717 2516952 2505504 2491288 2474823 2455658 2433849 2410954 2388491 2365894 2341034 2312723
53399 2312723 2282097 2251569 2222755 2195282 2167329 2137422 2105776 2073787 2042488 2012075 1982784
53388 1982784 1955185 1929344 1904630 1880888 1858962 1839374 1821330 1804042 1788468 1776604 1769129
53377 1769129 1764799 1762228 1761360 1762891 1766998 1773237 1781392 1791986 1805874 1823409 1843948 1866281 1889637
53364 1889637 1914241 1940764 1969456 2000054 2032444 2067087 2104778 2146054 2190746 2238017 2287004
53353 2287004 2337594 2390382 2445755 2503285 2562266 2622669 2685334 2751340 2821227 2894505 2969776
53342 2969776 3045777 3122614 3201675 3284093 3369660 3457432 3546673 3636619 3725990 3813698 3899807
53331 3899807 3984992 4069274 4152096 4233318 4312948 4389865 4462126 4528963 4591409 4650268 4704414
53320 4704414 4751952 4792301 4826057 4853125 4872079 4881455 4881010 4871705 4855013 4832150 4803182 4766637
53308 4766637 4720539 4664173 4598635 4525746 4447042 4363931 4278058 4190785 4102510 4013005 3922433
53297 3922433 3831707 3742013 3654310 3569202 3486720 3406085 3326151 3246510 3168079 3092376 3020320
53286 3020320 2951872 2886583 2824021 2763728 2705215 2648295 2593246 2540613 2491158 2446020 2406309
53275 2406309 2372048 2341839 2314106 2288447 2265140 2243579 2222175 2200060 2177968 2156852 2136406
53264 2136406 2115902 2096046 2078805 2065268 2054604 2045550 2038139 2033289 2031200 2030918 2031444 2032716 2035398
53251 2035398 2040099 2046845 2055053 2064039 2073872 2085782 2101298 2120792 2143141 2166999 2192089 2218998
53239 2218998 2248088 2279117 2311814 2346216 2382268 2419546 2457611 2496261 2535065 2573007 2609121
53228 2609121 2643336 2676090 2707139 2735384 2760078 2781400 2799235 2812069 2818198 2818040 2814187 2808659
53216 2808659 2800728 2787976 2769032 2744621 2716331 2685221 2651640 2615567 2576751 2535059 2491090
53205 2491090 2446115 2400950 2355118 2307462 2257581 2206342 2155039 2104317 2053869 2002914 1950961
53194 1950961 1898315 1845957 1794880 1745531 1697935 1652099 1608006 1565316 1523557 1482760 1443630
53183 1443630 1406771 1371861 1337860 1304037 1270642 1238596 1208748 1181502 1156885 1134576 1113852
53172 1113852 1093880 1074335 1055649 1038384 1022453 1007143 991772 976055 959970 943696 927622
53161 927622 911842 895609 877909 858865 839882 822051 805108 788562 773011 759231 746465
53150 746465 733001 718455 704237 691507 679879 668558 657547 646978 636316 625269 614697
53139 614697 605475 596911 587470 576804 566043 556132 546956 538185 529991 522663 516214 510622 505839 501396
53125 501396 496621 491376 485992 480443 474393 468300 463601 461226 460402 459353 456801 452687 448105 444816
53111 444816 443972 444653 444287 441218 436396 431962 428842 426639 425381 425945 428474 431363 432472 431035 428079
53096 428079 425144 422791 420332 416963 413019 409751 407835 406672 405406 404019 402908 402110 401734 402568 405154
53081 405154 408451 410531 410612 409518 408193 406820 405514 404608 403874 402556 400814 400188 401803 404804 407337
53066 407337 408532 408877 409186 410079 412101 415461 419681 423983 427848 430861 432416 432146 430383 427804 425004
53051 425004 422735 421817 422063 421984 420516 418554 417662 417614 416551 413538 409683 406490 404293 402753 401784 401339
53035 401339 401031 400623 400364 400386 400336 399977 399539 399032 397902 395939 393963 392972 393112 394021 395600 397657 399316
53018 399316 399708 399076 398390 397995 397425 396432 395324 394229 392857 391229 389909 389186 388582 387496 385849 383758
53002 383758 381126 378070 375340 373716 373092 372666 371962 371237 370893 371005 371595 372921 375100 377605 379555 380505
52986 380505 380667 380326 379413 377866 376182 375172 375122 375425 375145 373888 372160 370993 371180 372610 374277 375048
52970 375048 374482 372918 371018 369485 368943 369520 370546 371254 371907 373649 376888 380371 382397 382599 381972 381421
52954 381421 381037 380740 380850 381635 382776 383707 384227 384391 384027 382933 381678 381643 383798 387585 391459 394481 396824
52937 396824 398664 399409 398644 397188 396271 395924 395245 394147 393595 393851 393800 392801 392101 393320 396201 398988 400629
52920 400629 401427 401806 401651 400983 400305 400010 400251 401553 404714 409710 415213 419486 421491 421284 419954 419071
52904 419071 419357 419787 418810 416645 415473 417009 420643 424375 426853 427945 427947 426912 424523 420426 415088 410316
52888 410316 408003 408053 408502 408218 408298 409869 411639 411127 407781 403424 399812 397208 395346 394230 393537 392580
52872 392580 391586 391985 394494 397571 398680 396844 393323 390153 388635 388970 390464 391906 392234 391164 389140
52857 389140 386745 384460 382892 382813 384633 387732 390439 391003 389026 386018 384158 384240 385040 384899 383639 382584
52841 382584 382929 384537 386260 386956 386195 384494 383123 383297 385185 387812 390082 391651 392649 393072 392975 392974 393716
52824 393716 394745 394649 392757 390196 388760 389072 390349 391671 392805 393887 394995 396253 397876 399916 402248
52809 402248 404791 407332 409140 409432 408518 407928 408905 411081 413030 413864 413919 414171 415388 417612 419971 421117
52793 421117 420281 417921 415144 412618 410212 407336 403275 397659 391223 385772 382547 380743 378468 375188
52779 375188 372339 371388 372240 373937 375894 377651 378277 377173 375118 373447 372243 370357 367360 364477 363170
52764 363170 363566 364830 366431 368326 370224 371484 371753 371269 370554 370136 370366 370965 370939 369633 367954 367820 370073
52747 370073 373501 376238 377551 377739 376984 375256 373161 371824 371620 371693 371070 369828 368829 368686 369334 370277 370818
52730 370818 370224 368252 365677 363979 364149 365780 367513 368470 368977 369635 369941 368587 365375 362114 360881 361715
52714 361715 362756 362456 360827 358614 356293 354213 352887 352538 352746 352924 352750 351980 350495 348929 348567 350083
52698 350083 352740 355327 357289 358531 358799 358158 357622 358375 360406 362693 364652 366717 369391 372353 374724
52683 374724 375961 376386 376929 378129 379422 379963 380312 382351 386833 391857 394898 395741 396155 397144 398078 398480
52667 398480 398948 399770 400056 399092 397518 396293 395313 393959 392414 391512 391515 391732 391113 388855 384821 379957 375925
52650 375925 373755 373047 372865 372991 373769 375152 376699 378378 380595 383273 385440 385997 384729 382558 380915
52635 380915 380704 381599 382462 382664 382806 383758 385197 385696 384393 382212 381031 381751 383490 384714 384849 384454 384080
52618 384080 383694 383443 384158 386327 388913 390147 389453 387825 386310 385072 384211 384540 386751 390323 393819 396052
52602 396052 396661 395897 394322 392546 391065 390488 391740 395340 400296 404464 406493 406960 407321 408284 409553 410496
52586 410496 410589 409776 408884 409110 410692 412594 413918 414869 415825 416371 416050 415333 414941 414840 414831 415428 417003 418663
52568 418663 419282 419382 420710 424047 428575 433226 437380 440283 441128 439928 437250 433035 426949 420101 414899
52553 414899 412556 411882 411230 410582 410863 412090 413255 413516 412666 410791 408269 405996 404942 405385 406746 408159
52537 408159 409241 410531 412949 416384 419211 420111 420025 420946 422814 423331 421437 419151 418692 419294 418647 416562
52521 416562 415166 415732 417174 417915 417696 417090 416585 416748 418181 420580 422634 423538 423936 424680 425275 424391 421614
52504 421614 417955 414778 412941 412924 414873 418118 421115 422402 421641 419630 417487 416025 415572 415863 416110 415673
52488 415673 414866 414651 415210 415338 413843 411327 409784 410415 412525 414746 416587 418209 419307 419125 417658 416123
52472 416123 415844 416795 417602 417089 415593 414453 414285 414350 413928 413595 414322 415769 416668 416855 417669 419867 422414
52455 422414 424083 425193 426643 428082 428501 428351 429506 432841 437072 440619 443715 447833 453339 458578 461418
52440 461418 461353 459719 457967 456219 453917 451437 450001 449777 449148 446702 443194 440433 438692 436548 433301
52425 433301 430203 428822 429108 429681 429344 427830 425606 423578 422536 422299 421725 420084 418181 417566 418762 420835
52409 420835 422717 424355 426313 428628 430586 431710 432670 434923 439361 445430 451602 456624 460289 463241
52395 463241 466113 468740 470143 469549 467409 465029 463015 460683 457387 453835 451358 450274 449702 448767 447237
52380 447237 445175 442878 441064 440130 439174 436843 433385 430703 429870 429660 428324 425921 423952 423336 423821 424913
52364 424913 426347 427808 429177 430941 433466 435950 437114 437059 437440 439454 442515 445430 448126 451473 455894
52349 455894 461035 466688 473331 481561 491408 502209 512768 521567 527390 530111 530558 529283 525823 519763
52335 519763 512357 506289 503427 503195 503401 502199 499041 494419 489621 486413 485911 487439 489034 489313 488491
52320 488491 487667 487770 489280 492138 495499 498257 500252 502515 505955 510458 515705 522126 530202 539317 548203
52305 548203 556289 563779 570625 576339 580838 584592 587779 590023 591143 591469 591187 590143 588643 587753 588233
52290 588233 589767 591945 595461 601304 608738 615129 618488 619813 622325 628468 638042 649159 660265 670917
52276 670917 681312 691972 703751 717221 731818 746261 760214 774947 791948 811431 832673
52265 832673 855233 879119 904158 929972 956397 983264 1010104 1036789 1064132 1092901 1122278
52254 1122278 1150184 1175152 1197098 1216427 1233640 1250022 1267380 1286310 1305452 1323050 1338466
52243 1338466 1351650 1362172 1369884 1376005 1382318 1389338 1395962 1400918 1403980 1405919 1407745 1409918 1411847
52230 1411847 1412353 1410967 1408435 1405537 1401911 1396695 1389897 1382339 1374605 1366987 1360311 1355907 1354696 1357041
52216 1357041 1363267 1373218 1385331 1397490 1409339 1422693 1438937 1456836 1473717 1488192 1500961 1513482
52204 1513482 1526764 1541124 1556185 1571007 1584782 1597291 1608308 1617116 1623560 1629239 1636283 1644623
52192 1644623 1651529 1654535 1654010 1652132 1650129 1647582 1643989 1639595 1634466 1627863 1619110 1608370 1595987 1581710
52178 1581710 1565302 1547409 1529044 1510473 1491519 1472811 1455741 1440987 1427927 1415845 1404855
52167 1404855 1395248 1386738 1379082 1372748 1368149 1364632 1361150 1357680 1355144 1354014 1353834 1354089 1354733 1355764 1357053
52152 1357053 1358760 1361246 1364368 1367545 1370665 1374201 1378188 1381872 1384771 1387349 1390132 1392846 1395116 1397394
52138 1397394 1400399 1404055 1407809 1411694 1416194 1421172 1425776 1429497 1432586 1435257 1437306 1438940 1441418 1446059
52124 1446059 1452615 1459024 1463023 1463944 1462869 1461086 1458704 1455045 1450153 1445257 1441431 1438278 1434353 1428706
52110 1428706 1421640 1414262 1407678 1402444 1398381 1395037 1392556 1391735 1392868 1395012 1397105 1399504 1403524 1409572
52096 1409572 1416622 1423670 1430782 1438306 1445775 1452204 1457112 1460815 1463923 1466815 1469487 1471877 1474571 1478940
52082 1478940 1485862 1494240 1501711 1507223 1512230 1518882 1527813 1538408 1550455 1564323 1579680 1595245 1610271
52069 1610271 1625624 1643008 1663566 1687486 1714475 1743947 1774831 1805886 1836762 1868614 1903085
52058 1903085 1940316 1978272 2014416 2047809 2079150 2109188 2137968 2165454 2191671 2215836 2236396
52047 2236396 2252539 2264796 2273508 2277748 2276855 2272148 2265612 2257354 2246008 2231691 2216902 2203938 2192653
52034 2192653 2181492 2169638 2157215 2144104 2129729 2113956 2097536 2081610 2066996 2053807 2041494
52023 2041494 2029456 2017677 2006596 1996445 1987287 1979739 1974949 1973518 1975087 1979290 1986369 1996316 2008057
52010 2008057 2020246 2032512 2045299 2058818 2072776 2086859 2100812 2114249 2126903 2138780 2149510
51999 2149510 2157917 2163056 2165564 2167151 2168638 2169107 2167030 2161765 2153935 2144875 2135691 2126390 2115933 2103458
51985 2103458 2089105 2073077 2054503 2032337 2007258 1981375 1955834 1929814 1902248 1873407 1844307
51974 1844307 1815760 1788806 1764970 1744890 1727321 1710638 1694856 1681100 1669481 1658732 1647762
51963 1647762 1636353 1624167 1610297 1594287 1576816 1558950 1541237 1523756 1506397 1488814 1470801
51952 1470801 1453117 1437230 1423650 1410910 1396760 1380157 1361770 1342987 1324830 1307509 1290452
51941 1290452 1272891 1254783 1236933 1219899 1203078 1185365 1166485 1147252 1128874 1112622 1099810
51930 1099810 1091032 1085117 1079664 1073049 1065534 1058123 1050957 1043335 1034886 1025934 1016724 1006900 995984 984098
51916 984098 971963 960161 948507 936155 922436 907594 892622 878530 866065 855996 848984 844817
51904 844817 842338 840674 840227 841864 845534 850568 857113 866101 877445 889304 899736 908286 915199 919897
51890 919897 921489 920511 918883 917903 917226 916100 914688 913694 913529 914644 918188 925432 936518 950302 965434
51875 965434 981295 998129 1016790 1038312 1063074 1090062 1117089 1141928 1163132 1179767 1190531
51864 1190531 1193431 1186788 1170956 1148880 1124202 1098561 1071307 1042052 1012392 984268 957568 930841
51852 930841 904073 879015 856577 835707 815774 798492 785909 777270 769678 761753 755091 751832
51840 751832 752121 754605 758356 763311 769323 775854 782504 789114 795130 799420 801049 799961 796653 791402
51826 791402 784136 775063 765063 755244 746303 738607 732731 729390 728631 729476 730782 732340 734882 739109
51812 739109 744959 751647 758074 763386 767648 771970 777342 783061 786850 787052 784528 781811 780347 779046
51798 779046 775799 770073 763587 758563 755809 754698 754431 754734 755427 756186 757038 758573 761051 763515 764303 762447
51782 762447 758294 752827 746831 740710 734666 728840 723382 718398 713623 708355 702033 694849 687463 680299
51768 680299 673624 668233 665232 664801 665614 665908 664925 663167 661598 660785 660435 659456 656830 652691 648278 644654
51752 644654 641967 640179 639670 640440 641364 641335 640958 642022 645089 648623 650891 651951 653118 655047 657076 658142
51736 658142 657648 655541 652308 649127 647394 647571 648579 648618 646580 642583 637401 631775 626349 621858 618991
51721 618991 618088 619136 622018 626617 632694 639806 647232 653841 658290 659882 659487 659254 661090 665360 671054
51706 671054 676936 682438 687733 693330 699652 706911 715206 724420 733799 741986 748023 752268 755621 757761
51692 757761 756863 751443 741892 729848 716758 703628 691421 680671 670958 661681 653226 646664 642463
51679 642463 640347 640268 642446 646317 650526 654384 658548 663798 669879 676001 681679 686359 688917 688574 686291
51664 686291 684442 684879 687481 690476 691883 690782 687659 683622 679290 674612 669734 665515 662797 661392
51650 661392 660157 657955 654421 650196 646670 645126 645706 647444 649546 652145 655455 658854 661504 663374
51636 663374 664695 664800 662770 659346 656936 657217 659627 662683 665738 668558 670067 669016 665778 662218 659466
51621 659466 656765 653034 648683 645161 643206 642403 642217 642495 642914 642827 642207 642229 644398 649287 656415 664955
51605 664955 674092 682989 690996 697856 703303 706681 707513 706324 704232 701743 698634 695051 691907 689964
51591 689964 689305 690122 693173 698729 705503 711325 714608 714763 711773 706146 698974 691302 683563 676136 669960
51576 669960 665724 662731 659661 656424 654243 653744 653969 653676 652778 651973 651659 651773 652235 652923 653464 653333 651874
51559 651874 648145 641496 632772 624408 618577 615472 613708 611884 609209 605334 600651 596604 594673 594791
51545 594791 595489 595752 595957 596782 598087 599529 601763 606166 613347 622463 632212 642190 653102 665643 679147
51530 679147 691311 699441 702211 700381 695948 690871 686495 683584 682209 681666 681125 680680 681539 684981 691354
51515 691354 700209 711176 724341 739785 756979 774686 791538 807023 822077 838356 856509 875385
51503 875385 893332 910041 926546 943697 961656 981124 1003986 1031879 1064546 1100318 1137885
51492 1137885 1176773 1216111 1253561 1285711 1309579 1324233 1331386 1333846 1332623 1325822 1311080 1288627
51480 1288627 1260962 1229898 1195583 1158753 1122312 1089568 1061653 1037605 1016252 997040 979529
51469 979529 963315 948523 935490 923794 912110 899121 884296 867992 851289 835438 820853
51458 820853 806688 791976 777028 762996 750196 737728 725008 712816 702315 693590 685779 678292
51446 678292 671260 664926 659220 654100 649777 646240 642841 638851 634449 630594 627649 624606 620345 615498
51432 615498 612270 612230 614847 618363 621406 623410 624344 624831 626006 628260 630330 630430 628228 625016 622086
51417 622086 619762 617912 616418 614874 612610 609493 606245 603679 601907 600277 597677 593085 586690 580469
51403 580469 576747 575844 575857 574900 572677 569723 566377 563274 561641 561961 563008 563328 563303 564721 568620 574524
51387 574524 581568 589344 597686 606521 615995 626042 635948 645163 654427 665104 677283 689322 699332
51374 699332 706326 710078 711129 711265 712736 716154 719875 721985 722093 720549 717024 711083 703603 696206 689311
51359 689311 681917 673495 665128 658369 653763 650978 649712 649704 650181 650089 649052 647637 646535 645899 645733 646556
51343 646556 649096 653285 657989 661943 664706 666653 668454 670876 674615 679797 685907 692736 701018 711323
51329 711323 722471 732166 739539 746346 755334 768192 785336 806677 831736 859686 890226 924028
51317 924028 961582 1002132 1044753 1090065 1139546 1192846 1246780 1297440 1342781 1382833 1417924
51306 1417924 1447085 1468037 1478650 1478577 1469349 1452612 1428663 1397242 1359246 1316670 1271009 1222831
51294 1222831 1172980 1123036 1074257 1027155 982637 942412 907419 876693 848637 822723 799099
51283 799099 777441 757422 739736 725260 713355 702320 691525 681757 673274 664923 655876 647194
51271 647194 640738 637176 635792 635658 636050 636033 634813 632741 631265 631325 632022 631253 627690 621976 615990 611088
51255 611088 607193 603458 599501 595840 593360 592626 593509 595136 596176 595565 593131 589469 585343 581388 578162
51240 578162 576010 574786 574083 573796 574157 575174 576376 577181 577152 575984 573793 571545 570546 571088 572081 572461 572618
51223 572618 573907 577035 581440 586228 591148 596539 602512 608382 613017 615972 618178 620946 624070 625679
51209 625679 624593 622334 621816 624244 628184 631753 634706 637956 641906 645918 648915 649872 648166 644221 639658
51194 639658 636096 633613 630792 626305 620138 613412 607464 603126 600318 598142 595752 593310 591670 591011
51180 591011 590295 588456 585619 582674 580129 577941 576199 575146 574642 574352 574436 575346 576834 578018 578711 579814
51164 579814 581852 583883 584612 584012 583054 582184 581004 579332 577703 576772 576818 577901 579923 582512 585383 588728
51148 588728 592656 596416 598949 600235 601292 602798 604667 607022 610444 614817 619013 622439 625927 630241
51134 630241 634541 637362 638558 639188 639837 640121 639712 638953 638431 638642 639813 641320 641536 639304 635501 632176
51118 632176 630073 628057 625178 622229 620700 621011 622347 623682 624471 624800 625320 626649 628553 630146 631065
51103 631065 631818 632667 632944 632031 630360 628703 626997 624719 622125 620187 619305 618859 618108 616941 615642 614474
51087 614474 613684 613450 613611 613832 614128 614854 615992 616869 616916 616408 616075 616176 616376 616479 616799 617642 618775 619736
51069 619736 620456 621146 621685 621755 621826 623297 626970 631698 635336 637002 637587 638008 638033 637369 636979 638199 640906
51052 640906 643561 645146 646179 647743 650253 653562 657598 662328 667378 672218 676628 680609 683952 686228
51038 686228 687329 687863 688913 691338 695068 698994 701772 702975 703356 703878 704757 705804 707395 710332 714547
51023 714547 718552 720813 721383 721556 722046 722291 721779 721279 722105 724478 727367 729830 731811 733570 735105 736676
51007 736676 739397 744489 751908 760244 768250 776212 785632 797730 812553 829417 847648 866582 885185
50994 885185 902358 917746 931794 944866 956971 968738 981786 996941 1012291 1024255 1031048 1034196
50982 1034196 1036130 1037165 1035689 1030696 1022989 1014011 1004616 995294 986697 979110 971617 962445 950464 936337
50968 936337 922067 909326 898194 887609 877014 867295 859966 855728 854093 854233 855821 859080 864282
50955 864282 871226 879043 886732 894256 902921 914162 927787 941883 954703 966391 978597 992600
50943 992600 1008100 1023766 1038593 1052546 1066050 1079241 1091877 1103765 1114876 1124969 1133502 1140202
50931 1140202 1145504 1150118 1154242 1157542 1159921 1162105 1165381 1170862 1178969 1189522 1202324 1217631 1235719
50918 1235719 1255823 1275898 1294000 1310048 1326017 1344448 1366873 1393436 1423484 1456420 1492385
50907 1492385 1532292 1577067 1626841 1681055 1739233 1801230 1866697 1934785 2004729 2076533 2150808
50896 2150808 2227842 2306664 2384838 2459263 2527722 2589953 2647044 2699589 2746536 2785886 2816388
50885 2816388 2838425 2853549 2863437 2869345 2872274 2873234 2872838 2870505 2864545 2853639 2838232 2820040 2800194
50872 2800194 2778350 2753760 2726593 2697805 2668052 2637115 2604161 2568181 2528422 2484931 2438720
50861 2438720 2390941 2341728 2290058 2234885 2176314 2115783 2055438 1997434 1943307 1893389 1846822
50850 1846822 1802667 1761180 1723518 1689901 1658716 1628294 1599222 1573718 1552542 1533724 1515023
50839 1515023 1496597 1480067 1465668 1451841 1437572 1423685 1411462 1401162 1392534 1385797 1381198 1378132
50827 1378132 1375590 1373375 1372383 1373653 1377395 1382795 1388705 1394762 1401778 1410582 1420607 1430408 1439705 1450042
50813 1450042 1463039 1478898 1497086 1517499 1540026 1563796 1588001 1613086 1640214 1670037 1702962
50802 1702962 1740101 1782599 1830021 1880599 1933190 1988111 2046201 2108215 2175296 2248839 2329534
50791 2329534 2417477 2513388 2618568 2733274 2856322 2986845 3125318 3272108 3426146 3585996
50781 3585996 3751244 3921570 4094980 4268031 4437348 4599860 4752028 4890143 5011407
50772 5011407 5113957 5196162 5257022 5297062 5317822 5320625 5306914 5279501 5241982 5196809 5145544
50761 5145544 5091385 5039575 4993995 4954421 4918290 4884159 4851979 4820636 4786970 4747416 4699562
50750 4699562 4642104 4574428 4496651 4409243 4312246 4205356 4088985 3964686 3834477 3700454
50740 3700454 3565240 3431993 3303257 3180146 3063086 2953072 2851737 2760257 2678484 2605239
50730 2605239 2539489 2481311 2431563 2390394 2356358 2327436 2302573 2281564 2263701 2247703 2233132
50719 2233132 2220659 2210331 2200628 2190017 2178498 2166603 2153776 2139176 2123557 2108694 2094822
50708 2094822 2080003 2062442 2042255 2020601 1998191 1975265 1952127 1928953 1905807 1883497 1863578
50697 1863578 1846608 1831056 1815051 1798919 1784895 1774489 1767236 1762200 1759597 1760337 1764734 1772456 1783498
50684 1783498 1798535 1818375 1843422 1873623 1908534 1947384 1989465 2034744 2084048 2138455 2198420
50673 2198420 2263472 2332639 2405086 2480455 2558806 2640271 2724544 2810610 2897107 2983082 3068269
50662 3068269 3152539 3235261 3315325 3391468 3462204 3525585 3579333 3621098 3648551 3659937 3655418
50651 3655418 3637654 3610210 3575369 3534289 3489151 3443712 3401116 3362143 3326490 3294926 3269147
50640 3269147 3249955 3236534 3227162 3219626 3211292 3199966 3184783 3165341 3140017 3106346 3063466 3013183
50628 3013183 2958204 2900220 2840302 2780103 2721438 2665055 2610971 2560125 2514791 2477093 2447658
50617 2447658 2425981 2411538 2404124 2403480 2409237 2421267 2439697 2464382 2494598 2529372 2567886 2609317
50605 2609317 2652433 2695741 2738090 2779010 2818533 2857029 2895248 2934091 2973974 3014656 3055955
50594 3055955 3098465 3143198 3190562 3240044 3290967 3343472 3398631 3457607 3520724 3587484 3657565
50583 3657565 3731511 3810025 3892819 3978815 4067409 4158624 4251606 4343846 4432626 4516791 4596446
50572 4596446 4671443 4740943 4804010 4859713 4907097 4946166 4978681 5006452 5028194 5038863 5032712
50561 5032712 5006771 4961675 4900606 4828410 4751051 4674535 4603593 4541095 4488295 4445504 4412800
50550 4412800 4390215 4377003 4370927 4368862 4368084 4366342 4360729 4347479 4323326 4286485 4236113 4171754
50538 4171754 4094004 4005048 3907758 3804582 3697632 3589178 3481046 3373860 3267634 3163083
50528 3163083 3061760 2964955 2873064 2786155 2704816 2630241 2563454 2504322 2451466 2403445 2359944
50517 2359944 2321330 2287383 2257622 2232934 2215409 2205637 2201281 2199447 2199591 2202908 2209784 2219572 2232460
50504 2232460 2249580 2271024 2295480 2322447 2353297 2389224 2429334 2471959 2517134 2566455 2620623
50493 2620623 2678213 2737057 2796208 2856269 2918225 2982374 3048395 3116104 3185673 3256972 3329287
50482 3329287 3402392 3477774 3558004 3644797 3738361 3838880 3947801 4067008 4197224 4337995
50472 4337995 4489044 4650932 4824314 5009145 5204890 5411133 5627445 5852551 6083889
50463 6083889 6318306 6553270 6787281 7018957 7245870 7464330 7669947 7858082 8023984
50454 8023984 8163211 8272319 8349145 8392435 8401362 8375338 8314236 8219165 8093483 7942851 7773791
50443 7773791 7592269 7404035 7215823 7035042 6867814 6717947 6588093 6481114 6399700 6345048
50433 6345048 6316388 6311321 6325941 6354812 6391485 6429064 6460016 6475912 6468414 6431175 6360973 6257455
50421 6257455 6122593 5960604 5777627 5580298 5374062 5162854 4950308 4740674 4537907
50412 4537907 4343974 4158795 3982202 3815396 3660010 3516290 3383080 3259339 3144812
50403 3144812 3039252 2941972 2852484 2770750 2696443 2628794 2567637 2513758 2467522 2427981 2394232
50392 2394232 2366943 2347206 2334181 2325329 2319181 2316581 2318663 2324819 2333617 2344902 2359657 2377968
50380 2377968 2398241 2418714 2438926 2459311 2479883 2499830 2518047 2533751 2546912 2558589 2570569
50369 2570569 2584114 2599166 2615300 2633240 2654550 2679731 2707652 2737477 2770320 2808158 2851660
50358 2851660 2900255 2954053 3014390 3082213 3156973 3237779 3324942 3419695 3522685 3633190 3749510
50347 3749510 3869635 3991744 4114526 4237026 4357832 4474440 4583614 4682487 4769446 4844095
50337 4844095 4906182 4954064 4984197 4992593 4977120 4938385 4878622 4800299 4705836 4598077 4480707
50326 4480707 4358391 4236381 4119279 4009912 3909807 3820644 3744425 3682099 3633093 3596789
50316 3596789 3573579 3563809 3566271 3578245 3596089 3614929 3628738 3632236 3622722 3599382 3561393 3507922
50304 3507922 3439752 3359615 3270724 3175818 3077529 2978430 2880248 2783757 2689803 2599842 2515285
50293 2515285 2436839 2364556 2297992 2236331 2179130 2126955 2080438 2038496 1998249 1957027 1913939
50282 1913939 1869545 1825001 1781940 1742236 1707117 1676779 1651037 1629766 1612458 1598117 1586052
50271 1586052 1576149 1568058 1560917 1554414 1549391 1546683 1545930 1546172 1546970 1548109 1548783 1548206 1546912 1546455 1547636
50256 1547636 1549692 1551367 1552174 1552333 1551915 1550571 1548225 1545879 1545292 1547473 1551706 1556663 1562317 1569760 1579003
50241 1579003 1588248 1596163 1603844 1613396 1625335 1638665 1653015 1669158 1687446 1707181 1727887 1750049
50229 1750049 1774163 1800002 1827278 1856267 1887446 1921234 1958110 1997442 2035239 2064169 2077550
50218 2077550 2073663 2055852 2028984 1996696 1961532 1926077 1892988 1864179 1840275 1820536 1803177
50207 1803177 1786291 1769182 1753025 1740105 1732174 1729261 1729888 1732441 1736506 1742992 1753105 1767312 1785168
50194 1785168 1805739 1827983 1850867 1873359 1894429 1913315 1930143 1946219 1963121 1981186 1999156
50183 1999156 2015414 2028999 2039097 2044297 2043285 2036121 2023975 2007701 1987435 1963733 1938231 1912758
50171 1912758 1888288 1865046 1843001 1821759 1800453 1778233 1754556 1728618 1699118 1665302 1627935
50160 1627935 1588569 1548201 1507519 1468096 1431945 1399444 1368794 1338398 1309187 1283862 1264142
50149 1264142 1249418 1237750 1227440 1217674 1208439 1200095 1192852 1186611 1181423 1177648 1175220 1173105 1170256
50136 1170256 1166881 1163826 1160694 1155704 1148003 1139179 1131572 1125609 1119869 1113596 1107930 1104208 1101907 1099090
50122 1099090 1094635 1089314 1084550 1080720 1077154 1073552 1070664 1069304 1069159 1069197 1069096 1069662 1071681 1074943 1078699
50107 1078699 1082666 1087139 1092397 1098506 1105646 1114175 1124206 1135320 1146790 1158126 1169464 1181491
50095 1181491 1194813 1209483 1225427 1243196 1263592 1286282 1309665 1332803 1356892 1383882 1414091
50084 1414091 1446289 1479877 1515529 1553481 1592685 1632444 1673664 1717347 1762698 1808002 1852813
50073 1852813 1897934 1943456 1988295 2031831 2074632 2116947 2157571 2194888 2228080 2256357 2277666
50062 2277666 2289324 2289816 2279231 2258244 2227744 2189534 2146278 2100195 2052293 2003229 1954276 1906909
50050 1906909 1861755 1818562 1777123 1737860 1701588 1668916 1639715 1612885 1586909 1560999 1535658
50039 1535658 1511872 1490045 1470062 1452016 1436160 1422230 1409528 1397864 1387850 1380142 1374990 1372618
50027 1372618 1373173 1375730 1378172 1379032 1379085 1380137 1382406 1384103 1383781 1381971 1380020 1378216 1375912 1372915 1369604
50012 1369604 1365710 1360074 1352143 1343089 1334775 1327843 1321361 1314364 1307188 1300987 1296282 1292403 1288340 1283648
49998 1283648 1278370 1272558 1266519 1261462 1259156 1260423 1264218 1268675 1272969 1277777 1284058 1291995 1301263 1311680
49984 1311680 1323082 1334806 1345856 1355677 1364680 1374053 1385088 1398281 1412765 1426917 1439870 1452170
49972 1452170 1464582 1476759 1487819 1497938 1508319 1519559 1531140 1542904 1555954 1571387 1588930
49961 1588930 1607700 1627620 1649099 1671830 1695060 1718813 1743599 1768825 1792615 1813525 1831609
49950 1831609 1847472 1861210 1872769 1882526 1890713 1896597 1898712 1895641 1886230 1869588 1845498 1814799
49938 1814799 1779021 1739806 1698811 1657785 1618351 1581755 1548863 1519922 1494196 1470297 1447231
49927 1447231 1424870 1403373 1382801 1363600 1346668 1332288 1319355 1306192 1291900 1276561 1260513
49916 1260513 1243842 1226230 1207062 1186306 1165529 1147094 1131711 1117624 1103030 1088333 1074932
49905 1074932 1062846 1051213 1040502 1032149 1025968 1019914 1012916 1006218 1001169 997283 993628 990845 990395
49892 990395 992513 996103 1000267 1004975 1010647 1017949 1027576 1039334 1051785 1063675 1075455 1088428 1102531
49879 1102531 1115936 1126849 1134821 1140256 1143543 1145052 1145270 1144363 1141887 1137193 1129952 1120132 1107839 1093446
49865 1093446 1077782 1061993 1047233 1034327 1023512 1014474 1006773 1000200 994610 989768 985774 983471 983738
49852 983738 986239 989378 991784 993493 995417 998074 1001349 1005236 1010070 1015873 1021939 1027508 1032618 1038004
49838 1038004 1044364 1052121 1061848 1074284 1089538 1106426 1122841 1136754 1146939 1153301 1156824 1158874
49826 1158874 1160118 1160268 1159062 1156964 1154381 1150687 1144888 1136942 1127435 1116072 1101748 1084526 1066540
49813 1066540 1050331 1036907 1025861 1016503 1008174 1000178 992327 985267 979587 974930 970581 966512 963203
49800 963203 960851 959639 960516 964714 972400 982467 993660 1005386 1017479 1029913 1042847 1056408 1070293
49787 1070293 1083913 1096848 1108805 1119431 1128667 1137017 1144790 1151248 1155251 1156628 1156128 1154139 1150298
49774 1150298 1144398 1136812 1127989 1118380 1108864 1100233 1092016 1082929 1072829 1063154 1054989 1047902 1041496 1036903
49760 1036903 1035410 1036317 1037571 1038410 1040173 1044523 1051802 1061221 1071754 1082599 1093398 1104285 1115360
49747 1115360 1126095 1135756 1144282 1152112 1159073 1164229 1167072 1168217 1168488 1167805 1165476 1161284 1155743 1149385
49733 1149385 1142264 1134271 1125587 1116530 1106966 1096181 1083660 1070015 1056783 1045044 1034501 1024225
49721 1024225 1013955 1004194 995277 987220 980576 976520 975446 975944 975778 973689 969978 965858 962994 963277
49707 963277 967780 975511 983965 991539 998957 1007825 1018332 1029293 1040128 1051467 1063340 1073946 1081440
49694 1081440 1086500 1091711 1098022 1103023 1103593 1099552 1093505 1087445 1080954 1073102 1064622 1057006 1050242 1043002
49680 1043002 1035037 1027975 1023288 1020532 1018224 1015646 1013003 1010613 1008935 1008855 1010771 1013616 1015882 1017493
49666 1017493 1019528 1022190 1024433 1025911 1027859 1031434 1036523 1043040 1052062 1064262 1078252 1092100 1105922
49653 1105922 1121255 1138043 1153811 1165974 1173567 1176771 1176387 1174226 1172395 1171339 1169686 1166548 1162717
49640 1162717 1158954 1154748 1150084 1146960 1147193 1149426 1150132 1147356 1141890 1135098 1127563 1120117 1114259 1110520
49626 1110520 1107734 1104886 1102780 1103066 1106485 1113002 1122717 1135442 1149871 1164393 1178599 1193071 1207977
49613 1207977 1223097 1239195 1257867 1279308 1301062 1319772 1333700 1343048 1348573 1350940 1351210 1350896 1351224
49600 1351224 1352848 1356391 1362556 1371229 1380832 1389082 1394250 1395378 1391484 1381273 1364120 1341290 1315797
49587 1315797 1290678 1267283 1245401 1225002 1207245 1193283 1182549 1173211 1164323 1156518 1150283 1144725
49575 1144725 1138943 1133659 1130206 1128350 1126555 1124187 1121975 1119971 1116681 1111115 1104550 1099088 1095054 1090931
49561 1090931 1085445 1078618 1070964 1062793 1054567 1047125 1041172 1036896 1034109 1032259 1030352 1027628 1024656 1023140
49547 1023140 1024156 1026823 1029158 1030044 1030018 1030360 1031812 1034199 1036916 1039538 1042048 1044571 1046855 1048113 1047688
49532 1047688 1046059 1044976 1046128 1049550 1053607 1056712 1058772 1060792 1063469 1066710 1070205 1073736 1076843 1078882
49518 1078882 1079758 1080241 1081322 1083554 1086990 1091191 1095162 1097903 1099411 1100742 1102858 1106033 1110575 1117226
49504 1117226 1126128 1136180 1146328 1157011 1169191 1182191 1193598 1201545 1206335 1209604 1212500 1214840
49492 1214840 1215557 1213806 1209962 1205501 1201504 1197565 1192804 1187658 1183745 1181957 1181683 1182195 1183803 1187027 1191365
49477 1191365 1195628 1199215 1202523 1206289 1210932 1216363 1222195 1228303 1235303 1244201 1255389 1268373 1282721
49464 1282721 1298839 1317506 1338838 1361986 1385564 1407988 1427627 1443149 1454094 1461060 1465242 1467643
49452 1467643 1468809 1469372 1470524 1473355 1477782 1483062 1489575 1498945 1511468 1524405 1534118 1539212 1540148 1536524
49438 1536524 1526928 1511641 1493402 1474801 1456475 1438403 1421129 1404701 1388144 1371330 1356017
49427 1356017 1343738 1334072 1326427 1321923 1321431 1322862 1322889 1320891 1318889 1317771 1316143 1313342 1311205 1311750 1314637
49412 1314637 1317999 1320674 1322772 1325088 1328702 1334241 1340741 1346045 1349008 1350608 1352424 1354940 1357908 1361355
49398 1361355 1365244 1368863 1371515 1373338 1374713 1375406 1375140 1374483 1374262 1374372 1373971 1372629 1370606 1368288 1366168
49383 1366168 1365065 1365297 1365613 1364020 1360298 1356999 1357195 1361330 1366884 1371221 1374250 1377831 1383033 1388970 1394644
49368 1394644 1400975 1410026 1422646 1437980 1455137 1474231 1495690 1519740 1546981 1578395 1614047 1652267
49356 1652267 1690218 1724260 1749636 1761701 1759139 1745469 1726350 1705887 1686185 1669122 1656475
49345 1656475 1648518 1644219 1643181 1646226 1653810 1664965 1678221 1692719 1707991 1723392 1738226 1752083
49333 1752083 1764830 1776676 1788242 1800114 1812240 1824026 1834684 1843015 1847489 1847636 1845137 1842259
49321 1842259 1839126 1833735 1824940 1814251 1804031 1794925 1785878 1776053 1765938 1756851 1749873 1745016 1741244
49308 1741244 1737688 1734936 1734669 1737892 1743995 1751430 1758469 1763409 1765304 1764939 1763994 1762895 1760673 1757345 1754658
49293 1754658 1753314 1751085 1745498 1737342 1729481 1722923 1716386 1709593 1704429 1702096 1701269 1700291 1699560 1700196 1701573
49278 1701573 1701893 1700668 1698916 1696962 1693558 1687595 1679629 1671165 1663118 1655597 1648735 1643125 1639564 1638702
49264 1638702 1640847 1645815 1653043 1662045 1672788 1685558 1700606 1718031 1737537 1757628 1775032 1785772
49252 1785772 1787638 1781705 1771150 1758593 1744674 1728804 1710667 1690859 1670486 1650416 1630882 1611874
49240 1611874 1594020 1578778 1567227 1558794 1551822 1545549 1540915 1539110 1539823 1541311 1541887 1541050 1539486 1538368
49226 1538368 1538439 1539506 1540828 1541916 1542489 1541764 1538649 1533088 1526578 1520837 1516403 1512967 1510479 1509207 1509112
49211 1509112 1509850 1511134 1512513 1513207 1512840 1512140 1512196 1513036 1513401 1511872 1508144 1503656 1501181 1502874 1508004 1513399
49195 1513399 1516973 1520026 1525098 1532651 1541537 1552025 1566150 1584885 1606712 1629265 1650781 1669635
49183 1669635 1684276 1694479 1701284 1705002 1704660 1700185 1693655 1687275 1681193 1674309 1666156 1656982 1647219 1638111
49169 1638111 1631809 1629358 1629375 1630073 1631789 1635992 1642542 1649717 1656622 1663773 1671407 1678918 1686202 1694036 1702759
49154 1702759 1711804 1720847 1730245 1739982 1749497 1759019 1769989 1783511 1799278 1816469 1834705 1853606
49142 1853606 1872453 1891183 1910990 1932964 1956510 1979849 2001749 2022170 2041583 2060384 2078850
49131 2078850 2097113 2115146 2132985 2150767 2168263 2184774 2199892 2214129 2228263 2242154 2254708
49120 2254708 2265185 2274389 2284530 2297886 2315402 2336351 2359306 2383445 2408892 2436140 2465607
49109 2465607 2497838 2533612 2573417 2616674 2661393 2704394 2742094 2771708 2792283 2804867 2812017
49098 2812017 2817047 2822840 2830311 2838104 2844703 2850966 2859744 2872729 2888533 2904353 2918715 2931813 2943919
49085 2943919 2954747 2964485 2974467 2986246 3000253 3015679 3031521 3047539 3064243 3082180 3101474 3122005
49073 3122005 3143749 3166680 3190559 3215142 3240559 3267111 3294662 3322523 3350005 3376991 3404085
49062 3404085 3432339 3462463 3493930 3525195 3555301 3584900 3615091 3645845 3676711 3708852 3744961
49051 3744961 3786980 3835201 3889984 3952941 4025764 4109348 4205284 4316906 4446616 4591595 4742946
$$ [...]
##END NTUPLES=NMR SPECTRUM
##END=
