
##TITLE=UV1032_TOFR01-ROVE100A_6099457_6eYaFNhx15
##JCAMPDX= 6.0         $$ Bruker NMR JCAMP-DX V2.0
##DATA TYPE= NMR SPECTRUM
##DATA CLASS= NTUPLES
##ORIGIN= BRUKER
##OWNER= Administrator
$$ 1.72 TOPSPIN		Version 2.1
$$ 2012-05-12 23:27:59.984 -0500  Administrator@TOPSPIN
$$ Compression mode = diff/dup
##.OBSERVE FREQUENCY= 400.13188235
##.OBSERVE NUCLEUS= ^1H
##.ACQUISITION MODE= SIMULTANEOUS (DQD)
##.ACQUISITION SCHEME= undefined
##.AVERAGES= 8
##.DIGITISER RES= 22
##SPECTROMETER/DATA SYSTEM= spect
##.PULSE SEQUENCE= zg30
##.SOLVENT NAME= COFFEE_meoh
##.SHIFT REFERENCE= INTERNAL, COFFEE_meoh, 1, 14.98061
##AUDIT TRAIL= $$ (NUMBER, WHEN, WHO, WHERE, PROCESS, VERSION, WHAT)
$$ ##TITLE= Audit trail, TOPSPIN		Version 2.1
$$ ##JCAMPDX= 5.01
$$ ##ORIGIN= Bruker BioSpin GmbH
$$ ##OWNER= Administrator
$$ $$ C:\Bruker\TOPSPIN/data/COFFEE/nmr/UV1032_TOFR01-ROVE100A_6099457_6eYaFNhx15/10/pdata/1/auditp.txt
$$ ##AUDIT TRAIL=  $$ (NUMBER, WHEN, WHO, WHERE, PROCESS, VERSION, WHAT)
(   1,<2012-05-12 23:27:52.812 -0500>,<Administrator>,<TOPSPIN>,<go>,<TOPSPIN 2.1>,
      <created by zg
	started at 2012-05-12 23:26:46.281 -0500,
	POWCHK enabled, PULCHK disabled,
       configuration hash MD5:
       AF F2 23 6B 01 CD 40 DD E5 A1 38 A0 06 EA F7 77
       data hash MD5: 64K
       5A 81 CE 5D 02 1A 93 F7 BF 5F 20 6B 38 F3 08 07>)
(   2,<2012-05-12 23:27:55.687 -0500>,<Administrator>,<TOPSPIN>,<proc1d>,<TOPSPIN 2.1>,
      <Start of raw data processing
       efp LB = 0 FT_mod = 6 PKNL = 1 PHC0 = 0 PHC1 = 0 SI = 32K 
       data hash MD5: 32K
       B0 79 02 13 9F 9D 16 E6 A8 14 C7 93 65 50 AE 6A>)
(   3,<2012-05-12 23:27:56.093 -0500>,<Administrator>,<TOPSPIN>,<proc1d>,<TOPSPIN 2.1>,
      <pk PHC0 = 216.1066 PHC1 = 0 
       data hash MD5: 32K
       D8 17 D7 79 22 D4 0B 5C 27 83 81 D2 8B 59 82 A8>)
(   4,<2012-05-12 23:27:56.171 -0500>,<Administrator>,<TOPSPIN>,<proc1d>,<TOPSPIN 2.1>,
      <abs ABSG = 1 
       data hash MD5: 32K
       AD 0E 21 25 D4 90 D0 B1 F1 EA 83 1D B1 9E CC 75>)
(   5,<2012-05-12 23:27:56.203 -0500>,<Administrator>,<TOPSPIN>,<proc1d>,<TOPSPIN 2.1>,
      <abs ABSG = 2 
       data hash MD5: 32K
       AF 87 45 B6 46 02 24 38 35 5F 9D 40 4D 06 D3 AE>)
(   6,<2012-05-12 23:27:56.234 -0500>,<Administrator>,<TOPSPIN>,<proc1d>,<TOPSPIN 2.1>,
      <abs ABSG = 3 
       data hash MD5: 32K
       81 47 03 CD 3A 5C 8D 3A 37 7E 24 75 F9 FC 31 D7>)
(   7,<2012-05-12 23:27:56.265 -0500>,<Administrator>,<TOPSPIN>,<proc1d>,<TOPSPIN 2.1>,
      <abs ABSG = 4 
       data hash MD5: 32K
       34 1B FD 2E F8 0C A7 CB F3 C3 D9 D3 97 06 74 B6>)
(   8,<2012-05-12 23:27:56.296 -0500>,<Administrator>,<TOPSPIN>,<proc1d>,<TOPSPIN 2.1>,
      <abs ABSG = 5 
       data hash MD5: 32K
       F7 63 01 6F 46 52 E9 18 5D 60 FE 33 94 A1 5C AF>)
$$ ##END=
$$ 
$$ $$ hash MD5
$$ $$ 3E 72 DB 5C EE F0 B8 97 88 89 6D AF FA 3F DF B1
##$RELAX= 
##$RELAX= 
##$RELAX= 
##$RELAX= 
##$RELAX= 
##$RELAX= 
##$RELAX= 
$$ Bruker specific parameters
$$ --------------------------
$$ [...]
##$TP= (0..7)
150 150 150 150 150 150 150 150
##$TP07= 0
##$TPNAME0= <>
##$TPNAME1= <>
##$TPNAME2= <>
##$TPNAME3= <>
##$TPNAME4= <>
##$TPNAME5= <>
##$TPNAME6= <>
##$TPNAME7= <>
##$TPOAL= (0..7)
0.5 0.5 0.5 0.5 0.5 0.5 0.5 0.5
##$TPOFFS= (0..7)
0 0 0 0 0 0 0 0
##$TUNHIN= 0
##$TUNHOUT= 0
##$TUNXOUT= 0
##$USERA1= <user>
##$USERA2= <user>
##$USERA3= <user>
##$USERA4= <user>
##$USERA5= <user>
##$V9= 5
##$VALIST= <valist>
##$VCLIST= <CCCCCCCCCCCCCCC>
##$VD= 0
##$VDLIST= <DDDDDDDDDDDDDDD>
##$VPLIST= <PPPPPPPPPPPPPPP>
##$VTLIST= <TTTTTTTTTTTTTTT>
##$WBST= 2048
##$WBSW= 25
##$XGAIN= (0..3)
0 0 0 0
##$XL= 0
##$YL= 0
##$YMAX_a= 537718
##$YMIN_a= -629733
##$ZGOPTNS= <>
##$ZL1= 120
##$ZL2= 120
##$ZL3= 120
##$ZL4= 120
##$ABSF1= 14.98061
##$ABSF2= -5.57192
##$ABSG= 5
##$ABSL= 3
##$ALPHA= 0
##$AQORDER= 0
##$ASSFAC= 0
##$ASSFACI= 0
##$ASSFACX= 0
##$ASSWID= 0
##$AUNMP= <proc_prof1d_extract_pilot.lims>
##$AXLEFT= 0
##$AXNAME= <>
##$AXNUC= <1H>
##$AXRIGHT= 0
##$AXTYPE= 0
##$AXUNIT= <>
##$AZFE= 0.1
##$AZFW= 0.1
##$BCFW= 0
##$BC_mod= 0
##$BYTORDP= 0
##$COROFFS= 0
##$CY= 15
##$DATMOD= 1
##$DC= 0
##$DFILT= <>
##$DTYPP= 0
##$F1P= 0
##$F2P= 0
##$FCOR= 0.5
##$FTSIZE= 32768
##$FT_mod= 6
##$GAMMA= 0
##$GB= 0
##$INTBC= 1
##$INTSCL= 1
##$ISEN= 128
##$LB= 0
##$LEV0= 0
##$LPBIN= 0
##$MAXI= 10000
##$MC2= 0
##$MEAN= 0
##$ME_mod= 0
##$MI= 0
##$NCOEF= 0
##$NC_proc= -8
##$NLEV= 6
##$NOISF1= 0
##$NOISF2= 0
##$NSP= 0
##$NTH_PI= 0
##$NZP= 0
##$OFFSET= 14.98061
##$PC= 1
##$PHC0= 216.1066
##$PHC1= 0
##$PH_mod= 1
##$PKNL= yes
##$PPARMOD= 0
##$PPDIAG= 0
##$PPIPTYP= 0
##$PPMPNUM= 2147483647
##$PPRESOL= 1
##$PSCAL= 4
##$PSIGN= 0
##$PYNMP= <proc.py>
##$REVERSE= no
##$SF= 400.13
##$SI= 32768
##$SIGF1= 0
##$SIGF2= 0
##$SINO= 400
##$SIOLD= 32768
##$SPECTYP= <>
##$SREGLST= <1H.CDCl3>
##$SSB= 0
##$STSI= 32768
##$STSR= 0
##$SW_p= 8223.68421052632
##$SYMM= 0
##$S_DEV= 0
##$TDeff= 65536
##$TDoff= 0
##$TI= <>
##$TILT= no
##$TM1= 0
##$TM2= 0
##$TOPLEV= 0
##$USERP1= <user>
##$USERP2= <user>
##$USERP3= <user>
##$USERP4= <user>
##$USERP5= <user>
##$WDW= 1
##$XDIM= 32768
##$YMAX_p= 452336118
##$YMIN_p= -682892
##$CURPLOT= <Network HP LaserJet P1505>
##$CURPRIN= <$Network HP LaserJet P1505>
##$DFORMAT= <normdp>
##$LAYOUT= <+/1D_H.xwp>
##$LFORMAT= <normlp>
##$PFORMAT= <normpl>
##$SURQMSG= 1
$$ End of Bruker specific parameters
$$ ---------------------------------
##NTUPLES= NMR SPECTRUM
##VAR_NAME=  FREQUENCY,     SPECTRUM/REAL,   SPECTRUM/IMAG
##SYMBOL=    X,             R,               I
##VAR_TYPE=  INDEPENDENT,   DEPENDENT,       DEPENDENT
##VAR_FORM=  AFFN,          ASDF,            ASDF
##VAR_DIM=   32768,         32768,           32768
##UNITS=     HZ,            ARBITRARY UNITS, ARBITRARY UNITS
##FACTOR=    0.250966925370066, 1,           1
##FIRST=     8223.43324360095, 124723,       -302116
##LAST=      0,             58764,           93548
##MIN=       0,             -682892,         0
##MAX=       8223.43324360095, 452336118,    0
$$ Real data points
##PAGE= N=1
##DATA TABLE= (X++(R..R)), XYDATA
$$ [...]
19549G4862O833c881A0832a8865G4768f0492A69566J39911D6755a81462d9012
19537b09652a8530E0583b0002j09935B5247M5525b6496E3885a33595j84517J44459
19526a73653A54132B6939K57001i2313j6579A96486b32102p0149g2107l36664
19516d08771E0412b06946j5758H0381J19731a1943j84215G6423i1150d3115k41763
19505b84878M0344L6984B42824i3341A3465J0663J60663H5352a35162m2338M5427
19494a32073C0844f3583e940j0270j31394K9472B67376b9798A71417c48750C9150
19482a31493A36249f1F6930c6732m44858C4279D379a77301R598d3430k78857R6059
19470b26228j5927o6982A11861a2086A51634a82814G7333i2532C6876R674P781
$$ y = [74862, 81695, -3881, 10832, -18865, 74768, -60492, 169566, 309477, 46755, -181462, -49012, -209652, -18530, 50583, -20002, -129937, 25247, 70772, -26496, 53885, -133595, -318112, -173653, 154132, 26939, 283940, -92313, -108892, 196486, -232102, -302251, -72107, -408771, 50412, -206946, -222704, 80381, 200112, -11943, -196158, 76423, -91150, -43115, -284878, -244534, -207550, 242824, -93341, 13465, 24128, 184791, 85352, -135162, -177500, -132073, 30844, -63583, -5940, -16210, -147604, -118132, 267376, -29798, 171417, -348750, 39150, -131493, 136249, -61, 66930, -36732, -481590, 34279, 4379, -177301, -167703, -43430, -322287, -226228, -242155, -309137, 111861, -12086, 151634, -182814, 77333, -92532, 36876, 46550, 54331]
19459E4331b36687d3153j00761K8962b5797H4424b47171a12913n1506A85518b79247
19447a07124K2544A22308g588o6466H8104N6860k5335b54612A55381L1792r1455
19436I5718C1065b71811I7690h2584C45581e1936j04576F0524a37819I8463O1219
19425A59682F4488B3742a27834m5872A2140a05614k98509B03700c90828g8561
19414b71148A43211a86936K7256m6004B79262b80534E3281k988k4133d35609J41790
19403b93819I9053b55096k19630a52833A52003B1057J74403A85L09837A44535
19392A50296h9692k52280a4950l58609R1785M9644P5530J7603B63052b14213P4103
19381a40110k08979A69907n6811a65098g7061G7798l1259m384I967K29256Q2587
$$ y = [54331, -236687, -43153, -143914, -114952, -25797, 84424, -247171, -112913, -164419, 185518, -279247, -107124, -84580, 122308, -7588, -74054, 88104, 144964, 119629, -254612, 155381, 187173, 95718, 31065, -271811, 97690, -82584, 345581, -51936, -156512, 60524, -137819, 98463, 159682, 64488, 23742, -127834, -173706, 12140, -105614, -404123, 203700, -390828, -78561, -271148, 143211, -186936, -159680, -205684, 279262, -280534, 53281, 50293, 26160, -435609, -293819, 99053, -255096, -474726, -152833, 152003, 21057, 195460, 185, 310022, 144535, 150296, -89692, -341972, -14950, -373559, -281774, -232130, -156600, -138997, 263052, -214213, -140110, -349089, 169907, 113096, -165098, -77061, 77798, 46539, 42155, 9967, 239223, 321810]
19370C21810j48016a73226B35454a37550C5195c64014D68810b56201R0075f4510
19359f0725l85669a52670B35294c6271l50534a54005O920G7919g1102I2390a32065
19347a11875E7458j9289J72987c23007H760J19569c53143h7083j23063G5715a4441
19335C00079a40905n3978A04268J68488A03174b1201j62730D5024a57356E9419
19324f9265F8546k320d2362m2867J9451o4032j11690Q9292G3249c70226A02281
19312a86682A93606a22896A55033C3629F633b0384m66372F7212f7398c0121k40312
19301b70433e4961m3742j81817A2114J8836b08306h0444o9892P3419A46301h5228
19289C39374b58038d5545A49667a60880q1272B05242e4276k85510d8173m7419
$$ y = [321810, 173794, -173226, 235454, -137550, 35195, -364014, 468810, -256201, -166126, -64510, -60725, -446394, -152670, 235294, -36271, -386805, -154005, -147085, 77919, -71102, 92390, -132065, -111875, 57458, 38169, 211156, -323007, 8760, 128329, -353143, -87083, -210146, 75715, -14441, 300079, -140905, -194883, 104268, 272756, 103174, -21201, -183931, 45024, -157356, 59419, -69265, 68546, 66226, -42362, -85229, -65778, -129810, -241500, -152208, 73249, -370226, 102281, -186682, 193606, -122896, 155033, 33629, 6633, -20384, -486756, 67212, -67398, -30121, -270433, -54961, -98703, -280520, 12114, 30950, -208306, -80444, -150336, -76917, 146301, -85228, 339374, -258038, -45545, 149667, -160880, -242152, 205242, -54276, -339786, -48173, -95592]
19279i5592H0978c35340M9508A50864a9826I4223Q1924a41822C9249A5377b1132
19267F4874J85505b01852k34L0874O0840j10373K1748E0518b92601c6689q1892
19256a18581k82216a33555N960p6593L8030c9717g609C8074a44159M2735G3839
19244h2512j72487G3148a8173K791j8131B20116J33418I4070P5904a45379j58116
19233c03495Q5470P5569B6868b25624l73884A2993c82966G0014a90009D3739f1645
19221A36435a45632q4079J10325M6818a79l22282G6633J9480J31466n3123a31737
19209D2179A6292a64997e7542b5875B00998q3485c52842c2252n8016A24795c73732
19197g1475j41296B55810c518l577l85950J90037O9432A80277C3874a21504b8560
$$ y = [-95592, 80978, -335340, -285832, 150864, -19826, 94223, 176147, -141822, 39249, 15377, -21132, 64874, 250379, -201852, -202086, -171212, -110372, -220745, -198997, 50518, -292601, -36689, -118581, -400797, -133555, -127595, -204188, -166158, -39717, -7609, 38074, -144159, -101424, 73839, -82512, -254999, 73148, -18173, -15382, -33513, 220116, 353534, 94070, 169974, -145379, -303495, -218025, -142456, 26868, -225624, -599508, 12993, -382966, 70014, -190009, 43739, -61645, 136435, -145632, -229711, -119386, -72568, -179, -322461, 76633, 96113, 227579, 174456, -131737, 42179, 16292, -164997, -57542, -25875, 200998, 117513, -352842, -32252, -90268, 124795, -373732, -71475, -212771, 255810, -3518, -7095, -393045, -203008, -133576, 180277, 33874, -121504, -28560]
19185A67770C1275P1553J1792l7053g2552j30349A67753i4936l080A8024a67061
19173C6791a77414A21666b15804M7944P3519j03009g5121K0995h402A1023c27126
19161e8443F1250a2637l40961a63774e1196o9405b7122k16032J9709E7360a28974
19149f7556A59818B3047P3673b40939e4375k117j71283Q3902A20577A3715b09231
19137d65287a95314A07603l3029i9531J1082j00586j0694C29603a46708A10445
19126i0835A06744h7943k18664f2562E6977L62192E6077e3687A53958p1707b85568
19114a45136A398J10614b03583A26798d15720J80839L0548r750B25917C0234H681
19102f9629m287H3090j2841c11407c0667Q795k61128A04000M3437O0503D4490
$$ y = [167770, 31275, 102828, 114620, 77567, -72552, -202901, 167753, -94936, -98016, 18024, -167061, 36791, -177414, 121666, -215804, -167860, -94341, -197350, -75121, -54126, -8402, 11023, -327126, -58443, 61250, -12637, -353598, -163774, -51196, -120601, -27122, -243154, -223445, 57360, -128974, -67556, 159818, 23047, 96720, -240939, -54375, -56492, -227775, -143873, 120577, 13715, -209231, -465287, -195314, 107603, 74574, -99531, -88449, -189035, -199729, 329603, -146708, 110445, -90835, 106744, -87943, -306607, -62562, 56977, 419169, 56077, -53687, 153958, 82251, -285568, -145136, 1398, 112012, -203583, 126798, -415720, -234881, -204333, -214083, 225917, 30234, 8681, -69629, -73916, 83090, 70249, -311407, -30667, -21872, -283000, 104000, 147437, 207940, 44490]
19090b74687c9194J1306I6716K60230I4662q343J8516c6912l14394a04746B5445
19078a59798G6808L8021m5646a0882k76738J15387M1076G161M0770c63273E7046
19066g2688d728p8251m1705C3855c666B47755Q8882a03635j35652g3636j17839
19055a91475A56128C7724b06936N6801A25900J73891c24551L623m352J61904O8594
19044i4782j13351A3604a91422g0897A30999d3352A1540N4323L8164L4205b8787
19032H8675a23924j67462C16203f9427M030a3436A88625f5734q9868b2266D2529
19020F7647L68920a28510l1331B38005B7065f8991A94827i8881C06444J2738a67589
19008c1883k15306e9209A48305a83311A22457C6280P1643a31055q3056j21146
$$ y = [-274687, -39194, -27888, 96716, 356946, 94662, 86319, 104835, -36912, -351306, -104746, 25445, -159798, 76808, 114829, 69183, -10882, -287620, -172233, -131157, 7161, 47931, -363273, 57046, -72688, -4728, -82979, -124684, 33855, -3666, 247755, 336637, -103635, -239287, -73636, -191475, 156128, 37724, -206936, -150135, 125900, 299791, -324551, -320928, -325280, -163376, -94782, -208133, 13604, -191422, -70897, 130999, -43352, 11540, 65863, 104027, 138232, -28787, 88675, -123924, -291386, 316203, -69427, -65397, -13436, 188625, -65734, -155602, -22266, 42529, 67647, 436567, -128510, -159841, 238005, 27065, -68991, 194827, -98881, 306444, 319182, -167589, -31883, -247189, -59209, 148305, -183311, 122457, 36280, 107923, -131055, -214111, -335257]
18998c35257c8789j50939m370j09097L6825p4384A55688j7612e608C926K18430
18987B22356j3392e6725e756j8288l11726B25260a83828l24771G1304b92068B27769
18975e6513e065j0866B4986c4127A9998g598j88686b5476D2900R8393c77983a20597
18962b18215L9529C13149n5611H6670a50383B25184A09827N4818a46680l50647
18952d97327K31167R0803M6507k2383A7055L2487J88970o358E8155i0290O382
18941h3908o7538B1408L2083J03957c1457A44953b88865J44169D3824b13017A52957
18929i8644D0748a26742B8259J71038I8775J00828b70333P5381A45021c90374
18918a92942b8460a0348B02646J27752H9850J29024a18665j261r597C36326A40721
$$ y = [-335257, -38789, -189728, -194098, -303195, -266370, -340754, 155688, 138076, -5608, 3926, 222356, 208964, -56725, -5756, -24044, -335770, 225260, -183828, -508599, 71304, -292068, 227769, -56513, -5065, -15931, 24986, -34127, 19998, -7598, -196284, -25476, 42900, 141293, -377983, -120597, -218215, -178686, 313149, 257538, 86670, -150383, 225184, 109827, 164645, -146680, -497327, -266160, -175357, -128850, -151233, 17055, 49542, 238512, 232154, 58155, -90290, -83908, -151446, 21408, 53491, 157448, -31457, 144953, -288865, -144696, 43824, -213017, 152957, -98644, 40748, -126742, 28259, 199297, 98775, 199603, -270333, -194952, 145021, -390374, -192942, -28460, -10348, 202646, 330398, 89850, 218874, -118665, -119926, -129523, 336326, 140721]
18906a60779j48388b0109j32675A3960c50715E1473D643i1218I2959J35209a25506
18894b46705a7428q4827r5579i5241i975k51605A01998d4218j959j57301g3477
18882c4663B79572F5882a51249k8460I8170c6380m9148p9629M5030A21150C2273
18870a61463A10417a23826d4428k27789a0492j08794B6885e3574C6860a51702
18859F6045N3654i793l84275f0706j17226C773c75782R3631A70802O331H437c35086
18846h743q9869G7819l3704e1468G674P5949d33654B37417a16926k07644B02578
18834a62984C5888g4891j95632a17872f537A8599O7606G244b2054k17705p7570
18823c17329c162I9521J53293c05751B3091O7308J9382a80084N9317A49166a53790
$$ y = [-160779, -309167, -20109, -152784, 13960, -350715, 51473, 4643, -91218, 92959, 228168, -125506, -246705, -17428, -102255, -197834, -95241, -9975, -261580, 101998, -44218, -46177, -203478, -73477, -34663, 279572, 65882, -151249, -179709, 98170, -36380, -85528, -165157, -120127, 121150, 32273, -161463, 110417, -123826, -44428, -272217, -10492, -119286, 26885, -53574, 36860, -151702, 66045, 119699, -9793, -394068, -60706, -177932, 3773, -375782, -282151, 170802, 177133, 8437, -335086, -8743, -98612, 77819, 44115, -51468, 7674, 83623, -433654, 237417, -116926, -324570, 202578, -162984, 35888, -74891, -270523, -117872, -6537, 18599, 86205, 7244, -22054, -239759, -317329, -3162, 99521, 252814, -305751, 23091, 90399, 109781, -180084, -120767, 149166, -153790]
18811c9476j31152b2271G4902L2442e1379G5745a70586B31400P2510G1181a82064
18799G8698c6561k20974f5876A14815J6660b46321A87956e0765k08511g8060G7168
18787a05698H1265R7979a43995A66976a14595A28777R3178c83974A59130E3670
18776D4349N289c6866H4614L65Q8254C6745J14963b16514A50345a26074a9133
18764a72699O4080j48600B9808Q1796A7830Q5173a13131R115k34239I0444d57962
18752b31962a278j73878n9431J9052B7166b48088Q8705A50761a10682j16002D2838
18740D4539J16803D5640c63136F051b55259E958J80327b7558r3408j07668j02845
18729c31479C90208B2439h0297A25436a53122E0025e1111k6873A03549o301L0343
$$ y = [-39476, -170628, -22271, 74902, 107344, -51379, 75745, -170586, 231400, 303910, 71181, -182064, 78698, -36561, -257535, -65876, 114815, 131475, -246321, 187956, -50765, -259276, -78060, 77168, -105698, 81265, 179244, -143995, 166976, -114595, 128777, 221955, -383974, 159130, 53670, 44349, 49638, -36866, 84614, 84979, 173233, 36745, 151708, -216514, 150345, -126074, -19133, -172699, -108619, -257219, 29808, 111604, 17830, 103003, -113131, -104016, -338255, 90444, -457962, -231962, -1278, -175156, -234587, -215535, 27166, -248088, -159383, 150761, -110682, -226684, 42838, 44539, 161342, 45640, -363136, 6051, -255259, 5958, 186285, -27558, -120966, -228634, -331479, 390208, 22439, -80297, 125436, -153122, 50025, -51111, -77984, 103549, 97248, 127591]
18718A27591e8169k07636I1722M5447b62724a8772A57948b89863i7978n0746m4261
18707a92985o2497A32429e8881l5151C09436I5106b22793A7963J66283b5222A93591
18695a23257c6696l7467A59876o1602a23847d043l02657c1377B38957B5672F054
18683b69634K5382M5419P686l0064a01082k3268j83649R8326B16990a45237I6721
18671I405a65057j47325a4492l4917j83155i5547d1046p8812B59214b04702E9406
18659a8624k52008A41439J4743J02660J1809c19419Q5887o2288g8667a6695j7194
18648c3889J4641A11993f6870k2334A60409b10905f903B4434Q1091R5255B4208
18636a96254O9565j18059f1851F4026b63010f3568C50908G6602b02525D8212c25659
$$ y = [127591, -58169, -265805, 91722, 137169, -262724, -18772, 157948, -289863, -97978, -148724, -192985, -255482, 132429, -58881, -94032, 309436, 95106, -222793, 17963, 184246, -25222, 193591, -123257, -36696, -74163, 159876, 98274, -123847, -4043, -306700, -31377, 238957, 25672, 6054, -269634, -244252, -198833, -191147, -221211, -101082, -124350, -307999, -209673, 216990, -145237, 96721, 9405, -165057, -312382, -14492, -49409, -232564, -95547, -41046, -119858, 259214, -204702, 59406, -18624, -270632, 141439, 156182, 258842, 270651, -319419, -233532, -295820, -78667, -16695, -33889, -19248, 111993, -66870, -89204, 160409, -210905, -6903, 24434, 105525, 200780, 24208, -196254, -126689, -244748, -61851, 64026, -263010, -63568, 350908, 76602, -202525, 48212, -325659]
18624e5647j75823c9184p9336A30517b38401f3093D6386a7040l23465B3599b91336
18612a00274A5908g182A83664d48251a52295A3402d8607B9806a00176l4930p0784
18601b05890A80595G565a80269n3330a10354A3793R7291b1749k15455f7836A29864
18589a9513A13768b45711d016k8486j2104A8402K31075c4208D66111E5539H827
18577b01108A56077c20098A97552d6557r3345N5366j02935M4523h815j93247K590
18566a99472A99518N3110e06907J15414J44558N0342C82389a7735I6128L93723
18556D89851a63565p8942g6611j97974l2216a14810P426j5302Q687H6539c61423
18544i3471j07354P8066j54069J16311M7747o2444k0348d4254h45F188J9761K9821
$$ y = [-55647, -231470, -39184, -118520, 130517, -238401, -63093, 46386, -17040, -340505, 23599, -291336, -100274, 15908, -7182, 183664, -448251, -152295, 13402, -48607, 29806, -100176, -135106, -205890, 180595, 7565, -180269, -233599, -110354, 13793, 111084, -21749, -237204, -67836, 129864, -19513, 113768, -245711, -4016, -32502, -44606, 18402, 249477, -34208, 466111, 55539, 8827, -201108, 156077, -320098, 197552, -46557, -139902, -84536, -187471, -142948, -8815, -202062, -199472, 199518, 252628, -506907, -391493, -246935, -196593, 382389, -17735, 96128, 489851, -163565, -242507, -76611, -274585, -306801, -114810, -107384, -122686, -113999, 86539, -361423, -93471, -200825, -122759, -276828, -160517, -112770, -175214, -195562, -44254, -845, 6188, 25949, 55770]
18532E5770a80180m2740Q3543L1077q7577C9670I689K19698c02220P339B63018
18520A19754d17524G4222O0118f7263C2564P0289C9341J55638G0027c93243C4075
18508E3308b29747C25674a23642G3682g7368q7797l3314F5110b37843A84096r729
18497A74367K9228c61209B06464k258d9426A15806b24284h9636n9355O9128k1675
18486a01538A8055R801K38562a55694B73668g1068I2519b19721F8655m507b7486
18474f9546A1196K5336K376b10622j08323A30685K387a13967K4906a3461n5018
18463f8479E3894R877j4944b70552B2581Q5676J46646q9555h8580K1947m09091
18452d75724C31859G0979b08954j06822B26616O6185A07457a15305j123q5301
$$ y = [55770, -180180, -222920, -139377, -108300, -195877, 39670, 9689, 229387, -302220, -294881, 263018, 119754, -417524, 74222, 134340, -67263, 32564, 102853, 39341, 194979, 70027, -393243, 34075, 53308, -229747, 325674, -123642, 73682, -77368, -165165, -198479, 65110, -237843, 184096, 174367, 203595, -361209, 206464, 204206, -49426, 115806, -224284, -89636, -148991, -79863, -101538, 18055, 27856, 266418, -155694, 273668, -71068, 92519, -219721, 68655, 64148, -27486, -69546, 11196, 36532, 38908, -210622, -318945, 130685, 133072, -113967, -89061, -13461, -68479, 53894, 63771, 48827, -270552, 22581, 108257, 254903, 165348, -88580, -66633, -475724, 331859, 70979, -208954, -315776, 226616, 292801, 107457, -115305, -116428, -201729]
18442b01729A90832b63653M7895i7001n4554a0147p3353r2403j32183J49449g6691
18430b18754J08895C28183H5222e4628J752l28712A22897e8223n795j44851i2340
18418E6065c8117j86803B1316h5647J524H8948b76978N7587A23492a29049K4652
18407a04397q4255k7105c3598A71309N3121a1709j11411A71936K4751P464q4706
18396A19445J16679j2849r5138K01806a48606I6452A6500a57239D9369c7273l67186
18385d04459F1010a02295B27554B611b89958e3774c435l48124L4935h015H7922
18373c17305e5736B5785f2180k54916a24348e836B63936A14957A2338L0336b02448
18361a36107H4862i7022C1316K2578a53251j73252b4714k16105f1688A31633b47655
$$ y = [-201729, 190832, -263653, -215758, -97001, -151555, -10147, -83500, -175903, -308086, -158637, -76691, -218754, -109859, 328183, 85222, -54628, -52876, -381588, 122897, -58223, -64018, -208869, -92340, 56065, -38117, -224920, 21316, -85647, -84123, 88948, -276978, -219391, 123492, -129049, -104397, -188652, -215757, -33598, 171309, 224430, -11709, -123120, 171936, 196687, 204151, 119445, 236124, 223275, 128137, 329943, -148606, 96452, 16500, -157239, 49369, -37273, -404459, 61010, -102295, 227554, 2611, -289958, -53774, -3435, -351559, -316624, -8015, 87922, -317305, -55736, 25785, -62180, -317096, -124348, -5836, 263936, 114957, 12338, 42674, -202448, -136107, 84862, -97022, 31316, 53894, -153251, -326503, -24714, -240819, -61688, 131633, -247655]
18349h7833j79800A53873i0208A63436Q1546a99741E1417c00028P5579M2603C5521
18337i6285A51310J7363b86683G9842a18076E3292g9725D51772a82129A20772
18326a1989l2950h11D9377b3615I4967L9966N6753K8055e5200q3381n1310b4317
18313a5821j17273K6884c8244j56854R1643j984a6287k3742j11830C2027c06198
18301c31440A36392i0881L6651I971L13554N3202b90143d9910m8895k058j32615
18290b33478l5806j15230Q5737B65724b39349a1245j090j60263A95211l8555D4756
18278C01271B6031a74590n9879A7689b01758A75047F8006O39c40354d8271B7150
18266B31954a1105n0689G2777g1297j4083k68608f5188o2007B930J93591a04724
$$ y = [-87833, -267633, 153873, -90208, 163436, 244982, -199741, 51417, -300028, -224449, -181846, 35521, -96285, 151310, 168673, -286683, 79842, -118076, 53292, -79725, 451772, -182129, 120772, -11989, -44939, -811, 49377, -23615, 94967, 134933, 191686, 219741, -55200, -138581, -189891, -24317, -15821, -133094, -106210, -38244, -195098, -103455, -105439, -16287, -40029, -151859, 32027, -306198, -331440, 136392, -90881, -54230, 9971, 323525, 376727, -290143, -49910, -98805, -100863, -233478, -269284, -384514, -298777, 265724, -239349, -11245, -12335, -172598, 195211, 156656, 44756, 301271, 26031, -174590, -234469, 17689, -201758, 175047, 68006, 68645, -340354, -48271, 27150, 231954, -11105, -61794, 72777, -71297, -85380, -353988, -65188, -127195, 2930, 196521, -104724]
18254c1255l0903l7788j52661o4992e8862j12774J7057I1566k868a85542l7233
18243b22775I0214j1127a63834F4285K04773H227a31645N3614H7480i1436q3648
18232a75084j0882Q5099m44151a10241j84763A04147a50077B5560e6789j20708
18222a77497I8901J00338a90715Q139O3303N0497A66363a79386A67486e6473A25520
18210a53873B34551H7397e110A10279a26269J4089C6146L46685B1102a14737K2681
18199i2056L4314k54889b1900D2824L290P177c71987D7825b07508l8202C5486
18187G6072J38003l516J62789b33895o8069i3001j39506E4146K875J34443A8229
18175B9678O4581J36954d3420j29379e9762j14605Q6392C4495b37595P3417k3447
$$ y = [-31255, -62158, -99946, -252607, -317599, -58862, -171636, -154579, 91566, 88698, -185542, -222775, 90214, 79087, -163834, 64285, 269058, 8227, -131645, -78031, 87480, -91436, -175084, -185966, -100867, -545018, -110241, -295004, 104147, -150077, 25560, -56789, -177497, 98901, 199239, -190715, -182576, -119273, -68776, 166363, -179386, 167486, -56473, 125520, -153873, 234551, 87397, -5110, 110279, -126269, -112180, 36146, 382831, 21102, -114737, -92056, -57742, -312631, -21900, 42824, 46114, 53291, -371987, 47825, -207508, -245710, 35486, 76072, 214075, 210559, 373348, -233895, -301964, -93001, -232507, 54146, 57021, 191464, 18229, 29678, 94259, 231213, -43420, -172799, -59762, -174367, -87975, 34495, -237595, -164178, -187625]
18164a87625q4917E6524f4673l16225g3759k1167L5631p4028G6818d2399D3371
18152g5467E9321L0453b99763A09717a32615m07531a01282b2263a922k91304A4675
18140A97571a02702C84597E4765f195A90590a61134B8775a4406G0494a25299A28989
18128C09876a49213P3289B71452d47868A09661O6661f3395i201A83071b84923
18117A29921a93018M3475A04681a66034N6818j57171l1590C58223a2934B3708
18106c52140c4776l484n9035d0314k49062F4230I432a39654C02276b515m79737
18095d82252A26508h9153o3477n6593J9304P6907j75165J32854q9129P5579A74317
18083b21894i4384k9151p5390a7143j30611H6321a06206k82586e932H3436h8238
$$ y = [-187625, -272542, 56524, -64673, -380898, -73759, -94926, -59295, -133323, 76818, -42399, 43371, -75467, 59321, 89774, -299763, 109717, -132615, -540146, -101282, -22263, -1922, -293226, 14675, 197571, -102702, 384597, 54765, -6195, 190590, -161134, 28775, -14406, 70494, -125299, 128989, 309876, -149213, -75924, 271452, -447868, 109661, 176322, -63395, -9201, 183071, -284923, 129921, -193018, -149543, 104681, -166034, -109216, -266387, -297977, 358223, -12934, 23708, -352140, -34776, -38260, -97295, -40314, -289376, 64230, 9432, -139654, 302276, -2515, -482252, 126508, -89153, -152630, -209223, -189919, -113012, -288177, -155323, -244452, -168873, 174317, -221894, -94384, -123535, -198925, -17143, -147754, 86321, -106206, -388792, -5932, 83436, -88238]
18071a92221M1045J9244N1087o0963B67212A05533b86766A40068J7864b24891
18060D1648f5779A47516B0833b9627l33361a30206J2416j68266h4875C2135J86091
18049B18226a93870A55557a27989B27485J34665a37013a4671A24057O6797B5463
18038D9050J29849c9939a1873C0102a20662J1662j17670Q0085B13899d0945H6058
18026c53791A8649J78559H3160a01735l600r4649R3055J1379A46828a44950E1830
18014G1059h5507A54801a26704C31884D7483a28922A13334A7399b21520e5271
18003A50942K6090a33133e4398n056B67308a39254k0919E4909J41254J4096A03242
17991A3712a65888G8918b45007A45421h3931j11495a7026A10372J17775e8829
$$ y = [-192221, -151176, -131932, -80845, -141808, 267212, 105533, -286766, 140068, 157932, -224891, 41648, -65779, 147516, 20833, -29627, -362988, -130206, -117790, -286056, -84875, 32135, 218226, -193870, 155557, -127989, 227485, 362150, -137013, -14671, 124057, 190854, 25463, 49050, 178899, -39939, -11873, 30102, -120662, -109000, -226670, -146585, 213899, -40945, 86058, -353791, 18649, 197208, 83160, -101735, -105335, -199984, -106929, -95550, 146828, -144950, 51830, 71059, -85507, 154801, -126704, 331884, 47483, -128922, 113334, 17399, -221520, -55271, 150942, 177032, -133133, -54398, -59454, 267308, -139254, -160173, 54909, 196163, 210259, 103242, 13712, -165888, 78918, -245007, 145421, -83931, -195426, -17026, 110372, 228147, -58829]
17980g3644j64985J05805B6952K06284G91N3916e3481C14720E582a79590A71055
17968a89151B2764a73090g187H166J13634b75266O0402D1958N018M3625b4775
17956D8870g0700J5898j26541L0374A51973J74727a61886g5717B2833d82297c2820
17944b2567A40498K51834g2446o4536G5298b6654o7296K307k5632m0895A60792
17932A11179O8166K01081B5885Q0544M7214C475a69540N1004J0635B77572a56706
17920A05675c93345F6088K8183M0305R3690a49476k83940a21690A7472J51478
17910A68950e4499l32208D417a45026k2816A505b38520B29894k6209B5752N1833
17899G7585m992b05933E4987b96065C82013F4212d03276A27692a07357j00256
$$ y = [-73644, -238629, -132824, 26952, 233236, 791, 54707, -53481, 314720, 5582, -179590, 171055, -189151, 22764, -173090, -7187, 8166, 121800, -275266, -214864, 41958, 46976, 90601, -24775, 48870, -70700, -54802, -181343, -150969, 151973, 326700, -161886, -75717, 22833, -482297, -32820, -22567, 140498, 392332, -72446, -136982, 75298, -26654, -93950, -91643, -117275, -158170, 160792, 111179, 179345, 380426, 25885, 106429, 153643, 3475, -169540, -118536, -107901, 277572, -156706, 105675, -393345, 66088, 94271, 134576, 228266, -149476, -433416, -121690, 17472, 168950, -54499, -386707, 4417, -145026, -167842, 1505, -238520, 229894, 203685, 25752, 77585, 72593, -205933, 54987, -296065, 382013, 64212, -403276, 127692, -107357, -207613]
17889b07613h0300C36304a15048F8504c5464A37580A3342K80640D393a93447Q880
17878a84567B78226i016p788k2769a8679l5284j47355k0743J08340A38347f1460
17866b93741h6199b0029j02646A40295n7874a1010k23432A23236a9240A7256J91103
17855B08359J97867A70583a12121l8643D1324M1848b56420J22305A35614h8639
17844c8719A39955C8177Q1626H219c0858B70326F4985L00900a2021D8675a61212
17832A14432Q7690c80428a03023l8922a6587j7134B79289Q432D5136b60779g7874
17820i9630C8725K51258E1465f6875k83396J52102J2013j96567A32338a04695
17809g6002H7547h0654j31336A37854b03833B82326b14719A24114f098k0347G1399
$$ y = [-207613, -80300, 336304, -115048, 68504, -35464, 137580, 13342, 293982, 4393, -193447, -184567, 278226, -9016, -16804, -39573, -18679, -53963, -201318, -222061, -113721, 138347, -61460, -293741, -86199, -20029, -122675, 140295, 82421, -11010, -234442, 123236, -19240, 17256, 208359, 406226, 170583, -112121, -150764, 41324, 83172, -256420, -134115, 135614, -88639, -38719, 139955, 38177, 119803, 8219, -30858, 270326, 64985, 365885, -12021, 48675, -161212, 114432, 202122, -380428, -103023, -141945, -16587, -33721, 279289, 287721, 45136, -260779, -77874, -99630, 38725, 289983, 51465, -66875, -350271, -198169, -186156, -382723, 132338, -104695, -76002, 87547, -80654, -211990, 137854, -203833, 282326, -214719, 124114, -6098, -26445, 71399]
17797a94874A7879M3179a39080E6694I839l263O3544b33294A16033a92382K7079
17786a65303c6174j9178J623E5a23251D2325e0080k91043A02209A6985M320e5863
17773A62023d164j13226c1161A22116a79790A24601J7458B1337Q8335J12973o2137
17762A60508B2924K55471a58004C57920F7648L05422A01700i5613A43586a09461
17751B37185P9038B6674P1025a27776k24341J37501a0462j6906k18264H8956a64568
17739F7849b7468B74984e1153H7153J11638q0387b9845j22908A1873c9652E2515
17727a383A00043A6103M2487a59420C396O1316J67618m3759p5163R5903b22106
17715B31434r0607N1477H9350a48335B10292J3043b47076B41623P7503e0794B9165
$$ y = [-194874, 17879, 61058, -139080, 56694, 9839, 6576, 70120, -233294, 116033, -192382, -165303, -36174, -55352, -53729, 55, -123251, 42325, -50080, -341123, 102209, 16985, 21305, -55863, 162023, -4164, -117390, -31161, 122116, -179790, 124601, 142059, 21337, 109672, 222645, 160508, 22924, 278395, -158004, 357920, 67648, 373070, 101700, -95613, 143586, -109461, 237185, 316223, 26674, 97699, -127776, -352117, -214616, -10462, -27368, -245632, 88956, -164568, 67849, -27468, 274984, -51153, 87153, 198791, 118404, -29845, -152753, 11873, -39652, 52515, -1383, 100043, 16103, 58590, -159420, 3396, 64712, 232330, 188571, 113408, 209311, -222106, 231434, 140827, 192304, 89350, -148335, 210292, 223335, -247076, 241623, 319126, -50794, 29165]
17703b3141B5805J8362J0591a75234E1303O374J30945L8447d4906D4623a14613
17691B67946q5453b2627j28179B95697G2823a25965c6766B67452A01753b97620
17680g3453I6294j8868o144N7277B9425n114a84621c4122k65014B60922a4696
17668h1826L1740a1518D7283I0b34686C8698g2063C81405j44961q1291D7786g5571
17655i1717q5023m5498m1306A3612K38083J23086q2191h3893L1947A40611k8451
17644A12160P5152o2912c2636C1320a69175A75341a2517m0140A52211K42332G0358
17632f5066b371E2370A1792K1083K00408a60279H1403R4948D7484a79972A00330
17620B96329e1793A41843A9610c88993A50690J64105a05402B79052b8854A71092
$$ y = [-23141, 25805, 44167, 54758, -175234, 51303, 57677, 188622, 227069, -44906, 44623, -114613, 267946, 182493, -22627, -150806, 295697, 72823, -125965, -36766, 267452, 101753, -297620, -73453, 96294, 77426, 71282, 128559, 29425, 24311, -184621, -34122, -299136, 260922, -14696, -81826, -50086, -11518, 47283, 90, -234686, 38698, -72063, 381405, 236444, 155153, 47786, -75571, -91717, -176740, -222238, -263544, 13612, 251695, 374781, 292590, -83893, -51946, 140611, 112160, 187312, 124400, -32636, 31320, -169175, 175341, -12517, -52657, 152211, 394543, 70358, -65066, -2371, 52370, 11792, 32875, 233283, -160279, 81403, 176351, 47484, -179972, 100330, 296329, -51793, 141843, 19610, -388993, 150690, 314795, -105402, 279052, -28854, 171092]
17609B70564a47347l01337A92971a05761j33755J08244Q02D7046a30598F8062
17598A75369e2777C9107K52140a21875B30134a29006D32330a77312c4851B06162
17587A31771m6439h2170B5831O3737c7592p8449J2656K6027O154D86807b67738
17575e1017A87812b9630G2257J22677H8526j0396M3294a23723C54097A63714j8362
17564A45352a33637e8438A13451O661J08924F4282K87324I4370A4901b19410E03256
17552A00825M7266n0099a91443H2484g5739A04734a4788F5499P9127a46558F3655
17540b770H2941M48708A35728b32263O2022B72282a50558bB36925a2451A56539
17528A75235j1894G6548C4831b37444A8707K5131b04991O5879C01134E5804k4764
$$ y = [270564, -147347, -448684, 192971, -105761, -239516, -131272, -130470, 47046, -130598, 68062, 175369, -52777, 39107, 291247, -121875, 230134, -129006, 432330, -177312, -34851, 206162, 131771, 85332, -82170, 25831, 89568, -37592, -116041, -103385, -77358, -71204, 486807, -267738, -51017, 187812, -29630, 72257, 194934, 88526, 78130, 121424, -123723, 354097, 163714, 145352, -133637, -58438, 113451, 120112, 229036, 64282, 351606, 94370, 14901, -219410, 503256, 100825, 148091, 97992, -191443, 82484, -75739, 104734, -14788, 65499, 144626, -146558, 63655, -2770, 82941, 531649, 135728, -232263, -170241, 272282, -150558, -2, 236925, -12451, 156539, 175235, 163341, 76548, 34831, -237444, 18707, 43838, -204991, -139112, 301134, 55804, 31040]
17517C1040J73911e1470D7903K24835k7471a40601B55367N4121F5079b31299i474
17505e4770o3212I3576M0439K84471j75593b2427k72661i098C96824A01139P1243
17494A72382a13715k37537f5062C2228N8352b1081B61837I2944J29514C8823M3766
17483H2589b48415A9801J07708Q1320b51005A57491d9457l0617C85383a54929
17472A24876J83506b77570B08583J48618M2004j26647g979A08730j3258K1014
17462A16486e1934C22827O8242O065H3094R5380k7256O629D6182p261a07751K6708
17450h1043r8804j2274c584l71499I0326L4670K01533A25502L91552k06257C9289
17438A89341N935g8790D12247k01271G9011J85117A09143E1842K76471A00790
$$ y = [31040, 204951, -51470, 47903, 272738, 245267, -140601, 255367, 309488, 65079, -231299, -9474, -54770, -117982, 93576, 134015, 418486, 242893, -22427, -295088, -9098, 396824, 101139, 172382, -113715, -351252, -65062, 32228, 90580, -21081, 261837, 92944, 222458, 38823, 82589, -248415, 19801, 127509, 208829, -251005, 157491, -49457, -80074, 385383, -154929, 124876, 308382, -277570, 208583, 357201, 399205, 272558, -7979, 108730, 95472, 116486, -51934, 322827, 391069, 397134, 83094, 178474, 151218, 157847, 46182, 38921, -107751, -81043, -179847, -192121, -3584, -375083, 90326, 124996, 326529, 125502, 517054, 310797, 39289, 189341, 195276, -78790, 412247, 210976, 79011, 264128, 109143, 51842, 328313, 100790]
17427C6738K6119M14077A69016J98254j17667K59739l8785H806K28242n3932J41784
17416C24900A43127J66933j27197D1444K2580a70254A57899D0328K47080r0333
17406A97075K12626K3591L176P7374A31705J83572K69291B06796J08108b5322
17395e0829A55826h9795A74801K81932A66923E5194J54188o9268b058k5023B5561
17383c41446B98344b03595B28164n7908C7068J5159M0346K33081J22821o4969
17373C83506E0459K07595a90714B68764A06012K45328j57947E2825M24312A04490
17362A57407o6231K86068r2220Q967j25486q0469b90812J0113C20208a60850B74466
17350B60313b8461P890k8801A84591C9887K18609a42765C2975K60120j03835J03243
$$ y = [36738, 62857, 476934, 169016, 367270, 249603, 509342, 470557, 8806, 237048, 183116, 324900, 143127, 310060, 182863, 41444, 64024, -170254, 157899, 40328, 287408, 197075, 409701, 433292, 436468, 513842, 131705, 315277, 584568, 206796, 314904, -25322, -50829, 155826, -89795, 174801, 456733, 166923, 55194, 209382, 140114, -2058, -27081, 25561, -341446, 298344, -203595, 228164, 170256, 37068, 52227, 92573, 325654, 448475, 383506, 50459, 258054, -190714, 268764, 106012, 351340, 193393, 52825, 477137, 104490, 157407, 91176, 377244, 285024, 293991, 168505, 88036, -290812, -280699, 320208, -160850, 274466, 260313, -28461, -20571, -49372, 184591, 39887, 258496, -142765, 32975, 293095, 189260, 292503]
17339B92503E2333K63635M0933k0796A29106J49765G6481C5819i8650B53852q3871
17328A69981O4979J25594A3631g6290j81260C56560j70624H8314b73266A76419
17317E8076K94699l6747o4690H3840j6524J16316B4081L76045d6468A46043J73854
17306C19897J07744B366b30716E32800A65730M5040N7853r3031j3545J2655K8911
17295B03613l3133F6341c7844E17113E7453B6934c5670F03586G5244J31579J15304
17284C22127A38774l4308R99Q4558k8490J67130b28936A45042J54911j13804J73667
17273C59816j00374F8717K7581J81376j19060J48732b6712C34854f5851C54587
17262C56646J30175H8225M67377k22539b1523B11274q9808J50173b1610B70977
$$ y = [292503, 52333, 315968, 356901, 336105, 129106, 278871, 76481, 35819, -98650, 253852, 169981, 234960, 360554, 13631, -76290, -257550, 356560, 185936, 88314, -273266, 176419, 58076, 352775, 316028, 251338, 83840, 67316, 183632, 24081, 400126, -46468, 146043, 319897, 427641, 2366, -230716, 532800, 165730, 210770, 268623, 175592, 162047, 174702, 203613, 170480, 66341, -37844, 517113, 57453, 26934, -35670, 603586, 75244, 206823, 322127, 138774, 104466, 105465, 190023, 161533, 328663, -228936, 145042, 299953, 186149, 359816, 259442, 68717, 96298, 277674, 158614, 307346, -26712, 334854, -65851, 354587, 356646, 486821, 88225, 555602, 333063, -21523, 211274, 121466, 271639, -21610, 270977]
17251C40487C3312J47057J07392m139D0814M19071j91128O8546F4783i9272A00725
17239A54803C1949K5647J21109L7076H0292l3380l715J46852L2617r1210j5329
17228A16127K60104m1426a53450A98463n2670C2025J78457a18496G1683J74112
17218B45795b01214B58818m0673M7433I592R7935J57230J42715H0155l0290b817
17206B36608J36619o2715J906M9658j56661m4476M6877l1249q3168J01671J0749
17195B05819l9073g6172A92142R2080F2425K04129k4962A01005K97400A18656
17184B12995q5009J40147q7708K70918A05990M03780M3617B22043L5205c7536
17173D71704m5514F5699K96391L0966A15476K09291k8864Q420A51728g8625C72467
$$ y = [340487, 33312, 180369, 287761, 283622, 40814, 459885, 268757, 337303, 64783, -99272, 100725, 154803, 31949, 57596, 178705, 215781, 80292, 46912, 43197, 190049, 222666, 131456, 116127, 376231, 334805, -153450, 198463, 145793, 32025, 210482, -118496, 71683, 245795, -201214, 258818, 218145, 265578, 9592, 107527, 264757, 407472, 80155, 49865, -2817, 236608, 373227, 310512, 312418, 362076, 205415, 160939, 207816, 176567, 93399, 195070, 205819, 166746, -76172, 192142, 284222, 62425, 266554, 241592, 101005, 398405, 118656, 212995, 127986, 268133, 180425, 451343, 105990, 509770, 553387, 222043, 257248, -37536, 471704, 426190, 65699, 362090, 393056, 115476, 324767, 295903, 304323, 151728, -78625, 372467]
17161B67729J22474A4345K75096I7140J90035K20022A59169g8672B80405j19662
17151A60743o4582K18515r8869O3025j07810F0089L26776j4943Q7358Q6729J0663
17140E56672j88682A03888K32689N4536q842K8581q5118K13753j83424A61588
17129D54258k23196a29727C01342r1544P0475E9942N3020L83943k04207M0633
17119C33331l362J13548j26413A46351p2333Q4881L17392A78405J35872m9241
17109B65036K38485k44255K03455P127G3085K10604O2760J15316o1945A63678
17098C21444P4364J13980j08023J24778p5776Q8795a2393E03916j76590k1217
17088C06109m6873Q7933j61500J02300J40411J27991j89379J80092B30259J20542
$$ y = [267729, 390203, 14345, 289441, 97140, 287175, 507197, 159169, -78672, 280405, 160743, 96161, 314676, 215807, 278832, 171022, 60089, 386865, 371922, 459280, 546009, 556672, 367990, 103888, 336577, 391113, 382271, 410852, 325734, 539487, 356063, 161588, 454258, 231062, -129727, 301342, 209798, 280273, 59942, 112962, 496905, 292698, 333331, 329969, 443517, 317104, 146351, 74018, 158899, 476291, 178405, 314277, 265036, 503521, 259266, 462721, 469848, 73085, 283689, 346449, 461765, 399820, 163678, 321444, 395808, 509788, 401765, 526543, 450767, 539562, -12393, 503916, 327326, 306109, 259236, 347169, 185669, 287969, 428380, 556371, 366992, 547084, 230259, 350801]
17078C50801L2830o0081J52169J18648K4655A47838N77524j54468F8156L69169
17068D37325K9062P1354k42935n8679J31579A26802K02676J34639J1551J77545
17058F53213B59336L85684q5524B15671O0040K05998J90346j95273k4600j39589
17048C12593j33461K17333q507K30003q4441k07351J69587j221m3346M2018R0367
17037E83574j15090p264n6723N7746Q9207K81971l46848M1956j51469J82197m3716
17026E15541J01442l6411j11418J66906n025C02438L91699B89531M83296l028
17016G69799k04540n8744K63207K12517l30355k44644j09343L64206R603Q1019
17006G52725j25238M3149n0565k27313M01718C45823J01081J68643K64505k4311
$$ y = [350801, 383631, 323550, 475719, 594367, 619022, 147838, 725362, 570894, 68156, 437325, 466387, 537741, 294806, 236127, 367706, 126802, 329478, 464117, 475668, 653213, 259336, 645020, 559496, 215671, 275711, 481709, 672055, 476782, 452182, 312593, 179132, 396465, 387958, 617961, 533520, 326169, 495756, 494535, 451189, 493207, 583574, 468484, 461220, 404497, 462243, 551450, 833421, 486573, 528529, 377060, 559257, 515541, 616983, 580572, 469154, 636060, 631035, 302438, 694137, 289531, 772827, 769799, 565259, 506515, 769722, 982239, 651884, 407240, 297897, 662103, 671706, 752725, 627487, 670636, 620071, 392758, 794476, 345823, 446904, 615547, 880052, 855741]
16996H55741k80028J11402R211J2228k5710K43281j48099k68177M34621m65060
16986D79410O82353C09869P30833l98820K60674K9291r4178o9288l2600j72393
16976E63388K08866m2858j27213L02936l18761o073o2318M10014l91093K06696
16966G43584K56971J06474j28136l09514J85797J5824K059k65821M06346q7708
16956I25876j7826L22335m29048L47477l1923N8748m18343p4105M53194j88928
16946I47457k6989k11149j46596L51897J46790k77868M3210L17565j65782o4276
16936I14259m423r578J68087j9047p1602K07767q859p6298k0977N8049J56360
16925A293738l26840M75687l09151P7147k75956K04427M325J52824k51800M9292
$$ y = [855741, 575713, 687115, 696326, 708554, 682844, 926125, 778026, 509849, 944470, 479410, 1161763, 309869, 1040702, 641882, 902556, 931847, 837669, 768381, 735781, 563388, 772254, 729396, 602183, 905119, 586358, 580285, 517967, 927981, 536888, 743584, 1000555, 1107029, 978893, 669379, 855176, 871000, 873059, 607238, 1013584, 925876, 908050, 1230385, 801337, 1148814, 1116891, 1175639, 757296, 683191, 1136385, 947457, 920468, 709319, 562723, 914620, 1061410, 783542, 826752, 1144317, 978535, 914259, 909836, 900258, 1068345, 1049298, 977696, 1185463, 1176604, 1100306, 1079329, 1137378, 1293738, 966898, 1442585, 1133434, 1210581, 934625, 1139052, 1143377, 1296201, 1044401, 1093693]
16915A093693J82152L47558m50734J10651o9860J53965P6613l85838L67684m9369
16905A376515j1703K92951j50768k0527J62631n5857l0124p7570p5883J86060
16895A595725j73888K29858J3168k1481K08374j79972j90983N1608L72297n10478
16885A394228M37702l8344j7281o5050l2853k30429M37120j8418k5995K04726
16875B045406k00010K15427J3487Q5467k8627k46946K5917K63779q3703N8041
16865B148238k75100N35966m22752M74020j35094J8693M54969n86447K97488l09865
16855B200116K20766k38663L42025j60509M01439n35132J91135J66731K13903
16846B801811K884o6834J33087l34556K3494M75297Q6866j47598Q5449k28692
$$ y = [1093693, 1275845, 1623403, 1172669, 1283320, 1213460, 1367425, 1444038, 1058200, 1425884, 1376515, 1364812, 1657763, 1506995, 1486468, 1649099, 1593242, 1563118, 1485548, 1409665, 1595725, 1421837, 1651695, 1664863, 1643382, 1851756, 1671784, 1480801, 1532409, 1904706, 1394228, 1831930, 1793586, 1776305, 1711255, 1678402, 1447973, 1885093, 1866675, 1840680, 2045406, 1845396, 2060823, 2074310, 2159777, 2131150, 1884204, 1910121, 2173900, 2090197, 2148238, 1873138, 2409104, 1986352, 2460372, 2325278, 2343971, 2798940, 2212493, 2509981, 2200116, 2420882, 2182219, 2524244, 2363735, 2765174, 2230042, 2421177, 2587908, 2801811, 2804695, 2737861, 2870948, 2536392, 2559886, 3035183, 3122049, 2974451, 3059900, 2831208]
16836B831208J92023J71292J16976p821L37608j76452K11706Q8025q8740J59294
16826C835119k71888K7080O8633J45219l7655O55075k06503O4922R4851J25641
16816D500494J47792j27582K91552P225j55711K31854l5841M29820q0728l4834
16806E174041L27514m7773j20213L27308P6869j06488O93535K7579l07075M44184
16796F489481k44495L18818K97703O1012N24524j85529K70590J24383L49125m1565
16786G964047J70209j166N85671j02354N27712l5104L14766L75169m8078K40079
16776I990951N50502M73366J73385q052O33227K67728L72570K68407P31915k93562
16766A3160437Q14392L15826P63405K07367M80999N59430K02854Q36377L93292
$$ y = [2831208, 3023231, 3194523, 3311499, 3303678, 3641286, 3464834, 3676540, 3764565, 3675825, 3835119, 3563231, 3590311, 3658944, 3804163, 3766508, 4421583, 4215080, 4280002, 4374853, 4500494, 4648286, 4520704, 4812256, 4819481, 4663770, 4895624, 4859783, 5289603, 5208875, 5174041, 5501555, 5453782, 5333569, 5660877, 5737746, 5631258, 6324793, 6352372, 6045297, 6489481, 6244986, 6563804, 6861507, 6922519, 7447043, 7261514, 7532104, 7656487, 8005612, 7964047, 8134256, 8133090, 8718761, 8616407, 9144119, 9109015, 9423781, 9798950, 9750872, 9990951, 10541453, 11014819, 11188204, 11180152, 11813379, 12081107, 12453677, 12722084, 13453999, 13160437, 13974829, 14290655, 15054060, 15261427, 15742426, 16301856, 16504710, 17341087, 17734379]
16757A7734379P93600M57973M11403R46488R41300O60424J128015P18332P95402
16748B4587316J180241P87526J027579R25086K006454J052138J363885J405980
16740C4336205J659972J657435J661936K146392K206225J942418K290586K699669
16732E0600838K443534K857514L167600L320382L415159L947135L659014M542949
16724G7954125M209458N117581N461198N392620N601779O436760O269200P202041
16716A23644762P000744O955731P465445P475717P626784O583859O548028O233020
16708A79534090N795794M200310L665850K378833J533351K110r14205k491665
16700A93704468l604420m244837n387463o187305o493550o951519p199269p486571
$$ y = [17734379, 18527979, 18985952, 19397355, 20343843, 21285143, 21945567, 23073582, 23791914, 24587316, 25767557, 26555083, 27582662, 28507748, 30514202, 31566340, 32930225, 34336205, 35996177, 37653612, 39315548, 41461940, 43668165, 45610583, 47901169, 50600838, 53044372, 55901886, 59069486, 62389868, 65805027, 69752162, 73411176, 77954125, 82163583, 87281164, 92742362, 98134982, 103736761, 110173521, 116442721, 123644762, 130645506, 137601237, 145066682, 152542399, 160169183, 166753042, 173301070, 179534090, 185329884, 189530194, 193196044, 195574877, 197108228, 197110338, 196196133, 193704468, 190100048, 185855211, 180467748, 174280443, 167786893, 160835374, 153636105, 146149534]
16692A46149534o837070p663504o705430o902707o470884o129749o083467n739900
16684I3616823n481502m943634m865866m809590l698871m052652l595839l422853
16676E8746016l339659k874659k815078k742613k309752k570068j964259j622121
16668C8507807j967396j902767j555182j454119j370676j676558q82289j167236
16660B6531584p79047j501717j073771o37943j101281k05642j159509n26846j018087
16651A8527741q00176n65113n98152m77768m47084q23860n91150J3837o42932
16642A3595343m15313m67161m15819j80283n80986l34318k30666k86660o97075
16633I987062L53907m59225N9717p41946R421j98909n07460j71864l38415k26229
$$ y = [146149534, 139312464, 131648960, 124943530, 118040823, 111569939, 105440190, 99356723, 93616823, 88135321, 83191687, 78325821, 73516231, 69817360, 65764708, 62168869, 58746016, 55406357, 52531698, 49716620, 46974007, 44664255, 42094187, 40129928, 38507807, 36540411, 34637644, 33082462, 31628343, 30257667, 28581109, 27698820, 26531584, 25752537, 24250820, 23177049, 22539106, 21437825, 21232183, 20072674, 19545828, 18527741, 17727565, 17162452, 16564300, 16086532, 15639448, 14815588, 14224438, 14238275, 13595343, 13180030, 12712869, 12297050, 12116767, 11535781, 11201463, 10970797, 10684137, 9987062, 10340969, 9881744, 9941461, 9199515, 9208936, 9010027, 8502567, 8330703, 7992288, 7766059]
16623G766059j68587J02993J6488n68387l0991j72411j59463l71805p5426j33942
16613F204528j82361o771j46309j98538j72020k873l30947J87699l03451j97619
16603D851338N1689l97842J64178j93433n8934P412k20194L45722l15366K23060
16593D457630l65824j70754J45270k00288n1254k48914J71504j9305q4280J15716
16583C749501k89303k69676M1656P1867k47702j72361m8633L7225j02291J48428
16573B918711l75018J54420O2542j86046K32743k57296r9399l6837J82622k59915
16563B336527J89277N7020m92851L72243m58205j1940L14213k75223J59520J0086
16553B200667j94116J39930l38019K73404k28081J14890j28795J21929k87961
$$ y = [7766059, 7597472, 7700465, 7716953, 7148566, 7117575, 6945164, 6785701, 6413896, 6338470, 6204528, 6022167, 6015396, 5869087, 5670549, 5498529, 5495656, 5164709, 5352408, 5048957, 4851338, 4903027, 4505185, 4669363, 4475930, 4416996, 4424408, 4204214, 4549936, 4234570, 4457630, 4091806, 3921052, 4066322, 3866034, 3814780, 3565866, 3737370, 3718065, 3633785, 3749501, 3460198, 3190522, 3232178, 3304045, 3056343, 2883982, 2835349, 2872574, 2770283, 2918711, 2543693, 2698113, 2760655, 2574609, 2807352, 2550056, 2450657, 2413820, 2596442, 2336527, 2525804, 2582824, 2089973, 2462216, 2004011, 1992071, 2306284, 2031061, 2190581, 2200667, 2006551, 2146481, 1808462, 2081866, 1853785, 1968675, 1839880, 1961809, 1673848]
16544A673848n6658O7457O0458J58219k9686J52942l02759k2021j19420K15277
16534A797657j88060j66095K32364k25117n138k15764M51948j15809K95178n72699
16524A288465M21585n27763L0257J56371o1072q5233J43731k64884K53523J16839
16514A471819n9154M2091l25323J86796o3405K8671k06701j37131J31796K67798
16504A337257o51424L63222K10832Q9086l38987J7833J87315j59190P9002J12891
16494A247837j12593r7852j1186R5281J04970n58809n25M08278j30344D40452
16483G49963n5492K00359R0733J02743j57955j70850N368O6561M3273j84821L31180
16472A021062j68006K2454m8514n9110l0830k55788M47574j78339n2442o0650
$$ y = [1673848, 1617190, 1684647, 1745105, 1903324, 1873638, 2026580, 1723821, 1701800, 1582380, 1797657, 1609597, 1443502, 1675866, 1450749, 1445611, 1229847, 1681795, 1565986, 1861164, 1288465, 1710050, 1182287, 1212544, 1368915, 1307843, 1222610, 1366341, 1101457, 1354980, 1471819, 1412665, 1454756, 1129433, 1316229, 1252824, 1281495, 1074794, 937663, 1069459, 1337257, 685833, 1049055, 1259887, 1348973, 1009986, 1027819, 1215134, 1055944, 1134946, 1247837, 1135244, 1037392, 1026206, 1121487, 1226457, 667648, 667123, 1075401, 945057, 440452, 749963, 694471, 894830, 985563, 1088306, 930351, 759501, 764869, 831430, 874703, 689882, 1021062, 853056, 875510, 826996, 767886, 737056, 481268, 928842, 750503, 698061, 637411]
16462F37411k07615L51662m145J59636l96427J47163K21522k44772q7039J14383
16452F91779O5362A22636L97831J71783l2983j854j32689J47627k91705k4642
16442C56004J51440J33376j08591K55677l87382N38253m17801M5116K92253J62141
16432A020486n09520Q9519O631j7812m4586K06559O2646l27926J31324B88313
16421F80104f316C85230R5333L9343J0538r9394q3642K45312B36917L95563k21523
16410D10957K4635J70340q4812L77465C78173J61917J11237j18983J9373B69319
16399D47929o7485p6755A38053J49756A3268L68199J1187J01067p8490q9206P8522
16388D04547L6821K60886A7874J92131M81656k95840J43868o9547B04268o5353
$$ y = [637411, 429796, 781458, 777313, 936949, 540522, 687685, 909207, 664435, 577396, 691779, 757141, 122636, 520467, 692250, 659267, 657413, 524724, 672351, 380646, 356004, 507444, 640820, 532229, 787906, 400524, 938777, 520976, 566092, 858345, 1020486, 510966, 600485, 607116, 589304, 544718, 751277, 813923, 485997, 617321, 288313, 680104, -6316, 385230, 480563, 519906, 530444, 431050, 347408, 592720, 236917, 632480, 410957, 435592, 605932, 521120, 898585, 378173, 540090, 651327, 532344, 551717, 269319, 447929, 380444, 303689, 138053, 287809, 13268, 381467, 392654, 493721, 415231, 326025, 404547, 441368, 702254, 17874, 210005, 691661, 395821, 539689, 470142, 204268, 138915]
16378A38915J01628P3435K11359B08342q026J98544N6411j52726q3784K58891
16368D77652q7706P9916D0527L99501j19037J96448k30595o2864R859H2281K49474
16357C31755n3750G3748J95090J8391n9996m0545K66075k18728K74584A83743
16346D33855B16571R8562F1698J11440Q6409J65090j5581H372M28397j7106A34896
16334e194H8002M03082j37318o800D9000O358K93205O514O9698p4435Q9607A8274
16321B38782r3373i265C84614A56899m0082j461j6136K12177A19154M02907B12245
16309c8698A63379R4281O0779Q6942j37403b34874D56021B3149P7997N4560k3848
16298A31858j7025J47874g975B1953L61233j03660K07385F4705J25765J03370
$$ y = [138915, 240543, 313978, 525337, 208342, 200316, 398860, 455271, 302545, 218761, 477652, 389946, 469862, 40527, 440028, 320991, 517439, 286844, 223980, 233839, 82281, 331755, 278005, 73748, 268838, 287229, 227233, 186688, 452763, 234035, 508619, 183743, 433855, 216571, 315133, 61698, 173138, 259547, 424637, 409056, 8372, 436769, 419663, 134896, -5194, 88002, 491084, 353766, 346966, 49000, 55358, 348563, 355077, 424775, 350340, 439947, 18274, 238782, 145409, -9265, 384614, 156899, 116817, 115356, 99220, 311397, 119154, 522061, 212245, -38698, 163379, 257660, 318439, 405381, 267978, -234874, 456021, 23149, 101146, 155706, 131858, 114833, 262707, -7975, 21953, 383186, 279526, 486911, 64705, 190470, 293840]
16288B93840m2558F4164a9017D42613H8282P2963o3053J46581I8830H313J29693
16277A38006J46544D1856d4931B96177a98518A18311n7882a00321A44139d2934
16266E4003h6211C80055j86225J61705j5581A45057L7435g2617l20763B0640J69121
16255A89761G9737a20276C21946k2928a23701M5833G5742L59211j29565A05485
16244H814a50036B33769E3092J7872K15940N7045A1151K08801l2960i6567a9344
16232b5197H8660J10824k136O1393C6323e4609A32410d6522A87349k7638O3857
16221B23568i1821b2221p2166A21986e7342q0310j16679i6107A25875i6280a3317
16209B2057N0517L77886A99435j3464h8311D04546C9373L94032B13318b28242
$$ y = [293840, 251282, 64164, -19017, 442613, 88282, 161245, 98192, 244773, 98830, 8313, 138006, 284550, 41856, -44931, 296177, -198518, 118311, 60429, -100321, 144139, -42934, 54003, -86211, 380055, 193830, 355535, 339954, 145057, 182492, -72617, -393380, 20640, 189761, 79737, -120276, 321946, 299018, -123701, -77868, 75742, 434953, 305388, 105485, 8814, -150036, 233769, 53092, 70964, 286904, 343949, 11151, 219952, 186992, -96567, -19344, -25197, 88660, 199484, 197348, 258741, 36323, -54609, 132410, -46522, 187349, 159711, 223568, -91821, -22221, -94387, 121986, -57342, -137652, -254331, -96107, 125875, -96280, -13317, 22057, 72574, 450460, 199435, 185971, -88311, 404546, 39373, 433405, 213318, -228242]
16198d1079a6857d993A83215b6528F8494K212K06146b4543B74395A1183f4707
16186G8454a21207A52887e0151C32210D0084b06125D08577b8300A71977k5322
16176A46655K06942j42804J6117A13285b6396C6628a4528A03756B6886R9893Q7913
16165B14692a29753k5640g2250k97779h5888H6106J81769a49526A54190L01694
16155D55884A21708H402O273M3801j7457d8946A41718B9256k43M0765M0470b88948
16142c8264I1244a29082b6771A13867a17717e913l3342j90568A75924N809E5527
16130c93459C0606K0296J84480n7287a43551D938a65934I2623a333C371e346m1262
16118d6608E5694N6387b7445j8956A32872b60655H3611a53196A7496a71774E0371
$$ y = [-41079, -16857, -4993, 183215, -26528, 68494, 70706, 276852, -24543, 274395, 11183, -64707, 78454, -121207, 152887, -50151, 332210, 40084, -206125, 408577, -28300, 171977, 146655, 353597, 210793, 226910, 113285, -26396, 36628, -14528, 103756, 26886, 126779, 214692, -129753, -155393, -72250, -370029, -85888, 86106, 267875, -149526, 154190, 455884, 121708, 8402, 14675, 58476, 41019, -48946, 141718, 29256, 29013, 69778, 110248, -288948, -38264, 91244, -129082, -26771, 113867, -117717, -5913, -39255, -229823, 175924, 181733, 55527, -393459, 30606, 50902, 235382, 178095, -143551, 4938, -165934, 92623, -1333, 3371, -5346, -46608, 55694, 112081, -27445, -46401, 132872, -260655, 83611, -153196, 17496, -171774, 50371]
16106e1943l2237k0064j33810B57228D3553g7265A11382K54145B2418f0811A5100
16094G22M1700a16946A1359J09314K51899b09040K22A67012J36654a31398C20379
16082B6045h0349C681e8135A9756a10158r506A08686A2139b8174A54627J0265
16071A64892k1015L03963A85826b59421c442k194B42602c35642B25233E2240B2282
16059g1426o8576o6285M9403K9192k3230f7012N24l46876B4933K12475H2324a25414
16046D44060I059J57249l4291c34164B45931n6429a77324l8947A68045R2245N6628
16035C16918a06714B11442D6184h2768j11E9932J40111d5852k19724a16404J4656
16024a01748k2098k95470K03802d5349D2846a38219j07796C10738e3221H9405
$$ y = [-51943, -84180, -104244, -238054, 257228, 43553, -77265, 111382, 365527, 22418, -60811, 15100, 722, 42422, -116946, 11359, 120673, 372572, -209040, -208818, 167012, 303666, -131398, 320379, 26045, -80349, 3681, -58135, 19756, -110158, -119664, 108686, 12139, -28174, 154627, 164892, 143877, 447840, 185826, -259421, -3442, -5636, 242602, -335642, 225233, 52240, 22282, -71426, -140002, -206287, -156884, -127692, -150922, -67012, -66488, -413364, 24933, 237408, 82324, -125414, 444060, 9059, 166308, 132017, -334164, 245931, 189502, -177324, -216271, 168045, 260290, 316918, -106714, 211442, 46184, -82768, -82879, 59932, 200043, -45852, -265576, -116404, -101748, -123846, -419316, -215514, -45349, 42846, -138219, -246015, 310738, -53221, 89405]
16013a0702q9847B017K37106g6999G0294a60895j33197G4737d27j94813A26757
16001A2341c36974a40673j60231h3331I9211a34854j91853a1289j21424K5566
15991a07147m5973n7757f7754q7654m0383j76666h095B32975b84360a7758j79426
15980a97184p1953e3210H5038J35393o198a02088A48567b3250B03121l5323p2970
15969I4828J0608K19341E1580b44646f870k27112B61219b15203A1485L9113j0797
15958C9801b64346A97779a30662C5497a29786j71140D6140e1397B78108J1204
15948B89312i1105A97692a7041p0756b2391p1489j15102B1802a79357k1637a8893
15936A01259b34009r6878i3182A8346a95517B42130g1236B32885a43008B399M917
$$ y = [-10702, -100549, 2017, 239123, -76999, 70294, -160895, -294092, 74737, -427, -195240, 126757, 12341, -336974, -140673, -300904, -83331, 99211, -134854, -326707, -11289, -132713, -107147, -153120, -210877, -67754, -155408, -195791, -372457, -8095, 232975, -284360, -17758, -197184, -269137, -53210, 85038, 220431, 214233, -102088, 148567, -23250, 203121, 167798, 94828, 105436, 324777, 51580, -244646, -6870, -233982, 261219, -215203, 11485, 50598, 39801, -264346, 197779, -130662, 35497, -129786, -300926, 46140, -51397, 278108, 289312, -91105, 197692, -17041, -87797, -22391, -93880, -208982, 21802, -179357, -200994, -18893, 101259, -234009, -330887, -93182, 18346, -195517, 242130, -71236, 232885, -143008, 2399, 7316]
15925G316J45404D4940B349R0875a49818q9085a03691M6764B11341p8424P4113
15914B07030a06880A04383h6523q3317B15432a90563M0947C5075O23b81489Q9854
15903a91635m91257A19878h5684A34935K026b11717j46537G0474b1001E2172i5358
15891a31111b1334q084A00348b2487j17722r141o10b7089H3260M7544a46498A57563
15878a39851j65660C32586b10157e0892m8986B97458H2513h4371r720K6440j61378
15867b29029Q9409A93681a54911C2138a29764B85469g132j18579L0822i231k06581
15856b15812a0451n0929j19638C79448b83325E8357c5511m5675B5857a74848A85803
15844A9038a0872C3291K14585a01660k51062a24391D9880B0068N2929b85053h9018
$$ y = [7316, 152720, 44940, 2349, 93224, -149818, -238903, -103691, -56927, 211341, 132917, 207030, -106880, 104383, -86523, -169840, 215432, -190563, -149616, 35075, 35698, -281489, -191635, -682892, 119878, -85684, 134935, 136961, -211717, -358254, 70474, -21001, 52172, -95358, -131111, -21334, -29418, 100348, -22487, -140209, -149350, -149960, -27089, 83260, 130804, -146498, 157563, -139851, -305511, 332586, -210157, -50892, -99878, 297458, 82513, -84371, -94091, -67651, -229029, -139620, 193681, -154911, 32138, -129764, 285469, -7132, -125711, -94889, -9231, -215812, -10451, -61380, -181018, 379448, -283325, 58357, -35511, -81186, 25857, -174848, 185803, 19038, -10872, 33291, 247876, -101660, -352722, -124391, 49880, 20068, 72997, -285053, -89018]
15832F7858J94023o8189o1898d421j49724Q673b7094A22433D019g4677q3014A19808
15819B7570A1540g7430J4705k3848C28548C703J01248b0814p5323j486K9388G894
15806b93059B2455J51526b20664L9110L7197o2783A7800a44786L971A71639i2371
15794b40667j20301C9127b85035B32996r1149h1262D280R3404a70191A19130a59220
15782A03500a1061n588F4036h4922I8512B2730N917J6130h4971k79002A98337
15770c2058E6707K53104A1205h6473F3935M7655n0512i7497m3674F4015n074b48490
15757a60900l2429A7741c0347A7367i7164A84512k1807G7337P5186R0813a1653
15745b000k4741E9974r618m023Q0738a14897l2979q905j4642A25563D3033b81748
$$ y = [67858, 261881, 193692, 131794, -4421, -154145, -145472, -27094, 122433, 4019, -74677, -157691, 119808, 27570, 11540, -77430, -62725, -86573, 328548, 3703, 104951, -20814, -96137, -97623, -68235, 7894, -293059, 22455, 173981, -220664, -181554, -144357, -207140, 17800, -144786, -140815, 171639, -92371, -240667, -360968, 39127, -285035, 232996, 141847, -81262, 4280, 97684, -170191, 119130, -159220, 103500, -11061, -16649, 64036, -84922, 98512, 22730, 28647, 44777, -84971, -363973, 198337, -32058, 56707, 309811, 11205, -86473, 63935, 111590, 61078, -97497, -141171, 64015, 58941, -248490, -160900, -193329, 17741, -30347, 17367, -97164, 184512, 162705, 77337, 152523, 243336, -11653, -2000, -26741, 59974, 50356, 46333, 127071, -114897, -147876, -156781, -171423, 125563, 43033, -281748]
15732a43356c2331E3013J87502a53221a5517A57237c2341A80754J9130a30479
15721A34222a28623B57498e3634G9357h2735J6313A53877i0899j7239j10446b7868
15709H721J91434c7705B5618a14501l742m6238A31355J16288B3435d33443B40127
15697I2662d05996g600j79266L5080f3315F2521a60166M3274j66667C27114a06765
15685B26480p9227b06780j63488g8097j06528h0278m2620j0853q6202a06181a9536
15673I5739b42328c4587G6558b0655G3334c437B66135a71723G6796J8325e8789
15661c26785j75840a28808B917a04357j70709f0461a0000j92657a6054k43134
15651b59188R5992j66929A19413n8610i9604K4118A7026Q7669d39690C5579f1044
$$ y = [-143356, -32331, 53013, 240515, -153221, -15517, 157237, -32341, 180754, 199884, -130479, 134222, -128623, 257498, -53634, 79357, -82735, -66422, 153877, -90899, -108138, -218584, -27868, 8721, 200155, -37705, 25618, -114501, -118243, -164481, 131355, 247643, 23435, -433443, 240127, 92662, -405996, -7600, -186866, -151786, -63315, 62521, -160166, -116892, -283559, 327114, -106765, 226480, 147253, -206780, -370268, -78097, -184625, -80278, -122898, -133751, -219953, -106181, -19536, 95739, -242328, -34587, 76558, -20655, 73334, -3437, 266135, -171723, 76796, 95121, -58789, -326785, -502625, -128808, 2917, -104357, -275066, -60461, -10000, -202657, -16054, -259188, -163196, -330125, 119413, 60803, -99604, -75486, 17026, 104695, -439690, 35579, -61044]
15639D26672c00101a21912C23940d5111A45806a19236C2677A4085i0996j4395
15629a05391H0767c67113i0391A85395B958Q5361j7294c7155H8144R5265b23758
15617b9923k11359A27936i227A08758k4362k398a38401F3812c02890B4963a54133
15605a42608B18616d1648A53365c18696A58225R6712b52j25578A5289h080B62256
15593H70a72926O9961o7141l819F177a26478K3236j7430k0817F6983b78191A65559
15580b43107a18057C08837c08372I5200P9983R804A7092a03221I6431h6696p4009
15569a60705C36952b86785A53526b79286J24625p6963A11455N2820o8784P44a09554
15557C0274O319J95079H3748J30538a3441k29373c8121d169B39612F9298J28088
$$ y = [426672, -300101, -121912, 323940, -45111, 145806, -119236, 32677, 14085, -90996, -105391, 80767, -367113, -90391, 185395, 2958, 88319, 71025, -37155, 88144, 183409, -223758, -29923, -241282, 127936, -9227, 108758, 84396, 81998, -138401, 63812, -302890, 24963, -154133, -142608, 218616, -41648, 153365, -318696, 158225, 254937, -252, -125830, 15289, -8080, 262256, 870, -172926, -102965, -170106, -173925, 6177, -126478, -103242, -120672, -141489, 66983, -278191, 165559, -243107, -118057, 308837, -308372, 95200, 175183, 184987, 17092, -103221, 96431, -86696, -160705, 336952, -286785, 153526, -279286, -154661, -231624, 111455, 164275, 95491, 96235, -109554, 30274, 36593, 231672, 83748, 214286, -13441, -242814, -38121, -4169, 239612, 69298, 197386]
15546A97386a69973m6165g4110A85244a86978B48826f2023A84218A8793K4117
15536D2910B1199J74075d2971k84635E10956H8609R4259a21611j78392a43262
15525C24409j8152f1084d041A43763Q9575n872K2171b04674F7020F953b5946q2063
15513a08009I0069K7761d30770F947g4736K0800A93707g3973B17911L2682E3590
15501a51229b9974B01443J55285a44735B857P2337c5713A08498l6109b74738j7758
15490b92496g2041l60983G3618K76855A06225l4594i0767A39468Q6936d78368
15479A52012A6978g7660A84751b25075k7579N1949i9424j06493h4999K2913A27069
15467a36629A79427E8810d8506k08967A7413N8249b3345n9071j37285A44912c4613
$$ y = [197386, -169973, -216138, -74110, 185244, -186978, 248826, -62023, 184218, 18793, 42910, 21199, 195274, -42971, -327606, 510956, 88609, 182868, -121611, -300003, -143262, 324409, 306257, -61084, -4041, 143763, 233338, 227466, 249637, -204674, 67020, 6953, -25946, -108009, 90069, 117830, -430770, 6947, -74736, -53936, 193707, -73973, 217911, 250593, 53590, -151229, -29974, 201443, 356728, -144735, 2857, 75194, -35713, 108498, 72389, -274738, -292496, -72041, -433024, 73618, 350473, 106225, 71631, -90767, 139468, 226404, -478368, 152012, 16978, -77660, 184751, -225075, -252654, -200705, -99424, -205917, -84999, -62086, 127069, -136629, 179427, 58810, -48506, -257473, 17413, 75662, -23345, -82416, -219701, 144912, -34613]
15455h8048C15369f12B78115g7041A11268i9446I8883A3781a43203A2545J1066
15444B3611J56396G6752c12544i1392A1585c02432p0450B83414d3802J3538k6343
15433e6607N873q2360j38447E6671J74816B0438M9377a80550B16257G234h3723
15421d6060j32378M9888M5890B83094R0410a27009A04197J01255b21427o7843
15411b89270g7268k4770d702K017j0614C17992A30443a33684m086a9222A63912
15399a15688A31856D7651K25621r1985a71833A87849J32756F9560d9446A34645
15388E2126j5102M39136G1199J28405D8891K28348j07203R0961a42885D4833a14753
15376a62272e0647A0533b78211B17679j03210c40893b5125j4355M850F5619a03062
$$ y = [-88048, 315369, -612, 278115, -77041, 111268, -99446, 98883, 13781, -143203, 12545, 23611, 180007, 76752, -312544, -91392, 11585, -302432, -372882, 283414, -43802, -30264, -56607, -50734, -133094, -271541, 56671, 231487, 20438, 69815, -180550, 216257, 7234, -83723, -46060, -178438, -128550, -82660, 283094, 373504, -127009, 104197, 205452, -221427, -289270, -77268, -102038, -4702, -2685, -13299, 317992, 130443, -133684, -137770, -19222, 163912, -115688, 131856, 47651, 273272, 181287, -171833, 187849, 320605, 69560, -49446, 134645, 52126, 37024, 476160, 71199, 199604, 48891, 277239, 170036, 260997, -142885, 44833, -114753, -162272, -50647, 10533, -278211, 217679, 114469, -340893, -25125, -39480, -34630, 65619, -103062]
15364b97689C25588H0864C0043J72732D328L0603L2438P6978j1923c97766J83450
15353b14316a6233A02198a6941j64003Q2852R007j30810f3827C8459P6134a76337
15341a93496d9414k62770B4163K42424d6788g301j42206j9030A4892a42369j48637
15330b91006H8793K67470b03094Q8753d4873j71556H6848K70426a20558c6089
15319A45717C9731M6931b51051a09511j07184P2077B95819j20201A5434P7780
15309I3214c38197E8076k2852Q1477K6746b86652E4727k1245A821O171K68384
15298B76376q3230i1948l7489A1542e0241j0928H4477C5691J53480c8449C81116
15286A45661i1225G5251r109f4345A9393D571a16602k5797l1444c5784j93479
$$ y = [-297689, 325588, 80864, 30043, 202775, 4328, 34931, 67369, 144347, 132424, -397766, -214316, -16233, 102198, -16941, -180944, -98092, -89085, -219895, -63827, 38459, 114593, -176337, -193496, -49414, -312184, 24163, 266587, -46788, -7301, -149507, -168537, 14892, -142369, -291006, 88793, 356263, -203094, -114341, -44873, -216429, 86848, 357274, -120558, -36089, 145717, 39731, 86662, -251051, -109511, -216695, -144618, 295819, 175618, 15434, 93214, -338197, 58076, 35224, 116701, 143447, -286652, 54727, 33482, 1821, 7992, 276376, 193146, -91948, -129437, 11542, -50241, -61169, 84477, 35691, 189171, -38449, 381116, 145661, -91225, 75251, 66142, -64345, 19393, 4571, -116602, -142399, -173843, -35784, -229263]
15275b29263A86131N4557B3996J1316P9389a25725A85983a04166B65262B4139
15264b89014j32205E5118P6039O8265H8177N6742J86746E0663J83010a91340h0501
15252C1262B716J02859B2582M4413k3339M7594j2906L2030J4427b38827G7423
15240a94986C25729j45553F9962L71138J7618K97278N97116m49200L30288p6157
15230A158043C59254L4105P2514A49152L0211J92533K62405C335L06084q3143
15220B26276c04844D9036a75112e3005n9715C13386j56104J08772m2897h1949
15209A86255b38888B25333J7109b3750j06515D2176J73358c135A13678g01B55149
15197D0783L94256D3291L39452F7132K29447D7026a35032c8596k8722B60308c2600
$$ y = [-229263, 186131, 240688, 23996, 35312, 114701, -125725, 185983, -104166, 265262, 24139, -289014, -421219, 55118, 131157, 199422, 88177, 144919, 331665, 50663, 233673, -191340, -80501, 31262, 2716, 105575, 22582, 66995, 43656, 91250, 78344, 110374, 124801, -238827, 77423, -194986, 325729, 180176, 69962, 441100, 458718, 755996, 1353112, 903912, 1234200, 1158043, 359254, 393359, 465873, 149152, 179363, 371896, 634301, 3335, 309419, 226276, -304844, 49036, -175112, -53005, -112720, 313386, 157282, 266054, 223157, -81949, 186255, -238888, 225333, 242442, -23750, -130265, 42176, 215534, -3135, 113678, -701, 255149, 40783, 435039, 43291, 382743, 67132, 296579, 47026, -135032, -38596, -67318, 260308, -32600]
15185A85020e8383n8179C9709N5059b57348B44531h1960A68819a675k51778g7513
15173A38171d8662B36327c6005F3940L9763b08240g6774L1848l8875a1605E7723
15161B15509D2531M7674B2653K1664b04893H2813C7722J7256L66063A80343B059
15149C90156A64801l4439a30983q6941A61332P7584c1015C43939o1384J27049
15139D09604A85130J34292a94068D8150c0971C0275a40806B83514j13414e9338
15128B44218j18725J83010r6082O7302j7012q7756d95075b00510B36532o1369
15118A75163K03384I9114E101h6481A74589h5802d747A7050M15698I2012P1539
15107A63551L97910a10431D15112D4196O355K32774A4507a4417A44488a8116C6317
$$ y = [185020, -58383, -116562, 39709, 94768, -257348, 244531, -81960, 168819, -1675, -253453, -77513, 138171, -48662, 236327, -36005, 63940, 103703, -208240, -76774, -44926, -83801, -11605, 57723, 215509, 42531, 90205, 22653, 44317, -204893, 82813, 37722, 54978, 421041, 180343, 2059, 390156, 164801, 130362, -130983, -217924, 161332, 238916, -31015, 343939, 282555, 409604, 185130, 319422, -194068, 48150, -30971, 30275, -140806, 283514, 170100, -59338, 244218, 125493, 308503, 212421, 279723, 262711, 174955, -495075, -200510, 236532, 175163, 378547, 99114, 5101, -86481, 174589, -85802, -4747, 17050, 432748, 92012, 163551, 561461, -110431, 415112, 44196, 50551, 283325, 14507, -14417, 144488, -18116, 36317]
15095A42709m0233K062b26829A53600k4682l5087J70292a48398A39741J20237
15085B59978p1767J08588j2752J83876A79328g3885A71636a13036D00565a13512
15074A63869D1443J4090K24922j17871J11758i0562D85372A03893M528K03488
15064C11909B0464L97556b92576B02211C2823J51236L84172j70911i2576B0496
15053B57321m4385b6016H2114c84555B84555p4538J24494A08822L45613d8992
15042c2877I5382Q0415J0907M3409J54627A18159J38419J6359J44904j63340n2466
15031B02035l3169C2043Q2825D9028d4926I1991L69952a99038B12815r7131L82816
15020D98500k07546a919D87182j28638k6508c25013A72827K22668J46443m589
$$ y = [142709, 102476, 104538, -226829, 153600, 128918, 93831, 264123, -148398, 139741, 259978, 188211, 296799, 284047, 467923, 179328, -73885, 171636, -113036, 400565, -113512, 163869, 41443, 55533, 280455, 162584, 274342, -90562, 485372, 103893, 108421, 311909, 20464, 418020, -292576, 202211, 32823, 184059, 568231, 397320, -92576, 20496, 257321, 212936, -26016, 82114, -384555, 284555, 210017, 334511, 108822, 454435, -48992, -32877, 95382, 175797, 186704, 230113, 384740, 118159, 256578, 272937, 417841, 254501, 202035, 168866, 32043, 114868, 49028, -44926, 91991, 461943, -199038, 212815, 115684, 498500, 290954, -1919, 487182, 358544, 332036, -325013, 172827, 395495, 541938, 537349]
15010E37349B29805N7635J64553k03281M3242A24479K95088j00448r4183M06395
15000F31331B56591l9183L2663J19009H7834J09763K9292c6204B0301R7853L5762
14989A53916o2581M77811a7243A44944q849q890a31359C1201G050Q3219P5669
14978A65938K34702A65615R4472m6077A4930J58359J39745A11135P6534R7112
14968B84781b02729B91423o6190m9381C1673P6732j6682J37092O2259A06234J4843
14957A21077O4965O0512j10280B4721K83250J07636j94835J91037A92968J66570
14947C59538j07314B5606M69963A44644K88798j78627O5804A25770K29640J93126
14937E48536A04229L03728j05311A02977K92939m3567a10779k46981B16629H8604
$$ y = [537349, 229805, 287440, 451993, 248712, 291954, 124479, 419567, 319119, 224936, 631331, 256591, 217408, 250071, 369080, 87834, 197597, 226889, -36204, 20301, 118154, 153916, 91335, 569146, -17243, 144944, 136095, 127205, -131359, 31201, 7050, 90269, 165938, 400640, 165615, 260087, 214010, 14930, 173289, 313034, 111135, 187669, 284781, -202729, 291423, 225233, 175852, 31673, 108405, 91723, 228815, 291074, 106234, 121077, 186042, 246554, 136274, 24721, 307971, 415607, 220772, 411809, 192968, 359538, 252224, 25606, 495569, 144644, 433442, 254815, 320619, 125770, 355410, 548536, 104229, 407957, 302646, 102977, 395916, 352349, -110779, -357760, 216629, 88604]
14926B36794K0434m0541K35528j91821D495J93889D0768K75554J58619A02545
14915B85005B2113J32277m6343L55453A55408J44962K53062Q4952B31874J87643
14905D19517n3092j13025L6856A40748L36400j37572m298A41174K28979J59367
14895E29520k47955b5034C12056J28333P19k04541H3487K58762j25475R6379J5971
14884C29124j50402L52930j5217B42342J1007K12280j79925K51537J8876j54278
14874D01839q246j47722J8775J31137j53677L34098j75862j04631J03532j81692
14864B17551L30179j5870j64443A66686L38041l6953A93114K72482A76736M0379
14854B17115Q1427J38209j26175N04299C32521N0049j07235o8505L81702k00504
$$ y = [236794, 257228, 216687, 452215, 260394, 4495, 198384, 40768, 316322, 474941, 102545, 285005, 22113, 154390, 108047, 463500, 155408, 300370, 553432, 638384, 231874, 419517, 366425, 253400, 290256, 140748, 477148, 339576, 335278, 141174, 370153, 529520, 281565, -25034, 312056, 440389, 441108, 236567, 83487, 342249, 216774, 313153, 329124, 178722, 531652, 516435, 242342, 253349, 465629, 285704, 537241, 556117, 401839, 393593, 245871, 264646, 395783, 242106, 576204, 400342, 295711, 399243, 217551, 547730, 531860, 367417, 166686, 504727, 467774, 193114, 465596, 176736, 217115, 298542, 436751, 310576, 814875, 332521, 382570, 275335, 206830, 588532, 388028]
14844C88028k5890p8697J29795A74891M57854j15397A22641M10732l4342q8448
14834D10583L43266j91283L2158m9188A17006K19129j44565N80291A91430L16910
14824E08340j4545R26j22952Q8740q2686j8951J91909K1469o7819j0885K6407
14813E19953B36953K84443j88969L0935O8516A83477K48895K71973j70782n6472
14803D77091j48912K07791O6245J41200k47461n8198n9281j44574O75721m08780
14793E00842K85127j93059j99040K14009B88413O2512L3441j71242K51116J95715
14783F59955j8814m0115B70164K61295M4816k7335K05502j25886B16469L91823
14773F08292j20576k0191l086J7146L8067j39567R9574J12305R2549M25129l43329
$$ y = [388028, 362138, 283441, 413236, 174891, 632745, 517348, 122641, 533373, 499031, 410583, 753849, 562566, 594724, 545536, 117006, 336135, 191570, 771861, 191430, 508340, 493795, 494721, 371769, 460509, 377823, 358872, 550781, 572250, 504431, 493546, 519953, 236953, 521396, 332427, 363362, 431878, 183477, 432372, 704345, 533563, 477091, 328179, 535970, 602215, 743415, 495954, 437756, 378475, 233901, 909622, 500842, 785969, 592910, 393870, 607879, 288413, 350925, 384366, 213124, 464240, 659955, 641141, 601026, 270164, 531459, 576275, 548940, 754442, 628556, 216469, 608292, 487716, 467525, 464439, 481585, 519652, 380085, 479659, 591964, 684513, 1109642, 766313]
14762G66313m1585R0229k48771J81405j6204N298M0121j35565Q242p4274k53155
14751C22054L78114n4514o9415j43792L10022k21497l4366l9106K09898J44249
14741H01647L40117n57012K6557K21706k77729M38720l9193j71478J22229j27707
14731G77857l2073K29474p3119k05940K34019l25387m243K86315K60631l88889
14721G58645J36194k02752J6298k95776L84605L42757k78875j30966J7593K63390
14711A011113k78208r1521J85147r5917M5748j05565k9299J70435M59537l41514
14701I29956j53832J05935J31305k11140K6379r2875k98920K44721J85413l96052
14691D70890L06081P2091O4659j35690q7381M24906l43845K06147O4555l1692
$$ y = [766313, 724728, 814957, 566186, 747591, 731387, 736685, 776806, 641241, 649483, 575209, 322054, 700168, 645654, 576239, 432447, 742469, 520972, 486606, 447500, 657398, 801647, 1141764, 584752, 611309, 833015, 555286, 994006, 954813, 783335, 905564, 777857, 745784, 975258, 902139, 696199, 930218, 604831, 600588, 886903, 1147534, 758645, 894839, 692087, 708385, 412609, 797214, 1139971, 861096, 730130, 747723, 1011113, 732905, 641384, 826531, 730614, 776362, 670797, 641498, 811933, 1271470, 929956, 776124, 882059, 1013364, 802224, 828603, 735728, 436808, 681529, 866942, 470890, 776971, 849062, 913721, 778031, 690650, 1115556, 771711, 977858, 1042413, 1010721]
14681A010721K4597R3908k33007j6091j14682J48252J42661l6491L0303l72298
14671F77873J99931N4143j3774J01826K6365N4768r6887k16017M13977j77631
14661A024574J78257N8484l50392M95763m95016P9107K31479k16860p233K22133
14651A220296l01944K65906R5790l66878K79839j39200K84427k87757K03680J63070
14641A417229k13028R2379L9741k25602M43846Q3837n25614J15922k93785M159
14631I39084J78966K94045k4065j4670J36542M72440o22071o6767L267L7107j89959
14620A143919M62372n28925O66478k15414m13479K44870O2019j21358O6M02163
14610A702711l40101K80870k75290K5835J84295Q6293m2566j77805K04947j56030
$$ y = [1010721, 1035318, 1129226, 896219, 880128, 765446, 913698, 1056359, 1019868, 1050171, 677873, 877804, 931947, 918173, 1019999, 1046364, 1101132, 1004245, 788228, 1202205, 1024574, 1202831, 1261315, 910923, 1406686, 911670, 990777, 1222256, 1005396, 998163, 1220296, 918352, 1184258, 1280048, 913170, 1193009, 1053809, 1338236, 1050479, 1254159, 1417229, 1204201, 1296580, 1336321, 1110719, 1554565, 1638402, 1112788, 1228710, 934925, 939084, 1118050, 1412095, 1388030, 1373360, 1509902, 1982342, 1360271, 1293504, 1296771, 1333878, 1143919, 1606291, 1077366, 1743844, 1528430, 1114951, 1359821, 1421840, 1300482, 1300548, 1702711, 1362610, 1643480, 1368190, 1394025, 1578320, 1664613, 1622047, 1444242, 1649189, 1493159]
14600A493159J46961j48949j89819K16388L95923k42317P0106J09179j63325j648
14590A685658J5257j40443q8304J25617Q6084L7681L4768R6068j37059k79893
14580A435434M61420j68327j05610J41097J0123k59496O23980R5063k46234Q350
14570A995800K41629m33561N4654K94815k14903J84629Q3568k27946J61190K28897
14560B368772j32595j091K82954j98323J98173k19760J8192j99358L26900o992
14550B436872M70280k17485j96184K61413J12057L3196J83285o8930J75957K82295
14540C472756J05212R11654P2146N08247P97504J264209J998584L141867N812850
14531A8085029Q503396O657167j0932802p848424n078220k484203j895126r12557
$$ y = [1493159, 1640120, 1491171, 1301352, 1517740, 1913663, 1671346, 1741452, 1850631, 1687306, 1685658, 1700915, 1560472, 1472168, 1597785, 1683869, 1721550, 1756318, 1852386, 1715327, 1435434, 1896854, 1728527, 1622917, 1764014, 1774137, 1514641, 2138621, 2233684, 1987450, 1995800, 2237429, 1803868, 1858522, 2153337, 1938434, 2123063, 2206631, 1978685, 2139875, 2368772, 2236177, 2235086, 2518040, 2319717, 2517890, 2298130, 2316322, 2116964, 2443864, 2436872, 2907152, 2689667, 2493483, 2754896, 2866953, 2900149, 3083434, 3014504, 3190461, 3472756, 3577968, 4489622, 4561768, 5070015, 5867519, 7131728, 9130312, 12272179, 18085029, 26588425, 33245592, 22312790, 14464366, 9386146, 6901943, 5006817, 4094260]
14523D094260l12121m95534k98118j82910j34853J26984l8653k10902M5808n6059
14513B537902L5835o4620m7424K19223l14179K43271L55o0122J28637K05725l64677
14502B519926L13J82284k0157N75707m75176N8488J20492o2913K45797k69584
14492B875177L35183j39521j58751J07744K31741j05435n2808P8614J82396O9554
14482C423894J39063J8100m8905k737j01249Q7626J18802j05531L00343o046J59729
14471C983089l02092J15560J56158R4787q5015k63061K79473J03130k5976L17510
14461D373563k76985L70329j79279K51064K8417p8410k45851J94392K61858k83449
14451D415649L05796k13440M34509P7468M503K23691l41303K53408j00264L73170
$$ y = [4094260, 3782139, 3286605, 2988487, 2805577, 2670724, 2797708, 2759055, 2548153, 2593961, 2537902, 2573737, 2509117, 2461693, 2680916, 2366737, 2610008, 2610363, 2550241, 2678878, 2884603, 2519926, 2520239, 2702523, 2682366, 3258073, 2782897, 2841385, 2961877, 2898964, 3144761, 2875177, 3210360, 3070839, 2912088, 3019832, 3251573, 3146138, 3093330, 3171944, 3354340, 3423894, 3562957, 3581057, 3532152, 3529415, 3428166, 3515792, 3634594, 3529063, 3829406, 3823360, 3983089, 3680997, 3796557, 3952715, 4047502, 3962487, 3699426, 3978899, 4082029, 4056053, 4373563, 4096578, 4466907, 4287628, 4538692, 4567109, 4488699, 4242848, 4437240, 4699098, 4415649, 4721445, 4508005, 4942514, 5019982, 5024485, 5248176, 4906873, 5160281, 5060017, 5433187]
14441E433187j37082N8847K39816l2439J15754J5396O6462J56634K94836n44835
14431E666576J68087L1041K76575K96904l77273J08453K16171K93508J33232J12363
14421F925637j7276n0043J71143k18605M5120L79536m8145l4096K03567L90149
14411G746987N4217K29140K0370j06981L11600P8771J07764O3317K74316J02008
14401H881509O7686J10634j04747N67050J0132K67638m0667J30447l0947J07875
14391I966610L79624K04171r9989J29345K12139M01227r1569J86522K80792J50978
14381A1719850p4228O18675j27886M14626J77095J36766L55432J81182J40822
14372A3542334K49883j15976M70551L80980K29837L26694J16259L19325N47885
$$ y = [5433187, 5296105, 5354952, 5594768, 5562329, 5678083, 5693479, 5759941, 5916575, 6211411, 5666576, 5834663, 5865704, 6142279, 6439183, 6061910, 6170363, 6386534, 6680042, 6813274, 6925637, 6908361, 6858318, 7029461, 6810856, 6855976, 7235512, 7187367, 7153271, 7356838, 7746987, 7801204, 8030344, 8050714, 7943733, 8255333, 8334104, 8441868, 8505185, 8779501, 8881509, 8949195, 9059829, 8955082, 9522132, 9532264, 9799902, 9759235, 9889682, 9858735, 9966610, 10346234, 10550405, 10450416, 10579761, 10791900, 11193127, 11101558, 11288080, 11568872, 11719850, 11645622, 12264297, 12136411, 12551037, 12728132, 12864898, 13220330, 13401512, 13542334, 13792217, 13676241, 14146792, 14527772, 14757609, 15084303, 15200562, 15519887, 16067772]
14363A6067772j14902N85918J11664M04179N54771K61060M80072K6745L72557
14354A8749836N77185K50866R5759J073173l5444M13383Q65453K78334M42459
14345B2711004J081190J07896J24682Q47301L28961P11623N41287P03900P03190
14336B7861034P02701O37030N40532Q90044R13017N43880J258979L66886J228681
14327C4942784P90443R27008O29228J262948J130399O49479J563588J057571J483274
14318D4436722J440923J320216J361957J552375J159334J709616J724523J725020
14310E6430686J941802J975545J656197K115598K638339K127062K346783K402711
14302G3634723K877452K902287K910783L218881L388738L550049L349130M059332
$$ y = [16067772, 15952870, 16538788, 16650452, 17054631, 17609402, 17870462, 18350534, 18377279, 18749836, 19327021, 19577887, 19673646, 20746819, 20711375, 21124758, 21990211, 22268545, 22711004, 23792194, 23900090, 24024772, 24872073, 25201034, 25912657, 26453944, 27157844, 27861034, 28563735, 29200765, 29741297, 30631341, 31544358, 32088238, 33347217, 33714103, 34942784, 35733227, 36660235, 37289463, 38552411, 39682810, 40332289, 41895877, 42953448, 44436722, 45877645, 47197861, 48559818, 50112193, 51271527, 52981143, 54705666, 56430686, 58372488, 60348033, 62004230, 64119828, 66758167, 68885229, 71232012, 73634723, 76512175, 79414462, 82325245, 85544126, 88932864, 92482913, 95832043, 99891375]
14294I9891375M338869L778518M521649M948912N088457N120771N406241O337089
14286A39431881O284901O604151P137069P436705P777699Q318861Q686033R147418
14278B00824718R751945R891631J1496301J1415234J1670612J2308188J2844587
14271B80203216J3340611J3857475J3714870J4182969J3894799J3567240J2958578
14264C75719758J2255513J1984726J0377373R515170Q874078Q031846O564725
14257D43323189L848462K663345K501122p08947n793054m061800m703300o903754
14249D30165263q281115r791089j0087361j1224457j1022530j1802478j2872345
14242C55083888j2838929j2644989j2630803j2867810j2607406j2253575j2182926
$$ y = [99891375, 104230244, 108008762, 112530411, 117479323, 122567780, 127688551, 133094792, 139431881, 145716782, 152320933, 159458002, 166894707, 174672406, 182991267, 191677300, 200824718, 210576663, 220468294, 231964595, 243379829, 255050441, 267358629, 280203216, 293543827, 307401302, 321116172, 335299141, 349193940, 362761180, 375719758, 387975271, 399959997, 410337370, 419852540, 428726618, 436758464, 443323189, 447171651, 449834996, 452336118, 451627171, 445834117, 441772317, 437069017, 430165263, 421884148, 412093059, 402005698, 390781241, 379758711, 367956233, 355083888, 342244959, 329599970, 316969167, 304101357, 291493951, 279240376, 267057450]
14235B67057450j1306272j1944205j1297061j1050829j0723655j0589637r698797
14228A90446994r039245q573683q450857p708157p466386o557548o391215n676088
14220A30583815n918575m937646n374491m911214m143521m128049m269610l690644
14212I3210065l547947l562164l173487l344523k922283k777654k331012k295723
14204F9255272k485042k145621k250197k456565j587019j724576j567498j813505
14196E3225249k133263j182656j210111j653159j121155j252129j051467j691093
14188D1930216j021072r45542j347277p53647r66036j053040j148809p54695q97958
14179C3042140q68811p19491o99353q15346n25205o49275o31475o15763q53153
$$ y = [267057450, 255751178, 243806973, 232509912, 221459083, 210735428, 200145791, 190446994, 181407749, 172834066, 164383209, 156675052, 149208666, 142651118, 136259903, 130583815, 124665240, 119727594, 114353103, 109441889, 105298368, 101170319, 96900709, 93210065, 89662118, 86099954, 82926467, 79581944, 76659661, 73882007, 71550995, 69255272, 66770230, 64624609, 62374412, 59917847, 58330828, 56606252, 55038754, 53225249, 51091986, 49909330, 48699219, 47046060, 45924905, 44672776, 43621309, 41930216, 40909144, 39963602, 38616325, 37862678, 36896642, 35843602, 34694793, 33940098, 33042140, 32173329, 31453838, 30754485, 29939139, 29413934, 28764659, 28133184, 27517421, 26664268]
14170B6664268p49769n92189k00904n84168p91068l33069q06399k68745n51654
14161B1786303l86630j88427p23421m69648K2413r94224l64804r4219k73889k35886
14151A8077568m81989k13691l18606o17293J61731m75163j52441n66899j80578
14142A5232639l39419l47412j99006O3751k15634o18125k05287l03888l40503
14133A2727116J46181k41586m21442J40470j09940l38527k32776m49885K32437
14124A1452048l59564k10799M8023j87306j69067l19900k58160p4573j0581k97706
14114I612415L2454k51879j23862L89788p07809J93831l39107j55393o142m01889
14104H242407o4073L07009k92404J84439m51217q73J39694n34577K0456j58459
$$ y = [26664268, 25914499, 25322310, 25121406, 24537238, 23746170, 23413101, 22606702, 22337957, 21786303, 21399673, 21211246, 20487825, 20018177, 20040590, 19046366, 18681562, 18587343, 18313454, 18077568, 17595579, 17381888, 17063282, 16445989, 16607720, 16132557, 15980116, 15413217, 15232639, 14893220, 14545808, 14346802, 14410553, 14194919, 13576794, 13371507, 13067619, 12727116, 12873297, 12631711, 12210269, 12350739, 12240799, 11902272, 11669496, 11219611, 11452048, 11092484, 10881685, 10929708, 10742402, 10573335, 10253435, 9995275, 9920702, 9910121, 9612415, 9644869, 9392990, 9269128, 9658916, 8951107, 9144938, 8805831, 8650438, 8644296, 8242407, 8178334, 8485343, 8192939, 8377378, 7926161, 7925288, 8064982, 7530405, 7550861, 7392402]
14094G392402J51212k90193k5614p4257n2764k72321M38396l59453O1356j49720
14084F819044l81205J24412J77716m62151J80285n62496j06461M68583j33068
14075F124659l780n04305j355L43296j07857m38445K8859J37925n99532L58805
14065E338270j82297Q6494k5455p4814m70984L69896k42532M32389o51091J65916
14055D745792n2404J5854j01627K23868n05523N9245K30377l83117M55547j59054
14045D528958j50857n12343N20701k62327J33090M5605k44763q3978j79657K26459
14035D020888j21978J63157j12460n25620N27847j59368J21300o90733L24823
14026C547856K80968m75767Q9733j22628J76393q2406O9100O045k32709k1078
$$ y = [7392402, 7543614, 7253421, 7227807, 7153550, 7100786, 6828465, 7266861, 6907408, 6968764, 6819044, 6437839, 6562251, 6739967, 6277816, 6458101, 5895605, 5789144, 6257727, 6124659, 6120879, 5616574, 5615219, 5958515, 5850658, 5412213, 5441072, 5578997, 4979465, 5338270, 5155973, 5242467, 5217012, 5142198, 4671214, 5041110, 4798578, 5230967, 4579876, 4745792, 4693388, 4709242, 4607615, 4831483, 4325960, 4385205, 4615582, 4232465, 4688012, 4528958, 4378101, 3865758, 4386459, 4124132, 4257222, 4302827, 4058064, 3974086, 3794429, 4020888, 3898910, 4062067, 3949607, 3423987, 3951834, 3792466, 3913766, 3223033, 3547856, 3828824, 3353057, 3442790, 3320162, 3496555, 3414149, 3483249, 3489294, 3256585, 3235507]
14016C235507o6744J50209j73314p1427M92333m85001K64135l15937K51374l81227
14006B899908L60425k67246k27828o8547m2976K9872J07939K24106n5597k81791
13996B678265L22791m61593J51634o3986j58545K25508l1392R190k62049K284
13986B412107O7509J1601j62796J36637L6423J03462P4647N9792N8829K75701
13976C073912O24040N52778J097269K952497M820800Q158186J0407271p042929
13968B4643824p485934m737749l040342k114249r99570o90819n03782q93077j77234
13959D001068l02271l42599r3794n09077K07997j52274m8119r5516M3712j02736
13949B606391j5353L3524m79614J88384P8188n3681J34981j73485j82808M6288
$$ y = [3235507, 3168763, 3318972, 3145658, 3074231, 3566564, 3081563, 3345698, 3029761, 3281135, 2899908, 3260333, 2993087, 2765259, 2696712, 2653736, 2683608, 2791547, 3015653, 2960056, 2678265, 3001056, 2539463, 2691097, 2627111, 2468566, 2694074, 2662682, 2671872, 2409823, 2412107, 2479616, 2491217, 2328421, 2465058, 2501481, 2604943, 2679590, 2739382, 2798211, 3073912, 3697952, 4250730, 5347999, 8300496, 13121296, 21279482, 31686753, 24643824, 17157890, 12420141, 9379799, 7265550, 6265980, 5575161, 5071379, 4178302, 4001068, 3698797, 3356198, 3262404, 2753327, 2961324, 2809050, 2760931, 2665415, 2709127, 2606391, 2591038, 2624562, 2144948, 2333332, 2411520, 2357839, 2492820, 2319335, 2136527, 2182815]
13939B182815J28799J78503k26739m13064J81869L36375l28912j00398K7536K29046
13929B195830J52488l42494j73534r6673N1267O3823q1129J84075J32355k7719
13919B058289J90738n66334R0942K24411l50974K33896k66034L15652k36801K14300
13909A908085P604l42538K51702q6920l66943J2776Q6020L20534j4757l11959
13899A463604N0507N0023j76575j00853K24945J06356R0207j78478j62761J77621
13889A544596l04254M6803K85603j0845K54685n26812K55067l3586k14125J62606
13879A459738k11051J76276k53525L21423J43158k48164M2r4060J34859J69331
13869A598027l45952j42791J59322Q0011n6810j78659J41656q9655L91420j51280
$$ y = [2182815, 2311614, 2490117, 2263378, 1850314, 2032183, 2368558, 2039646, 1939248, 1966784, 2195830, 2348318, 2005824, 1832290, 1735617, 1786884, 1850707, 1769578, 1953653, 2086008, 2058289, 2249027, 1682693, 1773635, 1998046, 1647072, 1880968, 1614934, 1930586, 1693785, 1908085, 1915689, 1573151, 1824853, 1737933, 1370990, 1383766, 1469786, 1790320, 1775563, 1463604, 1514111, 1564134, 1387559, 1286706, 1511651, 1618007, 1708214, 1529736, 1366975, 1544596, 1240342, 1287145, 1572748, 1561903, 1816588, 1289776, 1544843, 1511257, 1297132, 1459738, 1248687, 1424963, 1171438, 1492861, 1636019, 1387855, 1387897, 1293837, 1428696, 1598027, 1252075, 1109284, 1268606, 1348617, 1291807, 1113148, 1254804, 1165149, 1556569, 1405289]
13859A405289J7288l84709K62882l9113q1485N6950O5575j12314o7888j09649
13849A012826L56914j62735K63484m31058o4759K87868j31959j66233J78543n859
13839A137032L4077n8974L9245o0557R8416L9892l4663k1642k05532N2756j14072
13828I05978j19285J67288m5553L31617j5469l19457Q4497l02436M65253k07432
13818I45001R4540k87243O53284m00920K45744k68857k41784L42987J51427k48479
13808I85700J40764j35929k83958n9122M93237j57414m6461J77701j56556l09975
13798F47987J67327j28313J87789J3792k72713J42662J57197N2526J05531l62712
13788G11073J94560k3026L57757m61013L54410l06695J10256j68754j5459N6303
$$ y = [1405289, 1422577, 1037868, 1300750, 1261637, 1180152, 1237102, 1302677, 1190363, 1122475, 1012826, 1369740, 1207005, 1470489, 1039431, 974672, 1262540, 1130581, 964348, 1142891, 1137032, 1171109, 1112135, 1151380, 1090823, 1189239, 1229131, 1194468, 1172826, 967294, 1020050, 905978, 786693, 953981, 908428, 1240045, 1224576, 905119, 989616, 687180, 1152433, 945001, 1039541, 752298, 1405582, 1004662, 1250406, 981549, 739765, 1082752, 1234179, 985700, 1126464, 990535, 706577, 647455, 1140692, 983278, 936817, 1114518, 957962, 647987, 815314, 687001, 874790, 888582, 615869, 758531, 915728, 968254, 1073785, 711073, 905633, 882607, 1240364, 779351, 1133761, 827066, 937322, 768568, 753109, 809412]
13778H09412J32615l72673L41493J02247p2173J80477m70548J22172K41890q1998
13768I32914q7172m7806N0619Q6150j12903k23776R0268j2693j31004K25316n3934
13757G15979k01731P4073K08176R5697C19036L65784L0871J74663K8742M30504
13747A349600n69060K32385l95365J03370l11731K33852K72539l47789k11069
13738C56732N18748p3983j05567j52845J39612m7558o1145J56407K240j21153
13728F11488C05047N93368l09231J12437j63703J50906j72113q6900J25564J54837
13718G10212j02127O5691k02842J07067K65156j23492k35641K03612p8275K39422
13708H48783q9460j53204B62973M07337O3262J43949m24885J35453l6114l2706
$$ y = [809412, 942027, 569354, 910847, 1013094, 940921, 1121398, 650850, 773022, 1014912, 932914, 845742, 797936, 848555, 934705, 821802, 598026, 688294, 675601, 544597, 769913, 715979, 514248, 588321, 796497, 892194, 319036, 684820, 715691, 890354, 919096, 1349600, 780540, 1012925, 617560, 720930, 409199, 643051, 915590, 567801, 356732, 875480, 801497, 695930, 543085, 682697, 635139, 573994, 730401, 732641, 611488, 305047, 898415, 589184, 701621, 537918, 688824, 516711, 429811, 555375, 710212, 608085, 673776, 470934, 578001, 843157, 719665, 484024, 687636, 609361, 848783, 759323, 606119, 262973, 670310, 733572, 877521, 452636, 588089, 551975, 519269]
13698E19269J91175J19616l83616J19779K85368j09572r552M3233k61955K03035
13688G16780l07654M9613M39451k87301k24381K33626k2654k69402K20004j985
13678E46097N4249P1485J82590B48037M77520r9366n6896L12032m15547J73046
13668F38826o9052l1967R2253N5344j14382N9598j56200A70468J94672L28343
13658F93483B99751J30628K9900R4255m2814p4024R9305p9527p2297K06683K52586
13647H44446B17771J75001K83373C04130J901J49405K95090l1981A80972M70738
13637F51710r9203j25262J05854B53290J06110M8915d488D74762k06488m8785
13627B19489M56281b5373D27097N035K02542B96745K39819j25244J05778j04254
$$ y = [519269, 710444, 830060, 446444, 566223, 851591, 742019, 732467, 775700, 513745, 716780, 409126, 458739, 898190, 610889, 386508, 620134, 597480, 328078, 548082, 546097, 600346, 671831, 854421, 248037, 725557, 626191, 569295, 881327, 465780, 638826, 569774, 537807, 630060, 685404, 571022, 630620, 474420, 170468, 365140, 693483, 299751, 430379, 460279, 554534, 511720, 437696, 537001, 457474, 385177, 591860, 844446, 217771, 392772, 676145, 304130, 306031, 455436, 750526, 718545, 180972, 651710, 552507, 427245, 533099, 253290, 359400, 408315, -4488, 474762, 268274, 219489, 675770, -25373, 427097, 432132, 634674, 296745, 536564, 411320, 517098, 412844]
13617D12844j82249L24414B08085J72488J2795K60684b6598G56987C36159J1242
13607C47401J13438k5767r9145J29883b0239E56584R9496j12071B44009L03832
13597E47841j81491J6559J28340J118J96117C03038J65365o2925B9250K37495
13587B66745Q2325j16597J37939J29285j84937K14030B52137J62788J2972Q8231
13577E16128l3990i2141E57079B61047B8261O9785L43482o1280K99267k72867
13567D06648O2090j61040A51264Q108p9262Q6950K52044j74343I6044l1699K40882
13556C05227M5492N8116j70315J52871j62951K74792k3288K31044B47082J52608
13546C99690j62265M0676F6033O14687p8145j87162A91096k5818L27213r9758
$$ y = [412844, 230595, 555009, 208085, 380573, 393368, 654052, -26598, 756987, 336159, 347401, 460839, 435072, 335927, 465810, -20239, 556584, 656080, 544009, 244009, 547841, 366350, 382909, 511249, 512367, 708484, 303038, 468403, 405478, 29250, 266745, 349070, 232473, 370412, 499697, 314760, 528790, 252137, 414925, 427897, 516128, 482138, -92141, 557079, 261047, 28261, 98046, 441528, 380248, 679515, 406648, 468738, 307698, 151264, 159372, 80110, 167060, 419104, 244761, 96044, 64345, 305227, 350719, 408835, 238520, 391391, 228440, 503232, 479944, 710988, 247082, 399690, 237425, 278101, 66033, 680720, 602575, 415413, 191096, 165278, 492491, 392733]
13536C92733J3148j75024L02851r4011j70871K2001K84496k73188A18166J47599
13526B65765J69617k202O4341B01335L61270k28974P8459R182K3469A80746K00125
13515C80871j58213q2601M53425k48420k1564A27873L17966p0294A57126J15170
13505B72296J58158j59536J56951j92315j3882J29161j5021G2390J83659j5678
13495B40371L8353K47801J1404a49802C98053k2237l8898m9493B8051K85444j8111
13484B95384K46275A58194O2207K70478r4956j49644K7135H1970i4731C60793
13473D58687o3279j22494n3668p1517P5792O0883K16607a29412e9524G3190K37150
13462C10340J37378M7830j43122k2114q2591p7888J66457j16043P7424A13211
$$ y = [392733, 405881, 230857, 533708, 439697, 268826, 290827, 575323, 302135, 118166, 265765, 435382, 433180, 497521, 201335, 562605, 333631, 412090, 421272, 444741, 180746, 380871, 222658, 140057, 593482, 345062, 323498, 127873, 445839, 375545, 157126, 272296, 430454, 270918, 427869, 235554, 221672, 350833, 335812, 72390, 256049, 240371, 278724, 526525, 537929, -149802, 398053, 375816, 336918, 287425, 28051, 313495, 295384, 541659, 158194, 220401, 490879, 395923, 246279, 273414, 81970, -94731, 360793, 458687, 395408, 272914, 219246, 147729, 223521, 284404, 501011, -129412, -59524, 73190, 310340, 447718, 495548, 352426, 330312, 247721, 169833, 336290, 220247, 297671, 113211]
13451C38403O5097O4745A77426b808E48469B54981H673M44122j43742A04684J66424
13440B71108E9626M30057H8249j9209K75156J78624A25672Q4124K9505M5694j01556
13429A83439J50306k8525J71880A13963M03405A62948J89724R6225C8984L0960
13419F9944J81419G4323K4211b7207B39060O4748P4802o3151r9304J32752A10400
13407A75361K00775j41943N1628G7621H726K9971f7574B05325C4843K25050k9378
13396B30515r132O199p8591l1009K05001D5602K70423K39772B27045o7485L16870
13385D76430d970B72543p6332J23951j17410L15466k37974A08426K67715j36902
13375B39239O855C0538L8911J85410n8701E4478L96217A67919K7529K49955A26603
$$ y = [338403, 403500, 468245, 177426, -2808, 548469, 254981, 8673, 452795, 309053, 104684, 271108, 59626, 489683, 88249, 69040, 344196, 522820, 125672, 209796, 239301, 284995, 183439, 333745, 305220, 477100, 113963, 517368, 162948, 352672, 448897, 38984, 69944, 251363, 74323, 98534, -27207, 239060, 303808, 378610, 315459, 216155, 348907, 110400, 175361, 376136, 234193, 285821, 77621, 8726, 38697, -67574, 205325, 34843, 259893, 230515, 221383, 227582, 148991, 117982, 322983, 45602, 316025, 555797, 227045, 159560, 476430, -4970, 272543, 196211, 320162, 202752, 518218, 280244, 108426, 376141, 239239, 246094, 30538, 69449, 254859, 196158, 54478, 450695, 167919, 195448, 445403, 126603]
13363H144a58527A70963J63801a41009A0354J2968Q1786K33432N1155J5201A07259
13351B81834n5615A12521n1099J28234K02510j15350c2108C70243C5941K3344
13341E9285k661N7824K5794M2053K82589N3907B07160p5541j5624K85868j67863
13330B34000M29309j29057A15803K67513d5758C28807A00245J26381Q8724r4731
13320B20619k0464p5142R7036j05904L11317C1713K39698n3411M0938M08581B02815
13308B64485J67287E6793K0530K02391o0461A04286e1756B5113M95602A62673
13297B8915L46697A63905J41312A27469J9423K35161m8510j09197b785H6144J72407
13286B58551i7709b545j30990A81165J64961n818j36653a5816m9485l1827E4362
$$ y = [8144, -158527, 170963, 334764, -141009, 10354, 23322, 105108, 338540, 389695, 404896, 107259, 281834, 226219, 112521, 61422, 189656, 392166, 276816, -32108, 370243, 35941, 59285, 56624, 114448, 140242, 182295, 464884, 518791, 207160, 131619, 115995, 401863, 234000, 663309, 534252, 115803, 383316, -45758, 328807, 100245, 226626, 315350, 220619, 200155, 125013, 222049, 116145, 427462, 31713, 271411, 218000, 258938, 667519, 202815, 264485, 431772, 56793, 77323, 279714, 219253, 104286, -51756, 25113, 520715, 162673, 28915, 375612, 163905, 305217, 127469, 146892, 382053, 333543, 224346, -2785, 86144, 258551, -97709, -2545, -133535, 181165, 346126, 340308, 203655, -15816, -65301, -97128, 54362]
13274A79519a56374C54281a34845B19317K11465F6017J42710q7219B739J30692
13264A33431J89795B9661P3430a7876p7397A87072g7747E160K59842A30797Q6807
13253B17604K35079H0840l1622j571J56912G6546R9325O8977H6399N3981E2078
13241C97994i7024B03926g956D27544A2717a43803B02645E1668J76436f6123b6699
13229G6220L09556A15093N29109F9301J72758N450b05153C7807R5734A2742K14941
13218B27683b50059E14950i9250A31457O9921J12111E5184h1163B70488c0799
13207a89139C76036n5830j50238a91939A61680L33078o6244A31386J2071a37780
13196B13823l8916k4041J70251F1453P5502P6093J066A01356Q3398k3698O8247
$$ y = [179519, -156374, 354281, -134845, 219317, 430782, 66017, 208727, 121508, 2739, 133431, 323226, 29661, 103091, -17876, -95273, 187072, -77747, 5160, 265002, 130797, 217604, 452683, 80840, 49218, 47647, 204559, 76546, 175871, 244848, 86399, 140380, 52078, 397994, -97024, 203926, -7956, 427544, 12717, -143803, 202645, 51668, 228104, -66123, -26699, 76220, 385776, 115093, 644202, 69301, 242059, 247509, -205153, 37807, 133541, 12742, 227683, -250059, 514950, -99250, 131457, 201378, 313489, 55184, -81163, 270488, -30799, -189139, 376036, 320206, 169968, -191939, 161680, 494758, 428514, 131386, 143457, -137780, 213823, 174907, 150866, 321117, 61453, 136955, 213048, 214114, 101356, 184754, 161056, 229303]
13185B29303h404B87569b530B63595j31197N9709J50986j25937J051a7657A99745
13173C21937f557A04179k8391K95485e6521A78140J65100n6183h1365l7320C22108
13161F4146A7852j087K34861b19426L1170D75934C9149J81845b98145f2262A00589
13149a48725D34131A19774i7157B28102J97418e2872j8662E3222J05209G8459
13138A67956e0349q1078A27941B1002j766K44999G9183J85219O6692A53095D09
13126A8955K52213A1008c9232A81642i0744B59324A27405M7373J33276a12507
13115B30919G7452A3507O7408e8171I7269b642A66033n4724K112J28788c7018
13103B4263M4655b22277B73798c1899B52735J72635A96031K5541B2905J81595
$$ y = [229303, -8404, 287569, -2530, 263595, 132398, 192107, 343093, 217156, 218207, -17657, 199745, 321937, -6557, 104179, 75788, 371273, -56521, 178140, 343240, 287057, -81365, -118685, 322108, 64146, 17852, 16765, 251626, -219426, -188256, 475934, 39149, 220994, -298145, -62262, 100589, -148725, 434131, 119774, -97157, 228102, 425520, -52872, -71534, 53222, 158431, 78459, 167956, -50349, -131427, 127941, 21002, 19236, 264235, 79183, 264402, 331094, 153095, 409, 18955, 271168, 11008, -39232, 181642, -90744, 259324, 127405, 174778, 308054, -112507, 230919, 77452, 13507, 80915, -58171, 97269, -2642, 166033, 111309, 113421, 242209, -37018, 24263, 68918, -222277, 273798, -31899, 252735, 425370, 196031, 221572, 22905, 204500]
13093B04500d9160j39034F0334N6706M30745a03535C4953A634g193j0597A39802
13081B65462I7151R2458J36717j36356l2394p7600f7561C77874a47396E5751a62744
13069D8385k0199a00911N0097A08767E507a47083A54612m5700K3256E0028a11426
13057B38006i5254A81746i4094d0963l8681H1069J59929G6516k361a04774l3107
13046a37881B4343K07175F4021b44793E7267J49368F8569r97J09799i6652M6478
13035e0174E21660H6288b6653B2114N5849J89260O2257I9481O4901B4304L94013
13024D18317B4312J30661N9613A03503C4528a92965Q6678B3181J08486b98989
13013A32598a33116C08291E4652A3376c44711C38013j12229J11283a96594B4872
$$ y = [204500, -49160, -188194, 60334, 117040, 547785, -103535, 34953, 1634, -7193, -17790, 139802, 265462, 97151, 189609, 326326, 189970, 157576, 79976, -67561, 377874, -147396, 55751, -162744, 48385, 28186, -100911, -50814, 108767, 5507, -147083, 154612, 108912, 132168, 50028, -111426, 238006, -95254, 181746, -94094, -40963, -79644, 81069, 240998, 76516, 74155, -104774, -137881, 24343, 231518, 64021, -244793, 57267, 206635, 68569, 67572, 177371, -96652, -50174, 521660, 86288, -26653, 22114, 77963, 267223, 329480, 99481, 164382, 24304, 418317, 24312, 154973, 214586, 103503, 34528, -192965, -106287, 23181, 131667, -298989, 132598, -133116, 308291, 54652, 13376, -344711, 338013, 225784, 337067, -196594, 24872]
13002C08030H3112K27733A50199K59573n5696K69739H2348B8049J1911K7635g911
12990C50186A68433n6684J217b4414j03969N263B71041c08425A58318J19130J15227
12979C92675A48257b4147A26183K07305a73791J6225E40573a54514B43362b47110
12968A61195c66866B6224a52944B08826B4495J71772I7172j634c0847j7085B29405
12956b08825J4285F8952J05789K03485b5225j8032A42008P3792r2243m5414L7355
12945A15498a45530H8564J81009A07063J83637a42016G906J23488b19105C48379
12934a90767j8218E248a18687K1753F7415L00196b85881F1571b63442a18148E5829
12922B11807f5610H5694c7621B2736J23269n0201K60775a01371c1773E222c24489
$$ y = [308030, 83112, 310845, 150199, 409772, 354076, 623815, 82348, 28049, 39960, 67595, -7911, 350186, 168433, 111749, 112966, -24414, -128383, -123120, 271041, -308425, 158318, 277448, 392675, 148257, -24147, 126183, 333488, -173791, -157566, 540573, -154514, 243362, -247110, 161195, -366866, 26224, -152944, 208826, 24495, 196267, 97172, 95538, -30847, -47932, 229405, -208825, -194540, 68952, 174741, 378226, -25225, -43257, 142008, 215800, 123557, 78143, 115498, -145530, 88564, 269573, 107063, 290700, -142016, 7906, 131394, -219105, 348379, -190767, -208985, 5248, -118687, -96934, 67415, 367611, -285881, 61571, -263442, -118148, 55829, 211807, -65610, 85694, -37621, 22736, 146005, 95804, 356579, -101371, -31773, 5222, -324489]
12910i4565j26943a840C51338A32304a65679f1681A65176a16140A2391h8647B03007
12898b50151A16773b52381J12508A9203P1556H92L73574E2140L44216A95287Q1584
12887B76871j37689f2292m6378A61578m6174C376N6026b25270C47972c8371n2225
12876i0596B98012j45834n5535a71736P4497K3181l7251I2542a29601C43058c6530
12864F7944a68199F5141J50826c4041k09923A41054L9266a63722M8675K6019B31086
12852B41560i2395B14341b14258A83602a08948A95907o9410b13354C48665A32847
12841a032j23911B97175b98951E3056m115d24552C07870G9613k8597J49542l3845
12830A66713f6628l5341n3313C9035a73552H3894K4979P6213Q1354D8423K62620
$$ y = [-94565, -221508, -1840, 351338, 132304, -165679, -61681, 165176, -116140, 12391, -88647, 203007, -250151, 116773, -252381, -139873, 19203, 90759, 892, 374466, 52140, 396356, 195287, 276871, 139182, -62292, -108670, 161578, 115404, 3376, 59402, -225270, 347972, -38371, -90596, 298012, 152178, 96643, -171736, -97239, -74058, -111309, 92542, -129601, 343058, -36530, 67944, -168199, 65141, 215967, -34041, -243964, 141054, 180320, -163722, -115047, -89028, 231086, 241560, -92395, 214341, -214258, 183602, -108948, 195907, 126497, -213354, 348665, 132847, -1032, -124943, 297175, -298951, 53056, 48941, -424552, 307870, 79613, 51016, 200558, 166713, -66628, -101969, -155282, 39035, -173552, 83894, 108873, 185086, 266440, 48423, 311043]
12819C11043b50025F6797K0613b73599O5078D7066J53904B569P579K14969B5407
12807c14192F4269a30747A03090K47219b4433B9771J02613l0839f3517H7605R2551
12796A80156b26650A675a15833A87273G8838l3353M146J96823A18107K848f2243
12784d4173q1514p3281A46213F3281g3080p892E5558M55018A98932m4087J28753
12773B83598b27972C9998a42653E4485L04317d0086o3436A50753M7949m2367b7599
12761F9003M5856h7477C7524J9889a99664G6790M2688a83797B12349n2153F3717
12749B9572R3403k0136l8237b76290J27832e1209B34560f6264A2287N6437e44413
12737B1213a70727e9772k53663A89546i3084D71144a89916R0020c0422n3810Q598
$$ y = [311043, -250025, 66797, 87410, -273599, -208521, 47066, 200970, 2569, 10148, 225117, 25407, -314192, 64269, -130747, 103090, 350309, -24433, 29771, 132384, 101545, -63517, 87605, 180156, -226650, 1675, -115833, 187273, 78838, 45485, 49631, 246454, 118107, 120955, -62243, -44173, -125687, -198968, 146213, 63281, -73080, -80972, 55558, 510576, 198932, 154845, 283598, -227972, 39998, -142653, 54485, 358802, -40086, -103522, 150753, 198702, 156335, -27599, 69003, 114859, -87477, 37524, 57413, -199664, 76790, 119478, -183797, 212349, 160196, 63717, 29572, 122975, 102839, 64602, -276290, -148458, -51209, 234560, -66264, 12287, 68724, -544413, 21213, -170727, -59772, -313435, 189546, -93084, 471144, -189916, -99896, -30422, -84232, -75634]
12726g5634c0174J0570F1145a2333B79549D4723b4312B22558P1438R7345c20522
12714H2267J0040a94406D6167J45917e4679G2664K14413E3931b39577A0257a1343
12702I1090a59641A88693a29534B9911L21799b2730B13797A04280m2785J37589
12692A99084K35845d3429G2483J17363p9587J08828A04349a73782B09975P8982
12682B88957o8807g6879A71559G6040L18927j82587B2128L73157j64011a053H8156
12670E7362m046d5657H9023l7658j3289b56267a24043k9987B2573a77233B41483
12658B80518m3944A15886Q9647f8497j93271H0207a85123d3823D2877K6490C288
12646e7754k18813A19979O1186J24336K2627a64410F6863B0900e7948D67586A05532
$$ y = [-75634, -30174, -19604, 61145, -12333, 279549, 44723, -24312, 222558, 293996, 391341, -320522, 82267, 92307, -194406, 46167, 192084, -54679, 72664, 287077, 53931, -239577, 10257, -11343, 91090, -159641, 188693, -129534, 29911, 351710, -22730, 213797, 104280, 61495, 199084, 434929, -43429, 72483, 189846, 110259, 219087, 104349, -173782, 209975, 288957, 220150, -76879, 171559, 76040, 394967, 212380, 22128, 395285, 231274, -1053, 88156, 57362, 53316, -45657, 89023, 51365, 38076, -256267, -124043, -154030, 22573, -177233, 241483, 280518, 236574, 115886, 205533, -68497, -261768, 80207, -185123, -43823, 42877, 69367, 3288, -57754, -276567, 119979, 181165, 305501, 328128, -164410, 66863, 20900, -57948, 467586, 105532]
12634H6342L8910g5322B09515A043a44476a3475F9765k5446a32625A13298l26
12623A12972c6067D2633b03203g1785B71902g264A73483P8179i839m0661B72439
12611B03085K24250D0247R6767J0827N8190M2254A8641K62116H9301J47017N9055
12600B95373p2901d0946j6288B75204d4729k620D922i9566r0122B07179a04508
12588B39646a70039D84772c6822b525A13357D825M9891J01504C991P0396L3631
12577A08018m015j1403O0820K49526c5058L215l42532F5978L2529g6953j03447
12566a80400I0480P75C1240J18246M11491d00333a55070I0224e9920q399B26555
12554b12168f4194B34718D948J63709c93606B96882G3302J97697H2963A0923P5164
$$ y = [86342, 125252, -75322, 209515, 1043, -144476, -13475, 69765, 44319, -132625, 113298, 112972, -36067, 42633, -203203, -71785, 271902, -7264, 173483, 251662, -9839, -50500, 272439, 203085, 427335, 40247, 137014, 147841, 206031, 248285, 18641, 280757, 89301, 236318, 295373, 222472, -40946, -57234, 275204, -44729, -47349, 4922, -99566, -189688, 207179, -104508, 239646, -170039, 484772, -36822, -2525, 113357, 4825, 54716, 156220, 3991, 74387, 108018, 104003, 92600, 153420, 402946, -35058, -31843, -374375, 65978, 98507, -76953, -180400, 90480, 91255, 31240, 149486, 560977, -400333, -155070, 90224, -59920, -68319, 226555, -212168, -64194, 234718, 4948, 168657, -393606, 296882, 73302, 270999, 82963, 10923, 86087]
12543H6087J26802k6663m4353O6658k0623M42O0134i8134k18037J44895a4576
12531a41723J7802j66222B26541N2643f7094m3940D4363K444I148i8231I46K98010
12519B98956b8122A79654i1362o1592A80535L0386A2434f3219B21633a73179B8507
12507A12991K2633A1487L9895b01870j59438A33217o3262L0904P6561J64276e493
12495a65054q728d0789B67830C9401R3387b52105E6824a02991A23867a24953a9625
12483a66398K7137m6868A38572d11340a19399j8508L5135D0332Q099K32680a23985
12471g8392B53084g5497j40463B47898j21863B9192d9864p8963I538b77406I6117
12459d731A0062k008a60119H883a82j84099A28719d3676k29684c087r5884p9153
$$ y = [86087, 212889, 186226, 141873, 208531, 187908, 188350, 248484, -98134, -316171, -171276, -14576, -141723, -123921, -290143, 226541, 279184, -67094, -111034, 44363, 46807, 9148, -98231, 946, 298956, -28122, 179654, -91362, -152954, 180535, 210921, 12434, -63219, 221633, -173179, 28507, 112991, 135624, 11487, 51382, -201870, -361308, 133217, 69955, 100859, 177420, 341696, -5493, -165054, -173782, -40789, 267830, 39401, 132788, -252105, 56824, -102991, 123867, -124953, -19625, -166398, -139261, -186129, 138572, -411340, -119399, -137907, -102772, 40332, 48431, 281111, -123985, -78392, 253084, -75497, -215960, 247898, 126035, 29192, -49864, -128827, 9538, -277406, 96117, -4731, 10062, 8054, -160119, 8883, -182, -184281, 128719, -43676, -273360, -3087, -98971, -178124]
12447a78124G8139c6322J6253A75621J02323j09533n1062D5899a44865o9441J04876
12436a09430l3100J3413k21625f1250B19053c44005H7337P5846J07524E4904d4612
12424b34184b3600G9582B0740Q7857K7648b5489p0289j00352A34288E5190j7880
12413C7310L99394A10485a36015D3289b25453D7499c1720G4022K79424j10962
12403B42484g146j57500g2766D9012a05243a9553A34520b55198m1813F2714c0329
12391a33145G2019p497a94420I0501b5773r502n9022A70048J82058F3174j4970
12380D8204a29136L2208A22826b03687E4873a63242j16927A02253e3164B2036
12369C27865b34217E922J56875a68197A69011i4862j3564C5354a09926M379F6884
$$ y = [-178124, 78139, -36322, -20069, 175621, 277944, 168411, 117349, 45899, -144865, -214306, -109430, -142530, -129117, -350742, -61250, 219053, -344005, 87337, 163183, 270707, 54904, -44612, -234184, -23600, 79582, 20740, 108597, 136245, -25489, -95778, -196130, 134288, 55190, 37310, 436704, 110485, -136015, 43289, -225453, 47499, -31720, 74022, 353446, 242484, -7146, -164646, -72766, 49012, -105243, -19553, 134520, -255198, -297011, 62714, -30329, -133145, 72019, 64522, -194420, 90501, -25773, -35275, -94297, 170048, 352106, 63174, 48204, -129136, -96928, 122826, -203687, 54873, -163242, -280169, 102253, -53164, 22036, 327865, -234217, 5922, 162797, -168197, 169011, -94862, -108426, 35354, -109926, -105547, 66884]
12357D4210e7282A67961O4985D4585a14600B4440L53954d7158q6537O479A07197
12345f5845A79955b38690g7277j44660e3922H8626a96485C7077a89724A00111
12334I2695f0564A67635j6888m9106K52867B9236K2024O7083c92320Q8641A21040
12322B60219E7423J21910a06030j7274d2433D9248K3189k5865c5725o14B26757
12310c81475A19302b6988b623A62733a33452D0102J00945n0321i3094C37912b5475
12298A57455a56432B26949h7817A98261m7240a11928d8521o5700r7858A32242
12287A75358B1483J95015b64002B15216h092q7859D554O7768b37222f6758D7869
12275B39888q4589c04762i3361B6835K55277j30936O918g914m6034j16860A279
$$ y = [44210, -57282, 167961, 232946, 44585, -114600, 24440, 378394, -47158, -133695, -127216, 107197, -65845, 179955, -238690, -77277, -221937, -53922, 88626, -196485, 37077, -189724, 100111, 92695, -60564, 167635, 150747, 101641, 354508, 29236, 51260, 118343, -392320, -303679, 121040, 260219, 57423, 179333, -106030, -123304, -42433, 49248, 72437, 46572, -35725, -36339, 226757, -381475, 119302, -26988, -2623, 162733, -133452, 40102, 141047, 90726, -93094, 337912, -25475, 157455, -156432, 226949, -87817, 198261, 151021, -111928, -48521, -114221, -212079, 132242, 175358, 21483, 216498, -264002, 215216, -8092, -95951, 4554, 72322, -237222, -66758, 47869, 239888, 155299, -304762, -93361, 26835, 282112, 151176, 158094, -7914, -53948, -170808, 1279]
12263G0033k9153J63183a02963E829L24306A21641D2475J29831a51603A72828
12252A49238J2463A6808a14438A49113b4577I496D428R2722l4785h537E43949
12240a93614C08228j4245b1260A73487K8882c830A58005i6041b0431C02881j3545
12229B89336A31766D3916J05067c1657B1442c8941r409M20B32824q5133P8184
12218B25875A1974K71317b22946C89286m8519g0744b233j82496l5682C78918K00159
12207E79077B16809J27699r1430p087k146J15649i4163A4766g0824j1919C61081
12195A94157a17118A29400L68700k17223p3231a67666G1793J83949m6374G6291
12184A03255K90559a29117I6530N016K4872J75204p5643K9738A06652f3819q7395
$$ y = [70033, 40880, 204063, -102963, 5829, 330135, 121641, 42475, 172306, -151603, 172828, 149238, 161701, 16808, -114438, 149113, -24577, 9496, 4428, 97150, 62365, -8537, 543949, -193614, 308228, 293983, -21260, 173487, 202369, -3830, 158005, -96041, -20431, 302881, 289336, 131766, 43916, 148983, -31657, 21442, -38941, -48350, -47930, 232824, 147691, 225875, 11974, 283291, -222946, 389286, 340767, -70744, -2233, -184729, -220411, 378918, 579077, 216809, 344508, 253078, 245991, 243845, 359494, -94163, 14766, -70824, -82743, 361081, 194157, -117118, 129400, 498100, 280877, 207646, -167666, 71793, 255742, 209368, 76291, 103255, 393814, -129117, 96530, 101546, 126418, 301622, 225979, 255717, 106652, -63819, -151214]
12173a51214L5587B15062f0911B16658J93528a42059b8006B78704H0267g9722
12162b33458A43753B8716J93238K08025A88843A1377Q5194N0896K56885j90094
12152B14258Q7959a32673A3679J40390l1001a20514A64269b52254C13981a0937
12141A34897Q959a35667e4885A89284a66625B05563c7688G1106a14855I7425a12539
12129A38883E7067F007R4983k8131a92343h5777l0962M5044E1014f5381A28503
12117a58440N2924b1592A63513q1631P4698A591J7119R275K16571e5741A12619
12105F5682Q5022G907K19118H5665J86115A1943a5595A21925a36188f1218B69287
12093a42067k7060g8265E21904A1858O3109a63665A44724e7951C9768c58853J46330
$$ y = [-151214, -115627, 215062, -60911, 216658, 410186, -142059, -28006, 278704, 80267, -79722, -233458, 143753, 28716, 221954, 429979, 188843, 11377, 96571, 147467, 404352, 214258, 302217, -132673, 13679, 154069, 123068, -120514, 164269, -252254, 313981, -10937, 134897, 143856, -135667, -54885, 189284, -166625, 205563, -37688, 71106, -114855, 97425, -112539, 138883, 57067, 6007, 100990, 72859, -192343, -85777, -116739, -71695, 51014, -65381, 128503, -158440, -105516, -21592, 163513, 81882, 156580, 1591, 18710, 27985, 244556, -55741, 112619, 65682, 150704, 7907, 227025, 85665, 271780, 11943, -15595, 121925, -136188, -61218, 269287, -142067, -169127, -78265, 521904, 11858, 74967, -163665, 144724, -57951, 39768, -358853, -212523]
12082b12523E496b46380f6505J4671A95059a94501r9490A59213l9260D1104J45024
12071A86128O4199j2092a21980D7357J8741Q2806J85270a53485E3879L39057A94553
12059B60084O76406j40249l59268H465e3854A89723a28736B10970m5136k3643
12049A42191m3888N9030f4843G6099a02394A11059K17804i5528d4673k921G8366
12037a39956n9755A6559a91764H3005j7332B2107c1903B76685A04236R5050a21518
12025A91694G4818g014j27485H972a55857b0896j42489A1381c04157B56582D3599
12013A87142P184b27691a06253k09603f1463B01037a56114k6529d12G2363h5820
12001H5124L3471j1940a67270A66066c5841B44600F7726K91285H7903d6624a8475
$$ y = [-212523, 5496, -246380, -66505, -51834, 195059, -194501, -293991, 159213, 119953, 41104, 186128, 250327, 238235, -121980, 47357, 66098, 148904, 334174, -153485, 53879, 392936, 194553, 260084, 936490, 796241, 436973, 8465, -53854, 189723, -128736, 210970, 165834, 142191, 98303, 157333, -64843, 76099, -102394, 111059, 328863, -95528, -44673, -47594, 78366, -139956, -199711, 16559, -191764, 83005, 65673, 22107, -31903, 276685, 104236, 199286, -121518, 191694, 74818, -7014, -134499, 8972, -155857, -20896, -163385, 11381, -304157, 256582, 43599, 187142, 194326, -227691, -106253, -315856, -61463, 201037, -156114, -182643, -412, 72363, -85820, 85124, 118595, 106655, -167270, 166066, -35841, 244600, 67726, 359011, 87903, -46624, -18475]
11989A52256b06646N9960m3551c6140F0910K6400P0574N2512p3032d3629C88687
11977a17922I6418g4938A3092e3485k82298I6137l4499a91035B381h8744E1728
11965a82476B19206I9886f8766A466a05648A60593f0093A55298c84467A39399
11954c912G2348a85015A50651a72428q1047h5636J1655D9796O5590a4151j16560
11943a30711c0764A14514D1709c51794i2962q1101F7381N8446C6946N2817b53254
11931f5858l4067j63240a1309q1028H9567G260a91425k18419a98215P4308A83610
11919a18711C23785j108l7381j15972d4761G9894c52251E2910J07982a64271O049
11908a58222A27921b35350b8797C54319a29709A22442a8189A84467a24871A29873
$$ y = [152256, -206646, -146686, -190237, -36140, 60910, 87310, 157884, 210396, 137364, -43629, 388687, -117922, 96418, -74938, 13092, -53485, -335783, 96137, 61638, -191035, 2381, -88744, 51728, -182476, 219206, 99886, -68766, 1466, -105648, 160593, -60093, 155298, -384467, 139399, -3912, 72348, -185015, 150651, -172428, -253475, -85636, -73981, 49796, 115386, -14151, -130711, -30764, 114514, 41709, -351794, -92962, -174063, 67381, 125827, 36946, 89763, -253254, -65858, -99925, -263165, -11309, -92337, 89567, 7260, -191425, -409844, -198215, -123907, 183610, -118711, 323785, 322677, 285296, 169324, -44761, 79894, -352251, 52910, 160892, -164271, -158222, 127921, -235350, -28797, 354319, -129709, 122442, -18189, 184467, -124871, 129873]
11897A71172P4690k0989a88669B21467b2979k64642A22729g1998D5562K952N3308
11886A01822L0247b85590a15888D0330J23113b12956C2495a07798j69582g2878
11875C10304i5885B0069J27K1199b30532E3381e2064k08582A119a23934E8066
11863d6064I0613c26308A7635m822b10924M6422d7377K2774r1446j49369B01989
11851b63328h5360C01847e1466j36872M2286q6078b5094n0774A71818d9330k32120
11840b81450J30218C60059b40392c3903B0869d83703B1601i2157m1828I1984a75093
11828c63541B4503g8108c3957D8380d81746h606A94551c5691k00963Q7521A72978
11816f7080L0467j42202B85864A02734c18741I0147a47786B65998d7708o2486
$$ y = [171172, 245862, 224873, -188669, 221467, -22979, -287621, 122729, -71998, 45562, 48514, 101822, 132069, -285590, -115888, 40330, 163443, -212956, 32495, -107798, -277380, -72878, 310304, -95885, 20069, 20196, 41395, -230532, 53381, -52064, -260646, 1119, -123934, 58066, -46064, 90613, -326308, 17635, 12813, -210924, -164502, -47377, -24603, -116049, -265418, 201989, -263328, -85360, 301847, -51466, -188338, -146052, -232130, -25094, -75868, 171818, -49330, -281450, -151232, 360059, -240392, -33903, 20869, -483703, 21601, -92157, -133985, 91984, -175093, -363541, 24503, -78108, -33957, 48380, -481746, -8606, 194551, -35691, -236654, -149133, 172978, -67080, -36613, -178815, 285864, 102734, -318741, 90147, -147786, 265998, -47708, -110194]
11806a10194n0615B551a7044G5296g3954j28031K5682Q1853l44148c2652E0619
11794c59962b2780j13236G5763a88077D8414k296O8433D7395J35128j8289h6993
11782A27855m0720A1488K75025g2339k00540g8454C0929L833b63940A10407J07341
11771B17748J10965I1275R7169b34570J03065k25268h0354a8916F4083d8286k2510
11760g0796l0324M3561q338H1518a86120P5373A801M7463a27846l5277P2342c9336
11747B28508q5308a32092n9007M3050j09744k6415A4580J01984L6158a45412f9892
11735d06601A03616d23002B20220a00818B45730r9566a55058a8599A04964l5018
11725F9946b73322G3881a04283H0443c7455j00027O8316K5229h676o2866B69802
$$ y = [-110194, -160809, 2551, -17044, 75296, -73954, -201985, -176303, -94450, -438598, -32652, 50619, -359962, -22780, -136016, 75763, -188077, 48414, 46118, 114551, 47395, 182523, 164234, -86993, 127855, 87135, 11488, 286513, -72339, -272879, -78454, 30929, 34762, -263940, 110407, 217748, 328713, 91275, 188444, -234570, -131505, -356773, -80354, -18916, 64083, -48286, -70796, -101120, -57559, -65897, 81518, -186120, -110747, 1801, 49264, -127846, -163123, -90781, -39336, 228508, 143200, -132092, -191099, -148049, -257793, -284208, 14580, 116564, 152722, -145412, -69892, -406601, 103616, -423002, 220220, -100818, 245730, 146164, -155058, -18599, 104964, 69946, -273322, 73881, -104283, 80443, -37455, -137482, -69166, -43937, -8676, -71542, 269802]
11713G2494r572b68106a0673F993h9477D9031J60437h9837C8190J76545b3391
11701a75823e8154B01775B5670J31896a9328j48627A07635J93282c87811A7953
11690E2809Q9771c72426j778J51615E0224k0051b65149J05460H2028e1589A82647
11678A97817l5194D5214P615c53758a34066A42927N1448L557b0578r8887H5075
11666b24981g3483A45104m6925D8710a05005j13456M5286j481D9062e7981j40632
11655a98613J6443B1330a00096b5185G0435a49186K7755e4578j74546C6428N3065
11644H9493J27643e3420A9576a68974C5016M0171g1934G5553A8246P4364Q41M5492
11632A38943E1025b74592N3013h6858d2640B47881j14007o4850Q7010i4239A06520
$$ y = [72494, 62922, -268106, -10673, 6993, -89477, 49031, 209468, -89837, 38190, 214735, -23391, -175823, -58154, 201775, 25670, 157566, -19328, -167955, 107635, 300917, -387811, 17953, 52809, 142580, -372426, -374204, -222589, 50224, 30173, -265149, -159689, 82028, -51589, 182647, 197817, 162623, 45214, 52829, -353758, -134066, 142927, 194375, 197932, -20578, -119465, 85075, -224981, -73483, 145104, 98179, 48710, -105005, -218461, -173175, -174656, 49062, -57981, -198613, -182170, 21330, -100096, -25185, 70435, -149186, -121431, -54578, -229124, 36428, 89493, 217136, -53420, 19576, -168974, 35016, 75187, -71934, 75553, 18246, 92610, 93451, 138943, 51025, -274592, -221579, -86858, -42640, 247881, 133874, 69024, 156034, -94239, 106520]
11620G5674g8937A11086J14381l9451d67046A03978C097J1622P319g9400B68964
11608B03302g1206C2829J93867i5557C65203j06608a63674a275j5914D9289a81112
11596a55399C2574c32251b837E07690a59862j25381d3127j05862j16672g7808
11585a04357E8323Q0365c9193A92724f197A11967j6051J61233D8170c02257J39843
11574a62414C27432a19263A64281K09008D8018J0630J8087j6269J1444j380R265
11563G9795b6957k83563f2274E3588K81887D9024m092J67028p0448B8836a06447
11551A12030I518a45515I652J21744B4419a55413A14931L5513R8502E9929B9391
11539c61772A14795b33316c616A93863a37133L7701c1855A15279a55604B57364
$$ y = [75674, -78937, 111086, 225467, 186016, -467046, 103978, 3097, 14719, 22038, -79400, 268964, 203302, -71206, 32829, 226696, -95557, 365203, 258595, -163674, -1275, -17189, 49289, -181112, -155399, 32574, -332251, -2837, 507690, -159862, -285243, -43127, -148989, -265661, -77808, -104357, 58323, 138688, -39193, 192724, -6197, 111967, 95916, 257149, 48170, -302257, -162414, 327432, -119263, 164281, 373289, 48018, 58648, 76735, 60466, 71910, 70530, 79795, -26957, -310520, -62274, 53588, 335475, 49024, 44932, 211960, 141512, 28836, -106447, 112030, 9518, -145515, 9652, 131396, 24419, -155413, 114931, 150444, 248946, 59929, 29391, -361772, 114795, -233316, -3616, 193863, -137133, -99432, -31855, 115279, -155604, 257364]
11528b7330j21780B35440B7207c46855h0378j00418d2777D7829d3648j10740N2365
11517a02023B67636A3909O224P9355i8984B12630r1776c5503a1854j84040B41222
11505G4000J52546a21081C08338C680J14543h469l0580C98028a81113a4429o1246
11494g5675A01274a9060C60672c4779B15076D7689K0318J46109F0619G41L56133
11483C56874a34509P897A79114i648k1723G5466j3811r282a76761A73946h9217
11471b7117n9318n4523G3868K11066J51659I3479f3310A8499R2740l1610O2042
11460A41671O4660a81560D16730C3699N3607J26893J65682k8040j56819b9397
11449A42328J70107m5633o6234N5646b03100A79848D6461N6787M3955b32642B06428
$$ y = [-27330, -149110, 235440, 27207, -346855, -80378, -180796, -42777, 47829, -43648, -154388, -102023, 267636, 13909, 20133, 99488, -98984, 212630, 120854, -35503, -11854, -195894, 241222, 74000, 226546, -121081, 308338, 3680, 118223, -8469, -39049, 398028, -181113, -14429, -75675, 101274, -19060, 360672, -34779, 215076, 47689, 68007, 214116, 60619, 741, 356874, -134509, -126612, 179114, -9648, -31371, 75466, 61655, 52373, -176761, 173946, -89217, -27117, -86435, -140958, 73868, 284934, 436593, 93479, -63310, 18499, 111239, 79629, 141671, 206331, -181560, 416730, 33699, 87306, 214199, 379881, 351841, 195022, -29397, 142328, 312435, 266802, 200568, 256214, -203100, 179848, 46461, 103248, 147203, -232642, 206428]
11437H8270h5516F2458P7627B294d5245A09396P6789g8535D02874a83701A70752
11425A55500f7004A42290d0695E4731N3630b30700A04263D8607O7104j3902m8721
11414E3088k1455Q4895J02721R1543a25911q6827P4211A86239e4309E9019e5240
11402a29046A4327K31838o0675A360R6365c12493i9001B3037c8774A45486o2345
11391H3141b50121A41042e4670m3310E9071J38183a53803A7093J11162B7259L0956
11380E8215a91292g7992A56205i0350C0939h4711a802D5937b51462C88567F9589
11368a54321B55936e6118A6150J58822i6510p7267A17915R7820G0946a76775f475
11356a87890C3665h0462H8865b46094G2923e29488C9336b5257B40044a7876A11469
$$ y = [88270, -85516, 62458, 140085, 2294, -45245, 109396, 186185, -78535, 402874, -183701, 170752, 155500, -67004, 142290, -40695, 54731, 108361, -230700, 104263, 48607, 115711, 101809, 53088, 31633, 116528, 219249, 310792, -125911, -212738, -138527, 186239, -54309, 59019, -55240, -129046, 14327, 246165, 185490, 1360, 97725, -312493, -99001, 23037, -38774, 145486, 83141, -250121, 141042, -54670, -97980, 59071, 197254, -153803, 17093, 128255, 27259, 58215, -191292, -77992, 156205, -90350, 30939, -84711, -1802, 45937, -251462, 388567, 69589, -154321, 255936, -56118, 16150, 174972, -96510, -173777, 117915, 215735, 70946, -176775, -6475, -187890, 33665, -80462, 88865, -246094, 72923, -529488, 39336, -25257, 240044, -17876, 111469]
11344g8722r4966p6350M569j27549a32112M1316B3109L3724a1217H4764g9640
11332c60680J15934h8292n2178a5006F1426e9504p654m0243B15806a02599d0217
11320a07195B05188a7178j43290O9150q4941B6063a80294M7053r851H7058c77749
11308B45401p9242e0642k2501A4902c4559l2408A04019l9111M5643D57c8723C23078
11295C8670f307l1971a3063m62769E0912J14608O6015b23577J09327C3538b57552
11283A28410J8772a54990L2206j09005E8345P4312a70405C00664D616J99081F4829
11271G5675c06963F5984b02796I720h9346i718B89792c2964j91463c1301k03949
11260b35250l7635A05140l7980B7429f56006e2727C6373A0239J72159E2546I220
$$ y = [-78722, -173688, -250038, -245469, -373018, -132112, -90796, 23109, 56833, -11217, 84764, -79640, -360680, -244746, -88292, -140470, -15006, 61426, -59504, -67158, -107401, 215806, -102599, -40217, -107195, 205188, -17178, -160468, -91318, -176259, 26063, -180294, -133241, -143092, 87058, -377749, 245401, 166159, -50642, -73143, 14902, -34559, -66967, 104019, 64908, 110551, 457, -38723, 323078, 38670, -6307, -38278, -13063, -475832, 50912, 165520, 231535, -223577, -114250, 33538, -257552, 128410, 147182, -154990, -122784, -231789, 58345, 132657, -170405, 300664, 4616, 203697, 64829, 75675, -306963, 65984, -202796, 9720, -89346, -9718, 289792, -32964, -224427, -31301, -235250, -272885, 105140, 67160, 27429, -656006, -52727, 36373, 10239, 182398, 52546, 9220]
11248E6010b03691I6028d7726b2563A92645b32154A05806h3156q2931K3568j03639
11237b46158R8216k04928J63591h8322o052k8553A15508C9825a72249B8304j3975
11226A4329b8729j98699A4740a27944C7027a55235p9310D1619L8873j0001a67632
11214A8808J34269h5963c9125j66387G4702O8629d8019j14892j354A437a56851
11202B00341a87658L2806A55346J0565A9820f4194B96240b9248A22852J65852
11192B88704a16701m7689l82134a36365H7918g8799j87109H3849J57133B6281
11181b27454M3016M3950n5414g542F0927a47584k74424D850a0615m70097i8608
11169a51827m2565C6929a96193A29737e5227K966o7218j01112E1011d0544A53312
$$ y = [56010, -203691, 96028, -47726, -22563, 192645, -232154, 105806, -83156, -166087, -142519, -246158, -147942, -352870, -189279, -88322, -94374, -122927, 115508, 39825, -172249, 28304, 14329, -28729, -227428, 14740, -127944, 37027, -155235, -234545, 41619, 80492, 70491, -167632, 18808, 153077, -85963, -39125, -205512, 74702, 143331, -48019, -162911, -164265, 1437, -156851, 200341, -187658, -154852, 155346, 165911, 19820, -64194, 296240, -29248, 122852, 288704, -116701, -164390, -546524, -136365, 87918, -78799, -265908, 83849, 240982, 26281, -227454, -184438, -140488, -195902, -7542, 60927, -147584, -422008, 4850, -10615, -480712, -98608, -151827, -194392, 36929, -196193, 129737, -55227, -52261, -119479, -220591, 51011, -40544, 153312]
11157i0864L5918b0356A34819m389c6181A3204N3716N1690e1702F0275b20414
11145b04318P5428j43358O3051g929j50892P3155k8182J3396A515d425o1425j5217
11133h1067m9598C72687a12339D3999J750d0026o2888B99637d7922k03091n7992
11122c09005A30019m0038a76178n7514B7657K13928O5060d3456b0617m2362A81782
11110B97391p8324E7557N5836O7413B9359a2528H8982g2726B83491C547f2500
11098A45735J7953A6338L22110H0035A0159O8544B3099M3222L58941j71835l66
11087B53061I8040G832M92769b7520C55778a58661A93937j2580e8830D44624A9089
11075a62243A93569K0064n8854L03450c1968A4589K11586O5770D8285N2755k9485
$$ y = [-90864, -54946, -20356, 134819, 130430, -36181, 13204, 66920, 118610, -51702, 60275, -220414, -204318, -128890, -272248, -209197, -7929, -158821, -85666, -113848, -100452, 1515, -4425, -65850, -81067, -130665, 372687, -112339, 43999, 45749, -40026, -102914, 299637, -47922, -251013, -309005, 130019, 89981, -176178, -233692, 27657, 241585, 306645, -43456, -20617, -62979, 181782, 297391, 219067, 57557, 113393, 180806, 29359, -12528, 88982, -72726, 283491, 3547, -62500, 145735, 163688, 16338, 338448, 80035, 10159, 78703, 23099, 66321, 425262, 253427, 253061, 98040, 7832, 500601, -27520, 355778, -158661, 193937, 181357, -58830, 444624, 19089, -162243, 193569, 213633, 154779, 458229, -31968, 14589, 226175, 291945, 48285, 101040, 71555]
11064G1555J02001H5960J41160K715o0024d6121B07162q1165N1797J23693M9140
11053C50627j50250N1296I9038J21878J58123A12898M45065J2425k46549K84845
11043F08684j90272N0847A52486O78352k40801M0692k20078M9611L68376j51190
11033F77448l18564N92974l78145j0236r3755K70519l50082k5633K18187j29444
11023D53269j25578K39474J70257K62906m82445J76118m7604q3618m1201K05893
11013G27471L0970Q1362j70517j18253p907R5635B34435L05600j66369K85930
11003F59596j62518O4134k46440N04447l01981P4401m7699j81637J49540B27660
10992B95887L24343A27578K95177j6846J95972M0844j32848K41143j71770j20788
$$ y = [71555, 173556, 85960, 227120, 229835, 169811, -46121, 207162, 125997, 177794, 301487, 350627, 200377, 251673, 99038, 220916, 379039, 112898, 557963, 570388, 323839, 608684, 418412, 469259, 152486, 830838, 590037, 630729, 410651, 460262, 828638, 677448, 358884, 951858, 573713, 563477, 469722, 740241, 390159, 364526, 582713, 453269, 327691, 567165, 737422, 1000328, 517883, 694001, 646397, 562779, 521578, 727471, 758441, 839803, 669286, 551033, 543126, 638761, 234435, 540035, 373666, 659596, 497078, 561212, 314772, 819219, 517238, 591639, 543940, 362303, 511843, 227660, 295887, 620230, 127578, 422755, 405909, 601881, 642725, 509877, 751020, 579250, 458462]
10982D58462K10261q0872J16105k9806C36609J27731K05295j74701L66968j40196
10972G21706r8726q7474K77091K43538r5211J0627m5693K84780J79319K6038K29850
10961A645845l37067M94035k16562M23398L87292k19855Q3971l12938M11695l64660
10951A995154l63260k0119l80400J69446K28323j64232l80899j00270J13803k7000
10941A070546K76821j71409L6789k08881r5600l95802j03317P2516M0544o1916
10931D60291j46608J688A50609J87182o4115J2615n1137m1824E2510K10500A8125
10919B14563C9565a92047o7457E6870J78345O6132N7933j34818J94341f3813B09904
10907a07759A06814P9932D6057d5825E7472J27080C4190L17378A17637K99056
$$ y = [458462, 668723, 587851, 703956, 674150, 336609, 464340, 669635, 494934, 861902, 721706, 622980, 535506, 812597, 1056135, 960924, 971551, 925858, 1210638, 1389957, 1415995, 1645845, 1308778, 1802813, 1586251, 2009649, 2396941, 2177086, 2261057, 1948119, 2359814, 1995154, 1631894, 1611775, 1231375, 1400821, 1629144, 1464912, 1084013, 983743, 1097546, 1070546, 1347367, 1175958, 1212747, 1003866, 908266, 512464, 409147, 481663, 522207, 460291, 313683, 315371, 150609, 337791, 273676, 286291, 235154, 193330, 52510, 263010, 18125, 214563, 39565, -192047, -259504, 56870, 235215, 301347, 359280, 224462, 418803, -63813, 209904, -107759, 106814, 186746, 46057, -45825, 57472, 184552, 34190, 351568, 117637, 416693]
10897D16693j57564a06081A02371R3490a31720J6706B5812M9723J00717a55349
10886a6833q156A5127R7109K61468E5601b97392e3047j28910E2951b56940C01433
10874A62537F2407f9902p1460E3440a31186m0540e4771D8186i0965G5360c92474
10862b03815b5194B21284G1001f3801k38774A52897b82982b5520k57403D1864
10851a86721i2267A29644J7015k0566E7996c63425A00604B7581b17186a46A11383
10839b01042H2264A2876K56944F674i1464G7804h6256l9912j56375j06361A22899
10827b20496B48407h9033L9190G9957A9859K18769a10743g252o2148c0286b391
10815b26200L6294b2191E6204c20718L958c0065j39027d4733j58168A65763p8364
$$ y = [416693, 259129, -106081, 102371, 195861, -131720, -115014, 25812, 75535, 176252, -155349, -16833, -24989, 15127, 112236, 373704, 55601, -297392, -53047, -181957, 52951, -256940, 301433, 162537, 62407, -69902, -141362, 53440, -131186, -171726, -54771, 48186, -90965, 75360, -392474, -203815, -25194, 221284, 71001, -63801, -302575, 152897, -282982, -25520, -282923, 41864, -186721, -92267, 129644, 146659, 126093, 57996, -363425, 100604, 27581, -217186, -146, 111383, -201042, 82264, 12876, 269820, 6674, -91464, 77804, -86256, -126168, -282543, -388904, 122899, -220496, 248407, -89033, -49843, 79957, 19859, 238628, -110743, -7252, -69400, -30286, -2391, -226200, -189906, -22191, 56204, -320718, -316760, -30065, -169092, -44733, -202901, 165763, 87399]
10804H7399i3108B2946J51826C8446L0888J38921M5576a40868O177j18616d8734
10792a62320a9434l08031d2610j81205g3420j19026E1298i0186A6693b5594A62347
10780a16273I9855J027J24374a06000j62401i9820C05072E5206M3554a11763c0572
10768B30500l2264I1855N2571N322h8594E9139J1491f4778j92076A14796N1870
10757A66666h8231j30091J2517J92c8272j89758A42880i7246b6847j80918Q0143
10746a27622n383B35699a21979C45897j33162R159e4950F9675b18100a6993A3428
10734B9113K01578c18244D5757J36264g8211A40270a58132n4907C60918A0415
10723a82520E5369j2844c17143i7884c5284l81447b2464h886r7651l32920A85203
$$ y = [87399, -93108, 22946, 174772, 38446, 69334, 208255, 253831, -140868, -134691, -253307, -48734, -162320, -19434, -327465, -42610, -223815, -73420, -192446, 51298, -90186, 16693, -25594, 162347, -116273, 99855, 100882, 225256, -106000, -268401, -99820, 305072, 55206, 98760, -111763, -30572, 230500, 198236, 91855, 144426, 149748, -88594, 59139, 70630, -64778, -256854, 114796, 166666, -88231, -218322, -205805, -205613, -38272, -228030, 142880, -97246, -26847, -207765, -127622, -133005, 235699, -121979, 345897, 212735, 221894, -54950, 69675, -218100, -16993, 13428, 29113, 230691, -318244, 45757, 182021, -78211, 140270, -158132, -213039, 360918, 10415, -182520, 55369, 42525, -317143, -97884, -35284, -416731, -22464, -8886, -106537, -439457, 185203]
10711A02518a38570C03734B7986b43720B9319c32730c9915k7652J5118j07194
10701a59643F2101K69146j36144i4672j34875C9350c03978f6905k61159a36432
10690g0948K9482A72152e7033e929k16702A12655a23493C6310c13590j0355I6106
10678a25832J1074A44565h5377C09693a08977j7223A94222B9043J98636b45184
10667b12797A23503A7814a17233d6506j84481A78541c26344a19969j54615B13040
10656c9156k32421a14052k3296j98757J22924B0579a47382c2259j37405M0225
10646a29439M1963b2823j07214k26203a69811A93830J88396a26536n8909l5326
10636b20771h457E2449c66318H6738b18609A40181b43128j5325H6926b61968L7135
$$ y = [102518, -138570, 303734, 27986, -243720, 29319, -332730, -39915, -67567, -52449, -159643, 62101, 331247, 195103, -94672, -229547, 39350, -303978, -66905, -328064, -136432, -70948, -41466, 172152, -57033, -5929, -222631, 112655, -123493, 36310, -313590, -323945, 96106, -125832, -114758, 144565, -85377, 309693, -108977, -126200, 194222, 29043, 227679, -245184, -212797, 123503, 17814, -117233, -46506, -230987, 178541, -326344, -119969, -274584, 213040, -39156, -271577, -114052, -137348, -336105, -213181, 20579, -147382, -32259, -169664, -129439, -87476, -22823, -130037, -356240, -169811, 193830, 382226, -126536, -185445, -220771, -8457, 52449, -366318, 86738, -218609, 140181, -243128, -258453, 86926, -261968, -224833]
10625b24833L3627E2986J81488G6049J07271b40483B00092I7729b71223A25973
10614b08729c0254C20693h7397c2274A6030a91537e7559l0184A35446l2154I799
10602a83441j44844J30319P1583L68j7938A32925f321k1004B06392c5234o7376
10591a02610a390k0111E686Q671a33430D26260a09854B51596c77165g705j06956
10580a14661p0546G5816O5064b75247g3885c2775j1669J5702a2300A18850D2588
10568b78212a27347B30665J11601A52085C6973b21846B5911b72436j1187C0115
10557A55847g384m2932F9069k9142b82923H9467M5534e2064b013j74914Q1550
10546i5377l0782j72334a47321p2980A42539E6389J78841I0000c55998c78k5095
$$ y = [-224833, -191206, 52986, 234474, 76049, 183320, -240483, 200092, 97729, -271223, 125973, -208729, -30254, 320693, -87397, -32274, 16030, -191537, -57559, -87743, 135446, 103292, 9799, -183441, -328285, -197966, -126383, -126015, -143953, 132925, -6321, -27325, 206392, -35234, -102610, -1390, -21501, 5686, 14357, -133430, 426260, -109854, 251596, -377165, -7705, -114661, -185207, 75816, 140880, -275247, -73885, -32775, -44444, -28742, -12300, 118850, 42588, -278212, -127347, 230665, 342266, 152085, 36973, -221846, 25911, -272436, -283623, 30115, 155847, -7384, -50316, 69069, 39927, -282923, 89467, 135001, -52064, -2013, -176927, -95377, -126159, -298493, -147321, -220301, 142539, 56389, 235230, 90000, -355998, -378, -25473]
10535b5473B322f4895G6067I13e6153B76982a70634A4150c952p6054c4436j57812
10523a92248B6051J19838b1566A36790b9085H3744a07141k2436A41813g7212K1369
10512e5843K3847A55032b97593B87444c58822I5831N7187i014l41129C0194c4776
10500b8899G6350J02719K6028K1732j04714K5693b85361D0550a91496p8925d5110
10488E9142A0449a75355J7585D2500a59438j4057E1885J52747B5212j029N2643
10477G6826l6544a86369n8064m919J12303a2197D1831J91066M1632a09969A59412
10465E17607A97459G1769R5527M46038a13420b8090A23724J25092F5797l0712
10455C5085a65998p868A85303l3653c80902J14963F8413c47586a37149r838a8362
$$ y = [-25473, 2322, -64895, 76067, 913, -56153, 276982, -170634, 14150, -3952, -80006, -34436, -192248, 26051, 145889, -21566, 136790, -29085, 83744, -107141, -129577, 141813, -77212, -55843, -31996, 155032, -297593, 287444, -358822, 95831, 153018, -9014, -350143, 30194, -34776, -28899, 76350, 179069, 205097, 226829, 122115, 147808, -285361, 40550, -191496, -270421, -45110, 59142, 10449, -175355, -157770, 42500, -159438, -173495, 51885, 204632, 25212, 24183, 76826, 40282, -186369, -244433, -249352, -137049, -12197, 41831, 232897, 274529, -109969, 159412, 517607, 197459, 71769, 167296, 613334, -113420, -28090, 123724, 248816, 65797, 35085, -165998, -173866, 185303, 151650, -380902, -265939, 68413, -347586, -137149, -146987, -18362]
10443B9297b04079e2505F015a40850e4536j06409B27658h5387E5352b75196n9817
10432c35013A9504a5190j65370j0680h6951d599k29340A23457B7790i8389D1308
10420c02066J48401j0273B73303r1645a26926q342G4045b14815j36392B69155
10409b79275l1112a50365J150H8688b89387d6560k53328a44049n582N2939A51256
10397c03109D538b75399B2014o328b09876A11512a01156j66336l23955i9206C1013
10385F6961c7192n7707A41143a4053m7344f607m8164A63995K13846E5669P2999
10374A28668a11206E0929f183o9799A12489J4347k0034N5169G8543A2182O2609
10363G4791J30885I0429J0484M63L31271d114n0869D75096A08579K9359J13337
$$ y = [29297, -204079, -52505, 6015, -140850, -54536, -160945, 227658, -85387, 55352, -275196, -335013, 19504, -15190, -180560, -191240, -86951, -4599, -233939, 123457, 27790, -98389, 41308, -302066, -153665, -163938, 273303, 181658, -126926, -135268, 74045, -214815, -351207, 269155, -279275, -310387, -150365, -149215, 88688, -289387, -46560, -299888, -144049, -149631, -96692, 151256, -303109, 4538, -275399, 22014, 15686, -209876, 111512, -101156, -267492, -591447, -99206, 31013, 66961, -37192, -94899, 141143, -14053, -61397, -6607, -54771, 163995, 377841, 55669, 128668, -111206, 50929, -6183, -75982, 112489, 126836, 106802, 161971, 78543, 12182, 74791, 205676, 90429, 100913, 101376, 432647, -4114, -54983, 475096, 108579, 137938, 251275]
10352B51275K5056J52766m4359j04119Q0493l3108F5510J52020K4815p9077B7618
10340a25832B3604J03531L13782J59271a96874C48587k9548A49721J92153A27854
10329C24077J4695J08572A35659a2706B61716h6813D07588k8815p9793r8178G9815
10317e6478r7232A97238B4773K3259J27961c2477r9900A6537c55532A819J19223
10306A21042a15410F1393O9992l4014f2009B23343A09125J09310p0419a37403
10295g9104A38940L579K26713A9374J01907O6293L2273G7001h3629n0394A14270
10283b21718A06164A0184g7896k05250J4132q429b1001m78164J44174j69808K36301
10272b88498c4417j55206B13352E3972c2086H1216i5556Q446j9649A63694E2163
$$ y = [251275, 276331, 429097, 384738, 280619, 361112, 328004, 65510, 217530, 242345, 163268, 27618, -125832, 23604, 127135, 440917, 600188, -196874, 348587, 319039, 149721, 341874, 127854, 324077, 338772, 447344, 135659, -12706, 261716, -86813, 407588, 378773, 298980, 200802, 79815, -56478, -153710, 197238, 24773, 48032, 175993, -32477, -132377, 16537, -355532, 1819, 121042, -115410, 61393, 131385, 97371, -62009, 223343, 109125, 218435, 148016, -137403, -79104, 138940, 142519, 369232, 19374, 121281, 187574, 219847, 77001, -83629, -134023, 114270, -221718, 106164, 10184, -77896, -283146, -269014, -277443, -21001, -499165, -354991, -524799, -288498, -34417, -189623, 213352, 53972, -32086, 81216, -95556, -87110, -106759, 163694, 52163]
10260b37078j6154A64951a36796D2176P1848D3018e1865G0806e7364j92758h9642
10248C10838a10815G288b26403B03157l5181a26728A29732C7876N1110d342C37501
10236a88709l7831f4216p2696N9576A05213c51594J10767d5045A88591J08571
10226B97162P8971f2459A08821L2743c0420j25010c7382j8371j55008C6566c4974
10214A5594g1312A31366d4920p3537K9531C9601q698L16703i2744k59875d7825
10202B4793Q5627J15287b65529H2017e9352E5176K28722c26690c4799j07375m5005
10191a87179A99072a90624Q9022B47642H4232E301J29440i633E7901A4198b37724
10179A05605K70136C8916g8515J1908k28048C2344K35483a64043o9463c4126l3611
$$ y = [-237078, -253232, 164951, -136796, 42176, 114024, 43018, -51865, 70806, -57364, -250122, -89642, 310838, -110815, 7288, -226403, 203157, 167976, -126728, 129732, 37876, 88986, -4342, 337501, -188709, -226540, -64216, -136912, -77336, 105213, -351594, -240827, -45045, 188591, 297162, 376133, -62459, 108821, 141564, -30420, -155430, -37382, -55753, -210761, 36566, -34974, 15594, -71312, 131366, -44920, -118457, -88926, 39601, 30903, 347606, -92744, -352619, -47825, 24793, 110420, 225707, -265529, 82017, -59352, 55176, 283898, -326690, -34799, -142174, -187179, 199072, -190624, -101602, 247642, 84232, 5301, 134741, -9633, 57901, 14198, -237724, 105605, 375741, 38916, -78515, -66607, -294655, 32344, 267827, -164043, -233506, -34126, -67737]
10168f7737A58372e6181j13034K4269p9837R2468B9090q721h3301j58712O5747
10157a76266d232n723o2187l115l01454H833a26353n201A05223J20216d0555j13664
10145a54219A65540a550A64718b27975j32714c061k57776Q4167l4169n4591J26318
10134a39112c5512B1042c2628H49J18009L4848c2255A58536a99087N9132A4921
10122a30114p3023A26282g050j29966B09822a59051a1382B2287c22617J49631
10112a72986C0875L89639a21472o6573L8072N7518j41708J7909j00525A4249J23002
10101A37251a66116J6232l4805K2927G8604l98a06771j12943D5538A3203h4065
10089a37580A6368a14267A16805f8737A80654E0841K9586A5679j966L0814a21569
$$ y = [-67737, 158372, -56181, -169215, -144946, -224783, -132315, 29090, 20369, -83301, -242013, -176266, -4232, -9955, -72142, -75257, -376711, 8833, -126353, -131554, 105223, 225439, -40555, -154219, 165540, -1550, 164718, -227975, -360689, -3061, -260837, -176670, -210839, -265430, -139112, -35512, 21042, -32628, 849, 118858, 153706, -32255, 158536, -199087, -139955, 14921, -130114, -203137, 126282, -7050, -137016, 209822, -159051, -11382, 22287, -322617, -172986, 30875, 420514, -121472, -188045, -149973, -92455, -234163, -216254, -316779, 14249, 137251, -166116, -149884, -184689, -161762, 78604, 78206, -106771, -219714, 45538, 13203, -84065, -137580, 16368, -114267, 116805, -68737, 180654, 50841, 80427, 15679, 13713, 44527, -121569]
10077B8861d8966p6539f857l14528f4906p0754M0474L5349p8860A47320K9967
10066A77287c12634J06572A51154b13312K7961j3271d8983k28484J34438d0497
10055a3901D8063M026J30090L9964b08983C6460J7690f7574k72591a16195k57420
10044c73615J64691O100c4582A38054c30625P7435R4023j10137g0978B0783a56832
10032A17774M7860b63795e7354A86829a80863j22006a25247q4012A87308a7123
10021b29967p4104f9039k85832f0125k6955K9414A31361b9002B19561r9288c093
10009A34309O6741d65110b0755k14527E3473e7187k48081a25105j0819b9470l50257
9998c79727i7733F0091i3445k34276r2264E8415P2490a40399L9479k3704n4059
$$ y = [28861, -48966, -125505, -6857, -321385, -64906, -135660, -95186, -59837, -138697, 147320, 177287, -312634, -206062, 151154, -213312, -185351, -198622, -48983, -277467, -143029, -40497, -13901, 48063, 52089, 182179, 222143, -208983, 36460, 54150, -67574, -340165, -116195, -373615, -208924, -202824, -34582, 138054, -330625, -253190, -159167, -269304, -70978, 20783, -156832, 117774, 165634, -263795, -57354, 186829, -180863, -302869, -125247, -209259, 187308, -17123, -229967, -304071, -69039, -354871, -60125, -87080, -57666, 131361, -29002, 219561, 120273, -3093, 134309, 201050, -465110, -20755, -235282, 53473, -57187, -305268, -125105, -135924, -29470, -379727, -97733, 60091, -93445, -327721, -419985, 58415, 130905, -140399, -100920, -124624, -178683]
9987a78683M3534G9201c27934J41685r4098o6455h9421D42141b20049I6120O8629
9976A64749g2104l566F5610h8901A97594F6586b02677B43620f2107K9398k97507
9965c30216e646A14039q815k1525c37311a25654k01807a19526D8015p103a1603
9953C6775a4340H8558b58055K0495j48501A01613a3116q151j18758A34151o2223
9942G1928C4373M1046F552c36946R5475f3710E8659L8518K20927a4622A02750
9930A6328c3308B0121d3653j57579f0321J365E1780j1121a77551K1820P195G5665
9917B66581b530A72548f2715j14341A53037b76877f2519j58047P9673a6708j29857
9906a46565I828c21068H11a28286o8441A5694c24760A34783g3570a3975A17803
$$ y = [-178683, -135149, 79201, -327934, -186249, -280347, -346802, -89421, 442141, -220049, 96120, 164749, -72104, -75670, 65610, -88901, 197594, 66586, -202677, 243620, -62107, -32709, -330216, -5646, 114039, 105224, 83699, -337311, -125654, -327461, -119526, 48015, 40912, -11603, 36775, -14340, 88558, -258055, -237560, -386061, 101613, -13116, -21267, -140025, 134151, 71928, 34373, 75419, 6552, -336946, -241471, -63710, 58659, 97177, 318104, -14622, 102750, 16328, -33308, 20121, -43653, -201232, -60321, -58956, 51780, 40659, -177551, -155731, -148536, 75665, 266581, -2530, 172548, -62715, -177056, 153037, -276877, -62519, -220566, -140893, -16708, -146565, 9828, -321068, 811, -128286, -196727, 15694, -324760, 134783, -73570, -13975, 117803]
9894d4260j78419A95241b19756A28556b18041C9141e2426j66414A40916q979d2512
9882a89242b0497G4544d89558K26932f3942l17289j675R8983B23400a8213A51914
9870D6608a22737j53699p9021J74454c8744f28A98605b35824J11065j80655B24564
9858h4207B2236a62798d9313j7929p634p1363F329e2186l9905g946A24919n8507
9846F6412P8801c86204J86264o6886h4162j95197N4406A51875k1137b10753E8447
9834G7015L37546a26218B59176r2137a01233p3711M8604j09980F1830R5278E0241
9822c4372B0486B759b38469F6730J13198b42776q1875i6158j31878B70020e2201
9810A479a04118A17873j9017a73951k84836A5827M36338B13010B4759O5799b11494
$$ y = [-44260, -222679, 195241, -219756, 128556, -218041, 39141, -52426, -218840, 140916, 131937, -42512, -189242, -20497, 74544, -489558, -262626, -63942, -381231, -382906, -283923, 223400, -18213, 151914, 46608, -122737, -276436, -355457, -181003, -38744, -628, 198605, -235824, -124759, -305414, 224564, -84207, 22236, -162798, -49313, -67242, -74876, -146239, 6329, -52186, -92091, -7946, 124919, 66412, 145213, -386204, -199940, -266826, -84162, -279359, -224953, 151875, 130738, -210753, 58447, 77015, 414561, -126218, 259176, 167039, -101233, -174944, -126340, -236320, 61830, 157108, 50241, -34372, 20486, 2759, -238469, 66730, 179928, -242776, -324651, -96158, -228036, 270020, -52201, 1479, -104118, 117873, 98856, -173951, -458787, 15827, 452165, 213010, 24759, 90558, -211494]
9798I4913b81255A46772f1549D7498e4661B045M6620a56040g7820n4096k99191
9787d31107f6385m5602G5108g2585A2306e1994j56122B20501n0624e8603E9605
9775a89950O3229L3316C8798f2300A29940o2235b64930K5498K2820A16402a1428
9763B30135c02648A12021c8135G3006O9825h5538D1393a00302l5838a4712k373
9752a7085A46619c26826d1088C94057a803m4321g069j76441M7910e9828r8636
9741a58464j91237j345i2031m3096F9421d7736A2550a76411a6315B6581G890b57050
9728D7612a44684D8574a2876A7593f2110A56033d4306R44j26064M3488n3517A0593
9715f6693B0811a32546n623E7743a09371A69353J79668a81225a0556A70336a61237
$$ y = [94913, -281255, 146772, -61549, 47498, -54661, 2045, 48665, -156040, -77820, -131916, -431107, -66385, -111987, 75108, -72585, 12306, -51994, -208116, 220501, 169877, -58603, 59605, -189950, -126721, -93405, 38798, -62300, 129940, 67705, -264930, -239432, -216612, 116402, -11428, 230135, -302648, 112021, -38135, 73006, 142831, -85538, 41393, -100302, -136140, -14712, -17085, 146619, -326826, -41088, 394057, -1803, -46124, -7069, -183510, -135600, -59828, -158464, -349701, -351046, -92031, -135127, 69421, -47736, 12550, -176411, -16315, 26581, 7890, -257050, 47612, -144684, 48574, -12876, 17593, -62110, 156033, -44306, -43362, -169426, -125938, -179455, 10593, -66693, 20811, -132546, -138169, 57743, -109371, 169353, 349021, -181225, -10556, 170336, -161237]
9703A7638c20700A84561d78355a18280j92298A29106B9307l736h0180m0375b7637
9691a58642j54527c8747D234a90554e4942A30515a7716e133l07157f9166l5956
9680a05122k09165c0752o7495l98481f6307A72896B6205J46679d4677l87089h884
9668a7910p7363D07558a10510M7199k21097E36933D6275a22925L1704A98119r3112
9657A05007d0600l16879h8026j90444N4648B60354a24124k8842I3021a0654k1008
9646c1662l01704A83313a70156I0642d18439I2195c53628J06784I7957J37717
9636B35674b8425B0146L4545b9986n7676k30880A47827a84728A63186a01037r221
9625a10258k36876A54743d22315A55549b51402a3038m48668B10929c348m39646
$$ y = [17638, -320700, 184561, -478355, -118280, -310578, 129106, 29307, 25571, -80180, -120555, -27637, -158642, -313169, -38747, 4234, -190554, -54942, 130515, -17716, -5133, -312290, -69166, -105122, -314287, -30752, -98247, -496728, -66307, 172896, 26205, 172884, -44677, -431766, -8884, -17910, -95273, 407558, -110510, -63311, -284408, 536933, 46275, -122925, -91221, 198119, 105007, -40600, -357479, -88026, -278470, -223822, 260354, -124124, -152966, 93021, -10654, -31662, -333366, 183313, -170156, 90642, -418439, 92195, -353628, -246844, 97957, 235674, -28425, 20146, 54691, -29986, -87662, -318542, 147827, -184728, 163186, -101037, -110258, -347134, 154743, -422315, 155549, -251402, -13038, -461706, 210929, -3348, -442994]
9615d42994i290j24372E0377a04995b0470k4225j90703B9582Q3248d04140j60074
9604e64214g4779k36010A44669a23045n7384A43322h4265A26659c18858o664H3061
9592a27678C2637K22380b53934B59340a92676E8261b22194K7771e466A75641q7579
9581H8062a59430j6900Q1404k5486E7950a86862h9695B8440b06342C05083a494
9569A65679a3408r0602K965D2449a83407M4982Q075I6049J31507F829f0573r8460
9557a59033B75702l7583b28176k0068b3471j56882C6881J77441a04057j993E2292
9545a57235B51123d4357q8658A97003a30469f1932j03297h94r4516c8961l48638
9534c87599a06813d5206l27266B69600e7098k19331J31498L377F2876a7532l21922
$$ y = [-442994, -9290, -133662, 50377, -104995, -20470, -44695, -235398, 29582, 112830, -404140, -564214, -74779, -310789, 144669, -123045, -180429, 143322, -84265, 126659, -318858, -325522, 83061, -127678, 32637, 255017, -253934, 259340, -192676, 58261, -222194, -194423, -5466, 175641, 88062, -159430, -176330, -94926, -120412, 57950, -186862, -89695, 28440, -206342, 305083, -1494, 165679, -13408, -104010, -101045, 42449, -183407, -138425, -130350, 96049, 227556, 6829, -60573, -159033, 275702, 238119, -228176, -248244, -23471, -180353, 36881, 214322, -104057, -106050, 52292, -157235, 251123, -44357, -133015, 197003, -130469, -61932, -165229, -894, -95410, -38961, -387599, -106813, -45206, -372472, 269600, -57098, -276429, -144931, -141554, 62876, -17532, -339454]
9523c39454J05599e3855A18315a13140j54759R7473A69888l5371L7379O574p5454
9512A03016a47873C3791L35590j82984c04678A42096a39024L8007L7399k25091
9502b88709a01377A22938L5029d30678J40137l40176a02850E5049J8593g5571
9491f1013C88681g3131A83552d32822e5108l4394B71885b18965f6483G0116J77056
9480B47172C3982m952a33194K5982B04526b06421B75803f6986A41876c06733i8828
9468H4450j0161J07394a73665h1184j58185B3588N9641a89936j83913I9523a19742
9456a06948A87458b36678g9738I761a70018I3313K2476c78559D7977J32148N740
9445A85865b83006A61504b44915g8311G8095c01160h1311j77185B1558f7625r9368
$$ y = [-339454, -233855, -53855, 118315, -113140, -267899, -170426, 169888, 134517, 171896, 178470, 103016, -147873, 33791, 369381, 186397, -304678, 142096, -139024, -101017, -63618, -288709, -101377, 122938, 157967, -430678, -290541, -630717, -102850, 55049, 73642, -75571, -61013, 388681, -73131, 183552, -432822, -55108, -89502, 271885, -218965, -66483, 70116, 247172, 33982, 29030, -133194, -107212, 204526, -206421, 275803, -66986, 141876, -306733, -98828, 84450, 74289, 181683, -173665, -81184, -239369, 23588, 83229, -189936, -373849, 99523, -119742, -106948, 187458, -236678, -79738, 9761, -170018, 93313, 115789, -378559, 47977, 180125, 185865, -283006, 161504, -244915, -78311, 78095, -301160, -81311, -258496, 21558, -67625, -166993]
9434a66993F1406a60874i784A9159K01442a20145F4555Q7961A9274b12445j8749
9423b31194B72012b4250o6405A01363b25665f9778o9270c8428B7866R377P3833
9412A11076L3192c30163J43605I591b02397K3711j35069h6086Q660c4566A59256
9400I5250b33000F0742a68822j5725M7560A34466K87044b50240d1966G1857b27559
9388e7284B4159e3434B42842J18574i1927j23613J5494l05133A31542b24964f624
9376b302j06401A7860A10f6432p66q8157n1054A82571d11580B69613a5246l3876
9364d9122E2025o689b86843J39167B89014E0506a21503e0685H1643J32689e7988
9352a89130P2914A52919a10237d6749B14201d20225C8541a00288A41131a6106
$$ y = [-166993, 61406, -160874, -9784, 19159, 220601, -120145, 64555, 152516, 19274, -212445, -231194, 272012, -24250, -90655, 101363, -225665, -69778, -139048, -38428, 27866, 37243, 111076, 144268, -330163, -186558, 9591, -202397, -178686, -313755, -86086, -77426, -34566, 159256, 95250, -233000, 60742, -168822, -184547, -136987, 134466, 421510, -250240, -41966, 71857, -227559, -57284, 24159, -53434, 242842, 361416, -91927, -215540, -200046, -505179, 131542, -224964, -6624, -2302, -108703, 17860, 110, -66432, -67198, -155355, -206409, 182571, -411580, 269613, -15246, -49122, 52025, 45336, -286843, -147676, 289014, 50506, -121503, -50685, 81643, 214332, -57988, -189130, -116216, 152919, -110237, -46749, 214201, -420225, 38541, -100288, 141131, -16106]
9341i7547A00667J84800a21483A47235g614j0809l13603i3407k5449j16223I8413
9329A58067L7067b75303J1520d9660B49482k4954D9680a89220N1803f3447j13376
9318a76823n6201i1221B3333g490n032k90678P1210d0092r7950b2066m52586b3726
9305a80282G0153K31742A47616h752A79880b68002a5462B6361L19652g0610a730
9293h8173j42113B95070a3634C0203d8530r4574N9363K2570o0693B49062b54137
9281C23777a89355f4467j13534d3641j9078J1223j70755d2556C7127a51550G3686
9269I0479c24520J6126A7608b76101P045d6617A62428b53554C2122a9421l3213
9258e2634J1149m046j25501n8944C1735a53311k12724A60168a37959A38712e2459
$$ y = [-97547, 100667, 285467, -121483, 147235, -7614, -18423, -332026, -93407, -118856, -235079, 98413, 158067, 195134, -275303, -263783, -49660, 249482, 224528, 49680, -189220, -137417, -63447, -176823, -233024, -91221, 23333, -7490, -12522, -303200, -231990, -40092, -138042, -22066, -474652, -23726, -180282, 70153, 301895, 147616, -8752, 179880, -268002, -15462, 26361, 346013, -70610, -1730, -88173, -230286, 295070, -13634, 30203, -48530, -143104, -83741, -61171, -121864, 249062, -254137, 323777, -189355, -64467, -178001, -43641, -62719, -51496, -222251, -42556, 37127, -151550, 73686, 90479, -324520, -308394, 17608, -276101, -269056, -46617, 162428, -253554, 32122, -19421, -52634, -41485, -45531, -171032, -229976, 31735, -153311, -366035, 160168, -137959, 138712, -52459]
9246A81422A8597d4156j4525A117L15603a78966j06992j37097A10185b28032f0052
9234a9956A71332e6509j92569A78294H0229b06404M6758m1001d1678I8167l7612
9223F0555b02475L9323g1826H4271h3162A82603M4236L44623I3656e8309j20730
9212a79039C65172B4930f5492l3795p8772B83238C9441a14021F0762k9590a63582
9200H1484j1595e18227C6343M6606l8920M1988a78352L8981L3657j59974K960
9189b62728A00453n796a41286C7777a5523A59594i1411p0571I840b52299g8597
9177A26239e35518B48483D821a051B03707C9886f2418a2937D9612b02247A17307
9165h8604A5326a2406A27011b92405f7100C829Q1005N3477F0803e9899j89384
$$ y = [181422, 18597, -44156, -58681, 1117, 316720, -178966, -285958, -423055, 110185, -228032, -60052, -19956, 171332, -56509, -249078, 178294, 80229, -206404, -159646, -200647, -41678, 98167, 60555, -202475, -163152, -71826, 84271, -83162, 182603, 226839, 571462, 93656, -58309, -179039, 365172, 24930, -65492, -99287, -178059, 283238, 39441, -114021, 60762, 31172, -163582, 81484, 69889, -518227, 36343, 82949, 44029, 86017, -178352, -139371, -105714, -265688, -262728, 100453, 94657, -141286, 37777, -15523, 159594, -91411, -161982, 9840, -252299, -78597, 126239, -535518, 248483, 4821, -1051, 203707, 39886, -62418, -12937, 49612, -202247, 117307, -88604, 15326, -12406, 127011, -292405, -67100, 3829, 84834, 138311, 60803, -59899, -249283]
9154b49283h4631a8783o1932B62725a02030F705g5470c2339r876l32528E2229
9142C06986j43010C1967a67436l0782M1550D9704f9470q4240b2514B2991b01552
9130B78550b75858f6510B2573K24654a90193k05520a78902B38213n0974a75956
9119B24601a6773l5066j75667E7266b17019j65671G0523b4238O853n53299J61722
9108d08962F0304a02870l4763J8283K3795A82609F9335J73572D4411h2781B43002
9096H2156L7494b9610A5920a16758Q658E4275a05129k9078m2176e5049j08986
9085a64035k6450C812J82630d4114C1643a23424J1298A63124j8360a12657b6059
9073B17372c18721a06373B88227f0455r5081j30066A17129N7848a3773A2804h0301
$$ y = [-249283, -84631, -18783, -80715, 262725, -102030, 6705, -75470, -32339, -42215, -374743, 52229, 306986, 163976, 31967, -167436, -198218, -156668, 49704, -69470, -153710, -22514, 22991, -201552, 278550, -275858, -66510, 22573, 247227, -190193, -395713, -178902, 238213, 187239, -175956, 224601, -16773, -51839, -227506, 57266, -217019, -382690, 70523, -24238, -17385, -570684, -408962, 60304, -102870, -137633, -119350, -95555, 182609, 69335, 242907, 44411, -82781, 243002, 82156, 119650, -29610, 15920, -116758, -108100, 54275, -105129, -134207, -176383, -55049, -164035, -190485, 3812, 186442, -44114, 31643, -123424, -112126, 163124, 144764, -112657, -26059, 217372, -318721, -106373, 288227, -60455, -155536, -285602, 117129, 174977, -13773, 12804, -80301]
9061H1608f9868j10525l00203A02122b84587j26997D9571b5070o6013A21100a32251
9049h380l57695A2204J70490h9215n0025L2366b5686l69331A38913b47187r1210
9038c38397b1482m82596A09541i5147k16521b0120B63045a03814n0857D9377c03635
9026F5377k8939f8925A40521e14573g3870F9212k1490j7693K62526b96040a22225
9014b84526A89121b31070A42339i4728A64685b625l0991l959k08001A57469b48274
9002b14641Q4332R007f457l4872F4568a42056c5096A34394H370b02716e4808L146
8990e1662C8413N8474A315h6709j82511J30899j1927B65248b2433A53785f9715
8978d01168B21793C5190g7182A09756k8202b8971C27977A23797b81930B93325
$$ y = [81608, -69868, -180393, -480596, 102122, -284587, -411584, 49571, -25070, -91083, 121100, -132251, -8380, -366075, 12204, 182694, -89215, -139240, -106874, -25686, -395017, 138913, -247187, -338397, -21482, -504078, 109541, -95147, -311668, -20120, 263045, -103814, -154671, 49377, -303635, 65377, 36438, -68925, 140521, -514573, -73870, 69212, 47722, 30029, 292555, -296040, -122225, -284526, 189121, -231070, 142339, -94728, 164685, -2625, -33616, -37575, -245576, 157469, -248274, -214641, -130309, -121302, -6457, -41329, 64568, -142056, -35096, 134394, 8370, -202716, -54808, -51662, 38413, 96887, 1315, -86709, -269220, -138321, -150248, 265248, -22433, 153785, -69715, -401168, 221793, 35190, -77182, 109756, 81554, -28971, 327977, 123797, -281930, 293325]
8967B9427a23777A09090N9603M1156a11217K3948l25432A99616D9368i6362n1622
8956a47984b3600j04180q2058h6142p2246A67932b28880l5496J26680k23492L4123
8945c27065B38955I9691K53749a72421B18979j02429b883m050B30789b2240q616
8934c0856k16477K7347O7631L3069K3901L1015B3727a16070r0006B26068J5093
8923B41161E342c0471B1237O1745J60614A07790h7458C4199J04772L3387l1828
8912A40530K51440k0175L75111M31455M70813J535846K834099N529965E375800
8902C498334j352079o46400o98880l93068j44203K05934A32961K45656c9694j06512
8892a46206C63932G9152h0105n055c7847o5400E4650J11585a02068d4767j25031
$$ y = [29427, -123777, 109090, 168693, 209849, -111217, -87269, -412701, 199616, 49368, -96362, -147984, -23600, -127780, -209838, -86142, -158388, 167932, -228880, -264376, -137696, -361188, -327065, 238955, 99691, 353440, -172421, 218979, 116550, -2883, -6933, 230789, -22240, -30856, -247333, -219986, -152355, -119286, -95385, -64370, 23727, -116070, -206076, 226068, 241161, 5342, -30471, 21237, 82982, 243596, 107790, -87458, 34199, 138971, 172358, 140530, 391970, 371795, 746906, 1178361, 1649174, 3185020, 6019119, 11549084, 5375800, 3498334, 2146255, 1499855, 800975, 407907, 263704, 469638, 132961, 378617, -39694, -146206, 363932, 79152, -80105, -85160, -37847, -103247, 54650, 166235, -102068, -44767, -169798]
8881a69798A57377c4178m29252a13198a9931j9598j01847A86008a62925f4028
8870G2475L33894c5459C16635A1996a20901j32814A70989J3928E4489a44939a7482
8858a14150f719j49416d893D7458a31864A01474A207g9335q329j04926M6399f3584
8845b80050a669A2532d9273C9913c0558E8754B2579N5203j6094A5307O0a56649
$$ y = [-169798, 157377, -34178, -463430, -113198, -19931, -39529, -141376, 186008, -162925, -64028, 72475, 406369, -35459, 316635, 11996, -120901, -253715, 170989, 184917, 54489, -144939, -17482, -114150, -6719, -156135, -4893, 47458, -131864, 101474, 1207, -79335, -87664, -192590, -146191, -63584, -280050, -1669, 12532, -49273, 39913, -30558, 58754, 22579, 77782, 61688, 15307, 15367, -156649]
$$ [...]
##END NTUPLES=NMR SPECTRUM
##END=
