
##TITLE=UV1032_TOFR01-ROVE100A_6099457_6eYaFNhx15
##JCAMPDX= 6.0         $$ Bruker NMR JCAMP-DX V2.0
##DATA TYPE= NMR SPECTRUM
##DATA CLASS= NTUPLES
##ORIGIN= BRUKER
##OWNER= Administrator
$$ 1.72 TOPSPIN		Version 2.1
$$ 2012-05-12 23:41:02.781 -0500  Administrator@TOPSPIN
$$ Compression mode = diff/dup
##.OBSERVE FREQUENCY= 400.13188235
##.OBSERVE NUCLEUS= ^1H
##.ACQUISITION MODE= SIMULTANEOUS (DQD)
##.ACQUISITION SCHEME= undefined
##.AVERAGES= 64
##.DIGITISER RES= 22
##SPECTROMETER/DATA SYSTEM= spect
##.PULSE SEQUENCE= noesygpps1d.comp
##.SOLVENT NAME= COFFEE_meoh
##.SHIFT REFERENCE= INTERNAL, COFFEE_meoh, 1, 14.96706
##AUDIT TRAIL= $$ (NUMBER, WHEN, WHO, WHERE, PROCESS, VERSION, WHAT)
$$ ##TITLE= Audit trail, TOPSPIN		Version 2.1
$$ ##JCAMPDX= 5.01
$$ ##ORIGIN= Bruker BioSpin GmbH
$$ ##OWNER= Administrator
$$ $$ C:\Bruker\TOPSPIN/data/COFFEE/nmr/UV1032_TOFR01-ROVE100A_6099457_6eYaFNhx15/12/pdata/1/auditp.txt
$$ ##AUDIT TRAIL=  $$ (NUMBER, WHEN, WHO, WHERE, PROCESS, VERSION, WHAT)
(   1,<2012-05-12 23:40:57.812 -0500>,<Administrator>,<TOPSPIN>,<go>,<TOPSPIN 2.1>,
      <created by zg
	started at 2012-05-12 23:29:27.562 -0500,
	POWCHK enabled, PULCHK disabled,
       configuration hash MD5:
       AF F2 23 6B 01 CD 40 DD E5 A1 38 A0 06 EA F7 77
       data hash MD5: 64K
       AD C7 53 45 F3 98 D0 BF DA D6 A6 4C 80 D4 5A 98>)
(   2,<2012-05-12 23:41:00.734 -0500>,<Administrator>,<TOPSPIN>,<proc1d>,<TOPSPIN 2.1>,
      <Start of raw data processing
       efp LB = 0.3 FT_mod = 6 PKNL = 1 PHC0 = 0 PHC1 = 0 SI = 128K 
       data hash MD5: 128K
       FE B1 70 E0 F6 D6 A6 05 02 56 88 42 05 62 0B CF>)
(   3,<2012-05-12 23:41:01.890 -0500>,<Administrator>,<TOPSPIN>,<proc1d>,<TOPSPIN 2.1>,
      <pk PHC0 = 38.47961 PHC1 = 0 
       data hash MD5: 128K
       27 CA BE 02 0F CC 9E 88 B7 D7 9B 96 F3 50 25 45>)
(   4,<2012-05-12 23:41:02.453 -0500>,<Administrator>,<TOPSPIN>,<proc1d>,<TOPSPIN 2.1>,
      <abs ABSG = 1 
       data hash MD5: 128K
       D5 EF 8B F2 7C B3 4E 22 AA 86 78 A9 64 E5 3B 55>)
(   5,<2012-05-12 23:41:02.515 -0500>,<Administrator>,<TOPSPIN>,<proc1d>,<TOPSPIN 2.1>,
      <abs ABSG = 2 
       data hash MD5: 128K
       14 79 28 12 B1 0B 9F 06 F0 EC DD 6F CD 56 55 89>)
(   6,<2012-05-12 23:41:02.593 -0500>,<Administrator>,<TOPSPIN>,<proc1d>,<TOPSPIN 2.1>,
      <abs ABSG = 3 
       data hash MD5: 128K
       F7 E7 7F 53 37 EE 12 36 BC 12 2D D2 0C 27 29 43>)
(   7,<2012-05-12 23:41:02.640 -0500>,<Administrator>,<TOPSPIN>,<proc1d>,<TOPSPIN 2.1>,
      <abs ABSG = 4 
       data hash MD5: 128K
       05 63 6B 3D 35 2E 40 0E 0F 75 3A 65 B7 17 D4 E3>)
(   8,<2012-05-12 23:41:02.703 -0500>,<Administrator>,<TOPSPIN>,<proc1d>,<TOPSPIN 2.1>,
      <abs ABSG = 5 
       data hash MD5: 128K
       AF C9 F2 FC 43 6D 26 87 E2 0F 06 B3 67 14 D3 B9>)
$$ ##END=
$$ 
$$ $$ hash MD5
$$ $$ 02 82 01 57 B4 DF 1E B4 38 39 BB AF 38 78 E2 DF
##$RELAX= 
##$RELAX= 
##$RELAX= 
##$RELAX= 
##$RELAX= 
##$RELAX= 
##$RELAX= 
##$RELAX= 
$$ [...]
##$TP07= 0
##$TPNAME0= <>
##$TPNAME1= <>
##$TPNAME2= <>
##$TPNAME3= <>
##$TPNAME4= <>
##$TPNAME5= <>
##$TPNAME6= <>
##$TPNAME7= <>
##$TPOAL= (0..7)
0.5 0.5 0.5 0.5 0.5 0.5 0.5 0.5
##$TPOFFS= (0..7)
0 0 0 0 0 0 0 0
##$TUNHIN= 0
##$TUNHOUT= 0
##$TUNXOUT= 0
##$USERA1= <user>
##$USERA2= <user>
##$USERA3= <user>
##$USERA4= <user>
##$USERA5= <user>
##$V9= 5
##$VALIST= <valist>
##$VCLIST= <CCCCCCCCCCCCCCC>
##$VD= 0
##$VDLIST= <DDDDDDDDDDDDDDD>
##$VPLIST= <PPPPPPPPPPPPPPP>
##$VTLIST= <TTTTTTTTTTTTTTT>
##$WBST= 2048
##$WBSW= 25
##$XGAIN= (0..3)
0 0 0 0
##$XL= 0
##$YL= 0
##$YMAX_a= 10723358
##$YMIN_a= -5257488
##$ZGOPTNS= <>
##$ZL1= 120
##$ZL2= 120
##$ZL3= 120
##$ZL4= 120
##$ABSF1= 14.96706
##$ABSF2= -5.58547
##$ABSG= 5
##$ABSL= 3
##$ALPHA= 0
##$AQORDER= 0
##$ASSFAC= 0
##$ASSFACI= 0
##$ASSFACX= 0
##$ASSWID= 0
##$AUNMP= <proc_prof1d_extract.lims>
##$AXLEFT= 0
##$AXNAME= <>
##$AXNUC= <1H>
##$AXRIGHT= 0
##$AXTYPE= 0
##$AXUNIT= <>
##$AZFE= 0.1
##$AZFW= 0.1
##$BCFW= 0
##$BC_mod= 0
##$BYTORDP= 0
##$COROFFS= 0
##$CY= 15
##$DATMOD= 1
##$DC= 0
##$DFILT= <>
##$DTYPP= 0
##$F1P= 0
##$F2P= 0
##$FCOR= 0.5
##$FTSIZE= 131072
##$FT_mod= 6
##$GAMMA= 0
##$GB= 0
##$INTBC= 1
##$INTSCL= 1
##$ISEN= 128
##$LB= 0.3
##$LEV0= 0
##$LPBIN= 0
##$MAXI= 10000
##$MC2= 0
##$MEAN= 0
##$ME_mod= 0
##$MI= 0
##$NCOEF= 0
##$NC_proc= -3
##$NLEV= 6
##$NOISF1= 0
##$NOISF2= 0
##$NSP= 0
##$NTH_PI= 0
##$NZP= 0
##$OFFSET= 14.96706
##$PC= 1
##$PHC0= 38.47961
##$PHC1= 0
##$PH_mod= 1
##$PKNL= yes
##$PPARMOD= 0
##$PPDIAG= 0
##$PPIPTYP= 0
##$PPMPNUM= 2147483647
##$PPRESOL= 1
##$PSCAL= 4
##$PSIGN= 0
##$PYNMP= <proc.py>
##$REVERSE= no
##$SF= 400.130005424339
##$SI= 131072
##$SIGF1= 0
##$SIGF2= 0
##$SINO= 400
##$SIOLD= 131072
##$SPECTYP= <>
##$SREGLST= <1H.CDCl3>
##$SSB= 0
##$STSI= 131072
##$STSR= 0
##$SW_p= 8223.68421052632
##$SYMM= 0
##$S_DEV= 0
##$TDeff= 65536
##$TDoff= 0
##$TI= <>
##$TILT= no
##$TM1= 0
##$TM2= 0
##$TOPLEV= 0
##$USERP1= <user>
##$USERP2= <user>
##$USERP3= <user>
##$USERP4= <user>
##$USERP5= <user>
##$WDW= 1
##$XDIM= 131072
##$YMAX_p= 424560727
##$YMIN_p= -40095107
##$CURPLOT= <Network HP LaserJet P1505>
##$CURPRIN= <$Network HP LaserJet P1505>
##$DFORMAT= <normdp>
##$LAYOUT= <+/1D_H.xwp>
##$LFORMAT= <normlp>
##$PFORMAT= <normpl>
##$SURQMSG= 1
$$ End of Bruker specific parameters
$$ ---------------------------------
##NTUPLES= NMR SPECTRUM
##VAR_NAME=  FREQUENCY,     SPECTRUM/REAL,   SPECTRUM/IMAG
##SYMBOL=    X,             R,               I
##VAR_TYPE=  INDEPENDENT,   DEPENDENT,       DEPENDENT
##VAR_FORM=  AFFN,          ASDF,            ASDF
##VAR_DIM=   131072,        131072,          131072
##UNITS=     HZ,            ARBITRARY UNITS, ARBITRARY UNITS
##FACTOR=    0.0627417313425165, 1,          1
##FIRST=     8223.62146879498, 3886,         -101787
##LAST=      0,             4650,            -102953
##MIN=       0,             -40095107,       0
##MAX=       8223.62146879498, 424560727,    0
$$ Real data points
##PAGE= N=1
##DATA TABLE= (X++(R..R)), XYDATA
$$ [...]
63725C69361k698k253j194l40r7L23J619K660J569j267k939j622R47J856O84p89
$$ 369361 366663 364410 363216 362876 362779 363102 364721 367381 368950 367683 364744 363122 364069 365925 366609 365820
63709C65820j627k519l752m287l329j536j52K02l01q81n35Q68J913J147p94j847
$$ 365820 364193 361674 357922 353635 350306 348770 348618 348820 348519 347638 347103 347971 349884 351031 350237 348390
63693C48390j353p48r73r26N34K425K945K154J825K881M280M569L582K219J265
$$ 348390 347037 346289 345316 344390 344924 347349 350294 352448 354273 357154 361434 366003 369585 371804 373069
63678C73069Q86J006J609K471K900K323J382J720L931O155N855K995L16J50K048
$$ 373069 373955 374961 376570 379041 381941 384264 385646 387366 391297 397452 403307 406302 406618 406768 408816
63663D08816M005M990N375N671N845N642M923L849L014K945L207K701J229mp1
$$ 408816 412821 417811 423186 428857 434702 440344 445267 449116 452130 455075 458282 460983 462212 462208 462137
63648D62137L78J59p66j553j712j241j59J105J423K25j405j970j508j139j069
$$ 462137 462515 462674 461908 460355 458643 457402 457243 458348 459771 459996 458591 456621 455113 453974 452905
63633D52905m65Q36J929K311K515K981L511M072M993N991O103N020L553K407J512
$$ 452905 452440 453276 455205 457516 460031 463012 466523 470595 475588 481579 487682 492702 496255 498662 500174
63618E00174R24J153J974K148J149J25J58N39M1q82n48J490L840N077N097M485
$$ 500174 501098 502251 504225 506373 507522 507647 507805 508344 508385 507503 506955 508445 512285 517362 522459 526944
63602E26944L491K046K18j657l105l740l662l473l581l708l477l106k903k451
$$ 526944 530435 532481 532699 531042 527937 524197 520535 517062 513481 509773 506296 503190 500287 497836
63588D97836j153N78J638J803J926K428K680K381K412L430M499M365L561L787
$$ 497836 496683 497261 498899 500702 502628 505056 507736 510117 512529 515959 520458 524823 528384 532171
63574E32171N376O885P510Q330J0330J2602J3817J4518J6163J8408J9267J8158
$$ 532171 537547 544432 551942 560272 570602 583204 597021 611539 627702 646110 665377 683535
63562F83535J6972J7483J9376K1633K4233K7136K9088K9303K9342L1354L5040
$$ 683535 700507 717990 737366 758999 783232 810368 839456 868759 898101 929455 964495
63551I64495L8444M1255M4895M9362N2632N3838N4385N4672N2250M5320L6070
$$ 964495 1002939 1044194 1089089 1138451 1191083 1244921 1299306 1353978 1406228 1451548 1487618
63540A487618K8071K1647J4538O434l8l061l981n086o981r032j0953j2956j5299
$$ 1487618 1515689 1537336 1551874 1558308 1558270 1555209 1551228 1546142 1539161 1530129 1519176 1506220 1490921
63527A490921j8464k3017k8581l3663l7057l8814l9407l8783l6802l3971l1043
$$ 1490921 1472457 1449440 1420859 1387196 1350139 1311325 1271918 1233135 1196333 1162362 1131319
63516A131319k8274k5623k3224k1130j8895j5965j2357q665n492k996p62J841
$$ 1131319 1103045 1077422 1054198 1033068 1014173 998208 985851 977186 971694 968698 967936 969777
63504I69777M901P641R357J0474J2029J4251J6508J8548K0734K2940K4542K5829
$$ 969777 974678 982319 991676 1002150 1014179 1028430 1044938 1063486 1084220 1107160 1131702 1157531
63492A157531K8134L1927L6035L9618M3566M8743N3883N6756N6682N4415N0173
$$ 1157531 1185665 1217592 1253627 1293245 1336811 1385554 1439437 1496193 1552875 1607290 1657463
63481A657463M3476L4729K5371J6359P903N82m795q545j1750j4286j4947j4051
$$ 1657463 1700939 1735668 1761039 1777398 1785301 1785883 1781088 1772543 1760793 1746507 1731560 1717509
63469A717509j4114j6830k0993k4754k8485l3588l9522m4089m6447m7827m9108
$$ 1717509 1703395 1686565 1665572 1640818 1612333 1578745 1539223 1495134 1448687 1400860 1351752
63458A351752m9525m8362m6400m4778m3499m1963m0140l8342l6425l4156l1908
$$ 1351752 1302227 1253865 1207465 1162687 1119188 1077225 1037085 998743 962318 928162 896254
63447H96254l0051k8033k5065k1529j8722j7129j5889j4213j2499j1573j1450
$$ 896254 866203 838170 813105 791576 772854 755725 739836 725623 713124 701551 690101
63436F90101j1411j0808r418p406n410m273m113m022l204k096j673j978k144j780
$$ 690101 678690 667882 658464 651058 645648 641375 637262 633240 630036 627940 626267 624289 622145 620365
63422F20365j328r95l37P35J531J741K155L352M413M024K431J161Q06M02q47k325
$$ 620365 619037 618042 617705 618440 619971 621712 623867 627219 631632 635656 638087 639248 640054 640456 639609 637284
63406F37284l075l156l138k926k041p63l9k44p12o29Q3R98J777K360K922L793
$$ 637284 634209 631053 627915 624989 622948 622185 622146 621902 621190 620561 620644 621642 623419 625779 628701 632494
63390F32494N156O647P516P447P076P561R678J3172J6823J9365K0765K2436K5528
$$ 632494 637650 644297 651813 659260 666336 673897 683575 696747 713570 732935 753700 776136 801664
63377H01664K9165L1332L1754L2608L5606L9417M1284M0428L8357L6212L3702
$$ 801664 830829 862161 893915 926523 962129 1001546 1042830 1083258 1121615 1157827 1191529
63366A191529L0877K9133K9610L1886L5100L9019M3109M5949M7093M8504N2342
$$ 1191529 1222406 1251539 1281149 1313035 1348135 1387154 1430263 1476212 1523305 1571809 1624151
63355A624151N7798O1695O1989N9022N3616M5839L6086K5763J6185P907J485k444
$$ 1624151 1681949 1743644 1805633 1864655 1918271 1964110 2000196 2025959 2042144 2050051 2051536 2049092
63343B049092m466o516r845j3908j7911k2222k7323l2569l7169m1457m5888m9707
$$ 2049092 2044626 2038110 2028265 2014357 1996446 1974224 1946901 1914332 1877163 1835706 1789818 1740111
63331A740111n1963n3155n4220n4475n2380m8221m4139m1212l8274l4258l0090
$$ 1740111 1688148 1634993 1580773 1526298 1473918 1425697 1381558 1340346 1302072 1267814 1237724
63320A237724k7173k5160k2557j8862j4842j1012p044k844Q82L679O360J0227
$$ 1237724 1210551 1185391 1162834 1143972 1129130 1118118 1111074 1108230 1109112 1112791 1119151 1129378
63308A129378J5304J9943K2559K3385K4087K5903K8863L2738L7728M3608M9078
$$ 1129378 1144682 1164625 1187184 1210569 1234656 1260559 1289422 1322160 1359888 1403496 1452574
63297A452574N2903N5250N7071N8527N8934N7861N5236N0495M2941L3180K3122
$$ 1452574 1505477 1560727 1617798 1676325 1735259 1793120 1848356 1898851 1941792 1974972 1998094
63286A998094J4099N936j804q602j3610j6785j8724k0024k1393k3827k7832l2679
$$ 1998094 2012193 2018129 2016325 2007723 1994113 1977328 1958604 1938580 1917187 1893360 1865528 1832849
63274A832849l7103m0581m3575m6680m9974n2986n4910n4896n2591m8529m3851
$$ 1832849 1795746 1755165 1711590 1664910 1614936 1561950 1507040 1452144 1399553 1351024 1307173
63263A307173l9600l6072l2754k9037k5325k3094k3343k5243k7080k8178k9003
$$ 1307173 1267573 1231501 1198747 1169710 1144385 1121291 1097948 1072705 1045625 1017447 988444
63252I88444k9526k8883k6933k4851k3467k2182k0316j8502j7693j7643j7376
$$ 988444 958918 930035 903102 878251 854784 832602 812286 793784 776091 758448 741072
63241G41072j6536j5225j3204j0482q127p311p759q265q360q358q143p354o527
$$ 741072 724536 709311 696107 685625 677498 670187 662428 654163 645803 637445 629302 621948 615421
63228F15421o642p413p512o668o089o434o722n943m447l040j842q85q00j872l145
$$ 615421 608779 601366 593854 587186 581097 574663 567941 561998 557551 554511 552669 551784 550984 549112 545967
63213E45967l468k904k206j587r78q41j517k161j585p2Q82P79Q61K230M232N410
$$ 545967 542499 539595 537389 535802 534824 533983 532466 530305 528720 528648 529530 530309 531170 533400 537632 543042
63197E43042N417N235N750O846P823Q220Q010P344O434N703N757O912Q835J0912
$$ 543042 548459 553694 559444 566290 574113 582333 590343 597687 604121 609824 615581 622493 631328 642240
63183F42240J2911J4929J6723J7728J8023J8577K0024K1673K2495K2683K3377
$$ 642240 655151 670080 686803 704531 722554 741131 761155 782828 805323 828006 851383
63172H51383K4904K6267K6561K6071K5569K5277K5020K4893K5139K5666K6202
$$ 851383 876287 902554 929115 955186 980755 1006032 1031052 1055945 1081084 1106750 1132952
63161A132952K6734K7294K7472K6745K5269K3889K3119K2473K0942J7909J3452
$$ 1132952 1159686 1186980 1214452 1241197 1266466 1290355 1313474 1335947 1356889 1374798 1388250
63150A388250Q048K316l005p335j0859j4620j9412k4412k7423k7031k4331k1850
$$ 1388250 1396298 1398614 1395609 1388274 1377415 1362795 1343383 1318971 1291548 1264517 1240186 1218336
63138A218336k0906k0677j9923j8633j7369j5821j3072r120n216k501r78N1J156
$$ 1218336 1197430 1176753 1156830 1138197 1120828 1105007 1091935 1082815 1077599 1075098 1074120 1074171 1075327
63125A075327K661M844P725J0809J3266J4375J3962J2737J2123J3082J4964J6059
$$ 1075327 1077988 1082832 1090557 1101366 1114632 1129007 1142969 1155706 1167829 1180911 1195875 1211934
63113A211934J5582J4524J4182J4466J4216J2635R629N195l43n639r125j0940
$$ 1211934 1227516 1242040 1256222 1270688 1284904 1297539 1307168 1312363 1312020 1306381 1297256 1286316
63101A286316j3045j6772k0991k3601k4191k4110k4279k4269k3798k3716k4643
$$ 1286316 1273271 1256499 1235508 1211907 1187716 1163606 1139327 1115058 1091260 1067544 1042901
63090A042901k5574k5056k3338k1985k1441k0372j7961j5460j4463j4475j3634
$$ 1042901 1017327 992271 968933 946948 925507 905135 887174 871714 857251 842776 829142
63079H29142j1356q873p189o028n119n046n946o493n333k916q22L27J150K033
$$ 829142 817786 808913 801724 795696 790577 785531 779585 773092 767759 764843 764021 764348 765498 767531
63065G67531K589K581K428K529K870L429M322N312N886N934N736N300M517M008
$$ 767531 770120 772701 775129 777658 780528 783957 788279 793591 799477 805411 811147 816447 820964 824972
63051H24972M756O495P532O898N849O200P784Q671P648N546L928L362L251K838
$$ 824972 829728 836223 843755 850653 856502 862702 870486 879157 886805 892351 896279 899641 902892 905730
63037I05730K003J295J386K318L307L428K528J321O74R27J841K898L658L930L758
$$ 905730 907733 909028 910414 912732 916039 919467 921995 923316 923990 924917 926758 929656 933314 937244 941002
63022I41002L315K873K785L332M506O075P674Q741Q783Q177Q216R566J1028J1042
$$ 941002 944317 947190 949975 953307 957813 963888 971562 980303 989086 997263 1005479 1015045 1026073 1037115
63008A037115J0411J1984J6921K2659K5706K5548K4585K5015K7191L0561L4529
$$ 1037115 1047526 1059510 1076431 1099090 1124796 1150344 1174929 1199944 1227135 1257696 1292225
62997A292225L8234M0838M2516M4409M7371N1347N5786N9840O2421O3205O3446
$$ 1292225 1330459 1371297 1413813 1458222 1505593 1556940 1612726 1672566 1734987 1798192 1861638
62986A861638O4590O6103O6096O4284O2684O2764O3472O3134O1978O1387O1649
$$ 1861638 1926228 1992331 2058427 2122711 2185395 2248159 2311631 2374765 2436743 2498130 2559779
62975B559779O1839O1262N9612N6147N0203M2451L4339K6265J7332P051l900j4726
$$ 2559779 2621618 2682880 2742492 2798639 2848842 2891293 2925632 2951897 2969229 2976280 2972380 2957654
62963B957654k5359l5757m5254n3023n8725o2404o4349o5179o5415o4677o1963
$$ 2957654 2932295 2896538 2851284 2798261 2739536 2677132 2612783 2547604 2482189 2417512 2355549
62952B355549n7098n1206m5379l9564l3371k7305k2294j8312j4308r572m411O01
$$ 2355549 2298451 2247245 2201866 2162302 2128931 2101626 2079332 2061020 2046712 2037140 2032729 2033330
62940B033330N376R989J4083J7055J8677J9267J9423J9803K0928K2786K4508K4839
$$ 2033330 2038706 2048695 2062778 2079833 2098510 2117777 2137200 2157003 2177931 2200717 2225225 2250064
62928B250064K3232K0341J7210J4033J0096M897j133p296j3601k0524k7920l4758
$$ 2250064 2273296 2293637 2310847 2324880 2334976 2339873 2338740 2331444 2317843 2297319 2269399 2234641
62916B234641m0086m3961m7223n0581n4025n6883n8275n7609n4984n1165m7310
$$ 2234641 2194555 2150594 2103371 2052790 1998765 1941882 1883607 1825998 1771014 1719849 1672539
62905A672539m4562m3467m3389m2677m0048l5950l2220l0236k9684k9222k7935
$$ 1672539 1627977 1584510 1541121 1498444 1458396 1422446 1390226 1359990 1330306 1301084 1273149
62894A273149k6006k4393k4048k5050k6278k6323k4912k3005k1352j9755j8101
$$ 1273149 1247143 1222750 1198702 1173652 1147374 1121051 1096139 1073134 1051782 1032027 1013926
62883A013926j7188j7603j8488j8439j7335j6188j5415j4528j3383j2484j1827
$$ 1013926 996738 979135 960647 942208 924873 908685 893270 878742 865359 852875 841048
62872H41048j0687r010p823p707p918p650p170o866o170m530k692j845j966k138
$$ 841048 830361 821351 813528 805821 797903 790253 783083 776217 770047 765517 762825 760980 759014 756876
62858G56876k112k397l039l485l593l797m229m539m600m522m106l183k415k603
$$ 756876 754764 752367 749328 745843 742250 738453 734224 729685 725085 720563 716457 713274 710859 708256
62844G08256l246k938j411o9j05j174k279k965l101k488j334l81lJ78M22M82M57
$$ 708256 705010 702072 700661 700592 700487 699313 697034 694069 690968 688480 687146 686765 686762 686940 687362 687844 688301
62827F88301R93K020K364J380M4n32p07j394k302k377j504n66j86l65j043j946
$$ 688301 689294 691314 693678 695058 695102 694570 693863 692469 690167 687790 686286 685720 685534 685169 684126 682180
62811F82180k269j569o57n97j120j173p34p43j382j713j220m63j3K08K70j7m40
$$ 682180 679911 678342 677685 677088 675968 674795 674061 673318 671936 670223 669003 668540 668527 668735 669005 668988 668548
62794F68548l42L97J167J514J448Q79k31j134r05lJ00p64r35O42K739L588L126
$$ 668548 668206 668603 669770 671284 672732 673611 673380 672246 671341 671338 671438 670674 669739 670381 673120 676708 679834
62777F79834K400J699O18o09j120o34K97J113J575J535J176J214K073L037L147
$$ 679834 682234 683933 684551 683942 682822 682188 682485 683598 685173 686708 687884 689098 691171 694208 697355
62762F97355K744L181M805O128N590L571K124K717M662N993N815N392O539R183
$$ 697355 700099 703280 708085 714213 719803 723374 725498 728215 732877 738870 744685 750077 756616 765799
62748G65799J1270J1261R903R067R485J0426J1215J2156J3821J6079J8261J9978
$$ 765799 777069 788330 798233 807300 816785 827211 838426 850582 864403 880482 898743 918721
62736I18721K1498K3191K4761K5460K5321K5737K8150L2269L6429L9744M3001
$$ 918721 940219 963410 988171 1013631 1038952 1064689 1092839 1125108 1161537 1201281 1244282
62725A244282M7114N1740N6086O0221O4782O9853P4965P9867Q4640Q9141R2747
$$ 1244282 1291396 1343136 1399222 1459443 1524225 1594078 1669043 1748910 1833550 1922691 2015438
62714B015438R4428R3069Q8512Q2373P6666P1034O2633M9792L4526K0017O761
$$ 2015438 2109866 2202935 2291447 2373820 2450486 2521520 2584153 2633945 2668471 2688488 2695249
62703B695249o868k1127l4291m5354n4944o3202o9038p2352p5060p8569q1814
$$ 2695249 2688381 2667254 2632963 2587609 2532665 2469463 2400425 2328073 2253013 2174444 2092630
62692B092630q3096q2528q1085p8439p3697o7762o3057o0687n9347n7228n3774
$$ 2092630 2009534 1927006 1845921 1767482 1693785 1626023 1562966 1502279 1442932 1385704 1331930
62681A331930m9369m4520l9994l6682l4591l2556k9714k6646k4355k2566k0139
$$ 1331930 1282561 1238041 1198047 1161365 1126774 1094218 1064504 1037858 1013503 990937 970798
62670I70798j7011j4549j3560j2913j1013q064n788n018m612l062k92K627M799
$$ 970798 953787 939238 925678 912765 901752 893688 887900 882882 878270 875208 874916 877543 882342
62657H82342N939O161O210P358J0101J3158J4812J5188J6165J8952K2792K6372
$$ 882342 888281 894442 900652 908010 918111 931269 946081 961269 977434 996386 1019178 1045550
62645A045550K9469L2655L6252M0271M4721M9245N2999N5564N7638O0147O3006
$$ 1045550 1075019 1107674 1143926 1184197 1228918 1278163 1331162 1386726 1444364 1504511 1567517
62634A567517O5363O6627O6596O4931O1338N6134M9841M2397L3497K3611J3757
$$ 1567517 1632880 1699507 1766103 1831034 1892372 1948506 1998347 2040744 2074241 2097852 2111609
62623B111609M188n822j6626k7323l6531m3543m8547n2308n5808n9445o2313o2970
$$ 2111609 2115797 2109975 2093349 2066026 2029495 1985952 1937405 1885097 1829289 1769844 1707531 1644561
62611A644561o1295n8859n7032n5565n3628n1335m9214m6951m3998m0989l9113
$$ 1644561 1583266 1524407 1467375 1411810 1358182 1306847 1257633 1210682 1166684 1125695 1086582
62600A086582l8077l6202l2765k8933k5909k3467k1000j8734j6899j4876j2430
$$ 1086582 1048505 1012303 979538 950605 924696 901229 880229 861495 844596 829720 817290
62589H17290j0922j1678j3604j4010j1936r246q215r042j0159j0006q117n235
$$ 817290 806368 794690 781086 767076 755140 745894 737679 728637 718478 708472 700355 695120
62577F95120k755j565j262j033r81j655k519k353j333j066k028k583j571k44j09
$$ 695120 692365 690800 689538 688505 687524 685869 683350 680997 679664 678598 676570 673987 672416 672172 672063
62562F72063l00J012L351M364L353K310K966M671N976O840Q083R565J0291J0003
$$ 672063 671763 672775 676126 680490 683843 686153 689119 693790 699766 706606 714689 724254 734545 744548
62548G44548R667J0323J1980J3819J5156J6086J7250J9089K1396K3696K5791K7860
$$ 744548 754215 764538 776518 790337 805493 821579 838829 857918 879314 903010 928801 956661
62536I56661L0267L3459L7562M1670M4065M3919M2397M1256M0603L9010L5686
$$ 956661 986928 1020387 1057949 1099619 1143684 1187603 1230000 1271256 1311859 1350869 1386555
62525A386555L1353K6694K1163J4020N739k363r452j5490k0711k5461l0122l4554
$$ 1386555 1417908 1444602 1465765 1479785 1485524 1483161 1473709 1458219 1437508 1412047 1381925 1347371
62513A347371l7758l8806l8159l7520l8093l9253l9200l6864l3040k9546k7463
$$ 1347371 1309613 1270807 1232648 1195128 1157035 1117782 1078582 1041718 1008678 979132 951669
62502I51669k6494k5896k5382k4773k3398k0582j6600j2528r283p307o799p420
$$ 951669 925175 899279 873897 849124 825726 805144 788544 776016 766733 759426 752627 745207
62490G45207p996p548o599o456p065o793m748k122n51j53n8K6p9O2J125K697L439
$$ 745207 737211 729663 723064 716608 709543 702750 698002 695880 695329 695176 695118 695144 695065 695127 696252 698949 702388
62473G02388K814J895K221M256P141R475J0284R672Q791Q900J0289J2218J3961
$$ 702388 705202 707097 709318 713574 720715 730190 740474 750146 758937 767837 778126 790344 804305
62460H04305J5591J7691K0452K3369K5891K8162L0728L3522L5665L6658L7286
$$ 804305 819896 837587 858039 881408 907299 935461 966189 999711 1035376 1072034 1109320
62449A109320L8598M0218M0524L8613L5291L1864K8701K5373K1464J6807J1388
$$ 1109320 1147918 1188136 1228660 1267273 1302564 1334428 1363129 1388502 1409966 1426773 1438161
62438A438161N587J21m577q513j1507j3027j2972j1960j0402q025m824j676P55
$$ 1438161 1443748 1443869 1439292 1430779 1419272 1406245 1393273 1381313 1370911 1362886 1358062 1356386 1357141
62425A357141L049O125R887J3688J7601K2065K6567K9922L1860L3289L4814L5861
$$ 1357141 1360190 1366315 1376202 1389890 1407491 1429556 1456123 1486045 1517905 1551194 1586008 1621869
62413A621869L5474L3164K8867K2845J6002R521L807j834q185j5328k2878l0398
$$ 1621869 1657343 1690507 1719374 1742219 1758221 1767742 1771549 1769715 1761530 1746202 1723324 1692926
62401A692926l7112m1895m4223m4932m5541m6711m7749m7655m6375m4655m2716
$$ 1692926 1655814 1613919 1569696 1524764 1479223 1432512 1384763 1337108 1290733 1246078 1203362
62390A203362l9720l5125l0177k6927k5559k3933k0517j6645j4556j4111j3160
$$ 1203362 1163642 1128517 1098340 1071413 1045854 1021921 1001404 984759 970203 956092 942932
62379I42932j0911q880q160p716o422n121n149n825n203l063j438k019m273o616
$$ 942932 932021 923141 914981 907265 900843 895722 890573 884748 879545 876482 875044 873025 868752 862136
62365H62136q284r346r749r383q815q912r664j0077r513q545q052p958p485o479
$$ 862136 853852 844506 834757 825374 816559 807647 797983 787906 778393 769848 761796 753838 746353 739874
62351G39874n665n504n488m984m182l698l581l314k697k060j635j137k07J034
$$ 739874 734209 728705 723217 718233 714051 710353 706772 703458 700761 698701 697066 695929 695722 696756
62337F96756K052K442K361K423L067L940M296M014L866M457N375N828N696N494
$$ 696756 698808 701250 703611 706034 709101 713041 717337 721351 725217 729674 735049 740877 746573 752067
62323G52067N620O260P594R476J1156J2118J2876J4176J5731J6793J7705J9597
$$ 752067 757687 763947 771541 781017 792173 804291 817167 831343 847074 863867 881572 901169
62311I01169K2471K4952K6358K7697K9946L2636L4978L7440M0876M4852M8165
$$ 901169 923640 948592 974950 1002647 1032593 1065229 1100207 1137647 1178523 1223375 1271540
62300A271540N0749N3923N8689O4746P1307P8045Q4902R1339R6032R7244R3863
$$ 1271540 1322289 1376212 1434901 1499647 1570954 1648999 1733901 1825240 1921272 2018516 2112379
62289B112379Q6439P6824O6437N5248M2976L0514J9167Q827j836j3419k5104l5963
$$ 2112379 2198818 2275642 2342079 2397327 2440303 2470817 2489984 2498811 2496975 2483556 2458452 2422489
62277B422489m5711n3867n9539o2765o5026o7414o9061o8415o5492o1702n7853
$$ 2422489 2376778 2322911 2263372 2200607 2135581 2068167 1999106 1930691 1865199 1803497 1745644
62266A745644n3643m9101m5229m2723m1054l9390l7748l6542l5608l4374l2814
$$ 1745644 1692001 1642900 1597671 1554948 1513894 1474504 1436756 1400214 1364606 1330232 1297418
62255A297418l1491l0732l0269k9709k8932k7959k6831k5662k4564k3404k1902
$$ 1297418 1265927 1235195 1204926 1175217 1146285 1118326 1091495 1065833 1041269 1017865 995963
62244I95963j9968j7761j5404j2959j0720r155q458q310q179p684o571m755k510
$$ 995963 975995 958234 942830 929871 919151 909996 901538 893228 885049 877365 870794 866039 863529
62231H63529m41J009J919K640L353M015M626N424O682Q315R650R922R298R133
$$ 863529 863088 864097 866016 868656 872009 876024 880650 886074 892756 901071 910721 920643 929941 939074
62217I39074J0669J3497J5897J6793J6760J6948J7762J9047K0905K3572K6758
$$ 939074 949743 963240 979137 995930 1012690 1029638 1047400 1066447 1087352 1110924 1137682
62206A137682K9852L2704L5731L9272M3209M7217N1188N5601O1439O9176P7653
$$ 1137682 1167534 1200238 1235969 1275241 1318450 1365667 1416855 1472456 1533895 1603071 1680724
62195A680724Q4657Q9157R2292R5406R7870R7824R4483Q8401P9873O8629N5303
$$ 1680724 1765381 1854538 1946830 2042236 2140106 2237930 2332413 2420814 2500687 2569316 2624619
62184B624619M1662K8831J6320L297j0132k3328l5850m7226n6961o5333p3213
$$ 2624619 2666281 2695112 2711432 2714729 2704597 2681269 2645419 2598193 2541232 2475899 2402686
62173B402686q0489q5632q7620q7234q5530q2160p6669p0580o6349o4326o2339
$$ 2402686 2322197 2236565 2148945 2061711 1976181 1894021 1817352 1746772 1680423 1616097 1553758
62162A553758n8526n3289m8068m3462l9197l5144l1588k8765k6525k4272k1436
$$ 1553758 1495232 1441943 1393875 1350413 1311216 1276072 1244484 1215719 1189194 1164922 1143486
62151A143486j8379j6510j6638j7463j6763j4048j0814q136n584l074j961k980
$$ 1143486 1125107 1108597 1091959 1074496 1057733 1043685 1032871 1024735 1019151 1016077 1014116 1011136
62139A011136m350l606o15K769N424P567R016Q971P904P783R562J1848J2999J3337
$$ 1011136 1006786 1003180 1002565 1005334 1010758 1018325 1027341 1036312 1044216 1051999 1061561 1073409 1086408 1099745
62125A099745J4098J5307J6073J6395J7249J9063K1140K2650K3286K3137K2721
$$ 1099745 1113843 1129150 1145223 1161618 1178867 1197930 1219070 1241720 1265006 1288143 1310864
62114A310864K2970K4300K5924K6916K7762K9759L3127L6994M1251M6838N3786
$$ 1310864 1333834 1358134 1384058 1410974 1438736 1468495 1501622 1538616 1579867 1626705 1680491
62103A680491O0369O4970O7544O8528O7445O3697N7728N0312M1468L1314K1190
$$ 1680491 1740860 1805830 1873374 1941902 2009347 2073044 2130772 2181084 2222552 2253866 2275056
62092B275056J2473M761l321j1714j8901k4343k9452l5623m2419m8234n1910n3190
$$ 2275056 2287529 2292290 2288969 2277255 2258354 2234011 2204559 2168936 2126517 2078283 2026373 1973183
62080A973183n2376n0258m7794m5316m2313l8360l3992l0286k7749k5879k3756
$$ 1973183 1920807 1870549 1822755 1777439 1735126 1696766 1662774 1632488 1604739 1578860 1555104
62069A555104k1046j8371j6476j5020j2739r169n449k860j360n34j128m041q063
$$ 1555104 1534058 1515687 1499211 1484191 1471452 1462283 1456834 1453974 1452614 1452080 1450952 1446911 1438848
62056A438848j0361r596p196n219m267l945m080m764o077q304j1490j4529j5921
$$ 1438848 1428487 1418891 1411695 1406476 1402209 1398264 1394184 1389420 1383343 1375039 1363549 1349020 1333099
62043A333099j5748j5603j5996j5481j3259j0841r784r172p177l996j327L21J893
$$ 1333099 1317351 1301748 1285752 1270271 1257012 1246171 1236387 1227215 1220038 1216042 1214715 1215036 1216929
62030A216929L666M815N111N475O544P939R107R912J0401J1043J2946J6642K0817
$$ 1216929 1220595 1225410 1230521 1235996 1242540 1250479 1259586 1269498 1279899 1290942 1303888 1320530 1341347
62017A341347K3569K4873K6405K8922L1281L2472L3109L4389L6717L9883M3553
$$ 1341347 1364916 1389789 1416194 1445116 1476397 1508869 1541978 1576367 1613084 1652967 1696520
62006A696520M6989M9302N0533N1760N3650N5666N6934N6918N4979N0413M3488
$$ 1696520 1743509 1792811 1843344 1895104 1948754 2004420 2061354 2118272 2173251 2223664 2267152
61995B267152L5457K7129J8332R163N79o973j4329k2264l0333l7737m4387n0309
$$ 2267152 2302609 2329738 2348070 2357233 2357812 2350839 2336510 2314246 2283913 2246176 2201789 2151480
61983B151480n5137n8946o2425o5272o5833o3656o1003o0100n9960n7972n3836
$$ 2151480 2096343 2037397 1974972 1909700 1843867 1780211 1719208 1659108 1599148 1541176 1487340
61972A487340m9734m6955m4675m2095l9558l7140l4180l0847k8286k6495k3960
$$ 1487340 1437606 1390651 1345976 1303881 1264323 1227183 1193003 1162156 1133870 1107375 1083415
61961A083415k0383j7876j7974j9099j8722j6881j5567j5396j4999j3545j1958
$$ 1083415 1063032 1045156 1027182 1008083 989361 972480 956913 941517 926518 912973 901015
61950I01015j1159j0610r264p056m909l740l670l810k908p67J243J782J315J260
$$ 901015 889856 879246 869982 862926 858017 854277 850607 846797 843889 843122 844365 846147 847462 848722
61936H48722J770J744J052R42J701J717J9j739j509j14k71k736n384o354o354
$$ 848722 850492 852236 853288 854230 855931 857648 857667 855928 854419 854305 854034 851298 845914 839560 833206
61921H33206p082q724j0128j0636j0614j0548j0374r731q335o352m608m021m464
$$ 833206 826124 817400 807272 796636 786022 775474 765100 755369 747034 740682 736074 732053 727589
61908G27589m642l660k233j689k185k672k423j706q97Q5J218J956J893J473J549
$$ 727589 722947 719287 717054 715365 713180 710508 708085 706379 705482 705567 706785 708741 710634 712107 713656
61893G13656K386L346L537K737J887K433M812P658R136R087R125J0400J2169J3172
$$ 713656 716042 719388 722925 725662 727549 729982 734794 742452 751588 760675 769800 780200 792369 805541
61879H05541J3661J4917J7182J9206K0040K0205K0591K1017K0600J9161J7445
$$ 805541 819202 834119 851301 870507 890547 910752 931343 952360 972960 992121 1009566
61868A009566J6070J4934J3719J2469J1400J0484R484Q223O608M653K584Q17n09
$$ 1009566 1025636 1040570 1054289 1066758 1078158 1088642 1098126 1106349 1112957 1117610 1120194 1121011 1120502
61855A120502j740l160m322m332k831l48K423N264Q169J0805J2620J3405J3388
$$ 1120502 1118762 1115602 1111280 1106948 1104117 1103769 1106192 1111456 1119625 1130430 1143050 1156455 1169843
61842A169843J2877J1962J0498Q197M863Q51k909n629p398q943j0771j2743j4319
$$ 1169843 1182720 1194682 1205180 1213377 1218240 1219091 1216182 1210553 1203155 1194212 1183441 1170698 1156379
61829A156379j4955j4488j3644j3895j5979j8572j9294j7383j4634j3219j3240
$$ 1156379 1141424 1126936 1113292 1099397 1083418 1064846 1045552 1028169 1013535 1000316 987076
61818I87076j3251j2578j2007j2218j2647j2391j1502j0723j0205r227p298n064
$$ 987076 973825 961247 949240 937022 924375 911984 900482 889759 879554 870327 863029 857965
61806H57965l666l274k646n13K775N482O446O343O635P799R299J1076J3989J8440
$$ 857965 854299 851025 848379 847866 850641 856123 862569 868912 875547 883346 892645 903721 917710 936150
61792I36150K3235K6538K7733K7892K8469K9974L1908L3473L4100L3539L1820
$$ 936150 959385 985923 1013656 1041548 1070017 1099991 1131899 1165372 1199472 1233011 1264831
61781A264831K9259K6352K3406K0216J6232J1272N993J424j994m586o643p901
$$ 1264831 1294090 1320442 1343848 1364064 1380296 1391568 1397561 1398985 1396991 1392405 1385762 1377861
61769A377861p994p035n318k843K62L128M720N187N858P567R468R869P841L629
$$ 1377861 1369867 1362832 1357514 1354671 1354933 1358061 1362781 1367968 1373826 1381393 1390861 1400730 1408571 1412200
61755A412200j942p806j2675j5630j7047j8369k0753k3985k6835k8219k8033k7072
$$ 1412200 1410258 1402452 1389777 1374147 1357100 1338731 1317978 1293993 1267158 1238939 1210906 1183834
61743A183834k6246k5736k4995k3748k2596k2242k2332k1786k0229j8353j6756
$$ 1183834 1157588 1131852 1106857 1083109 1060513 1038271 1015939 994153 973924 955571 938815
61732I38815j5196j3401j1925j1561j2287j3237j3443j2339j0080p821p025p865
$$ 938815 923619 910218 898293 886732 874445 861208 847765 835426 825346 817525 810500 802635
61720H02635q742q067o014l861k235j148j101k628m770n606m607l166k383j775
$$ 802635 793893 785826 779812 775951 773716 772568 771467 768839 764069 758463 753856 750690 748307 746532
61706G46532q48m21j173k054j582p2R28R57R42J377J599J081K60k37k65J24Q26
$$ 746532 745684 745263 744090 742036 740454 740382 741310 742267 743209 744586 746185 747266 747526 747289 747024 747148 747974
61689G47974J431J495J247J209J208O62j41k26L90M17q84k668l814m159l929l078
$$ 747974 749405 750900 752147 753356 754564 755226 755085 754859 755249 755666 754782 752114 748300 744141 740212 737134
61673G37134j996j633k007j703kJ593J379N0m19K88R12J129J790K728K529J064
$$ 737134 735138 733505 731498 729795 729793 731386 732765 732815 732396 732684 733596 734725 736515 739243 741772 742836
61657G42836J37Q00J801J777J347J598J933J186r3l02O65J255N60p02j634k358
$$ 742836 742973 743773 745574 747351 748698 750296 752229 753415 753322 753020 753685 754940 755500 754798 753164 750806
61641G50806l298m325n059n425n536n459n312n237n176n003m812m762m748m697
$$ 750806 747508 743183 738124 732699 727163 721704 716392 711155 705979 700976 696164 691402 686654 681957
61627F81957m964n923p194p842p351n979m308k825j898j647j838k169k524k669
$$ 681957 676993 671070 663876 656034 648683 642704 638396 635571 633673 632026 630188 628019 625495 622826
61613F22826k217j310r05j606k646k763j840p74p7M10O43L66l9J24O75P98O07
$$ 622826 620609 619299 618394 616788 614142 611379 609539 608765 608688 609098 609741 610107 610068 610192 610867 611665 612272
61596F12272J076K118K170N08j222q39J746M671O224N969M417K553J448J427J737
$$ 612272 613348 615466 617636 618144 616922 616083 617829 622500 628724 634693 639110 641663 643111 644538 646275
61581F46275J490P67K79L29N87P22P70R73J473J954J634J09j851l044l386l764
$$ 646275 647765 648532 648811 649140 649727 650449 651219 652192 653665 655619 657253 657362 655511 652467 649081 645317
61565F45317m321m185l340l210m429n480m856l453l148l900m080l241k583k656
$$ 645317 640996 636811 633471 630261 625832 620352 615496 612043 608895 604995 600915 597674 595091 592435
61551E92435k513j482l61j65q76j947l098m129m797n287o034o756o445m809l005
$$ 592435 589922 588440 588079 587914 587038 585091 581993 577864 573067 567780 561746 554990 548545 543736 540731
61536E40731k487l575n437o869o996n844m540m216m540m121k526j013q31j694
$$ 540731 538244 534669 529232 522363 515367 509523 504983 500767 496227 492106 489580 488567 487736 486042
61522D86042k488k705k457j866j235j314k397l480l218j678k97j43q58j535j898
$$ 486042 483554 480849 478392 476526 475291 473977 471580 468100 464882 463204 462907 462764 461906 460371 458473
61507D58473k207k429k102j070P5O06M88L16M39O14O36P61J185J582J694J934
$$ 458473 456266 453837 451735 450665 450740 451346 451834 452150 452589 453203 453839 454600 455785 457367 459061 460995
61491D60995K665L222K643J236L95O30Q83K23o80n15P46J787J585N35r3M71J651
$$ 460995 463660 466882 469525 470761 471156 471786 472669 472892 472212 471697 472443 474230 475815 476350 476257 476728 478379
61474D78379K042R82m94o84P13K258K654K128J582J103K50p42r94k12R04J552
$$ 478379 480421 481403 480909 480225 480938 483196 485850 487978 489560 490663 490913 490171 489177 488965 489869 491421
61458D91421J475O92o23j706j381N89K737L213J895M15QJ34k71j017j125o26n59
$$ 491421 492896 493588 492965 491259 489878 490467 493204 496417 498312 498727 498735 498869 498598 497581 496456 495830 495271
61441D95271j127j178r0J092J258R41J274J980J787M97p86j406j770k051j538
$$ 495271 494144 492966 492876 493968 495226 496167 497441 499421 501208 501705 500919 499513 497743 495692 494154
61426D94154J73K284L559L487K380R07k75r26j317j567j162J20J274J146K33R2
$$ 494154 494327 496611 500170 503657 506037 506944 506669 505743 504426 502859 501697 501817 503091 504237 504470 504562
61410E04562J011J785J828J933K366K029M67q29l89J053J737J302P62O45N58K61
$$ 504562 505573 507358 509186 511119 513485 515514 515981 515152 514763 515816 517553 518855 519617 520262 520820 521081
61394E21081K0K8L19J047K118K805K444J260R2l11N47K494L935K805n80k819j150
$$ 521081 521101 521129 521448 522495 524613 527418 529862 531122 531214 530903 531450 533944 537879 540684 540104 537285 536135
61377E36135K893N247M219J755J15n49r13p20N11K245L446L671K957J401m58j455
$$ 536135 539028 544275 548494 550249 550364 549815 548902 548182 548693 550938 554384 558055 561012 562413 561955 560500
61361E60500q25Q43K208K480J839R47M53O76J295J575J220O95M64K49m25j221
$$ 560500 559675 560518 562726 565206 567045 567992 568445 569121 570416 571991 573211 573906 574370 574619 574194 572973
61345E72973j213l24K02p18k358k767j235O91J179N37N77J812K611J625j87q42
$$ 572973 571760 571436 571638 570920 568562 565795 564560 565251 566430 566967 567544 569356 571967 573592 573405 572563
61329E72563O0J153J382J107J167J721K300K438K043J413R17N34n6o31j77J835
$$ 572563 572623 573776 575158 576265 577432 579153 581453 583891 585934 587347 588264 588798 588742 588111 587934 589769
61313E89769M166M776L185J179P78K021L165K898J799J465K470L677L848L342
$$ 589769 593935 598711 601896 603075 603853 605874 609039 611937 613736 615201 617671 621348 625196 628538
61299F28538L563M869O012N898M995M480M735N334N990O741P559Q342R000R139
$$ 628538 632101 636970 642982 648880 653875 658355 663090 668424 674414 681155 688714 697056 706056 715195
61285G15195Q186O375M946M650M652L829K626K530L942N655O439O197N455M572
$$ 715195 723381 729756 734702 739352 744004 747833 750459 752989 756931 762586 769025 775222 780677 785249
61271G85249L687K901K167J367M15p98k343l819m440l976l139k630k313j821j330
$$ 785249 788936 791837 794004 795371 795786 794988 792645 788826 784386 780410 777271 774641 772328 770507 769177
61256G69177j019n16L33Q97R51J667M051O963Q201P346O176O353Q009J0549J3275
$$ 769177 768158 767642 767975 768872 769823 771490 775541 782504 790705 798051 804227 810580 818589 829138 842413
61241H42413J4993J4457J1872Q957P051N894M517K541L04j488k075j359m48p41
$$ 842413 857406 871863 883735 892692 899743 905637 910154 912695 912999 911511 909436 908077 907629 906888
61227I06888k379m294n706o669p259p203o481n434m243l032k296k216j820o9K365
$$ 906888 904509 900215 894509 887840 880581 873378 866897 861463 857220 854188 851892 849676 847856 847787 850152
61212H50152L732L580L109K986K470J173K13P46K444M145N167N486N439N696O792
$$ 850152 853884 857464 860573 863559 866029 867202 867415 868161 870605 874750 879917 885403 890842 896538 903330
61197I03330Q279R082Q771P808O661N585M989M768L690J027j486j370R87K634
$$ 903330 911609 920691 929462 937270 943931 949516 954505 959273 962963 963990 962504 961134 962121 964755
61183I64755K189J202Q56J73j357k097j108l42j716l841m120k662j576j435r61
$$ 964755 966944 968146 969002 969175 967818 965721 964613 964271 962555 958714 954594 951932 950356 948921 947960
61168I47960K82J236J241O41l40j611k292j367P81K832M220N225N815N875O023
$$ 947960 948242 949478 950719 951360 951020 949409 947117 945750 946531 949363 953583 958808 964623 970498 976521
61153I76521O715P050O013M457M071M797N104M599M472N257O080O296O181N840
$$ 976521 983236 990286 996299 1000756 1004827 1009624 1014728 1019327 1023799 1029056 1035136 1041432 1047613 1053453
61139A053453N149N020O876J0386J3415J4788J5423J6117J6041J4478J2405J1078
$$ 1053453 1058602 1063622 1070498 1080884 1094299 1109087 1124510 1140627 1156668 1171146 1183551 1194629
61127A194629J0151Q653O887N981O081O159N406L909K112L93r74j934k606k901
$$ 1194629 1204780 1213433 1220320 1226301 1232382 1238541 1243947 1247856 1249968 1250361 1249387 1247453 1244847 1241946
61113A241946k590k064k352l755n044m853l628l288m831p031p966p380o871p794
$$ 1241946 1239356 1237292 1234940 1231185 1226141 1221288 1217660 1214372 1209541 1202510 1194544 1187164 1180293 1172499
61099A172499r685j1189j1892j2297j2313j1128q911p313p388q056p735o560n699
$$ 1172499 1162814 1151625 1139733 1127436 1115123 1103995 1095084 1087771 1080383 1072327 1064592 1058032 1052333
61086A052333n319m873m895o551r398j1326j1126r671q268p297o817o994p262
$$ 1052333 1047014 1042141 1037246 1030695 1021297 1009971 998845 989174 980906 973609 966792 959798 952536
61073I52536o485m613k851j618J30K684M405M135L331M126O311Q158R439J1505
$$ 952536 946051 941438 938587 936969 937099 939783 944188 948323 951654 955780 962091 970249 979688 991193
61059I91193J4568J6990J7696J7708J8628K0865K3885K7046K9546L0531L0092
$$ 991193 1005761 1022751 1040447 1058155 1076783 1097648 1121533 1148579 1178125 1208656 1238748
61048A238748K9523K9819L0434L0224K9077K7818K6839K5658K3802K1374J8696
$$ 1238748 1268271 1298090 1328524 1358748 1387825 1415643 1442482 1468140 1491942 1513316 1532012
61037A532012J5907J2984R786O040J773k246n116o952q766j0944j2650j3227j3478
$$ 1532012 1547919 1560903 1570689 1576729 1578502 1576256 1571140 1564188 1555422 1544478 1531828 1518601 1505123
61024A505123j4674j6688j8152j8347j7946j7741j7554j6784j5297j3407j1508
$$ 1505123 1490449 1473761 1455609 1437262 1419316 1401575 1384021 1367237 1351940 1338533 1327025
61013A327025j0028r071p853n283j535J740L307L738M385N751P591R787J2077
$$ 1327025 1316997 1307926 1300073 1294790 1293255 1294995 1298302 1302040 1306425 1312176 1319767 1329554 1341631
61000A341631J3631J4153J4984J7752K2049K5745K7668K8790L0597L3504L7191
$$ 1341631 1355262 1369415 1384399 1402151 1424200 1449945 1477613 1506403 1537000 1570504 1607695
60989A607695M1408M5751M9452N2079N4016N5931N8253O1504O6398P3021Q0321
$$ 1607695 1649103 1694854 1744306 1796385 1850401 1906332 1964585 2026089 2092487 2165508 2245829
60978B245829Q7023R2991R9355J07269J16589J25690J32751J37527J41706J47165
$$ 2245829 2332852 2425843 2525198 2632467 2749056 2874746 3007497 3145024 3286730 3433895
60968C433895J54144J61740J69868J79766J92395K07245K23183K39820K57549
$$ 3433895 3588039 3749779 3919647 4099413 4291808 4499053 4722236 4962056 5219605
60959E219605K76672K97050L18676L42534L70970M07093M53444N11343N81556
$$ 5219605 5496277 5793327 6112003 6454537 6825507 7232600 7686044 8197387 8778943
60950H778943O64897P61776Q72057R96499J137701J299051J484621J700696J949592
$$ 8778943 9443840 10205616 11077673 12074172 13211873 14510924 15995545 17696241 19645833
60941A9645833K207723K403697K431698K212590J761213J196651O79232L27404
$$ 19645833 21853556 24257253 26688951 28901541 30662754 31859405 32538637 32866041
60933C2866041J79777K11196L58567N25183N85132M24421Q405n83028j194222
$$ 32866041 33045818 33257014 33615581 34140764 34725896 35150317 35158722 34575694 33381472
60924C3381472j680499j974355k089203k078305j994480j875093j744224j615847
$$ 33381472 31700973 29726618 27637415 25559110 23564630 21689537 19945313 18329466
60916A8329466j494575j378798j266380j157631j053844r55481q62879p77343
$$ 18329466 16834891 15456093 14189713 13032082 11978238 11022757 10159878 9382535
60908I382535o99972o30137n66458n08911m58574m15453l77917l44392l14203
$$ 9382535 8682563 8052426 7485968 6977057 6518483 6103030 5725113 5380721 5066518
60899E066518k86567k60388k35735k14067j96087j80664j66802j55185j46395
$$ 5066518 4779951 4519563 4283828 4069761 3873674 3693010 3526208 3371023 3224628
60890C224628j38856j30421j21210j13026j06514j00591r4381q7887q0934p3342
$$ 3224628 3085772 2955351 2834141 2721115 2614601 2514010 2419629 2331742 2250808 2177466
60880B177466o6237o1503n9500n8671n7572n5919n3595n0378m6960m4680m3641
$$ 2177466 2111229 2049726 1990226 1931555 1873983 1818064 1764469 1714091 1667131 1622451 1578810
60869A578810m2545m0735l8910l7377l5347l2699l0715k9969k9036k6576k3443
$$ 1578810 1536265 1495530 1456620 1419243 1383896 1351197 1320482 1290513 1261477 1234901 1211458
60858A211458k1391k0671k0243j9541j8734j7796j6503j4961j3390j1776j0390
$$ 1211458 1190067 1169396 1149153 1129612 1110878 1093082 1076579 1061618 1048228 1036452 1026062
60847A026062r780r582q402n747l243k731l931n124n443n217m676l710k657k142
$$ 1026062 1016282 1006700 998298 992551 989308 986577 982646 977522 972079 966862 962186 958476 955819 953677
60833I53677k181k312k434k783l477m704o774r123j0097q941p324p480r196j0242
$$ 953677 951496 949184 946750 943967 940490 935786 929012 919889 909792 900851 893527 886047 876851 866609
60819H66609r631q813r316j0620j1160j0340q859p644p124p188p260o623n078
$$ 866609 856978 848165 838849 828229 817069 806729 797870 790226 783102 775914 768654 762031 756953
60806G56953l257k091j882j989j637j058j373k959m420m191k757j972k202j863
$$ 756953 753696 751605 749723 747734 746097 745039 743666 740707 736287 732096 729339 727367 725165 723302
60792G23302k34J195J331J547L357N377M957K229J65N75K161K880K381J403K90
$$ 723302 723068 724263 725594 727141 730498 735875 740832 743061 743226 743801 745962 748842 751223 752626 752916
60777G52916q71j595j531j128j213k087l384m443m765m406l954l791l589l022
$$ 752916 752045 750450 748919 747791 746578 744491 741107 736664 731899 727493 723539 719748 716159 713137
60763G13137k606l154m499n476n099l382j282k64j361l994o137o425n493m572
$$ 713137 710531 707377 702878 697402 692303 688921 687639 687375 686014 682020 675883 669458 663965 659393
60749F59393l794l047l463n961q912r415p131m763m306m622l637j394K08l60k988
$$ 659393 655599 652552 649089 643128 634216 624801 617670 612907 608601 603979 600342 598948 599156 598796 595808
60734E95808o130p611o252l162p03J01J40J37m40j775k665k149j060q13j484k066
$$ 595808 589678 582067 575815 572653 571950 572051 572191 572328 571888 570113 567448 565299 564239 563426 561942 559876
60718E59876j820m76J883M180M538K475J40QJ810L142K763J865K051L349M563
$$ 559876 558056 557580 559463 563643 568181 570656 570796 570804 572614 575756 578519 580384 582435 585784 590347
60703E90347M646L402J421k89j011p46P4J065J828J866J132L32P3k4p32j923k528
$$ 590347 594993 598395 599816 599527 598516 597770 597844 598909 600737 602603 603735 604067 604140 604116 603384 601461 598933
60686E98933j784j17J228J185l32k278l328l120k412k044k284l204m737o085o114
$$ 598933 597149 597032 598260 599445 599113 596835 593507 590387 587975 585931 583647 580443 575706 569621 563507
60671E63507n032m491n180n519m104k215k035l218l535k573k287l483m316l341
$$ 563507 558475 553984 548804 543285 539181 536966 534931 531713 528178 525605 523318 519835 515519 512178
60657E12178j819j486j808j331k56L65J007K737M497L868R55r75L00K998M010
$$ 512178 510359 508873 507065 505734 505478 505843 506850 509587 514084 517952 518907 517932 518232 521230 525240
60642E25240K992K098K508L232L231K986L313L840L554K336J199J074J809K394
$$ 525240 528232 530330 532838 536070 539301 542287 545600 549440 552994 555330 556529 557603 559412 561806
60628E61806K002Q27j22n2Q01J574J739J461J089Q08Q04J259J980K397K277K038
$$ 561806 563808 564635 564513 564461 565262 566836 568575 570036 571125 571933 572737 573996 575976 578373 580650 582688
60612E82688K071K060J504O22J07m7p43k399l890l720k151j278k487m551n130
$$ 582688 584759 586819 588323 588945 589052 589005 588262 585863 581973 578253 576102 574824 572337 567786 562656
60597E62656l822k545k689l215k363j50J997L401M471N154M669L001J278J83p69
$$ 562656 558834 556289 553600 550385 548022 547872 549869 553270 557741 562895 567564 570565 571843 572026 571257
60582E71257j940k744k763k489k156j011J120K602J773p20k701l060k398j550
$$ 571257 569317 566573 563810 561321 559165 558154 559274 561876 563649 562929 560228 557168 554770 553220
60568E53220r49j110k182l035k248j98J122O69n77j252j115m96M19J163J062M83
$$ 553220 552271 551161 548979 545944 543696 543498 544620 545289 544712 543460 542345 541849 542268 543431 544493 544976
60552E44976P77K217L154K369J147J538L210L755K043l71j452r79J1R53J916K744
$$ 544976 545753 547970 551124 553493 554640 556178 559388 563143 565186 564815 563363 562384 562395 563348 565264 568008
60536E68008L081L084L172L092K194R09Q97K901N115M817J619j947l152j572J271
$$ 568008 571089 574173 577345 580437 582631 583540 584437 587338 592453 597270 598889 596942 593790 592218 593489
60521E93489L684M696M282L547L966N642O863O284M846M624O295Q903J1521J3763
$$ 593489 597173 601869 606151 609698 613664 619306 626169 632453 637299 641923 648218 657121 668642 682405
60507F82405J4960J4497J3120J2475J2970J3279J2331J0601Q923P095M448J060
$$ 682405 697365 711862 724982 737457 750427 763706 776037 786638 795561 802656 807104 808164
60495H08164k224m453n010m021k595j893j798j253P3J556L215O028R940J3025
$$ 808164 805940 801487 796477 792456 789861 787968 786170 784917 784990 786546 789761 795789 805729 818754
60481H18754J3792J3398J4302J7313K1112K4125K5749K5896K4607K2174J9006
$$ 818754 832546 845944 860246 877559 898671 922796 948545 974441 999048 1021222 1040228
60470A040228J5224J0888O442K524n62k833m306n121n717o553p659q693r133q488
$$ 1040228 1055452 1066340 1072782 1075306 1074744 1071911 1067605 1062484 1056767 1050214 1042555 1033862 1024729 1016241
60456A016241o745m676l085j788o8J831K951L568N453R371J3585J6120J7525J9944
$$ 1016241 1009496 1004820 1001735 999947 999879 1001710 1004661 1008229 1013682 1023053 1036638 1052758 1070283 1090227
60442A090227K4117K8766L2663L5976L9562M3945M8958N3571N6226N6229N4602
$$ 1090227 1114344 1143110 1175773 1211749 1251311 1295256 1344214 1397785 1454011 1510240 1564842
60431A564842N2801N0876M7774M3047L6995K9345J9217O749o335j8213k8253l6678
$$ 1564842 1617643 1668519 1716293 1759340 1796335 1825680 1844897 1851646 1845311 1827098 1798845 1762167
60419A762167m3671m9290n3553n6422n8007n8786n9015n8105n5381n1474m8028
$$ 1762167 1718496 1669206 1615653 1559231 1501224 1442438 1383423 1325318 1269937 1218463 1170435
60408A170435m5818m3952m1231l7487l3301k9202k5606k2965k1305j9958j8217
$$ 1170435 1124617 1080665 1039434 1001947 968646 939444 913838 890873 869568 849610 831393
60397H31393j6093j4191j3022j2596j2554j2531j2414j2044j0729p822m259k610
$$ 831393 815300 801109 788087 775491 762937 750406 737992 725948 715219 707397 703138 700528
60385G00528m439p946r711q680o993o605o808n978m275l058k559j789n16K13l48
$$ 700528 696089 688143 678432 669752 662759 656154 649346 643368 639093 636035 633476 631687 631171 631384 631036
60370F31036j680k956l875m217l572k168j211j519k320k257j276n08l81n6R19
$$ 631036 629356 626400 622525 618308 614736 612568 611357 609838 607518 605261 603985 603477 603096 603040 603959
60355F03959J571J013J37N33K122L147K618J424P33N00K44K46R34J807K053J801
$$ 603959 605530 606543 606680 607213 609335 612482 615100 616524 617257 617757 618001 618247 619181 620988 623041 624842
60339F24842J760J880J526P93O03J302K102K291K234K658L516L981L450K165R89
$$ 624842 626602 628482 630008 630801 631404 632706 634808 637099 639333 641991 645507 649488 652938 655103 656092
60324F56092O89J412K793M400N823O437N796M517L950M386M430K962J020M35J258
$$ 656092 656781 658193 660986 665386 671209 677646 683442 687959 691909 696295 700725 703687 704707 705142 706400
60309G06400K027K276K962M188M503L292K249L129N257O641O682O199N426L811
$$ 706400 708427 710703 713665 717853 722356 725648 727897 731026 736283 742924 749606 755805 761231 765042
60295G65042J836J342L263O177P860P717O980O871P261P133N890L973K253R76
$$ 765042 766878 768220 771483 777660 785520 793237 800217 807088 814349 821482 827372 831345 833598 834574
60281H34574m31k372m175m677l704k372j719j507q68R2Q9j771m570o203n449l202
$$ 834574 834143 831771 827596 822919 819215 816843 815124 813617 812749 812841 812930 811159 806589 800386 794937 791735
60265G91735j516j502k360k559j780j213j841k823k255N21M050O474P474P962
$$ 791735 790219 788717 786357 783798 782018 780805 778964 776141 773886 774407 778457 784931 792405 800367
60251H00367Q384Q398Q167Q876J1304J4464J6427J6314J4985J3820J3256J2536
$$ 800367 808751 817149 825316 834192 845496 859960 876387 892701 907686 921506 934762 947298
60239I47298J0653P341L236r10m880q707j1920j3758j4150j3851j3353j2306j0468
$$ 947298 957951 965292 968528 967618 962738 954031 942111 928353 914203 900352 886999 874693 864225
60226H64225q591p612p307o555m839k901j840k059l075l924l757k588j503j685
$$ 864225 855634 848022 840715 834160 829321 826420 824580 822521 819446 815522 811765 809177 807674 805989
60212H05989l089m365m279k968j735j745l011m508n212m912l986k627q39Q57J416
$$ 805989 802900 798535 794256 791288 789553 787808 784797 780289 775077 770165 766179 763552 762713 763570 764986
60197G64986M15j283k488k928l004k774j881l56J152J984J877R64j40m20O58K257
$$ 764986 765401 764118 761630 758702 755698 752924 751043 750687 751839 753823 755700 756664 756524 756104 756762 759019
60181G59019K751J487m34j320o28O27J023J43j145j721j353n57L69J667L353M792
$$ 759019 761770 763257 762823 761503 760875 761502 762525 762668 761523 759802 758449 757892 758261 759928 763281 768073
60165G68073N287M722L477K171J581K105L131L660L752M362N497N920N266M996
$$ 768073 773360 778082 781559 783730 785311 787416 790547 794207 797959 802321 807818 813738 819004 824000
60151H24000O100P227O738N539N913Q130J0166J0610R947Q992P877O981P060P887
$$ 824000 830100 837327 844065 849604 855517 863647 873813 884423 894370 903362 911239 918220 925280 933167
60137I33167Q161P420O803P281Q181Q115O588M228K212J679K780M050L794K210
$$ 933167 941328 948748 955551 962832 971013 979128 985716 989944 992156 993835 996615 1000665 1004459 1006669
60123A006669J047Q55j1k999p154j0149j0613q927o536n061n253o261o626o175
$$ 1006669 1007716 1008571 1008560 1005561 998407 988258 977645 968718 962182 957121 951868 945607 938981 932806
60109I32806n951o215o009n187n168o611p815o860m248k020j004l34P90K114K836
$$ 932806 926855 920640 914631 909444 904276 897665 889850 882990 878742 876722 875718 875384 876174 878288 881124
60094H81124K258L07j858k488j246J60K30m06l50K34J57n91p96N6J258K142K620
$$ 881124 883382 883689 881831 879343 878097 878257 878487 878081 877731 877965 878122 877531 876735 876791 878049 880191 882811
60077H82811K599K142K148L520N584O597O048N237N315N903O171O246O815P907
$$ 882811 885410 887552 889700 893220 898804 905401 911449 916686 922001 927904 934075 940321 947136 955043
60063I55043Q692Q326O720M726L559L725M569N128N123M688L683K167J208J929
$$ 955043 963735 972061 978781 983507 987066 990791 995360 1000488 1005611 1010299 1013982 1016149 1017357 1019286
60049A019286L724M443K908L23j249j245q59j384k779l751l143j304L9l74j882
$$ 1019286 1023010 1027453 1030361 1030684 1029435 1028190 1027331 1025947 1023168 1019417 1016274 1014970 1015009 1014635 1012753
60034A012753k920l188l900n715p441p346n215k590j258j848l557m872m791l700
$$ 1012753 1009833 1006645 1002745 997030 989589 982243 977028 974438 973180 971332 967775 962903 958112 954412
60020I54412k892l157m028m518m267l759l645m032m368l979k953k303k935m526
$$ 954412 951520 948363 944335 939817 935550 931791 928146 924114 919746 915767 912814 910511 907576 903050
60006I03050n892o420o597o984p391p413p248p402p809p906p485o960o660o295
$$ 903050 897158 890738 884141 877157 869766 862353 855105 847703 839894 831988 824503 817543 810883 804588
59992H04588n442m266l376k953k356r12J061K431K580K224K518L501L958L059
$$ 804588 799146 794880 791504 788551 786195 785283 786344 788775 791355 793579 796097 799598 803556 806615
59978H06615J694J587L154M840N008L980L461M124M683L802K117J486K535L785
$$ 806615 808309 809896 813050 817890 822898 826878 830339 834463 839146 842948 845065 846551 849086 852871
59964H52871L243L28l763p044q139p354o458o902q284r037q524p658p462p855
$$ 852871 856114 856442 852679 845635 837496 830142 823684 816782 808498 799461 790937 783279 775817 767962
59950G67962q121p897p391p121p535q298q117o230l986l618n115n818l889p96
$$ 767962 759841 751944 744553 737432 729897 721599 713482 707252 703266 699648 694533 688715 684826 684030
59936F84030P85M15k45j98j02o54j426j579q40M46J634K152K071K095K565K735
$$ 684030 684815 685230 684985 684787 684685 684031 682605 681026 680186 680632 682266 684418 686489 688584 691149 693884
59920F93884J746k1j208j014R3J067J175N18J2N09J639K047J276N39R19J572Q33
$$ 693884 695630 695609 694401 693387 693480 694547 695722 696240 696252 696761 698400 700447 701723 702262 703181 704753 705586
59903G05586j486l955n259n097l721j764k76P6k48m86o57r01n93O28J477M59j605
$$ 705586 704100 700145 694886 689789 686068 684304 684028 684104 683856 683370 682713 681812 681219 681847 683324 683783 682178
59886F82178k259p75R21J079K16j74M42J712L150M049L685K434J665J876J847
$$ 682178 679919 679144 680065 681144 681360 681186 681628 683340 686490 690539 694224 696658 698323 700199 702046
59871G02046N11j234j593j20K062L774M657M815M514M329M898O227P319O847M458
$$ 702046 702557 701323 699730 699610 701672 705446 710103 714918 719432 723761 728659 734886 742205 749052 753510
59856G53510J524N5N64J498J379O52M89N13m85j941j607J203M288N333M555L522
$$ 753510 755034 755089 755653 757151 758530 759182 759671 760184 759699 757758 756151 757354 761642 766975 771530 775052
59840G75052K713J604K73m98m03K23J160K409L777N052O292P441Q061Q040Q039
$$ 775052 777765 779369 779642 779144 778741 778964 780124 782533 786310 791362 797654 805095 813156 821196 829235
59825H29235Q622R347R333Q390P025N879N627O765Q672R514Q112N586M076M077
$$ 829235 837857 847204 856537 864927 871952 877831 883458 890223 898895 908409 916521 922107 926183 930260
59811I30260M004K535L59p83j54J261J806O79j404k813k346j23K556M161L988
$$ 930260 934264 936799 937158 936375 936221 937482 939288 939967 938563 935750 933404 933281 935837 939998 943986
59796I43986K731J946K542L958N277O604Q339R487Q295M971K020J044P64n04j841
$$ 943986 946717 948663 951205 955163 960440 967044 975383 984870 993165 998136 1000156 1001200 1001964 1001460 999619
59781I99619j224Q65J642j07k552l756m321n889q277r624q918p156n882n444n081
$$ 999619 998395 999260 1000902 1000795 998243 994487 990166 984277 976000 966376 957458 950302 944420 938976 933895
59766I33895m286l525l537m162m288l168j612j393l212n529n886l716j415k004
$$ 933895 929609 926084 922547 918385 914097 910929 909317 907924 904712 899183 893297 889581 888166 886162
59752H86162n687r444j0447r015p385o448n265l521k433k676l112k652j997k280
$$ 886162 880475 871031 860584 851569 844184 837736 832471 828950 826517 823841 820729 818077 816080 813800
59738H13800l080l262k937k987l191k602j504j293k226k979k755k296k213j795
$$ 813800 810720 807458 804521 801534 798343 795741 794237 792944 790718 787739 784984 782688 780475 778680
59724G78680l68J284J976J814J668J558O64j118k647k718j297M93J325P30l84
$$ 778680 778312 779596 781572 783386 785054 786612 787276 786158 783511 780793 779496 779989 781314 782044 781660
59709G81660m92Q91K566L061K404J858K174K949L762M813N952O023M162J375k77
$$ 781660 781168 782059 784625 787686 790090 791948 794122 797071 800833 805646 811598 817621 821783 823158 822881
59694H22881J4J293K613M127N987P289P247O609O712P417P329O026M830M917N876
$$ 822881 822895 824188 826801 830928 836915 844204 851451 858060 864772 872189 879518 885544 890374 895291 901167
59679I01167O729P341P882P660N720K516j6l13J394L532M597M041K298L25r28
$$ 901167 907896 915237 923119 930779 936499 939015 938999 938686 940080 943612 948209 952250 954548 954873 953945
59664I53945r27K37J810K656J999J42j794k946l281l183k832k230j535j174j708
$$ 953945 953018 953255 955065 957721 959720 959862 958068 955122 951841 948658 945826 943596 942061 940887 939179
59649I39179l389n464o253m701j961m05r10j984j984j047j80M90J453K510L016
$$ 939179 935790 930326 924073 919372 917411 917006 916096 914112 912128 911081 910901 911391 912844 915354 918370
59634I18370L073L368L918M042L488K737K149J658J293J202J091L61r75k137k472
$$ 918370 921443 924811 928729 932771 936259 938996 941145 942803 944096 945298 946389 946750 945775 943638 941166
59619I41166k065j481j340j997l131l821l618l289l828n007n757n696n329m933
$$ 941166 939101 937620 936280 934283 931152 927331 923713 920424 916596 911589 905832 900136 894807 889874
59605H89874m410m169m741n385m473j837O35J356Q17K32k21o77l53J313L064L039
$$ 889874 885464 881295 876554 871169 866696 864859 865494 866850 867667 867899 867678 867001 866648 867961 871025 874064
59589H74064J376M5K19J166J815J877J211m21k294k825j568j14m2r50j543j771
$$ 874064 875440 875485 875704 876870 878685 880562 881773 881352 879058 876233 874665 874551 874509 873559 872016 870245
59573H70245k454l319l166k011j495k576l999l956k416r02m27o13q47j427l095
$$ 870245 867791 864472 861306 859295 857800 855224 851225 847269 844853 843951 843524 842911 842064 840637 837542
59558H37542n582p203o388l731j886k750n152o274n108l253k238j645o25K43m2
$$ 837542 831960 824757 818369 814638 812752 810002 804850 798576 793468 790215 787977 786332 785707 785950 785908
59543G85908j030j416r71l77L02J521K763K805J591M61K37M18N51R95J785J991
$$ 785908 784878 783462 782491 782114 782416 783937 786700 789505 791096 791557 791794 792212 792763 793758 795543 797534
59527G97534R97n03j383j259m18N29O34o84k462k868j639o54j310k565k558j148
$$ 797534 798531 798028 796645 795386 794968 795497 796131 795447 792985 790117 788478 787824 786514 783949 781391 780243
59511G80243L06Q64N46l53j358j735j284p66p48o63R9R63J029N29K83L26J68j48
$$ 780243 780549 781413 781959 781606 780248 778513 777229 776463 775715 775052 775151 776114 777143 777672 777955 778281 778449 778301
59493G78301k97m25n07K49K124L765L846L262L966O088P992Q831R158R213Q707
$$ 778301 778004 777579 777072 777321 779445 783210 787056 790318 794284 800372 808364 817195 826353 835566 844273
59478H44273Q506J0298J3949J6968J7340J5328J1909P446K859J34RM21r86l697
$$ 844273 852779 863077 877026 893994 911334 926662 938571 946017 948876 949010 949019 949440 948454 944757
59464I44757n199m390k589j383j020r64q73o24j51L77N40k7j316k848l844l917
$$ 944757 939558 935168 932579 931196 930176 929212 928339 927715 927564 927941 928481 928454 927138 924290 920446 916529
59448I16529l607l821m580n084n104n468o631p569o917m733k432j273j508k648
$$ 916529 912922 909101 904521 899437 894333 888865 882234 874665 867748 863015 860583 859310 857802 855154
59434H55154l884m513m427m097l712k800j196J30l1j544k910k845j383N88K274
$$ 855154 851270 846757 842330 838233 834521 831721 830525 830655 830624 829080 826170 823325 821942 822530 824804
59419H24804L373L909M070M276N182P201R613J0616R059O067M080M055M559M026
$$ 824804 828177 832086 836156 840432 845614 852815 862428 873044 882103 888170 892250 896305 900864 904890
59405I04890K817K213K317K204J654J425J878K427K590K589K705K797K844L305
$$ 904890 907707 909920 912237 914441 916095 917520 919398 921825 924415 927004 929709 932506 935350 938655
59391I38655M472N933O997P384P198O642O065N972O544P284P447O739N335L372
$$ 938655 943127 949060 956057 963441 970639 977281 983346 989318 995862 1003146 1010593 1017332 1022667 1026039
59377A026039P84k187m636n458m360k328r76j203k483l571l772l355k742j858
$$ 1026039 1026823 1024636 1020000 1014542 1010182 1007854 1006878 1005675 1003192 999621 995849 992494 989752 987894
59363I87894n12J003K410M340P808J2483J6349J7818J7692J8263K0794K4769K9182
$$ 987894 987382 988385 990795 995135 1002943 1015426 1031775 1049593 1067285 1085548 1106342 1131111 1160293
59350A160293L3225L5528L4143K8211J9055R141M95n660q851r658r104o938j617
$$ 1160293 1193518 1229046 1263189 1291400 1310455 1319596 1320091 1314431 1305580 1295922 1286818 1279880 1278263
59337A278263O703J4051J5354R266r49j1031j8755k3557k5226k4112k1561j9045
$$ 1278263 1284966 1299017 1314371 1323637 1322688 1311657 1292902 1269345 1244119 1220007 1198446 1179401
59325A179401j7092j5446j3830j2164j0466q802p135n278l330j870j216q77m91
$$ 1179401 1162309 1146863 1133033 1120869 1110403 1101601 1094466 1089188 1085858 1083988 1082772 1081895 1081404
59312A081404p30k116l413k785m62J439J967K275L039L069J720P48J885L792L647
$$ 1081404 1080674 1078558 1075145 1072360 1071898 1073337 1075304 1077579 1080618 1083687 1085407 1086155 1088040 1091832 1095479
59297A095479J232o89p2K063L477L527L356M129N877P801R176R970J0736J1929
$$ 1095479 1096711 1096022 1095950 1098013 1101490 1105017 1108373 1112502 1118379 1126180 1135356 1145326 1156062 1167991
59283A167991J3380J4509J4886J4495J3663J2809J2148J1528J0758R909Q921P252
$$ 1167991 1181371 1195880 1210766 1225261 1238924 1251733 1263881 1275409 1286167 1296076 1304997 1312249
59271A312249M616J940N40K57m73k399m594o317q350j1245j3437j2873j0112q156
$$ 1312249 1316865 1318805 1319345 1319602 1319129 1316730 1312136 1305819 1297469 1286224 1272787 1259914 1249802 1241646
59257A241646q877j0921j1613j0021p550o118o402p686q807q993p971n717k465
$$ 1241646 1232769 1221848 1210235 1200214 1192664 1186546 1180144 1172458 1163651 1154658 1146687 1140970 1138505
59244A138505J180M583P498R635R957P247J657m932j0498j4329j6741j8115j8705
$$ 1138505 1139685 1144268 1151766 1161401 1171358 1178605 1180262 1175330 1164832 1150503 1133762 1115647 1096942
59231A096942j8769j8376j7469j6283j5124j3631j1137q067n960n449n323m207
$$ 1096942 1078173 1059797 1042328 1026045 1010921 997290 986153 978086 972126 966677 961354 957147
59219I57147k293n42P92J842K272K026K360M630Q262J1121J1825J0932J0016J0328
$$ 957147 954854 954312 955104 956946 959218 961244 963604 968234 976496 987617 999442 1010374 1020390 1030718
59205A030718J2114J4457J5948J6024J5239J3871J1329P760N032M562M995L769
$$ 1030718 1042832 1057289 1073237 1089261 1104500 1118371 1129700 1137460 1142492 1147054 1152049 1155818
59193A155818N62k520l997m446m795m875m225l081k036j555j992l109l629k334
$$ 1155818 1156380 1153860 1149863 1145417 1140622 1135747 1131522 1128441 1126405 1124850 1122858 1119749 1116120 1113786
59179A113786L11K719M294N723P248Q130Q071P662P110O012M779M656N515N315
$$ 1113786 1114097 1116816 1121110 1126833 1134081 1142211 1150282 1157944 1165054 1171066 1175845 1180501 1186016 1191331
59165A191331K853k64j745j721k263m416p089q663q652p731o898o619o563o276
$$ 1191331 1194184 1193920 1192175 1190454 1188191 1183775 1176686 1168023 1159371 1151640 1144742 1138123 1131560 1125284
59151A125284o201p329r617j1562j1793j0375q097n460l020j691j711k003j581
$$ 1125284 1119083 1111754 1102137 1090575 1078782 1068407 1060310 1054850 1051830 1050139 1048428 1046425 1044844
59138A044844r48j089j718j802j360j333j814j758o48P71J720K317K851L058K748
$$ 1044844 1043896 1042807 1041089 1039287 1037927 1036594 1034780 1033022 1032374 1033145 1034865 1037182 1040033 1043091 1045839
59123A045839K570L473N590P944R132Q297N916L737L411M946O838P820P956P704
$$ 1045839 1048409 1051882 1057472 1065416 1074548 1082845 1088761 1092498 1095909 1100855 1107693 1115513 1123469 1131173
59109A131173O804M819K383R40J110K031K575K643K787K987K536J161l43j055
$$ 1131173 1137977 1142796 1145179 1146119 1147229 1149260 1151835 1154478 1157265 1160252 1162788 1163949 1163606 1162551
59095A162551j179j875l806o243p888q345q424r027j0107j0912j1002j0638j0262
$$ 1162551 1161372 1159497 1155691 1149448 1141560 1133215 1124791 1115764 1105657 1094745 1083743 1073105 1062843
59082A062843j0045j0064j0407j0753j0308q758p047o472p010p342o649n505m622
$$ 1062843 1052798 1042734 1032327 1021574 1011266 1002508 995461 988989 981979 974637 967988 962483 957861
59069I57861l611j761M95J863J737P42m6J55J673M061O021O497O016O233P899
$$ 957861 954250 952489 952984 954847 956584 957326 957280 957435 959108 963169 969190 975687 981703 987936 995835
59054I95835J0002J1174J1278J1020J0698J0053R173Q774R388J0654J1569J1332
$$ 995835 1005837 1017011 1028289 1039309 1050007 1060060 1069233 1078007 1087395 1098049 1109618 1120950
59042A120950R862P738N776M662M617N139N116L663J097j174k046j721j105o39
$$ 1120950 1130812 1138550 1144326 1148988 1153605 1158744 1163860 1167523 1168620 1167446 1165400 1163679 1162574 1161935
59028A161935k67k66j189k772l756l294k164j964l225m880n654n540n570o442
$$ 1161935 1161668 1161402 1160213 1157441 1153685 1150391 1148227 1146263 1143038 1138158 1132504 1126964 1121394 1114952
59014A114952p859r200j0261j1041j1314j0918j0140r219p810n747m011l834m811
$$ 1114952 1107093 1097893 1087632 1076591 1065277 1054359 1044219 1035000 1027190 1021443 1017432 1013598 1008787
59001A008787n172m278l514m078n123n100l925k549j305m8O78J69j073j890k159
$$ 1008787 1003615 999337 995823 991745 986622 981522 977597 975048 973743 973695 974373 974542 973469 971579 969420
58986I69420k529k681j551N85J950J690R56R59J299J226J302K530M530N827N762
$$ 969420 966891 964210 962659 963244 965194 966884 967840 968799 970098 971324 972626 975156 979686 985513 991275
58971I91275N159N123N909P029P960Q577R043R398R379Q887Q540R253J1151J3324
$$ 991275 996434 1001557 1007466 1014495 1022455 1031032 1040075 1049473 1058852 1067739 1076279 1085532 1096683 1110007
58957A110007J4821J5494J5645J5243J3904J1620R207P744P362O829M899K129
$$ 1110007 1124828 1140322 1155967 1171210 1185114 1196734 1205941 1213685 1221047 1227876 1232775 1234904
58945A234904N64J205K693L233K938L169M225N083N202N136N328N556N745O249
$$ 1234904 1235468 1236673 1239366 1242599 1245537 1248706 1252931 1258014 1263216 1268352 1273680 1279236 1284981 1291230
58931A291230P025P490P396P123P032P274P996Q890Q900P617O407O752P868P837
$$ 1291230 1298255 1305745 1313141 1320264 1327296 1334570 1342566 1351456 1360356 1367973 1374380 1381132 1389000 1396837
58917A396837O850P065R100J1084J1908J2945J5349J7865J8903J8946J9162J9258
$$ 1396837 1403687 1410752 1419852 1430936 1442844 1455789 1471138 1489003 1507906 1526852 1546014 1565272
58905A565272J8593J8025J8685J9877K0095J9298J8371J7204J5240J3322J2969
$$ 1565272 1583865 1601890 1620575 1640452 1660547 1679845 1698216 1715420 1730660 1743982 1756951
58894A756951J3975J4417J2990R955O174K647N72K45K02j025k620k662j313q21
$$ 1756951 1770926 1785343 1798333 1808288 1814462 1817109 1817681 1817926 1818128 1817103 1814483 1811821 1810508 1809687
58880A809687k316m485n770o118o010n489m901n226o773q683j0259j1711j3027
$$ 1809687 1807371 1802886 1797116 1790998 1784988 1779499 1774598 1769372 1762599 1753916 1743657 1731946 1718919
58867A718919j3424j2660j1832j1887j2297j2071j1288j0699j0444j0079r477
$$ 1718919 1705495 1692835 1681003 1669116 1656819 1644748 1633460 1622761 1612317 1602238 1592761
58856A592761q821q054p020n894m880l760k309r33k94k59K57K202N284Q126R678
$$ 1592761 1583940 1575886 1568866 1562972 1558092 1554332 1552023 1551090 1550796 1550537 1550794 1552996 1558280 1566406 1576084
58841A576084J0380J1671J4152J6713J7957J7906J7576J7243J6252J4441J2554
$$ 1576084 1586464 1598135 1612287 1629000 1646957 1664863 1682439 1699682 1715934 1730375 1742929
58830A742929J0979R254P340O301O968Q613R780R881R322Q403O897M571J695r57
$$ 1742929 1753908 1763162 1770502 1776803 1783771 1792384 1802164 1812045 1821367 1829770 1836667 1841238 1842933 1841976
58816A841976k595l318m566p781j2291j5418j5473j3976j3933j6378j9564k1277
$$ 1841976 1839381 1836063 1831497 1823716 1811425 1796007 1780534 1766558 1752625 1736247 1716683 1695406
58804A695406k0901j9249j7436j6290j6080j6345j6359j5970j5690j5843j6077
$$ 1695406 1674505 1655256 1637820 1621530 1605450 1589105 1572746 1556776 1541086 1525243 1509166
58793A509166j5905j5317j4684j4405j4763j5683j6476j6295j5190j4189j3868
$$ 1509166 1493261 1477944 1463260 1448855 1434092 1418409 1401933 1385638 1370448 1356259 1342391
58782A342391j3357j1523q961p784r223j2033j3763j3162j0960q735p578p672
$$ 1342391 1329034 1317511 1308550 1300766 1291543 1279510 1265747 1252585 1241625 1232890 1225312 1217640
58770A217640q431q879q411p326o364n729m966l887l018k826k969k812k355j987
$$ 1217640 1209209 1200330 1191919 1184593 1178229 1172500 1167534 1163647 1160629 1157803 1154834 1152022 1149667 1147680
58756A147680j515k38J783L328L372K487K117K678L114K426Q75p76k394m094n267
$$ 1147680 1146165 1145927 1147710 1151038 1154410 1156897 1159014 1161692 1164806 1167232 1168107 1167331 1164937 1160843 1155576
58741A155576n104m078l707m558n547n674n514o100p253q044q262q248p824o717
$$ 1155576 1150472 1146394 1142687 1138129 1132582 1126908 1121394 1115294 1108041 1099997 1091735 1083487 1075663 1068946
58727A068946n746o035p043o877m995k990k085j291P73L374M512L644K216J603
$$ 1068946 1063200 1057165 1050122 1043245 1038250 1035260 1033175 1031884 1032657 1036031 1040543 1044187 1046403 1048006
58713A048006J724J823J538Q18m37k183l951n231n962o410o617o303n417m491
$$ 1048006 1049730 1051553 1053091 1053909 1053472 1051289 1047338 1042107 1036145 1029735 1023118 1016815 1011398 1006907
58699A006907m017l645k631j200o30j510k754l145l004l129k934j228J427L062
$$ 1006907 1002890 999245 996614 995414 994784 993274 990520 987375 984371 981242 978308 977080 978507 981569
58685I81569L081K818L020K748J555Q81J985M055N679O779P703P738O365N034
$$ 981569 984650 987468 990488 993236 994791 995672 997657 1001712 1007391 1014170 1021873 1029611 1035976 1041010
58671A041010N673P822R079Q236O523N742O396P656Q178P104N095M056M975O547
$$ 1041010 1046683 1054505 1063584 1071820 1078343 1084085 1090481 1098137 1106315 1113419 1118514 1122570 1127545 1134092
58657A134092O966O390O287O985P407P021O426O099O033O513P794Q817P903M954
$$ 1134092 1141058 1147448 1153735 1160720 1168127 1175148 1181574 1187673 1193706 1200219 1208013 1216830 1224733 1229687
58643A229687J666p48k728m902o900q326r766j2057j5169j8308k0516k0997j9672
$$ 1229687 1231353 1230605 1227877 1222975 1216075 1207749 1197983 1185926 1170757 1152449 1131933 1110936 1091264
58630A091264j7634j6348j6055j5733j4602j2840j0795q570o688o019o592p317
$$ 1091264 1073630 1057282 1041227 1025494 1010892 998052 987257 978687 971999 965980 959388 952071
58618I52071p428p344p668p985p264n110k277j20N06J44J69R75J329L98m04R10
$$ 952071 944643 937299 929631 921646 914382 909272 906995 906875 907381 907525 907694 908669 909998 910396 909992 910902
58602I10902L869N959N993N255N037M885L993K608J176n14k373l489l562l685
$$ 910902 914771 920730 926723 931978 937015 941900 945893 948501 949677 949163 946790 943301 939739 936054
58588I36054m646n525n090l731k853k981l586m169m544m486l993l534l331k897
$$ 936054 931408 925883 920793 917062 914209 911228 907642 903473 898929 894443 890450 886916 883585 880688
58574H80688j877q03l12j89J39P70J582K526L074K226L8j728j594l11L47L9k47
$$ 880688 878811 878008 877696 877507 877646 878416 879998 882524 885598 887824 887862 886134 884540 884229 884576 884615 884368
58557H84368j69k52k98O90K695M247M417M144M771O147O976O574N417M205L201
$$ 884368 884199 883947 883649 884339 887034 891281 895698 899842 904613 910760 917736 924310 929727 933932 937133
58542I37133K505K389K990L876M224L441J703n4p11J61J768K608J900M57k11L36
$$ 937133 939638 942027 945017 948893 953117 956558 958261 958207 957496 957657 959425 962033 963933 964390 964179 964515
58526I64515J207J715K440M198O707R001J0615J1570J1651J0716R505R090R636
$$ 964515 965722 967437 969877 974075 980782 989783 1000398 1011968 1023619 1034335 1043840 1052930 1062566
58513A062566J0494J1243J1703J1311R846Q585R204J1466J3521J4737J6491J9542
$$ 1062566 1073060 1084303 1096006 1107317 1117163 1125748 1134952 1146418 1159939 1174676 1191167 1210709
58501A210709K2481K3954K4883K6895K9520L0609K9162K6384K3928K2201K0454
$$ 1210709 1233190 1257144 1282027 1308922 1338442 1369051 1398213 1424597 1448525 1470726 1491180
58490A491180J7870J4456J1097Q571O396L334p69m407o203o514o611p047p650
$$ 1491180 1509050 1523506 1534603 1543174 1549570 1552904 1552135 1547728 1541525 1535011 1528400 1521353 1513703
58477A513703q623j0688j4245j8888k3480k6473k6784k4851k2347k0389j8720
$$ 1513703 1505080 1494392 1480147 1461259 1437779 1411306 1384522 1359671 1337324 1316935 1298215
58466A298215j6920j5422j4572j3667j1978j0114r237r383r557r152q376p528
$$ 1298215 1281295 1265873 1251301 1237634 1225656 1215542 1206305 1196922 1187365 1178213 1169837 1162309
58454A162309o735o233o060n739m948m291m525n317n481m423k637j037l30q16
$$ 1162309 1155574 1149341 1143281 1137542 1132594 1128303 1123778 1118461 1112980 1108557 1105920 1104883 1104553 1103737
58440A103737k033k849k520j483n15L95J572K522K449J730J629K435L077K952
$$ 1103737 1101704 1098855 1096335 1094852 1094337 1094732 1096304 1098826 1101275 1103005 1104634 1107069 1110146 1113098
58426A113098L080M668P253R213R790R741R999J0573J1046J1560J2543J3758J4485
$$ 1113098 1116178 1120846 1128099 1137312 1147102 1156843 1166842 1177415 1188461 1200021 1212564 1226322 1240807
58413A240807J4692J5125J5841J5558J3350J0257Q044O802N133K510Oj522k473
$$ 1240807 1255499 1270624 1286465 1302023 1315373 1325630 1333674 1340476 1345609 1348119 1348125 1346603 1344130
58400A344130l166k839r78J353K579K608K757M020N931P149O827N525M748N227
$$ 1344130 1340964 1338125 1337147 1338500 1341079 1343687 1346444 1350464 1356395 1363544 1370371 1375896 1380644 1385871
58386A385871N960N528L933K132J90k553n555p201p313p694r327j0656r880p478
$$ 1385871 1391831 1397359 1401292 1403424 1403614 1401061 1395506 1388305 1380992 1373298 1363971 1353315 1343435 1335957
58372A335957n241l886k985k168j101P85L300N027N125M744N363O566O946O482
$$ 1335957 1330716 1326830 1323845 1321677 1320576 1321361 1324661 1329688 1334813 1339557 1344920 1351486 1358432 1364914
58358A364914O365O874P072O498N691N001M006K301m0k810n689p909q643p759
$$ 1364914 1371279 1378153 1385225 1391723 1397414 1402415 1406421 1408722 1408682 1405872 1400183 1392274 1383631 1375872
58344A375872n834l635j891j102j123j355j575j952k088j139P28K181K646L073
$$ 1375872 1370038 1366403 1364512 1363410 1362287 1360932 1359357 1357405 1355317 1354178 1354906 1357087 1359733 1362806
58330A362806M047M655M246L865M474N127M618L794M308N791O202M726K758K129
$$ 1362806 1366853 1371508 1375754 1379619 1384093 1389220 1393838 1397632 1401940 1407731 1413933 1418659 1421417 1423546
58316A423546L552O428R074R656Q074O370O278P134P419P251P752Q880R701J0168
$$ 1423546 1427098 1433526 1442600 1452256 1460330 1466700 1472978 1480112 1487531 1494782 1502534 1511414 1521115 1531283
58302A531283J0948J1896J2484J3216J4893J6871J7764J7586J7492J7694J7346
$$ 1531283 1542231 1554127 1566611 1579827 1594720 1611591 1629355 1646941 1664433 1682127 1699473
58291A699473J6260J5070J3836J2088J0147Q931Q555Q507Q898J0060J1318J1701
$$ 1699473 1715733 1730803 1744639 1756727 1766874 1775805 1784360 1792867 1801765 1811825 1823143 1834844
58279A834844J1514J1728J2203J2181J2050J2873J4541J6170J7868K0142K2012
$$ 1834844 1846358 1858086 1870289 1882470 1894520 1907393 1921934 1938104 1955972 1976114 1998126
58268A998126K1987K0781K0753K2454K3852K3411K1867K0515J9626J9204J9567
$$ 1998126 2020113 2040894 2061647 2084101 2107953 2131364 2153231 2173746 2193372 2212576 2232143
58257B232143K0427K0775K0308J9882K0147K0800K1462K2173K2851K3199K3294
$$ 2232143 2252570 2273345 2293653 2313535 2333682 2354482 2375944 2398117 2420968 2444167 2467461
58246B467461K3539K4183K5523K7906L0711L2280L2112L2000L3588L5960L7405
$$ 2467461 2491000 2515183 2540706 2568612 2599323 2631603 2663715 2695715 2729303 2765263 2802668
58235B802668L8233L9633M0966M0957M0708M2625M6610N0076N1726N2672N3878
$$ 2802668 2840901 2880534 2921500 2962457 3003165 3045790 3092400 3142476 3194202 3246874 3300752
58224C300752N5088N6452N8655O1129O2421O2635O3440O5466O7713O9566P1378
$$ 3300752 3355840 3412292 3470947 3532076 3594497 3657132 3720572 3786038 3853751 3923317 3994695
58213C994695P3204P4962P7559Q1813Q6634R0418R3558R7348J01359J04673J08643
$$ 3994695 4067899 4142861 4220420 4302233 4388867 4479285 4572843 4670191 4771550 4876223 4984866
58202D984866J15203J23156J29637J34637J40493J47375J53270J58233J64523
$$ 4984866 5100069 5223225 5352862 5487499 5627992 5775367 5928637 6086870 6251393
58193F251393J72273J79044J84214J89925J97206K05034K13664K24960K38683
$$ 6251393 6423666 6602710 6786924 6976849 7174055 7379089 7592753 7817713 8056396
58184H056396K52457K66137K82362L02122L23629L46221L71182L98002M24090
$$ 8056396 8308853 8574990 8857352 9159474 9483103 9829324 10200506 10598508 11022598
58175A1022598M49089M75357N03462N31561N59979N91924O28702O68735P11895
$$ 11022598 11471687 11947044 12450506 12982067 13542046 14133970 14762672 15431407 16143302
58166A6143302P60060Q12763Q67624R25861R92022J067243J148306J233975J326189
$$ 16143302 16903362 17716125 18583749 19509610 20501632 21568875 22717181 23951156 25277345
58157B5277345J424197J524398J627582J739841J864874K001973K152497K320663
$$ 25277345 26701542 28225940 29853522 31593363 33458237 35460210 37612707 39933370
58149C9933370K506612K706858K923224L163212L430829L726922M059969M445999
$$ 39933370 42439982 45146840 48070064 51233276 54664105 58391027 62450996 66896995
58141F6896995M896642N419237O030021O753880P610517Q617731R809650J1229879
$$ 66896995 71793637 77212874 83242895 89996775 97607292 106225023 116034673 127264552
58133A27264552J2899061J4805216J6925880J9241157K1744784K4487293K7548277
$$ 127264552 140163613 154968829 171894709 191135866 212880650 237367943 264916220
58126B64916220L0751940L3236170L3413011K9719527K1748874J0774985q54891
$$ 264916220 295668160 328904330 362317341 392036868 413785742 424560727 423705836
58119D23705836j0937933j8269079k2693371k4678172k4901474k4032800k2628712
$$ 423705836 412767903 394498824 371805453 347127281 322225807 298193007 275564295
58112B75564295k1077143j9593900j8261077j7074488j5987356j4949451j3928341
$$ 275564295 254487152 234893252 216632175 199557687 183570331 168620880 154692539
58105A54692539j2907196j1878411j0847655r836813q874207p982323p174451
$$ 154692539 141785343 129906932 119059277 109222464 100348257 92365934 85191483
58098H5191483o455000n817967n250193m741015m287019l886970l537232l233800
$$ 85191483 78736483 72918516 67668323 62927308 58640289 54753319 51216087 47982287
58090D7982287k973297k748905k549437k365243k192459k030386j878711j738724
$$ 47982287 45008990 42260085 39710648 37345405 35152946 33122560 31243849 29505125
58082B9505125j612965j501161j399239j303888j215394j134702j060763r92226
$$ 29505125 27892160 26390999 24991760 23687872 22472478 21337776 20277013 19284787
58074A9284787r29273q72357q21062p74863p33152o94324o56794o20805n87198
$$ 19284787 18355514 17483157 16662095 15887232 15154080 14459756 13802962 13182157 12594959
58065A2594959n55159n23763m94733m70381m49428m28274m06018l84681l64897
$$ 12594959 12039800 11516037 11021304 10550923 10101495 9673221 9267203 8882522 8517625
58056H517625l45280l26042l09149k94474k79660k64474k51534k41796k32958
$$ 8517625 8172345 7846303 7537154 7242680 6963020 6698546 6447012 6205216 5972258
58047E972258k23391k14261k06560j99272j91921j85933j81938j78280j73506
$$ 5972258 5748867 5534606 5328046 5128774 4936853 4750920 4568982 4390702 4217196
58038D217196j68054j62578j56824j50943j45489j39558j31421j21715j13316
$$ 4217196 4049142 3886564 3729740 3578797 3433308 3293750 3162329 3040614 2927298
58029B927298j07368j02037r5856q9434q3197p6444o9685o4800o1682n7700n1970
$$ 2927298 2819930 2717893 2622037 2532603 2449406 2372962 2303277 2238477 2176795 2119095 2067125
58018B067125m7106m5037m4022m1859l9436l8656l8941l8266l6312l4404l3377
$$ 2067125 2020019 1974982 1930960 1889101 1849665 1811009 1772068 1733802 1697490 1663086 1629709
58007A629709l3082l3055l2497l0715k8549k7925k9095k9891k8583k5823k2913
$$ 1629709 1596627 1563572 1531075 1500360 1471811 1443886 1414791 1384900 1356317 1330494 1307581
57996A307581k0060j7428j6007j6079j6552j6902j8020k0004k1102k0224j8621
$$ 1307581 1287521 1270093 1254086 1238007 1221455 1204553 1186533 1166529 1145427 1125203 1106582
57985A106582j7568j6354j4221j2408j2347j3351j3979j4214j4542j4313j2990
$$ 1106582 1089014 1072660 1058439 1046031 1033684 1020333 1006354 992140 977598 963285 950295
57974I50295j1759j1883j2523j2200j1304j1159j1537j1253j0519j0587j1414
$$ 950295 938536 926653 914130 901930 890626 879467 867930 856677 846158 835571 824157
57963H24157j1707j1140j0725j0921j1020j0525r866r459r074q313p137o008n842
$$ 824157 812450 801310 790585 779664 768644 758119 748253 738794 729720 721407 714270 708262 702420
57950G02420p278r459j0241q498n547l586l359m094m880n068m163k408j069j106
$$ 702420 695142 685683 675442 666944 661397 657811 654452 650358 645478 640410 636247 633839 632770 631664
57936F31664k082l068l942m937n673n667n129m370l168j617p89j305k067j661
$$ 631664 629582 626514 622572 617635 611962 606295 601166 596796 593628 592011 591222 589917 587850 586189
57922E86189n23k84j365k584l008l044l500m512n487n694m841l370j979q59L3
$$ 586189 585666 585382 584017 581433 578425 575381 571881 567369 561882 556188 551347 547977 545998 545139 545172
57907E45172P0j480l787m775l779k468k236k248j287m5R0o15r72j074j862l022
$$ 545172 545242 543762 539975 535200 531421 528953 526717 524469 523182 523137 523227 522612 521640 520566 518704 515682
57891E15682l231k145p16L30Q68O44m10j416j481r95p44l34Q72J969J604M46M53
$$ 515682 512451 510306 509590 509920 510788 511432 511022 509606 508125 507130 506386 506052 506924 508893 510497 510943 511396
57874E11396J757K556K161J890K460K817K397K308L031K967Q47j951l274l187
$$ 511396 513153 515709 517870 519760 522220 525037 527434 529742 532773 535740 536587 534636 531362 528175
57860E28175l293l945m042l405l453n125p377q290p015m370k022j235j979l013
$$ 528175 524882 520937 516895 513490 510037 504912 497535 489245 482230 477860 475838 474603 472624 469611
57846D69611l186k618k282k428k060l05K077L181K092N6q72j05J124J556J249
$$ 469611 466425 463807 461525 459097 457037 456732 458809 461990 464082 464138 463266 463161 464285 465841 467090
57831D67090R19Q23R03J410K438L245K967J833P84M6q55j668j241P98L110M091
$$ 467090 468009 468832 469735 471145 473583 476828 479795 481628 482412 482458 481603 479935 478694 479492 482602 486693
57815D86693L599K518J190q22l526n831o473n307l502k410k323k467k151j642
$$ 486693 490292 492810 494000 493178 489652 483821 477348 472041 468539 466129 463806 461339 459188 457546
57801D57546j640k229k819k906k350j088P44K304K570J743J499L133N880P668
$$ 457546 455906 453677 450858 447952 445602 444514 445258 447562 450132 451875 453374 456507 462387 470055
57787D70055P387N752L985K451R17m29j065j018r33r75l87J242K794K704J088
$$ 470055 477442 483194 487179 489630 490547 490118 489053 488035 487102 486127 485740 486982 489776 492480 493568
57772D93568k70m06m88j923m053m904l871k375j835k026j809o75R87K475L080
$$ 493568 493298 492892 492404 490481 486428 481524 477653 475278 473443 471417 469608 468933 469920 472395 475475
57757D75475K240P2k326l720l953m011m741n808o133n250l928l388m105n503o604
$$ 475475 477715 477787 475461 471741 467788 463777 459036 453228 447095 441845 437917 434529 430424 424921 418317
57742D18317o811o211n431n108n297n447n109m423l618k521j082l0q3o84n25O50
$$ 418317 411506 405295 399864 394756 389459 384012 378903 374480 370862 368341 367259 367229 367146 366462 365937 366587
57726C66587J756K079K047J971J436O23Q62K700M493M475L416L530N109O070M995
$$ 366587 368343 370422 372469 374440 375876 376499 377361 380061 384554 389029 392445 395975 401084 407154 412149
57711D12149L015K075K551L297L330K678J958J630J627J556J314J239J428J334
$$ 412149 415164 417239 419790 423087 426417 429095 431053 432683 434310 435866 437180 438419 439847 441181
57697D41181N68l20o38p10j245j847j361K24J397J043k49j206j366j050o15l02
$$ 441181 441749 441429 440791 440081 438836 436989 435628 435852 437249 438292 438043 436837 435471 434421 433806 433504
57681D33504k91m03k19K36L91J6l61l15k35o64j310j354o09P4k75j464j979l92
$$ 433504 433213 432810 432591 432827 433218 433234 432873 432558 432323 431659 430349 428995 428386 428460 428185 426721 424742 424350
57663D24350K839N401N433L459J444L96j56n96m44O29K053L047L274K683J503
$$ 424350 427189 432590 438023 441482 442926 443322 443166 442570 442126 442755 444808 447855 451129 453812 455315
57648D55315O19Q46J540J021j059k945l057j923j010p09o07q48j700k375j756
$$ 455315 455934 456780 458320 459341 458282 455337 452280 450357 449347 448638 448031 447183 445483 443108 441352
57633D41352k46M43n50k296l424l502k938k398k489l215l463j848J439M302M850
$$ 441352 441106 441549 440999 438703 435279 431777 428839 426441 423952 420737 417274 415426 416865 421167 426017
57618D26017L547K693L855O285Q069Q482Q775J0567J3986J7989K2104K6771L1675
$$ 426017 429564 432257 436112 442397 450466 458948 467723 478290 492276 510265 532369 559140 590815
57605E90815L4912L4680L1090K5322J7670P869k839j1663j6948j9781k2151k4309
$$ 590815 625727 660407 691497 716819 734489 742358 739519 727856 710908 691127 668976 644667
57593F44667k4999k3730k1680k0220j9397j8327j6542j4365j2167r871p461n581
$$ 644667 619668 595938 574258 554038 534641 516314 499772 485407 473240 463369 455908 450327
57581D50327n018n613o162n748m783m275m323l950k485n80M52J3j392k959m315
$$ 450327 445309 439696 433534 427786 423003 418728 414405 410455 407970 407390 407842 407855 406463 403504 399189
57566C99189n393n784m770k219P67K579K668J999J717J674Q80q08k109j748n2
$$ 399189 393796 388012 383242 381023 381790 384369 387037 389036 390753 392427 393307 392499 390390 388642 388590
57551C88590J254P58j368l695m839m411k898r40J083K790L554K945J411J33j43
$$ 388590 389844 390602 389234 385539 380700 376289 373391 372451 373534 376324 379878 382823 384234 384367 384224
57536C84224N4l83j608k425j665L21J988K275J498N29k81j018j479j180j23Q70
$$ 384224 384278 383895 382287 379862 378197 378518 380506 382781 384279 384808 384527 383509 382030 380850 380727 381597
57520C81597P53p47k666l343j938M30J615Q97j04M16J985K629J700O35P43J603
$$ 381597 382350 381603 378937 375594 373656 374086 375701 376598 376494 376910 378895 381524 383224 383859 384602 386205
57504C86205K145K144J898J381N58L3M34J478K289K409J960J158K82q2O42K432
$$ 386205 388350 390494 392392 393773 394331 394364 394798 396276 398565 400974 402934 404092 404374 404292 404934 407366
57488D07366M545N782M997K149r91k104q31Q09J063M68M74J210J886K511L564
$$ 407366 411911 417693 422690 424839 423848 421744 420913 421722 422785 423253 423727 424937 426823 429334 432898
57473D32898M540M480L714L439L657L242K166J885L024M273M302L491K932K901
$$ 432898 437438 441918 445632 449071 452728 455970 458136 460021 463045 467318 471620 475111 478043 480944
57459D80944L140L613M118M121L786M179N499O154M793K420J249J898L120L864
$$ 480944 484084 487697 491815 495936 499722 503901 509400 515554 520347 522767 524016 525914 529034 532898
57445E32898M235M361L724K100L66j25J292L977O107N841L122L18J53K735N329
$$ 532898 537133 541494 545218 547318 547684 547559 548851 552828 558935 564776 567898 568216 568369 571104 576433
57430E76433N331K998Q50R04K892M970N683N084M158L610L533L936M820N615N451
$$ 576433 581764 584762 585612 586516 589408 594378 600061 605145 609303 612913 616446 620382 625202 630817 636268
57415F36268M461M074N186O573O243M122K295K420L877M843M520L699L538M328
$$ 636268 640729 644803 649989 656562 662805 666927 669222 671642 675519 680362 684882 688581 692119 696447
57401F96447N430O225O885P951R080Q846O466L423K362M226P186Q701Q139O922
$$ 696447 701877 708102 714987 722938 732018 740864 747330 750753 753115 757341 764527 773228 781367 788289
57387G88289O558P139P656P459P001P144P974Q753Q957Q707Q073O866N662N857
$$ 788289 794847 801986 809642 817101 824102 831246 839220 847973 856930 865637 873710 880576 886238 892095
57373H92095P710R197Q417O490O251Q181R775R320Q087P735P622O457N151N711
$$ 892095 899805 909002 917419 923909 930160 938341 948116 957436 965523 973258 980880 987337 992488 998199
57359I98199P946R407Q767P317O771P063P154O874O983P847Q897R349R041Q547
$$ 998199 1006145 1015552 1024319 1031636 1038407 1045470 1052624 1059498 1066481 1074328 1083225 1092574 1101615 1110162
57345A110162Q595R250R787R532Q731Q229Q444R052R709J0509J1581J2637J3208
$$ 1110162 1118757 1128007 1137794 1147326 1156057 1164286 1172730 1181782 1191491 1202000 1213581 1226218 1239426
57332A239426J3197J2946J2790J2620J2054J1089J0378J0527J1247J1817J2249
$$ 1239426 1252623 1265569 1278359 1290979 1303033 1314122 1324500 1335027 1346274 1358091 1370340
57321A370340J3147J4278J4454J3446J2867J3997J5541J5081J2427R988R712J1092
$$ 1370340 1383487 1397765 1412219 1425665 1438532 1452529 1468070 1483151 1495578 1505566 1515278 1526370
57309A526370J2476J3151J3443J3744J4126J4434J4351J3825J3536J4247J5565
$$ 1526370 1538846 1551997 1565440 1579184 1593310 1607744 1622095 1635920 1649456 1663703 1679268
57298A679268J6159J5475J4387J3842J3796J3942J4537J5797J7228J8257J8930
$$ 1679268 1695427 1710902 1725289 1739131 1752927 1766869 1781406 1797203 1814431 1832688 1851618
57287A851618J9437J9652J9701K0146K0962K1148K0177J8983J8595J8657J8380
$$ 1851618 1871055 1890707 1910408 1930554 1951516 1972664 1992841 2011824 2030419 2049076 2067456
57276B067456J8104J8449J8660J7549J5716J5019J5757J6233J5461J4614J5081
$$ 2067456 2085560 2104009 2122669 2140218 2155934 2170953 2186710 2202943 2218404 2233018 2248099
57265B248099J6474J7528J7825J7722J7550J7792J9121K1242K2449K1396J8851
$$ 2248099 2264573 2282101 2299926 2317648 2335198 2352990 2372111 2393353 2415802 2437198 2456049
57254B456049J6765J6112J6535J7496J8589J9142J8825J8601J9748K1794K2682
$$ 2456049 2472814 2488926 2505461 2522957 2541546 2560688 2579513 2598114 2617862 2639656 2662338
57243B662338K1452J9691J9526K0952K1993K1175J9046J7260J6738J7039J7292
$$ 2662338 2683790 2703481 2723007 2743959 2765952 2787127 2806173 2823433 2840171 2857210 2874502
57232B874502J7394J7958J9221K0462K0830K0368J9768J9415J9212J9050J8712
$$ 2874502 2891896 2909854 2929075 2949537 2970367 2990735 3010503 3029918 3049130 3068180 3086892
57221C086892J7598J5532J3680J3530J4742J5347J4541J3891J4867J6408J6445
$$ 3086892 3104490 3120022 3133702 3147232 3161974 3177321 3191862 3205753 3220620 3237028 3253473
57210C253473J4985J4009J4716J6435J8264K0083K1668K2390K2483K3296K5417
$$ 3253473 3268458 3282467 3297183 3313618 3331882 3351965 3373633 3396023 3418506 3441802 3467219
57199C467219K7618K8496K8269K7938K7619K6773K5433K3967K2107J9556J7199
$$ 3467219 3494837 3523333 3551602 3579540 3607159 3633932 3659365 3683332 3705439 3724995 3742194
57188C742194J6356J6936J7763J8768K1229K5238K8561K9203K8070K7699K8890
$$ 3742194 3758550 3775486 3793249 3812017 3833246 3858484 3887045 3916248 3944318 3972017 4000907
57177D000907L0116L0211L0037L0783L1798L1322K9118K7002K6389K6274K4580
$$ 4000907 4031023 4061234 4091271 4122054 4153852 4185174 4214292 4241294 4267683 4293957 4318537
57166D318537K1029J7381J4767J2204Q582M913L119L076K663Q83o62j40K102M627
$$ 4318537 4339566 4356947 4371714 4383918 4392500 4397413 4400532 4403608 4406271 4407154 4406492 4406352 4408454 4413081
57152D413081P343J1261J6245K0564K2998K4213K5562K7402K9253L0912L2592
$$ 4413081 4420424 4431685 4447930 4468494 4491492 4515705 4541267 4568669 4597922 4628834 4661426
57141D661426L4242L5550L6583L7779L9158M0112M0136L9211L7125L3222K7505
$$ 4661426 4695668 4731218 4767801 4805580 4844738 4884850 4924986 4964197 5001322 5034544 5062049
57130E062049K1565J7250J4434J1066N599j532r097j6461k3149k8205l1248l3409
$$ 5062049 5083614 5100864 5115298 5126364 5131963 5130431 5121334 5104873 5081724 5053519 5022271 4988862
57118D988862l5939l8278l8890l7656l6068l5027l3835l1460k7668k2685j7001
$$ 4988862 4952923 4914645 4875755 4838099 4802031 4767004 4733169 4701709 4674041 4651356 4634355
57107D634355j1653p511m101m30K865L804J826j544n534j1601k0668l0498l7689
$$ 4634355 4622702 4615191 4611090 4610660 4613525 4617329 4619155 4617611 4612077 4600476 4579808 4549310 4511621
57094D511621m1250m2532m2596m1484l9591l7769l6116l4078l1720k9515k7253
$$ 4511621 4470371 4427839 4385243 4343759 4304168 4266399 4230283 4196205 4164485 4134970 4107717
57083D107717k4517k2199k1966k3967k6385k7665k8124k9022l0870l3038l4466
$$ 4107717 4083200 4061001 4039035 4015068 3988683 3961018 3932894 3903872 3873002 3839964 3805498
57072C805498l4665l4494l5763l9503m4975n0942n7323o4565p2007p8202q2777
$$ 3805498 3770833 3736339 3700576 3661073 3616098 3565156 3507833 3443268 3371261 3293059 3210282
57061C210282q6863r1745r7923j05213j12739j19094j23584j27115j31180j36492
$$ 3210282 3123419 3031674 2933751 2828538 2715799 2596705 2473121 2346006 2214826 2078334
57051B078334j43370j52409j63374j74525j84715j95260k07816k21180k32253
$$ 2078334 1934964 1782555 1619181 1444656 1259941 1064681 856865 635685 403432
57042D03432A63831g9804k43809k37705k22582j95623j53642r5251k3073N8156
$$ 403432 163831 -79804 -323613 -561318 -783900 -979523 -1133165 -1228416 -1251489 -1193333
57032a193333J44289K30648L11162a25462C14018M71130M48211L43537J46651
$$ -1193333 -1049044 -818396 -507234 -125462 314018 785148 1233359 1576896 1723547
57023A723547j58569o35130d50824k437028l701137m933040n853022o237357n961612
$$ 1723547 1564978 929848 -450824 -2887852 -6588989 -11522029 -17375051 -23612408 -29574020
57014b9574020n020707l550856j817323j32201J258957K241845K818818L054101
$$ -29574020 -34594727 -38145583 -39962906 -40095107 -38836150 -36594305 -33775487 -30721386
57006c0721386L028943K822474K508679K157670J833088J582821J430178J375192
$$ -30721386 -27692443 -24869969 -22361290 -20203620 -18370532 -16787711 -15357533 -13982341
56998a3982341J403961J494899J618719J740185J826455J856039J821803d91088
$$ -13982341 -12578380 -11083481 -9464762 -7724577 -5898122 -4042083 -2220280 -491088
56989A102109J433840J269540J112043R66324Q33982P15868O12211N22007M43668
$$ 1102109 2535949 3805489 4917532 5883856 6717838 7433706 8045917 8567924 9011592
56980I011592L76415L20367K74786K36989K03954J74562J49186J27774J10463
$$ 9011592 9388007 9708374 9983160 10220149 10424103 10598665 10747851 10875625 10986088
56971A0986088R9624R7919J02538J03631R0897O1091J8390l0047p6653j14067
$$ 10986088 11085712 11183631 11286169 11389800 11480697 11541788 11560178 11530131 11453478 11339411
56961A1339411j37776j49009j53007j54213j54476j54904j56544j58826j59790
$$ 11339411 11201635 11052626 10899619 10745406 10590930 10436026 10279482 10120656 9960866
56952I960866j58677j56759j55154j53483j51143j48505j46341j45351j46486
$$ 9960866 9802189 9645430 9490276 9336793 9185650 9037145 8890804 8745453 8598967
56943H598967j50419j56470j63385j71129j80345j90070j98136k04311k11037
$$ 8598967 8448548 8292078 8128693 7957564 7777219 7587149 7389013 7184702 6973665
56934F973665k20015k29842k37993k43684k47590k50093k51094k50459k47456
$$ 6973665 6753650 6523808 6285815 6042131 5794541 5544448 5293354 5042895 4795439
56925D795439k40633k29483k15669k01720j89158j78443j69747j62703j56140
$$ 4795439 4554806 4325323 4109654 3907934 3718776 3540333 3370586 3207883 3051743
56916C051743j49063j41475j33773j26135j19022j13177j08284j02716r5500q7754
$$ 3051743 2902680 2761205 2627432 2501297 2382275 2269098 2160814 2058098 1962598 1874844
56906A874844q1104p5659p0557o5638o1230n6969n2050m6304m0067l3599k7592
$$ 1874844 1793740 1718081 1647524 1581886 1520656 1463687 1411637 1365333 1325266 1291667 1264075
56895A264075k3582k2605k3906k5956k8133l0501l2671l4138l5066l5509l4653
$$ 1264075 1240493 1217888 1193982 1168026 1139893 1109392 1076721 1042583 1007517 972008 937355
56884I37355l2158k9446k7913k6637k3745j9549j6058j3672j0721o618l023j090
$$ 937355 905197 875751 847838 821201 797456 777907 761849 748177 737456 730838 727815 726725
56872G26725L61K870O161R017J0718J0539P356J157o048j2115j6770k0742k3880
$$ 726725 727086 729956 736117 745134 755852 766391 773747 774904 768856 756741 739971 719229 695349
56859F95349k5482k5693k5240k4171k2021j8952j5719j2858j0736r874j0278j0818
$$ 695349 669867 644174 618934 594763 572742 553790 538071 525213 514477 504603 494325 483507
56847D83507j0359r198q404q040p130n326l448k299j807j534j263q72k84L04O10
$$ 483507 473148 463950 455546 447506 440376 435050 431602 429303 427496 425962 424699 423827 423543 423847 424457
56832D24457P78J261K226L468M827O225P440Q350R178R932R842Q195N561L343
$$ 424457 425235 426496 428722 432190 437017 443242 450682 459032 468210 478142 487984 496179 501740 505083
56818E05083K069J062q1p76o15l61q89j747j527M34L381O123Q189R923J1884J4429
$$ 505083 507152 508214 508133 507357 506742 506381 505492 503745 502218 502652 506033 512156 520345 530268 542152 556581
56802E56581J7720K1765K6162K9903L1792L1265K8544K3890J7126Q430p66q381
$$ 556581 574301 596066 622228 652131 683923 715188 743732 767622 784748 793178 792412 784031
56790G84031j3221j5505j5921j4957j3154j1256r550p486m323L1N111J0388J5359
$$ 784031 770810 755305 739384 724427 711273 700017 690467 682981 678658 678689 683800 694188 709547
56777G09547J9599K3338K7824L4211M1781M7729M9192M5314L7186K6140J3041
$$ 709547 729146 752484 780308 814519 856300 904029 953221 998535 1035721 1061861 1074902
56766A074902p95j3082k1836k6851k9156k9427k7849k5328k3280k1888j9765j6121
$$ 1074902 1074107 1061025 1039189 1012338 983182 953755 925906 900578 877298 855410 835645 819524
56754H19524j2086q888n757j045N184J1215J6049K0208K4060K6583K6208K2079
$$ 819524 807438 798550 792793 791748 796932 808147 824196 844404 868464 895047 921255 943334
56742I43334J4443M671n170j3761k1432k8596l3730l4671l1863k8286k5651k2824
$$ 943334 957777 962448 957278 943517 922085 893489 859759 825088 793225 764939 739288 716464
56730G16464j8980j5911j5314j5527j3466q953m664k088J21L507P495J0373J1070
$$ 716464 697484 681573 666259 650732 637266 628313 623649 621561 621682 625189 632684 643057 654127
56717F54127R323N275k89o084j1172j5160j7634j8413j8443j9153k0476k0728
$$ 654127 663450 668725 668436 662352 651180 636020 618386 599973 581530 562377 541901 521173
56705E21173j9029j6683j5351j5015j4759j4540j4745j4662j2999r923p180n959
$$ 521173 502144 485461 470110 455095 440336 425796 411051 396389 383390 373467 366287 360328
56693C60328n788n875o413p779r185r237p576n226l319k142j633k066l561n187
$$ 360328 354540 348665 342252 334473 325288 316051 308475 303249 299930 297788 296155 294089 290528 285341
56679B85341n359l558j244m73j628k997k778j131J77j7j007j321o32L7j93j056
$$ 285341 279982 276424 275180 274707 273079 270082 267304 266173 266350 266333 265326 264005 263373 263410 263217 262161
56663B62161j859k459k838k224K01L608N625M771K105j59j043j047o29K77J364
$$ 262161 260302 257843 255005 252781 252982 256590 262215 266986 269091 268932 267889 266842 266213 266490 267854
56648B67854J752J152L73J85L01n7r45j583j212K60K237L819M358L950L311L079
$$ 267854 269606 270758 271131 271316 271617 271560 270615 269032 267820 268080 270317 274136 278494 282444 285755 288834
56632B88834L320L635L459K298J84k007l054k425o28J451L115L798L170J626J60
$$ 288834 292154 295789 299248 301546 301730 299723 296669 294244 293616 295067 298182 301980 305150 306776 306936
56617C06936o20r94j420j903k303k610k467j231Q21K054J232p86k082k055j517
$$ 306936 306316 305322 303902 301999 299696 297086 294619 293388 294209 296263 297495 296709 294627 292572 291055
56602B91055q08N61K186K366L18k361l548l062k182j495o32K17J18r82j788j405
$$ 291055 290247 290808 292994 295360 295678 293317 289769 286707 284525 283030 282398 282615 282733 281751 279963 278558
56586B78558o13o92j660k437k327j488k38J264K551K777J511o44k461l088k715
$$ 278558 277945 277253 275593 273156 270829 269341 269103 270367 272918 275695 277206 276562 274101 271013 268298
56571B68298k328k677l308k899q61J690L043K754J808J089N70J00RM07N99o8j135
$$ 268298 265970 263293 259985 257086 256225 257915 260958 263712 265520 266609 267179 267279 267288 267695 268294 268226 267091
56554B67091j556j051l45j19l49o44p47o33m10k45j77l9K55N46P93J261K041K638
$$ 267091 265535 264484 264139 264020 263671 263027 262280 261647 261237 260992 260815 260776 261031 261577 262370 263631 265672 268310
56536B68310K551J975J492J177O55r6n90n21j05K10K0q54j906j988n78J232J878
$$ 268310 270861 272836 274328 275505 276160 276064 275474 274953 274848 275058 275078 274224 272318 270330 269752 270984 272862
56519B72862J263N32J27n21j245p56J278L198L549L094L381M221M199L114K246
$$ 272862 274125 274657 274784 274263 273018 272262 273540 276738 280287 283381 286762 290983 295182 298296 300542
56504C00542K294K587K529K505K994L847M927O511Q377R339Q373N873L168J103
$$ 300542 302836 305423 307952 310457 313451 317298 322225 328736 337113 346452 354825 360698 363866 364969
56490C64969l61j357j625j056l64n66j630k126q89J144J755K56j526j747r33p77
$$ 364969 364608 363251 361626 360570 360206 359640 358010 355884 354995 356139 357894 358150 356624 354877 353944 353167
56474C53167j417j476m16P77J266J153M70j118l040l776k848j620j325j505j353
$$ 353167 351750 350274 349858 350635 351901 353054 353524 352406 349366 345590 342742 341122 339797 338292 336939
56459C36939j306k067k963k777j643p17l46P3P04J067J120J259J183P1j837k999
$$ 336939 335633 333566 330603 327826 326183 325466 325120 325193 325897 326964 328084 329343 330526 330597 328760 325761
56443C25761k353n89P04N50q84k470k712j039J325K578K459K189K290J820K78
$$ 325761 323408 322819 323523 324073 323189 320719 318007 316968 318293 320871 323330 325519 327809 329629 329907
56428C29907j190j365o66j59K05J096K114K073Q32l48m04M13J128J060K03q19
$$ 329907 328717 327352 326686 326527 326732 327828 329942 332015 332847 332499 332095 332508 333636 334696 334899 334080
56412C34080j146n82M8q0o21n91J92R58J083N06o81k087k571j161J310K642J825
$$ 334080 332934 332352 332400 332320 331699 331108 331300 332258 333341 333847 333166 331079 328508 327347 328657 331299 333124
56395C33124J47o82m37K20J061J929J942M89j413j960p70R05K082K986L854M019
$$ 333124 333271 332589 332152 332372 333433 335362 337304 337793 336380 334420 333650 334555 336637 339623 343477 347496
56379C47496K913J167o0m59n30n26k02L80O16K40p9M52J636K510K543K039J276
$$ 347496 350409 351576 351516 351057 350527 350001 349799 350179 350795 351035 350956 351408 353044 355554 358097 360136 361412
56362C61412Q3j352j949q98R15J650O91p41j305j044q36j177j995k973l404k328
$$ 361412 361495 360143 358194 357296 358211 359861 360552 359811 358506 357462 356626 355449 353454 350481 347077 344749
56346C44749M22L602N531N498L872J402j033k520k693j947o65J264L580N140N194
$$ 344749 345171 348773 354304 359802 363674 365076 364043 361523 358830 356883 356218 357482 361062 366202 371396
56331C71396M438L749K669O33j076n91J471K373J101k45K62J671K021J207M38
$$ 371396 375834 379583 382252 382885 381809 381218 382689 385062 386163 385918 386180 387851 389872 391079 391517
56316C91517J14j9M75K047L627L657K411J620J788J693P57K27J184K760L396K919
$$ 391517 391631 391612 392087 394134 397761 401418 403829 405449 407237 408930 409687 409914 411098 413858 417254 420173
56300D20173K369K293K302K052J686J259M74n95j070p1K027L704L914L338L410
$$ 420173 422542 424835 427137 429189 430875 432134 432608 432013 430943 430872 432899 436603 440517 443855 447265
56285D47265M277M582L502K091J849K649L122K626J749R90K50k82L4J092J730
$$ 447265 451542 456124 459626 461717 463566 466215 469337 471963 473712 474702 474952 474670 474704 475796 477526
56270D77526J350R98J909L633M478L753K591K502L688N005N258M344L244K978
$$ 477526 478876 479874 481783 485416 489894 493647 496238 498740 502428 507433 512691 517035 520279 523257
56256E23257L584M244M269L717L006K342J709J149Q25R61J749L038M123M357M022
$$ 523257 526841 531085 535354 539071 542077 544419 546128 547277 548102 549063 550812 553850 557973 562330 566352
56241E66352M059M792N594O091O827Q142R169Q840P417O073N260M544L830L683
$$ 566352 570411 575203 580797 586888 593715 601857 611026 619866 627283 633356 638616 643160 646990 650673
56227F50673M323N344O637Q556J0763J1937J1317R867R187R768J0967J2249J3635
$$ 650673 654996 660340 666977 675533 686296 698233 709550 719417 728604 738372 749339 761588 775223
56214G75223J5142J6435J7143J7144J6773J6989J8836K2150K5254K6686K6966
$$ 775223 790365 806800 823943 841087 857860 874849 893685 915835 941089 967775 994741
56203I94741K7726K9399L0938L1876L3405L6754M1480M6144N0085N3752N7759
$$ 994741 1022467 1051866 1082804 1114680 1148085 1184839 1226319 1272463 1322548 1376300 1434059
56192A434059O2439O8012P4379Q0856Q6831R2595R8876J05674J12236J18174J23679
$$ 1434059 1496498 1564510 1638889 1719745 1806576 1899171 1998047 2103721 2215957 2334131 2457810
56181B457810J28467J31309J31148J28181J23258J16629J07779R6299Q2385O6515
$$ 2457810 2586277 2717586 2848734 2976915 3100173 3216802 3324581 3420880 3503265 3569780
56171C569780M9099L0601J1728o639k3729l9137n2925o5457p6953q7048r4862
$$ 3569780 3618879 3649480 3661208 3654569 3630840 3591703 3538778 3473321 3396368 3309320 3214458
56160C214458r9625j01483j01578j01177j00604r9348r7148r4514r1955q9242
$$ 3214458 3114833 3013350 2911772 2810595 2709991 2610643 2513495 2418981 2327026 2237784
56150B237784q5982q2441p9044p5392p0824o5817o1778n9095n6415n2371m7267
$$ 2237784 2151802 2069361 1990317 1914925 1844101 1778284 1716506 1657411 1600996 1548625 1501358
56139A501358m2483l8779l5864l3096l0076k6960k4564k3601k3416k2231j9307
$$ 1501358 1458875 1420096 1384232 1351136 1321060 1294100 1269536 1245935 1222519 1200288 1180981
56128A180981j6058j4115j3155j1808j0042r019q793p891n568l084k054k601l651
$$ 1180981 1164923 1150808 1137653 1125845 1115803 1106784 1097991 1090100 1084532 1081448 1079394 1076793 1073142
56115A073142m127l252p44K438M337L987K722K712M569P078Q780R094Q276P260
$$ 1073142 1069015 1065763 1065019 1067457 1071794 1075781 1078503 1081215 1085784 1092862 1101642 1110736 1119012 1126272
56101A126272P353R150J1710J3460J3971J4204J5127J6820J8963K1429K4062K6499
$$ 1126272 1133625 1142775 1154485 1167945 1181916 1196120 1211247 1228067 1247030 1268459 1292521 1319020
56089A319020K8615L0783L3475L6840M0771M5149M9953N5482O2313P0558P9199
$$ 1319020 1347635 1378418 1411893 1448733 1489504 1534653 1584606 1640088 1702401 1772959 1852158
56078A852158Q6824R2986R8027J01396J01226R6367Q8184P9423P1715O5013N9056
$$ 1852158 1938982 2031968 2129995 2231391 2332617 2428984 2517168 2596591 2668306 2733319 2792375
56067B792375N4081M9882M5309L9343L2230K4995J8202J1703N383m53n592j0640
$$ 2792375 2846456 2896338 2941647 2980990 3013220 3038215 3056417 3068120 3073503 3073050 3067458 3056818
56055C056818j6980k5875l7406n0255o2548p2755p9846q3088q2429p8908p3983
$$ 3056818 3039838 3013963 2976557 2926302 2863754 2790999 2711153 2628065 2545636 2466728 2392745
56044B392745o8389o2116n5532m9605m4657l9772l4178k8653k4639k2213j9845
$$ 2392745 2324356 2262240 2206708 2157103 2112446 2072674 2038496 2009843 1985204 1962991 1943146
56033A943146j6251j1828q041n866n000m247k585o5K240L499M239N827Q809J2101
$$ 1943146 1926895 1915067 1907026 1901160 1896160 1891913 1889328 1889263 1891503 1895002 1899241 1905068 1913877 1925978
56019A925978J4064J4195J3614J3845J5189J6592J7184J7631J9233K1913K4152
$$ 1925978 1940042 1954237 1967851 1981696 1996885 2013477 2030661 2048292 2067525 2089438 2113590
56008B113590K5172K5971K7502K9007K9344K9144L0028L2153L4087L5067L5814
$$ 2113590 2138762 2164733 2192235 2221242 2250586 2279730 2309758 2341911 2375998 2411065 2446879
55997B446879L6995L8387L9864M1777M3827M4943M5009M5484M7488N0280N2445
$$ 2446879 2483874 2522261 2562125 2603902 2647729 2692672 2737681 2783165 2830653 2880933 2933378
55986B933378N3570N3944N3659N3106N3498N5656N8737O1241O2806O4028O5006
$$ 2933378 2986948 3040892 3094551 3147657 3201155 3256811 3315548 3376789 3439595 3503623 3568629
55975C568629O5339O5440O6663O9726P3815P7518Q0343Q3085Q6827R1550R5943
$$ 3568629 3633968 3699408 3766071 3835797 3909612 3987130 4067473 4150558 4237385 4328935 4424878
55964D424878R8927J01239J04735J10099J16246J22114J28017J34572J41462J48111
$$ 4424878 4523805 4625044 4729779 4839878 4956124 5078238 5206255 5340827 5482289 5630400
55954E630400J54749J61909J69472J77115J85104J93953K03820K14844K27341
$$ 5630400 5785149 5947058 6116530 6293645 6478749 6672702 6876522 7091366 7318707
55945G318707K41010K54806K68388K82911K99600L18404L38754L60634L83931
$$ 7318707 7559717 7814523 8082911 8365822 8665422 8983826 9322580 9683214 10067145
55936A0067145M07752M31535M55998M81946N09109N37267N67617O01686O39764
$$ 10067145 10474897 10906432 11362430 11844376 12353485 12890752 13458369 14060055 14699819
55927A4699819O81528P27312P77558Q32049Q90951R55538J026676J103603J185436
$$ 14699819 15381347 16108659 16886217 17718266 18609217 19564755 20591431 21695034 22880470
55918B2880470J272420J364449J460117J559199J664661J780359J908221K049339
$$ 22880470 24152890 25517339 26977456 28536655 30201316 31981675 33889896 35939235
55910C5939235K205797K379247K569724K778460L010094L269843L561029L888598
$$ 35939235 38145032 40524279 43094003 45872463 48882557 52152400 55713429 59602027
55902E9602027M262678M695478N197520N780744O462421P262138Q198468R293244
$$ 59602027 63864705 68560183 73757703 79538447 86000868 93263006 101461474 110754718
55894A10754718J0574477J2069236J3798812J5788777J8079233K0714122K3706069
$$ 110754718 121329195 133398431 147197243 162986020 181065253 201779375 225485444
55887B25485444K6959803L0117039L2377169L2523932K9375578K2514367J2758269
$$ 225485444 252445247 282562286 314939455 347463387 376838965 399353332 412111601
55880D12111601J921738q010381j5690024k0694940k3306245k4118415k3754668
$$ 412111601 414033339 406022958 390332934 369637994 346331749 322213334 298458666
55873B98458666k2730496k1405066j9986005j8572511j7206736j5907045j4682206
$$ 298458666 275728170 254323104 234337099 215764588 198557852 182650807 167968601
55866A67968601j3536064j2466420j1462753j0510816r602676q741085p934278
$$ 167968601 154432537 141966117 130503364 119992548 110389872 101648787 93714509
55859I3714509p189165o509030n893357n337713m835837m383263l978224l619294
$$ 93714509 86525344 80016314 74122957 68785244 63949407 59566144 55587920 51968626
55851E1968626l303811l028375k788714k578740k391284k220405k062465j915620
$$ 51968626 48664815 45636440 42847726 40268986 37877702 35657297 33594832 31679212
55843C1679212j779312j653634j537788j429664j327798j232863j146134j067615
$$ 31679212 29899900 28246266 26708478 25278814 23951016 22718153 21572019 20504404
55835B0504404r96824r33846q77861q26043p76003p28267o84337o43515o04200
$$ 20504404 19507580 18573734 17695873 16869830 16093827 15365560 14681223 14037708 13433508
55826A3433508n67341n35613n09373m86025m63493m41891m21508m01533l81476
$$ 13433508 12866167 12330554 11821181 11335156 10871663 10429772 10008264 9606731 9225255
55817I225255l61983l43703l26900l12301l00546k90487k80050k69233k60200
$$ 9225255 8863272 8519569 8192669 7880368 7579822 7289335 7009285 6740052 6479852
55808F479852k53661k47254k38769k29339k21775k16622k11441k03777j93729
$$ 6479852 6226191 5978937 5740168 5510829 5289054 5072432 4860991 4657214 4463485
55799D463485j83625j75708j70144j65201j59234j52163j44724j37100j29227
$$ 4463485 4279860 4104152 3934008 3768807 3609573 3457410 3312686 3175586 3046359
55790C046359j21768j15494j09974j04319r8842r4281q9632q2878p4395o7371
$$ 3046359 2924591 2809097 2699123 2594804 2495962 2401681 2312049 2229171 2154776 2087405
55780B087405o3823o1974n8919n4340n0011m6888m4539m2708m1498m0222l7776
$$ 2087405 2023582 1961608 1902689 1848349 1798338 1751450 1706911 1664203 1622705 1582483 1544707
55769A544707l4381l1582l0228k9563k8597k7367k6300k5264k4021k3024k2900
$$ 1544707 1510326 1478744 1448516 1418953 1390356 1362989 1336689 1311425 1287404 1264380 1241480
55758A241480k3284k2930k1192j8913j7475j7246j7373j7029j6305j5719j5308
$$ 1241480 1218196 1195266 1174074 1155161 1137686 1120440 1103067 1086038 1069733 1054014 1038706
55747A038706j4746j4100j3796j3732j2988j0819p811n606n387o593p341o233
$$ 1038706 1023960 1009860 996064 982332 969344 958525 950714 945108 939721 933128 925787 919554
55735I19554l739j605j027j721k690l211k951j963j031j237k415k820j358L34
$$ 919554 915815 914210 913183 911462 908772 905561 902610 900647 899616 898379 895964 893144 891786 892120
55721H92120n27m425r050j2347j4484j6228j6909j5273j1643p900n491m275l385
$$ 892120 891593 887168 878118 865771 851287 835059 818150 802877 791234 783334 777843 773568 770183
55708G70183k399j629j758l254n861q688j1045j3001j4786j5920j5573j3815j1871
$$ 770183 767784 766155 764397 761143 755282 746594 735549 722548 707762 691842 676269 662454 650583
55695F50583j0925j1021j1378j1416j1167j0859j0551j0220r852r367q688q127
$$ 650583 639658 628637 617259 605843 594676 583817 573266 563046 553194 543827 535139 527012
55683E27012q399r806j1492j1962j0588q251o246m910l762k681k235k712l450
$$ 527012 518613 508807 497315 485353 474765 466514 460268 455358 451596 448915 446680 443968 440518
55670D40518l540k953k490k720l326l637l500l430l976n090o146o442n794m730
$$ 440518 436978 434025 431535 428815 425489 421852 418352 414922 410946 405856 399710 393268 387474 382744
55656C82744m031l750k901o16K334M006L628K757L310M985N678M135J144j830
$$ 382744 378713 374963 372062 371446 373780 377786 381414 384171 387481 392466 398144 402279 403423 401593
55642D01593l978m986m832m266m455n524o283n942n282n471o564p787q580q637
$$ 401593 397615 392629 387797 383531 379076 373552 367269 361327 356045 350574 344010 336223 327643 319006
55628C19006p750o298n164m525l623k412k153l211l566j252K562M826M485L255
$$ 319006 311256 304958 299794 295269 291646 289234 287081 283870 280304 279052 281614 286440 290925 294180
55614B94180K757K811K669K191J412L01p59j491k620m713o221m786r15J833J225
$$ 294180 296937 299748 302417 304608 306020 306321 305562 304071 301451 296738 290517 285731 284816 286649 287874
55599B87874r51j842j335j213j848j826m34J223J699Q01l34l01J219K806K696
$$ 287874 286923 285081 283746 282533 280685 278859 278425 279648 281347 282148 281814 281513 282732 285538 288234
55584B88234J158N59K310M817N389L335J89k303l261k571j110n56j712l387m118
$$ 288234 289392 289951 292261 297078 302467 305802 305991 303688 300427 297856 296746 296190 294478 291091 286973
55569B86973m273n060o078n800m371l853n236o955p132n861m330k940j454k12
$$ 286973 282700 277640 271562 265762 261391 257538 252302 245347 238215 232354 228024 225084 223630 223418
55555B23418N8o09j453k020k446k755k526j482n5Q07M76p58j971k612k991l536
$$ 223418 223476 222867 221414 219394 216948 214193 211667 210185 210130 210937 211413 210655 208684 206072 203081 199545
55539A99545l831l022j155M82O43o03k021k322j159N92J366K03k313m467m895
$$ 199545 195714 192692 191537 192019 192662 192059 190038 187716 186557 187149 188515 188718 186405 181938 177043
55524A77043l443r30J383K234J222l84l67K174N499O705M651J159p80J74K709
$$ 177043 173600 172670 174053 176287 177509 177125 176758 178932 184431 191136 195787 196946 196166 196340 199049
55509A99049M551M833M464M388M348L761K928K483K126J015p99k434l653n035
$$ 199049 203600 208433 212897 217285 221633 225394 228322 230805 232931 233946 233147 230713 227060 222025
55495B22025o513p064o419n774n940n917m443k201j070j628k634k887k367j508
$$ 222025 215512 208448 202029 196255 190315 184398 179955 177754 176684 175056 172422 169535 167168 165660
55481A65660m96M18P83N53J91o7m39q55p08K52J300J511P67l72j392j967j655
$$ 165660 165164 165582 166365 166918 167109 167042 166603 165748 165040 165292 166592 168103 168870 168498 167106 165139 163484
55464A63484k14J784K980K339J75k033l023k849k486k465k500k452k812l547l366
$$ 163484 163270 165054 168034 170373 170548 168515 165492 162643 160157 157692 155192 152740 149928 146381 143015
55449A43015j350J161J753R8j664k000j769k032j865l1K264K439J33k200k508
$$ 143015 141665 142826 144579 144677 143013 141013 139244 137212 135347 135316 137580 140019 140152 137952 135444
55434A35444j313j47N61J147J460J211R47J427K280K220P91q34j092K38J715J674
$$ 135444 134131 133984 134545 135692 137152 138363 139310 140737 143017 145237 146028 145194 144102 144340 146055 147729
55418A47729p9k074k781k177j355q28m7J283K301K011O29o79j116q17l36q7j07
$$ 147729 147650 145576 142795 140618 139263 138435 138388 139671 141972 143983 144612 143933 142817 142000 141664 141577 141470
55401A41470o4L64Q69O73l78j321j187k58L67J91l75r51j674k573l147k826j748
$$ 141470 141406 141770 142639 143312 142934 141613 140426 140168 140535 140726 140351 139400 137726 135153 132006 129180 127432
55384A27432p80p27j461j872r84Q73K357K698K391K184K021J569J083J019J177
$$ 127432 126652 125925 124464 122592 121608 122481 124838 127536 129927 132111 134132 135701 136784 137803 138980
55369A38980R35J40q47j606j646m38J664L003K174j80k016k232j468p26k87pK75
$$ 138980 139915 140055 139208 137602 135956 135518 137182 140185 142359 142179 140163 137931 136463 135737 135450 135443 135718
55352A35718P91J504J711Q80l25q37q81j553k732k992j955j089j437j985j394
$$ 135718 136509 138013 139724 140604 140279 139442 138561 137008 134276 131284 129329 128240 126803 124818 123424
55337A23424j27L62k68j118j379q21M76J880K293J432N24P71J688J948J341P88
$$ 123424 123297 123659 123391 122273 120894 120073 120549 122429 124722 126154 126678 127449 129137 131085 132426 133214
55321A33214P75R85J211J552J743J377O75J45m07j493k738l076k255j058o5P51
$$ 133214 133989 134974 136185 137737 139480 140857 141532 141677 141270 139777 137039 133963 131708 130650 130585 131336
55305A31336J181P61j69n81l94p12j818k200o27J741K612J438j47o26j32L21J20
$$ 131336 132517 133278 133109 132528 132134 131422 129604 127404 126777 128518 131130 132568 132421 131795 131663 131984 132104
55288A32104p32j869k550j986k75J370J800J126L26o9k75l97n8Q00J465J368R80
$$ 132104 131372 129503 126953 124967 124692 126062 127862 128988 129314 129245 128970 128573 128515 129315 130780 132148 133128
55271A33128J141J755J863R64m14j467j854j644j117p08n38p4J036J879J153p71
$$ 133128 134269 136024 137887 138851 138437 136970 135116 133472 132355 131647 131109 131035 132071 133950 135103 134332
55255A34332j871j107K27N23Nk32j72m32p06l65o9r67k477k638r13R89J522R43
$$ 134332 132461 131354 131581 132104 132109 131877 131705 131273 130567 130202 130133 129166 126689 124051 123138 124127 125649 126592
55237A26592K1j345l173m302l461r11J907L869M637M260L206K364K154J945J019
$$ 126592 126613 125268 122095 117793 114332 113421 115328 119197 123834 128094 131300 133664 135818 137763 138782
55222A38782k55r33q71p83j002j054n37K33O79N94J25m89r98j199j094q71o49
$$ 138782 138527 137594 136723 135940 134938 133884 133347 133580 134259 134853 134978 134489 133491 132292 131198 130327 129678
55205A29678l80l1K86L92L07L63R93K129K901K314M08j552k319j871j138p32m08
$$ 129678 129298 129267 129553 129945 130252 130615 131608 133737 136638 138952 139360 137808 135489 133618 132480 131748 131340
55188A31340K66J179J835K025J934J626Q69k75r56k34J561K700J845l30j777j329
$$ 131340 131606 132785 134620 136645 138579 140205 141074 140799 139843 139609 141170 143870 145715 145385 143608 142279
55172A42279J25P94p3j502j885o85Q54R73m61j505m81J696K415O30j856k672j561
$$ 142279 142404 143198 143125 141623 139738 139053 139907 140880 140419 138914 138433 140129 142544 143174 141318 138646 137085
55155A37085j76J01o73j616j975j542p13j64j04N5R34K185K691J864L28p28o95
$$ 137085 136909 137010 136337 134721 132746 131204 130491 130327 130223 130278 131212 133397 136088 137952 138280 137552 136857
55138A36857L1N81M75J9l2P48K044L105L322K527R62p61j867j910j170m34k59
$$ 136857 136888 137469 137944 137963 137931 138679 140723 143828 147150 149677 150639 149878 148011 146101 144931 144497 144238
55121A44238m44k87O48J988K882K727J564n5j225r04J314M265N631M023M75k601
$$ 144238 143794 143507 144155 146143 149025 151752 153316 153261 152036 151132 152446 156711 162342 166365 166840 164239
55105A64239l808l645l316l337l415k980j678K25J750J991J096P4l48k04K76J026
$$ 164239 160431 156786 153470 150133 146718 143738 142060 142285 144035 146026 147122 147196 146848 146644 146920 147946
55089A47946J709J709Q36l26j137j460j376r33n26q25j806k374j613r4P75M35
$$ 147946 149655 151364 152200 151874 150737 149277 147901 146968 146442 145617 143811 141437 139824 139730 140505 140940
55073A40940l39n89j65N13J167J799K335K454J820N31p98j478j259m55L76P77
$$ 140940 140601 140012 139847 140360 141527 143326 145661 148115 149935 150466 149668 148190 146931 146476 146852 147629
55057A47629O55M09N82J155J403P97k45q47p04j52M16O68L30k70p5J281K367J538
$$ 147629 148284 148693 149275 150430 151833 152630 152385 151538 150834 150682 151098 151766 152096 151826 151751 153032 155399 156937
55039A56937n41j426j73J465J649P73L20O70J239J862K719L380L078J771K16q07
$$ 156937 156396 154970 154797 156262 157911 158684 159004 159674 160913 162775 165494 168874 171952 173723 173939 173132
55023A73132r03k26K18p91l041m588l957k014o59l23jO48P21k76j407j461m23
$$ 173132 172229 172003 172221 171430 168389 163801 159844 157830 157171 156848 156847 157495 158216 157940 156533 155072 154649
55006A54649O84J095J005J004J032L92r19j549l65J615K217J014l47r26j563k418
$$ 154649 155333 156428 157433 158437 159469 159861 158942 157393 157028 158643 160860 161874 161527 160601 159038 156620
54990A56620j764J110L702L312R14m49p6K49j37k3P65O35q88k024j558o70q07
$$ 156620 154856 155966 159668 162980 163894 163445 163369 163618 163481 163458 164223 164858 163970 161946 160388 159718 158911
54973A58911j497j509p70J58J238K428K962K315J121K67j94m77l24M45J244J405
$$ 158911 157414 155905 155135 155293 156531 158959 161921 164236 165357 165624 165430 164953 164629 165074 166318 167723
54957A67723R82M31P6J53N44L64j128l047l658k895k558l359l570j752Q30J900
$$ 167723 168705 169136 169212 169365 169909 170273 169145 166098 162440 159545 156987 153628 150058 148306 149136 151036
54941A51036J080l63j485j911j072J059L115L732L322L074K915K017Q58R33K461
$$ 151036 152116 151753 150268 148357 147285 148344 151459 155191 158513 161587 164502 166519 167377 168310 170771
54926A70771L850L647J799r70l815n631n448l365n77J631K559K263J596J640K349
$$ 170771 174621 178268 180067 179097 175282 169651 164203 160838 160261 161892 164451 166714 168310 169950 172299
54911A72299K497J603R68J655K578K154Q82L07J56j159l329l942j930Q88K355
$$ 172299 174796 176399 177367 179022 181600 183754 184636 184943 185099 183940 180611 176669 174739 175627 177982
54896A77982K225J235k22j555j692n23N72N39j16n31o70o12l1P04L28j299k333
$$ 177982 180207 181442 181220 179665 177973 177450 178022 178561 178445 177914 177244 176632 176601 177305 177633 176334 174001
54879A74001j327P29K011K227J967R70j067k851k688r00P93J923L340M836M823
$$ 174001 172674 173403 175414 177641 179608 180578 179511 176660 173972 173072 173865 175788 179128 183964 188787
54864A88787K861O97M9O74J331J513J487J608K264L687N309O080N868N743O316
$$ 188787 191648 192345 192394 193068 194399 195912 197399 199007 201271 204958 210267 216347 222215 227958 234274
54849B34274O754O064M437K577N39j728l373l481k642k499l619m853m935l934
$$ 234274 241028 247092 251529 254106 254645 252917 249544 246063 243421 240922 237303 232450 227515 223581
54835B23581k784k140k081k351k430j755m54M60Q7j256k319k251j283j14Q70J578
$$ 223581 220797 218657 216576 214225 211795 210040 209586 210046 210133 208877 206558 204307 203024 202910 203780 205358
54819B05358J822J349L10o09p06J07J186J772J806K012L095M849O310O744O246
$$ 205358 207180 208529 208839 208230 207524 207631 208817 210589 212395 214407 217502 222351 228661 235405 241651
54804B41651N336M356L384K296O44j950m827o201m949k232m83p16j749k231k367
$$ 241651 246987 251343 254727 257023 257667 255717 250890 244689 239740 237508 237025 236309 234560 232329 229962
54789B29962l072m259m874m348l263k572k640l062l180k798k364k273k237j895
$$ 229962 226890 222631 217757 213409 210146 207574 204934 201872 198692 195894 193530 191257 189020 187125
54775A87125j787k736m121m035j799P95J662Q96j0l40k81L48J731K823K253M01
$$ 187125 185338 182602 178481 174446 172647 173442 175104 176000 175990 175650 175369 175717 177448 180271 182524 182925
54759A82925j015j348j380j313m13R00P49j340l147k613m43J576L300N352O698
$$ 182925 181910 180562 179182 177869 177456 178356 179105 177765 174618 172005 171562 173138 176438 181790 188488
54744A88488N451J834j633l037k620j436m4J087J358R08O87J129J496J024O8l39
$$ 188488 193939 195773 194140 191103 188483 187047 187003 188090 189448 190356 191043 192172 193668 194692 194760 194421
54728A94421K70J323J693P22q66j380p6J701K086J097L94P38J050K88r71j454
$$ 194421 194691 196014 197707 198429 197563 196183 196107 197808 199894 200991 201385 202123 203173 203461 202490 201036
54712B01036q30K51J179J886K671L855N266O135N957N269M862M445L191J531J068
$$ 201036 200206 200457 201636 203522 206193 210048 215314 221449 227406 232675 237537 241982 245173 246704 247772
54697B47772K398M306N507N917N716M602K746J160K06j062l120m806n074m708
$$ 247772 250170 254476 259983 265900 271616 276218 278964 280124 280330 279268 276148 271342 266268 261560
54683B61560m912n332m974m105l620l242k230j199j345k255k386j567j170j735
$$ 261560 256648 251316 246342 242237 238617 235375 233145 231946 230601 228346 225960 224393 223223 221488
54669B21488k295k176j731j090N4J060O38q70j275N17K898L872L558L367L850
$$ 221488 219193 217017 215286 214196 214250 215310 215948 215078 213803 214320 217218 221090 224648 228015 231865
54654B31865M556N075N266N057M767M875M933L778J289j188k839m395o235p017
$$ 231865 236421 241496 246762 251819 256586 261461 266394 270172 271461 270273 267434 263039 256804 249787
54640B49787n651l488k805l810m709m306l108k173k065k748l481l217j940r88
$$ 249787 244136 240648 237843 234033 229324 225018 221910 219737 217672 214924 211443 208226 206286 205298
54626B05298j150j325l73P62M98o08n99P40J573R27j63o99j015j427j426q80o28
$$ 205298 204148 202823 202450 203212 203710 203102 202503 203243 204816 205743 205580 204881 203866 202439 201013 200133 199505
54609A99505j113j650j696j562j383p15K36M39j64k06Q94J758J288N06P06J081
$$ 199505 198392 196742 195046 193484 192101 191386 191622 192061 191897 191691 192585 194343 195631 196137 196843 197924
54593A97924R0j745k491j836j487k375l253k563m33J778L012L059K229J049L9
$$ 197924 198014 196269 193778 191942 190455 188080 184827 182264 181831 183609 186621 189680 191909 192958 192997
54578A92997m60k72N56J409J301j9j575k242j994j427o86K75Q42L56o05p47J45
$$ 192997 192537 192265 192821 194230 195531 195512 193937 191695 189701 188274 187588 187863 188705 189061 188456 187709 187854
54561A87854R74R95N72Q4q17k236l291k930j137J134K765L143K506J766J480J056
$$ 187854 188828 189823 190395 190479 189662 187426 184135 181205 180068 181202 183967 187110 189616 191382 192862 193918
54545A93918k23j621j592j36Q40J50j023r70J26Q41O94M10M65P20J241K168K848
$$ 193918 193695 192074 190482 190346 191186 191336 190313 189343 189469 190310 191004 191414 191879 192599 193840 196008 198856
54528A98856K281O35q31j571k427l951n070m273j636J104K426K279J575R45L72
$$ 198856 201137 201772 200941 199370 196943 192992 187922 183649 182013 183117 185543 187822 189397 190342 190714
54513A90714k74p79q35m59K04J251K691L780L451J771K20J1O42P88L1j019j784
$$ 190714 190440 189661 188826 188367 188571 189822 192513 196293 199744 201515 201735 201746 202388 203176 203207 202188 200404
54496B00404j978j292O7R05L40o53m03Q86J328L13n06J96J590K417K871L419L237
$$ 200404 198426 197134 197201 198106 198446 197793 197390 198276 199604 199917 199411 199607 201197 203614 206485 209904 213141
54479B13141J617j87m46L67K99j065k188k094j437r17m01L6j47p39p46NO43J009
$$ 213141 214758 214571 214125 214492 214791 213726 211538 209444 208007 207090 206689 206725 206578 205839 205093 205098 205741 206750
54461B06750J940L239L227J302p17j090m69l86r06j347j899k634k180K91K731
$$ 206750 208690 211929 215156 216458 215741 214651 214182 213796 212890 211543 209644 207010 204830 205121 207852
54446B07852K428J26q34N73J794R41n70q64n60r59j305j69J673K112R15p2J57
$$ 207852 210280 210406 209572 210145 211939 212880 212310 211446 210886 209927 208622 208453 210126 212238 213153 213081 213238
54429B13238N58Nj129j807j654r34r2M05M83Q99K390M154M187J796j077j849k50
$$ 213238 213796 213801 212672 210865 209211 208277 208185 208590 209073 209972 212362 216516 220703 222499 221422 219573 219323
54412B19323J589J836R61P46J820K813K111l2j688j512j89O95O40M80J015K204
$$ 219323 220912 222748 223709 224455 226275 229088 231199 231167 229479 227967 227778 228473 229113 229593 230608 232812
54396B32812L615M801N171M187K105q1j730l060m250m673l659j670LN55K28m05
$$ 232812 236427 241228 246399 250586 252691 252610 250880 247820 243570 238897 235238 233568 233571 234126 234354 233949
54380B33949j083j726k099j871r69K22R53O03p03k072k671k401j622m74R76K179
$$ 233949 232866 231140 229041 227170 226201 226423 227376 227979 227276 225204 222533 220132 218510 218036 219012 221191
54364B21191K450K033K006K740L163K277Q63O47J851K693J673n10j968j914j158
$$ 221191 223641 225674 227680 230420 233583 235860 236723 237370 239221 241914 243587 243077 241109 239195 238037
54349B38037o79o60q88j270j571j348n38L04P16R46J487K346L220L966M450M225
$$ 238037 237358 236698 235810 234540 232969 231621 231083 231387 232103 233049 234536 236882 240102 244068 248518 252743
54333B52743L019J484O73O57L77p87j974j956q84j70o52j554j574n73L79M76J20
$$ 252743 255762 257246 257919 258576 258953 258166 256192 254236 253352 253182 252530 250976 249402 248829 249208 249684 249804
54316B49804R3K32l18j534j967m00K322L912L181J197k49n77l48R3R68K194K995
$$ 249804 249897 250129 249811 248277 246310 245910 248232 252144 255325 256522 256273 255696 255348 255441 256409 258603 261598
54299B61598K754J800J045J006J398J565J198N94K37J09k77j037j477j065n63
$$ 261598 264352 266152 267197 268203 269601 271166 272364 272958 273195 273304 273027 271990 270513 269448 268885
54284B68885j273l027l911k628l38P38O9r33j201j218j586j773j208p68j821l865
$$ 268885 267612 264585 260674 258046 257708 258446 258515 257582 256381 255163 253577 251804 250596 249828 248007 244142
54268B44142m490k099J951M621M234J889%j09Q98J501R73k07j249j846j930j239
$$ 244142 239652 237553 239504 244125 248359 250248 250248 250139 251037 252538 253511 253304 252055 250209 248279 247040
54252B47040J64J194N93j269k323j186R29J572Q1j744k119j450j386k387l187
$$ 247040 247204 248398 248991 247722 245399 244213 245142 246714 246795 245051 242932 241482 240096 237709 234522
54237B34522k681j349l68R5Q39K051K652J698j68j362j280p84p69j039j006p70
$$ 234522 231841 230492 230124 230219 231058 233109 235761 237459 237291 235929 234649 233865 233096 232057 231051 230281
54221B30281q26j034p32K38J322K135K798L184K599Q06j173j998j585j063j103
$$ 230281 229455 228421 227689 227927 229249 231384 234182 237366 239965 240771 239598 237600 236015 234952 233849
54206B33849j005K03K278L881M104L318K445J811J115K89j39K04Q69J057P25P07
$$ 233849 232844 233047 235325 239206 243310 246628 249073 250884 251999 252288 252149 252353 253222 254279 255004 255711
54190B55711J486K265J791M0j502j513m07K23m12j426j484m23O77P75j68j383
$$ 255711 257197 259462 261253 261293 259791 258278 257871 258094 257682 256256 254772 254349 255026 255801 255633 254250
54174B54250k086k039j623j341j161m99Q31J955J722J64j451k124k035j745j235
$$ 254250 252164 250125 248502 247161 246000 245501 246332 248287 250009 250173 248722 246598 244563 242818 241583
54159B41583l57M14N05K11L42R41J159M61o87j545j862j727j193m35J31K27O6
$$ 241583 241226 241640 242145 242356 242698 243639 244798 245259 244572 243027 241165 239438 238245 237810 237941 238168 238234
54142B38234J02O15J497K197J940N52q71q42P26K184K096R28J90L81N90Oj008
$$ 238234 238336 238951 240448 242645 244585 245137 244266 243424 244150 246334 248430 249358 249548 249929 250519 250525 249517
54125B49517j564j436j223j500k017j943q81N21J303J404J519J775J357Pr94k73
$$ 249517 247953 246517 245294 243794 241777 239834 238953 239474 240777 242181 243700 245475 246832 246839 245845 245572
54109B45572J670K977K720J699R15L36m45j183j307q45m42n58r64j052n81p1k43
$$ 245572 247242 250219 252939 254638 255553 255889 255444 254261 252954 252109 251667 251109 250145 249093 248512 248441 248198
54092B48198q91q36M73J751J218r96k871k933j684l53N49Q87L50q81j779j718
$$ 248198 247307 246471 246944 248695 249913 248917 246046 243113 241429 241076 241625 242512 242862 241981 240202 238484
54076B38484j431j693j837p36J201K347K047J221Q78J152J891K887L340K299J32
$$ 238484 237053 235360 233523 232787 233988 236335 238382 239603 240481 241633 243524 246411 249751 252050 252182
54061B52182j447j440p15n41q89r23l75M65J474K481K824K154J302J322J833J464
$$ 252182 250735 249295 248580 248039 247150 246227 245852 246317 247791 250272 253096 255250 256552 257874 259707 261171
54045B61171qj126p17N39J204J021R81J689K540K677K305K537L784M704L391q2
$$ 261171 261163 260037 259320 259859 261063 262084 263065 264754 267294 269971 272276 274813 278597 283301 286692 286610
54029B86610l002k702L33L078L775L805N070O738O140K542j639l756l618k606
$$ 286610 283608 280906 281239 284317 288092 291897 296967 303705 309845 312387 310748 306992 303374 300768
54015C00768j381J74J485J463K64m93J55J129Q62n25j462j046l0K99m54j631k301
$$ 300768 299387 299561 301046 302509 302773 302280 302435 303564 304426 303901 302439 301393 301363 301662 301208 299577 297276
53998B97276j981q61N09J796K968L786L674K534J309J064J712K383K843L624M754
$$ 297276 295295 294434 294943 296739 299707 303493 307167 309701 311010 312074 313786 316169 319012 322636 327390
53983C27390N398N194M938N304N760N542M956M699M379L038J080L42J806M219
$$ 327390 332788 337982 342920 348224 353984 359526 364482 369181 373560 376598 377678 378020 379826 384045
53969C84045N623N596N136M831M107K467N78m13k44L72Q17J003P18n35k483l626
$$ 384045 389668 395264 400400 405231 409338 411805 412383 411970 411726 412098 412915 413918 414636 414101 411618 407992
53953D07992k892j375j215k738l979l509k420k622m143n378n367m582l667k718
$$ 407992 405100 403725 402510 399772 395793 392284 389864 387242 383099 377721 372354 367772 364105 361387
53939C61387j894j640j911j975j451r53j388k929m843o101o110n191m212l505
$$ 361387 359493 357853 355942 353967 352516 351563 350175 347246 342403 336302 330192 325001 320789 317284
53925C17284k562j148j55m29j289j420q68p37r86l05J412K294J213k83k36P16
$$ 317284 314722 313574 313419 312990 311701 310281 309413 308676 307690 307385 308797 311091 312304 312021 311785 312501
53909C12501L96j334k054j02L102M804M099K543J971K492K871K441K031K687M091
$$ 312501 312897 311563 309509 309407 312509 317313 321412 323955 325926 328418 331289 333730 335761 338448 342539
53894C42539N083N515O447Q184R296Q346N798L341K040J865K302K366Q45k178
$$ 342539 347622 353137 359584 367768 377064 385410 391208 394549 396589 398454 400756 403122 403967 401789
53880D01789m441l655m15K297K601J497J013J761K813L088K394J635K147M221
$$ 401789 397348 393693 393278 395575 398176 399673 400686 402447 405260 408348 410742 412377 414524 418745
53866D18745O395O943N951M887M347L671K830K978M443N741N637M948N112O017
$$ 418745 425140 432083 438034 442921 447268 450939 453769 456747 461190 466931 472568 477516 482628 488645
53852D88645O623O893P571Q484Q513P231N337L457J642Q8p15q48j024j547j935
$$ 488645 495268 502161 509732 518216 526729 533960 539297 542754 544396 544484 543769 542921 541897 540350 538415
53837E38415j829j585j693k190k920l833m761n423n840o309o815p031p016p286
$$ 538415 536586 535001 533308 531118 528198 524365 519604 514181 508341 502032 495217 488186 481170 473884
53823D73884p883q072p403o429n845n451m741m011l986m503m550l837l308l742
$$ 473884 466001 457929 450526 444097 438252 432801 428060 424049 420063 415560 411010 407173 403865 400123
53809D00123m571m762m294l937l824l278k182j528k059l045l166k286j510j557
$$ 400123 395552 390790 386496 382559 378735 375457 373275 371747 369688 366643 363477 361191 359681 358124
53795C58124j819j303O1J372J706R11l71j288j566j644j923k154k097k366l603
$$ 358124 356305 355002 355063 356435 358141 359052 358681 357393 355827 354183 352260 350106 348009 345643 342040
53780C42040m908m321j453J496K186P33j031j963k027j156N99J973J444m58j409
$$ 342040 337132 332811 331358 332854 335040 335773 334742 332779 330752 329596 330195 332168 333612 333154 331745
53765C31745m47O65J11j304j481k6J554K085J701P97m80j558j507k65J082J701
$$ 331745 331298 331963 332074 330770 329289 329263 330817 332902 334603 335400 334920 333362 331855 331590 332672 334373
53749C34373J941K461L130L467L643M314N570O572O372M869L041K205K847M116
$$ 334373 336314 338775 341905 345372 349015 353329 358899 365471 371843 376712 379753 381958 384805 388921
53735C88921M743M486M207M433M568L970L081K785K958K656J615O33L34M15M53
$$ 388921 393664 398150 402357 406790 411358 415328 418409 421194 424152 426808 428423 429056 429390 429805 430258
53720D30258O84J423K243K315J330m37k618m869o748p969q616q696p858o042m074
$$ 430258 430942 432365 434608 436923 438253 437816 435198 430329 423581 415612 406996 398300 390442 384400 380326
53705C80326k853k193j301l42m41j968l762m522m186l383k339j074j26j12q35
$$ 380326 377473 375280 373979 373637 373196 371228 367466 362944 358758 355375 353036 351962 351836 351724 350889
53690C50889j549j881j795r02J166L614M641L217L32j890k105p34O29P26k26q07
$$ 350889 349340 347459 345664 344762 345928 349542 354183 357400 357732 355842 353737 353003 353632 354358 354132 353325
53674C53325j24J031J207L00l10L25J566K298K316J990J275L0j014p53P22J945
$$ 353325 353201 354232 355439 355739 355429 355754 357320 359618 361934 363924 365199 365229 364215 363462 364184 366129
53658C66129J863J218J534L004M167L807K576K208L272M524M623L874L587M202
$$ 366129 367992 369210 370744 373748 377915 381722 384298 386506 389778 394302 398925 402799 406386 410588
53644D10588M877M879M476M228M178M077L861L496K928K494K750L540L939L618
$$ 410588 415465 420344 424820 429048 433226 437303 441164 444660 447588 450082 452832 456372 460311 463929
53630D63929L369L586L194J388m20n9K128L285J678j225l039l399l480l732l503
$$ 463929 467298 470884 474078 475466 475046 474987 477115 480400 482078 480853 477814 474415 470935 467203 463700
53615D63700k620j871j755j639o27J151K489K285P43p34r61j69N26O33N64N09
$$ 463700 461080 459209 457454 455815 455188 456339 458828 461113 461856 461122 460161 459992 460518 461151 461715 462224
53599D62224J01n04l97N20Q56l47j921k135j177n41m58J66J314J473K47n08O91
$$ 462224 462325 461821 461424 461944 462800 462453 460532 458397 457220 456679 456221 456387 457701 459174 459421 458913 459604
53582D59604K689L385K622J916K030K410K734L471M694N555N374M525L901L989
$$ 459604 462293 465678 468300 470216 472246 474656 477390 480861 485555 491110 496484 501009 504910 508899
53568E08899M663N354N355M437L307K997L723M717N276N477N764O269O662O463
$$ 508899 513562 518916 524271 528708 532015 535012 538735 543452 548728 554205 559969 566238 572900 579363
53554E79363N443L997K961K783L055L280L775N134O941P982P727O802N804M602
$$ 579363 584806 588803 591764 594547 597602 600882 604657 609791 616732 624714 632441 639243 645047 649649
53540F49649L184K250K256K582K415J857J481J217N95k26n90l86j54j97m05r60
$$ 649649 652833 655083 657339 659921 662336 664193 665674 666891 667486 667260 666670 666284 666130 665933 665528 664568
53524F64568k290m041n020m665l856l635l703l010j477j57K44J03p3m66j215j678
$$ 664568 662278 658237 653217 648552 644696 641061 637358 634348 632871 632714 632958 633061 632988 632522 631307 629629
53508F29629j255n47o34j366j394k13Q76N42p58j583j528j263q95L76K669M648
$$ 629629 628374 627827 627193 625827 624433 624220 625096 625638 624880 623297 621769 620506 619611 619987 622656 627304
53492F27304N036M168L403L411L715L656L177K685K562K898L544M430N764P691
$$ 627304 632340 636508 639911 643322 647037 650693 653870 656555 659117 662015 665559 669989 675753 683444
53478F83444R782J1255J1806J1871J1940J2147J2629J3714J5351J6947J8149J9290
$$ 683444 693226 704481 716287 728158 740098 752245 764874 778588 793939 810886 829035 848325
53466H48325K0577K1499K1692K1900K3098K4944K6055K5908K5537K6071K7296
$$ 848325 868902 890401 912093 933993 957091 982035 1008090 1033998 1059535 1085606 1112902
53455A112902K8286K8956L0314L2998L6060L7796L7783L7556L8765M1098M2795
$$ 1112902 1141188 1170144 1200458 1233456 1269516 1307312 1345095 1382651 1421416 1462514 1505309
53444A505309M2928M2066M0725L8615L6060L4563L4910L5724L5390L4380L4145
$$ 1505309 1548237 1590303 1631028 1669643 1705703 1740266 1775176 1810900 1846290 1880670 1914815
53433A914815L4467L3911L2483L1732L1932L1348K9028K6561K5983K7175K8441
$$ 1914815 1949282 1983193 2015676 2047408 2079340 2110688 2139716 2166277 2192260 2219435 2247876
53422B247876K8623K7671K6012K4287K2935K1339J8143J3291Q796O489N789M702
$$ 2247876 2276499 2304170 2330182 2354469 2377404 2398743 2416886 2430177 2438973 2445462 2451251 2455953
53410B455953K271j071m823q688j2040j4455j6592j9236k1732k2729k2385k2427
$$ 2455953 2458224 2457153 2452330 2443642 2431602 2417147 2400555 2381319 2359587 2336858 2314473 2292046
53398B292046k3769k5535k6817k8066k9880l1563l1951l1151l0348l0091k9739
$$ 2292046 2268277 2242742 2215925 2187859 2157979 2126416 2094465 2063314 2032966 2002875 1973136
53387A973136k8746k7694k7508k7819k6892k3557j8902j5347j3989j3535j2157
$$ 1973136 1944390 1916696 1889188 1861369 1834477 1810920 1792018 1776671 1762682 1749147 1736990
53376A736990r547o649m080j802K28K072M216O968R724J1764J3457J5555J7733
$$ 1736990 1727443 1720794 1716714 1714912 1715140 1717212 1721428 1728396 1738120 1749884 1763341 1778896 1796629
53363A796629J9242K0759K3691K7512K9883L0226L1087L4552L9129M2088M3546
$$ 1796629 1815871 1836630 1860321 1887833 1917716 1947942 1979029 2013581 2052710 2094798 2138344
53352B138344M5853M9633N2937N4416N5049N6211N7927N9953O2826O6633O9973
$$ 2138344 2184197 2233830 2286767 2341183 2396232 2452443 2510370 2570323 2633149 2699782 2769755
53341B769755P1696P2836P5390P9515Q3253Q5023Q5233Q5298Q5991Q7102Q7960
$$ 2769755 2841451 2914287 2989677 3069192 3152445 3237468 3322701 3407999 3493990 3581092 3669052
53330C669052Q7858Q6509Q4505Q2910Q1946Q0392P6767P1084O5011O0201N6738
$$ 3669052 3756910 3843419 3927924 4010834 4092780 4173172 4249939 4321023 4386034 4446235 4502973
53319D502973N3316M8723M2902L6596L0333K3944J6983R267R38p808j6808k5868
$$ 4502973 4556289 4605012 4647914 4684510 4714843 4738787 4755770 4765037 4765975 4758167 4741359 4715491
53307D715491l4832m3710n2441o0487o6926p1157p3609p5613p8398q1993q5162
$$ 4715491 4680659 4636949 4584508 4524021 4457095 4385938 4312329 4236716 4158318 4076325 3991163
53296C991163q6580q6150q4951q3918q2965q1649q0107p8688p7069p4686p2113
$$ 3991163 3904583 3818433 3733482 3649564 3566599 3484950 3404843 3326155 3249086 3174400 3102287
53285C102287p0867p1364p1846p0139o5982o0950n6564n3212n0580m8131m5136
$$ 3102287 3031420 2960056 2888210 2818071 2752089 2691139 2634575 2581363 2530783 2482652 2437516
53274B437516m1253l7155l3987l2006l0436k8724k7153k5976k4767k3036k0905
$$ 2437516 2396263 2359108 2325121 2293115 2262679 2233955 2206802 2180826 2156059 2133023 2112118
53263B112118j8810j7101j6137j6045j5983j4547j1513q385o419n022l030p03
$$ 2112118 2093308 2076207 2060070 2044025 2028042 2013495 2001982 1993597 1987178 1982156 1979126 1978423
53251A978423Q96K039M134P362J0122J1368J2139J3997J6941J9783K1872K3448
$$ 1978423 1979319 1981358 1985492 1992854 2002976 2014344 2026483 2040480 2057421 2077204 2099076 2122524
53239B122524K4778K5982K7585L0226L3598L6277L7072L6247L5205L5017L5477
$$ 2122524 2147302 2173284 2200869 2231095 2264693 2300970 2338042 2374289 2409494 2444511 2479988
53228B479988L5582L4724L3192L1486K9549K7019K4000K1073J8449J5632J2055
$$ 2479988 2515570 2550294 2583486 2614972 2644521 2671540 2695540 2716613 2735062 2750694 2762749
53217B762749P640K635k673p824j2275j6021j9764k4008k8215l1391l3381l5113
$$ 2762749 2770389 2773024 2770351 2762527 2750252 2734231 2714467 2690459 2662244 2630853 2597472 2562359
53205B562359l7464m0282m2706m4234m5261m6578m8412n0028n0428m9462m8136
$$ 2562359 2524895 2484613 2441907 2397673 2352412 2305834 2257422 2207394 2156966 2107504 2059368
53194B059368m7675m8409m9579n0081m9316m7527m5682m4809m5103m5513m4600
$$ 2059368 2011693 1963284 1913705 1863624 1814308 1766781 1721099 1676290 1631187 1585674 1541074
53183A541074m2075l9307l7938l7968l7692l5761l2867l0782l0006k9291k7560
$$ 1541074 1498999 1459692 1421754 1383786 1346094 1310333 1277466 1246684 1216678 1187387 1159827
53172A159827k5307k3474k1888j9829j7637j6361j5926j5056j3352j2278j3308
$$ 1159827 1134520 1111046 1089158 1069329 1051692 1035331 1019405 1004349 990997 978719 965411
53161I65411j5939j8402j9642j9752j9014j7666j6497j6452j7268j7309j5421
$$ 965411 949472 931070 911428 891676 872662 854996 838499 822047 804779 787470 772049
53150G72049j2595j1130j2155j4407j5640j4907j3130j1626j0843j0650j1140
$$ 772049 759454 748324 736169 721762 706122 691215 678085 666459 655616 644966 633826
53139F33826j2244j2961j2036r597p283o442o899p748q581r325r571q843p328
$$ 633826 621582 608621 596585 586988 579705 573263 566364 558616 550035 540710 531139 522296 514968
53126E14968n787m921n043n942o693o223m617l396l817n276o070n378l822k471
$$ 514968 509181 504260 499217 493275 486582 480359 475742 472346 468529 463253 457183 451805 447983 445512
53112D45512k034k726m008m687m107l083k739k714j671N02K278K554J819P93p64
$$ 445512 443478 440752 436744 432057 427950 424867 422128 419414 417743 418245 420523 423077 424896 425689 424925
53097D24925l028m939n240m142k818j707l61J105J682Q62n27j389j643j911k317
$$ 424925 421897 416958 411718 407576 404758 403051 402690 403795 405477 406339 405812 404423 402780 400869 398552
53082C98552k323j590m88M34J031J375J332P37j42p97j148j607k278k471j328
$$ 398552 396229 394639 394151 394585 395616 396991 398323 399060 398918 398121 396973 395366 393088 390617 389289
53067C89289J109L636M603L115j7k569k746j010N63Q85Q74J493K008J358K86L52
$$ 389289 390398 394034 398637 401752 401735 399166 396420 395410 395973 396858 397732 399225 401233 402591 402877 403229
53051D03229J278J078q83k689k467p86M13K90m87j081j246j150j211j792k544
$$ 403229 404507 405585 404702 402013 399546 398760 399173 399463 398976 397895 396649 395499 394288 392496 389952
53036C89952k454j064P77J802J498J02j837l318l165j383L70N74l28q20n08k84
$$ 389952 387498 386434 387211 389013 390511 390613 388776 385458 382293 380910 381280 381854 381526 380706 380198 379914
53020C79914o33j004r00m75O3P33J172P36n21j650j998j944k144k676l150l166
$$ 379914 379281 378277 377377 376902 376965 377698 378870 379606 379085 377435 375437 373493 371349 368673 365523 362357
53004C62357k463j118J38M50j24o62o71o44r59j077m33M50N91m4m62L6J067J773
$$ 362357 359894 358776 358914 359364 359240 358578 357907 357263 356304 355227 354794 355244 355835 355791 355329 355365 356432 358205
52986C58205J788J437J235J287J230P15j31q67j244j196n14R19K507L164K433
$$ 358205 359993 361430 362665 363952 365182 365897 365766 364899 363655 362459 361945 362864 365371 368535 370968
52971C70968R25o00j926k837k705j371Q9M39j49l99K73J105J206O52J13L2M31
$$ 370968 371893 371293 369367 366530 363825 362454 362543 362982 362833 362434 362707 363812 365018 365670 365783 365815 366246
52954C66246J087J548J333M51m70p45j55R91J996K100J150N0j04N47O80m00j687
$$ 366246 367333 368881 370214 370665 370195 369450 369295 370286 372282 374382 375532 375582 375478 376025 376705 376305 374618
52937C74618j816q63j8K28N72J564K627K798J871M31q54j536j292j19J302J821
$$ 374618 372802 371939 371921 372149 372721 374285 376912 379710 381581 382012 381158 379622 378330 378211 379513 381334
52921C81334Q40r88k209k008r94m03n26m07P83K455L181K335P82M4J055L484N765
$$ 381334 382174 381186 378977 376969 375975 375572 375046 374639 375422 377877 381058 383393 384175 384219 385274 388758 394523
52904C94523O073L970J166q3N70J337O86q79j801j421l21O52Q58j42k197m273
$$ 394523 400596 404566 405732 405649 406219 407556 408242 407363 405562 404141 403820 404472 405330 405188 402991 398718
52888C98718n274n135m547l860k929j912j396j599k078k364k309j736m34J260
$$ 398718 393444 388309 383762 379902 376973 375061 373665 372066 369988 367624 365315 363579 363145 364405
52874C64405K447K492J611M96k14j91L38O20K19k29J84J169J530R54M04M53M16
$$ 364405 366852 369344 370955 371451 371237 371046 371384 372004 372223 371994 372178 373347 374877 375831 376235 376688 377104
52857C77104j96n53J43J143J178L51k56l80p51j610k364k775l308m068m265l199
$$ 377104 376908 376355 376498 377641 378819 379170 378914 378534 377783 376173 373809 371034 367726 363658 359393 356194
52841C56194j062J360L265L972L171J401j76o38J90J761K937K523N61j213j239
$$ 356194 355132 356492 359757 363729 366900 368301 368125 367487 367677 369438 372375 374898 375459 374246 373007
52826C73007k16j15j249j795o01J124J704J197P07O10P07J227K271K814J800n8
$$ 373007 372791 372676 371427 369632 369031 370155 371859 373056 373763 374373 375080 376307 378578 381392 383192 383134
52810C83134r13k32O73P21M25P64J689K299J844K12j948l247k466OK225K688J734
$$ 383134 382221 381989 382662 383383 383808 384572 386261 388560 390404 390616 388668 385421 382955 382961 385186 387874 389608
52793C89608O35q5o44j005r38r09j818l546m629l857j803k40l16j584k659k424
$$ 389608 390243 390158 389514 388509 387571 386662 384844 381298 376669 372812 371009 370769 370453 368869 366210 363786
52777C63786p85J259K234J216j381m019n126m222k131k39N70L66k83r92j661k099
$$ 363786 363001 364260 366494 367710 366329 362310 357184 352962 350831 350592 351162 351528 351245 350253 348592 346493
52761C46493k091j777j492j065J08J845K831K160O84j09p8j09r2J075L186M242
$$ 346493 344402 342625 341133 340068 340176 342021 344852 347012 347696 347587 347509 347400 347308 348383 351569 355811
52745C55811L203J722J740K565K101K25j054o52K74L26m27j357k437l684m553
$$ 355811 359014 360736 362476 365041 367142 367367 366313 365661 365935 366261 365834 364477 362040 358356 353803
52730C53803m666m345l795k637r33K79L37P9O10J595J831J157O20Q82J405J331
$$ 353803 349137 344792 340997 338360 337427 337706 338043 338122 338732 340327 342158 343315 343935 344817 346222 347553
52714C47553M70o70j352j132l63r1r32k147k309r21J031K110J700L78p14q78m67
$$ 347553 348023 347353 346001 344869 344506 344415 343483 341336 339027 338106 339137 341247 342947 343325 342611 341733 341266
52697C41266l68p38p42K59J754K758L002K838K380J407J0j260j827j385K2J839
$$ 341266 340898 340160 339418 339677 341431 344189 347191 350029 352409 353816 353826 352566 350739 349354 349376 351215
52681C51215L266L950M058L513J968J3o13J034L539M667L884K278N92j152k388
$$ 351215 354481 358431 362489 366002 367970 367983 367370 368404 371943 376610 380494 382772 383364 382212 379824
52666C79824k031j36J765K385J813P78k18q27r97j333k430l631l598k222p15K85
$$ 379824 377793 377657 379422 381807 383620 384398 384180 383353 382356 381023 378593 374962 371364 369142 368427 368712
52650C68712J250K066J494p54k884l159k050j140q75o56l20j35J56J027K157K723
$$ 368712 369962 372028 373522 372768 369884 366725 364675 363535 362660 362004 361684 361549 361705 362732 364889 367612
52634C67612K459J684P04q2o6O88J057K99p55r06l12J01K12L42J1j309k627k448
$$ 367612 370071 371755 372459 372377 372311 372999 374056 374355 373600 372694 372382 372483 372695 373037 373048 371739 369112 366664
52616C66664j225r24j908k221n51J765K710K101J086K67l74m78L52J486J619L16
$$ 366664 365439 364515 362607 360386 359835 361600 364310 366411 367497 367764 367390 366912 367264 368750 370369 370685
52600C70685j440k267j612k3J485K340K806L303L640L325K468J644R82K42l13
$$ 370685 369245 366978 365366 365343 366828 369168 371974 375277 378917 382242 384710 386354 387336 387578 387265
52585C87265j35L75Q8j035j577p63L33N55M22R88J902K086J581J234R73L3j269
$$ 387265 387130 387505 387593 386558 384981 384218 384551 385106 385528 386516 388418 390504 392085 393319 394292 394325 393056
52568C93056j549l83J063J744J830J785J537J189J427K426L148K562R02q83k365
$$ 393056 391507 391124 392187 393931 395761 397546 399083 400272 401699 404125 407273 409835 410737 409854 407489
52553D07489l533m064l593k456j405p46m32o91j692k660k337o32R67J127K35l04
$$ 407489 403956 399892 396299 393843 392438 391692 391260 390569 388877 386217 383880 383248 384215 385342 385577 385273
52537C85273N4N66N02J46J97O75R26N66m1k73M3N89R74J100J178J512K019K068
$$ 385273 385327 385893 386395 386541 386738 387413 388339 388905 388864 388591 388634 389223 390197 391297 392475 393987 396006 398074
52519C98074J192P1J07J569K717J744p32k264j679l37J65K60J157K362K083J3
$$ 398074 399266 399337 399444 401013 403730 405474 404742 402478 400799 400462 400627 400887 402044 404406 406489 406502
52503D06502j937k112j103n25p97j112r55o53m78k27J71L44N6l46l48K7J47o38
$$ 406502 404565 402453 401350 400825 400028 398916 397961 397308 396830 396603 396774 397118 397174 396828 396480 396507 396654 396016
52485C96016k226l493l074p67J994L480L332K418J384K13q98j282q86n80p98p77
$$ 396016 393790 390297 387223 386456 388450 391930 395262 397680 399064 399277 398379 397097 396211 395631 394833 394056
52469C94056m8K48j104l037l102p78J692K393K036K252K948K896K176K107K875
$$ 394056 394008 394256 393152 390115 387013 386235 387927 390320 392356 394608 397556 400452 402628 404735 407610
52454D07610K956J498j75l73N46P95k59j215m93J756L911M634L997L084K734K694
$$ 407610 410566 412064 411889 411516 412062 412857 412598 411383 410890 412646 416557 421191 425188 428272 431006 433700
52438D33700K025L00j695k651k028n92L55J53p72j450j386r91r72j355j494j159
$$ 433700 435725 436025 434330 431679 429651 429059 429414 429567 428795 427345 425959 424968 423996 422641 421147 419988
52422D19988j060j809k719k417o65J156J695J078L70Q0j03l42j45R47K497L363
$$ 419988 418928 417119 414400 411983 411318 412474 414169 415247 415617 415697 415594 415252 415107 416054 418551 421914
52406D21914K736J035m08p12l92n27j067o73J342L698M526L626K389J767J323
$$ 421914 424650 425685 425277 424565 424173 423646 422579 421906 423248 426946 431472 435098 437487 439254 440577
52391D40577M67n01j008j103j233j675k558l758m384l245n47J627J460m67k128
$$ 440577 441044 440543 439535 438432 437199 435524 432966 429208 424824 421579 421032 422659 424119 423652 421524
52376D21524k620k571k299j227N42J544P10j001j785j208k85K18N15R28J307J663
$$ 421524 418904 416333 414034 412807 413349 414893 415603 414602 412817 411609 411324 411542 412057 412985 414292 415955
52360D15955K461L692M262L156J051j25N62J977K567K354K509L335L900L774L959
$$ 415955 418416 422108 426370 429526 430577 430452 431014 432991 435558 437912 440421 443756 447656 451430 455389
52345D55389N413P577R117R502Q972P545N084K087o36k821m481n129m451l439
$$ 455389 460802 468379 477496 486998 495970 503515 508599 510686 510050 507229 502748 497619 493168 489729
52331D89729l469m284m368l397k667k722k396j022K38M45N34J418J952Q42n96
$$ 489729 486260 481976 477608 474211 471544 468822 466426 465404 465642 466087 466621 468039 469991 470833 470237
52316D70237L4K475L977L234J897J847K886L858M282M196L687L439M427O280P236
$$ 470237 470271 472746 476723 479957 481854 483701 486587 490445 494727 498923 502610 506049 510476 516756 523992
52301E23992O415M966M186L745K768J535R40J122J770K885M253M886M199L036
$$ 523992 530407 535373 539559 543304 546072 547607 548547 549669 551439 554324 558577 563463 567662 570698
$$ [...]
##END NTUPLES=NMR SPECTRUM
##END=
