
##TITLE=UV1033_TOFR01-ROVE100A_6099501_PFSwfo4xtT
##JCAMPDX= 6.0         $$ Bruker NMR JCAMP-DX V2.0
##DATA TYPE= NMR SPECTRUM
##DATA CLASS= NTUPLES
##ORIGIN= BRUKER
##OWNER= Administrator
$$ 1.72 TOPSPIN		Version 2.1
$$ 2012-05-13 01:07:52.468 -0500  Administrator@TOPSPIN
$$ Compression mode = diff/dup
##.OBSERVE FREQUENCY= 400.13188235
##.OBSERVE NUCLEUS= ^1H
##.ACQUISITION MODE= SIMULTANEOUS (DQD)
##.ACQUISITION SCHEME= undefined
##.AVERAGES= 8
##.DIGITISER RES= 22
##SPECTROMETER/DATA SYSTEM= spect
##.PULSE SEQUENCE= zg30
##.SOLVENT NAME= COFFEE_meoh
##.SHIFT REFERENCE= INTERNAL, COFFEE_meoh, 1, 14.98061
##AUDIT TRAIL= $$ (NUMBER, WHEN, WHO, WHERE, PROCESS, VERSION, WHAT)
$$ ##TITLE= Audit trail, TOPSPIN		Version 2.1
$$ ##JCAMPDX= 5.01
$$ ##ORIGIN= Bruker BioSpin GmbH
$$ ##OWNER= Administrator
$$ $$ C:\Bruker\TOPSPIN/data/COFFEE/nmr/UV1033_TOFR01-ROVE100A_6099501_PFSwfo4xtT/10/pdata/1/auditp.txt
$$ ##AUDIT TRAIL=  $$ (NUMBER, WHEN, WHO, WHERE, PROCESS, VERSION, WHAT)
(   1,<2012-05-13 01:07:45.750 -0500>,<Administrator>,<TOPSPIN>,<go>,<TOPSPIN 2.1>,
      <created by zg
	started at 2012-05-13 01:06:38.968 -0500,
	POWCHK enabled, PULCHK disabled,
       configuration hash MD5:
       AF F2 23 6B 01 CD 40 DD E5 A1 38 A0 06 EA F7 77
       data hash MD5: 64K
       73 08 9E 86 33 83 67 98 A6 D5 17 50 9D BB 15 34>)
(   2,<2012-05-13 01:07:48.343 -0500>,<Administrator>,<TOPSPIN>,<proc1d>,<TOPSPIN 2.1>,
      <Start of raw data processing
       efp LB = 0 FT_mod = 6 PKNL = 1 PHC0 = 0 PHC1 = 0 SI = 32K 
       data hash MD5: 32K
       5A 91 A6 EA C5 E9 EC AB 3C 58 F8 41 E9 37 16 B2>)
(   3,<2012-05-13 01:07:48.765 -0500>,<Administrator>,<TOPSPIN>,<proc1d>,<TOPSPIN 2.1>,
      <pk PHC0 = 213.1787 PHC1 = 0 
       data hash MD5: 32K
       C7 F8 29 EF 3C DF CD 2F B4 97 B5 32 B1 C5 67 3D>)
(   4,<2012-05-13 01:07:48.875 -0500>,<Administrator>,<TOPSPIN>,<proc1d>,<TOPSPIN 2.1>,
      <abs ABSG = 1 
       data hash MD5: 32K
       C0 DE 18 E7 8F C6 B1 66 04 86 AB 93 A8 F8 30 11>)
(   5,<2012-05-13 01:07:48.906 -0500>,<Administrator>,<TOPSPIN>,<proc1d>,<TOPSPIN 2.1>,
      <abs ABSG = 2 
       data hash MD5: 32K
       CD 96 B6 56 82 C7 49 EB 03 D5 23 77 49 C6 85 FB>)
(   6,<2012-05-13 01:07:48.937 -0500>,<Administrator>,<TOPSPIN>,<proc1d>,<TOPSPIN 2.1>,
      <abs ABSG = 3 
       data hash MD5: 32K
       E1 5E 9C 94 7F 26 0A 75 AF 17 42 76 2C 43 16 B0>)
(   7,<2012-05-13 01:07:48.968 -0500>,<Administrator>,<TOPSPIN>,<proc1d>,<TOPSPIN 2.1>,
      <abs ABSG = 4 
       data hash MD5: 32K
       EF 84 01 C3 96 72 0A E7 AF 9D 10 B6 08 3A 6F 75>)
(   8,<2012-05-13 01:07:49.000 -0500>,<Administrator>,<TOPSPIN>,<proc1d>,<TOPSPIN 2.1>,
      <abs ABSG = 5 
       data hash MD5: 32K
       C4 FC C2 AB DD D4 59 1D C6 1B DD 7E 82 D6 40 BB>)
$$ ##END=
$$ 
$$ $$ hash MD5
$$ $$ A1 AB 4F 1E 3F D9 43 9D 2E 83 66 56 71 77 D4 C7
##$RELAX= 
##$RELAX= 
##$RELAX= 
##$RELAX= 
##$RELAX= 
##$RELAX= 
##$RELAX= 
$$ Bruker specific parameters
$$ --------------------------
$$ [...]
##$TP= (0..7)
150 150 150 150 150 150 150 150
##$TP07= 0
##$TPNAME0= <>
##$TPNAME1= <>
##$TPNAME2= <>
##$TPNAME3= <>
##$TPNAME4= <>
##$TPNAME5= <>
##$TPNAME6= <>
##$TPNAME7= <>
##$TPOAL= (0..7)
0.5 0.5 0.5 0.5 0.5 0.5 0.5 0.5
##$TPOFFS= (0..7)
0 0 0 0 0 0 0 0
##$TUNHIN= 0
##$TUNHOUT= 0
##$TUNXOUT= 0
##$USERA1= <user>
##$USERA2= <user>
##$USERA3= <user>
##$USERA4= <user>
##$USERA5= <user>
##$V9= 5
##$VALIST= <valist>
##$VCLIST= <CCCCCCCCCCCCCCC>
##$VD= 0
##$VDLIST= <DDDDDDDDDDDDDDD>
##$VPLIST= <PPPPPPPPPPPPPPP>
##$VTLIST= <TTTTTTTTTTTTTTT>
##$WBST= 2048
##$WBSW= 25
##$XGAIN= (0..3)
0 0 0 0
##$XL= 0
##$YL= 0
##$YMAX_a= 537147
##$YMIN_a= -640593
##$ZGOPTNS= <>
##$ZL1= 120
##$ZL2= 120
##$ZL3= 120
##$ZL4= 120
##$ABSF1= 14.98061
##$ABSF2= -5.57192
##$ABSG= 5
##$ABSL= 3
##$ALPHA= 0
##$AQORDER= 0
##$ASSFAC= 0
##$ASSFACI= 0
##$ASSFACX= 0
##$ASSWID= 0
##$AUNMP= <proc_prof1d_extract_pilot.lims>
##$AXLEFT= 0
##$AXNAME= <>
##$AXNUC= <1H>
##$AXRIGHT= 0
##$AXTYPE= 0
##$AXUNIT= <>
##$AZFE= 0.1
##$AZFW= 0.1
##$BCFW= 0
##$BC_mod= 0
##$BYTORDP= 0
##$COROFFS= 0
##$CY= 15
##$DATMOD= 1
##$DC= 0
##$DFILT= <>
##$DTYPP= 0
##$F1P= 0
##$F2P= 0
##$FCOR= 0.5
##$FTSIZE= 32768
##$FT_mod= 6
##$GAMMA= 0
##$GB= 0
##$INTBC= 1
##$INTSCL= 1
##$ISEN= 128
##$LB= 0
##$LEV0= 0
##$LPBIN= 0
##$MAXI= 10000
##$MC2= 0
##$MEAN= 0
##$ME_mod= 0
##$MI= 0
##$NCOEF= 0
##$NC_proc= -8
##$NLEV= 6
##$NOISF1= 0
##$NOISF2= 0
##$NSP= 0
##$NTH_PI= 0
##$NZP= 0
##$OFFSET= 14.98061
##$PC= 1
##$PHC0= 213.1787
##$PHC1= 0
##$PH_mod= 1
##$PKNL= yes
##$PPARMOD= 0
##$PPDIAG= 0
##$PPIPTYP= 0
##$PPMPNUM= 2147483647
##$PPRESOL= 1
##$PSCAL= 4
##$PSIGN= 0
##$PYNMP= <proc.py>
##$REVERSE= no
##$SF= 400.13
##$SI= 32768
##$SIGF1= 0
##$SIGF2= 0
##$SINO= 400
##$SIOLD= 32768
##$SPECTYP= <>
##$SREGLST= <1H.CDCl3>
##$SSB= 0
##$STSI= 32768
##$STSR= 0
##$SW_p= 8223.68421052632
##$SYMM= 0
##$S_DEV= 0
##$TDeff= 65536
##$TDoff= 0
##$TI= <>
##$TILT= no
##$TM1= 0
##$TM2= 0
##$TOPLEV= 0
##$USERP1= <user>
##$USERP2= <user>
##$USERP3= <user>
##$USERP4= <user>
##$USERP5= <user>
##$WDW= 1
##$XDIM= 32768
##$YMAX_p= 454316079
##$YMIN_p= -732022
##$CURPLOT= <Network HP LaserJet P1505>
##$CURPRIN= <$Network HP LaserJet P1505>
##$DFORMAT= <normdp>
##$LAYOUT= <+/1D_H.xwp>
##$LFORMAT= <normlp>
##$PFORMAT= <normpl>
##$SURQMSG= 1
$$ End of Bruker specific parameters
$$ ---------------------------------
##NTUPLES= NMR SPECTRUM
##VAR_NAME=  FREQUENCY,     SPECTRUM/REAL,   SPECTRUM/IMAG
##SYMBOL=    X,             R,               I
##VAR_TYPE=  INDEPENDENT,   DEPENDENT,       DEPENDENT
##VAR_FORM=  AFFN,          ASDF,            ASDF
##VAR_DIM=   32768,         32768,           32768
##UNITS=     HZ,            ARBITRARY UNITS, ARBITRARY UNITS
##FACTOR=    0.250966925370066, 1,           1
##FIRST=     8223.43324360095, -203091,      -4615
##LAST=      0,             36402,           -43408
##MIN=       0,             -732022,         0
##MAX=       8223.43324360095, 454316079,    0
$$ Real data points
##PAGE= N=1
##DATA TABLE= (X++(R..R)), XYDATA
$$ [...]
23857 36214 -176931 -102402 76952 97561 -351799 -146604 -99284 -199348 -23878 -121619 13292
23845 -20102 -22354 312338 226490 -205315 199597 191455 -139676 -37321 -9565 261583 -286479
23833 77016 -71598 162003 -135998 -161095 2519 -68355 96863 49161 34158 -297830 207607
23821 -124808 -91008 339293 -311004 -382725 -252850 -396549 70044 -229405 -98308 163890
23810 -33101 156687 -199372 376757 209370 142162 -139498 -91832 289074 -63831 -81405
23800 -81405 162044 136095 -8613 -138153 -108649 39705 -36074 84832 215639 82034 -297179
23788 108832 169031 -265317 -222919 43062 186835 177471 68383 -370956 -16540 15661 -3516
23776 44259 37548 143070 -72219 104113 304501 -224277 -173335 -44567 -292285 7942 -257703
23764 -138077 -252134 101616 -264793 -114221 -331333 -84821 77939 -85801 -245568 -107541
23753 16695 32066 66695 -56988 129545 44626 254986 138467 58128 -190520 -180102 -127341
23742 -127341 -67705 -60133 263403 -26904 48397 -38087 265345 -99754 93610 -349751 -88116
23730 169668 47131 -55740 196149 171788 289728 54965 23222 -126326 -102608 -2805 25862
23718 -91252 -1458 -68563 56370 -164841 -221466 181086 -527848 46608 -44023 -97637 94252
23706 -474361 573 -97902 -192553 -118145 -141209 103434 94046 -41466 93206 -110979 221572
23694 -69611 -212843 57092 -168574 -37308 206929 -33505 -358377 -76538 40890 -29062 -18550
23683 -18550 -46033 251624 -262967 -34135 265158 -76847 1560 -243285 291878 56364 -49666
23671 -58260 173575 15709 -233341 -201500 107495 120224 67900 -205424 151873 167424 235670
23660 235670 15758 -128985 140993 -12392 9121 258623 -129799 -94715 -28304 88428 -91995
23648 97920 -33312 318243 22475 -73772 88871 22205 268041 -302234 37033 -92823 -55836
23637 -55836 -137790 -237078 -54508 285295 -376228 -459704 -148316 81401 -56 -127101 162748
23625 62013 -47188 15508 -97554 134092 -300927 236140 95098 -85702 -38895 119002 100188
23614 100188 -101683 -58940 143253 53296 277830 114654 54293 -228513 45310 174272
23604 174272 49138 333248 242287 67262 149158 -80336 -301087 -247547 -301086 -25924 266460
23592 239602 255386 97991 -95861 163055 28357 -125143 -34261 -126803 -154216 44909 94519
23581 94519 107218 504138 -111763 -69518 80938 -69912 149099 -95337 -204791 38705 20585
23570 20585 -122162 422607 73089 -6609 -179734 -129932 117396 -35865 -164070 212753 -317508
23558 142870 111759 177351 -106377 382499 38653 -131959 -6143 -138276 -190104 -59095 57421
23546 262562 -109272 152171 103142 332491 16831 188928 155178 -52958 194526 40282
23535 -69436 109480 -127069 -139898 56091 105894 67947 -191428 -117414 -159652 -43198 -45046
23524 -45046 -91052 114032 -115040 62174 44795 42378 226828 -14393 13840 63660 -45898
23512 159521 -11757 -148051 -199861 -174633 92297 -163112 51044 -5280 -42764 108693 -170592
23500 -298332 181078 202335 73401 -114745 -214986 116269 347454 -147081 217798 -111201
23489 -228766 -20450 -158502 115722 -15483 6710 -100342 -309740 182893 198536 161324 -113747
23477 30719 -24486 178451 -189615 -202570 69139 -51696 -184671 35409 49330 -399438 59039
23465 -156260 -183252 207301 -154985 -319287 -2841 -154540 79816 -156213 15212 369038
23455 369038 36787 194830 386 46626 -255123 -105409 170989 -183892 75203 77707 -283023
23443 -562743 -231736 -9177 -167390 90161 225914 -243617 -370741 -399528 -161733 -245174
23433 -245174 483151 44618 -277488 -94707 -200652 74170 -163023 190718 -129248 110530
23422 66405 -217216 -249251 247166 51237 -315469 195432 -154407 -85252 29649 23797 6098
23410 13622 202689 -62286 226956 -4103 -5328 28900 212006 38434 17143 293368 -214093
23398 -123283 207662 -39819 -166783 -15243 -256591 6390 -45347 66584 116402 -141666 43081
23386 -100897 -93149 252475 -45135 174388 157136 -70509 9203 -114776 24960 263095 -476583
23374 -36106 -251169 -354039 70297 -43312 -209788 -50297 115473 -186551 -184803 -377977 167644
23362 -49372 -190826 100832 213219 -98330 279380 -61981 35070 -21873 62736 -327019 -259934
23351 -259934 -22653 147560 -50819 -130560 49100 208459 64384 28169 27527 -1507 230872
23339 4632 -125816 222002 -34841 -250446 140876 170219 151865 -143095 -24981 -176484 38642
23327 -45251 -98943 55007 55117 176907 93021 73943 -166346 -186428 -63442 -31560 -60288 293573
23314 316422 -3165 -270233 -89396 -278795 50696 82796 -175035 207729 -121498 -21554 88476
23302 165888 -80244 67393 -43772 -109890 -25115 15365 -446015 -115804 -107802 62450 -50259
23290 -41286 -71689 -34524 -216054 -266682 117983 -229967 70523 -248885 36546 23585 167364
23279 167364 42395 -143557 -177360 -124073 -85263 62625 -9234 -24055 -71889 26280 -59220
23267 -46390 58904 -35066 -68587 -133389 -178121 -151954 -12951 -397053 218144 169174 -178796
23255 -383592 155064 -44820 -322092 5504 -170610 -262435 201479 -206665 -20354 -47339 15956
23243 -148633 -198351 151794 303991 67296 -136404 144576 110758 186688 -346100 -38964
23232 -137979 -72850 326005 -32798 -56635 155027 -135727 -10664 260293 111668 357551
23222 357551 -202443 142700 -202621 120645 -63550 181911 -109167 -303247 500973 -173059
23211 64586 343280 -61678 339112 233103 105945 11494 114979 260637 99130 -22576
23200 261013 -221375 -129237 126726 -440655 33389 23806 -179324 133577 -212444 -305677
23190 -305677 -376687 -178269 -243181 -330019 -292757 368 110301 -198801 13894 -31161 -179236
23179 -179236 333846 20720 144052 319182 -62972 -183012 -84810 -99711 -241762 35256
23168 85142 15294 -100672 48913 111831 -71936 59268 35655 365493 -154453 199474 -20163
23156 226650 81216 -93469 -87513 -252040 253199 -243945 99223 38039 120907 -154903 -79175
23145 -79175 78543 33028 -29160 -19029 -182501 44176 -105678 -40133 179864 34602 8231
23133 86884 260899 92885 145656 90220 39376 -115560 -93236 5692 29831 13229 -416527
23121 -198815 -141845 -93905 238140 -350769 526256 108007 -108014 11452 -165292 -67671
23110 -178529 215868 405917 -281352 -106388 373267 -139144 -83981 167925 -80431 -307578
23100 -307578 9376 -145377 111352 -202608 -89770 -141379 -164 151624 -160483 -81422 -132850
23089 -132850 -212463 -137887 -110436 91461 -208583 -231711 56568 122799 89559 135303 -57266
23077 123022 104517 63392 -276923 57330 -56884 -108507 -21574 104952 -54829 209660 122495
23066 122495 -237848 23579 180207 122848 203510 -78021 356880 113217 56283 106896 94004
23055 94004 128819 -145324 111564 151593 -35732 162372 -28789 50534 -124183 -77932 -174989
23044 -174989 78425 -257909 59154 162221 -69285 275166 242097 81710 -206082 -154880 -40610
23032 -58051 -120460 146698 -111081 113192 6131 196083 7285 90661 -249157 -7899 253496
23020 -19805 -117043 -159685 139515 88509 -72256 105211 -71953 -79834 -177097 -179621 -212372 25159
23007 94230 -122605 -200492 106539 184766 198348 2891 -461580 216642 69160 -179233 -186930
22996 -186930 -188213 -137606 -99887 171940 -150794 -87305 75124 41817 427058 1193 -73673
22984 371792 68364 -295422 219847 98441 -63253 -236726 162272 28094 -53132 82965 -314485
22972 -138697 210854 221989 197085 76812 44786 -210488 -138580 -65231 211771 23439 215871
22961 215871 -195321 90157 -118035 -3769 -10468 -83757 -77664 -238966 -241685 205611 -254046
22949 -205990 -97992 90918 -188399 93594 57482 158893 119924 214246 175273 -369830 -83792
22937 101055 -127870 -319252 233721 -372786 8404 -126055 73744 274817 -81173 -128015
22927 -128015 -142764 -151252 -198381 -94704 -152033 37345 13291 -365210 87486 -193110 1531
22915 56451 247791 110951 -60106 -153097 255748 73232 -69723 -45180 54503 -32737 249396
22903 86848 73562 -107847 91149 271006 62962 -135246 -36994 38372 -8477 -125304 -375019
22892 -375019 110393 4268 77845 -48189 77898 -111375 142908 -427209 -266651 -511796
22882 -511796 -53067 264223 167725 -85225 -257000 167135 18997 -446962 39306 -5076 30676
22870 132165 -171119 159238 32443 -256613 -137582 -319883 -239821 169978 -282857 -48202
22859 -1647 294171 151372 -323996 -207223 155771 -143191 137460 79843 -180022 109707
22848 -286113 -196566 -315531 45780 -5779 193788 -413907 -98320 -304408 -318618 23440 216558
22837 216558 4567 -61200 128275 -147366 -78533 -59771 54560 -169972 232745 215918 -2233
22825 114512 -293524 -184433 211474 -2067 128143 138428 152374 97606 202346 70082 -417616
22813 -315621 43403 -41175 -118115 21920 -23271 45077 -156026 27480 113726 73883 111834
22802 111834 49453 253299 -327227 -239149 -657576 39224 -19702 361824 47038 -251658
22791 111662 97011 391566 96093 44015 119538 -173202 -269332 -383680 95812 -19882 -305658
22780 -305658 264423 5845 77741 340047 -48250 39853 -330197 34718 49955 -24939 -59357
22769 -59357 -8458 80457 -52176 238387 -83305 -11046 -124007 -28899 -268929 133458 18429
22757 -42402 -164884 -158473 90342 -23060 -24191 30388 -37031 -259714 -4807 31683 -290939 108708
22744 67082 -186899 -47975 -64969 125877 -108209 259904 -328372 -840 -21972 159935 205259
22733 205259 -233784 105048 521090 -237709 538 131073 362828 26253 -188317 -19638
22722 108308 -396525 -58614 -140428 24114 -99817 -6241 101828 -271050 10632 -116441 -198116
22711 -198116 147683 -97652 -59578 -116940 39024 -87198 -227651 -53387 84814 102159 -19004
22699 -23220 -12501 -32558 -326322 -95836 369121 164226 221221 107106 -6975 -152279 -108489
22688 -108489 59837 -99008 -597 -156569 26026 -183261 212839 154049 -222257 -262459 151214
22676 -149509 -117703 -313933 46661 350923 -229849 270544 -194703 -174397 34690 9949 117104
22665 117104 -76715 -41433 -224307 -49355 27743 -24390 191929 91688 181881 -47145 107687
22653 -231386 -520644 -164378 -5626 1403 -153253 90562 -39544 -132708 146410 65155 -135918
22641 69866 -101945 -146510 16375 4278 64430 -139265 -107413 339970 97885 -154678 -287304
22630 -287304 -70567 379542 -31038 -108621 -1706 4722 -26107 282690 -111568 -46149 -12330
22618 -27530 -79122 -121262 12127 29463 104209 -323075 -87381 -227078 -184235 28726 -192565
22606 316170 -216612 15105 55710 -223414 191497 -63162 197001 -276494 -7920 -45812 65120
22594 113415 44260 54789 -136681 -110653 54494 -93895 -64360 -165153 -106030 88893 -36158
22582 285137 123069 -106961 -299273 180447 -15854 -251450 -290139 -190757 -182843 -107188 -16064
22570 -80787 -179259 266608 4684 1170 -377247 -352680 -62513 -69186 -199595 -183450 -677 -392914
22558 -392914 133657 100700 180911 -95761 -357413 142042 59407 42948 192994 24700 -93475
22546 62765 -181262 -49243 -57989 -23895 -1563 56708 -20070 -80604 -239896 -204021 145270
22534 216328 -244501 -82448 64065 286864 -241171 -291187 -127028 -112250 174225 179786 -86547
22522 -5145 -60039 -5115 219439 -150136 87784 287779 -134146 157070 133205 -134247 392913
22510 -133083 150620 -27666 -209843 7515 -176767 -81163 -57788 -290886 -373704 10740 124342
22499 124342 -25218 -204221 23923 -96821 -210071 -279713 -167529 1901 -179569 209841 -49865
22487 109609 -49138 -239475 -75990 -373387 31454 115494 141610 81503 93056 -206491 -146363
22476 -146363 356744 153748 144883 151640 -73285 55497 -101328 137805 145155 -142775 59660
22464 29408 210531 -148837 -179098 -102381 -451 309539 -237942 -52376 406163 120811 -199974
22452 -154070 11257 232166 12019 161210 -222358 -68239 -51727 -204953 -390970 318533
22441 20851 -117572 -292265 10966 -460792 -19335 67869 -119348 135178 -45610 4075 -136854
22429 -42767 -318199 100855 16843 -213724 177280 3624 -23759 -156085 184945 -43462 -146271
22418 -146271 169632 173489 55682 -3196 -141523 -19471 58009 26665 -8855 -93899 -136838 -2478
22405 -296635 -90707 -31872 239357 -60647 -178156 -158127 -301887 -349657 -151261 19348 16301
22394 16301 -208526 -192818 2930 38125 -27312 -444296 -20547 83702 6947 -4896 -77908 -195053
22382 -195053 70808 -138929 -89805 40320 -130010 -498279 -157447 -214950 -91968 -177006 -113546
22371 -113546 -195922 1936 -3446 -259788 -216790 28633 -106796 -241808 -191799 220183 -280432
22359 -89395 178958 -21797 -20139 31211 39367 -158236 -402774 8710 54395 75748 73234 -117117
22346 190642 -23741 -185078 331554 286441 32881 -24425 185392 93534 -326153 180547
22335 -139843 -70116 160834 -149873 -167554 -970 -48463 105015 -3547 -89084 -316857 -73371
22323 96439 45167 -401739 255949 40765 -111201 141524 102542 85747 669 19475 -112288
22311 1766 -48890 -108811 -10689 -105622 -191613 200973 -10241 21802 -14073 -200567 -69837
22299 144652 134500 -148574 -310594 -23131 264745 -7501 229482 322652 509428 214086
22288 -84591 78315 -72302 62853 322389 -25597 -169291 -70260 -159686 -49725 -169196 -37241
22276 171427 -76537 -134030 -50300 105109 -34334 -4896 220735 110789 47465 102541 292347
22265 292347 -82858 1520 65412 -82389 -176239 -181125 -268189 10858 40741 -142861 221647
22253 -14834 200239 -92186 76144 81874 -138419 -185780 -284860 199238 182211 -226629 103005
22241 -27813 -34371 73261 5624 -72465 -261914 13830 -271420 -280476 119049 -234293 -155092
22230 -155092 -207869 -204911 165868 23225 -9791 233263 -16932 73042 -20503 -256050 -347018
22219 -347018 -109703 -129843 301251 -98609 184770 386505 -159415 -158497 -164336 -25739 27835
22207 -49125 -18816 136042 374101 -149828 -111310 -86651 -97342 -160082 -81040 3299 -172442
22195 -169528 19028 -123174 -168198 69303 92033 -23104 -298820 -148759 -31134 -84976 90517
22183 312412 53367 -192252 -281057 192665 -109947 33860 257531 -85456 -279590 111787
22172 -126347 -32430 282777 168838 -202651 -183423 -146214 -59823 -242898 144946 -354863
22161 -119321 -131791 -305354 8209 -285477 302780 -18066 -23774 -88557 -158663 -269293 -182323
22150 -182323 -214509 -25181 255453 -75765 -7457 -172759 -73070 -27429 99593 90990 96715 -178283
22137 -357350 -21284 -75614 106332 24640 91761 -447529 216355 -256085 -124947 39047
22126 -234607 26866 323872 -251506 175641 -70282 -165890 82486 -51487 128435 265025
22116 265025 -78705 -51652 -223923 29211 -115305 122287 -71508 -232197 -73853 -117195 -225374
22105 -225374 -117213 161176 -150075 -71107 -136070 176707 -24010 -5056 3830 116660 239800
22094 239800 -235767 346839 -32054 -136348 -269887 4016 125542 -62404 -227132 274799
22083 -30139 109148 143059 -239452 -135340 49608 -50357 -30600 -331399 -135824 -365000
22073 -365000 199590 55921 -51031 142329 172801 -117279 -132752 35347 -123733 124310
22062 159851 -116446 -156879 43223 13911 148484 -288024 -304658 25172 -85826 157613 309041
22051 309041 242511 -106579 52041 4249 -172272 -140388 116175 -145048 -237134 -197536 95132
22039 127519 -50488 -106365 73199 -140521 -196360 -68285 114094 -152840 41626 346122 200667
22028 200667 17372 -78205 -190212 -9627 -47808 -262633 -52569 -214403 -124071 -190270 3873
22016 -468234 3640 -19102 193148 -208112 -60831 197667 -306268 3735 201300 -9484 253894
22004 111840 -85187 74256 -55529 130981 100951 -15019 80975 -15134 103569 -222224 56393
21992 -113454 40245 122387 -196494 74033 -80901 -172218 181280 -218038 183593 229704 -478111
21980 187233 -13425 -140531 -148016 -82734 124008 508453 8941 -109825 373190 -260533 8645
21968 -302160 -15013 -108901 -84050 113634 -224804 -253222 176 224623 108054 -312298 229813
21956 -185519 -149180 -12998 -161904 -14394 26551 -33397 -177236 -329826 319086 -31252 5164
21944 -100547 -152665 -290061 -182321 -144431 -77225 19497 -292976 17037 -154530 38502 186431
21933 186431 254560 -209583 337770 -217336 22280 -294021 -116917 -212374 196898 52712
21922 -140572 -59541 -166011 89080 -273315 -132480 -57556 -24166 -139317 242372 -208434
21911 -324285 -167064 -94601 44325 -76854 176000 -177620 123380 178444 -5397 -6558 19771
21899 -142603 20701 -152916 196493 207870 -175061 6668 126783 -114628 -81495 222492
21888 -121792 -99506 26426 -307860 -246847 -112357 -116983 26883 -85212 -207010 36054 -35984
21876 449882 -356202 254744 168717 -226461 -31768 -59754 -152538 -4184 342420 176517 -477536
21864 -144887 -175254 -98118 -58374 -190746 -69291 -129968 -194879 -132919 91315 161919 49798
21852 -280773 -284422 -2426 -278612 -123005 195277 -205823 -241423 -179777 -37731 -151882 -15934
21840 405284 -47298 -170112 23153 160303 215404 -6140 -109945 81039 -29985 -102233 200133
21828 314949 -425397 145600 -461504 2282 27866 -184034 111403 10714 -128672 -60455
21817 -460809 -271513 -223956 195509 -61493 -227979 -293573 -237523 42565 -148825 91580 4668
21805 164547 232310 -106613 385536 130093 -29944 -6761 129672 -8673 -150727 244849 -186205
21793 87389 -38296 -408627 -4511 -126717 -416724 -36479 -13926 84706 -48008 332095 155427
21781 -319330 -288213 -20946 -38495 -58211 -44484 -186560 138810 -198633 -20530 6085 -65591
21769 -26988 -159533 60100 -28140 -100560 -284844 240019 -110366 -31211 3057 118400 171259
21758 171259 57869 135357 40974 -188666 183899 129219 -146294 96607 -35191 -35690 145474
21746 -71350 -74525 -41425 -62450 193072 -259970 130032 64875 172533 104313 70509 47384
21735 47384 -403308 -16422 122667 181271 262269 454927 -359504 33057 -224759 18802 177084
21724 177084 125510 21763 -131658 63689 12952 204149 106929 -235451 -50180 12034 -61597
21712 268962 -330351 12233 -265959 50932 -189513 85101 -337038 -13432 104017 -408479
21701 -55026 -214712 -134550 -76247 36876 6721 50949 16927 -76530 165663 -110780 -76356
21690 -76356 -76103 -409245 110420 -119143 -221491 -21716 49499 -62266 119915 -363627 110720
21678 -221759 86174 -41384 39362 -83054 -219519 154020 -88173 -64785 166733 214881 -31960
21666 -68195 -167111 198565 71969 29282 -165827 97606 8534 -208136 119878 -108247 39436
21654 11037 290936 -105257 27195 -103674 -96859 6036 -366805 -273365 48018 -6698 -48186
21643 -48186 -44667 75210 -457241 -303637 -128347 -47127 114235 103620 -25100 -151053 -87311
21632 -87311 222227 -2144 -54359 66631 109357 129446 -33980 -254440 -106355 -71125 -234071
21621 -234071 -74799 39477 -34472 -126359 -243260 -297062 -342049 -136108 -74047 -1905 84618
21609 -134913 87770 163079 -38221 -102154 -155653 152997 -253833 180152 73707 167640 -340645
21597 -149894 44653 -346702 52933 -356673 -17155 1877 68803 -173918 -190720 67923 -130875
21585 -111637 131142 -250045 -40208 -110117 251870 -216999 -34338 71905 -214718 166576
21574 37568 -144500 -294411 84166 60540 149426 -134813 -98706 9142 -186634 -331656 -130342
21562 -246275 -607 -12136 138400 274719 21667 204445 174818 -48865 -120114 14524 96555
21551 96555 53345 35570 -68498 -61671 16155 88439 -302303 25382 30843 -65348 123924 -233290
21538 215834 -300437 -30862 -124074 -185375 -347615 -149678 -150195 -117974 -458774 230331 -176585
21526 -83053 -151634 154891 -177693 165055 229694 -8571 -117800 -226827 -70482 432362 -180304
21514 6248 -85292 110356 184280 -232627 -31338 -183686 410085 -75542 -208905 7869 -79150
21502 -102622 -54051 58523 16399 19451 89758 -196008 -152624 -127522 -91232 -194479 -228145
21491 -228145 -83419 -18412 -100298 -199460 -182891 50743 -140942 -431129 110262 67087 -21683
21479 43338 -392551 127805 198061 -86902 143609 -213175 324307 -227928 6434 -70728 -422503
21468 -422503 -372060 -260978 325098 -293331 -55779 4164 142839 266264 -241311 -169468
21458 -169468 51265 52179 -85045 -240804 -224193 256100 -70149 -268759 -47414 75420 79300
21447 79300 156585 -63654 -82630 16319 46418 -88294 -31757 -360605 -22125 -91711 173317
21435 -199197 -63722 24417 -55267 30278 -63654 -149252 -170826 158501 299562 -120982 205144
21423 -52228 232632 -1254 211446 46958 -276536 -232744 -4535 -68789 46792 241957 -255562
21411 -161078 -105412 -165434 -298322 16033 -107670 67095 -409299 296110 -45886 249106
21400 107282 -133316 -120074 78136 -164140 -130990 -32424 121946 -124331 -202807 -75288 -50333
21389 -50333 300564 163173 28831 -59050 -98067 -315342 95873 -8354 55922 -2244 -194620
21378 -194620 -30675 48944 -173258 -19524 -237849 68196 104451 -135745 -43756 -176819 -176108
21367 -176108 158573 -96823 -301828 93962 -352536 227243 -92414 -244427 116289 234964
21357 234964 -114916 -23582 52258 93298 -16683 -74424 63861 -152640 -160716 142647 -101782
21345 56863 36511 115618 78328 -417745 118272 -42895 24142 -128957 -42991 -71753 -49788
21334 -49788 101928 111028 -142509 -121939 -116289 -105381 42271 393369 147029 179214 -231324
21322 -372225 -371303 -81609 -120369 107588 -388839 137430 -16738 -40722 -288034 -152048 -244976
21311 -244976 -186074 -47677 -140830 30623 -20673 -81352 -165775 136081 50241 -124876 83295
21299 -117456 -41213 84573 -112193 -136472 -94453 -302390 2928 140170 224179 143895 -13020
21287 -183059 -165356 -55114 41555 -150296 -209394 271098 -292996 11803 -61453 4664 -24796
21275 -50396 220812 49281 223116 -248138 -204909 -130361 -310640 -104143 -237819 -255482
21265 -255482 130705 44967 -228063 45533 85206 89360 -120463 348456 -61137 -26727 -201709
21254 -201709 2929 -113525 -182113 -11966 196146 -158942 -292085 -111214 -38930 115596
21243 -269280 294746 149598 -211979 -185885 85746 209077 257666 101775 -99476 58133
21232 -39506 -163518 -77764 -12851 46865 -29036 329247 109049 -42955 60745 -96808 -14777
21220 -335683 -438528 -119272 -241070 99832 -34065 31479 -47423 145952 267032 -311464
21209 -222060 -5288 47518 69090 125065 20716 -217755 -369899 -294419 -2733 39273 -35894
21197 -233606 69576 -79772 67967 126800 -59194 -169962 127611 85868 -174788 -279528 191892
21185 -15433 -87979 38200 30870 144384 -200639 124787 -144842 -18597 310061 -119941 -11099
21173 204291 -401301 -12390 -39043 -51781 -310710 115758 124836 11720 12687 64443 19210
21161 176879 -33065 -221375 -174892 -130338 659 -107613 296038 -73848 -74876 65208 -74355
21149 -221163 -60104 42840 43390 9354 -103615 14517 61633 4983 -142909 -267200 -113601
21137 57822 -283284 127452 -140651 81941 -79133 -64822 -132014 -203298 59555 -170148 8578
21125 -174168 145436 -99001 -246641 -189942 -380059 -39371 -86360 87278 -119244 21869 317055
21114 317055 104057 369646 67687 -29842 -18807 -436689 -75356 126586 -123041 -267198
21104 -267198 -265813 381188 -192800 -64596 -209896 -87649 193352 -9530 -116986 -307829 102403
21092 318305 -231736 250673 -81711 127459 -326804 96648 -158726 32534 17367 -18521
21081 -149507 182027 21133 -179024 136550 -17861 -215372 -323330 -95225 -216268 -173971
21071 -173971 20789 -59396 -226715 121060 113747 173500 -215496 68017 -242152 -401041 -51508
21059 -363662 -10901 30648 56859 17956 -41997 -400607 -76713 29909 167625 -73159 -58005
21048 -58005 -12915 -54205 139441 -35903 -78352 127937 -202251 -11058 -171426 113389 301093
21037 301093 -344254 -75576 181618 136912 -127471 257132 -29969 160695 337906 -404560
21026 450770 -239799 -258296 213138 164827 239336 -77975 120178 -208638 39029 -140222
21015 -133975 -186307 -13224 -130105 135691 -38600 231076 91347 -406144 -35686 -90911 -73549
21004 -73549 -56221 150845 -277998 -523687 54210 115245 185057 -47139 -57759 14240 -88424
20992 -105065 26974 76430 -391869 -123454 -208071 51973 -3138 -49374 151098 76113 98837
20981 98837 137399 -195092 -147458 214354 41029 163285 -143323 -320121 -193770 136466
20970 -78289 -156308 -90754 210671 110748 -544611 80725 -89135 -12879 -151556 18418 -206025
20958 -133116 54579 178317 22021 -117753 135742 -127054 -19574 -186531 252924 357825
20948 357825 -2467 -96296 -276146 -135765 87590 87589 -27952 72133 -158063 -147146 -113569 -170506
20936 -170506 -483212 -84808 42877 283310 -66233 -178002 -199580 -143583 31979 236449 -40140
20924 -130469 11521 -207949 83962 259243 -28873 25861 -198854 -76792 283281 72453 -46818
20912 -88231 358447 284144 -20749 -168875 -124142 -108944 -75317 -62197 -119330 -186115 -87513
20900 -115924 139512 -470884 -128084 -507058 61939 -191929 67845 -157680 -16532 -134547
20890 -134547 -173196 -153468 -137833 -104939 -178606 21232 133344 69114 182250 178775 -229853
20878 -324965 -24910 364472 -175433 -10328 262385 -49484 -515 -109472 -136679 -107164 -211441
20867 -211441 48081 -263 -46954 -15453 97992 201905 -45201 49276 92292 -168736 -304171
20856 -304171 7549 -114015 133928 -94793 9202 -51902 -81274 -109005 24451 44826 -100440
20844 -266460 -73268 48194 -164929 -228962 -43370 309786 -131201 -191996 -77185 154798 -228598
20832 -44290 -219458 -255583 -101968 -438598 65215 -115714 -100172 307452 129370 112888
20822 112888 -163922 -251997 -188365 154005 -240616 53951 -225789 146382 18404 -441963
20811 -243038 -140277 60707 -122857 -325933 -73353 13201 81272 166898 69848 -15959 -207866
20800 -207866 -255364 -196677 -34638 173261 167723 -270479 -222528 252270 83858 85948 -39974
20788 139575 -220837 -140633 -102909 -23410 171003 98547 -96675 -89167 -156213 -28225 -222329
20777 -222329 39590 293224 -111919 -101631 -174961 -51776 65804 -198469 -5081 -27021 -114156
20766 -114156 37528 -146706 182356 65337 241030 18687 -76461 257520 -122600 245680
20755 -366260 -152034 239487 22083 65336 136645 25819 -270420 -64837 -62895 186743 -220089
20743 -7980 227249 143010 -30428 32411 -180620 58325 35770 -108060 -150840 -55351 -30509
20732 -30509 -321792 -325344 272288 -161991 249010 -23516 -358239 151440 -137690 56074
20721 277367 -22278 -123782 -164645 -77693 57994 136106 -191503 -30062 -64328 -26576 157087
20709 29470 -101121 96545 -133023 153272 58957 -115671 -114912 -176333 -183794 93158 149958
20698 149958 -91605 179429 -235552 -141960 -180034 203263 -336502 -173352 156597 -166777
20687 172572 6812 -396123 -102557 -8425 62507 -228799 -128951 -309764 178838 103956 -38588
20675 59466 -246469 63190 -21266 -9987 -287420 -194602 -122895 -155752 -66591 161396 -39797
20663 153947 113470 -1785 -72549 83076 49657 7079 -323651 -188557 106379 -244860 102097
20651 -60551 -15564 72646 91225 219571 -23896 45942 -47893 162408 326642 -330374 130818
20639 -179228 47356 -58472 -328907 82756 -92554 34858 -181770 -272353 -20557 -80031 -404537
20628 -404537 -66185 -338846 -59000 -53265 -135100 -108279 -239938 246579 251696 -21413 -76321
20617 -76321 -430517 -151590 -6221 158993 -100609 -194389 105787 385700 175756 205638
20607 205638 -44744 -279214 -344793 -3342 86011 -99452 22185 -233236 -3952 -193014 32047
20595 -85215 -200691 -128522 -245441 88725 -22904 -236173 -217805 -381212 -71142 -62442 67009
20583 255850 75032 -31489 -88808 -192056 79283 -141806 48541 155631 -65570 138515 -310942
20571 153029 -99130 59728 -66480 124815 189322 275272 -112505 -140229 -161522 -219480 332695
20559 103661 -166083 261378 332898 10587 -192322 -283436 -118233 24194 215192 -263783
20548 -7259 90401 -182432 39134 43758 -247656 -182046 -196578 -122191 -45340 -96980 101861
20536 -573 43558 -130973 -24544 192024 83280 -48511 256611 -222576 -39661 -185874 -156901
20525 -156901 -330254 -146364 28373 -201300 43975 5883 -159070 -49140 -135513 68607 -18382
20513 269033 -4291 244375 -290235 -167670 -241289 -111804 -85002 146538 28245 -133330
20502 -241322 -216637 -154271 -295234 -338596 95353 -210080 77786 265227 11055 129585 190082
20491 190082 223091 102941 14989 -112789 51415 133988 -222507 -340791 61885 -16006 152373
20479 95710 65764 -269609 -58333 329043 114159 372797 -55235 2813 33524 39493 -240626
20467 -39435 -18217 -115297 82178 112165 251243 14965 11974 -148988 -72314 317259 -27308
20455 120800 209167 -82411 -371812 -49724 -198544 -147705 -86753 -150442 13154 -150962 -81649
20444 -81649 56042 -36208 -62520 56984 -76231 -181982 206288 17075 212650 -169995 -57979
20432 -372 -34915 -178522 -238314 -14983 -199836 92522 472893 -70223 73106 -233066 139866
20420 -73479 -56172 201783 -52946 -37488 -42163 -299723 312930 -145333 -259514 214008 -45895
20408 -100598 17019 -265298 -147793 91289 62834 -353200 8026 -61746 -58301 -171116 -58310
20396 -102330 -95908 -147579 -159579 -179861 -23453 -366714 -262324 -53276 -70124 -273171 -170941
20385 -170941 -123330 -314057 -43492 -45566 -11843 -241844 -146036 -165426 60586 23697 -108633
20373 194208 -162186 -2086 4371 -242085 176866 -136733 157806 -214602 -235059 -177762 -71724
20361 -161934 -145444 83895 -84654 -100512 -68085 198234 -265641 -203922 -20426 -155164 194937
20349 101282 131897 52077 -58642 -181632 -128566 -19747 -157747 -43717 -125055 217405 -259317
20337 -61010 -303523 -9967 127209 -49945 -271918 -508328 149751 -277387 -141499 84829
20326 78107 283178 132142 -96200 55091 -70125 -68280 -317276 -317344 -262186 83324 177327 -34355
20313 -38850 152606 52827 -91056 -280087 -40405 -20345 75027 -13616 -54478 -165789 -35491
20301 -161617 -72952 -356145 246621 46944 -26900 -327418 219381 -209888 1885 -59443 -156978
20290 -156978 -13758 69827 35179 -272529 -91624 22594 82790 -179190 -462777 -21747 -340300
20279 -340300 -142498 -147087 -73184 78750 -896 -205225 23309 -45327 -387828 148441 270623
20268 270623 128701 -443840 56542 -200953 396366 328726 217935 88407 82183 -167135
20257 -126018 -117681 -195342 43039 -114431 -178229 -114390 -148736 -241051 -85847 -5809 242361
20245 141932 5803 -84763 -37774 -377172 160873 256082 -10525 117352 -136523 -172786 -69337
20233 -42613 211459 -35654 6619 37078 -159745 -27231 158191 78633 -291176 192438 -67684
20221 -261242 -58998 220330 214918 -96710 -90472 124463 105998 -133841 17797 -377107 -98505
20209 -110356 187242 270955 -195101 -72652 -138904 -212999 -59308 109886 -189771 -86650 62003
20197 -246753 -281610 -123176 -129865 -186160 -343464 -181905 246657 14966 -297749 -24215 -193947
20186 -193947 -166380 19789 -150022 -127736 58884 -151404 -367856 -45244 -14769 -1746 -1405
20175 -1405 -107284 302527 -135835 -246714 166023 310528 -110574 -157972 -206628 -147307
20165 -147307 -406203 88608 -163801 18867 31111 -172473 79468 -252331 126229 65880
20155 65880 -191404 74536 1643 -394151 18637 -450570 293317 -125440 -3110 99139 -49339
20143 -54206 -187793 47486 18120 -43854 -10546 297918 33877 132906 324563 37547 -90430
20131 22857 -120807 122386 112422 -34882 -50825 -90022 118756 -206605 -158546 102647 -165263
20119 -69485 -97020 -131778 190843 11149 -185344 -141552 -17559 -212363 8487 183924 -153372
20107 -44384 -137003 -42573 -129322 93954 180305 156310 156095 -25114 -42151 -85296 297411 121986
20094 -308545 -170270 -224508 112929 181685 50488 -253472 -151774 164548 17656 160752
20084 160752 -19036 29952 -252637 102292 174708 -85402 -64594 -118116 -155823 -112144 73496
20072 34228 7974 359208 -44718 104978 220086 -39267 -16683 -48015 60786 -168908 107991
20060 25903 -280911 -79852 -163926 -172046 91107 64375 -47630 129823 -135996 -106312 -237421
20049 -237421 27585 34202 1659 -16832 -152809 273503 21193 110721 148284 65248 -383867
20037 -144402 -100078 -5185 -290955 -196362 -527204 17557 -65869 -78604 -152124 -198195 95511
20025 -122772 -105018 -247931 29993 -24309 -15024 -147152 -82764 -1465 20299 -100996 -89812
20014 -89812 -179821 -266005 -402454 -59427 -208554 -233770 -29403 82009 -100120 131596 -207270
20002 -334295 231240 -196968 -140892 209152 169151 -48565 257253 267677 -135629 74989
19991 -455350 89233 -290285 -175363 -343585 267547 284977 261771 -5379 75636 -209484 22397
19979 65346 -159109 166051 188852 -104529 -64961 -159666 -79431 -83230 -160754 83125 -42464
19967 -60476 71299 -135656 128070 -158288 -114969 83043 6300 29923 -69493 364160 -46586
19955 -271509 58896 -198029 -74785 -207159 129276 135418 -107977 -198914 -257427 -162105 31947
19943 -61735 137395 -146000 -304491 16701 7640 -131398 140898 -55714 -284658 -133677
19932 -189745 -271821 80352 11714 -47847 -60424 -110925 -180786 126375 -179773 -95726 181531
19920 113786 -169858 -187943 89544 -52958 -39997 -350024 -248824 -266776 -118093 -141399 -208881
19909 -208881 6029 147229 -213071 79167 4866 140339 -31878 77348 -43133 30515 -58257
19897 -12314 -91231 226023 -77957 -195175 342077 -191409 -314913 118588 32640 -26123
19886 -17327 -236389 -64938 5836 -59515 -17221 -89690 6017 -132332 195486 -143098 -7065
19874 76243 -289320 -39606 94770 -95956 51792 -324950 216751 -197524 176067 -224438
19863 -253247 -223530 -61871 -177947 1991 47949 9694 349959 18062 -144420 94414 -51939
19851 40265 -315253 250740 -525425 106222 -175005 -327743 -94424 -11773 -15030 -180618
19841 -180618 -86652 -475367 -139546 -64848 44495 -192868 134813 -106369 -210669 -304344
19831 -304344 -109568 -50016 -143481 -7912 -352365 -4836 293663 -72249 -196996 -34841 -108703
19820 -108703 335078 -203353 -108131 -82685 32563 -80593 -555562 -332937 232761 -355697
19809 -96765 -16731 145850 -66287 -7613 -74459 27500 24571 -14286 -21332 -238795 -442031 -87474
19796 157148 129672 7209 69148 -157299 79457 -3682 -95699 256821 91486 187656 -235 -132678
19784 -132678 62848 25241 -48709 -171397 -95711 -52008 -159312 -112047 -108370 105048 -188096
19772 -183072 -160473 -136847 -3317 -73254 139869 -218748 234049 153143 279848 -278180 21078
19760 172155 -374202 -205882 280682 37235 41673 173285 -287827 -338611 60255 28178 -104628
19748 -3935 -43419 -181710 279992 33126 -338405 116493 -229331 -8813 103723 -256308 -23799
19736 49647 -93588 8833 -125951 -36388 -111964 173916 13295 -424805 -40251 212513 237456
19725 237456 -140227 -32666 -141630 -205677 83165 18595 96886 3716 102818 2588 -124424
19713 -67790 25536 -78576 -252039 -21053 -176262 -113015 111493 -231464 -381838 90768 -182484
19701 32400 64759 -168050 106964 -167884 -122432 -146439 -134385 -240371 -29916 9669 -36968
19689 162936 388516 113237 171104 -85275 -84564 63028 -96585 -220282 43193 241776 97006
19677 -59670 339230 -408333 116635 125692 -116967 110423 -10609 -182313 -101766 -73268 -164927
19666 -164927 49009 -136099 -240683 -245548 -21395 22602 -1373 47908 -3404 -353425 -69197
19654 52642 134975 -322476 28561 -125587 -57351 -177000 106191 -241500 -83246 -122162 -219150
19643 -219150 -129448 -281142 -103818 -55040 -34520 -26511 -83004 -258307 111995 -88609 -29110
19631 195635 -221181 -86889 156384 -1520 118214 -210249 -284520 -9087 105369 -107832 -176201
19620 -176201 -89376 -196350 -213330 68810 -70274 -538810 47725 193955 26144 -88484 34123
19608 38719 -225925 -66541 164600 82810 -266902 -420710 84805 -227399 -42895 -33996 -55192
19597 -55192 101439 24273 21182 -131867 -359942 198180 -326660 -92929 -224546 -2914 -56996
19586 -56996 -17167 -100385 26456 47145 28416 358007 -116186 -106575 -152575 61989 -324744
19574 -25960 -112522 39000 -232226 -60031 131036 30543 -297600 -512349 -22453 -124856 -60153
19562 -242 64976 -164377 -100470 -240931 3779 -93712 38313 4938 193835 -267445 36548 -216332
19549 140036 -225899 -250967 -61150 -92148 -203363 -294839 -210023 -102398 -17634 171227 -468527
19537 -240959 632 117540 -107809 -68216 -30756 155590 -344558 -160101 -319717 -326310 -151684
19525 28618 -357799 -186910 281078 -37431 225103 240251 79437 19127 -115084 -86896 -79438
19514 -79438 181799 -295150 1591 11215 118285 -143930 81588 -19898 -271514 212845 -167618
19502 313161 -450495 378832 124527 148515 -166164 17779 -178177 -212934 -192931 48804
19491 121090 102130 -3853 -19862 -131361 -277687 -394153 -131801 -94304 -52669 149537 266680
19480 266680 186646 -149103 328060 20083 -3004 -150766 90045 -78085 -178615 -180107 -327502
19469 -327502 -152993 -610 8866 -61136 -13813 -232531 -199657 99348 -150011 -118600 -40594
19457 -239087 -85190 -188301 121469 80524 -47965 -284683 -102672 -87361 -208378 170518
19446 -246661 -197691 144846 169138 -1621 29437 -103112 14339 118004 -3021 179788 147650
19435 147650 64132 -326177 137248 42955 -18159 63464 -137414 -144971 15214 -6119 -203152
19424 -203152 24177 8850 -212211 84754 -6402 -201600 231488 -248734 -73259 -210410 -36582
19412 -18610 -156685 -108401 -132427 -138924 13486 -126595 382708 17325 190363 -2660 -207105
19401 -207105 -210440 -128334 -127947 34772 -231630 75934 -157288 -149148 -31716 -2754 -252443 67283
19388 43824 107785 81308 -732022 -88549 -2463 98719 -212860 -423184 -178998 7901 -185929
19376 297603 127425 3300 17903 -178493 51728 193383 65093 -181003 -443615 180321
19365 -174414 -504550 -121998 31627 -203255 -86845 16559 165366 274991 -235210 -147492
19355 -147492 -265827 -38940 -109950 -90966 -181874 -191351 73370 106744 60084 -260737 -92686
19343 -81236 -39662 -85185 33381 151086 -341513 -227882 -121555 -417711 14766 -118316
19332 -657723 142698 -202379 -76207 -64644 -227430 34742 144136 14901 -136301 -131537 -308835
19321 -308835 -81815 -139495 -477018 192745 -120931 -48716 298153 186166 -166549 123097
19310 -47575 -27362 -66336 -145394 -184177 57977 -178039 189117 -225010 -10521 -202797 327792
19298 139011 -111519 -253538 132974 -16759 -306365 -11037 -190561 104949 -68027 -33168
19287 507929 -318626 -41088 -181990 -92120 132224 -179602 126576 106895 189259 110155
19277 110155 -55897 136830 153215 -391938 -223319 -102971 -131959 193927 162185 -228254
19266 -115057 -157600 -51559 -220205 -32916 -30546 130974 -231212 -153935 -388241 6749 117395
19255 117395 32512 12253 -367499 124094 24388 -50081 -279107 143578 -86215 51354 9110
19243 -56943 -442730 66274 -90432 -260485 -207312 -631124 148939 -229904 -342341 -166081
19232 -231891 -147141 77515 -348082 -53231 197039 -51385 83807 -22652 -61946 -543156 -190872
19220 130339 -128906 -12631 90259 -41118 -107524 126691 -180292 -116200 -166004 -157684 -73876
19208 100686 -420485 -201651 -199584 -44422 -17730 164602 -273179 139797 204734 42671 -323595
19196 188396 176730 -16688 71126 -19623 25543 33126 71728 -99313 -117795 -324782 -90148
19184 167788 248583 -194477 -348846 124674 62570 101444 74323 144292 -292234 180870
19173 -202625 112697 -173787 -126518 -36473 -437640 17047 166781 -58381 82630 -60550 -205795
19162 -205795 8241 -49565 18485 57967 75768 198400 34667 236014 -99505 -141666 27658
19150 -22894 -155927 -10631 77113 -158600 -287214 -157807 98668 -38661 -86095 -82993 -142906
19139 -142906 328047 -343586 -75483 182441 -225481 12648 14417 -115561 49080 -39941 165619
19127 41149 39195 -14246 -238419 -81251 98892 297173 -5092 -294149 166131 -227658 -407764
19116 -407764 229659 -173723 290613 -243346 -126650 -244910 55206 -14832 55320 112316
19106 112316 -196023 90731 188650 45013 -357650 93663 55793 2709 -50093 -55063 -95290
19095 -95290 -4632 -311276 22794 170094 225362 135995 199923 -300419 -625 -70606 -133483 -337982
19083 -337982 -6084 83441 -313813 -233481 27059 -286891 7337 -192088 -216245 -401869 -276652
19072 -276652 -2810 -130528 -22507 -28754 31313 -244075 -270319 -200904 -73077 -52530 307565
19060 -259804 178727 52226 171509 -487033 1692 -87879 -99429 157877 -373415 134033
19049 -269885 -358425 -221760 -58191 55813 140196 131207 -140150 -1838 96536 -15739 46449
19037 -9988 -260103 251486 19014 -29851 -23472 58847 155167 -63728 255258 209595 -193115
19025 96047 78641 630 83564 -71326 30134 31212 155119 67935 115067 136347 183342 185211
19013 185211 11895 61357 149478 50513 225737 -123389 -154947 -19127 -153451 -469784 -131363
19001 -33933 -210911 -57674 46714 -62240 -26913 -256966 -118011 410859 -313170 -243555 6998
18989 -164215 -133493 -280224 -247729 -24503 -108976 -44775 -23427 -38705 -87638 -28709 -351262
18978 -351262 -103628 -250822 58089 -41932 -297575 -92189 -36247 -133650 -82831 -365748 7439
18966 -62013 251288 29943 45287 -98401 184230 -57942 161925 -51614 -88095 47562 -12879
18954 -38217 -68724 -83397 -132137 167552 -200454 -77740 42878 53500 -36235 -130349 107284
18942 -29404 395596 6915 -69594 -281215 13137 87704 182421 -89423 39551 93780 -185529
18930 -39400 127069 -101504 294361 50928 -214152 -176404 130609 -58125 134302 56396
18919 -232876 258174 99869 -139468 -51627 -43871 -35654 42674 -399192 120865 -357363 -202236
18908 -202236 -366371 33848 187405 -174185 -150498 -103109 -117178 -108918 280874 -203782 -46051
18896 -134885 -185282 -97249 191459 16491 421007 -244415 -191404 -201951 88013 132849 78099
18885 78099 206700 90450 196973 20865 371343 -206008 -285074 -163392 59528 366068
18875 366068 139616 -163020 -202506 -124669 -35991 244082 -94904 -162613 -58325 -38357 75797
18863 -167960 -400410 80356 125614 4144 -32631 -123952 16775 127252 139687 90853 -36331
18851 -73990 130518 -111213 -41300 -44597 44848 -141337 148148 121142 -36633 128095 -84529
18839 -255635 86305 227162 -225305 -124754 -79508 207671 9375 25022 -146593 -257672
18829 -257672 -42638 154814 141481 -153149 -189055 34398 89970 -237547 164407 136320 -108217
18817 -242070 -40659 49699 -7194 194503 -141208 -248193 -38175 136757 9362 74161 -23417
18805 314286 125902 162991 20376 438367 -228315 -52538 137695 -62495 84301 362310
18795 362310 118770 1472 -245869 171504 -43541 -364211 -108387 164747 -193501 -131303
18785 -131303 85000 -160994 -228253 -70490 -57596 81452 -136926 -150668 18970 -62189 85125
18773 -70546 -83794 -19640 -80281 113974 -344284 -263782 -357505 -192004 7522 228061 -170286
18761 -273610 -165443 80328 223996 -230345 -156281 81695 -338514 6163 -351167 -22131 -30702
18750 -30702 96660 3663 -100251 -171739 67587 -150480 24165 -91621 -84499 102367 -103705
18738 -389216 -156361 -505919 85987 86199 -114838 172199 -233236 -23473 53537 -118435 -47747
18726 143120 -267515 -278378 324270 -225146 111624 -92744 74127 -279150 -204043 -75790
18715 101339 -111640 45696 -64034 -205752 -40610 -149270 128688 30268 -134730 2860 170637
18704 170637 49681 -10486 119935 288191 152222 15563 -95161 -44437 -11958 174592 -80507
18692 -220341 193028 -288783 19167 -231101 -13463 -185785 -178291 -172067 25467 -186929 -336115
18681 -336115 -35567 -9244 -187466 -18820 -182253 -102071 33197 -32302 -379762 -185328 -287475
18670 -287475 -91402 205099 -227023 23176 22026 -93695 -117492 1770 -71809 126249 -63069
18658 -123563 -109860 260360 -505063 -90204 38785 -160266 -57869 -125818 97751 137637 -60310
18646 -296080 18172 284957 26085 -77335 119009 -411808 -352305 29933 125764 -313348 69712
18634 -154699 -177959 35684 -204450 10600 -171607 121918 14461 -120626 -215369 -131860 -114298
18623 -114298 114511 -10627 62311 -219400 106030 313251 -295285 -177136 282064 -161638
18612 165186 -265477 -95378 -115693 -100883 29610 -388483 -286542 -50217 227893 -58256 55126
18600 -148419 -101461 56169 -23997 -111714 -108990 27411 -79375 179799 -28809 127833 -140723
18588 269823 22861 102043 -95307 147005 -134404 57332 -44502 15128 -118975 -58037 -95061
18577 -95061 -21790 -433614 -65659 102364 -31939 71896 -313180 89427 -110303 -204738 -118291
18566 -118291 12603 209458 49863 -212811 18193 -313398 -17226 -30020 59742 -65770 -125788
18555 -125788 313559 354001 323481 13402 390748 -207127 -48363 -383092 -144755 67369
18544 -225237 -132544 12540 -20033 398712 -64089 252724 -56008 90596 202446 237607 40887
18532 -52561 -130014 -20323 -61009 42628 -105670 -183789 196443 217997 72152 118206 -150826
18520 -277823 -182561 -149267 -297406 -12028 -41043 -53379 -197492 88645 -215013 -146761 -32968
18508 -91971 251397 -144219 -78302 -107170 -38829 -229684 382031 -171239 -138187 -146546 -420762
18497 -420762 -193137 -138599 113364 -135941 -301412 -37485 150890 107475 190851 253643
18487 253643 -147250 -308911 62179 -180884 36232 22195 -87864 -32941 108041 -30553 -15878
18476 -15878 -227359 -198749 -113923 -145577 -241124 -7530 -131411 13484 400725 -169304 -32820
18464 420780 -315689 123409 59793 -193970 -280475 90482 -103722 -116926 -97737 -82962 135121
18452 71908 117361 207459 -135890 -537281 -40137 111934 -221832 -129660 -187302 -124719 -203591
18441 -203591 -56167 29778 -67545 -106865 -168172 -158469 146137 157830 -193177 -126365 -169084
18430 -169084 -87533 -79871 -331534 -124799 -64456 -61034 -231982 219049 -75954 9883 127201
18419 127201 -417559 96840 14423 176032 -26344 -245380 50711 -159397 210238 4216 -39972
18407 -174510 77613 16816 -122984 -183897 119944 -99893 147368 -59125 388896 -105217
18396 -438168 -119756 -122637 -44606 26078 204202 -205036 28954 -18847 -172639 -176155 -103952
18385 -103952 -70388 -107711 -265187 306018 -37635 -152765 69372 -40210 -90732 198429 -202969
18373 -89281 260141 18596 -64734 311712 -36806 -36365 -100490 90893 -119509 20901 254776
18362 254776 -194328 39882 -158868 -67848 74332 -236948 -101371 86472 223148 92349
18351 -318650 23519 -31756 8958 -35985 -107026 -55659 271651 266637 83214 -209519 -11952
18339 -351382 236365 -249380 -418781 56517 -5800 83513 -394233 -8403 150711 119034 100881
18328 100881 41617 18021 190063 -119536 342292 -82878 136623 -180574 226090 -249285
18317 -132711 -84445 -323314 -277639 -14517 -392947 380304 349154 -296565 228279 -115156
18306 -42320 -164425 299867 -135062 -133590 127295 -225381 -139997 -105046 60125 102331 -4877
18294 117483 66950 -10006 1018 277230 -14638 -36382 83477 194982 86163 130142 -78487
18282 80837 69269 -50109 -260457 -313596 -316453 25738 -77777 2880 -170352 85400 183029 -52814
18269 -190548 -254035 -120478 -236289 -196075 -450975 23989 26903 -14912 -223907 -35290 -244418
18258 -244418 -278284 -271626 -357631 -128598 -63040 -421436 116930 321713 -110926 -131556 -160862
18247 -160862 -41001 154199 1934 -152771 29338 292574 167235 -191551 106068 -71471
18236 129181 -55457 -15407 30931 26080 248144 49155 11624 14099 -244913 -124842 -67112
18225 -67112 -14332 -146315 220504 -223653 -94037 215912 31708 228135 -283295 -164810
18215 -164810 151008 -50342 -56099 -132198 -49211 -22148 -86918 -47664 103355 -168301 -76785
18203 226310 -187244 393903 -53975 61991 336949 38429 302255 -444683 -13508 -4456 -74592
18192 -74592 149481 104000 -86523 -111226 -225370 160454 288881 -147825 -5910 19911 111906
18181 111906 42797 46437 -12975 33307 117080 179436 -278757 -187991 151855 -29228 123145
18169 -116498 -93664 -43112 -71339 -158810 -109523 -195100 -257292 156608 -235882 129706 -313478
18157 -184158 44331 -375818 138204 57238 172830 -120378 -261665 -144994 213371 -200956
18146 184973 117484 113243 209016 -351732 -16266 157352 203957 -387994 -85275 16770 284612
18135 284612 251758 -43674 31381 93361 100854 -23380 173316 -220710 29603 -220744 229110
18123 165394 -130670 -145022 -290058 201149 41457 19058 -311676 -127466 107272 -34020
18112 -122756 26940 -13744 -90667 -178619 50366 -63300 174003 -187425 -19033 -241511 -197513
18101 -197513 241762 90862 60243 -68345 -90047 -223495 33655 54638 99976 7346 -89165
18089 129558 113871 -8062 -355810 9225 441507 -189154 -127252 -88715 -32602 -240432 -375462
18078 -375462 -91831 275120 -36163 243532 63803 53458 -234189 35827 -268733 -9672 71235
18066 113266 -2613 74658 211479 -120103 -294765 -61676 20581 -237669 -140587 8394 89618
18055 89618 -169800 -58917 -111168 -218264 -53349 143047 36681 374308 216002 -202605
18044 2612 -168430 -56327 167273 -245675 246245 -173328 -112592 -210140 204540 -63228 -168495
18033 -168495 52471 -185966 -209710 -223586 58361 -275619 99136 110723 -252731 123516 -73927
18021 -244378 108687 -148086 75608 -178911 180978 -66812 -25851 -190248 -170127 -255487
18011 -255487 238790 106184 296195 71043 75101 -157898 -38157 -112518 -25770 85354 53010
18000 53010 -9107 -331370 -77959 82024 63173 142200 147746 25583 -27779 -114550 161820 10605
17987 -80172 -155300 -42365 63185 -222111 -172633 55862 168038 -323925 -111204 -23839 217285
17975 123680 -120708 189437 -36504 26512 233848 18498 108316 87059 120741 276379 94882
17963 206349 -140622 -298778 -285618 -61868 177375 116543 -173945 -114955 147567 -117715
17952 52397 57356 -91107 445103 -57039 12377 -166478 -59763 -29090 -334986 -153615 -198983
17941 -198983 -345249 56041 -264192 34703 19773 104194 -190582 -197233 220045 84499 53694
17930 53694 -172777 98755 37820 -151108 62530 -33901 -112548 -182561 -288305 145934 77723
17919 77723 89563 72648 60755 10082 -33010 -225357 -315989 18679 -111267 -152118 68871
17907 3340 -26623 -132567 -160441 86947 -56033 97935 -363803 111299 -57679 -242186 126912
17895 2397 -26030 -84726 -147046 310793 -1182 -42445 182737 -44936 -140511 -154973 -142245 97567
17882 53330 11079 -48191 281504 265783 340234 139832 -163929 -122482 261079 -10225 61346
17870 42374 -36332 -42874 -47276 170089 163891 -201120 -172602 1679 -158151 73097 146572 -276863
17857 86357 143930 -63284 167554 -110075 51817 32695 -209638 35499 -42129 102029 -152020
17845 154504 237760 366114 -59812 36388 -400426 -147983 107776 866 303313 259100 -296762
17833 -135572 42886 -106138 -77521 -30268 -365354 129696 -206113 -134438 234904 -153756
17822 228758 39684 8897 91569 162249 -147577 -188173 119161 205685 -255416 196057 -19792
17810 -101068 86721 61099 -212905 227711 129915 -67434 -88035 224432 10924 -4368 116039
17798 419109 187058 -352206 143263 -282317 277773 15271 15437 -265587 -108962 196268
17787 72974 51571 -1053 -183404 -67138 122996 103072 -261637 -115310 -333183 -39376 -113881
17776 -113881 184399 -82477 56092 -163007 88697 -99414 -49600 63150 58236 -109511 19086
17764 -32812 40294 135131 294611 119187 127606 42326 -195164 -130061 -187324 81151 -93760
17752 192623 -176120 92249 48019 -195516 356156 -136310 -106524 100407 156509 332648
17742 332648 130080 -68518 112569 124251 -119032 136208 -179139 -56110 -110728 -221912
17732 -221912 66720 77147 15475 99942 93198 162244 35768 -65214 -29087 318091 23215
17720 267650 236220 154989 57042 -198329 21590 -294484 -166922 -100323 -248492 -55643 -238209
17709 -238209 55985 -3159 49044 -56276 302440 -109476 -160527 334254 6465 307231 43966
17697 -133364 147051 -32919 17733 165072 -212094 -80041 233155 255328 42264 70358 24666
17685 -22842 29813 -174828 -2746 220765 173749 146305 32207 166451 -63886 -10482 -257344
17674 -257344 232167 -217442 12301 211467 -96192 -43119 -13479 -48589 -26044 8194 72624
17663 72624 139021 217148 -69859 -274027 -52253 -90014 -261647 220629 73945 58098 -64642
17651 26238 88169 -136513 -211880 -87864 -53402 72934 299012 -53410 198297 -6904 -232905
17640 -232905 208848 -111707 -39818 -60932 -76750 144010 196091 73047 -104479 78398 203063
17629 203063 -6223 -99305 -149657 -43277 132298 -141300 -395573 -203409 -169507 195024 -187013
17617 -145997 -249842 311797 -151408 107753 266987 -67015 226397 -218174 -55678 55911
17606 50760 -142760 195769 -94455 -53560 -91004 103441 -24921 157094 49464 -227794 171265
17594 -182573 170101 50634 -67593 103579 194922 -113968 -14660 -44469 -11486 -12826 53379
17582 149851 23530 359530 -3590 335789 253196 539 324235 -77201 -33984 174586 -66229
17570 -29116 -143494 -49026 182979 -80064 -81960 206343 28892 71274 -27905 188991 262099
17559 262099 -1021 110848 -25336 72671 100150 -21924 -62687 68551 249934 203831 -6001
17547 -141075 79605 -91999 -46438 -122765 39814 -293003 184207 -116728 -217273 166157
17536 -256947 200625 17987 105300 -62250 -345980 1379 41658 223961 -40589 -102697 -98578
17525 -98578 383542 131880 -135203 144574 289754 383958 31381 21066 -33436 380397
17514 -24151 205312 -12476 366787 118078 -100640 143063 212879 95068 -15434 -200239
17504 -200239 227451 429063 241645 228239 128279 -6887 117247 -86043 50602 -107424 -4843
17492 -13633 279642 191984 37068 69385 300626 -124990 168858 157273 176877 303957 -42118
17480 -72389 -307129 312597 326071 484780 334713 22470 -21345 83998 -112842 234992
17469 122681 378479 369912 -11975 -314100 45955 79144 209688 89117 -199531 -270944 -5631
17457 237993 226396 10615 322347 -210059 315133 -39731 209883 174792 216594 277197 302385
17446 302385 244575 71309 87604 50319 -22731 -21557 -123371 230116 254856 145536 454112
17435 454112 329769 419253 217207 245479 314473 175989 260629 118343 210889 388891
17425 388891 32718 106738 13144 317215 105468 239061 84466 24092 -190896 202759
17414 198326 194012 281426 -104346 361369 298526 275921 621064 202836 75199 140504 720192
17403 720192 219657 459809 287426 86912 69543 306361 -9573 471235 302862 2008 266178
17392 266178 28902 156583 71706 157377 135713 78589 271336 -201602 194187 276128 329495
17381 329495 194049 309817 31153 90965 -54861 168120 145323 336833 -91227 -83806 189580
17369 83965 378507 -174041 66411 429056 -101333 -177396 82182 -146852 295954 264992
17359 264992 252603 187514 34146 192947 -137875 140838 377787 -130326 124102 548911
17349 548911 85721 144948 99218 -177279 68057 41855 -133805 115262 -56162 126959 282260
17338 282260 43645 31292 -35954 -40567 55646 173962 46968 -88302 153036 59568 41249
17327 41249 37400 420880 67373 80322 -249941 -46868 -53636 264272 181012 58267 51411 -27451
17314 98555 402639 -80705 -56070 -193463 60733 231360 181913 175125 402819 204621 113638
17303 113638 285069 255475 176838 -539 65065 286535 82294 222015 233581 227186 200882
17292 200882 417922 355784 184682 94052 323640 171265 202654 131869 166705 87357 -116768
17280 -243325 -91454 72155 50284 199760 183887 42268 -69176 314513 204703 313293 -180838
17268 64926 149398 397216 349478 362557 246926 -175619 -48725 303525 1692 273808 195973
17257 195973 127400 82286 279170 -143504 333282 192926 259411 325244 140276 196986
17247 196986 477479 192654 153846 138849 3737 537207 387117 290500 36473 242835 132706
17236 132706 -21316 373364 517138 95603 -10662 -69460 165032 47590 -7454 95887 171919
17225 171919 -75159 -7538 219060 -41021 23125 55478 277434 268643 63196 202772 75317
17213 187246 7423 195931 158951 451123 94029 10903 -35458 154969 364210 199809 -36895
17201 109293 232493 242732 35037 327483 114187 169440 302527 488789 -65250 380436
17190 252960 449814 184367 423477 216526 204417 227707 503440 245863 540532 183922
17179 317062 279370 511607 192066 383703 213511 10747 415801 146457 139973 190553
17169 190553 89602 114676 363717 84647 116792 295204 238609 247466 571061 104987 72194
17158 72194 -78978 411365 224888 221129 92580 198494 48323 237164 -71544 -28290 541218
17146 343926 168896 216643 260801 334233 678317 265990 375526 311234 247731 601516
17136 601516 184859 284640 125201 293394 297455 499136 206884 91625 234429 102595
17125 12634 385433 351591 535927 158155 468984 434760 853556 497910 349748 -572 406003
17113 208864 278920 100263 293343 442369 410932 296407 13581 336499 43281 108964
17103 108964 113772 389271 -165555 622739 139764 684193 350062 249571 403196 101276
17092 158473 -34852 383208 221306 543862 66288 421887 315468 220375 441466 286303
17082 286303 193227 466495 416146 44089 259564 80553 245744 328478 282163 421262 260517
17071 260517 553988 583370 -80511 543099 635674 369973 73334 427786 213160 145091
17061 145091 269659 386988 253363 417951 478355 319275 348017 483711 213074 406609
17051 406609 408974 612339 207684 507400 621717 802401 669517 706988 403607 127707
17040 805184 448049 135813 691417 208527 415260 470626 414966 631417 579659 686940
17030 686940 885601 731420 511510 299572 568661 467065 315167 413602 520600 472053
17020 472053 687490 497258 512915 574774 449194 831768 679009 383912 374574 837944
17010 837944 636278 646787 458927 543114 568465 641802 515282 440314 562639 700560
17000 700560 1002067 590703 760779 659379 541643 674242 826402 319394 1114333 691180
16990 691180 736342 537573 623567 574803 737511 424439 1055831 757809 893033 790686
16980 790686 630032 652715 605423 603911 915438 634582 1071058 1075202 909853 808602 1069637
16969 1069637 738198 755704 739057 1025323 379001 906596 1062425 593282 893197 1106841
16959 1106841 859374 369107 947935 750747 978232 840663 1060556 793121 830328 1162277
16949 1162277 526663 1106591 896126 1123328 1175660 923980 773826 909374 979893 1109052
16939 1109052 1378177 737409 1146455 937638 1156616 1193503 1128676 1254810 768110 1032769
16929 1032769 1061825 1179709 1188679 1176040 1553190 1156302 1419801 1158532 1112607 1196903
16919 1196903 1233722 1442357 1269751 1497014 1246821 1079553 1315615 1387626 1495633 1229915
16909 1229915 1220959 1536584 1553886 1527868 1606622 1426528 1098197 1633232 1612469 1287823
16899 1287823 1531532 1388612 1575290 1174856 1586210 1387441 1623186 1576440 2025762 1360740
16889 1360740 1527807 1367415 1485045 1470380 1685362 1480305 1967279 1508193 1970840 1757192
16879 1757192 1842855 1841187 2076353 1568256 1970590 1938805 2328500 2001072 2075487 2007478
16869 2007478 2011987 2267694 2338833 1960719 2117877 2293318 2138368 2604622 2244669 2236661
16859 2236661 2481251 2245551 2710473 2631961 2583257 2279565 2555103 2608009 2777544 2858119
16849 2858119 3034183 2511224 2892275 2601122 2614541 2808731 3067821 3121515 3035076 2886658
16839 2886658 3562152 3250062 3093809 3489492 3428757 3274198 3345416 3475059 3415464 3793047
16829 3793047 3953366 3992832 3884136 3706270 3771492 4137519 4043586 4376709 4067858 4413673
16819 4413673 4401987 4295613 4472037 4228072 4529350 4584668 4875401 4840831 5129517 5161320
16809 5161320 4907730 4996478 5383830 5423639 5739285 5652080 5636279 5923882 6379241 6551673
16799 6551673 6158117 6338677 6552702 6961137 6989042 7144930 7309164 7561100 7528857 7653748
16789 7653748 7675615 7975388 8543747 8601777 8578752 8934673 9024785 9211081 9152249 9888541
16779 9888541 9639577 10320738 10769917 10872729 11143853 11198440 11803286 12145132 12317035 12589379
16769 12589379 13224208 13287566 13981030 13976200 14623775 15329337 15670131 16472853 16651853 17270096
16759 17270096 17715872 18203352 18890328 19826389 20625345 21300921 22186600 22797262 23464145
16750 23464145 24649485 25625526 26677939 27683448 28961161 30311723 31618689 32531783
16742 32531783 34510629 35915144 37453027 39280660 41216348 42812612 45081212 47046961
16734 47046961 49567069 52318545 55114114 57864659 61075456 64289159 68057567 71900068
16726 71900068 75843684 80166632 85098788 89713963 95103176 100973385 106974753 113345817
16718 113345817 119720251 126029209 132989340 140547384 147765601 155138392 162226379 169066066
16710 169066066 175702600 181447671 186815057 191181675 194196552 196354792 196952128 197092323
16702 197092323 195300278 192624555 188761945 184070969 177730329 171819425 164837001 157705000
16694 157705000 150178868 143075168 135624764 128194541 121317886 114292226 107616504 101635679
16686 101635679 95590328 89444908 84534528 79768590 75013222 70845619 66533028 62648720
16678 62648720 59351803 56224234 53098481 50346874 47705548 45184442 43060902 40660925
16670 40660925 38491018 37218053 35396617 33196514 31842398 30394022 29455901 27976164
16662 27976164 26945705 25698765 24602090 23737997 22333337 21891027 20732190 20157695
16654 20157695 19675502 18633137 18142385 17233165 16652799 16127411 15649378 15230729 14338216
16645 14338216 14628177 13528120 13246326 12620411 12214791 12448668 11743974 11231472 10765544
16636 10765544 10758542 10445232 10277164 9822712 9516287 9753588 9186865 8659585 8383368 8257618
16626 8257618 8216238 8128143 7715790 7174257 7530779 7137586 6886026 6669770 6633733 6434629
16616 6434629 6396934 6270762 6191992 5691742 5945208 5542036 5507579 5650886 5265326 5260746
16606 5260746 5088030 4743324 4679881 4815886 4554354 4646789 4299906 4439673 3936826 4214365
16596 4214365 4478999 4277390 4154204 4419722 3893089 3776564 3987171 3536929 3680125
16587 3680125 3549872 3644263 3322823 3468427 3227830 3382753 3146189 3327834 2927546 3036413
16577 3036413 3092767 2933987 3113224 2783038 2658922 2995832 2849248 2736334 2824046 2486148
16567 2486148 2490502 2234160 2507747 2605390 2495171 2426745 2469776 2149007 2081088 2137118 2205191
16556 2205191 2129873 2313557 2136784 2116864 1889189 1919105 1787242 1847921 1967819 1875375
16546 1875375 1823363 2115464 1800185 1878460 1644411 1704439 1675307 1558211 1551479 1892391
16536 1892391 1700068 1853475 1440874 1281381 1236469 1583180 1214356 1320313 1558281 1470012
16526 1470012 1256508 1369933 1356045 1068800 1196579 1240009 1249844 1142449 1355327 1345719
16516 1345719 1280703 1372703 1337486 1649253 1079966 1151933 1409855 1205307 1037864 854847
16506 854847 1289948 1107410 1163931 1250147 1099133 1307125 1049232 945138 838822 795279
16496 795279 1266771 1010417 813099 779594 869460 1044086 1068230 1107896 1004071 1070304
16486 1070304 696052 975664 829423 847530 673250 1103108 781479 741838 996265 637748
16476 637748 753423 869662 712609 801076 893004 859623 996506 702679 771973 777788 647835
16465 647835 575291 552240 787431 804702 951824 927036 821074 748328 526878 627389
16455 627389 709997 425490 643405 713443 662599 888829 638434 1060599 780048 702168
16445 702168 687207 181114 837115 760491 336682 668255 486406 378771 468058 302647
16435 302647 558048 303454 515304 256320 237310 662931 590555 740175 595390 406201
16425 406201 508431 415672 484986 378636 390274 306636 570365 371194 760657 552878
16415 552878 885335 139946 106644 83821 468344 763309 355455 -14364 333754 640968
16405 640968 527878 584935 518946 521369 123802 289630 593678 130351 -21540 440935
16394 732965 375392 180084 302419 530230 319540 735172 113956 631036 709898 384414
16384 384414 385752 307685 316921 354148 511250 330939 38808 31112 413310 580004 95330
16372 325849 293687 340451 174763 438779 414888 347726 423886 467429 273835 366897 412078
16361 412078 138159 364740 302562 137522 271503 433992 444798 177335 339849 187693
16351 187693 98449 457460 400449 376454 47167 443176 236102 54973 337530 333305 328041
16340 328041 283460 256785 381176 477146 421811 469641 45130 58192 -206490 265100 153983
16329 153983 285574 -56343 392541 68431 361917 63229 -95716 421053 252705 128922
16319 128922 70473 228025 30818 184976 393002 -22203 287703 241676 231228 90148 -22574
16307 75987 -629 152891 219619 317450 90194 126167 -102891 371893 253194 -41741 16935
16295 287562 584130 390056 179163 307081 136455 812 19157 106376 210328 -136887
16284 489800 68273 311137 324929 -21189 -80639 -231054 159141 26735 147042 37201 -180106
16272 382709 242638 144319 75209 144835 387347 40034 392632 482363 28175 270818 -48011
16260 106754 74051 203805 67437 -38038 236856 121244 166623 -13609 59037 -58512 33565
16248 323632 151256 118397 -208537 41725 160465 -5238 299412 287141 376552 420977 192066
16236 -106146 -53076 114504 18354 356118 19971 434614 280815 315781 294452 -58033 263275
16224 197771 94711 406660 222788 62725 163027 -93919 100061 190604 185854 350578 269724
16213 269724 76065 170796 183295 -102321 -34745 -64857 119017 363 77483 -151765 101083
16201 115751 47267 -49729 308757 -222722 -123498 316436 10184 234032 135945 -177383
16190 68454 -29993 -57222 -129915 200718 89091 159069 180547 161592 -59215 -211729 236547
16178 120303 324604 331615 439183 281761 9154 29769 -77701 -179056 -251864 143372 -160143
16166 145137 101711 191434 77596 -199396 -4001 176761 150188 132137 213473 281988 284860
16155 284860 209199 -105479 153811 470884 -75520 67523 112144 -459023 60897 -151907
16144 -429377 -4140 -57060 102327 117638 83993 58545 -147549 -82439 274939 31501 59237
16133 59237 -58545 61011 -130700 -83929 -30371 -66908 164216 142986 21496 162307 -95836
16121 -77805 243857 -353791 50668 -48277 164823 -53872 -184224 10750 170351 -1780 189556
16109 -52416 109457 -130364 -33050 230808 -199174 65932 -50162 -65378 121835 -338605
16098 -56654 37136 147111 -29430 157623 -149004 -309358 -56448 167321 143557 170970 61715
16086 126682 255929 219231 149112 192929 56738 -33526 273323 -81103 258337 -29025 -341274
16075 -341274 227089 34773 -151696 186775 33017 178863 106663 17322 41639 -36495 65079
16063 -31114 -73457 -76748 133452 368451 -344558 32968 -101174 -265185 -86309 249707 -135590
16051 180625 -24542 68898 -334680 -18134 -54465 -88204 132998 10674 97694 -74708 158820
16039 51473 231369 36306 3119 42666 -340611 293339 -77103 -362140 187287 50861 -154206
16027 97568 -422807 -171901 64172 171015 57675 -136811 -403459 -210019 44059 -205487
16016 -119965 -203336 132498 -210740 -35610 33466 -297718 121309 16905 -241918 27753
16005 -27041 -168963 68495 -129925 -72954 280778 312236 26426 230642 214210 -254522 61881
15993 -93318 -338282 -504 -64440 -153970 -201686 120458 148491 2733 103795 -112283 362063
15981 -107432 42814 111755 -145449 31471 -111958 282707 -79314 -385792 -201888 304935
15970 -55595 86865 490184 -43830 -40293 135873 102045 251888 -64557 -91198 95620 130623
15959 130623 -191336 -398197 271386 1614 190320 -225706 36297 325085 -283620 223849
15948 -166540 -235031 -361825 48111 116547 -87260 -63719 -331045 28451 -79145 -23223 190497
15936 159214 154577 21365 184360 386974 105645 -209912 384811 -240012 -157149 76436
15925 -448371 158138 -34432 62484 -65828 155402 -81984 -302493 -65498 -178029 -65007 -1978
15913 -162918 117387 -96658 196010 -164262 -83303 -31580 -202314 -164069 164723 136062
15903 136062 -113514 -68910 -165696 -395931 -279451 -66653 -30243 -155735 -23725 -150197
15893 -150197 75286 128002 -95215 50534 -123617 -142300 121016 -165170 63859 -106837 -9278
15881 144988 -13044 -26548 22768 30123 -52751 -80955 380955 -156378 163831 -424343 113686
15869 -47591 192973 -43102 -325040 46960 -11125 67383 356521 -88872 102445 -60217 -173972
15858 -173972 79616 326634 107630 57524 -272572 -105650 -177805 -183543 -217489 -207628 -81998
15846 -71659 -224766 -218771 -9670 129126 -402151 10836 76017 -257017 60126 268643 -1526
15834 152341 -100761 -107599 146956 126924 244827 202239 61058 -314038 191053 -171440
15823 163821 69528 264169 -91722 -200643 401193 208551 -357748 -313542 206968 43827
15812 101134 -142201 -170648 -198540 -181296 -62565 -21312 -444392 -243858 23140 266553 -81535
15800 -216581 114859 -18587 -234996 109937 -171917 -242881 164941 126181 59723 -338327
15789 -231420 -191571 -57017 203476 -77046 189019 -204270 162255 81190 -115758 50261
15778 18328 -339076 124083 31804 -104344 104694 38144 78666 -149548 249610 228527
15768 228527 -9918 -82067 -147452 -260518 8888 5911 -107585 -229569 46947 -164635 -78475
15756 105399 191024 -243889 110229 -282477 163283 -17528 143329 -19568 -315309 -12967
15745 -74395 -159986 -256486 1788 48424 -150493 8139 11950 305379 114810 -62463 87801 -87473
15732 -92068 56801 -114126 87220 172373 187112 82905 -61288 -169562 -162278 -84431 494 124161
15720 124161 -236923 -91761 113345 29259 -374524 -237555 -106240 -55875 -226129 -159015
15710 -159015 -34125 258385 119528 40716 64751 -158185 -212178 401821 -83309 -174577 -287434
15699 -287434 -35346 69271 -30724 -8704 -269511 67495 -278596 179772 223942 207733 -60650
15687 -140409 88773 106311 -118864 166250 -47820 -79721 141189 -96684 -143014 65537 -113954
15675 96390 227318 -349390 68934 -28563 -136269 169676 147386 -69890 -253221 103677
15664 77249 10839 -161410 -172177 107188 -129644 -150703 -70506 -35279 121954 -115411 165682
15652 153747 -16039 -44539 23596 -67799 78182 -387154 -303558 283075 -163827 -123856 -50519
15640 -38794 -90144 -99779 -96296 76159 40925 -28610 396390 7173 152169 -371556 17845 205785
15628 205785 12629 -216283 40907 154542 65348 356727 46103 163161 136693 -47736 22366
15616 -209016 73980 -31105 262202 -23511 -296391 -68574 76336 -51606 -292311 139188 59169
15604 -28635 -126024 -60916 -142538 287189 111956 -141256 18531 -164109 -379286 -290896 171379
15592 -55932 -281753 -142774 -6192 92301 -98968 -46337 -110725 -92356 -201328 -105942 -14342
15580 38338 -167271 -52321 11491 149202 -346175 -34453 56839 63194 -78114 344136 140710
15568 -2048 287579 -134197 -6583 -72689 -201606 336826 126773 -81524 421532 124777 -242998
15556 20587 327089 156268 -463432 -133375 -53131 -63936 79307 -73276 -58069 105690 -274879
15544 20318 -36705 -72574 -47091 109169 110232 -75748 -101793 -36252 -123454 -166256 93321 127430
15532 127430 -155852 -155402 54887 607 63170 -44794 208291 18442 199189 -18682 134572
15520 -375937 54092 118327 -90105 -314204 -80071 -151511 48429 -107717 -57364 -190137 141667
15508 238139 -147505 -122186 -57542 -71691 275435 306023 124467 -52901 378322 238129
15498 238129 54725 83247 139442 77581 -260675 -102386 28850 106762 -242544 -117947 -278369
15487 -278369 9772 -48590 -63137 3920 80689 182091 -59439 211965 -243134 -13078 -109782
15476 -109782 16131 -43042 105588 -95953 -193643 62321 54477 -212065 97326 74118 -106139
15464 59551 -195545 -217431 -97411 126024 136092 -95646 340345 93775 6303 249043 -23739
15452 -56693 -583 440807 -25923 246387 -18719 75312 304303 247989 -73807 70415 32248
15440 280452 6790 388731 164656 -90724 -61526 -91585 -91684 438618 -101963 -24113 88395
15428 -82036 -52658 41406 -70320 -57463 76410 -333532 31345 25562 24795 -42492 99943 57997
15416 57997 43563 125826 101564 149209 -162934 150038 87877 120105 -280473 -349621 92677
15404 -189954 172505 219250 226629 2453 139186 342298 -7885 -3101 62986 9381 -262820 146260
15391 22242 -171979 103539 -257446 -18929 -164190 -69446 -276153 44672 -104501 -115841
15381 -115841 -120487 -121288 14945 -228336 -37826 -106213 -267986 57854 9656 10425 90955 37559
15368 19571 -111047 113036 136727 -187673 -191812 -97053 -93421 -132756 72757 203210 -84823
15356 133341 -30016 -330370 -3797 162877 -217688 -265770 106060 40768 -277153 50660 216504
15345 216504 -9537 287237 255375 152023 28587 -54305 327492 -82853 246436 352775 57567
15333 137452 36906 102853 121084 95664 -204268 -97966 194001 541317 -11672 -114914 -187432
15322 -187432 16692 -158428 -268128 163059 115723 -104399 -128656 62646 -182321 184129
15311 162179 20829 89849 -20399 114633 -81303 376770 -59876 -220339 254638 -93534 114157
15299 27307 146686 220883 -28386 -186551 50459 212577 90997 133985 -67712 145787 94435
15288 94435 230711 -130885 409144 -130981 -203376 131554 99680 -38701 121721 27618
15277 -1279 -33952 2471 -110905 -107830 242991 55481 88809 72130 -231399 -89000 -216382
15266 -216382 147033 37908 78042 265177 156775 81895 216477 40273 -178854 -82365
15255 190343 327593 368703 350603 283915 76689 69340 21228 -30709 -92387 314871 273904
15244 273904 -320299 45288 398018 -41393 185119 476367 278589 400253 -29667 797617
15233 947304 1019612 914278 1275322 448781 151724 560489 76037 172595 44610 70280
15223 70280 69719 134369 27659 91184 -111192 1589 144897 79544 123414 -79663 174913 42187
15210 197651 104487 -100759 -96053 181986 82388 108778 38563 -452937 109473 238047 333894
15199 333894 -79410 -55707 -242293 -48987 278633 -337317 7824 -162841 -175082 215684 -1726
15187 -102553 358793 163598 108053 254105 -201384 -344504 -63536 59193 205404 -321595
15176 95648 -240874 -19156 121301 243418 -13361 146869 -85381 91025 235726 164271 79865
15164 -37897 112146 7971 243577 170735 -11767 -15553 -27650 71885 93829 69902 -207759
15152 -261089 282010 12300 189145 115562 -140752 -132726 575760 91677 12141 -115896 317974
15140 286937 43318 111520 322502 469667 341807 -32819 231566 -42503 175025 133044
15130 133044 322055 -38981 276071 -133612 90668 40129 -116655 -182120 221595 170756
15120 170756 74396 207041 -8148 -121950 296836 256142 -108263 190177 -55070 31446 90476
15109 90476 220953 187317 180701 296741 173874 -166784 197608 -28459 7465 -183242 85642
15097 77792 34515 203480 39761 340394 184737 272340 135353 202781 245266 12631 283354
15086 283354 289849 41126 160203 76059 88341 16572 -167093 -13069 122638 91716 332481
15075 332481 128524 -66791 313011 219980 105512 49464 175016 334851 371658 150206
15064 76309 350 327997 -1671 17111 111873 65675 370709 312410 271061 -108309 -50661 15996
15051 221571 87539 39748 181792 128052 -34439 -139844 219101 51086 70463 189824 198783
15040 198783 237544 247320 426255 221636 302841 141162 422678 -258817 61430 298686
15030 298686 381580 104090 173518 9692 256468 378565 547014 229070 -172259 383558
15019 -38769 233031 -47078 -23538 -88124 508179 252375 446731 303145 -15151 321314
15008 306409 659489 613056 48724 38090 412477 174741 244531 289342 95438 218657 70332
14996 88367 104893 259576 450035 31387 17265 355086 220376 388304 123110 474029
14986 474029 142631 169770 261300 512467 270997 377313 409377 61628 -6185 75196 209759
14975 209759 81341 228146 253563 204633 -12964 21945 162803 197760 42012 167424 366744
14964 366744 292893 267762 26928 71922 252881 389304 363308 286420 267562 243035 409890
14953 409890 229540 -72154 20984 126505 53365 306742 390993 293639 -157060 281395
14942 227351 434710 173269 519886 425101 -107602 650421 283848 506656 468063 458348
14932 458348 238386 342496 -29961 167831 223832 105913 623501 364655 114595 356340
14922 356340 666445 190446 419936 176001 426845 333086 343436 255405 132141 272620
14912 272620 283418 226018 -208756 381009 362919 40956 230451 163974 59604 215654 289278
14901 289278 544847 209282 522675 335294 380559 148471 453523 -173969 -67328 683058
14890 260452 573602 419886 314367 670945 585805 375620 441456 156767 288974 353727
14880 353727 248518 272190 517330 492789 200798 303782 52251 499577 265440 215579
14870 215579 406990 345016 409020 236605 181733 469730 327463 288749 269472 332647 389505
14859 389505 625005 244687 523483 225038 520156 517102 276716 381850 229722 194508
14849 194508 444160 468886 681186 625324 454349 455453 474436 704096 559635 293296
14839 293296 422083 158943 398849 305908 475868 312063 211222 564598 84047 645090
14829 645090 180196 254444 488757 567660 376517 501280 366850 667641 646964 309800
14818 467247 509419 565480 134627 658264 95917 612015 641684 427225 752228 326040
14807 317546 122405 444426 626259 325464 371547 685213 576408 671790 651589 398946
14797 398946 554309 514503 782960 708631 306270 407532 407320 698830 666917 468180 653875
14786 653875 559537 552659 913474 614113 710461 759607 469222 355706 762914 835856 590508
14775 590508 433069 552698 494023 448681 536783 589482 586448 839921 940091 704063 223679
14763 639789 453965 627193 687969 398816 750235 671646 860992 853429 824150 844139 853217
14752 853217 702625 958091 976020 795924 349655 700016 1212527 546998 555177 852193
14742 852193 726897 139946 740397 316882 959560 747372 419045 314199 800597 982387
14732 982387 863664 818316 453810 855487 711892 930961 789009 814244 961391 724472
14722 724472 554250 691728 779328 646326 682454 649198 755533 824249 922977 361439
14711 869500 888351 698626 598966 747062 745361 1047188 777126 648844 753674 953054
14701 953054 1118056 944680 1028886 1013155 618574 582648 867362 507525 964908 401791
14690 677902 687233 1109376 780553 1208324 990559 1172647 959055 814590 1170369 1025636
14680 1025636 767092 730051 815125 888593 1098575 1281782 1197430 1033391 1067174 1212093
14670 1212093 895502 875075 965005 907097 978960 860956 1067000 1139982 1242213 1005465
14660 1005465 1064168 1277878 763047 1163510 1349491 1296633 1152826 1218902 1205489 1117946
14650 1117946 1293321 1055127 1527625 1325232 1093651 1004221 888873 1451189 970733 1240975
14640 1240975 1069911 1174904 1214399 925051 1104946 972098 1205330 1519351 1268606 953396
14630 953396 1205906 1438472 1383458 1416644 1117892 1236650 1217200 1213998 1512215 1396492
14620 1396492 1475594 1266650 1486775 1417050 1466987 1277619 1384031 1445828 1588125 1690220
14610 1690220 1652232 1395370 1492579 1580037 1564535 1645007 1341865 1533066 1634803 1635217 1812224
14599 1812224 1593084 2010549 1812214 1345762 1601652 1634381 1799219 1708586 1641275 1814251
14589 1814251 1584023 1763009 1380382 1406423 1779520 1695066 1886171 1655810 1885115 2002683
14579 2002683 1701591 1962289 1655657 2246091 1804888 1899134 1910520 1984933 2188466 1967909
14569 1967909 1923554 2175504 1971547 2264221 2008796 2036037 2002890 2248870 2354824 2387444
14559 2387444 2333642 2340357 2720836 2287841 2359070 2320342 2378926 2301537 2637910 2751579 2728990
14548 2728990 2839910 2948165 2890596 2974167 3154140 3663607 3183270 3936792 4053918 4716600
14538 4716600 5010038 5782471 6680782 7942457 10103160 13942554 21219878 31657393
14530 31657393 32169337 18323516 10794324 7491734 5252070 4241503 3518575 3092902
14522 3092902 2410333 2719098 2533235 2424489 2371057 2337937 2510561 2295143 2293195 2370167
14512 2370167 2095510 2516343 2481487 2531871 2393410 2451939 2408139 2720650 2893366 2848815
14502 2848815 2998716 3193287 3044105 2821205 2829174 2823293 3070491 3148950 2743097 2953649
14492 2953649 3032366 2946728 3122987 3442919 3275267 3256530 3517034 3407281 3349879 3317253
14482 3317253 3228714 3395254 3733641 3759831 3514241 3685495 3530721 3733825 3589880 3813625
14472 3813625 3550039 3889979 3813710 4156336 3926194 4006681 4433955 4057757 4393956 4446493
14462 4446493 4230071 4439090 4456328 4412943 4529050 4850835 4396510 4707784 4601890 4603125
14452 4603125 4550174 5301878 5147831 4900407 5171132 5480178 5212657 5251559 5081337 5365498
14442 5365498 5579718 5375293 4932707 5540663 5859116 5748351 6007857 5723859 5764894 5919281
14432 5919281 5618746 6250120 6232824 6393507 6488060 6681970 6539638 6624060 6489399 6826460
14422 6826460 6525943 7073746 6790682 7224208 7129195 7364050 7240864 7609622 7489985 7558592
14412 7558592 7650937 7806648 8079929 8064574 8264185 8606438 8368446 8344011 8789616 8796231
14402 8796231 8651373 9092864 9196343 9260981 9247321 9370269 9688597 9967152 9880325 9997651
14392 9997651 10192809 10457791 10452355 10911496 11029482 10976963 11291458 11264649 11246261 11857186
14382 11857186 11902271 12052314 12307400 12657886 12852939 12915026 13139066 13702159 13705493 13815512
14372 13815512 13954797 14844495 14549753 15199094 15745920 15424930 15922151 15824746 16442753
14363 16442753 16789218 16823646 17328615 17541931 18324858 18370147 18624644 18982942 19579238 19441904
14353 19441904 20434568 20503745 20976841 21445586 22010990 22361326 22684406 23469185 24068728
14344 24068728 24675987 25113441 25470397 26026573 27078829 27591148 28222456 29115556 29530662
14335 29530662 30331386 31107678 32095976 32837347 33576041 34332272 35229960 36626059 37412859
14326 37412859 38337258 39730097 40320619 41812394 42835188 44112260 45178701 46645672
14318 46645672 48223440 49669123 50980191 52632586 54186472 55909370 57909895 59840156
14310 59840156 61860051 63666419 66184695 68132361 70447263 73086685 75757521 78332162
14302 78332162 81440589 84367598 87621121 91389507 94856580 98399739 102221273 106264910
14294 106264910 110882432 115203632 120231300 125400116 131015689 136536692 142440686 148940935
14286 148940935 155407320 162883537 170094637 178282898 186365080 195380751 204582059 214243236
14278 214243236 224388538 235523836 246792442 258825571 270870019 283536356 296469560
14271 296469560 309960149 323116021 336356723 349506385 362207070 374416469 386587904
14264 386587904 398391868 409009367 418682949 427037212 434952697 441532909 447599218 451555013
14256 451555013 452851585 454316079 452400793 445851686 438627773 430123712 421166250 412003085
14248 412003085 401472717 391235549 380258581 367318611 354559725 341697148 328272878
14241 328272878 314807094 301746519 288743358 275423179 262451865 250220904 238261143
14234 238261143 226336623 214873140 203904622 193668489 184145752 175480513 167327632
14227 167327632 159341708 151813017 144893534 138443892 132465901 126845757 121293010 116274253
14219 116274253 111286385 106761605 102476295 98630010 94629853 91117070 87387035 83987420
14211 83987420 81158395 77783506 75391877 72572002 69763849 67508949 65337505 63376190
14203 63376190 61043927 59104991 57094857 55377789 53904486 52207090 50366127 49153734
14195 49153734 47320597 46100909 44757989 43993171 42398115 41634817 40202360 39043153
14187 39043153 38057209 37078452 36117263 35509575 34215203 33287636 32247893 31886088 31188419
14178 31188419 30380376 29629145 28447190 27999395 27610422 26722769 26136801 25294906 24737842
14169 24737842 24605325 24129873 23441278 22814045 22491101 21976641 21397809 21024857 20521765
14160 20521765 20268206 19763598 19735801 19016063 18668119 18236285 18193204 17499780 17227636 16924753
14150 16924753 16637399 16507854 15918590 15895499 15576077 15276101 14971909 14617447 14341149
14141 14341149 13915200 14091745 13697097 13344571 13303013 13217281 12725739 12917328 12544077 12261782
14131 12261782 12185427 11626021 11751146 11408368 11104634 11023354 11273770 10675901 10579084 10391818
14121 10391818 10455973 10671674 10163155 9897763 9702087 9798039 9097318 9003615 9184985 9300555
14111 9300555 9198600 8658617 8778616 8574383 8361843 8448642 8444707 8311161 8372186 8313404
14101 8313404 7847654 7830913 7799398 7278744 7419093 7182722 7069674 7102332 7076013 6713433
14091 6713433 6745223 6830390 6716112 6699431 6355068 6624253 6416526 6370295 6351658 6106934
14081 6106934 6334563 6268222 6022805 5940356 5918141 5913880 5454507 5411858 5702778 5507729
14071 5507729 5525327 5437849 5520127 5030462 5361324 5152038 5171059 5012315 5309752 4836303
14061 4836303 5016452 4843774 5018915 4729145 4605297 4796717 4393463 4647802 4430888
14052 4430888 4302992 4155822 4453383 4358168 4465153 4213316 4189690 4356065 4245247 4082789
14042 4082789 4198664 4302474 4071398 3867827 4091930 4294606 3528457 3735492 3577582
14033 3577582 3962035 3525277 3546463 3491168 3533790 3674710 4046642 3207638 3389160 3701286
14023 3701286 3473808 3280208 3441678 3617344 3272081 3698350 3287150 3385611 3189196 3116307
14013 3116307 3292323 3489984 2897856 3072244 2988140 2849091 3104248 2875827 2768645 2949064
14003 2949064 3015291 2664649 2640496 2868560 3063160 2679301 2465734 2641619 2573014 2479666
13993 2479666 2394322 3091628 2543929 2572299 2563825 2142827 2675683 2506202 2504121 2601703 2245644
13982 2245644 2552630 2546323 2834952 3219534 3015681 3495961 4185762 5085726 6426529 9686162
13972 9686162 16092880 26976725 32395261 20910138 14027403 10265471 7580667 6298014
13964 6298014 5036335 4922643 4290966 3825595 3391855 3563288 3525373 3304148 2987184
13955 2987184 2742032 2703245 2863049 2432167 2933280 2376858 2370602 2368247 2756482 2637423
13945 2637423 2215173 2335501 2062162 2298498 2528449 2139237 2110732 2309457 2256353 2203903
13935 2203903 1887566 1956424 1961753 2011186 1935269 1974648 1883780 1951935 2029341 1825187 2215852
13924 2215852 1990953 1755840 1868014 1787859 1644838 1745047 1535216 1439631 1612668 1792508
13914 1792508 2097142 1884160 1985264 1446698 1730822 1718467 1926814 1759466 1513511 1725410
13904 1725410 1640030 1438680 1522377 1527336 1115397 1398048 1459511 1633559 1614169 1499613
13894 1499613 1461504 1380320 1555482 1443405 1335734 1629104 1674096 1653228 1359847 1435464
13884 1435464 1429746 1265222 1639421 1279229 1558493 1504131 1289103 1392629 1228284 1719445
13874 1719445 1145975 1369027 1364834 1464694 1235221 1392174 1103033 1152453 1284127 1337887
13864 1337887 1305543 1250929 1368170 1298475 1172015 968384 1479431 1096836 1104691 1058312
13854 1058312 1084967 882113 834976 1205177 980427 1251928 1176294 1319037 1187707 1266371
13844 1266371 1131917 1055085 959006 1026955 1104192 1289892 1141592 1064526 1177799 1282171
13834 1282171 1121515 754900 872449 1007094 872250 1009729 979488 933048 1167762 1085492
13824 1085492 1034613 1383736 1236365 967440 834108 704678 1198730 834011 1139198 679645
13814 679645 1116262 1046913 946024 1080989 910781 826294 823280 880391 964006 1171431 1057783
13803 1057783 861147 1001484 1035283 1183893 927211 1223841 952160 1088252 933499 908291
13793 908291 932945 860893 932050 970073 1011558 719718 1005105 829637 1133313 909040
13783 909040 1083349 764748 885034 760975 897883 825344 985240 634503 598825 886853
13773 886853 559486 639911 614189 867231 752224 772551 844669 831401 826911 868456 706072
13762 706072 802991 738310 581008 698050 846338 785705 673768 775561 753804 1096701
13752 1096701 750362 641724 620228 734828 833330 629046 728291 918111 878200 863319
13742 863319 834407 728401 715851 401640 562861 628839 673825 678015 778650 650434 551394
13731 551394 462392 621146 377477 664618 685083 768790 413652 766838 378866 666321
13721 666321 721635 861097 424075 944483 871368 976353 750040 929250 563663 835397
13711 835397 963646 818934 542393 575534 694009 607828 742537 565885 285766 628240
13701 628240 494318 766935 651638 744090 651327 728047 372053 686672 424782 188596
13690 510358 829488 607979 462516 481035 442267 621319 560780 654418 356951 491392
13680 491392 501267 503490 421167 431604 509410 602137 847710 720783 669340 674958 576759 632960
13668 632960 240372 575238 591560 631704 545187 396480 561237 737525 842856 451135
13658 451135 497562 523908 443107 423681 802867 366420 295077 577945 495775 565445 597105
13647 597105 602139 567329 814749 573155 413603 371405 11014 509501 558917 548660 550579
13636 550579 899077 461993 423546 289717 611090 751385 419172 526629 215122 400262
13626 400262 199604 393757 416787 324013 307848 445590 370615 329685 475782 302063
13616 302063 618999 439005 495195 248943 280510 522344 299369 412154 411887 287397
13606 287397 547262 509951 607585 387092 329089 416264 550421 619445 561178 444415 308559
13595 308559 610498 262395 699069 594417 395669 304736 362864 480366 436557 431293
13585 431293 540053 390088 116345 532394 553308 116183 28317 694314 600909 569353
13575 569353 514060 588256 495345 159836 348181 354282 592249 649051 87628 262143 513067
13564 513067 428678 391164 357373 373128 684974 429610 558381 430396 306464 531474
13554 531474 317019 199889 517950 514893 304573 370796 175981 599798 235035 243831
13544 243831 61081 132349 86456 174803 54715 209798 322355 107918 413394 165314
13533 177194 188193 262163 416167 613694 163582 340558 414800 517759 380069 380993 451062
13522 451062 284531 515513 714177 65160 564594 123295 -36709 311572 314055 -7426 101901
13510 315955 298622 129236 304871 478240 333118 225417 90494 406660 234591 470829
13500 470829 226682 -6992 322152 186611 270299 92729 129513 541315 467812 -21937 466222
13488 326658 78494 409081 412932 253680 357044 263911 298175 444516 432706 -138633 182725
13476 107825 194953 348928 316343 151173 243656 181210 281495 207751 246704 127852 502736
13465 502736 307378 183095 286807 261494 463406 334915 346746 441075 34088 186107
13455 186107 435760 165250 563679 220103 306325 165092 161240 514173 279244 114469
13444 93333 379900 278123 282328 368139 258208 333080 93505 299813 88443 260186 265901
13433 265901 425884 266355 -63398 137834 -81039 -129424 355453 62265 245431 74349
13422 232590 396466 443996 223383 185743 234102 296512 310233 227414 268203 284326 27216
13410 39275 391192 312814 283922 208578 348837 36334 -95515 231366 136347 59944 408133
13399 408133 228626 341206 227255 33394 118334 237127 2994 73595 708176 500749
13389 500749 566158 360256 428989 16256 288117 24294 -220902 232575 411479 124026
13378 284614 100089 256428 166697 155776 308364 -26444 407443 247023 455582 245263
13368 245263 373671 198486 8082 272187 16711 199878 519182 328385 184118 464355
13358 464355 399437 353431 240516 296078 302472 310986 231363 435392 -129847 302485 280791
13347 280791 -64261 311185 191783 574693 121991 130622 -90570 237613 351492 168447
13336 243050 240704 126794 566107 281730 389469 319193 270484 236594 159370 304004 538416
13325 538416 -12820 127166 521372 588164 166533 69846 355419 427440 105198 161009
13315 161009 373274 -2351 16018 442916 197098 83918 182420 47308 241491 157694 162430
13304 162430 295452 300830 387901 447275 100860 71819 265127 149996 268805 -8041 362943
13292 206271 171005 108490 54895 518527 -14010 257208 -48351 -161215 -82697 371646 381260
13281 381260 245484 366025 477050 162616 -19287 138767 221857 108373 90505 138457
13271 138457 -169707 19924 65354 18176 378428 -205927 -157188 -43074 995 160792 258854
13260 258854 359637 166695 86010 302958 43990 244671 29746 -65126 13012 101031 117593
13249 117593 346096 354499 -29143 139882 376274 -83040 353099 232293 218746 171274 42959
13237 105446 255603 47792 281863 -55967 -319406 92285 -91875 132105 160373 214476 357122
13226 357122 102123 111628 215336 149998 85759 38009 14808 342341 173883 548453 -210764
13214 -49286 46390 135717 83545 51910 -46427 134882 -127389 81671 104617 315440 190847
13203 190847 215816 244778 295856 370774 -239622 171117 126598 -41671 151793 -22769 48478
13191 12163 -140107 175693 17290 57191 262431 443233 313053 -77890 50214 21711 -150945
13179 -97617 383237 263295 70538 5316 111397 172839 17001 -124893 195287 101673 62574
13168 62574 37388 436060 -135200 -144326 -155115 219679 6941 -84298 147057 158511 99110
13157 99110 45749 -175535 -16745 368233 281013 123620 196918 -72867 -147969 285056 329003
13146 329003 472430 154210 194769 99571 427517 276557 87556 310200 203746 56624
13135 200407 98456 199300 298599 17914 88820 11314 42420 202740 476678 79056 400055
13124 400055 87656 -107411 251433 -128813 36015 161369 486982 71302 -45730 -12818
13113 122981 104784 129969 21265 151305 52443 205528 100563 51397 362334 290813 171755
13102 171755 330678 -55091 188987 -95457 -151857 41204 -24027 278063 -159750 -169474 71251
13090 259963 302655 201927 26150 -26806 -37691 -203414 162286 -6371 -104172 67992 10023
13078 394172 174191 112384 -306129 259198 376574 120831 220609 52731 -143257 -188938
13068 -188938 51458 120709 56042 88209 -44639 -116564 327110 48022 469140 270219 59946
13056 173093 169180 70139 175863 338276 253225 -50629 247106 381649 267684 235506 235718
13045 235718 161072 -185018 105052 151711 5883 -32559 143874 84302 306648 148960 -22606
13033 153508 101964 -37688 69406 95626 -121847 181981 229578 206758 -27735 -117665 -56304
13021 104800 -199704 347590 -370889 19142 103015 140956 -61186 -264969 -190681 -173631 132839
13009 15991 -98951 290010 388892 17721 282767 -87148 54335 -110873 24403 177542 -117706
12997 180037 169608 108426 170359 246751 52058 286768 163848 145296 -239628 141730 178101
12986 178101 151716 173212 278747 183684 7396 61275 7994 228307 361295 52626 178702
12975 178702 169403 25298 142490 -60980 -195604 31954 31833 -131639 139993 -30332 139739
12963 167139 -120793 272566 -132398 60154 207242 145030 -175178 -13527 72839 -218485
12952 340975 66298 -35546 -5506 -46612 226732 385756 49786 -248701 56283 -47476 48942
12940 178515 62188 -43426 -259724 192186 129943 91748 -40585 -19774 162184 -42776 169411
12928 52369 197142 -14172 116329 -179280 500050 -17488 627866 102545 -381426 443828
12917 103492 -50279 73757 181154 -133028 442242 86786 15023 19677 -121317 235575 -136695
12905 129330 210787 199665 -24835 22541 9583 -171351 -254106 -62501 97089 69120 67949 1738
12892 -215631 467843 -24612 169073 234281 40721 -146145 -288386 -205044 -18273 125941
12881 213025 -65767 -196898 481015 -156419 171052 17718 230900 -314521 -133207 205678
12870 271200 -44222 -253407 241594 266481 199204 -76083 106548 -47274 8909 88444 371078
12859 371078 25939 332649 376481 -158448 89595 147491 -222964 40408 111569 274333 364771
12848 364771 226623 322731 -52450 -229845 -17374 -166210 215037 -207665 276702 164649
12838 164649 -306030 -67794 96176 -145039 -7437 -361222 -7084 173814 38216 -133099 198313
12826 -245160 -142657 122060 -282573 377382 -184683 -288730 366314 -289379 -35006 88429
12815 145422 114986 61773 -109011 216566 -42225 -208932 168632 227297 115818 175078
12805 175078 -34551 144350 92879 -193020 -165023 67963 226080 -211018 88839 40585 207649
12794 207649 134292 67378 131584 140048 -151405 -97630 -307663 24364 217798 -198103 96526
12782 118794 198566 149635 23151 67640 -88379 -308673 27846 73504 -157309 -32625 -49023
12771 -49023 -154470 -43747 -90275 44667 -123575 244270 145989 -187684 96940 27435 -148203
12759 33981 -194416 48665 -96276 235620 191403 517660 -273290 10139 -130443 9867 -55818
12747 60043 117122 162767 -180747 -147485 80186 227448 98105 -267206 57463 -90263 -350136
12736 -350136 479556 267571 111987 446636 -134663 5679 137353 -129955 -215022 109396
12725 119492 386468 217774 -229330 91337 120061 -15337 6452 -95542 115313 230784 -243325
12713 130355 235570 -92545 151120 21032 16130 -43274 58515 -28300 193601 229942 -325849
12701 60650 -11053 63044 165793 -305926 468072 68622 -9170 246273 -81266 -140951 152058
12689 72391 380646 -219386 320004 90637 50742 -349789 156645 -30999 502216 128244
12678 171396 151792 74768 75457 96191 -45232 204288 76059 10046 -10810 -120767 -208751
12667 -208751 252986 86992 -377191 242163 -611 135009 137370 141337 120151 155265 -182511
12655 -263651 151891 148752 138931 -66394 89221 -258482 99339 154587 -20215 150029 -152355
12643 -289211 -31909 235168 136335 455905 -115 291892 -41034 -117201 -6731 99385 -159768
12631 203255 51335 -136790 325459 148840 56456 218039 20012 2695 -238117 245240
12620 231971 137634 -268879 257243 143291 218266 24207 392066 205209 182258 45561
12609 11866 175525 483330 209445 -3060 316572 141924 110077 311684 180331 -278796
12598 -5986 101487 363968 -49035 -89110 174045 -105702 -251496 -53492 61698 503431 -172189
12586 -70612 -20122 119823 234546 106279 102436 183782 4166 198242 154817 31161 -101860
12574 -57368 165200 -82927 -91289 -100605 534978 57652 -11356 -273140 -113839 -160795 213091
12562 250983 6882 82070 130410 -51631 301676 124642 83881 -166090 -5857 -254362 67237
12550 -6269 176385 54796 96168 381386 208033 -218375 75004 214912 -51111 101333 -195175
12538 164073 -98374 -16110 -101863 -208455 271061 29709 190823 334338 216235 12881
12527 132000 -91794 -372950 -81866 -195297 88655 -49740 -90086 -33736 -33923 -52307 83631
12515 -391788 -30695 142662 67711 -74210 170116 -105486 372586 -258533 -25284 221398
12504 99885 99415 -14642 28795 -103447 -218045 76422 -63730 449508 41108 100200 31449
12492 -48500 5154 -251674 342349 -75729 -116191 91098 -18344 515618 -53513 154720 -214871
12480 6334 75828 10669 -302277 -86239 -40595 -287793 31068 -109257 -84776 129948 -2751
12468 -21639 117559 365552 -176630 -4399 -93257 166850 -230086 249144 34767 -27392 217457
12456 -67957 195389 324414 -5072 -3898 -80637 122871 91649 -216895 -229356 118663 24885
12444 115377 90666 -100582 110878 -15586 -700 -185852 164546 157729 335522 83630 -65324
12432 75164 321889 172719 221000 -177656 -207821 220254 125109 -47274 -233375 29187 10237
12420 -29320 -101690 -168620 -15630 -31569 -162738 -148439 -182342 -50649 68994 268590 37712
12408 -206154 -32992 108460 -8974 215115 46756 -348258 34005 -140884 94705 65798 67317
12397 67317 -347451 -97647 -51751 202849 -49909 -290322 -50383 238915 141918 -117932 -269323
12386 -269323 -189695 146499 375256 54151 -165496 -56750 -481901 -48029 264661 108879
12375 -129673 193147 -92307 -321470 33281 44691 140771 106946 46406 53439 159428 -150535
12363 -35179 -109236 564875 52637 -147345 186183 -488685 -189185 -74038 -48016 -66809 -122645
12352 -122645 -73056 -180701 -162431 6481 197881 284861 114825 -137752 -274698 126741
12341 411231 229771 -163904 267890 117909 -124356 126845 -96455 168976 -14377 -261609
12331 -261609 147747 -306811 -110305 160283 -80721 95672 -142311 90411 -101543 31560
12320 -28980 -128736 -74649 162311 -59516 60563 199959 -19951 -62405 257337 358094 88924
12308 -284592 -200625 -96598 36652 -136771 50594 -110556 49420 10312 -244580 -16223 -130248
12297 -130248 82287 96702 -193435 -40372 71255 -460283 -6491 81539 -283381 147211 -50495
12285 35459 69001 387547 311786 -111945 211110 -195427 61951 18073 -51434 -145595 261445
12273 -59754 -45733 -164692 226017 -181882 155742 -16394 219701 -11625 30286 40939 38305
12262 38305 134387 -202585 -260485 183369 -11270 291388 46765 222519 189963 114590 35142
12250 101685 104819 166113 -21904 31980 -24090 180288 -162819 -118397 -189819 -171563 -236910
12239 -236910 349264 -133565 307279 -135984 39295 31434 29972 210969 172813 224458 145054
12228 145054 -150959 55339 155511 86297 81426 -143463 53177 30961 -10522 36290 395756
12217 395756 134134 -101615 176235 153548 128639 71698 168575 427487 272158 210684
12207 210684 255358 499724 260619 83342 178748 -139539 3525 39959 243055 190423 -132326
12195 97458 -185867 -47949 88734 310514 114326 -268743 189510 48951 179801 213380
12185 213380 -53174 331238 35981 294664 266314 -76281 231650 335930 222843 226045 274162
12174 274162 105695 -63802 -184110 -7238 -64991 78245 236327 -53875 359381 63511 5538
12162 321587 370605 41271 57629 199929 145728 38859 -15014 86202 301774 -20553 26855
12150 223261 300579 9676 -3547 -155546 182892 -51718 39260 128310 96557 -80417 121207
12138 270562 79108 139647 -80049 -1415 -99298 -5432 199172 78231 60168 301149 293251 -7311
12125 73452 17508 4510 44761 301642 787 -81579 178658 241006 2234 27460 -177649 38850
12112 38611 -210749 -19507 -9710 -86445 19445 133182 -185416 -189610 -195867 94723 -77212 -25164
12099 -120537 83185 36023 133401 -63120 -50038 109678 -71938 -64453 -246899 188805 218924
12088 218924 -138965 -357275 -86488 477283 5811 134373 -79695 1225 62372 -113556 108919
12076 -46581 -15389 -338581 -260690 167039 252989 -458927 -33874 -54049 70474 -33423 -160142
12065 -160142 95752 -103827 81757 406063 277458 522503 905898 789696 404553 169813
12054 284324 248193 -154391 -274182 -178718 175032 -51080 -57796 134628 167078 55617 296268
12043 296268 -22555 -125791 -39817 -149740 88012 125269 98369 49055 180852 132770 -146325
12031 -115 -230016 75040 29805 -73542 -195492 7644 -153675 -58640 -47201 -117651 -65023 -16756
12018 -14091 -202739 240051 116930 -102830 -147293 -175565 -426615 -258152 59744 -220677
12007 192146 -62456 -678 110133 195718 -72990 124323 213631 75947 -199843 -191581 -225882
11996 -225882 68528 34410 -230715 -160196 -438578 -48717 77859 -9097 11374 -147040 188875
11984 12759 134939 -91020 -125430 -220027 106136 -20978 105819 2852 234688 18807 105772
11973 105772 -99562 69213 -64076 -271619 -27996 76086 42540 122452 -20559 21759 -29038
11961 -259958 -55808 -153490 102843 -132184 -202360 -206324 -45846 -290667 26150 184824 178515
11950 178515 144816 -128073 194689 44181 -282847 176752 37303 110054 -364227 -18526
11939 -120721 21321 587464 -112423 -152215 -240689 -173105 117209 -257048 142318 102083
11929 102083 -225565 -8918 -86636 -124841 -28768 -241387 -23514 160520 263778 270288 243928
11918 243928 -7908 -357403 -61934 2109 -2829 12888 -158669 -70991 -134405 278834 -61242
11906 -96151 -86282 43696 266083 -109161 37249 11055 -89199 -14918 68399 -27920 182477
11894 -249648 189861 -167040 -426955 328005 141769 20502 295842 200683 278800 -90279
11883 -244871 69374 -37837 -52181 -233937 -266627 143297 -88468 58856 -139806 -103376 -216629
11872 -216629 276573 223867 145894 -49654 58683 -240913 -16413 -67317 -61685 80843 -142326
11860 61039 -382662 -11012 169049 -144987 319995 -77868 -202920 352033 301658 -210907
11849 90640 262627 173375 5067 -213522 -132256 -110183 243796 35837 -321243 -259986 67870
11837 -166036 -52595 -164125 37782 133149 -76988 -289835 -32477 69418 -79395 263883 -51425
11825 -60690 163676 -132673 -123711 242001 63789 33 -163502 -137590 -31063 79310 36649 222235
11813 222235 -123492 -176593 -68522 182660 -216676 -158619 124336 -173123 132518 86407
11803 86407 326953 -223719 -147114 -85067 -232692 146440 77997 -205648 -218021 -168096 315607
11791 206152 -62228 171086 -162774 213651 -149800 147144 -281289 175393 87883 -54331
11780 -134392 -85262 73497 -118345 -20319 137268 -270904 -2848 -32400 -197999 -28300 -325956
11769 -325956 -12560 -188627 -374625 236075 -105793 -466746 66009 -178391 -66679 -84990
11759 -84990 -194688 -30770 -124428 -161702 -296035 -72618 331135 106830 -159575 -107146 -132614
11748 -132614 -148053 -82828 113899 -298841 -135720 30310 127005 -111449 344459 273197
11738 273197 125543 -201391 -250761 -26293 45107 -40473 -255674 78983 195737 99936 107038
11727 107038 154062 -253075 -33843 -165663 30066 -205519 146304 18344 -107450 -34551
11716 19677 -270908 4407 130106 58922 -348677 244345 -63852 50294 149749 -163112 -54054
11704 299616 -313217 -137288 46577 -328337 -385122 159227 119721 -59520 86175 -47216 113996
11692 -188905 178548 303678 55883 31122 -112151 -175063 238474 79473 -6187 -61221 52230
11680 12933 -38849 16489 60344 74166 -177115 -208962 154218 371900 71836 -62635 11115
11668 -393068 -6688 -72439 -53355 119756 24380 -50793 186435 -230781 -109221 23815 -117663
11656 72331 303619 -44260 154476 -77710 -73490 -109487 -99109 300351 -19319 52398 -399738
11644 255430 43679 -47440 281464 179970 188631 124736 100217 79606 -231100 82144 255277
11633 255277 -22849 39434 -89063 -150005 -306019 -89374 -54073 112962 -169097 67162 56216
11622 56216 24729 -10449 376407 -8813 124262 -12745 -5513 31157 -61912 -201168 -22144
11610 145115 76281 56143 -25361 241879 308933 -171325 227712 116113 -95629 51730 76120
11599 76120 -108580 -358822 791 291456 -33898 -90269 158185 -63178 161702 -120330 -258507
11588 -258507 -306347 64729 -5129 -201373 89337 45248 -37914 150096 -49555 201743 137258
11577 137258 -80990 272021 125610 89641 -29192 155815 84387 -39142 256222 23094 306414
11566 306414 -161551 -96341 271813 -22834 -49562 -210395 279392 -115591 -50013 -56408 159864
11554 -95311 -62704 -81635 -3603 -30280 37529 -67075 -132272 -80878 -213846 4888 119446 21453
11541 -22374 -99006 -57137 178065 -64010 20950 -155925 -135416 114129 -136291 -135804 182078
11529 230478 -297614 203354 139772 11841 87094 -141467 -184651 -171401 -130912 -27200 -64990
11518 -64990 25887 108831 84112 65151 -30943 -206577 -360906 -89686 116339 90725 91851
11507 91851 226077 -104820 -23337 182720 451101 -217995 -160074 26841 -59579 -29006 -138828
11496 -138828 -34948 62980 -3137 192206 71041 -24793 290605 403218 39098 355982 171731
11484 123157 -3293 -2644 62467 180162 157057 264136 -31876 201432 -220382 304676 48142
11472 133915 253157 104834 207417 67484 -88481 352231 198340 496244 -47429 426881
11461 40295 -148059 170943 -55768 149820 182733 -58395 -2923 -26128 487023 240183 264287
11450 264287 346817 94239 103122 66781 335845 25892 -79999 -12883 11778 103421 55260
11439 55260 -152796 65444 -137576 -340670 17134 422992 -22534 6096 -106397 249203 263777
11428 263777 156997 65241 11828 -17094 32970 -173351 -97199 347789 -34120 -343739 -199379
11417 -199379 142675 -251908 54051 -40821 173000 310882 -96126 29087 -205608 -306998
11407 -306998 60498 -113223 141382 213001 57124 -53842 98982 -259622 -183980 -158648 -73958
11395 -221342 41064 -184081 12282 -304791 43988 -20862 -65868 366629 55293 119045 -211844
11383 -99810 234189 -80783 -184515 386358 41737 -438472 -205645 -301753 387336 -293613
11372 35511 127815 15096 346575 194389 -85357 162850 -61129 53571 -47213 -179919 -305637
11361 -305637 119374 14331 -190067 142709 312439 20411 162294 -129170 -197428 -209607
11351 -209607 139611 -353836 -205921 -95232 270754 -127990 6799 -69077 -8384 -81774 18657
11339 221953 -61497 184758 -63183 64160 -86081 164943 -168115 270376 -263224 264978
11328 -51161 185126 100303 -125937 -106388 8108 -283423 -282800 431061 -278527 -135174 451488
11316 49496 29834 -148745 178432 -10717 -178091 -264474 -41120 -105828 -268667 237533 171622
11305 171622 5781 90137 -115993 -3342 107461 -94324 -465052 60242 -74089 99636 73592
11294 73592 -242179 79373 -96979 3040 179155 -457370 63642 -237243 -128767 27088 -137565
11282 -3248 -72727 299727 32319 159539 -238660 -15656 -308970 -81069 153325 84890 65923
11271 65923 -77276 -89902 -273370 24603 -325057 -89019 -85598 -151771 116530 -78730 188823
11259 19562 -70081 -46607 344806 148618 -191788 80219 205755 -116635 -42771 -100658 -51704
11248 -51704 102229 260940 -110255 -85320 38118 82936 -206857 51856 -448598 348462
11237 -134474 -25094 190162 -90711 148072 25823 -145219 -196634 -131067 7173 -3523 126415
11225 -359286 -269304 53446 59928 85424 -193567 138111 -213679 -155881 -93625 -103231 -91408
11214 -91408 -41663 415 -52157 -250420 329481 61281 -59997 -132681 -237121 -6026 127125
11202 70433 -20796 204297 -330542 -7380 -53609 -88539 -278481 25304 190735 117914 124213
11191 124213 110266 -107560 74581 156703 45655 -105194 -123385 -154822 22683 -442351 -32964
11179 -173072 -370267 -233553 -52793 197103 -105508 -11371 -10620 -116675 245106 -84607 -154999
11168 -154999 -208015 234001 -206547 -12950 -128198 102195 -52614 -12032 -309085 124619
11157 -86468 46220 -92105 -155211 -352568 212850 144929 249168 126722 -95575 -332455 -116290
11145 -94078 -141946 -183179 -91018 -178348 -109408 48 141334 -211348 223980 -110328 -193978
11134 -193978 402588 157733 -33363 13478 -196540 33930 -283809 -232643 79497 -30122 124101
11122 -16244 135998 -321893 270592 287278 -161557 -197994 164735 -47609 -63605 157491
11111 -142202 -210386 72132 -48171 -49128 161476 424635 257298 256913 -127748 21133 100299
11100 100299 7746 305900 1132 21094 99664 6509 334553 70941 -53729 174912 138879
11089 138879 -6049 357604 113084 321645 78522 284734 -86539 132112 64436 -89397 357859
11077 125890 220532 262247 300459 108599 -104208 -140605 402770 64752 386864 -58243 -50632
11066 -50632 241538 554709 181010 -1300 257347 330196 200372 65557 108212 370572 675988
11055 675988 271697 520135 284201 441202 238238 655379 333260 452748 395233 274155
11045 274155 540447 543335 737621 485830 683034 548590 532166 490117 652929 603614
11035 603614 703829 1043625 289512 780496 762291 557341 393867 350481 659473 900298
11025 900298 924416 766581 601169 737657 328267 516724 405981 698529 534137 506302
11015 506302 745981 752023 455132 789967 362093 338151 185630 638155 578235 667134
11005 667134 822562 832258 478111 411348 634150 577422 430266 434500 370483 362596 690378
10994 690378 635084 560190 285988 517785 625316 398405 593176 608566 167052 326828
10984 326828 543108 481405 677909 722642 447305 685896 791168 550423 782490 777536
10974 777536 626006 833381 772558 794606 924775 1007024 1081695 790982 1363510 1250033
10964 1250033 1295110 1261330 1395851 1604526 2115468 1935255 2405645 2624326 1980118 2589992
10954 2589992 2185580 2192720 2034532 1893641 1452487 1502619 1289514 1109036 1012940 1235741
10944 1235741 1354733 1060022 1365829 1280276 1074410 1173917 1050511 504812 706566 539672
10934 539672 390607 617967 506375 335626 329013 269394 192325 383594 177146 190568
10924 190568 -6826 128457 -58090 31221 -143644 155912 728 -26642 -139762 315181 257743
10913 257743 284895 249536 -13123 37749 -272837 160145 96259 167218 210820 291150 -9765
10901 -79136 215063 -150935 -202202 -272806 -190456 -174824 -368378 -76077 -38535 112346 -61661
10889 93087 -145938 -298229 -158938 16421 81549 67732 -61517 6443 -116002 228884 -206219
10877 261368 -103763 125116 -67514 -312059 -40198 220148 -176469 -9378 -26902 -299271
10867 -299271 -67267 170238 33776 279683 218916 75649 114754 -319661 -373407 -228855 -124232
10856 -124232 -89932 158382 372623 -65622 -3089 -165409 -42099 149440 -147036 -127619 149819
10844 314174 263004 -96793 267104 -24607 -152885 -205676 58859 250712 -22357 -19222 -15568
10833 -15568 -254110 -181740 232192 34541 -125579 -264110 231843 93210 143607 -100901
10822 129191 -73554 -61948 -54645 310422 58562 -163157 -45022 15721 18136 339243 -98857
10810 -276818 4074 -80391 -102014 -202219 67126 -105214 237658 425517 -127848 -109117 116596
10798 -2635 53466 -130915 -168606 148646 -31556 48134 -81768 12947 176726 56539 -284969
10786 -92591 -160015 -95832 -203065 24645 -29972 -207981 -151942 28376 203698 -234772 143947
10774 258395 40304 -209671 226797 111887 -183505 27676 -165634 -21043 -292388 35114
10763 81676 93976 -73112 -64208 -201006 14964 16563 162307 3436 -190626 -58351 -411890
10752 -411890 302907 158316 55318 22609 55429 -211428 -29946 133200 -265759 196266
10741 231920 -15100 113997 40997 -368794 -153050 -17618 206200 2492 -320509 90869 145284
10730 145284 191780 216419 -119278 73280 12872 57887 -66817 -107025 120028 -78795 109052
10718 -46449 -155982 -174942 -247897 86386 -38441 -50755 336673 -208405 -22665 333760 5265
10706 -31111 -70635 138153 -238844 8569 -118891 -68745 196844 36796 -77698 92526 -62697
10694 -138113 6208 -130336 -36631 -150764 -140493 1297 -4374 280917 -155066 35679 -141922
10682 200304 3899 -381811 -20903 -99453 -127106 -34688 -70484 32086 -310343 -173578 245125
10670 -1199 -269675 -67517 -41803 30497 27165 106296 111392 -414559 37732 -246549 261654
10658 184880 -30774 -138860 128414 289492 -21009 56793 -131096 -54683 -224564 -21597
10647 137878 -235571 54422 -89840 -32981 -183688 -117622 105027 -97423 -9185 -216273 -142906
10636 -142906 25108 34232 60230 -53585 13219 38807 9409 155094 52796 -12970 -45921 -168522
10624 -168522 -167301 -166350 -20847 223313 -153689 -438191 -109830 135081 -125963 -330854 61745
10612 -252287 43882 -114449 -128484 -164173 -110735 -71602 419572 -198580 273040 74974 -366452
10600 -62244 -28097 -71409 -72656 38965 -5558 -79450 -96541 83615 -239201 99448 261578 -166208
10587 -63351 -270548 -185237 -97570 -27937 20009 -2703 -104413 -289224 112247 160676 -361529
10575 -303 -175040 -164989 -45815 85022 -16355 -207891 135378 -284849 316099 -153360 -254742
10564 -254742 255710 9539 231012 86079 -11494 -138811 203193 394477 -544628 -46473
10553 -557571 -103882 -128713 -48982 43358 30270 -57880 58957 -84119 -228845 -194676 122882
10541 -193282 -54298 -194766 -66302 -324414 -28852 -42339 -187723 130141 -73020 245925
10530 -219510 11273 -109343 207099 -511263 143389 34619 -158036 -390592 -80714 -217873
10520 -217873 -113959 -152501 50436 109780 139690 43920 88049 -24622 -411179 25347 -137035
10508 47447 127214 3941 371954 -73368 161867 135357 -88739 154 -58732 127352 -56959 -312471
10496 -312471 -305998 -269178 125543 83129 -120228 55670 51521 -98974 -161349 -239510 -285363
10485 -285363 194402 52878 -60571 -403653 649 34325 -110724 -129787 -94684 -190920 133022
10473 -19633 239376 59720 25937 225831 -206750 252543 383129 281745 98993 137675
10463 137675 87380 159222 156193 84590 8521 116234 -83249 -93323 -81829 89509 16198 -103363
10450 47345 -38420 -53875 56283 -95660 -115697 160959 3833 -435776 153654 61278 78198
10439 78198 -266642 -73931 -245427 319014 -36659 328182 104045 -194050 -110623 56826
10428 -184762 -278711 166479 -49604 -79171 -38816 219740 70310 225537 -267025 85939 -217251
10416 64330 -12396 -280847 40715 -147278 -34975 199597 -106849 -1637 -144706 -20112 -3329
10404 -91754 15138 -60614 524586 -214386 27551 80747 -85672 -160304 125558 47594 -108299
10392 -53146 116072 -353824 -27673 274642 160474 -381329 -42998 -257274 147024 -204535
10381 149584 -83705 -48293 -170267 -121530 85323 364069 338629 -39623 351475 84938 243555
10370 243555 -70214 67377 -107028 115178 73103 37002 -1494 219182 93262 54700 308059
10359 308059 158439 30548 474217 65137 77316 217901 314429 130105 495500 92588
10348 178983 207176 162896 194512 163736 195173 58452 95975 516541 225659 122010 105465
10337 105465 332125 114841 146346 374115 379160 -77756 357654 392864 316350 233621 340038
10326 340038 10567 89054 189057 153850 453271 314044 14395 -49930 139153 86618 -251504
10314 -113108 -175432 54503 -90397 98546 149543 101024 224216 454711 -14241 509131 331787
10303 331787 187121 257997 187136 -226452 -30156 199443 196121 -214601 -71456 -16104 252989
10291 372056 307403 -8964 -209657 -48354 236316 -51614 -3047 14376 -126854 173278 -195586
10279 208534 -47033 -144547 -171689 10063 60508 -36048 294841 77398 161281 -57286 121320
10267 -99574 35737 -231083 -29131 -25888 -67633 -121689 -74419 25189 148700 122534 70054
10256 70054 155189 -217323 169959 50063 302352 -83925 97195 -117502 -90702 -142680 -227489
10245 -227489 148357 75181 93572 563978 110319 -133881 -2953 229609 3611 313184 289095
10234 289095 -133192 135956 -39582 -228391 60999 -143196 -170296 -261943 -134857 209635
10223 -96841 40855 -122837 85423 301953 -31112 251497 224218 -251308 -336782 -122691 -110746
10212 -110746 -239223 -22413 -146448 -135733 -92163 10548 97140 64193 -90522 -249700 -30425
10200 49104 -45942 72137 207066 -295275 78557 199949 -91859 -145339 237760 -108809 -281471
10189 -281471 -95856 67357 72590 -65493 -16573 -151968 -74831 -41352 -192461 -238041 -180404
10178 -180404 31469 215261 -286348 160489 -81419 -171409 -249772 -203132 142546 -113281
10167 -486995 20418 -447190 20184 -169542 -179930 -207485 104375 128124 -158114 -22945 56558
10155 119069 187936 -214647 48408 -110284 175161 5376 -302512 -45803 -319668 -297778 -181732
10144 -181732 139664 -207094 -108185 -229323 -330352 269123 -173370 -1223 299309 -127874
10133 20752 -33641 -56498 82763 -49242 -134909 -45816 -181289 8100 173862 -174211 -137343
10122 -137343 -123021 -122307 206308 -84267 -49800 -240685 75643 -56584 -116492 -494282 46451
10110 -154197 -160384 71048 206623 170178 -97297 -139520 136509 -109033 47137 -138348 -211901
10099 -211901 -23961 144492 -84200 4554 -103185 -168732 -171830 -215981 151807 -126432 -96540
10088 -96540 -276694 -133031 -38589 218317 51400 -97737 103488 174906 -62656 262372 -367848
10076 85165 -138356 -206708 -165354 -45107 162332 103044 1287 -56174 -4497 -816 89201 -354955
10063 81064 -156488 -53319 -210120 65402 -53511 -22068 -140865 -99211 -118900 -266280 -153430
10052 -153430 24349 -108234 -52695 9305 250705 -60948 -169243 -118512 174246 13578 -260189
10040 -40001 28459 98580 -289595 -129699 -8600 -155224 -296621 -15145 5529 -254609 -219782
10029 -219782 17261 -361833 -52915 93823 105962 -99181 -540337 -145852 -368855 -6359 110563
10017 -55219 61511 124552 -105809 -119492 29322 -270319 267611 205280 -260286 280075 -152496
10005 -109874 -128496 232449 76075 -320810 -71268 -5741 126230 -287989 -51211 217546 -42231
9993 -142010 -40658 168221 -195585 -184586 -348934 -460652 -5805 201921 114371 -157385 -272246
9982 -272246 397946 366175 -73437 264440 -196205 -42347 -239078 -24739 50392 239976 -16553
9970 -51827 -155747 263637 89077 -16001 -107011 -162542 -391734 202603 126156 -221500 78050
9958 -181681 -441301 -103893 23410 -108042 207831 -17844 -18009 -27426 -86167 -171934 -13232
9946 -184664 -192185 -79932 158805 -431672 -175970 49533 180161 -225598 -140547 -17087 -130887
9935 -130887 23777 -336189 -208903 12839 -69242 -172203 9719 -272428 21485 -273642 -35361
9923 -55878 61520 -78219 19173 -55798 99410 -343678 19969 -47766 83979 -74219 -165011 301687
9910 -60580 -118669 214708 45705 -29204 118340 115116 -146409 -355518 -311030 82952 306915
9899 306915 -39573 -66594 52664 -167252 -158639 -222443 136842 66515 118837 -292710 -23328
9887 -98851 -13415 29719 -146206 91149 -4749 -411893 119561 -312769 -177941 -458329 -133663
9875 -514839 45991 -10950 212237 -260268 -426990 -335844 39949 100879 -198663 72529 -136933
9863 -81999 -154104 104908 -116898 -27038 -55794 48855 86907 -30053 249401 17372 -42187
9851 11233 27262 -75355 -77797 14367 -183399 -109429 -5929 140693 -64246 107494 -17698 -209389
9839 -209389 196515 -33269 -190544 29929 -43044 321303 -92121 -234287 -217668 59478 163450
9828 163450 -294864 25494 -4587 116395 36448 -114954 -256119 264974 -249768 65519 -336658
9816 -13329 181819 -144701 -199238 -13948 -251365 -354095 -192982 -126574 -136354 -88769 -186106
9805 -186106 244559 -211096 -145190 -146214 165921 430489 -187658 -90798 -190576 -276583 206573
9793 -139826 58826 -451780 223321 96495 -111121 -118676 -388237 151268 -182122 63176 -379652
9781 -70561 92070 -47232 -132482 -2962 -116520 -151790 -10170 306779 -229196 193517 -207083
9769 12466 85967 36948 4670 16821 82159 192963 5530 -278370 -30202 -7993 -219412 -134111
9757 -134111 -103743 -895 -263094 -121982 -352067 -155186 -109518 -226775 -75183 -267043 -276064
9746 -276064 -75865 38601 111991 206390 -133443 84342 -91019 -201459 -161178 54548 274850
9735 274850 -343227 8218 -176476 -60943 -156028 118821 127513 889 113253 78273 -103623
9723 -15721 189236 171187 -95382 -60552 58542 98128 4080 28068 -157590 3874 -282138 -153423
9711 -153423 12825 78420 -4813 181486 143663 -334807 -205356 -62748 -84063 -362860 171676
9699 196479 -165442 -112958 -127458 -195013 -92467 -36428 -112680 67982 -10914 -4281 -92292 -59024
9687 -59024 5497 -66710 -6907 -341638 185916 -183584 25872 -293977 79332 -154672 -10719
9675 -28664 -281593 61014 107187 -107361 34862 -363557 -145844 -65213 -244476 73191 -59310
9663 56629 -162045 -157126 -316664 -19588 143795 -97552 117360 -74993 -140156 -155088 -128493
9652 -128493 -5753 33816 -116655 57649 54671 -487344 -83522 107831 -176447 -31272 66745
9640 -260936 -108508 -107624 -342369 88703 -124769 -56232 -229023 -237347 -23902 36912 -221900
9628 109148 -354598 -14470 33991 199660 -151415 139377 -236736 -156246 5759 74118 108699
9617 108699 -22323 -71308 -88887 -126353 -195691 -181026 190819 -395643 133550 28539 -218404
9605 -145039 109490 61291 248719 -150521 211495 84056 -96482 -296994 -198060 -159308 -241399
9594 -241399 1140 -4057 21564 -65761 67137 -19327 -255282 39040 2486 217924 -72868 -62118
9582 -62118 -23757 -248001 -41846 16920 157854 213364 298948 -1463 -1452 116156 -130336 219447
9569 -19516 -330046 -145953 -123779 -14582 -238722 -4391 102096 163041 -116044 42611 -313969
9557 -112813 -196883 -8211 140088 15846 255150 -132328 -114434 256084 -307349 -200965 -42080
9545 -143261 -312126 7113 -247047 -242457 -207289 -64734 44369 264182 -118651 28524 -47307
9533 36193 -62511 -185267 -28303 50299 156742 91586 -510248 103690 -412462 -237960 -14763
9521 262981 -180390 -2453 38191 -7964 -154755 -13007 -84460 135330 -156283 -133040 13384
9509 -112012 173702 95496 -34209 -345376 -179680 -34704 40612 275218 26810 20455 -180830
9497 -39186 -221756 -199269 15420 27425 151869 249338 252683 -418587 -7569 -248317 -67133
9485 343583 -158961 -336395 -152134 305208 -162796 140317 -352796 -346522 39175 -240944
9474 319192 -117310 -50799 -37801 -21004 64210 -63181 -74545 -231864 -83547 -202715 358743
9462 -272603 -302805 128994 -210710 103569 -125086 95256 168132 -218061 137394 -132925
9451 -6475 -25787 -311577 141256 -41953 -258592 -66672 -167824 -268801 217547 -19575 -207984
9440 -207984 123842 56209 -150984 -221316 -486092 -50131 -274077 122268 104196 119652 -47221
9428 2189 -99258 -202125 -70935 -14988 -69638 -160619 -192074 -242896 -136737 -29350 -300321
9417 -300321 -90927 238803 -176224 -37674 -35362 85400 186085 134561 -184418 -222031 110456
9405 147146 -41491 -27084 -21415 -121562 204946 -19021 -145796 57543 -2167 106242 -160235
9393 320808 -58125 -414615 -20290 -83630 -104117 -189668 385051 -14684 -92267 -252168 31742
9381 -66188 -32991 -4841 -122498 253641 -57698 37750 55193 563995 100573 136287 331505
9370 331505 -269453 -146170 -134066 17099 15741 -225597 26818 -16211 111512 37446 130544
9359 130544 -32353 -2740 34955 12482 -309166 -118891 -104713 26155 -24591 -325647 -94852
9347 -73938 199611 -277839 -61067 288477 -318635 -86199 -103842 -74453 -9801 -225600 -120933
9336 -120933 -78652 -14071 -467299 -272276 50703 234397 -119588 -139917 419646 48397 -261882
9324 -279019 65063 -174947 -195517 -150488 6792 3218 -304963 16888 17552 82065 122921 -50524
9311 -29653 57011 -318565 -230466 -114117 -32678 -382451 -176218 17966 -70628 114562 131511
9300 131511 83362 288135 -122076 -40761 -9041 -245030 91534 205827 -115364 -122250 105098
9288 325571 -46871 112537 259089 28379 -177938 -21867 148838 -134019 -92988 153892
9277 -163815 73109 -423275 -12229 36136 205558 143512 -119501 -14289 -267737 -91417 -36268
9265 -111675 37547 -103857 -214894 58796 -47406 -237856 160514 -76076 -286656 -285504 141689
9253 205337 -5677 -177598 -26384 -366198 -327504 -298334 -188481 -221055 -46158 -161693 31233
9241 -56419 122079 119751 -452559 -182507 24219 116833 -68512 -111320 -161507 -32050 -41522 -281992
9229 -281992 -62617 -274453 -58749 53343 -108602 138669 -63760 -58798 207584 106206 -16763
9217 -45684 -139124 -27473 24867 403429 -467 16037 -75264 293 -166975 -39970 31463 119584
9205 119584 -115556 -31159 42623 131401 -120919 -105460 134427 -84843 -142033 -290975 -191286
9194 -191286 -180431 -160375 -151107 -304564 56877 -66394 152491 311033 -228066 293689 339182
9183 339182 -108152 23118 -57015 -246953 -203470 -200445 -86001 -88926 38640 -152695 -14103
9171 376613 -110798 -178566 26090 -335108 111901 -244797 201175 -56994 37889 -74941 60216
9159 -46130 -193419 -1545 1691 184189 233317 93094 -212238 -309432 -118929 123888 50461
9147 -405259 -45939 192559 14415 -123860 -69100 -149999 -395841 -1562 195883 -216134 -153200
9136 -153200 50603 -108559 108527 53220 -123082 -70930 -179094 -77379 189332 -63876 20250
9124 -67590 -94813 -95427 192236 55895 -581503 48338 -64495 199104 -263655 78879 -24905
9112 158602 3959 -188987 229542 -17781 129236 -68552 33847 -51965 267104 -45200 134686
9100 -85592 -205852 -6777 229908 -153733 -50007 -420898 -12775 -49354 -12200 -229783 -33325
9088 -142560 -336403 307562 74054 -6276 -24700 -282058 -210786 177181 43836 7848 -122755
9076 48874 139046 -7909 -188258 -28184 -185648 -238079 -54493 -32838 -22159 -119699 -21279 -69022
9064 -69022 214569 47959 -112148 -99468 -272960 -296919 143965 -76119 -92219 283715 -232416
9052 -258061 -79469 117062 -278160 -35309 -6729 -149517 72325 -80446 -356100 -172145 -295048
9041 -295048 83138 144678 -264689 167297 -360934 -6095 -510 -243546 -106774 78284 118075
9030 118075 64253 146581 117982 73440 -122853 93897 -124577 -251006 39310 -228178 -100236
9018 -77142 -260864 100857 186704 223263 175950 -135977 -133663 -32320 -135020 10336 -33730
9006 -195438 -93983 -41074 -81317 88619 -148011 -120251 -90422 -40024 -309207 88663 26582
8994 101053 -163423 223088 240037 -502744 -163259 -168219 84245 140108 56130 91985 -197945
8982 172002 37846 -208866 -83057 121109 -89480 -104258 34605 378170 -38200 -335617 -128559
8970 -330099 125032 -90928 -65630 64035 -254694 -140575 31299 -330992 -111583 12579 -205905
8958 34171 -109185 -211092 43363 143826 -79723 -310947 -248737 18823 -10891 110870 -150168
8946 236490 -27174 -105230 -12496 -345771 -99271 -49366 -359277 -316983 76863 122925 145002
8935 145002 -73052 -148343 -280414 -182039 -245326 -126253 123097 -123615 -436935 106746
8924 211837 -159547 275117 131118 -6025 412012 272430 393539 333279 119207 289918
8914 289918 -45548 422569 385747 400232 825834 1242041 2039430 3224866 7334314 9365528
8904 9365528 3655606 1735958 1455102 840935 401865 294281 272463 143951 80876 129468
8894 129468 54854 67275 270579 -76890 -176449 -202418 87907 -158844 46638 173043 -23350
8882 32062 104817 -5033 -32885 157999 77389 -85975 -131804 176960 -155388 45537 28898
8871 28898 -158930 -44320 -225716 -159021 44418 -120099 400378 -137332 -161565 -38782 -76341
8860 -76341 -241521 22259 -27449 -57800 -69971 -6610 -137944 -258375 -265337 89066 -111035
8848 120790 -222182 34858 -241900 281157 29899 45439 -181214 -277751 125010 236408
8838 236408 173588 22564 -37744 9082 29505 -179001 16725 -89033 -183082 -91955 -85147 -123839
8826 -123839 -85691 62302 -434410 136114 -19779 -82586 -108308 -132330 219893 -135089 76589
8814 -258889 -93021 -181723 -269804 164597 292725 -126969 -151447 -147136 19211 128689 -14402
8802 -136250 -150517 7450 96320 -26813 66597 -207429 -385695 333463 -90059 -309559 1672
8790 91609 -44829 -209543 -20659 209282 -314809 271819 135947 113273 -259251 63383 79970
8779 79970 -58766 350393 -144721 157811 106102 20429 -4497 -100809 -223346 -118 468728
8767 -71364 -137210 -67556 -28603 50072 -172277 -63523 279814 -302357 75829 21976 199485
8756 199485 188867 127769 -30867 -245890 19673 -25757 45871 -310962 141978 -46628 4372
8744 -192843 -385716 14555 250917 31438 82726 -87129 -30144 -126033 -482650 517155 404866
8733 404866 -153804 -78982 210127 -13754 113870 85157 209890 85234 38917 88751 -208063
8721 239641 7496 -68130 262131 -24086 -37198 -132055 -58473 -235285 81344 26343 94648
8710 94648 -142944 120267 -109776 95480 232704 104963 -22544 -16542 130295 101201 -62499
8698 -142029 -61416 174599 -94858 -107927 -282170 -186670 -90550 10420 -83813 -274077 -112410
8686 208490 -530657 113627 -445356 -194944 56504 -285092 179566 -16856 -56525 -285645
8676 -285645 -8346 104492 -143787 -46890 187212 -31131 -75528 -247019 292629 354565 78551
8664 118789 -124857 85072 -301162 -217652 -187728 -346360 100053 92646 6315 -361781 150386
8652 6985 50058 295729 -243231 56336 160479 -320543 -218246 91283 -156891 190166 -143278
8640 47110 33087 -38040 -194020 -102311 -69611 -193238 42733 -139910 151138 152202 -114613
8628 -82148 -31898 -54772 -151980 21266 342031 -46506 -90590 -26470 -79842 -233839 -147762
8617 -147762 -70133 -49161 -244528 -77665 8600 -129954 -136304 -251764 155126 -144273 169104
8605 -113925 53886 -121845 -255456 -5992 -20874 -34169 -41777 -98245 -308318 33498 -23181
8593 47761 -59919 -56668 -99161 62651 62238 -92383 -138716 53284 -56508 -62542 -136884 -134936 -201496
8580 -201496 209199 -357439 -85061 -241789 122055 -233315 1108 198311 130812 116385 -170193
8568 130870 162529 -102476 7727 -176316 38592 81119 -319972 73220 62611 64548 -42168
8556 43554 -234269 79759 47020 -136478 85137 274191 -162985 -212073 -80551 -36826 -200803
8545 -200803 229611 -341201 -13600 281921 51060 -288758 -81088 -250433 -34943 63830 167630
8534 167630 -233298 -15709 -81162 -80521 -160574 -247341 -55203 13336 -113506 -256003 185933
8522 -358768 -112520 -135539 -308633 -199673 188927 90516 -270621 -193413 184489 125831
8512 125831 -19898 -420724 -55775 12883 18058 -124189 56002 23882 127840 -191187 27557
8500 -23907 398765 353077 -341720 -305906 -127953 165167 -122049 -120646 -10251 92883 -127847
8488 -7201 -71539 158997 311342 347920 44275 -39619 -145062 76979 -252856 -176409 124384
8476 -184170 -75774 -393419 -42505 140073 229689 390197 164909 -266017 -83081 70468 -101703
8464 -261669 -77490 -76127 -185314 24528 -1556 -235332 94218 44293 -25626 -259034 37036
8452 94291 -64363 8425 -60287 -12676 -105140 51244 -386786 -145074 239489 -461803 405134
8440 228684 154186 18064 -92140 63984 94846 -133591 127733 -201710 -147520 106123 71209
8429 71209 11871 -194033 -333774 64306 -48931 345103 -298881 298797 40563 -111289 -176704
8418 -176704 -170406 -169666 -158776 -292701 35628 -277033 -76372 130289 -45976 -48627 74709 -114593
8405 -264897 -45302 -80524 74467 101924 121416 -16310 -53480 -201341 -111015 -13077 -77863
8394 -77863 115777 33355 -256614 347529 -95153 129561 109502 -132521 -124173 166213 257899
8383 257899 -20037 -148688 118815 93162 63990 -138180 147266 -6196 -199090 -370517 300612
8371 -80683 -110569 -213692 -118966 -98475 -121473 287616 158062 60653 -8151 -242069 4151
8359 -340947 75742 -133756 127476 94201 -195511 -94494 158175 58841 -94452 -27366 -72462
8348 -72462 53637 -81654 -327939 -94482 182826 189020 137958 -5844 -112392 114243 -196354
8336 -417801 -330377 234086 -398943 -254014 -129238 245750 -79873 -129177 -50889 2557 -283551
8324 -23449 -69320 210064 -178615 -83053 9099 -183559 -221409 -267215 -301989 147607 121972
8313 121972 152849 671 -560916 -23962 12834 18270 159095 -289751 -199619 -355131 -304434
8302 -304434 219127 330938 -227193 129627 -293060 224443 -33758 -8951 -61274 -522321
8292 -522321 -24818 101452 -130827 36086 -10545 25609 -417634 -370568 -156905 76437 -120427
8280 71674 206362 -339731 -99624 -154265 -87279 -2747 49257 -88753 -44606 -37952 50675 -197948
8267 18721 37064 212835 481597 -83541 -266386 53136 -92050 -60239 -200100 317639 57823
8255 -60142 104863 147240 123787 -54733 128063 -23076 -258524 -203903 -366321 10044 -76491
8243 104629 -199786 34841 356365 -271862 -89840 319161 133896 -25838 -394809 5118 22009
8232 22009 54792 -361045 144466 -66545 -126402 -50682 60622 -86605 -78070 -108376 -198094 -56393
8219 105560 -138636 291180 42250 -49142 299081 23241 117438 120999 -71258 -15999 -147023
8208 -147023 -88437 -215751 -48934 -254433 271954 27928 -115987 -191985 108519 48914 91319
8197 91319 -207342 -245278 -84232 -37520 -2044 60728 4547 11814 -245463 261852 305033 132213
8184 -28340 -442727 219880 144695 191971 -56784 -56111 147549 -234126 -246029 -161190 -335666
8173 -335666 90427 -171429 1634 75646 219401 -71049 -430916 -181436 -25291 113226 -68658
8161 166935 -127040 1780 -38059 -103222 98091 -137588 -41841 -293790 -1977 161657 96794
8150 96794 -72479 -80801 -281357 -83997 -142789 -133729 10647 -168413 180823 -106224 -271054
8139 -271054 -120357 -41298 181897 170828 -89082 245695 -115807 -7832 -151144 -83770 -182566
8128 -182566 -194511 -264536 86362 47073 -625196 77137 25094 18136 -38355 19944 -247953
8116 -284230 24684 -287984 160720 229110 -318133 71329 159713 -153372 -65967 186735 21605
8104 -177228 80493 -179205 7503 61158 5343 -122081 150627 82502 -154586 -330098 -117640
8092 -513243 224258 -206419 -44301 -294301 -267808 140783 99305 -114340 1884 -27795 -10198
8080 28160 -222084 198598 -212640 -173673 145057 -478977 -163271 144668 22237 -210796
8069 34011 -191155 -19270 56192 -10618 -225225 -9932 -263053 54449 120863 -126421 281499
8057 -47413 163454 -92123 77188 -260009 -115913 -299667 115449 84441 -136651 -206589 -23860
8045 -162204 -355922 299998 82440 19375 165966 244596 115689 -227504 -234013 -316207 310558
8033 -38056 185757 501 9316 -16349 -154791 -65921 -209981 -57527 145740 229211 59138 103327
8021 103327 -115549 -127119 -254642 -239655 41193 35804 181684 -54833 -137680 146232 -65002
8009 104491 -418347 -101239 -212880 103568 12057 -65704 207060 102684 -37334 134579
7998 18998 -191528 -212567 -348582 -102935 -546386 9186 -168807 -226132 -156774 -98987 12842
7986 44067 -338945 -217248 126142 13179 -104209 -84930 227443 85936 45767 -213101 18422
7974 -182547 -146364 -209671 -87964 -18231 378798 -77245 45356 67587 -116566 -70845 -163755
7963 -163755 92124 -220854 -12443 -243210 -221652 -113747 79448 -116505 76533 -27559 56838
7951 48946 -150164 -130788 -41844 -160445 277083 -84393 -31671 -210602 79433 -46402 -49354
7940 -49354 -118258 309288 -86031 151244 -160476 8948 58158 177948 -114645 66417 91463
7929 91463 -90401 -305126 -60305 377724 -187874 -158960 -74567 81722 -10319 -18341 -89639
7918 -89639 -33615 16260 161839 225585 -88880 23571 120691 184916 -201194 -88894 -169868
7907 -169868 -128514 -51871 214847 62179 43639 -476524 -308452 -8456 36011 344746 -101552
7895 77757 293255 -534895 -38538 -169994 229172 129521 28078 72985 50831 -120607 135033
7883 -172159 114732 -195266 158043 -418036 6028 -133095 -95055 205739 117283 158903 -20788
7871 49226 -67429 -25554 146000 -20295 -125340 156166 -165034 22544 -197266 -134282 73533
7859 116374 41479 -253161 -242206 72766 -5159 -100653 -230803 203684 63557 -92749 -370632
7848 -370632 -122570 20678 -112020 -98520 -22803 59976 -258982 -142162 85315 -16050 -120718
7837 -120718 169783 106322 -546858 -95274 276124 -200265 -455711 -42896 -382450 -164378
7826 156564 -176267 102696 -213290 -59926 37017 61300 53098 86915 -167008 217436 111850
7815 111850 83518 -97530 -173311 28581 265292 307839 -115988 -5719 34859 249650 -21635
7803 31699 149528 53220 -268235 -91469 -189520 280 139028 202505 97038 37162 277279
7792 277279 -26626 47466 -154759 -237784 -43744 38168 -23626 -182140 137021 -142424 149445
7780 -348187 -34878 -152307 54118 -23776 -36504 45225 53965 -218814 -368568 -302104 120766
7768 -151961 -204409 403857 325902 -58793 -217869 -112926 -54512 109198 222273 8919 -52424
7756 -28558 256006 147339 -117909 111179 -23196 44296 -299419 -190591 -298910 -44718
7745 -161357 -131166 116486 -40813 90253 -64511 -269088 89516 9689 -220598 -94838 -156214
7734 -156214 5839 72499 108663 20610 -166020 205463 276103 141592 206446 -2009 -62002
7723 -62002 -309110 201614 59302 165566 155898 -174103 130336 255173 -64980 97548 25869
7711 136702 32596 -310501 95089 244872 -51896 -345226 -130971 196749 -47025 -101077 -226202
7700 -226202 148955 -201218 -107541 -176264 -218141 -153282 -141 -156557 -92429 -7318 78634 -115009
7687 102440 -117272 36908 -87948 13872 252065 75483 -160971 -302755 -87258 -163857 -58465
7675 -216696 -177635 -33656 -513674 49428 -61844 28743 120784 -1910 46853 -88860 -151462 -119131
7663 -119131 -127098 185606 75211 -805 -195744 -280367 -152026 -74400 -101670 -83350 -321415
7652 -321415 -72286 5645 -304943 185098 -117780 -51071 -79150 106115 -23547 -24055 -6957 -174307
7640 -174307 -223125 131836 -10032 208397 -238452 44041 -27918 -142092 -311721 -53788 -148586
7629 -148586 35116 -128604 -7460 -52106 -13665 -227346 -45356 -241050 65715 -254157 305138
7617 -403336 -117730 -333366 -78117 -104663 -33362 -225810 -833 45758 71890 139546 100501
7606 100501 -264930 -52087 65015 -74189 44712 -185629 -169192 -316497 54902 88015 -17892
7594 -40448 101637 207524 -90726 -96953 -9377 -35035 47518 -85871 -126414 128426 239685
7583 239685 35419 -173272 -34590 -291406 -50324 -23835 70425 433986 -236999 -194503 73429
7571 -118771 185697 -158667 -32785 94188 -114577 374640 11094 8140 -243839 -72140 103152
7559 -5230 242170 -37621 -201876 -147001 224034 -106265 -248354 59192 -381195 -205880 -72804
7547 100703 -132996 -250162 -219775 109631 130203 133225 -259006 -15368 -53105 40018 177415
7536 177415 227022 108410 -98041 -219175 283390 -97164 26710 -87591 131197 112036 -15289
7524 133837 -267052 28388 118557 205257 99711 -21511 -55232 -63512 74785 34519 -90158 -120931
7512 -120931 -279946 165804 -4707 -99948 -88907 -264627 126545 -240188 29833 62355 -242427
7500 -89700 -249412 170216 117363 -124 -155706 92400 84505 -24254 237360 -126099 -120730 -103411
7488 -103411 -113265 175570 95200 227163 -30400 55319 159449 -407373 -101082 267850 -141378
7476 209258 -14226 57618 -31597 26475 -63873 191284 -207234 -9425 178014 -72651 -369095
7465 -369095 -290926 -89974 139509 -66898 -22986 17061 -82208 -523979 -140386 159772 -378811
7453 92697 -348513 27139 -235241 75327 -49724 -268656 -225634 -178951 49121 322471 -351274
7441 -1153 128433 125075 -103473 204719 -35881 -8032 16220 26686 -6363 166606 202723 -95340
7428 -106200 -189886 -174197 204903 -53991 5532 -115369 -35572 60087 -44173 115642 -174119
7416 124321 217851 122704 -97845 -265676 -79623 -405253 -67161 -77266 -70412 125933 -185619
7404 16005 38803 -93696 -99808 -59659 -87143 -117545 -239279 116894 7222 -301605 38157 -44947
7391 -282327 -107260 -197947 -145367 -37377 -110274 -44595 -112175 7693 -57069 125416 -111103
7379 -489987 83190 -18543 -86729 210512 -40791 -85563 2229 214473 302467 195255 26648
7367 251671 -149109 -282618 -243469 155629 -234631 -98059 -377952 -222010 -215842 335851
7356 -479272 -144538 122654 -598628 -234617 -185794 45648 24410 -212732 22404 156763
7346 156763 -153459 107933 14888 92084 146587 214469 -7651 18462 237830 -50515 -148792
7335 -148792 27032 -111157 30558 81591 -81557 -174628 155521 -287240 -30170 101729 134115
7324 134115 2944 -9578 104406 -173097 -23104 194178 -71651 266761 -68920 -365917 160038
7312 -194697 174909 -202987 -351384 164197 48837 40314 -201488 -112692 -154318 -246827 194783
7300 88334 -58854 152627 -134215 -55267 271397 -133015 91434 -71545 86059 -111689 -65439
7289 -65439 -4397 -176830 -104536 234423 -123218 157875 -85321 38996 -69075 -173940 -52758
7277 -21877 -28543 -29828 210657 -351296 -69499 -151378 -17900 -123346 -4393 191800 -123429
7265 -150477 194835 15952 -72007 132253 -139236 -200737 -107932 22539 -282504 -271544 -51127
7253 -305154 256121 -148688 175215 74247 -270622 -66413 -213584 -132249 -236404 -7806 -2353
7241 -77508 -124648 -129821 14605 47034 179224 -244228 41781 -300257 1921 98520 -114290
7229 71318 136077 -214864 -14132 -115022 -49714 -231386 96605 -166887 81774 -277535 -97333
7217 -234630 209643 157115 95637 -120453 60496 21924 807 -135502 -365220 117639 81776
7206 81776 -2482 102813 -188672 377968 220416 49813 79471 -144967 10784 -129954 412236
7194 199093 -61800 -225726 227451 -289148 -52761 293151 157057 -18960 16524 -122746
7183 -111995 144080 -153895 79736 35264 -270265 -154417 -72279 106980 -213675 167208
7172 301353 -31639 -185760 214338 269067 233007 -273316 -3885 -129737 32480 -254768 178929
7160 -51151 -57757 -267802 362690 198578 330810 -68460 41768 -4798 149504 8638 -255408
7148 -193419 105478 11549 -188471 84182 62579 -166673 -344619 -180676 106308 102722 69668
7137 69668 -177902 -132376 -95064 44579 -227070 115342 243008 163137 -242691 -37160 -258890
7126 -258890 106902 -14786 43085 -226643 -79182 -90214 -136468 -261237 352346 -255940 212505
7114 61195 109186 -141728 -39839 88977 -105013 -129371 -87506 -25214 -9944 -232218 -251146
7103 -251146 -139319 119296 -199786 -95138 -75323 53109 -154097 -288446 37106 -253215
7092 58448 -60101 -205050 -78716 205190 -120968 59677 -9806 -371712 87194 285069 -65398
7080 157672 -364613 118484 31706 -255253 -246781 -268339 160198 188672 -133126 269277 6203
7068 -193770 60357 -19293 -416214 19390 303758 114151 131593 328716 -136424 -60417 86810
7056 -83625 -251074 152449 -228218 272585 18079 143372 308156 -73735 -133866 80103 192843
7045 192843 -163268 124391 3296 176428 -89245 95568 -154506 -37604 25230 -82764 -49045
7034 -49045 -105367 118569 -96079 -246095 -434639 -12833 -152960 128028 -133587 503184
7023 138388 -114139 14302 -67299 238625 11041 240348 -159065 247258 -109118 -61973
7013 -61973 396120 387075 154104 45690 59072 -142629 -200332 305235 252037 -99845 175359
7001 -53149 39095 -113806 -175981 103922 -323410 -148796 51995 -13594 -40905 -217347 -86490
6989 271640 -6980 139205 96722 -71505 56769 -316027 -44848 -27857 -52019 -175888 22354
6977 69786 -118042 270466 -34129 -22843 49605 -90728 -156706 360349 -10972 196964 63457
6965 44633 107128 8374 31225 24054 170433 -470 308040 82470 23019 226767 -234062 -308471
6953 -308471 13380 52808 207459 -200029 -136709 191646 26295 -172678 20856 16869 -213108
6941 -121681 -150239 -441658 -223390 -258183 266702 96960 94290 30680 89600 -7258 8049 -114593
6928 71782 129003 -67267 68402 42420 145697 247357 35198 424716 -120096 -70676 -166805
6917 -166805 111532 8279 36419 -79427 -229314 57365 178867 35063 33374 -102304 130837
6905 265797 12894 155626 149647 113101 -303445 220961 -129724 41459 -70344 112917 -127688
6893 -55308 330822 60958 -221249 181985 -118917 -206010 -227471 23100 230604 351145 -268212
6881 171307 90268 -35451 -103884 -245937 -115154 -1712 -61755 32844 23267 59230 186409
6870 186409 350576 -104981 107438 -201545 471975 -149007 259463 25589 156527 -66122
6859 59422 287127 -54561 39515 -72895 -8132 51342 70894 -21588 -215040 -106465 -240658
6848 -240658 -107191 -193384 -210172 -54686 -169866 -205789 59054 166823 -265151 76809 -187077
6836 -283124 31047 -179420 -26430 462152 46365 -328526 -121207 227070 -21973 250303
6825 205574 114438 53017 172241 -10742 30769 78536 364392 49557 116093 6303 39424
6814 39424 184141 20838 -16439 -36337 123087 -6711 -314548 301534 -247001 -202760 148668
6802 60810 118607 74549 46358 -57017 58199 -1365 -80692 -284234 -10691 -136801 34663 -169839
6789 -223316 87949 -23090 -340643 -68762 -216408 96458 -126247 -55017 -115218 102471 -82818
6777 12761 -344314 6614 50628 20417 -200599 -29038 341386 -266217 194080 -35765 67559
6765 -161130 -156770 219291 118357 -134672 -10051 -502262 -6145 -67866 66541 -488338 9297
6753 378918 11831 -44281 82912 -264332 59497 77956 158785 -206461 -143990 15555 -184597
6741 399269 302684 182718 81667 -53374 -234669 25405 -251593 150638 -139924 -145735 86385
6729 -152826 -79206 96479 -24941 171193 -37583 201819 -343266 -240058 106895 166237 -20296
6717 184205 -81609 -154155 72241 -42372 65831 240925 -164813 79500 320728 -112085 40324
6705 -132276 -32366 40734 -154566 211252 83872 -62842 -3322 -105505 -131422 29414 -30960
6693 -9294 10970 213705 32178 178833 125669 -69391 -19306 -26332 122378 -152967 35896
6681 141080 -52427 140361 -213968 249729 72110 -349197 -61351 -220275 -152810 -83320 96593
6669 235977 -10060 -123827 -169688 -53802 -60827 225157 265066 -86020 237352 -158115 -20971
6657 -53634 269539 -43699 -85069 68396 -44354 -124147 -287807 -220966 -211570 170742 -102127
6645 209205 -184699 -74174 194435 -237245 301328 164255 -125596 35305 97803 58903
6635 58903 371511 -135793 -140038 406852 -282389 45979 -180901 -46598 -94776 -183446 -87422
6623 125966 -61620 -191772 24903 -270874 106657 -234842 49103 -231461 -372224 55848
6612 266402 72440 177183 86416 49049 -4973 -130308 -164015 82574 65114 149973 -55631
6600 73053 -82452 137857 -6622 30591 -66899 -167842 -23791 15318 124625 -63826 25691
6588 -69968 82143 11224 -63194 -211376 -293842 -149266 109380 -262887 104920 -2144 -264302
6577 -264302 -153110 -176312 -72331 24961 131568 140768 -54319 -301328 349463 -160987 -58944
6565 386577 -102150 277580 -202722 128034 -130571 -42980 19284 11214 -260508 11158 -84572
6553 -271901 -75988 50497 265089 -201960 -103739 -25694 165195 -194109 77108 443301 93479
6541 -9310 304855 -279457 17175 -45846 -82625 -109798 175946 174857 112856 -240126 -185125
6530 -185125 186992 -347244 35595 301779 -175457 134144 136854 -6838 118189 28203 -34634
6518 -21675 -94374 108979 -122843 534928 39742 -310630 -218246 48049 70612 83754 -5297
6506 -64863 -283397 -83872 -34300 -5344 -189112 129548 273452 -251696 8120 139850 349720
6495 349720 -127153 164883 -60625 -423042 -525591 375205 141818 -189850 -182554 60442
6484 132083 -151109 26692 117894 49065 67912 -237891 -157019 36524 -190738 -209914 -306519
6473 -306519 160694 61795 296737 148250 -55718 15983 92382 -281666 156580 250860 109399
6461 151332 45720 -13308 -267878 92585 -352026 106186 -255353 -347854 -14903 -106924 -100767
6450 -100767 -311494 -164061 -152557 -136481 2390 -19716 -19302 -115748 31159 -251071 -87881 118315
6437 49468 -103900 28545 -76047 -58693 101557 180268 15739 -9096 115940 141004 27896
6425 -6920 -165850 -26281 77466 86262 115829 262855 -158910 -77098 91048 -31909 149356
6413 115389 -20498 -189756 97573 -380784 87631 -82877 154174 -15071 -95074 -210254 -128311
6402 -128311 -77023 -104024 285109 233813 -187617 189645 138695 -91179 -118250 -249803 189258
6390 -102587 4667 -43939 200595 -209465 122907 -46565 94777 -250770 28924 48719 -22905
6378 182161 -176546 -8921 -152144 -47718 -146561 208920 237917 -267396 6338 587685 -290301
6366 27808 -272083 288842 -21908 -120204 394081 -199584 -199709 6860 -342932 251 210565 -584867
6353 27029 32765 32109 -85280 -263207 -293990 278701 -17917 -53780 174681 230417 -3236 52025
6340 7917 372647 -33153 216528 -135758 158789 80795 -129868 204005 -202618 -131788 -37614
6328 139728 -52744 49986 65323 75981 115288 71647 29092 -155628 278154 -81371 71654
6316 -107846 954 -142301 -245172 -456594 378775 -51806 133200 91795 -131166 -16369 216313
6304 -281216 -94028 86463 92609 471734 55499 172112 -130846 -1271 13639 118273 -193439
6292 181811 -113372 -8973 -16519 71518 -377293 56606 194358 -175190 59428 -28564 -160735
6281 -160735 -106470 -94600 -17310 310989 -235750 151985 -124996 189253 -108859 -139834
6271 -139834 29841 158030 -264665 -127540 287885 -2078 22303 97788 -114277 -291933 92218
6259 -138452 127096 -250234 263316 -40979 -199787 75566 -293276 106176 -171195 168905
6248 36672 -154085 54535 438840 -20272 -236253 -238001 119717 391098 -140913 -66380 -45606
6237 -45606 337837 234523 52372 -94348 -984 104517 -49675 -67544 -245460 125447 -206753
6225 205255 111742 130993 96027 123027 70174 -90740 13057 145085 -108020 -218769 56976
6213 -277812 -117531 107576 -229191 -4726 -88298 31711 128899 68045 118586 -432436 -65775
6201 391025 204886 -124997 99775 175739 96730 430310 -87929 -10028 80091 165656 -51898
6189 -54723 86687 -313498 136273 121602 -12369 114290 -126758 112868 153841 -130827 -68337
6178 -68337 195506 -9877 -187179 -213498 -46630 190193 -232356 26404 264266 136262 -175457
6166 48656 -179469 -71127 5641 63961 114262 -58280 261268 76845 204823 -110228 -169660
6155 -169660 -324902 -385986 -40837 -179909 86413 12811 -127727 -224239 298155 -113210 -28283
6143 -41987 -243047 -358908 -65581 -171189 691 -23938 -177481 5637 247835 176839 -37897
6131 79519 -144884 107731 -207877 282216 -41032 -127239 -68972 -135353 10950 -51688 466275
6119 -78375 -7373 -808 164157 -106845 3852 105301 -44255 232623 -164882 -335697 154962
6107 347183 -37561 41802 -21612 12523 -41901 -109620 104791 40044 103410 -252365 23404
6095 -64052 159 -252202 -18109 -337159 131946 -99574 159799 208459 23752 -34556 -214608
6084 -214608 -25727 -65663 -303015 15607 177062 -34684 122705 217561 189493 -220334 -128002
6073 -128002 -110162 -62278 -145902 -87964 8352 71023 43600 127986 -148283 11812 75856 -255270
6060 -192953 -336491 -215645 57249 -41248 -189440 152166 -124015 88308 -185085 -133438
6050 -133438 66991 70533 87721 343397 303553 -157774 24928 15410 112771 -102372 -255673
6039 -255673 50306 251495 -446964 -269530 41007 339030 -5104 60858 -90143 -156793 -126612
6028 -126612 -107560 22949 107557 59692 -309323 125089 134668 -132913 109560 73151 4072
6016 -117280 -43369 105797 79886 -214070 217458 890 -217241 -41643 -148537 181661 12326
6004 46291 21226 -299344 151195 -93575 -45169 92295 88007 411430 -77339 36923 57348
5993 57348 -3473 -99970 10650 12311 293126 179732 11764 -143836 -100947 31735 -15196 -209290
5981 -209290 339070 -300541 133533 74990 83475 -88339 166874 -371608 72822 62857 350636
5970 350636 -49799 32463 -63316 -136269 -188818 324623 -106839 345370 4880 -183660 112688
5958 -43783 -95611 -246409 139130 -411451 171213 -224173 148843 -63745 105915 94207
5948 94207 142736 -32606 182839 -145752 -209689 -341741 -83857 3103 -20455 205310 -238735
5936 -8276 30174 47061 61477 -211039 -7220 54272 75354 -307318 -278041 83744 -64630 -168717
5924 -168717 -102839 118784 -273603 3919 122099 -158077 -64362 -142314 -84276 58798 -92680
5912 49852 -73680 -16535 -337949 -32979 -101359 -99878 18700 -284115 172891 -437226 65690
5900 -125103 -78556 60865 45393 110824 130488 73958 -388157 287840 -376800 209033 219053
5889 219053 49739 -220698 11821 23550 -369362 -124228 42611 24496 -59741 -104687 -138437
5878 -138437 -158257 -155294 -3340 35641 -7204 -43107 -304420 -102830 270868 -55078 312697
5866 -292199 32560 82435 -342052 300467 71053 -282696 120238 372771 26533 171014
5856 171014 169802 68383 -211121 -215597 -74902 -142701 -21223 258226 322191 112423 -159803
5844 70770 -77592 -56461 -6156 338612 102346 73383 105871 -399527 -117762 150451 -39464
5832 -100451 302744 -16975 66759 -35365 -7962 47080 -19492 236373 255842 -230880 -246755
5821 -246755 15371 193149 -108275 120647 -89664 66981 -234741 -255105 -92546 -17224 -77702
5810 -77702 -54340 187099 -127702 189819 232996 184045 -10253 214172 217419 270575 48859
5798 193636 202969 -135006 92319 -251806 -81970 -31721 -157268 -90895 -108065 -146247 -227673
5787 -227673 -15325 114982 -229520 58951 -94949 238139 59241 -89472 -171014 -36130 -129437
5776 -129437 85527 348290 15897 -5764 -16264 27582 -210658 -317243 66318 -53802 409680
5764 34597 -293675 -11071 -14998 28190 -75190 217550 173484 -32489 -286497 165131 217042
5753 217042 -89343 -6132 -17993 -274304 32347 937 -193093 -24604 109383 195564 -335782
5741 -283513 103289 -169150 78951 -29934 122119 -62684 -507878 202971 -52021 20879 88086
5730 88086 255937 -34519 -146657 -198750 -16302 -196507 -136685 -168824 25566 -183851 -40136
5718 -178804 124244 -49720 23537 39575 -6432 83753 -7167 -130432 93234 94434 168118 -82190
5705 -48872 63500 -32590 121132 265701 -133558 204464 109892 154928 -170484 16283 35064
5694 35064 -206625 137881 29154 79540 70712 295163 182140 70281 67861 -65706 -168363
5683 -168363 -61254 268535 -159936 43701 -66680 4257 5589 -4867 -2379 -48253 92621 107713
5671 107713 -263281 -82083 -28648 -128135 34243 204652 294756 203488 55325 -121450 -4304
5659 -95997 36360 92977 144564 -121575 274891 -239472 -38434 -176381 345879 5904 -93704
5647 -195206 -137063 -24571 90590 -216569 -139505 -202452 297024 -23401 -428937 -71954 202120
5635 -137222 -42368 110695 -82641 366160 8958 140581 -72539 -25781 -97591 -174503 313762
5623 95465 4766 -31580 370073 -127015 -138596 -256328 64505 188118 10210 -8955 -46706
5612 -46706 -103568 1452 151518 -61729 -182697 11369 -2575 -179561 278506 -178490 -102554
5601 -102554 -68762 -280014 -30757 156393 204658 -7197 253692 23388 124761 103394 -151076
5589 -41247 90414 -21982 -147357 40198 -27538 96246 -178598 -242564 -3102 14563 144610
5578 144610 274071 -173991 -217931 -12353 150246 -157848 152793 150609 -86202 -288337 164498
5566 -280899 39423 91957 188286 266357 243211 83718 -39101 -26673 15058 -78137 -48584 226805
5553 -462090 131206 -179595 -72239 182571 102451 -178535 133413 -47664 -12914 -56989 127633
5541 -46765 -40427 -110734 295 368687 -244898 226514 -117749 1283 -51889 -286271 -105185
5529 58847 -154682 247588 190170 -168869 213075 -138345 -38690 -257264 -51741 -60540 -293881
5518 -293881 7835 280938 221778 140776 150231 17869 -287940 210479 -232484 172835 37121
5506 202983 45586 39085 -71073 11767 140990 -215037 -138542 -19016 115303 61133 71237
5495 71237 106078 -82055 -174777 -55810 -118324 -43023 255120 189810 -137843 39598 55869
5484 55869 66622 -10887 -73446 216102 -214741 363623 190272 374813 -128992 -564352
5474 -564352 438762 -51769 72283 240151 332531 -598 7880 25077 -110508 -84257 40617 -78280
5461 -33531 -4237 -28267 -358665 115164 -171093 -40178 -225280 182992 32386 75468 263817
5450 263817 -98961 -27594 188775 234572 -337335 -134499 231793 -34070 94557 71089 49145
5439 49145 164887 -21546 163215 -111016 -93448 295534 125712 -75289 176769 -10172 235127
5427 -282397 -199672 -263674 -144325 -44330 171328 -100347 -65709 181034 -17146 61047 -101449
5415 39117 119297 -48155 -227980 198407 -9414 19658 87145 -88044 247920 -6518 -195339
5404 -195339 124181 -250103 -95606 -39934 187760 -41416 -6629 285389 106308 -150716 -205977
5393 -205977 -16565 -74584 236285 127440 463798 -247513 -196930 473748 -36732 137662
5382 -54250 -156590 89431 -27411 -80285 -310148 -231231 -247076 -92263 176446 320575 158377
5370 109875 -568398 53844 -262485 -234175 70309 442628 111163 -122676 110267 -34836
5359 305139 -191037 320738 -23458 -244213 -144184 -6434 59915 -169061 -52417 -143421 40283
5347 -151832 -276949 57853 289638 -214848 331905 -116313 -170527 101632 117408 -154081
5336 -8084 178673 -219384 -40809 50657 137878 133839 -179809 192799 73321 84002 17996
5324 88803 -126622 -26875 461979 149873 -86008 107412 -165830 147951 153226 27949 128956
5313 128956 -31685 159458 -387895 196043 -52249 110541 -385325 -112733 -37957 -234601
5303 -234601 -81998 27817 -72776 212045 -1218 -238675 -35144 -68428 248699 -82342 -218817
5292 -218817 203353 -193571 100009 225129 -78365 -27915 217539 2387 114532 -164344
5281 -351495 -169055 54277 220371 290168 48857 -25614 -156294 -98594 289533 27104 212880
5270 212880 303014 -188198 113910 -111848 138405 33675 236239 145770 141889 175416 -304996
5258 -40233 209954 -268691 -25828 97844 70758 -146282 285860 -322296 -291296 -96504 -179358
5247 -179358 273015 61036 130362 99729 94370 39222 -99164 -66041 -341914 -158347 55254
5235 171797 -577 15856 -53044 -65340 211070 -155640 -97550 -135732 133290 314902 242836
5224 242836 -83442 40574 -92125 -223990 -216301 9291 -43396 -17876 29734 148931 -55334 -16802
5211 -168297 270279 -101012 -155840 244448 -2609 -248414 -275179 175563 62123 -109009 166235
5199 246612 81527 -92855 -83879 -30464 105137 204212 20614 -115544 42556 -218137 -38970
5187 34934 193084 357901 117651 407707 -14390 41128 178958 -125278 -224528 159457
5176 -92781 -163569 108776 -57930 22258 341512 91642 -29092 179821 36609 6597 -110652
5164 -165789 -278182 -237931 193130 -67338 -179357 14417 -33711 121588 5615 99783 -55331
5152 21903 77036 14218 -45787 -214410 12528 -52741 -68088 267888 -99806 100635 26092
5140 -94807 37435 -28516 -1890 183542 184733 289010 318916 57176 -9448 124493 -184595 -80115
5127 24392 61198 138700 145199 169054 73736 -285521 -68052 -24836 -719 -159207 73250 -103053
5114 9415 -70114 48165 176587 115835 153985 -42372 153004 144254 -128558 -82709 -93779 165030
5101 -39582 97757 341771 -82435 -16520 160210 3405 70832 -75054 147552 -79129 -62588
5090 -62588 -33395 71598 -65484 -13113 -119857 18391 -179014 144131 -88533 122520 -122925
5078 -206264 -220905 13070 -28170 -45138 -352246 202170 26260 -55287 -188847 -115985 57874
5066 68496 134512 270053 -56104 -157162 -122348 -85444 440876 5075 -155553 -241361 68260
5054 -97289 -283672 71895 -16754 93386 28516 134465 97369 89222 -126052 -10972 -117948
5043 -117948 -4086 95229 227679 40628 165053 191171 461953 -43089 -62028 -27403 -71263
5032 -71263 138404 -181753 84547 61410 14879 -117923 89113 301218 329163 102252 224537
5021 224537 158769 161336 -77051 109160 350790 -142535 5377 -149533 325647 -42619 -245449
5010 -245449 -49616 106263 -139730 2837 -66546 -195327 -15774 118839 -374973 -174277 -329839
4999 -329839 85922 153596 -115776 -91522 126851 -301237 76912 -39025 36435 188183 172382
4988 172382 -184575 -85360 235604 217164 77493 -176841 114839 89735 308726 270334 145104
4977 145104 -60934 -152262 -165455 -93475 -157937 -111427 251856 252485 38972 7300 -247074 -58267
4964 -184752 -192381 -436872 -267240 240021 -93199 1429 -8477 211427 -2353 193758 -77516
4952 -69621 -195816 107468 -57090 -76849 231669 -141166 297098 31720 -33914 -3338 -107911
4941 -107911 -117859 -20187 -34719 111389 -88007 111880 -2842 31367 -94623 -146999 89456 80398
4929 80398 -236991 87049 33562 217404 -111404 152769 116450 129091 22312 198834 182708
4918 182708 181684 -28036 112405 -306486 48787 -165463 214885 211177 -176709 181528 196555
4907 196555 -190156 -79158 -22690 -68511 -130382 18961 47524 -69284 -139579 39197 -62347
4895 130217 234443 -151697 15797 92945 -205904 -209982 30823 185095 46031 77281 -174533
4883 7158 -78915 3559 -27499 276679 14478 -113824 -196945 323298 78482 -231145 -68760
4871 65615 89657 54406 99324 221063 159727 -7962 -151135 -30909 -49559 84358 153545 -59635
4858 191634 -7731 -24980 -1417 -224062 -82633 258616 -39691 -190346 -150919 -157154 227931
4846 20146 -199319 -177748 -174515 -336711 -124139 -79277 -98287 -60602 76432 -79512 -155357
4835 -155357 -163781 -48406 -52403 -271538 -111389 -102183 -33570 22674 286487 -119579 -74543
4824 -74543 -196806 -553561 145012 -73534 360793 -69431 215431 63807 219280 -375914
4813 -49341 138219 44776 104420 150120 52577 105224 164276 91045 17078 -107233 -18518
4801 116824 -112105 9079 -67157 -45815 169766 53466 -219462 135244 12278 -38199 -68582
4790 -68582 41724 25014 -36800 -85924 152305 12952 169771 -227684 357107 294347 254236
4779 254236 141291 -167741 -60863 -18005 -183696 50206 -53974 127681 -71951 149774 -42005
4767 6329 -696 -167200 171817 189560 -7665 -36863 58716 -92133 -228725 37694 214975 14822
4754 292691 16002 -104694 58334 7957 -114990 189047 -171366 -108345 -7693 -124387 51855
4742 -249009 -105705 -60874 -23509 -127409 143738 -311742 -158070 -165336 152477 -203514
4731 302009 174959 304189 132061 50537 26301 -80666 66800 -209014 143965 -105193
4720 -30604 -99933 -34789 -48444 -114735 -118072 135746 -58569 159404 -167414 -176325 263655
4708 70731 192035 6734 250604 38957 8465 333809 -94733 137643 127404 -191281 -245104
4697 -245104 -165826 156213 127636 77273 -468529 15223 -40034 218141 -72981 41763 -86545
4685 39091 -162251 59293 148867 229472 1048 223876 -41473 -268448 31866 367489 52796
4673 -63281 -412432 313349 -113178 -102306 201423 241393 32178 -287736 -155050 -329149
4663 -329149 147144 -117216 137694 118749 -327210 -138909 -103738 149680 -258064 -38066
4652 -143067 187052 92398 9978 -108607 295464 754 39376 -19823 -174037 -232570 -50573
4640 296854 -72811 -202685 437719 224468 4926 200999 -12190 -139942 -41575 11476 -56339
4628 -250993 -41788 73682 339605 81170 -83953 475525 3034 -6222 -202731 143835 459349
4617 459349 280563 -211741 -68900 159804 219773 -181569 -26863 -70466 188908 -272127
4606 -18914 87750 -75974 -217858 -128997 -35824 3215 160858 188981 -23904 66535 -293741
4594 133223 -112969 18570 -244831 -182990 87508 84200 -150899 241627 -3686 -238043 -78833
4582 168587 -32930 54844 52712 13259 185098 -286511 -183870 -166954 248084 -312128 225464
4570 66978 -6494 59095 220854 -286758 24951 100612 215542 -235060 214128 -44191 -88973
4559 -88973 30195 56116 168165 -181608 -119705 7931 -121275 220963 28535 209930 64544
4547 -48717 -54285 -90470 -44155 -69252 175901 215099 33947 196879 -296311 -141364 210851
4535 -96973 -22706 -92196 55910 -120898 90451 -157093 97326 17256 43947 225635 23112
4523 -36665 52366 288146 250330 -73370 -276206 74077 -137572 -76562 115008 -98528 61727
4511 -66502 9892 -230480 49777 402913 52619 -178243 148127 -303835 -83564 29696 316100
4500 316100 -233346 327233 39968 -135728 60801 6765 25517 -70849 -191405 21673 22164
4489 22164 -25693 57678 -187404 -77993 -175779 -2477 -1655 141043 -74971 -84760 203635 91391
4476 122201 -280828 -84786 -206096 248297 -288397 208818 -278623 -227179 288827 57504
$$ [...]
##END NTUPLES=NMR SPECTRUM
##END=
