
##TITLE=UV1033_TOFR01-ROVE100A_6099501_PFSwfo4xtT
##JCAMPDX= 6.0         $$ Bruker NMR JCAMP-DX V2.0
##DATA TYPE= NMR SPECTRUM
##DATA CLASS= NTUPLES
##ORIGIN= BRUKER
##OWNER= Administrator
$$ 1.72 TOPSPIN		Version 2.1
$$ 2012-05-13 01:20:56.640 -0500  Administrator@TOPSPIN
$$ Compression mode = diff/dup
##.OBSERVE FREQUENCY= 400.13188235
##.OBSERVE NUCLEUS= ^1H
##.ACQUISITION MODE= SIMULTANEOUS (DQD)
##.ACQUISITION SCHEME= undefined
##.AVERAGES= 64
##.DIGITISER RES= 22
##SPECTROMETER/DATA SYSTEM= spect
##.PULSE SEQUENCE= noesygpps1d.comp
##.SOLVENT NAME= COFFEE_meoh
##.SHIFT REFERENCE= INTERNAL, COFFEE_meoh, 1, 14.96687
##AUDIT TRAIL= $$ (NUMBER, WHEN, WHO, WHERE, PROCESS, VERSION, WHAT)
$$ ##TITLE= Audit trail, TOPSPIN		Version 2.1
$$ ##JCAMPDX= 5.01
$$ ##ORIGIN= Bruker BioSpin GmbH
$$ ##OWNER= Administrator
$$ $$ C:\Bruker\TOPSPIN/data/COFFEE/nmr/UV1033_TOFR01-ROVE100A_6099501_PFSwfo4xtT/12/pdata/1/auditp.txt
$$ ##AUDIT TRAIL=  $$ (NUMBER, WHEN, WHO, WHERE, PROCESS, VERSION, WHAT)
(   1,<2012-05-13 01:20:51.968 -0500>,<Administrator>,<TOPSPIN>,<go>,<TOPSPIN 2.1>,
      <created by zg
	started at 2012-05-13 01:09:21.687 -0500,
	POWCHK enabled, PULCHK disabled,
       configuration hash MD5:
       AF F2 23 6B 01 CD 40 DD E5 A1 38 A0 06 EA F7 77
       data hash MD5: 64K
       1E B4 24 CC 61 0B A8 95 3E FC EC 93 5D 33 A6 F0>)
(   2,<2012-05-13 01:20:54.656 -0500>,<Administrator>,<TOPSPIN>,<proc1d>,<TOPSPIN 2.1>,
      <Start of raw data processing
       efp LB = 0.3 FT_mod = 6 PKNL = 1 PHC0 = 0 PHC1 = 0 SI = 128K 
       data hash MD5: 128K
       B1 15 5F 45 D5 40 0F 26 5A A3 72 0D B6 FE 80 4B>)
(   3,<2012-05-13 01:20:55.890 -0500>,<Administrator>,<TOPSPIN>,<proc1d>,<TOPSPIN 2.1>,
      <pk PHC0 = 35.34302 PHC1 = 0 
       data hash MD5: 128K
       B4 4B F8 78 BB 36 D5 14 33 87 63 9D 83 4B DC 23>)
(   4,<2012-05-13 01:20:56.125 -0500>,<Administrator>,<TOPSPIN>,<proc1d>,<TOPSPIN 2.1>,
      <abs ABSG = 1 
       data hash MD5: 128K
       A5 30 7D 6B 0E DD 80 09 FA C0 C0 25 C9 D4 72 8B>)
(   5,<2012-05-13 01:20:56.203 -0500>,<Administrator>,<TOPSPIN>,<proc1d>,<TOPSPIN 2.1>,
      <abs ABSG = 2 
       data hash MD5: 128K
       D2 04 5B E0 E9 74 62 14 D3 D7 34 C9 51 47 4C A4>)
(   6,<2012-05-13 01:20:56.250 -0500>,<Administrator>,<TOPSPIN>,<proc1d>,<TOPSPIN 2.1>,
      <abs ABSG = 3 
       data hash MD5: 128K
       32 90 75 51 00 83 53 DB F5 D7 67 5D B7 25 26 4E>)
(   7,<2012-05-13 01:20:56.500 -0500>,<Administrator>,<TOPSPIN>,<proc1d>,<TOPSPIN 2.1>,
      <abs ABSG = 4 
       data hash MD5: 128K
       FC E0 27 3D D5 5B 0C 9C 6F 4E E0 54 25 46 5B CE>)
(   8,<2012-05-13 01:20:56.546 -0500>,<Administrator>,<TOPSPIN>,<proc1d>,<TOPSPIN 2.1>,
      <abs ABSG = 5 
       data hash MD5: 128K
       84 3A 6D 49 9E D8 B5 B4 03 7E 2C 4A A9 15 15 27>)
$$ ##END=
$$ 
$$ $$ hash MD5
$$ $$ D6 4F A1 95 F9 F2 EE 17 82 57 D9 4F 12 17 8A C2
##$RELAX= 
##$RELAX= 
##$RELAX= 
##$RELAX= 
##$RELAX= 
##$RELAX= 
##$RELAX= 
##$RELAX= 
$$ [...]
##$TP07= 0
##$TPNAME0= <>
##$TPNAME1= <>
##$TPNAME2= <>
##$TPNAME3= <>
##$TPNAME4= <>
##$TPNAME5= <>
##$TPNAME6= <>
##$TPNAME7= <>
##$TPOAL= (0..7)
0.5 0.5 0.5 0.5 0.5 0.5 0.5 0.5
##$TPOFFS= (0..7)
0 0 0 0 0 0 0 0
##$TUNHIN= 0
##$TUNHOUT= 0
##$TUNXOUT= 0
##$USERA1= <user>
##$USERA2= <user>
##$USERA3= <user>
##$USERA4= <user>
##$USERA5= <user>
##$V9= 5
##$VALIST= <valist>
##$VCLIST= <CCCCCCCCCCCCCCC>
##$VD= 0
##$VDLIST= <DDDDDDDDDDDDDDD>
##$VPLIST= <PPPPPPPPPPPPPPP>
##$VTLIST= <TTTTTTTTTTTTTTT>
##$WBST= 2048
##$WBSW= 25
##$XGAIN= (0..3)
0 0 0 0
##$XL= 0
##$YL= 0
##$YMAX_a= 10939392
##$YMIN_a= -5567231
##$ZGOPTNS= <>
##$ZL1= 120
##$ZL2= 120
##$ZL3= 120
##$ZL4= 120
##$ABSF1= 14.96687
##$ABSF2= -5.58566
##$ABSG= 5
##$ABSL= 3
##$ALPHA= 0
##$AQORDER= 0
##$ASSFAC= 0
##$ASSFACI= 0
##$ASSFACX= 0
##$ASSWID= 0
##$AUNMP= <proc_prof1d_extract.lims>
##$AXLEFT= 0
##$AXNAME= <>
##$AXNUC= <1H>
##$AXRIGHT= 0
##$AXTYPE= 0
##$AXUNIT= <>
##$AZFE= 0.1
##$AZFW= 0.1
##$BCFW= 0
##$BC_mod= 0
##$BYTORDP= 0
##$COROFFS= 0
##$CY= 15
##$DATMOD= 1
##$DC= 0
##$DFILT= <>
##$DTYPP= 0
##$F1P= 0
##$F2P= 0
##$FCOR= 0.5
##$FTSIZE= 131072
##$FT_mod= 6
##$GAMMA= 0
##$GB= 0
##$INTBC= 1
##$INTSCL= 1
##$ISEN= 128
##$LB= 0.3
##$LEV0= 0
##$LPBIN= 0
##$MAXI= 10000
##$MC2= 0
##$MEAN= 0
##$ME_mod= 0
##$MI= 0
##$NCOEF= 0
##$NC_proc= -3
##$NLEV= 6
##$NOISF1= 0
##$NOISF2= 0
##$NSP= 0
##$NTH_PI= 0
##$NZP= 0
##$OFFSET= 14.96687
##$PC= 1
##$PHC0= 35.34302
##$PHC1= 0
##$PH_mod= 1
##$PKNL= yes
##$PPARMOD= 0
##$PPDIAG= 0
##$PPIPTYP= 0
##$PPMPNUM= 2147483647
##$PPRESOL= 1
##$PSCAL= 4
##$PSIGN= 0
##$PYNMP= <proc.py>
##$REVERSE= no
##$SF= 400.130005498355
##$SI= 131072
##$SIGF1= 0
##$SIGF2= 0
##$SINO= 400
##$SIOLD= 131072
##$SPECTYP= <>
##$SREGLST= <1H.CDCl3>
##$SSB= 0
##$STSI= 131072
##$STSR= 0
##$SW_p= 8223.68421052632
##$SYMM= 0
##$S_DEV= 0
##$TDeff= 65536
##$TDoff= 0
##$TI= <>
##$TILT= no
##$TM1= 0
##$TM2= 0
##$TOPLEV= 0
##$USERP1= <user>
##$USERP2= <user>
##$USERP3= <user>
##$USERP4= <user>
##$USERP5= <user>
##$WDW= 1
##$XDIM= 131072
##$YMAX_p= 457879086
##$YMIN_p= -50292265
##$CURPLOT= <Network HP LaserJet P1505>
##$CURPRIN= <$Network HP LaserJet P1505>
##$DFORMAT= <normdp>
##$LAYOUT= <+/1D_H.xwp>
##$LFORMAT= <normlp>
##$PFORMAT= <normpl>
##$SURQMSG= 1
$$ End of Bruker specific parameters
$$ ---------------------------------
##NTUPLES= NMR SPECTRUM
##VAR_NAME=  FREQUENCY,     SPECTRUM/REAL,   SPECTRUM/IMAG
##SYMBOL=    X,             R,               I
##VAR_TYPE=  INDEPENDENT,   DEPENDENT,       DEPENDENT
##VAR_FORM=  AFFN,          ASDF,            ASDF
##VAR_DIM=   131072,        131072,          131072
##UNITS=     HZ,            ARBITRARY UNITS, ARBITRARY UNITS
##FACTOR=    0.0627417313425165, 1,          1
##FIRST=     8223.62146879498, 282,          -98034
##LAST=      0,             1028,            -98846
##MIN=       0,             -50292265,       0
##MAX=       8223.62146879498, 457879086,    0
$$ Real data points
##PAGE= N=1
##DATA TABLE= (X++(R..R)), XYDATA
$$ [...]
63662D31256P115P303O362N032L937L501L825M278L867K561J495J244Q78l76j567
$$ 431256 438371 445674 452036 457068 461005 464506 468331 472609 476476 479037 480532 481776 482654 482278 480711
63647D80711j495q66j191k078j839o38p01k702m173k885o0J453R84K52N32J496
$$ 480711 479216 478350 477159 475081 473242 472604 471903 469201 465028 462143 462083 463536 464520 464772 465304 466800
63631D66800K618L927N095N310M625M243M716M855L412J123l2O14J789K215K081
$$ 466800 469418 473345 478440 483750 488375 492618 497334 502189 505601 506724 506692 507306 509095 511310 513391
63616E13391K093K077J547J058J683L121L556K045J55L36K987N952O759M774J183
$$ 513391 515484 517561 519108 520166 521849 524970 528526 530571 530726 531062 534049 540001 546760 551534 552717
63601E52717k244m122l866k013j60L0j780m202n459n131m230l571k746j194M25
$$ 552717 550473 546351 542485 540472 540312 540342 538562 534360 528901 523770 519540 515969 513223 512029 512454
63586E12454R54N24M83J464K680L469M437O355Q770J0518J1045J0598R740R226
$$ 512454 513408 513932 514415 515879 518559 522028 526465 532820 541590 552108 563153 573751 583491 592717
63572E92717R743J1031J1879J1687J1463J2513J4830J7496K0087K2587K4520K5357
$$ 592717 602460 613491 625370 637057 648520 661033 675863 693359 713446 736033 760553 785910
63560G85910K5554K6176K7709K9970L2824L6056L8980M1234M3514M6490M9472
$$ 785910 811464 837640 865349 895319 928143 964199 1003179 1044413 1087927 1134417 1183889
63549A183889N1422N2691N4321N5855N5534N2470M6979L8987K8209J6230O226
$$ 1183889 1235311 1288002 1342323 1398178 1453712 1506182 1553161 1592148 1620357 1636587 1642813
63538A642813l57n160j0025j4336j6451j6413j5830j6026j7562k0768k5441l0468
$$ 1642813 1642456 1637296 1627271 1612935 1596484 1580071 1564241 1548215 1530653 1509885 1484444 1453976
63526A453976l4645l7569l9213l9527l9039l8743l8461l6508l2130k7081k3358
$$ 1453976 1419331 1381762 1342549 1303022 1263983 1225240 1186779 1150271 1118141 1091060 1067702
63515A067702k0432j6529j1816q160o110m282j844M62K243M445P574J0625J2815
$$ 1067702 1047270 1030741 1018925 1010765 1004655 1000373 998529 998991 1001234 1005679 1013253 1023878 1036693
63502A036693J5026J8275K1789K3991K4768K5462K6914K8726L0452L2469L5415
$$ 1036693 1051719 1069994 1091783 1115774 1140542 1166004 1192918 1221644 1252096 1284565 1319980
63491A319980L9349M3746M7999N1829N5384N8841O1537O1674N7355M8112L5363
$$ 1319980 1359329 1403075 1451074 1502903 1558287 1617128 1678665 1740339 1797694 1845806 1881169
63480A881169K1468Q466k568j1387j7961k1912k2824k1207j8913j8062j9662k3424
$$ 1881169 1902637 1911103 1908535 1897148 1879187 1857275 1834451 1813244 1794331 1776269 1756607 1733183
63468A733183k8601l4357l9618m3498m6211m8932n2219n5085n6151n5352n3755
$$ 1733183 1704582 1670225 1630607 1587109 1540898 1491966 1439747 1384662 1328511 1273159 1219404
63457A219404n1860m8965m4509l9363l5097l2274l0126k7892k5727k3922k1857
$$ 1219404 1167544 1118579 1074070 1034707 999610 967336 937210 909318 883591 859669 837812
63446H37812j8659j4834j2295j2227j3441j3582j1767r259p642p162p082o823
$$ 837812 819153 804319 792024 779797 766356 752774 741007 731748 724106 716944 709862 703039
63434G03039o239n333m305l513k870j753l9J284J304N66L27O61M58o41j371l67
$$ 703039 696800 691467 687162 683649 680779 679026 678987 680271 681575 682141 682468 683129 683587 682946 681575 681208
63418F81208K178M782O061N564L845K049J096R56J003Q45L14j029l399n828o955
$$ 681208 683386 688168 694229 699793 703638 705687 706783 707739 708742 709587 709901 708872 705473 699645 692690
63403F92690o880o836o821n234j698J480K154J224J051K109L172M103O070R034
$$ 692690 685810 678974 672153 666919 665221 666701 668855 670079 671130 673239 676411 680514 686584 695618
63389F95618J1244J1859J2241J3817J6053J7571J8271J9271K1308K4085K6854
$$ 695618 706862 718721 730962 744779 760832 778403 796674 815945 837253 861338 888192
63378H88192K9135L1160L3877L8057M2981M6508M6935M4524M0905L7326L3889
$$ 888192 917327 948487 982364 1020421 1063402 1109910 1156845 1201369 1242274 1279600 1313489
63367A313489L0382K7382K6332K8323L2887L8293M3160M7311N0955N3881N6167
$$ 1313489 1343871 1371253 1397585 1425908 1458795 1497088 1540248 1587559 1638514 1692395 1748562
63356A748562N8771O2125O4636O3833N8811N0346L8988K4877R583l794j3160j8792
$$ 1748562 1807333 1869458 1934094 1997927 2056738 2107084 2146072 2170949 2180532 2176738 2163578 2144786
63344B144786k1662k2038k0774k0361k2970k8141l3822l9162m4870n1113n6524
$$ 2144786 2123124 2101086 2080312 2059951 2036981 2008840 1975018 1935856 1890986 1839873 1783349
63333A783349n9534n9829n8247n5881n3296n0238m6164m1369l7176l4430l2223
$$ 1783349 1723815 1663986 1605739 1549858 1496562 1446324 1400160 1358791 1321615 1287185 1254962
63322A254962k8823k3694j7904j2781q852n941l556j038J992N191P961J0393J3372
$$ 1254962 1226139 1202445 1184541 1171760 1162908 1156967 1153411 1152373 1154365 1159556 1167517 1177910 1191282
63309A191282J7666K3171K8917L3556L6188L7362L8995M2581M7463N1605N4053
$$ 1191282 1208948 1232119 1261036 1294592 1330780 1368142 1407137 1449718 1497181 1548786 1602839
63298A602839N5824N8087O0473O1743O1344N9305N5072M7711L7482K6146J5212
$$ 1602839 1658663 1716750 1777223 1838966 1900310 1959615 2014687 2062398 2099880 2126026 2141238
63287B141238M708n628j4761k1159k4853k7322k9284l0098k9825l0380l3380l7991
$$ 2141238 2145946 2140318 2125557 2104398 2079545 2052223 2022939 1992841 1963016 1932636 1899256 1861265
63275A861265m2349m6306n0988n5967n8971n8747n6571n4157n1564m8082m3983
$$ 1861265 1818916 1772610 1721622 1665655 1606684 1547937 1491366 1437209 1385645 1337563 1293580
63264A293580m0133l6501l2241k6961k1282j6500j4213j5597k0169k5575k9343
$$ 1293580 1253447 1216946 1184705 1157744 1136462 1119962 1105749 1090152 1069983 1044408 1015065
63253A015065l0677l0126k8231k5394k2604k1008k0581k0005j8217j5597j3340
$$ 1015065 984388 954262 926031 900637 878033 857025 836444 816439 798222 782625 769285
63242G69285j2035j1257j0440r765r794j0265r845p744n187m320n563o959o531
$$ 769285 757250 745993 735553 725788 715994 705729 695884 688140 682953 678633 673070 666111 659580
63229F59580m454k454j825k649m230n619o101n802n478n362m816l482k058j312
$$ 659580 655126 652672 650847 648198 643968 638349 632248 626446 620968 615606 610790 607308 605250 603938
63215F03938j115j161j891l649n434n614l807j190R85K393L302L941M328M328
$$ 603938 602823 601662 599771 596122 590688 585074 581267 580077 581062 583455 586757 590698 595026 599354
63201E99354L963L692L887L965K926J198Q09K812N653P252P682Q246Q774Q039
$$ 599354 603317 607009 610896 614861 617787 618985 619794 622606 628259 635511 643193 651439 660213 668252
63187F68252O567O748R577J3192J5486J6596J7772J9132J9898K0132K0840K2484
$$ 668252 674819 681567 691144 704336 719822 736418 754190 773322 793220 813352 834192 856676
63175H56676K4393K5643K5933K5517K4830K4296K4236K4718K5417K5650K4828
$$ 856676 881069 906712 932645 958162 982992 1007288 1031524 1056242 1081659 1107309 1132137
63164A132137K3223K2050K2417K4119K5794K6197K5038K2890K0643J8831J7008
$$ 1132137 1155360 1177410 1199827 1223946 1249740 1275937 1300975 1323865 1344508 1363339 1380347
63153A380347J4027R461M355j64m519r915j6154k1456k4612k6137k7020k7434
$$ 1380347 1394374 1403835 1408190 1408026 1403507 1393592 1377438 1355982 1331370 1305233 1278213 1250779
63141A250779k7126k6086k4291k1632j8644j6428j5132j3463j0462p038m646l126
$$ 1250779 1223653 1197567 1173276 1151644 1133000 1116572 1101440 1087977 1077515 1070477 1065831 1062705
63129A062705j122J733M390O256Q160J0902J3794J5441J5542J5059J4832J4756
$$ 1062705 1061583 1063316 1067706 1073962 1082122 1093024 1106818 1122259 1137801 1152860 1167692 1182448
63117A182448J4472J4149J4094J3985J3201J1897J1011J0827J0179P723L743r1
$$ 1182448 1196920 1211069 1225163 1239148 1252349 1264246 1275257 1286084 1296263 1303986 1307729 1307638
63105A307638k807n275r014j4298j9803k3913k6061k6962k7792k9155l0699l1656
$$ 1307638 1304831 1299556 1290542 1276244 1256441 1232528 1206467 1179505 1151713 1122558 1091859 1060203
63093A060203l1521l0183k7609k3918j9780j6403j4762j4850j5658j5928j5060
$$ 1060203 1028682 998499 970890 946972 927192 910789 896027 881177 865519 849591 834531
63082H34531j3380j1612j0096q702p306n935m488k935j909k225l384l470j443
$$ 834531 821151 809539 799443 790741 783435 777500 773012 770077 768168 765943 762559 759089 757646
63069G57646J212K287J812J878L531N507O386O578P205Q137Q358P796P483P967
$$ 757646 758858 761145 762957 764835 768366 773873 780259 786837 794042 802179 810537 818333 825816 833783
63055H33783Q488Q114P019O223O385P182P810P723O919N764M761M335M512M775
$$ 833783 842271 850385 857404 863627 870012 877194 885004 892727 899646 905410 910171 914506 919018 923793
63041I23793M571M031L835M247M643M305L249J963P50j55k34Q42K479L547L548
$$ 923793 928364 932395 936230 940477 945120 949425 952674 954637 955387 955232 954998 955840 958319 961866 965414
63026I65414K988K623K736L134L449L416L132K911K865K960L682N901R543J3026
$$ 965414 968402 971025 973761 976895 980344 983760 986892 989803 992668 995628 999310 1005211 1014754 1027780
63012A027780J4857J5212J5126J4829J4158J4086J6147K0188K4142K6546K7996
$$ 1027780 1042637 1057849 1072975 1087804 1101962 1116048 1132195 1152383 1176525 1203071 1231067
63001A231067K9785L2287L5336L8999M3092M6765M9441N1554N3681N5588N6878
$$ 1231067 1260852 1293139 1328475 1367474 1410566 1457331 1506772 1558326 1612007 1667595 1724473
62990A724473N7939N9452O1305O2752O3343O3054O1878O0084N8661N8710O0254
$$ 1724473 1782412 1841864 1903169 1965921 2029264 2092318 2154196 2214280 2272941 2331651 2391905
62979B391905O2121O3123O2948O1831N9744N6187N0771M3786L5926K7416J7831
$$ 2391905 2454026 2517149 2580097 2641928 2701672 2757859 2808630 2852416 2888342 2915758 2933589
62968B933589O975m432j5453k5949l6238m6021n4542o1626o7570p1923p3529p2137
$$ 2933589 2940564 2936132 2920679 2894730 2858492 2812471 2757929 2696303 2628733 2556810 2483281 2411144
62956B411144o8945o5053o0232n3940m6746l9940l4095k8692k2918j6389r403
$$ 2411144 2342199 2277146 2216914 2162974 2116228 2076288 2042193 2013501 1990583 1974194 1964791
62945A964791k828K554O816J0666J4370J7491J9782K1624K3220K4145K4115K3522
$$ 1964791 1961963 1964517 1971333 1981999 1996369 2013860 2033642 2055266 2078486 2102631 2126746 2150268
62933B150268K2784K1812K0550J9280J7935J5929J3185J0465P988M631o19p273
$$ 2150268 2173052 2194864 2215414 2234694 2252629 2268558 2281743 2292208 2300196 2304827 2304208 2296935
62921B296935j4368k2032l0792l9848m7464n2872n6628n9179o0296o0043n9155
$$ 2296935 2282567 2260535 2229743 2189895 2142431 2089559 2032931 1973752 1913456 1853413 1794258
62910A794258n8017n6078n2693m8101m3332l9506l7253l6362l5884l4927l3322
$$ 1794258 1736241 1680163 1627470 1579369 1536037 1496531 1459278 1422916 1387032 1352105 1318783
62899A318783l1407k9403k7409k5712k4542k3713k2967k2394k2006k1334k0103
$$ 1318783 1287376 1257973 1230564 1204852 1180310 1156597 1133630 1111236 1089230 1067896 1047793
62888A047793j8969j8642j8556j7441j5360j4032j4672j6352j7157j6431j5103
$$ 1047793 1028824 1010182 991626 974185 958825 944793 930121 913769 896612 880181 865078
62877H65078j4032j2910j1136r219q527r459j0503r820p463n195m182l761k873
$$ 865078 851046 838136 827000 817781 809254 799795 789292 779472 772009 766814 762632 758871 755998
62864G55998j651q96p67q62j075j482j729j492j271j866l177m242m366l537j986
$$ 755998 754347 753451 752684 751822 750747 749265 747536 746044 744773 742907 739730 735488 731122 727585 725599
62849G25599k00Q82N49p30j853k466l036l629l633k817j719p52J87R22P42m36
$$ 725599 725399 726281 726830 726100 724247 721781 718745 715116 711483 708666 706947 706195 706382 707304 708046 707610
62833G07610j406q72J022K867L484K840J756J024P27K34r69k446l119k516j339
$$ 707610 706204 705332 706354 709221 712705 715545 717301 718325 719052 719286 718317 715871 712752 710236 708897
62818G08897p32j235k559l907m383l523j840n63n73j625k755l224k885j934o57
$$ 708897 708165 706930 704371 700464 696081 692558 690718 690155 689582 687957 685202 681978 679093 677159 676502
62803F76502N13J037O49k46p41k71P73J488J463J029N40J7l66j06Q85J849K059
$$ 676502 677015 678052 678701 678455 677714 677443 678216 679704 681167 682196 682736 682753 682387 682281 683166 685015 687074
62786F87074J745J609J755J705J210L95o52j760k279j567M2J296J261J27j110
$$ 687074 688819 690428 692183 693888 695098 695493 694841 693081 690802 689235 689277 690573 691834 691961 690851
62771F90851j533q59M18J532K200K773L495M201M916O040P341P649O442N027M971
$$ 690851 689318 688459 688877 690409 692609 695382 698877 703078 707994 714034 721375 729024 735466 740493 745464
62756G45464N908O274N804N778O751P707P910Q178R541J1733J3729J4938J5243
$$ 745464 751372 757646 763450 769228 775979 783686 791596 799774 809315 821048 834777 849715 864958
62743H64958J4658J3814J4017J6023J9034K1595K3116K4029K4822K5562K6283
$$ 864958 879616 893430 907447 923470 942504 964099 987215 1011244 1036066 1061628 1087911
62732A087911K7352K9311L2411L6268M0179M3977M8291N3564N9179O4213O8680
$$ 1087911 1115263 1144574 1176985 1213253 1253432 1297409 1345700 1399264 1458443 1522656 1591336
62721A591336P3160P7516Q1185Q4527Q8382R2084R3448R1335Q6897Q1407P4286
$$ 1591336 1664496 1742012 1823197 1907724 1996106 2088190 2181638 2272973 2359870 2441277 2515563
62710B515563O4329N1816L8040K3454P742q660k4319l8166n0251o1075p0742p8725
$$ 2515563 2579892 2631708 2669748 2693202 2700944 2692284 2667965 2629799 2579548 2518473 2447731 2369006
62698B369006q4144q6568q6762q6115q5011q2653p8906p5217p2764p0600o6929
$$ 2369006 2284862 2198294 2111532 2025417 1940406 1857753 1778847 1703630 1630866 1560266 1493337
62687A493337o1558n5931n1226m7737m5580m4391m2501l8158l1936k6641k4175
$$ 1493337 1431779 1375848 1324622 1276885 1231305 1186914 1144413 1106255 1074319 1047678 1023503
62676A023503k3561k2510k0010j6759j3843j1766j0404r337q275p300o518n588
$$ 1023503 999942 977432 957422 940663 926820 915054 904650 895313 887038 879738 873220 867632
62664H67632m071k016K82K879N771Q100Q899Q668R149J1182J3794J5737J7025
$$ 867632 863561 861545 861827 864706 870477 878577 887476 896144 905293 916475 930269 946006 963031
62651I63031J8395K0183K2436K5414K9165L3187L7159M1468M6294N0691N3518
$$ 963031 981426 1001609 1024045 1049459 1078624 1111811 1148970 1190438 1236732 1287423 1340941
62640A340941N4985N6495N8961O1971O4554O6124O6516O5594O3047N8522N2052
$$ 1340941 1395926 1452421 1511382 1573353 1637907 1704031 1770547 1836141 1899188 1957710 2009762
62629B009762M4302L6020K7118J6788M900p318j8459k8307l7448m6004n3490n9557
$$ 2009762 2054064 2090084 2117202 2133990 2138890 2131572 2113113 2084806 2047358 2001354 1947864 1888307
62617A888307o4105o6881o7806o7463o6453o4542o1337n7565n4464n1918m8512
$$ 1888307 1824202 1757321 1689515 1622052 1555599 1491057 1429720 1372155 1317691 1265773 1217261
62606A217261m3810l9225l6090l4052l2255l0891l0411l0022k8425k5658k2912
$$ 1217261 1173451 1134226 1098136 1064084 1031829 1000938 970527 940505 912080 886422 863510
62595H63510k0709j8556j6325j4599j3378j1724r337p469p392q633r503q978p340
$$ 863510 842801 824245 807920 793321 779943 768219 758882 751413 744021 735388 725885 716907 709567
62582G09567n355l575k400k073k381k697k385j098J053L260M194L019L79k065
$$ 709567 704212 700637 698237 696164 693783 691086 688701 687603 688656 691916 696110 699129 699508 697443
62568F97443l245l421l262k705j224R80K739L097K473K196K981M218M849M674
$$ 697443 694198 690777 687515 684810 683586 684566 687305 690402 692875 695071 698052 702270 707119 711793
62554G11793M495N231P194J0001J2692J4046J3538J2288J2466J5128J8932K1558
$$ 711793 716288 721519 728713 738714 751406 765452 778990 791278 803744 818872 837804 859362
62542H59362K2205K2161K3062K5351K8564L2305L6280L9793M1994M2720M2726
$$ 859362 881567 903728 926790 952141 980705 1013010 1049290 1089083 1131077 1173797 1216523
62531A216523M2766M2730M1681L8688L3497K6678J9317J2338N828q97q298j5742
$$ 1216523 1259289 1302019 1343700 1382388 1415885 1442563 1461880 1474218 1480046 1479149 1470851 1455109
62519A455109k2065k6971l1352l5898l9901m1966m1717m0157l8466l7075l6020
$$ 1455109 1433044 1406073 1374721 1338823 1298922 1256956 1215239 1175082 1136616 1099541 1063521
62508A063521l5383l4932l3760l0896k6300k1054j6681j4328j4239j5476j6305
$$ 1063521 1028138 993206 959446 928550 902250 881196 864515 850187 835948 820472 804167
62497H04167j5347j2729j0002q737r101r782r356p655n690m315l361k276j180
$$ 804167 788820 776091 766089 757352 748251 738469 729113 721458 715768 711453 708092 705816 704636
62484G04636o87q88j125p96J22J385K749L862M416M613M911N200M929M279M416
$$ 704636 703949 703061 701936 701140 701262 702647 705396 709258 713674 718287 723198 728398 733327 737606 742022
62469G42022N982Q023R191R547J0348J2267J4714J6929J8936K1177K3700K6076
$$ 742022 748004 756027 765218 774765 785113 797380 812094 829023 847959 869136 892836 918912
62457I18912K7883K9159L0474L2610L5966M0165M4107M6371M5807M2325L7295
$$ 918912 946795 975954 1006428 1039038 1075004 1115169 1159276 1205647 1251454 1293779 1331074
62446A331074L2720K9582K7138K4018J9649J4402Q815L167k431p878j2889j6749
$$ 1331074 1363794 1393376 1420514 1444532 1464181 1478583 1487398 1490565 1488134 1480256 1467367 1450618
62434A450618j8554j8000j5626j2076p575k438K466O458R920J3781J8295K2769
$$ 1450618 1432064 1414064 1398438 1386362 1378787 1376349 1378815 1385273 1395193 1408974 1427269 1450038
62422A450038K6376K8811L0336L1578L3147L5011L6281L5872L3274K8597K2261
$$ 1450038 1476414 1505225 1535561 1567139 1600286 1635297 1671578 1707450 1740724 1769321 1791582
62411A791582J4900P256j54p066j3267j8913k5020l2689m1469m9298n4406n6616
$$ 1791582 1806482 1813738 1813584 1806518 1793251 1774338 1749318 1716629 1675160 1625862 1571456 1514840
62399A514840n6588n4976n2705n0734m8703m5150m0083l5810l3896l2627k9388
$$ 1514840 1458252 1403276 1350571 1299837 1251134 1205984 1165901 1130091 1096195 1063568 1034180
62388A034180k4381k0116j7882j6852j5985j4741j2327q553n236m483n465n203
$$ 1034180 1009799 989683 971801 954949 938964 924223 911896 903343 898107 893624 888159 882956
62376H82956k785m50k6p07j245k000l567n289o448p409q397q651p960p476p823
$$ 882956 880171 879721 879695 878988 877743 875743 872176 866887 860439 853030 844633 835982 828022 820546 812723
62361H12723p918p049o565p891j0095j1107j0264q138n058j591N14l3k002k997
$$ 812723 804805 797756 791191 783300 773205 762098 751834 743696 738638 737047 737561 737528 735526 732529
62347G32529k472j678j196m88L96P38R70K491N126O565N367L048K152L126M454
$$ 732529 730057 728379 727183 726695 727091 727829 728799 731290 736416 742981 748348 751396 753548 756674 761128
62332G61128N185N941P328Q500Q182O701N993P268R439J0619J0637J0991J2465
$$ 761128 766313 772254 779582 788082 796264 802965 808958 816226 825665 836284 846921 857912 870377
62319H70377J4239J5554J6899J8831K0913K2688K4639K7137K9391L0580L1227
$$ 870377 884616 900170 917069 935900 956813 979501 1004140 1031277 1060668 1091248 1122475
62308A122475L2420L4390L7027M0923M6448N2426N7263O1091O5372P0619P6043
$$ 1122475 1154895 1189285 1226312 1267235 1313683 1366109 1423372 1484463 1549835 1620454 1696497
62297A696497Q1197Q6402R1365R4829R6005R5081R2003Q5932P6447O4315N0641
$$ 1696497 1777694 1864096 1955461 2050290 2146295 2241376 2333379 2419311 2495758 2560073 2610714
62286B610714L6062K1134O650o967j9934l2257m3200n2151n9570o6468p3023p8130
$$ 2610714 2646776 2667910 2674560 2667593 2647659 2615402 2572202 2520051 2460481 2394013 2320990 2242860
62274B242860q0450p9806p7322p4099p0097o4908n9301n4797n1511m7775m2667
$$ 2242860 2162410 2082604 2005282 1931183 1861086 1796178 1736877 1682080 1630569 1582794 1540127
62263A540127l7639l4593l3406l2724l2220l2390l2868l2750l2201l1997l1721
$$ 1540127 1502488 1467895 1434489 1401765 1369545 1337155 1304287 1271537 1239336 1207339 1175618
62252A175618l0182k7530k5123k3296k1120j8529j6712j5985j5270j4169j3576
$$ 1175618 1145436 1117906 1092783 1069487 1048367 1029838 1013126 997141 981871 967702 954126
62241I54126j3405j1860q263m718l326l156j866P62K807L070K166J093L13L51
$$ 954126 940721 928861 920598 915880 912554 909398 907532 908294 911101 914171 916337 917430 917743 918094
62227I18094J843M716Q045J0783J2215J2141J1453J1884J4197J6935J8114J7786
$$ 918094 919937 924653 932698 943481 955696 967837 979290 991174 1005371 1022306 1040420 1058206
62215A058206J7760J8981K0665K2102K3754K6002K8161K9781L1886L5765M1050
$$ 1058206 1075966 1094947 1115612 1137714 1161468 1187470 1215631 1245412 1277298 1313063 1354113
62204A354113M6193N0565N4888N9665O4460O9242P5183Q3020R1343R7777J01647
$$ 1354113 1400306 1450871 1505759 1565424 1629884 1699126 1774309 1857329 1948672 2046449 2148096
62193B148096J04062J05360J03942R8379Q9314P8212O5196M9579L1991J4438j555
$$ 2148096 2252158 2357518 2461460 2559839 2649153 2727365 2792561 2842140 2874131 2888569 2887014
62182B887014j5619k7635l7823m7741n9329p2223q3491r0944r5371r8492j00068
$$ 2887014 2871395 2843760 2805937 2758196 2698867 2626644 2543153 2452209 2356838 2258346 2158278
62171B158278r8616r4129q8343q2485p6269o9316o2253n6023n0881m6525m2662
$$ 2158278 2059662 1965533 1877190 1794705 1718436 1649120 1586867 1530844 1479963 1433438 1390776
62160A390776l9164l6052l3377l0868k7811k3880j9957j7349j6156j5077j3159
$$ 1390776 1351612 1315560 1282183 1251315 1223504 1199624 1179667 1162318 1146162 1131085 1117926
62149A117926j1039r972j0116j0273r211o760l699r40J140K765M219N337N712
$$ 1117926 1106887 1096915 1086799 1076526 1067315 1060555 1056856 1055916 1057056 1059821 1064040 1069377 1075089
62136A075089N508N651O833Q661J0224J1379J2725J4272J5153J5141J5595J7792
$$ 1075089 1080597 1086248 1093081 1101742 1111966 1123345 1136070 1150342 1165495 1180636 1196231 1214023
62124A214023K0847K2575K2355K1800K2254K3099K3297K3280K4044K5306K6057
$$ 1214023 1234870 1257445 1279800 1301600 1323854 1346953 1370250 1393530 1417574 1442880 1468937
62113A468937K6514K7950L0813L4422L8578M3828M9880N5292N9518O3771O8767
$$ 1468937 1495451 1523401 1554214 1588636 1627214 1671042 1720922 1776214 1835732 1899503 1968270
62102A968270P2682P2863O8970O3068N6689M9152L9096K6688J3657J643q791j7750
$$ 1968270 2040952 2113815 2182785 2245853 2302542 2351694 2390790 2417478 2431135 2432778 2423987 2406237
62090B406237k5368l1905l8106m4783n1819n8010o2122o3854o3469o1108n7023
$$ 2406237 2380869 2348964 2310858 2266075 2214256 2156246 2094124 2030270 1966801 1905693 1848670
62079A848670n2156m7552m3308l8772l3810k9077k5046k1622j8749j6498j4369
$$ 1848670 1796514 1748962 1705654 1666882 1633072 1603995 1578949 1557327 1538578 1522080 1507711
62068A507711j1521q092n261l584k252o48M73K41q49j928l452o373r978j2092
$$ 1507711 1496190 1488098 1482837 1479253 1477001 1476353 1476826 1477067 1476218 1474290 1470838 1464465 1454487 1442395
62054A442395j1617r623p678o270n354n270o279p940r723j1841j4599j7220j8290
$$ 1442395 1430778 1421155 1413477 1407207 1401853 1396583 1390304 1382364 1372641 1360800 1346201 1328981 1310691
62041A310691j7414j5610j3820j1764q784n270k395o38O76K235L919N457P140
$$ 1310691 1293277 1277667 1263847 1252083 1243299 1238029 1235634 1234996 1235672 1237907 1241826 1247283 1254423
62028A254423R279J1390J2766J3490J4208J5074J5845J6992J9574K3584K7342
$$ 1254423 1263702 1275092 1287858 1301348 1315556 1330630 1346475 1363467 1383041 1406625 1433967
62017A433967K9246K9655L0343L2377L5178L7538L9140M0903M3988M8359N2449
$$ 1433967 1463213 1492868 1523211 1555588 1590766 1628304 1667444 1708347 1752335 1800694 1853143
62006A853143N4685N5304N6088N8011N9857N9696N7138N3259M8608M2272L3092
$$ 1853143 1907828 1963132 2019220 2077231 2137088 2196784 2253922 2307181 2355789 2398061 2431153
61995B431153K1223Q244l891j3837k1439k7640l3707m0252m7132n4168o1448o8397
$$ 2431153 2452376 2460620 2456729 2442892 2421453 2393813 2360106 2319854 2272722 2218554 2157106 2088709
61983B088709p3178p3992p1309o7963o6329o5862o4188o0297n5592n1741m8699
$$ 2088709 2015531 1941539 1870230 1802267 1735938 1670076 1605888 1545591 1489999 1438258 1389559
61972A389559m5496m1938l8592l5616l2687k9745k6940k4009k0673j7529j5654
$$ 1389559 1344063 1302125 1263533 1227917 1195230 1165485 1138545 1114536 1093863 1076334 1060680
61961A060680j5247j5551j6051j6876j7791j7846j6482j4288j2194j0510r158
$$ 1060680 1045433 1029882 1013831 996955 979164 961318 944836 930548 918354 907844 898686
61950H98686q287q021p961p350n857l969k632k267k061o31K237M982O016N524
$$ 898686 890399 882378 874417 867067 861210 857241 854609 852342 850281 849650 851887 856869 862885 868409
61936H68409M669L619J738n52j745j353o35o71j207j925l476o160q780j0043j0355
$$ 868409 873078 876697 878435 877883 876138 874785 874150 873479 872272 870347 866871 860711 851931 841888 831533
61921H31533j0916j1640j1278r564p996q089r468j0143q620n508k865j863j665
$$ 831533 820617 808977 797699 788135 780139 772050 762582 752439 743819 738311 735446 733583 731918
61908G31918j008j80l04j160j285l04N36N06M80J095J498R86N58J534L600N429
$$ 731918 730910 730730 730426 729266 727981 727677 728213 728719 729199 730294 731792 732778 733336 734870 738470 743899
61892G43899O373O526O002N301N500O913Q423R183R961J1573J3228J4057J5175
$$ 743899 750272 756798 762800 768101 773601 780514 788937 798120 808081 819654 832882 846939 862114
61879H62114J8086K1805K3749K3231K1942K1088K0243J9276J9131J9906K0033
$$ 862114 880200 902005 925754 948985 970927 992015 1012258 1031534 1050665 1070571 1090604
61868A090604J8398J5862J3735J2001R956P525M957K083j061l553m475m230m071
$$ 1090604 1109002 1124864 1138599 1150600 1160556 1168081 1173038 1175121 1174060 1170507 1166032 1161802 1157731
61855A157731m511m773l794j313K020N361Q300J0693J2106J2101J1346J1493J3205
$$ 1157731 1153220 1148447 1144653 1143340 1145360 1150721 1159021 1169714 1181820 1193921 1205267 1216760 1229965
61842A229965J4836J4163J0975O819K708j548n824r317j2017j4992j8457k0937
$$ 1229965 1244801 1258964 1269939 1276758 1279466 1277918 1272094 1262777 1250760 1235768 1217311 1196374
61830A196374k1314k0581k0384k0570j9548j6823j3973j2885j3744j5070j5387
$$ 1196374 1175060 1154479 1134095 1113525 1093977 1077154 1063181 1050296 1036552 1021482 1006095
61819A006095j4527j3371j2635j2213j1722j1165j0746j0317r539q281o533m299
$$ 1006095 991568 978197 965562 953349 941627 930462 919716 909399 899860 891579 885046 880747
61807H80747k012m57M50K077N222Q460R774R531J0148J2838J6323J9114K1316
$$ 880747 878735 878278 878728 880805 886027 894487 904261 913792 923940 936778 953101 972215 993531
61794I93531K3421K5028K5847K6803K8853L1494L3512L4566L5084L5221L4773
$$ 993531 1016952 1041980 1067827 1094630 1123483 1154977 1188489 1223055 1258139 1293360 1328133
61783A328133L3570L1174K6928K1155J5553J1257P215J731m763r883j2054j1866
$$ 1328133 1361703 1392877 1419805 1440960 1456513 1467770 1474985 1476716 1471953 1462070 1450016 1438150
61771A438150j0618q817o524m072j821L20K625N133P752J0351J2514J3465J2420
$$ 1438150 1427532 1418715 1412191 1408119 1406298 1406618 1409243 1414376 1422128 1432479 1444993 1458458 1470878
61758A470878Q993L422l342r876j5191j9387k3219k7059l0603l3393l5132l5593
$$ 1470878 1479871 1483293 1479951 1470075 1454884 1435497 1412278 1385219 1354616 1321223 1286091 1250498
61746A250498l4737l3000l0949k8726k6242k3946k2593k2093k1347j9683j7795
$$ 1250498 1215761 1182761 1151812 1123086 1096844 1072898 1050305 1028212 1006865 987182 969387
61735I69387j6674j6068j4923j3147j1932j2065j2741j2600j1419j0048q996p951
$$ 969387 952713 936645 921722 908575 896643 884578 871837 859237 847818 837770 828774 820823
61723H20823o804o190o473o791o016m460l671m276m905l936j812o08j427l194
$$ 820823 814019 807829 801356 794565 788549 784089 780418 776142 771237 767301 765489 764881 763454 760260
61709G60260m322m602m649m227k490J53J835J520N02P33K224L240K670J178l8
$$ 760260 755938 751336 746687 742460 739970 740123 741958 743478 743980 744713 746937 750177 752847 754025 753987
61694G53987m88k87K96P59N96k8m09l84n24r70r86k28L47l64k046l362l504k666
$$ 753987 753499 753212 753508 754267 754863 754835 754426 754042 753518 752548 751562 751334 751681 751317 749271 745909 742405 739739
61676G39739j390j93L89J49m30o79n26l76l61k71J8M28Q63J223J401J489J653
$$ 739739 738349 738156 738545 738694 738264 737585 737059 736683 736322 736051 736069 736497 737360 738583 739984 741473 743126
61659G43126J698J361J090J635K506K062k9j665r18J152J878N87j003j713k374
$$ 743126 744824 746185 747275 748910 751416 753478 753449 751784 750866 752018 753896 754483 753480 751767 749393
61644G49393l906n638o345n939n301n056n230n697o376p110p489p034n793m852
$$ 749393 745487 739849 733504 727565 722264 717208 711978 706281 699905 692795 685306 678272 672479 667627
61630F67627n354o677o540l922r37m31k370m237m545m072l661k858j341k6J64
$$ 667627 662273 655596 649056 645134 644197 643766 641396 637159 632614 628542 624881 622023 620682 620656 620820
61615F20820n22j447k460l305l212j917m32K1n59j070n55Q58J949J511r7r52k
$$ 620820 620298 618851 616391 613086 609874 607957 607525 607546 606987 605917 605362 606220 608169 609680 609583 608631 608629
61598F08629J331J268O86J849M451N489L679J357Q95J497J241L19J70P26P78K87
$$ 608629 609960 611228 611914 613763 618214 623703 627382 628739 629634 631131 632372 632691 632861 633587 634365 634652
61582F34652L73J370K586L700M885N698N257L524J338p10k527l874m411m296l953
$$ 634652 635025 636395 638981 642681 647566 653264 658521 662045 663383 662673 660146 656272 651861 647565 643612
61567F43612l498l034l004l497l805l508l305l701l706k285n82r23l588o196o585
$$ 643612 640114 637080 634076 630579 626774 623266 619961 616260 612554 610269 609687 608764 605176 598980 592395
61552E92395n019l115j832j180j051j500k516l864n078n601n311m715m254l683
$$ 592395 587376 584261 582429 581249 580198 578698 576182 572318 567240 561639 556328 551613 547359 543676
61538E43676k807k375l217m670n079m150l531m451n811n690m180l376m419n717
$$ 543676 540869 538494 535277 530607 525528 521378 517847 513396 507585 501895 497715 494339 489920 484203
61524D84203m990k411n42r82k311k171m69Q35O67j5k28l87j023j449q72Q5K48
$$ 484203 479213 476802 476260 475278 472967 470796 470327 471162 471829 471814 471586 471199 470176 468727 467855 467940 468188
61507D68188l67p83n74m0P34J811K640K399J156j87r82j124n10P87J966K104J401
$$ 468188 467821 467038 466464 466424 467158 468969 471609 474008 475164 474977 473995 472871 472361 473148 475114 477218 478619
61490D78619Q63P52L81l55m02R88K999M182M069L315K581J954J371J005R88R53
$$ 478619 479482 480234 480615 480260 479858 480846 483845 488027 492096 495411 497992 499946 501317 502322 503310 504263
61474E04263K84j020j980j526K44K123L127L245K837K002Q76j18p91j358j734
$$ 504263 504547 503527 501547 500021 500265 502388 505515 508760 511597 513599 514475 514357 513566 512208 510474
61459E10474j319j89L89m87j856k089j169o01j094j596r04O50J628J099m67j581
$$ 510474 509155 508966 509355 508868 507012 504923 503754 503153 502059 500463 499559 500209 501837 502936 502469 500888
61443E00888r80J169L327M038L160J370r83l657n557n247k710K27J765J912J935
$$ 500888 499908 501077 504404 508442 511602 512972 511989 508332 502775 497528 494818 495045 496810 498722 500657
61428E00657K495K949K463J299O16J061K017K392J939J348J266J790K685L465
$$ 500657 503152 506101 508564 509863 510479 511540 513557 515949 517888 519236 520502 522292 524977 528442
61414E28442L369K229J245J781L224L360J367r71j757j289q35n56q4J6q21j597
$$ 528442 531811 534040 535285 537066 540290 543650 545017 544046 542289 541000 540165 539609 539525 539541 538720 537123
61398E37123j029K08N33L51J615M291N619L837P38p66k67L41j36r16p81K85J303
$$ 537123 536094 536302 536835 537186 538801 543092 548711 552548 553286 552520 552253 552594 552458 551542 550761 551046 552349
61381E52349J565J348J404J924K312K093J603J318J009K44n85o22J99J098J573
$$ 552349 553914 555262 556666 558590 560902 562995 564598 565916 566925 567169 566584 565962 566161 567259 568832
61366E68832J745J617R67Q1l73l92o53j153q24Q75K741L105K004J295K458M738
$$ 568832 570577 572194 573161 573242 572869 572477 571824 570671 569847 570722 573463 576568 578572 579867 582325 587063
61350E87063N766M085Q48j305j115O1P0j504l192l571k621j308m30L5P31J989
$$ 587063 592829 596914 597762 596457 595342 595403 595473 593969 590777 587206 584585 583277 582847 582882 583613 585602
61334E85602L060K742J009p76j598j822j894j176P81K744L050J861P43M31M68
$$ 585602 588662 591404 592413 591637 590039 588217 586323 585147 585928 588672 591722 593583 594326 594757 595225
61319E95225O93J497K629L268L372L532L495K403P23J68J244K502K877L156M145
$$ 595225 595918 597415 600044 603312 606684 610216 613711 616114 616837 617005 618249 620751 623628 626784 630929
61304F30929M811L689J289k40M18K579M665N707N934O347P729R766J1229J1175
$$ 630929 635740 639429 640718 640478 640896 643475 648140 653847 659781 666128 673857 683623 694852 706027
61290G06027R766Q092P345P922Q896Q707O934N014M433M817M798M277M425N498
$$ 706027 715793 723885 731230 739152 748048 756755 763689 768703 773136 777953 782751 787028 791453 796951
61276G96951O130N009K297p15k416j705O94K069N08k289k928r81N65j17j247p14
$$ 796951 803081 808090 810387 809672 807256 805551 806245 808314 808822 806533 803605 802624 803189 803072 801825 801111
61260H01111O31P99q6l92L94J578K852M144M696M060L422M280O197P584Q271R435
$$ 801111 801742 802541 802455 802063 802457 804035 806887 811031 815727 819787 823209 827489 833686 841270 849541 858976
61244H58976J1244J2359J2038J1034R976Q358N790L095J288K49q98k528m227n304
$$ 858976 870220 882579 894617 905651 915627 923985 929775 932870 934158 934407 933509 930981 926754 921450
61230I21450n273m256l222l469n309p478q195o908m790l526l671m232l766j854
$$ 921450 916177 911921 908699 905230 899921 892443 884248 877340 872550 869024 865353 861121 857355 855501
61216H55501N95K341L015L250L877M981N745N278L713K254J958K754L887M959
$$ 855501 856096 858437 861452 864702 868579 873560 879305 884583 888296 890550 892508 895262 899149 904108
61202I04108N971O762P172P623Q670R951J0344R381P722O177N026M442M652N289
$$ 904108 910079 916841 924013 931636 940306 950257 960601 969982 977704 983881 988907 993349 998001 1003290
61188A003290N403M664L874L735L674K520k0l079n544o833o986o462n794n307
$$ 1003290 1008693 1013357 1017231 1020966 1024640 1027160 1027140 1024061 1018517 1011684 1004698 998236 992442 987135
61174I87135n174n555o368o944o358m228j056K087M036M173L115K372K753L445
$$ 987135 981961 976406 970038 963094 956736 952508 951452 953539 957575 961748 964863 967235 969988 973433
61160I73433L333K724K835L987N312O069O261O073N724N651N887N627M399L254
$$ 973433 976766 979490 982325 986312 991624 997693 1003954 1010027 1015751 1021402 1027289 1032916 1037315 1040569
61146A040569L458M493M878M501M437M775M781N043P172J0967J4169J5602J6388
$$ 1040569 1044027 1048520 1053398 1057899 1062336 1067111 1071892 1076935 1084107 1095074 1109243 1124845 1141233
61133A141233J7345J7598J6740J6025J5895J4465J0385N504K732K470L084L739
$$ 1141233 1158578 1176176 1192916 1208941 1224836 1239301 1249686 1255190 1257922 1260392 1263476 1267215
61121A267215M839O274P018O287M044Q15k254l983m564n347o672p208o337n505
$$ 1267215 1272054 1278328 1285346 1291633 1295677 1296492 1294238 1290255 1285691 1280344 1273672 1266464 1260127 1254622
61107A254622n986o969p316p637q813r989j0103j0108j1508j3600j4457j3859
$$ 1254622 1248636 1241667 1234351 1226714 1217901 1207912 1197809 1187701 1176193 1162593 1148136 1134277
61095A134277j3068j2313j0769q669p190o444n593m812m986n619n286m345m961
$$ 1134277 1121209 1108896 1098127 1089458 1082268 1075824 1070231 1065419 1060433 1054814 1049528 1045183 1040222
61082A040222p709j0186r987p701n859n894o973p252n690k958p16J71M39J161
$$ 1040222 1032513 1022327 1012340 1004639 998780 992886 985913 978661 972971 970013 969297 969468 969907 971068
61068I71068K348L533M932O925Q995J0444J1800J4175J7531K0703K2832K3735
$$ 971068 973416 976949 981881 988806 997801 1008245 1020045 1034220 1051751 1072454 1095286 1119021
61056A119021K3414K2608K3267K6677L1226L3635L2664L0151K8400K7980K8365
$$ 1119021 1142435 1165043 1188310 1214987 1246213 1279848 1312512 1342663 1371063 1399043 1427408
61045A427408K9085K9509K8704K6368K3385K0763J8390J5224J0593N139M50k513
$$ 1427408 1456493 1486002 1514706 1541074 1564459 1585222 1603612 1618836 1629429 1634568 1635018 1632505
61033A632505m506p011j0227j2998j4777j6183j7299j7214j6178j6268j8327j9915
$$ 1632505 1627999 1620988 1610761 1597763 1582986 1566803 1549504 1532290 1516112 1499844 1481517 1461602
61021A461602j8442j5048j3064j3466j4227j3623j1832r463o671l996k183r21
$$ 1461602 1443160 1428112 1415048 1401582 1387355 1373732 1361900 1352437 1345766 1341770 1339587 1338666
61009A338666Q50L355O062R024J2565J5888J7630J7831J7983J9272K1872K5502
$$ 1338666 1339516 1342871 1348933 1357957 1370522 1386410 1404040 1421871 1439854 1459126 1480998 1506500
60997A506500K9390L2339L4301L7053M1769M6802M9774N0837N1858N3378N4895
$$ 1506500 1535890 1568229 1602530 1639583 1681352 1728154 1777928 1828765 1880623 1934001 1988896
60986A988896N7354O2391O9321P5618Q0463Q5385R1391R7762J03773J09378J14392
$$ 1988896 2046250 2108641 2177962 2253580 2334043 2419428 2510819 2608581 2712354 2821732 2936124
60975B936124J19084J25165J33898J43704J52107J59305J67097J75338J82929
$$ 2936124 3055208 3180373 3314271 3457975 3610082 3769387 3936484 4111822 4294751
60966D294751J91441K03763K19509K35895K52958K73439K97269L21168L44395
$$ 4294751 4486192 4689955 4909464 5145359 5398317 5671756 5969025 6290193 6634588
60957F634588L70342M01614M38632M84132N43551O19238P09527Q14929R39193
$$ 6634588 7004930 7406544 7845176 8329308 8872859 9492097 10201624 11016553 11955746
60948A1955746J082662J241682J416266J609019J814213K021820K237161K470359
$$ 11955746 13038408 14280090 15696356 17305375 19119588 21141408 23378569 25848928
60940B5848928K675613K713242K425195J787630R80112K74903j50910k91970k32893
$$ 25848928 28524541 31237783 33662978 35450608 36430720 36705623 36554713 36262743 36029850
60931C6029850m6826J95514L55350K43161k43419j004472j786838k357746k633529
$$ 36029850 35983024 36178538 36533888 36777049 36533630 35529158 33742320 31384574 28751045
60922B8751045k665685k546726k347494k114172j879600j661217j461087j278263
$$ 28751045 26085360 23538634 21191140 19076968 17197368 15536151 14075064 12796801
60914A2796801j117032r80884q65930p65462o76856o00518n35651m80383m33506
$$ 12796801 11679769 10698885 9832955 9067493 8390637 7790119 7254468 6774085 6340579
60905F340579l93533l58305l27238l01597k80908k61661k41218k20626k01932
$$ 6340579 5947046 5588741 5261503 4959906 4678998 4417337 4176119 3955493 3753561
60896C753561j85125j69484j55809j45121j36697j29018j21409j13590j05165
$$ 3753561 3568436 3398952 3243143 3098022 2961325 2832307 2710898 2597308 2492143
60887B492143r6743q9957q5243q1028p6024p0615o5205n9279n3254m9078m7396
$$ 2492143 2395400 2305443 2220200 2139172 2063148 1992533 1927328 1868049 1814795 1765717 1718321
60876A718321m6102m3425m0706m0182m1483m2255m1204l8772l5730l2759l0518
$$ 1718321 1672219 1628794 1588088 1547906 1506423 1464168 1422964 1384192 1348462 1315703 1285185
60865A285185k8632k5496k0671j6488j5671j7980k0624k1365j9951j7278j4644
$$ 1285185 1256553 1231057 1210386 1193898 1178227 1160247 1139623 1118258 1098307 1081029 1066385
60854A066385j3251j3073j2596j0696q154o425n775n732o201o798o219m048k109
$$ 1066385 1053134 1040061 1027465 1016769 1008615 1002190 996415 990683 984482 977684 971465 967417 965308
60841I65308k191l278l132j892j547k216j741N21K169J031k039m857o685p939
$$ 965308 963117 959839 956707 954815 953268 951052 949311 949832 952001 953032 950993 946136 939451 931512
60827I31512q596q461q241q765r622r781r258q992r198r047q143p410p965r612
$$ 931512 922916 914455 906214 897449 887827 878046 868788 859796 850598 841551 833408 825998 818033 808421
60813H08421j0914j0696r213p677o851o354n476m268l328k683j649P2J821K858
$$ 808421 797507 786811 777598 769921 763070 756716 751240 746972 743644 740961 739312 739384 741205 744063
60799G44063L223L274K957K124J214Q41R05P91M60N56J302J958J756Q94J93J31
$$ 744063 747286 750560 753517 755641 756855 757696 758601 759392 759852 760408 761710 763668 765424 766318 766511 766642
60783G66642N63J076J174L28j576l847n410n698m906l510j980r16r55k077l256
$$ 766642 767205 768281 769455 769783 768207 764360 758950 753252 748346 744836 742856 741940 740985 738908 735652
60768G35652l219j738o8J91j266l017l433k521j867k601m073m904m822m729n236
$$ 735652 732433 730695 730627 730818 729552 726535 723102 720581 718714 716113 712040 707136 702314 697585 692349
60753F92349o027o636o994p008o387n256m485m822n910o535n884m539m037n187
$$ 692349 686322 679686 672692 665684 659297 654041 649556 644734 638824 632289 626405 621866 617829 612642
60739F12642o725o330l453l88L24j023k013j470n55n59j276k042k777l297k927
$$ 612642 605917 599587 596134 595746 596070 595047 593034 591564 591009 590450 589174 587132 584355 581058 578131
60724E78131j721q63r81j172o20L2Q2L17J654L224L486K616K082K265K250J851
$$ 578131 576410 575547 574566 573394 572774 572806 572888 573205 574859 578083 581569 584185 586267 588532 590782 592633
60708E92633K080L326M557M810M328L737L044J954O31k95l34K27J20j833m922
$$ 592633 594713 598039 602596 607406 611734 615471 618515 620469 621100 620805 620471 620698 620818 618985 614063
60693F14063o661n615l218j654q52O57K663L444K848K758L798L992J908r25k393
$$ 614063 607402 601787 598569 596915 596063 596720 599383 602827 605675 608433 612231 616223 618131 617206 614813
60678F14813l046m908p920r670q569n675l129k112k647m247o040o801n703l133
$$ 614813 611767 606859 598939 589269 580700 575025 571896 569784 567137 562890 556850 550049 544346 541213
60664E41213n17Q05N99k43p05o71q15j532k274k150j032K32P62N66L02K41l7o06
$$ 541213 540696 541501 542100 541857 541152 540481 539666 538134 535860 533710 532678 532910 533672 534238 534540 534781 534744 534138
60646E34138m16J510M207N292L800J505P51J901L690N099N694N005L144J575J687
$$ 534138 533722 535232 539439 544731 548531 550036 550787 552688 556378 561477 567171 572176 575320 576895 578582
60631E78582K788L054K350K322L508M306L446J815P75K48l80p14k46J64n30j465
$$ 578582 581370 584424 586774 589096 592604 596910 600356 602171 602946 603194 602814 602100 601854 602018 601488 600023
60615F00023p13J675L190K108j75j055j44N31m38k092k854k852l297m159m058
$$ 600023 599310 600985 604175 606283 606108 605053 604909 605440 605002 602910 600056 597204 593907 589748 585690
60600E85690k578j216j297k159k380j849j335q22K97J650K068J429J067K030L765
$$ 585690 583112 581896 580599 578440 576060 574211 572876 572054 572351 574001 576069 577498 578565 580595 584360
60585E84360M820M262K381M91k49k80j263l552n130m376k793l012m745n219l461
$$ 584360 589180 593442 595823 596314 596065 595785 594522 590970 585840 581464 578671 575659 570914 565695 562234
60570E62234j575j300j807j826j716k044k058j065K19J073K068L550M267L160
$$ 562234 560659 559359 557552 555726 554010 551966 549908 548843 549062 550135 552203 555753 560020 563180
60556E63180J335O34J142J671J758J652J140J35k87Q45K617L311K813K289K003
$$ 563180 564515 565149 566291 567962 569720 571372 572512 572647 572360 573205 575822 579133 581946 584235 586238
60541E86238J238J49j61M44Q52N17J38K63O92J493L146N167N962M715K442N88
$$ 586238 587476 587625 587464 587908 588760 589277 589415 589678 590370 591863 595009 600176 606138 610853 613295 613883
60525F13883l59l88P10K701M414M924M793N206O246O883O643O453P471R604J1714
$$ 613883 613524 613136 613846 616547 620961 625885 630678 635884 642130 649013 655656 662109 669580 679184 690898
60510F90898J3190J4644J6723J8731J9289J8252J6905J5941J4241J0473N112N1
$$ 690898 704088 718732 735455 754186 773475 791727 808632 824573 838814 849287 854399 854450
60498H54450l336m937n303n324n998p393q070o569l281K42L474P048J0771J3166
$$ 854450 851114 846177 840874 835550 829552 822159 814089 807520 804239 804481 807955 815003 825774 838940
60484H38940J3550J3207J3730J5190J6800J8496K0812K3638K6046K7264K7193
$$ 838940 852490 865697 879427 894617 911417 929913 950725 974363 1000409 1027673 1054866
60473A054866K6015K3756K0298J5637J0172M691q0m002p250r695j0922j0912j0183
$$ 1054866 1080881 1104637 1124935 1140572 1150744 1155435 1155355 1151353 1144103 1134408 1123486 1112574 1102391
60460A102391r301q609q296q064o864l932k41K161K614K717M141O642R141J1803
$$ 1102391 1093090 1084481 1076185 1068121 1061257 1057325 1057084 1059245 1061859 1064576 1068717 1075359 1084500 1096303
60446A096303J5678K0719K5591K9510L3049L6841M0616M4095M7988N3109N8765
$$ 1096303 1111981 1132700 1158291 1187801 1220850 1257691 1298307 1342402 1390390 1443499 1502264
60435A502264O2758O3269O0476N6183N1899M7334M0904L1731K0785R851k40r779
$$ 1502264 1565022 1628291 1688767 1744950 1796849 1844183 1885087 1916818 1937603 1947454 1947214 1937435
60423A937435j8953k7522l5757m4529n3716o1454o6017o7885o8850o9396o8306
$$ 1937435 1918482 1890960 1855203 1810674 1756958 1695504 1629487 1561602 1492752 1423356 1355050
60412A355050o4903o0215n5460n0628m5450m0705l7370l5082l2661k9736k6736
$$ 1355050 1290147 1229932 1174472 1123844 1078394 1037689 1000319 965237 932576 902840 876104
60401H76104k3590j9871j6074j3365j1767j0124q308p944r800j1786j1122p855
$$ 876104 852514 832643 816569 803204 791437 781313 773005 765061 755261 743475 732353 724498
60389G24498m676l523l886m586n534o966q070p636n732l782l001l260l551l157
$$ 724498 719822 716299 712413 707827 702293 695327 687257 679621 673889 670107 667106 663846 660295 657138
60375F57138k225j464j402j871k188j921j388j251j738k435k805k566j688m02
$$ 657138 654913 653449 652047 650176 647988 646067 644679 643428 641690 639255 636450 633884 632196 631794
60361F31794N78L52j186k908l533l022k309j750p55P67J679J217N75J573L947
$$ 631794 632372 632724 631538 628630 625097 622075 619766 618016 617261 618028 619707 620924 621499 623072 627019
60346F27019N391M623L125L012M080M182K238l11j245kK008L002K409J130N90
$$ 627019 632410 637033 640158 643170 647250 651432 653670 653359 652114 652112 654120 657122 659531 660661 661251
60331F61251J417K881L757L841M131N149N638L908N42j391L49M326O914O254L724
$$ 661251 662668 665549 669306 673147 677278 682427 688065 691973 692515 691124 691473 695799 702713 708967 712691
60316G12691J629Q70J220K491M321N600N295L659J931J103J439K691M122M765
$$ 712691 714320 715190 716410 718901 723222 728822 734117 737776 739707 740810 742249 744940 749062 753827
60302G53827M399L916M110M663M938N123N614O091O258O762P993Q656P403N352
$$ 753827 758226 762142 766252 770915 775853 780976 786590 792681 798939 805701 813694 822350 829753 835105
60288H35105M943O258O687M708J824j2r27j897k773l027l146l667l847k827j392
$$ 835105 840048 846306 852993 857701 859525 859513 858586 856689 853916 850889 847743 844076 840229 837402 836010
60273H36010j069k004l006l272k854j937r21p38j842l121l153k231j823k070j461
$$ 836010 834941 832937 829931 826659 823805 821868 820947 820209 818367 815246 812093 809862 808039 805969 804508
60258H04508P52L198M181L898M065N765Q368J0455J1377J1856J3099J5332J7510
$$ 804508 805260 808458 812639 816537 820602 826367 834735 845190 856567 868423 881522 896854 914364
60245I14364J8631J8941J9257J9356J7861J3913Q371K935j646o108j1393j7094
$$ 914364 932995 951936 971193 990549 1008410 1022323 1030694 1033629 1031983 1025875 1014482 997388
60233I97388k1390k2640k0850j7502j4165j1620r999r052q167o749m832k946j383
$$ 997388 975998 953358 932508 915006 900841 889221 879222 870170 862003 855254 850422 847476 846093
60220H46093j27M66k02j889l237l220k389k203l315m796n030l429j430j350l635
$$ 846093 845966 846432 846230 844341 841104 837884 835495 833292 829977 825181 820151 816722 815292 813942 810307
60205H10307n810n225k412l24l65r97n93K47K04n43r15o83m05m03p24j330j534
$$ 810307 804497 799272 796860 796536 796171 795174 794581 794828 795032 794489 793574 792891 792486 792083 791359 790029 788495
60188G88495k90K091L586K973J518J044J433J511J336J751K360J849J54j231j143
$$ 788495 788205 790296 793882 796855 798373 799417 800850 802361 803697 805448 807808 809657 809811 808580 807437
60173H07437J40J584K151J312k26o87Q14L011M115M057L839L558K647J548J369
$$ 807437 807577 809161 811312 812624 812398 811711 812525 815536 819651 823708 827547 831105 833752 835300 836669
60158H36669K165L098M085N650P390Q208Q091Q040Q227P824O780O242O882Q126
$$ 836669 838834 841932 846017 851667 859057 867265 875356 883396 891623 899447 906227 912469 919351 927477
60144I27477R267J0088J0352R878R247R157R165Q325O914N962N301L871J993J373
$$ 927477 936744 946832 957184 967062 976309 985466 994631 1002956 1009870 1015832 1021133 1025004 1026997 1028370
60130A028370K419L447L094J823M06j330l430n063n732n899n732m759l534l828
$$ 1028370 1030789 1034236 1037330 1039153 1039559 1038229 1034799 1029736 1024004 1018105 1012373 1007614 1004080 1000252
60116A000252n969p670p028n396n433p243q374p314n200l842l534l347k758k141
$$ 1000252 994283 986613 979585 974189 968756 961513 953139 945825 940625 936783 933249 929902 927144 925003
60102I25003j912j806j371q39q87j351j223l95l49j885l157j859J195K813J697
$$ 925003 923091 921285 919914 919075 918188 916837 915614 915219 914870 912985 909828 907969 909164 911977 913674
60087I13674k00r64j000j190r48L76J883K427K381K613K879K652K702M217O961
$$ 913674 913474 912510 911510 910320 909372 909748 911631 914058 916439 919052 921931 924583 927285 931502 938463
60072I38463R539J1052J1387J0533Q739O899N697M759L569K713L078M295N019
$$ 938463 948002 959054 970441 980974 989713 996612 1002309 1007068 1010637 1013350 1016428 1020723 1025742
60059A025742M649L805L242L109L217L402L563L739L957L865K945J255n30j964
$$ 1025742 1030391 1034196 1037438 1040547 1043764 1047166 1050729 1054468 1058425 1062290 1065235 1066490 1065960 1063996
60045A063996l054l505k820j524j144k323l950m761m850m869m841m549m197l832
$$ 1063996 1060942 1057437 1054617 1053093 1051949 1049626 1045676 1040915 1036065 1031196 1026355 1021806 1017609 1013777
60031A013777l138k473k930m418n079l840k179j947k714l018k996l654m480m105
$$ 1013777 1010639 1008166 1005236 1000818 995739 991899 989720 987773 985059 982041 979045 975391 970911 966806
60017I66806k937k763l868m773m925n491p028q451q982r281r826r807q577o867
$$ 966806 963869 961106 957238 952465 947540 942049 935021 926570 917588 908307 898481 888674 880097 873230
60003H73230n688n208n400o476p808p832o132m458m423n196m879l273j694o92
$$ 873230 867542 862334 856934 850458 842650 834818 828686 824228 819805 814609 809730 806457 804763 804071
59989H04071L41J504K056J913J977K583L003L032L722N658P562P766O320M504
$$ 804071 804412 805916 807972 809885 811862 814445 817448 820480 824202 829860 837422 845188 851508 856012
59975H56012K965J732J512L107N397N728L120l34k164k424k729l730n072o877
$$ 856012 858977 860709 862221 865328 870725 876453 879573 879239 877075 874651 871922 868192 863120 856243
59961H56243r315j1106j0490p855n655n445o552p972r683j1298j1354r253o662
$$ 856243 846928 835822 825332 817477 811822 806377 799825 791853 782170 770872 759518 750265 743603
59948G43603n545n733n743n171m759m659m134k902j527m56L42P70N59j04o05o68
$$ 743603 738058 732325 726582 721411 716652 711993 707859 704957 703430 702974 703316 704086 704645 704541 703936 703268
59932G03268n41l67OO42J361J961K293K222J855J653K004K817L704M232L940K576
$$ 703268 702727 702360 702366 703008 704369 706330 708623 710845 712700 714353 716357 719174 722878 727110 731050 733626
59916G33626O33r59j844k399k659k095r55p02k204m195m649l150r70O93J539J708
$$ 733626 734259 733300 731456 729057 726398 724303 723348 722646 720442 716247 711598 708448 707478 708171 709710 711418
59900G11418J589J812K425K330O42j607k363j174K46L89j69J77J794L278L074
$$ 711418 713007 714819 717244 719574 720216 718609 716246 715072 715318 715707 715538 715715 717509 720787 723861
59885G23861J189p16j015K64J643J918J121j38j368j943j264K04J002O23M33J589
$$ 723861 725050 724334 723319 723583 725226 727144 728265 728127 726759 724816 723552 723756 724758 725381 725814 727403
59869G27403L097L389K906L293M494M865M205M501O798R131Q862N980K826J242
$$ 727403 730500 733889 736795 740088 744582 749447 753652 758153 764951 774082 782944 788924 791750 792992
59855G92992J082J153N90o34j785j918p10J121K455K761K360J912J839K116K426
$$ 792992 794074 795227 795817 795183 793398 791480 790770 791891 794346 797107 799467 801379 803218 805334 807760
59840H07760K528K495K517K657K926L487M403N252N375M665L913M162N732P857
$$ 807760 810288 812783 815300 817957 820883 824370 828773 834025 839400 844065 847978 852140 857872 865729
59826H65729R339R674R460R500R639Q989P348N699M988M985M861M458M261M330
$$ 865729 875068 884742 894202 903702 913341 922330 929678 935377 940365 945350 950211 954669 958930 963260
59812I63260L913K251m90l193m616m349l045j697p98m11n61r52o98P30K432L029
$$ 963260 967173 969424 968934 965741 961125 956776 953731 952034 951236 950825 950264 949312 948614 949344 951776 954805
59796I54805K702L054M823P045Q832J0437J1856J1893R787O506L384N89j947l362
$$ 954805 957507 960561 965384 972429 981261 991698 1003554 1015447 1025234 1031740 1035124 1035713 1033766 1030404
59782A030404l051k032j615j633j484j984m259p379r083q650p475o948p276q123
$$ 1030404 1027353 1025321 1023706 1022073 1020589 1018605 1014346 1006967 997884 989234 981759 974811 967535 959412
59768I59412q805q098n557k860k067k707k539j261j196l585o367o858n239m027
$$ 959412 950607 942509 936952 934092 932025 929318 926779 925518 924322 920737 914370 907512 902273 898246
59754H98246m879p071q616q199o271m641m682n947o869o515m950k525j9R92m11
$$ 898246 893367 886296 877680 869481 863210 858569 853887 847940 841071 834556 829606 827081 827062 828054 827643
59739H27643k788l734l100k937m058m703l402j211J41O51J155J422P87k64p18
$$ 827643 824855 821121 818021 815084 811026 806323 802921 801710 801851 802502 803657 805079 805866 805602 804884
59724H04884o39p26q25k98M50K03j186k326j936j92J705K694K472J520P00M49
$$ 804884 804245 803519 802694 802396 802846 803049 801863 799537 797601 797409 799114 801808 804280 805800 806500 806949
59708H06949L72j17q30q51M43K627M519N121M411L385L203M135N367N871N359
$$ 806949 807321 807204 806374 805523 805966 808593 813112 818233 822644 826029 829232 833367 838734 844605 849964
59693H49964M440M027M622N986P415Q317Q520Q148P556P338P851Q612Q685P893
$$ 849964 854404 858431 863053 869039 876454 884771 893291 901439 908995 916333 924184 932796 941481 949374
59679I49374O806N387K788o62k608j238K020M020L670K532J939J390J30j407k419
$$ 949374 956180 961567 964355 963693 961085 959847 961867 965887 969557 972089 974028 975418 975548 974141 971722
59664I71722k789k728k399k306l006l999m007k791j599j361j573j574j632j982
$$ 971722 968933 966205 963806 961500 958494 954495 950488 947697 946098 944737 943164 941590 939958 937976
59650I37976j958j191o83j357k229j395J328L869M226K475L47o27l25L12N06M10
$$ 937976 936018 934827 934144 932787 930558 929163 930491 934360 938586 941061 941408 940781 940456 940768 941274 941684
59634I41684O53J417K387L470M779N840N573L526P02j399k269k509k691k644k037
$$ 941684 942337 943754 946141 949611 954390 960230 965803 969329 970031 968632 966363 963854 961163 958519 956482
59619I56482j282j355k552l860m116l531l312l859m481m934n936p495q239p431
$$ 956482 955200 953845 951293 947433 943317 939786 936474 932615 928134 923200 917264 909769 901530 894099
59605H94099o311o119n983m439k037n71m54p28j002j287n27K238N549O810N956
$$ 894099 887788 881669 875686 871247 869210 868639 868185 867457 866455 865168 864641 866879 872428 879238 885194
59590H85194N283N543N021L078J597J656J537j89j971j827p27j082l052m643m724
$$ 885194 890477 896020 901041 904119 905716 907372 908909 908720 906749 904922 904195 903113 900061 895418 890694
59575H90694l988l346k969k705k217j089K59L71j410l542l989k844k089l010m818
$$ 890694 886706 883360 880391 877686 875469 874380 874639 875010 873600 870058 866069 863225 861136 858126 853308
59560H53308n745m690k115J78M52j215l057l803l951m426m991m870m150l466k838
$$ 853308 847563 842873 840758 840936 841388 840173 837116 833313 829362 824936 819945 815075 810925 807459 804621
59545H04621j797l86P20J058Q22O73J178K155K634K088J379J511J751N57j670
$$ 804621 802824 802438 803158 804216 805038 805711 806889 809044 811678 813766 815145 816656 818407 818964 817294
59530H17294k634j382L49Q58P12J078J578J198M5j184k398l409l281j758l21l56
$$ 817294 814660 813278 813627 814485 815197 816275 817853 819051 819096 817912 815514 812105 808824 807066 806745 806389
59514H06389j212j443j041j037j772k814l819m193l038p20O68l7j125n44Q82R48
$$ 806389 805177 803734 802693 801656 799884 797070 793251 789058 786020 785300 785968 785931 784806 784262 785144 786092
59498G86092j15J6J922L518L339K446K491L543M713N514N874N735N315N161N716
$$ 786092 785977 785993 787915 791433 794772 797218 799709 803252 807965 813479 819353 825088 830403 835564 841280
59483H41280P182R557J2144J3494J3028J2376J3861J7542K0800K0876J6984J0197
$$ 841280 848462 858019 870163 883657 896685 909061 922922 940464 961264 982140 999124 1009321
59471A009321K608l409o447p124p150p131o186l922j703j254k436l186j620J905
$$ 1009321 1011929 1008520 1002073 994949 987799 980668 974482 970560 968857 967603 965167 961981 960361 962266
59457I62266N070N817M230J956J82j090k098k794l503m839o559p505p254o750
$$ 962266 967336 973153 977383 979339 979521 978431 976333 973539 970036 965197 958638 951133 943879 937129
59443I37129o756o875o743o854p306p072n651m182l644l211j875n38p07j983k644
$$ 937129 930373 923498 916755 909901 902595 895523 889872 885690 882046 878835 876960 876422 875715 873732 871088
59428H71088k181j515j059k91Q50J717K230L207N174P489Q831Q265O277M825N502
$$ 871088 868907 867392 866333 866042 866892 868609 870839 874046 879220 886709 895540 903805 910082 914907 920409
59413I20409P293P584N712L849L524L439K158P98R66J788J426K50n7N48J032J814
$$ 920409 927702 935286 940998 944847 948371 951810 953968 954766 955732 957520 958946 959196 959139 959687 960719 962533
59397I62533L995O673P831P671Q297J0065J0998J0123R014R308J0691J1864J1916
$$ 962533 966528 973201 981032 988703 997000 1007065 1018063 1028186 1037200 1046508 1057199 1069063 1080979
59384A080979J0455P862N452L947K064j643n935q044p497o625p120q170q358p409
$$ 1080979 1091434 1099296 1104748 1108695 1110759 1109116 1103181 1095137 1087640 1081015 1073895 1065725 1057367 1049958
59370A049958n696l630j838o00P79K647L658K702J558L220P913J3111J7136K0258
$$ 1049958 1044262 1040632 1038794 1038194 1038973 1041620 1045278 1047980 1049538 1052758 1060671 1073782 1090918 1111176
59356A111176K2465K3159K3327K5154K9084L3610L7808M0884L9358K9000J1127
$$ 1111176 1133641 1156800 1180127 1205281 1234365 1267975 1305783 1346667 1386025 1415025 1426152
59345A426152o429j6564j8732j6504j2538p869l106K123Q762J5093J6025Q054
$$ 1426152 1419723 1403159 1384427 1367923 1355385 1347516 1344410 1346533 1355295 1370388 1386413 1394467
59333A394467o390k1191l1566l5626l3632k8175k3329k1064j9473j6229j2121
$$ 1394467 1388077 1366886 1335320 1299694 1266062 1237887 1214558 1193494 1174021 1157792 1145671
59322A145671r167p165m768k591k360l695m355l379j848p71k00j30n10n68K36
$$ 1145671 1136504 1129339 1124571 1121980 1119620 1115925 1111570 1108191 1106343 1105572 1105372 1105242 1104732 1104164 1104400
59307A104400R42K95j135j614o63O61J596K306K863L016K973L302M151N327O836
$$ 1104400 1105342 1105637 1104502 1102888 1102225 1102886 1104482 1106788 1109651 1112667 1115640 1118942 1123093 1128420 1135256
59292A135256Q475R554R909J0498J1896J3051J2875J2229J2746J4137J4493J3209
$$ 1135256 1143731 1153285 1163194 1173692 1185588 1198639 1211514 1223743 1236489 1250626 1265119 1278328
59280A278328J1965J2466J4423J6115J6053J3822J0067N986K405o73l377n347
$$ 1278328 1290293 1302759 1317182 1333297 1349350 1363172 1373239 1379225 1381630 1380957 1377580 1372233
59268A372233o378p309r341j2483j5266j6126j4852j2691j1199j0845j0860j0701
$$ 1372233 1365855 1358546 1349205 1336722 1321456 1305330 1290478 1277787 1266588 1255743 1244883 1234182
59256A234182j1134j2988j5194j5459j2993r280n945l290j271k08K51J333L376
$$ 1234182 1223048 1210060 1194866 1179407 1166414 1157134 1151189 1147899 1146628 1146420 1146671 1148004 1151380
59243A151380N206O209P367R011Q952M591l768j3017j9981k3118k2573j9914j7208
$$ 1151380 1156586 1162795 1170162 1179173 1188125 1192716 1188948 1175931 1155950 1132832 1110259 1090345 1073137
59230A073137j5232j3094j0255p749o468n565l973k330j853k122j765o11M42J328
$$ 1073137 1057905 1044811 1034556 1026807 1020339 1014774 1010801 1008471 1006618 1004496 1002731 1002120 1002562 1003890
59216A003890K882N195P274Q433Q984R638J0927J2984J5150J6285J6025J5194
$$ 1003890 1006772 1011967 1019241 1027674 1036658 1046296 1057223 1070207 1085357 1101642 1117667 1132861
59204A132861J4408J3228J1345R592Q687P989O525M382K051m57k780l587k384
$$ 1132861 1147269 1160497 1171842 1181434 1190121 1198110 1204635 1209017 1211068 1210611 1207831 1204244 1201860
59191A201860r13j257l159m663m659l432j519N09J815K332L300N384P183P095
$$ 1201860 1200947 1199690 1196531 1191868 1187209 1183777 1182258 1182767 1184582 1186914 1190214 1195598 1202781 1209876
59177A209876N803N072N039M695M285M897O002N800M065K546K196J930N51j675
$$ 1209876 1215679 1220751 1225790 1230485 1234770 1239667 1245669 1251469 1255534 1258080 1260276 1262206 1262757 1261082
59163A261082l817n352o054o097o404p761r528j0407j0347j0429j0952j1069j0379
$$ 1261082 1257265 1251913 1245859 1239762 1233358 1225597 1216069 1205662 1195315 1184886 1173934 1162865 1152486
59150A152486r472q735p889o919o258n890n310m449l625k722j454k68K86P88K111
$$ 1152486 1143014 1134279 1126390 1119471 1113213 1107323 1102013 1097564 1093939 1091217 1089763 1089495 1089781 1090569 1092680
59135A092680L569L516J858L91L32J031J520J883K439K920L156L652M705N640
$$ 1092680 1096249 1099765 1101623 1102014 1102346 1103377 1104897 1106780 1109219 1112139 1115295 1118947 1123652 1129292
59121A129292N506M246K848K598M053O329P653P193N890M918M014K314J58j148
$$ 1129292 1134798 1139044 1141892 1144490 1148543 1154872 1162525 1169718 1175608 1180526 1184540 1186854 1187012 1185864
59107A185864j014J29J762L351L935L071J718R60L47j046k585l008k895m066o548
$$ 1185864 1184850 1184979 1186741 1190092 1194027 1197098 1198816 1199776 1200123 1199077 1196492 1193484 1190589 1186523 1179975
59092A179975q293q216p480p297p461p657q428r855j0872j0804j0321j0070r645
$$ 1179975 1171682 1163466 1155986 1148689 1141228 1133571 1125143 1115288 1104416 1093612 1083291 1073221 1063576
59079A063576q696p820p428o926n925n188n404n891n476m012k199n74N76Q97N13
$$ 1063576 1054880 1047060 1039632 1032706 1026781 1021593 1016189 1010298 1004822 1000810 998611 998037 998613 999510 1000023
59064A000023M57J774M286O739Q093Q445Q833J0198J2358J4077J4430J3844J3332
$$ 1000023 1000480 1002254 1006540 1013279 1021372 1029817 1038650 1048848 1061206 1075283 1089713 1103557 1116889
59051A116889J3086J2535J1447J0104Q641P133O257O789Q302R265Q638O846N088
$$ 1116889 1129975 1142510 1153957 1164061 1172702 1179835 1186092 1192881 1201183 1210448 1219086 1225932 1231020
59038A231020M226M183L930K327m61k819l467k876k254j946j754j869k334k447
$$ 1231020 1235246 1239429 1243359 1245686 1245225 1242406 1238939 1236063 1233809 1231863 1230109 1228240 1225906 1223459
59024A223459k039k389m315o463p242p406q435r413q419o501o953j0225j2720
$$ 1223459 1221420 1219031 1214716 1208253 1201011 1193605 1185170 1175757 1167338 1160837 1153884 1143659 1130939
59011A130939j1718q707o537n786n473n350n545n489m848m405m653m613l378j771
$$ 1130939 1119221 1110514 1103977 1098191 1092718 1087368 1081823 1076334 1071486 1067081 1062428 1057815 1054437 1052666
58997A052666j156j492j680j212l59N23J041O97m61j638k231k310j931q89N80
$$ 1052666 1051510 1050018 1048338 1047126 1046767 1047290 1048331 1049028 1048567 1046929 1044698 1042388 1040457 1039568 1040148
58982A040148J798K623L338L520K517J333K123N238Q267R037P878O217M658L701
$$ 1040148 1041946 1044569 1047907 1051427 1053944 1055277 1057400 1062638 1070905 1079942 1087820 1094037 1098695 1102396
58968A102396M498P206R911J0873J0888J1761J3493J4664J4954J5407J6366J6763
$$ 1102396 1106894 1114100 1124011 1134884 1145772 1157533 1171026 1185690 1200644 1216051 1232417 1249180
58956A249180J5675J3534J1594J0801J1117J1483J0674Q484N775L332J336R6J53
$$ 1249180 1264855 1278389 1289983 1300784 1311901 1323384 1334058 1342542 1348317 1351649 1352985 1353081 1353234
58943A353234J219K108K228K246K768L531M398N892Q032R865J0896J1749J2636
$$ 1353234 1354453 1356561 1358789 1361035 1363803 1367334 1371732 1377624 1385656 1395521 1406417 1418166 1430802
58930A430802J2618J1389J0313J0520J1284J1565J1688J2087J1838J0280Q867
$$ 1430802 1443420 1454809 1465122 1475642 1486926 1498491 1510179 1522266 1534104 1544384 1553251
58919A553251R360J1168J2507J3360J5006J7227J8378J8160J8058J8876J9909
$$ 1553251 1562611 1573779 1586286 1599646 1614652 1631879 1650257 1668417 1686475 1705351 1725260
58908A725260K0764K1946K3158K3088K1703K0878K1725K2854K2501K0997J9760
$$ 1725260 1746024 1767970 1791128 1814216 1835919 1856797 1878522 1901376 1923877 1944874 1964634
58897A964634J8886J7362J5014J2657J0483P689L993M26j774k349j799p08L11
$$ 1964634 1983520 2000882 2015896 2028553 2039036 2046725 2050718 2051144 2049370 2047021 2045222 2044514 2044825
58884B044825O59L29R1M53P54k0j717l141l723m242n678q135j1255j4729j7860
$$ 2044825 2045484 2045813 2045904 2046357 2047111 2047091 2045374 2042233 2038510 2034268 2028590 2020455 2009200 1994471 1976611
58869A976611j9530j9478j8947j9119j9487j8777j6894j4879j3324j2045j0944
$$ 1976611 1957081 1937603 1918656 1899537 1880050 1861273 1844379 1829500 1816176 1804131 1793187
58858A793187j0010q700o666m869m543n129m753k848p30O85K216M777P839J0344
$$ 1793187 1783177 1774477 1767811 1762942 1758399 1753270 1748517 1745669 1744939 1745624 1747840 1752617 1760456 1770800
58844A770800J2159J3865J5799J7905J9899K1209K1370K0624J9536J8038J5768
$$ 1770800 1782959 1796824 1812623 1830528 1850427 1871636 1893006 1913630 1933166 1951204 1966972
58833A966972J3097J0817Q941P091N845O089O977O382L745R30l62m88p20j639
$$ 1966972 1980069 1990886 1999827 2006918 2012763 2018852 2025829 2032211 2035956 2036886 2036524 2036036 2035316 2033677
58819B033677l215n138o620p366q840j2832j8387k2282k3184k3184k4247k5562
$$ 2033677 2030462 2025324 2018704 2011338 2002498 1989666 1971279 1948997 1925813 1902629 1878382 1852820
58807A852820k5713k5231k5053k4332k1974j8998j7257j6781j6280j5536j5419
$$ 1852820 1827107 1801876 1776823 1752491 1730517 1711519 1694262 1677481 1661201 1645665 1630246
58796A630246j6112j6895j7337j7461j7224j6878j7089j7747j7617j6210j4866
$$ 1630246 1614134 1597239 1579902 1562441 1545217 1528339 1511250 1493503 1475886 1459676 1444810
58785A444810j4768j5094j4608j3796j3707j3706j2408j0222q894q860q920q363
$$ 1444810 1430042 1414948 1400340 1386544 1372837 1359131 1346723 1336501 1327607 1318747 1309827 1301464
58773A301464p711p270o486n009l371k287k009k285k459j936j086j044k062k790
$$ 1301464 1293753 1286483 1279997 1274988 1271617 1269330 1267321 1265036 1262577 1260641 1259555 1258511 1256449 1253659
58759A253659k031l88O71N32n75k286l693l282p54J825K003l25l222n082n496
$$ 1253659 1251628 1251240 1251911 1252443 1251868 1249582 1245889 1242607 1241853 1243678 1245681 1245356 1242134 1237052 1231556
58744A231556m585k932j860k496m610p057q934r713r041p369o059n988o717p585
$$ 1231556 1226971 1224039 1222179 1219683 1215073 1208016 1199082 1189369 1180328 1172959 1166900 1160912 1154195 1146610
58730A146610q589r396q838o654m496l830l793k529K13L044M642M341K144n67
$$ 1146610 1138021 1128625 1119787 1113133 1108637 1104807 1101014 1098485 1098698 1101742 1106384 1110725 1112869 1112302
58716A112302j498j6J744J709M84l64j110k907n173o199n744m988m467l864l378
$$ 1112302 1110804 1110788 1112532 1114241 1114725 1114361 1113251 1110344 1105171 1098972 1093228 1088240 1083773 1079909 1076531
58701A076531l454l739l859m492n929o599n015k318p25j96R25K636L288K701K661
$$ 1076531 1073077 1069338 1065479 1060987 1055058 1048459 1043444 1041126 1040401 1040205 1041130 1043766 1047054 1049755 1052416
58686A052416M042N669O423O579O657O570O261N835N104M248M455O351Q268P950
$$ 1052416 1056458 1062127 1068550 1075129 1081786 1088356 1094617 1100452 1105556 1109804 1114259 1120610 1128878 1136828
58672A136828N648L718L486M429N999Q019R361Q633O446M936M793M717M005L643
$$ 1136828 1142476 1146194 1149680 1154109 1160108 1168127 1177488 1186121 1192567 1197503 1202296 1207013 1211018 1214661
58658A214661M422N822P252Q601R213Q132N864M370M688N984P077P491O792M528
$$ 1214661 1219083 1224905 1232157 1240758 1249971 1258103 1263967 1268337 1273025 1279009 1286086 1293577 1300369 1304897
58644A304897J208j931m327o107p038p112p852j0979j5709j9334k0625k0696k0356
$$ 1304897 1306105 1304174 1299847 1293740 1286702 1279590 1271738 1260759 1245050 1225716 1205091 1184395 1164039
58631A164039j8936j6348j4067j3115j2794j2276j1768j1219r697p134n287n571
$$ 1164039 1145103 1128755 1114688 1101573 1088779 1076503 1064735 1053516 1043819 1036685 1031398 1025827
58619A025827o983p345n920l855k616k727l627m218l702k114N8K459M664O004
$$ 1025827 1018844 1011499 1005579 1001724 999108 996381 992754 988536 984834 982720 982778 985237 989901 995905
58605I95905O380O728P765Q850R011Q418P762O850N086K684J49k711n937q388
$$ 995905 1002285 1009013 1016778 1025628 1034639 1043057 1050819 1057669 1062755 1065439 1065588 1062877 1056940 1048552
58591A048552r058q608q152p455n955m415l667k924j471o60j731k999k244p58
$$ 1048552 1039494 1030886 1022734 1015279 1009324 1004909 1001242 998318 996847 996187 994456 991457 989213 988455
58577I88455j418l582l818j613k12j104j753j26K043K389J370O59M24J24J3J95
$$ 988455 987037 983455 979637 978024 977812 976708 974955 974829 976872 979261 980631 981290 981714 981838 981851 982046
58561I82046l59k268m628o414p695q599q546p336n699m116k326l33J446L129M910
$$ 982046 981687 979419 974791 968377 960682 952083 943537 936201 930502 926386 924060 923727 925173 928302 933212
58546I33212N825M901L385L561N365O504O095N554N579N018L496K402K412K441
$$ 933212 939037 943938 947323 950884 956249 962753 968848 974402 979981 984999 988495 990897 993309 995750
58532I95750J941J945K876L630L659L755M078L806L406M709P802J0367J1000J0701
$$ 995750 997691 999636 1002512 1006142 1009801 1013556 1017634 1021440 1024846 1029555 1037357 1047724 1058724 1069425
58518A069425J0353R477Q424Q847J0772J1938J1417J1088J2125J2915J2164J1403
$$ 1069425 1079778 1089255 1097679 1106526 1117298 1129236 1140653 1151741 1163866 1176781 1188945 1200348
58506A200348J2522J5155J8173K1399K4267K5331K4854K5461K8336L1154L1544
$$ 1200348 1212870 1228025 1246198 1267597 1291864 1317195 1342049 1367510 1395846 1427000 1458544
58495A458544L0146K8406K5888K1954J7728J4126J0055M685n42m096o570q700
$$ 1458544 1488690 1517096 1542984 1564938 1582666 1596792 1606847 1611532 1610990 1606894 1600324 1591624
58483A591624r557q731q128r320j1202j2384j3688j5972j7965j8690j9775k2554
$$ 1591624 1582067 1573336 1565208 1555888 1544686 1532302 1518614 1502642 1484677 1465987 1446212 1423658
58471A423658k4969k4484k2160k0764k0374j9022j6454j4176j2598j0866q894
$$ 1423658 1398689 1374205 1352045 1331281 1310907 1291885 1275431 1261255 1248657 1237791 1228897
58460A228897p178n466l696l247m919o794o501m662l790m572n439n204m064k639
$$ 1228897 1221719 1216253 1212557 1209310 1204391 1197597 1191096 1186434 1182644 1178072 1172633 1167429 1163365 1160726
58446A160726j618j647k273k076r98q37k182k941j761n36j249k510j961j24J164
$$ 1160726 1159108 1157461 1155188 1153112 1152114 1151277 1149095 1146154 1144393 1143857 1142608 1140098 1138137 1138013 1139177
58431A139177K314M670P022O999N194M606O323Q621J0081J0926J1438J1558J1958
$$ 1139177 1141491 1146161 1153183 1160182 1165376 1169982 1176305 1184926 1195007 1205933 1217371 1228929 1240887
58418A240887J3437J5395J6711J7605J8774J9447J8432J6444J5156J4371J2242
$$ 1240887 1254324 1269719 1286430 1304035 1322809 1342256 1360688 1377132 1392288 1406659 1418901
58407A418901Q092L216q37l269l854l299l282m664o263o467n107k735N63M300
$$ 1418901 1426993 1430209 1429372 1426103 1422249 1418950 1415668 1411004 1404741 1398274 1393167 1390432 1390995 1395295
58393A395295P053Q383R716J1763J2783J1248Q399O067L737J86l620n907p036
$$ 1395295 1402348 1410731 1420447 1432210 1444993 1456241 1464640 1470707 1474444 1474630 1471010 1465103 1458067
58380A458067q464r928j0159r370q574p383m993k470j567j915j595O2K213M337
$$ 1458067 1449603 1439675 1429516 1420146 1411572 1404189 1399196 1396726 1395159 1393244 1391649 1391711 1393924 1398261
58366A398261O393P804Q050P683P427P144O785O920P228O177L578J445Q60J68
$$ 1398261 1404654 1412458 1420508 1428191 1435618 1442762 1449547 1456467 1463695 1469872 1473450 1474895 1475755 1475923
58352A475923j946m087m847n418p123q571p915n877m168l003k368l347n663o388
$$ 1475923 1473977 1469890 1465043 1459625 1452502 1443931 1436016 1430139 1425971 1422968 1420600 1417253 1411590 1405202
58338A405202l793r0K190L704N523O072M351L204N280Q371Q776P015O055O120
$$ 1405202 1401409 1401319 1403509 1407213 1412736 1418808 1423159 1426363 1431643 1440014 1448790 1455805 1461860 1467980
58324A467980N581N039O059P451P014N579N417O243O669P720J0831J4022J4325
$$ 1467980 1473561 1478600 1484659 1492110 1499124 1504703 1510120 1516363 1523032 1530752 1541583 1555605 1569930
58311A569930J2477J1271J0991J0435J0437J2112J3582J2884J2022J3659J6075
$$ 1569930 1582407 1593678 1604669 1615104 1625541 1637653 1651235 1664119 1676141 1689800 1705875
58300A705875J6262J5667J7348J9669J8729J5398J3896J4548J4098J2303J2032
$$ 1705875 1722137 1737804 1755152 1774821 1793550 1808948 1822844 1837392 1851490 1863793 1875825
58289A875825J3248J2833J0384Q640Q297P671P327R552J3349J5171J4778J5227
$$ 1875825 1889073 1901906 1912290 1920930 1929227 1936898 1944225 1953777 1967126 1982297 1997075 2012302
58277B012302J7314J9008K0106K2272K4576K4291K2101K1585K3508K5340K6065
$$ 2012302 2029616 2048624 2068730 2091002 2115578 2139869 2161970 2183555 2207063 2232403 2258468
58266B258468K6742K6930K5444K3998K5125K7314K7138K5082K4157K4262K3466
$$ 2258468 2285210 2312140 2337584 2361582 2386707 2414021 2441159 2466241 2490398 2514660 2538126
58255B538126K3101K5498K8259K7460K5071K6243L0476L2655L1989L2395L4657
$$ 2538126 2561227 2586725 2614984 2642444 2667515 2693758 2724234 2756889 2788878 2821273 2855930
58244B855930L5722L5569L7175L9818L9774L7619L7550L9724M0689M0932M4099
$$ 2855930 2891652 2927221 2964396 3004214 3043988 3081607 3119157 3158881 3199570 3240502 3284601
58233C284601M9143N1374N1080N2855N6733N8618N9089O2511O7601O8690O6668
$$ 3284601 3333744 3385118 3436198 3489053 3545786 3604404 3663493 3726004 3793605 3862295 3928963
58222C928963O8432P4620P8350P7637P8432Q3227Q7049Q7511Q8916R3412R7650
$$ 3928963 3997395 4072015 4150365 4228002 4306434 4389661 4476710 4564221 4653137 4746549 4844199
58211D844199J00836J06697J14871J20076J22241J27630J37427J45463J49816
$$ 4844199 4945035 5051732 5166603 5286679 5408920 5536550 5673977 5819440 5969256
58202E969256J56128J66490J75809J82387J91325K03986K14924K22615K32287
$$ 5969256 6125384 6291874 6467683 6650070 6841395 7045381 7260305 7482920 7715207
58193G715207K44796K54231K60002K69457K84550K98098L07458L19487L37473
$$ 7715207 7960003 8214234 8474236 8743693 9028243 9326341 9633799 9953286 10290759
58184A0290759L55850L72726L94709M24030M53689M80658N10657N44571N73921
$$ 10290759 10646609 11019335 11414044 11838074 12291763 12772421 13283078 13827649 14401570
58175A4401570N95749O18289O45999O73114O97771P27673P65558Q04332Q42983
$$ 14401570 14997319 15615608 16261607 16934721 17632492 18360165 19125723 19930055 20773038
58166B0773038Q91384R52780J018082J084091J159743J247502J337532J427776
$$ 20773038 21664422 22617202 23635284 24719375 25879118 27126620 28464152 29891928
58158B9891928J529970J647898J770919J897608K043002K212706K393698K580975
$$ 29891928 31421898 33069796 34840715 36738323 38781325 40994031 43387729 45968704
58150D5968704K787695L018149L259307L512455L803332M146410M531019M958729
$$ 45968704 48756399 51774548 55033855 58546310 62349642 66496052 71027071 75985800
58142G5985800N459572O054106O738999P532048Q489637R654854J1032079J2636088
$$ 75985800 81445372 87499478 94238477 101770525 110260162 119915016 130947095 143583183
58134A43583183J4509333J6652982J8990878K1430472K3900131K6322003K8660859
$$ 143583183 158092516 174745498 193736376 215166848 239066979 265388982 294049841
58127B94049841L0974361L3078574L3878262L1292973K3524358J0829473m052067
$$ 294049841 325024202 358102776 391981038 423274011 446798369 457627842 453575775
58120D53575775j7470971k6982199l2151430l3843745l3192219l1134734k8382471
$$ 453575775 436104804 409122605 376971175 343127430 309935211 278800477 250418006
58113B50418006k5418910k2505129j9782228j7359495j5288121j3528531j2009640
$$ 250418006 224999096 202493967 182711739 165352244 150064123 136535592 124525952
58106A24525952j0692318r550408q539979p628063o819226o122425n519425m989131
$$ 124525952 113833634 104283226 95743247 88115184 81295958 75173533 69654108 64664977
58098F4664977m532541m149041l814856l508034l231013k988556k766555k552173
$$ 64664977 60132436 55983395 52168539 48660505 45429492 42440936 39674381 37122208
58090C7122208k352900k176480k012092j849641j698717j570490j458043j351491
$$ 37122208 34769308 32592828 30580736 28731095 27032378 25461888 24003845 22652354
58082B2652354j256146j178846j111023j041623r73751r13711q56187p94810p35817
$$ 22652354 21396208 20217362 19106339 18064716 17090965 16177254 15321067 14526257 13790440
58073A3790440o87337o45513o03663n64942n34002n06137m76243m49022m29270
$$ 13790440 13103103 12457590 11853927 11288985 10754983 10248846 9772603 9323581 8894311
58064H894311m11350l88861l65753l47555l30433l09118k87261k70046k54523
$$ 8894311 8482961 8094100 7728347 7380792 7050359 6741241 6453980 6183934 5929411
58055E929411k36779k20823k11013k03228j92669j82931j78375j74790j66680
$$ 5929411 5692632 5471809 5260796 5057568 4864899 4681968 4503593 4328803 4162123
58046D162123j57065j51370j47985j43108j38374j35671j30894j20982j10844
$$ 4162123 4005058 3853688 3705703 3562595 3424221 3288550 3157656 3036674 2925830
58037B925830j05424j01221r3444q4944q0045p5980o8881o2054n9707n8308n2873
$$ 2925830 2820406 2719185 2625741 2540797 2460752 2384772 2315891 2253837 2194130 2135822 2082949
58026B082949m6366m3976m3252l9017l3445l2022l3413l2404k9597k9418l1271
$$ 2082949 2036583 1992607 1949355 1910338 1876893 1844871 1811458 1779054 1749457 1720039 1688768
58015A688768l1141k9505k9674l0527k8733k6121k7040l0065k9856k6099k3404
$$ 1688768 1657627 1628122 1598448 1567921 1539188 1513067 1486027 1455962 1426106 1400007 1376603
58004A376603k3171k2424k0282j9270k0059k0382j9296j8101j7190j5902j4738
$$ 1376603 1353432 1331008 1310726 1291456 1271397 1251015 1231719 1213618 1196428 1180526 1165788
57993A165788j4273j3089j0231p895q290r838r995r538j0396j1615j1334j0505
$$ 1165788 1151515 1138426 1128195 1120300 1112010 1102172 1092177 1082639 1072243 1060628 1049294 1038789
57981A038789j0974j2085j2705j3935j6333j7428j5696j3911j4553j5210j2877
$$ 1038789 1027815 1015730 1003025 989090 972757 955329 939633 925722 911169 895959 883082
57970H83082r658r413j1509j2700j2686j3073j3273j2059j0980j1769j2612j1367
$$ 883082 873424 864011 852502 839802 827116 814043 800770 788711 777731 765962 753350 741983
57958G41983r826j0379j1147r383p005p495r527r156o534n078n533n923o052o987
$$ 741983 732157 721778 710631 701248 694243 686748 677221 668065 661531 656453 650920 644997 638945 631958
57944F31958p324m985j687r45k488l209k533k337k513j218J175K549K765L132
$$ 631958 624634 619649 617962 617017 614529 611320 608787 606450 603937 602719 603894 606443 609208 612340
57930F12340L268K225J309J899K106k57l197l419j920j882k786j879j17j047m347
$$ 612340 615608 617833 619142 621041 623147 622890 619693 616274 614354 612472 609686 607807 607690 606643 602296
57915F02296n984m722l337l362l482l347m266n654n121k682r40p70n24L33N10
$$ 602296 596312 591590 588253 584891 581409 578062 573796 568142 563021 560339 559399 558629 558105 558438 558948
57900E58948k15q85j942m279o253n460l023k076k571j857k2J00j709k448j080
$$ 558948 558733 557848 555906 551627 545374 539914 536891 534815 532244 530387 530365 530465 528756 526308 525228
57885E25228M7l02o06j57j64n07P18L353M718L968L359M213N126N169N462O447
$$ 525228 525275 524973 524367 524210 524046 523539 524257 527610 532328 536296 539655 543868 548994 554163 559625 566072
57869E66072O757N865M895L974J811j282k980k557k058l093m928o468p524p707
$$ 566072 572829 578694 583589 587563 589374 588092 585112 582555 580497 577404 572476 566008 558484 550777
57855E50777o678n654o082o816n562k884j486j667j179K41L02j303j843j52J443
$$ 550777 544099 538445 532363 525547 519985 517101 515615 513948 512769 513010 513312 512009 510166 510014 511457
57840E11457J217N24P79J175J051J498K934L746K949J861J817K354K711K957K766
$$ 511457 512674 513198 513977 515152 516203 517701 520635 524381 527330 529191 531008 533362 536073 539030 541796
57825E41796J391m73j075l38P4l22m57l68j270k755l052k388k854m482n027m130
$$ 541796 543187 542714 541639 541301 541375 541053 540596 540228 538958 536203 533151 530763 527909 523427 518400 514270
57809E14270l945m913m813l129k266l054l124j462m57j341j532Q71L618M070L220
$$ 514270 510325 505412 500599 497470 495204 492150 489026 487564 487107 485766 484234 485105 488723 492793 496013
57794D96013L090L247K888L445N959Q245P928O131N212M835L427J636J151J523
$$ 496013 499103 502350 505238 508683 514642 522887 530815 536946 542158 546993 550420 552056 553207 554730
57780E54730J169L37K40L53p65k700l829l951m045m164l725l161l314l753l525
$$ 554730 555899 556236 556476 556829 556064 553364 549535 545584 541539 537375 533650 530489 527175 523422 519897
57765E19897k836k365j766n51M26J02r62j467j322j137o79M56J332M43k353n848
$$ 519897 517061 514696 512930 512379 512805 512907 511945 510478 509156 508019 507340 507796 509128 509571 507218 501370
57749E01370q783j0183r394p066n159m735m673l756k770l048l950l773k512j953
$$ 501370 492587 482404 473010 465944 460785 456050 451377 447621 444851 441803 437853 434080 431568 429615
57735D29615l077m714m985l242o00J116J155O73J241K742L786M033M423N044M652
$$ 429615 426538 421824 416839 413597 412997 414113 415268 415941 417182 419924 423710 427743 432166 437210 441862
57720D41862K945J487J488K347L198M297N899P278P861P887P316N679L686L082
$$ 441862 444807 446294 447782 450129 453327 457624 463523 470801 478662 486549 493865 499544 503230 506312
57706E06312M036M609L704K431J604K80j816k857j806o15j526l904n766o819p918
$$ 506312 510348 514957 518661 521092 522696 522976 521160 518303 516497 515882 514356 510452 504686 497867 489949
57691D89949q960r343r328r195q204o043l945k865j944l52R33Q79L14K96K71l03
$$ 489949 480989 471646 462318 453123 444919 438876 434931 432066 430122 429770 430703 431582 431896 432192 432463 432160
57675D32160k50J211K372J399o23j364o10M00J559L228M232L309J685J596K947
$$ 432160 431910 433121 435493 436892 436269 434905 434295 434695 436254 439482 443714 447023 448708 450304 453251
57660D53251L877L747L191K093K49p96O13L226M303L587L077L111J867j140l899
$$ 453251 457128 460875 464066 466159 466408 465612 466225 469451 473754 477341 480418 483529 485396 484256 480357
57645D80357m831m410l375j777l18l23j501j794l58J091P61r60k531l203l107
$$ 480357 475526 471116 467741 465964 465646 465323 463822 462028 461670 462761 463522 462562 460031 456828 453721
57630D53721k550j891j461j253j289k033l466m203k837P3K737M598O452Q330R104
$$ 453721 451171 449280 447819 446566 445277 443244 439778 435575 432738 432811 435548 440146 446598 454928 464032
57615D64032Q614Q536J0484J4194J8154K1209K3405K5903K9995L5367L9444L9149
$$ 464032 472646 481182 491666 505860 524014 545223 568628 594531 624526 659893 699337 738486
57603G38486L3213K2410Q457o233j8670k6874l1176l2983l2714l0188k6304k2736
$$ 738486 771699 794109 802566 796333 777663 750789 719613 686630 653916 623728 597424 574688
57591E74688k0201j8337j6869j5668j4154j2004r971q740p597n519k920q69M65
$$ 574688 554487 536150 519281 503613 489459 477455 467484 458744 451147 445628 442708 441839 442304
57578D42304J144L26k159m112l279o96P75O53R76K436L305K533J238M03n12j832
$$ 442304 443448 443774 441615 437503 434224 433528 434303 434956 435932 438368 441673 444206 445444 445847 445335 443503
57562D43503k649k518k394k941l418l056k192j362o07n4k0j13M51J402J634J003
$$ 443503 440854 438336 435942 433001 429583 426527 424335 422973 422366 422312 422292 422179 422630 424032 425666 426669
57546D26669N32O28O44L23J95L06J22j70J73Q87R42M52N24J117R48j81r71r60
$$ 426669 427201 427829 428473 428796 428991 429297 429419 429249 429422 430309 431251 431703 432227 433344 434292 434111 433140 432180
57528D32180j279k451l334k958j729k79J188J922R25j135k128j276N7Q78J792
$$ 432180 430901 428450 425116 422158 420429 420150 421338 423260 424185 423050 420922 419646 419703 420581 422373
57513D22373K929K878R38j377k357k044j173J02J357J535O63L34J246J921J124
$$ 422373 425302 428180 429118 427741 425384 423340 422167 422269 423626 425161 425824 426158 427404 429325 430449
57498D30449o3JJ150K196K726K773K102J039P19J263J279L46J39J578K817K105
$$ 430449 430386 430387 431537 433733 436459 439232 441334 442373 443092 444355 445634 445980 446119 447697 450514 452619
57482D52619Q60J478L487M549M254M127M409L752K179J676L152M922N087L924
$$ 452619 453479 454957 458444 462993 467247 471374 475783 479535 481714 483390 486542 491464 496551 500475
57468E00475K961K912L321L588L569L452L309K790J437n15k115k766k751k387
$$ 500475 503436 506348 509669 513257 516826 520278 523587 526377 527814 527299 525184 522418 519667 517280
57454E17280j418K20J965L479M942N812M671J560r29n40J643K795K272J873K637
$$ 517280 515862 516082 518047 521526 526468 532280 536951 538511 537582 537042 538685 541480 543752 545625 548262
57439E48262L640M087M556N523O392O719O996P362O917N343M185N104P498R100
$$ 548262 551902 555989 560545 566068 572460 579179 586175 593537 600454 605797 609982 615086 622584 631684
57425F31684Q877Q031P914Q051P146N297M086M379N258N562N513N849O259N971
$$ 631684 640561 648592 656506 664557 671703 677000 681086 685465 690723 696285 701798 707647 713906 719877
57411G19877N400N554N969N035K739J250J910L291L449K769L087M880O898Q056
$$ 719877 725277 730831 736800 741835 744574 745824 747734 751025 754474 757243 760330 765210 772108 780164
57397G80164Q207P351N547L621K782L356M665O221Q096J0054J1192J0900R705
$$ 780164 788371 795722 801269 804890 807672 811028 815693 821914 830010 840064 851256 862156 871861
57384H71861Q813Q930R678J0151R963R684R992J0691J1028J0886J0957J1661J2609
$$ 871861 880674 889604 899282 909433 919396 929080 939072 949763 960791 971677 982634 994295 1006904
57371A006904J3204J3131J2278J1039J0629J2063J4612J6423J6848J6848J6935
$$ 1006904 1020108 1033239 1045517 1056556 1067185 1079248 1093860 1110283 1127131 1143979 1160914
57360A160914J6360J5001J4298J5132J6255J6168J5279J4840J4872J4801J5112
$$ 1160914 1177274 1192275 1206573 1221705 1237960 1254128 1269407 1284247 1299119 1313920 1329032
57349A329032J6596J8531J9390J8984J8390J8012J7360J6567J6504J7161J7387
$$ 1329032 1345628 1364159 1383549 1402533 1420923 1438935 1456295 1472862 1489366 1506527 1523914
57338A523914J6604J5755J6012J7351J8694J9041J8307J7448J7627J8983K0517
$$ 1523914 1540518 1556273 1572285 1589636 1608330 1627371 1645678 1663126 1680753 1699736 1720253
57327A720253K1494K2296K3336K3907K3148K1590K0685K1009K1881K2578K3039
$$ 1720253 1741747 1764043 1787379 1811286 1834434 1856024 1876709 1897718 1919599 1942177 1965216
57316A965216K3499K4115K4861K5302K4743K3102K1308K0392K0610K1819K3863
$$ 1965216 1988715 2012830 2037691 2062993 2087736 2110838 2132146 2152538 2173148 2194967 2218830
57305B218830K6097K7331K6989K5580K3606K1111J8914J8737K0819K2849K2896
$$ 2218830 2244927 2272258 2299247 2324827 2348433 2369544 2388458 2407195 2428014 2450863 2473759
57294B473759K2255K3530K6724K9314K9739K8867K8142K8042K8450K9044K9266
$$ 2473759 2496014 2519544 2546268 2575582 2605321 2634188 2662330 2690372 2718822 2747866 2777132
57283B777132K9014K9056K9673K9712K8499K7815K9839L3549L5588L4715L3064
$$ 2777132 2806146 2835202 2864875 2894587 2923086 2950901 2980740 3014289 3049877 3084592 3117656
57272C117656L2598L2672L2015L1073L1083L2088L3059L3260L2788L2398L2979
$$ 3117656 3150254 3182926 3214941 3246014 3277097 3309185 3342244 3375504 3408292 3440690 3473669
57261C473669L4475L5483L4984L4182L5116L7536L9036L8579L7898L8709M0283
$$ 3473669 3508144 3543627 3578611 3612793 3647909 3685445 3724481 3763060 3800958 3839667 3879950
57250C879950M0878M0058L8525L6847L5504L5241L6215L7470L8114L8483L9488
$$ 3879950 3920828 3960886 3999411 4036258 4071762 4107003 4143218 4180688 4218802 4257285 4296773
57239D296773M1421M3918M6457M8336M8852M8047M6829M6027M5840M6189M6659
$$ 4296773 4338194 4382112 4428569 4476905 4525757 4573804 4620633 4666660 4712500 4758689 4805348
57228D805348M6104M3502L9720L7219L7401L9080M0155L9829L8739L7839L7910
$$ 4805348 4851452 4894954 4934674 4971893 5009294 5048374 5088529 5128358 5167097 5204936 5242846
57217E242846L9406M1981M4579M6393M7325M7475M6969M6430M6636M7415M7745
$$ 5242846 5282252 5324233 5368812 5415205 5462530 5510005 5556974 5603404 5650040 5697455 5745200
57206E745200M7277M6760M6650M6215M4620M2092L9635L8121L7829L8259L8493
$$ 5745200 5792477 5839237 5885887 5932102 5976722 6018814 6058449 6096570 6134399 6172658 6211151
57195F211151L8482L9556M2548M5933M7592M8067M9963N3994N7964O0303O2282
$$ 6211151 6249633 6289189 6331737 6377670 6425262 6473329 6523292 6577286 6635250 6695553 6757835
57184F757835O5642P0130P4697P9067Q2803Q4630Q4514Q4608Q6180Q7187Q5101
$$ 6757835 6823477 6893607 6968304 7047371 7130174 7214804 7299318 7383926 7470106 7557293 7642394
57173G642394Q0851P7448P5518P3006O9053O5545O4137O3870O2685O0060N7233
$$ 7642394 7723245 7800693 7876211 7949217 8018270 8083815 8147952 8211822 8274507 8334567 8391800
57162H391800N5643N5694N6589N6924N5801N3491N0849M8292M5634M2579L9092
$$ 8391800 8447443 8503137 8559726 8616650 8672451 8725942 8776791 8825083 8870717 8913296 8952388
57151H952388L5598L3115L2565L3600L4720L4986L4926L5317L6008L6534L6957
$$ 8952388 8987986 9021101 9053666 9087266 9121986 9156972 9191898 9227215 9263223 9299757 9336714
57140I336714L7281L6755L4765L1791K8642K5359K1661J7873J4595J1836R275
$$ 9336714 9373995 9410750 9445515 9477306 9505948 9531307 9552968 9570841 9585436 9597272 9606547
57129I606547O835M499K169J89p60q62j332k819m667o372q590j1866j5444j8341
$$ 9606547 9613382 9617881 9620050 9620239 9619479 9618617 9617285 9614466 9609799 9603427 9594837 9582971 9567527 9549186
57115I549186k0434k1579k0894j8145j4674j1733r069o408n058o476j0204j4676
$$ 9549186 9528752 9507173 9486279 9468134 9453460 9441727 9432658 9426250 9421192 9414716 9404512 9389836
57103I389836j9057k3003k5826k7558k9746l3449l7521m0477m2831m5825m9115
$$ 9389836 9370779 9347776 9321950 9294392 9264646 9231197 9193676 9153199 9110368 9064543 9015428
57092I015428n1755n4276n7463o0212o0938o0135n9190n7777n5148n2918n3369
$$ 9015428 8963673 8909397 8851934 8791722 8730784 8670649 8611459 8553682 8498534 8445616 8392247
57081H392247n5569n6390n5099n3754n3147n1684m8807m6637m7486n2151o0912
$$ 8392247 8336678 8280288 8225189 8171435 8118288 8066604 8017797 7971160 7923674 7871523 7810611
57070G810611p3562q8028j01384j12860j23804j34843j45451j56009j67445j78963
$$ 7810611 7737049 7649021 7547637 7434777 7310973 7176130 7030679 6874670 6707225 6528262
57060F528262j89134j99045k11200k25496k39806k54309k71363k91018l11061
$$ 6528262 6339128 6140083 5928883 5703387 5463581 5209272 4937909 4646891 4335830
57051D335830l31891l56806l86498m17787m48870m81376n15981n50704B61134
$$ 4335830 4003939 3647133 3260635 2842848 2393978 1912602 1396621 845917 261134
57041c58387o54074o85532p14559p45306p78749q12512q48957q96522r61861j048898
$$ -358387 -1012461 -1697993 -2412552 -3157858 -3936607 -4749119 -5598076 -6494598 -7456459 -8505357
57031h505357j166403j324235j516757j719659j906637k059114k166870k255695
$$ -8505357 -9671760 -10995995 -12512752 -14232411 -16139048 -18198162 -20365032 -22620727
57023b2620727k429516k833727l502291m226130m621669m374269l429005j972009
$$ -22620727 -25050243 -27883970 -31386261 -35612391 -40234060 -44608329 -48037334 -50009343
57015e0009343k82922J375330K790105L822212M435847M685979M657433M418110
$$ -50009343 -50292265 -48916935 -46126830 -42304618 -37868771 -33182792 -28525359 -24107249
57007b4107249M022318L530399L007909K513405K093073J775769J563239J431168
$$ -24107249 -20084931 -16554532 -13546623 -11033218 -8940145 -7164376 -5601137 -4169969
56999d169969J347726J289507b92815H90576J109937J020885R23585Q22834P21082
$$ -4169969 -2822243 -1532736 -292815 890576 2000513 3021398 3944983 4767817 5488899
56990E488899O22174N29280M41790L58683K82701K17432J62651J15974P6754M4962
$$ 5488899 6111073 6640353 7082143 7440826 7723527 7940959 8103610 8219584 8296338 8341300
56980H341300J8582m548k4083l9273n1621o2626p1148p5825p7455p5487o5204
$$ 8341300 8359882 8355334 8331251 8291978 8240357 8177731 8106583 8030758 7953303 7877816 7812612
56969G812612m4203k1277j3748l3695p8215j32798j81876k16654k36553k45781
$$ 7812612 7768409 7747132 7733384 7699689 7621474 7488676 7306800 7090146 6853593 6607812
56959F607812k48507k46711k41683k35414k29230k22599k14946k07408k01273
$$ 6607812 6359305 6112594 5870911 5635497 5406267 5183668 4968722 4761314 4560041
56950D560041j95933j90151j84226j79201j75097j71787j70392j71826j74807
$$ 4560041 4364108 4173957 3989731 3810530 3635433 3463646 3293254 3121428 2946621
56941B946621j77297j78912j80034j79605j76083j69804j62239j53533j42897
$$ 2946621 2769324 2590412 2410378 2230773 2054690 1884886 1722647 1569114 1426217
56932A426217j30839j18787j06929r4501q1801o9943n9114m9064m0619l4637l0038
$$ 1426217 1295378 1176591 1069662 975161 893360 823417 764303 715239 674620 639983 609945
56921F09945k5242k1140k0021k1851k4031k4813k4482k3259k0679j7339j4727
$$ 609945 584703 563563 543542 521691 497660 472847 448365 425106 404427 387088 372361
56910C72361j2883j0558p984o899p324o984m815k491j353l23J730L708M149L599
$$ 372361 359478 348920 340936 334037 326713 319729 314914 312423 311070 310747 312477 316185 320334 323933
56896C23933L388L289J924j365o213j1764j6626j9375k0063k0182k0391j9522
$$ 323933 327321 330610 332534 331169 324956 313192 296566 277191 257128 236946 216555 197033
56884A97033j6633j2658r013n890k986o57R59K834N844R377J2341J4711J7065
$$ 197033 180400 167742 158729 152839 149853 149196 150155 152989 158833 168210 180551 195262 212327
56871B12327J9350K1035K1724K0723J6848R744Q11p953j5314k0419k2353k1256
$$ 212327 231677 252712 274436 295159 312007 321751 322562 314609 299295 278876 256523 235267
56859B35267j9019j7431j6154j3700j0101p234o594p614q329p154m041l28K522
$$ 235267 216248 198817 182663 168963 158862 151628 145034 137420 129091 121937 117896 117568 120090
56846A20090M070M664M433L273J754J005J456K551L799N230O626P390P341O741
$$ 120090 124160 128824 133257 136530 138284 139289 140745 143296 147095 152325 158951 166341 173682 180423
56832A80423N595M185M034O488J0304J2583J2610J2508J3485J3772J1551P638
$$ 180423 186018 190203 194237 200725 211029 223612 236222 248730 262215 275987 287538 295176
56820B95176L697r5l687n472m305j863n89l56P58L359O541R839J3142J5513J6485
$$ 295176 298873 298778 295091 289619 285314 283451 282862 282506 283264 286623 293164 303003 316145 331658 348143
56805C48143J7836K1534K6397K9519L0838L3232L7541M0273L7579K9418J8514
$$ 348143 365979 387513 413910 443429 474267 507499 545040 585313 622892 652310 670824
56794F70824P068l798j2585j7674j9084j8810j8783j8852j7123j2396n982l85
$$ 670824 677892 674094 661509 643835 624751 605941 587158 568306 551183 538787 532805 532420
56782E32420L598P427J2145J6756K0414K4766L2051M1572N0031N5053N6289N3146
$$ 532420 536018 543445 555590 572346 592760 617526 649577 691149 741180 796233 852522 905668
56770I05668M3853K7908P982j1639k7764l9052m5313m7026m5138m0735l4942k8904
$$ 905668 949521 977429 985411 973772 946008 906956 861643 814617 769479 728744 693802 664898
56758F64898k3206j7439j1000m238J902P098J1626J5513J8786K2276K6755L1215
$$ 664898 641692 624253 613253 609015 610917 618015 629641 645154 663940 686216 712971 744186
56746G44186L3181L1051K5027J5818L878r577k2078l1441l7236m0254m1141l9990
$$ 744186 777367 808418 833445 849263 853141 843564 821486 790045 752809 712555 671414 631424
56734F31424l6767l1664k5319j8900j3663j0250q464p449n864k549K282O875R706
$$ 631424 594657 562993 537674 518774 505111 494861 486397 478948 473084 470535 472817 479692 489398
56721D89398J1028J1974J2671J2128R448M179l812j3371k1527k5637k6101k5529
$$ 489398 500426 512400 525071 537199 546647 550826 547014 533643 512116 486479 460378 434849
56709D34849k5259k4221k1365j7530j4363j2668j2290j2546j2407j1314j0105
$$ 434849 409590 385369 364004 346474 332111 319443 307153 294607 282200 270886 260781
56698B60781j0072j0918j0901r303p360o254n579m533l391k811k572k052j408
$$ 260781 250709 239791 228890 219587 212227 205973 200394 195861 192470 189659 187087 185035 183627
56685A83627j432k413l663m083l180j775j494k960m715m719k728k74J431K469
$$ 183627 182195 179782 176119 172036 168856 167081 165587 162627 157912 153193 150465 150191 151622 154091
56671A54091L188L489L347L001K476J795J461J695J502l2j765j569O21K603L028
$$ 154091 157279 160768 164115 167116 169592 171387 172848 174543 176045 176013 174248 172679 173300 175903 178931
56656A78931K731K490J600l32k027k249j505q55m18o5k49r57j161n47m65j796
$$ 178931 181662 184152 185752 185420 183393 181144 179639 178784 178366 178301 178052 177095 175934 175387 174922 173126
56640A73126l170k919j652j115j366r77M07J569J699J271Q83N93N52J100J966
$$ 173126 169956 167037 165385 164270 162904 161927 162334 163903 165602 166873 167756 168349 168901 170001 171967
56625A71967K365K124J927K238K645K527J882J217Q80O69R6q24j229k76J526K573
$$ 171967 174332 176456 178383 180621 183266 185793 187675 188892 189772 190441 190537 189713 188484 188208 189734 192307
56609A92307J923K26j332k197k232j290K55J240P79p36k242l156l447l183k636
$$ 192307 194230 194456 193124 190927 188695 187405 187660 188900 189679 188943 186701 183545 180098 176915 174279
56594A74279k398k785l500m218n004n766n956n242l965k493q72M89P39q6n62L68
$$ 174279 171881 169096 165596 161378 156374 150608 144652 139410 135445 132952 132080 132569 133308 133222 132660 133028
56578A33028J822K095R26l13l46Q59K366L027K331J086Q20J931L003K715J741
$$ 133028 134850 136945 137871 137558 137212 138071 140437 143464 145795 146881 147701 149632 152635 155350 157091
56563A57091J809L191M288L722J945N84O73J735K331J437n82k422l147k742j613
$$ 157091 158900 162091 166379 170101 172046 172630 173303 175038 177369 178806 178224 175802 172655 169913 168300
56548A68300l17K82m65j903k463j563l24J02lL02J169K064K610K683K215J579
$$ 168300 167983 168265 167800 165897 163434 161871 161547 161649 161646 161948 163117 165181 167791 170474 172689 174268
56532A74268J500K036K320J853J235R91O68j17o42k38M37L89p8L7P40J259J597
$$ 174268 175768 177804 180124 181977 183212 184203 184871 184754 184112 183874 184311 184700 184622 184659 185399 186658 188255
56515A88255K530M020M851M128K364Q86O26J559K878L718L979M202M594M682M346
$$ 188255 190785 194805 199656 203784 206148 207034 207660 209219 212097 215815 219794 223996 228590 233272 237618
56500B37618M392N441O769P062O033M560L466K743J930Q07k81p47o90j228l124
$$ 237618 242010 247451 254220 261282 267315 271875 275341 278084 280014 280821 280540 279793 279103 277875 274751
56485B74751n186n157k616J93R54l20k030k990k900j922q16o08j218j274j11J102
$$ 274751 269565 264408 261792 261985 262939 262619 260589 257599 254699 252777 251961 251353 250135 248861 248750 249852
56469B49852J247J146K123L579L611J612j160l305m254l813k114r2J051R35Rj201
$$ 249852 251099 252245 254368 257947 261558 263170 262010 258705 254451 250638 248524 248432 249483 250418 250427 249226
56453B49226k149k102r25K98M12l14o82k62K58K16l47j023j335r09J43J239K007
$$ 249226 247077 244975 244050 244348 244760 244446 243764 243502 243760 243976 243629 242606 241271 240362 240505 241744 243751
56436B43751K519K588J763M46QR86K153K242J574J036M49o73j648j405l09J58
$$ 243751 246270 248858 250621 251067 251075 252061 254214 256456 258030 259066 259515 258842 257194 255789 255480 255638
56420B55638n88j673k026j355j2J352K256K833L422L568K397K69j184j202p23
$$ 255638 255050 253377 251351 249996 249984 251336 253592 256425 259847 263415 265812 266081 264897 263695 262972
56405B62972m93LQ56Q36m52j277k58J451K089J868J786J487M57j51P43J867J525
$$ 262972 262479 262482 263338 264174 263722 262445 262187 263638 265727 267595 269381 270868 271325 271174 271917 273784 275309
56388B75309O33J105K277J931K36m33N87J534J505J548K103J981O48o61q56k28
$$ 275309 275942 277047 279324 281255 281491 281058 281645 283179 284684 286232 288335 290316 290964 290303 289447 289219
56372B89219O16J378J481O09j50N46K028K393J395N86P31J172J619K292K462J295
$$ 289219 289835 291213 292694 293303 293153 293699 295727 298120 299515 300101 300832 302004 303623 305915 308377 309672
56356C09672QN04J955J696k59r06R08K734K748K418L185L659K311M84J51P25O10
$$ 309672 309680 310184 312139 313835 313576 312670 313578 316312 319060 321478 324663 328322 330633 331117 331268 331993 332603
56339C32603L30J448L417M037K639P76m6K31R82J707K066J960J560R38M3p07o19
$$ 332603 332933 334381 337798 341835 344474 345250 345204 345435 346417 348124 350190 352150 353710 354648 354691 353984 353365
56322C53365K35R50J004M85j055m512r419j3508j4900j3715j1011p410l457j20
$$ 353365 353600 354550 355554 356039 354984 350472 341053 327545 312645 298930 287919 280509 277052 276932
56308B76932K062L489M532M890M388L454K390J242O92J802M301O386O795O023
$$ 276932 278994 282483 287015 291905 296293 299747 302137 303379 304071 305873 310174 316560 323355 329378
56294C29378N016M021L174K913L008K433R07m58o21L15J896L880N550N768M344
$$ 329378 334394 338415 341589 344502 347510 349943 350850 350392 349771 350086 351982 355862 361412 367180 371524
56279C71524K254K06j592k168k28L451N903N372L257J896J943K859M280N682O122
$$ 371524 373778 373984 372392 370224 369996 373447 379350 384722 387979 389875 391818 394677 398957 404639 410761
56264D10761N620N451O023N820L817J547J194K540L417K596R31o0L18J610K766
$$ 410761 416381 421832 427855 433675 437492 439039 440233 442773 446190 448786 449717 449657 449975 451585 454351
56249D54351L205L457M257N250N631N818O815P945P263M843L610N715R684J2244
$$ 454351 457556 461013 465270 470520 476151 481969 488784 496729 503992 508835 512445 518160 527844 540088
56235E40088J1731Q701M677J534Q59K603N054O819Q045R190R989J0297J0687J1443
$$ 540088 551819 560520 565197 566731 567590 570193 575247 582066 590111 599301 609290 619587 630274 641717
56221F41717J2094J2552J3408J4614J5260J5175J5262J5725J5703J5211J5617
$$ 641717 653811 666363 679771 694385 709645 724820 740082 755807 771510 786721 802338
56210H02338J7439J9501K1071K2881K5184K6969K8190L0644L5086L9444M1561
$$ 802338 819777 839278 860349 883230 908414 935383 963573 994217 1029303 1068747 1110308
56199A110308M2119M3290M5986M9827N4469N9442O4034O8522P4305Q1839Q9858
$$ 1110308 1152427 1195717 1241703 1291530 1345999 1405441 1469475 1537997 1612302 1694141 1783999
56188A783999R7438J04977J12319J18078J22025J25747J29503J30832J28093J23002
$$ 1783999 1881437 1986414 2098733 2216811 2338836 2464583 2594086 2724918 2853011 2976013
56178B976013J17495J10315R9145Q4319O7890N0471L1537J1589q290k7867m6656
$$ 2976013 3093508 3203823 3302968 3387287 3455177 3505648 3537185 3548774 3540484 3512617 3465961
56167C465961o2665p4532q3783r2715j01091j07038j10176j11520j11205j08697
$$ 3465961 3403296 3328764 3244981 3152266 3051175 2944137 2833961 2722441 2611236 2502539
56157B502539j04690j00654r6827r2462q7543q2698p8013p3467o9682o6824o3586
$$ 2502539 2397849 2297195 2200368 2107906 2020363 1937665 1859652 1786185 1716503 1649679 1586093
56146A586093n8818n3277m8352m3987l9464l5189l2084l0048k8331k6718k5157
$$ 1586093 1527275 1473998 1425646 1381659 1342195 1307006 1274922 1244874 1216543 1189825 1164668
56135A164668k3308k1387k0085j8867j6085j1941r101q906r168p641n470m939
$$ 1164668 1141360 1119973 1099888 1081021 1064936 1052995 1043894 1034988 1025820 1018179 1012709 1007770
56123A007770n783o159n590m566k777k34J372Q44k36L14K247M089N672P164P380
$$ 1007770 1001987 995828 990238 985672 982895 982661 984033 984877 984641 984955 987202 991291 996963 1004127 1011507
56108A011507N797M655O162Q975J0309J0320J1358J3861J5975J6637J6386J5767
$$ 1011507 1017304 1021959 1028121 1037096 1047405 1057725 1069083 1082944 1098919 1115556 1131942 1147709
56096A147709J5245J6041J8739K1861K3910K5791K9134L3444L7174M0500M4648
$$ 1147709 1162954 1178995 1197734 1219595 1243505 1269296 1298430 1331874 1369048 1409548 1454196
56085A454196M9701N5272O2176P1150Q1057R0346R8900J06563J11732J13443J12689
$$ 1454196 1503897 1559169 1621345 1692495 1773552 1863898 1962798 2069361 2181093 2294536 2407225
56074B407225J09489J01331Q7496P2322O0764N2957M6556M1709L9410L6967L0140
$$ 2407225 2516714 2618045 2705541 2777863 2838627 2891584 2938140 2979849 3019259 3056226 3086366
56063C086366J8974P479j703q609j3307j6102j9712k7234l8336n0553o3159p6266
$$ 3086366 3105340 3112819 3111116 3102507 3089200 3073098 3053386 3026152 2987816 2937263 2874104 2797838
56051B797838q7470r3482r4318r2307q8067q1046p2676o4878n6682m6459l6246
$$ 2797838 2710368 2616886 2522568 2430261 2342194 2261148 2188472 2123594 2066912 2020453 1984207
56040A984207k9511k5736k1693j7028j3911j2032q874m560j705o78N79K260K654
$$ 1984207 1954696 1928960 1907267 1890239 1876328 1864296 1855422 1850862 1849157 1848479 1849058 1851318 1853972
56027A853972K121K956N432Q024J0883J4975J8668J9616J9212K0659K3516K4962
$$ 1853972 1856093 1859049 1864481 1872505 1883388 1898363 1917031 1936647 1955859 1976518 2000034 2024996
56015B024996K5396K7531L0676L1442K9856K9304L0580L1256L0961L1883L3984
$$ 2024996 2050392 2077923 2108599 2140041 2169897 2199201 2229781 2261037 2291998 2323881 2357865
56004B357865L5008L5300L7463M1142M3253M3348M3714M4520M4185M4054M6928
$$ 2357865 2392873 2428173 2465636 2506778 2550031 2593379 2637093 2681613 2725798 2769852 2816780
55993B816780N1306N3050N2503N3734N6890N7933N6218N5757N8261O1245O3675
$$ 2816780 2868086 2921136 2973639 3027373 3084263 3142196 3198414 3254171 3312432 3373677 3437352
55982C437352O7227P1272P2900P2668P4262P8038Q0993Q3126Q7246R2401R4686
$$ 3437352 3504579 3575851 3648751 3721419 3795681 3873719 3954712 4037838 4125084 4217485 4312171
55971D312171R4829R7730J04026J09501J13233J18504J25231J29668J32539J38983
$$ 4312171 4407000 4504730 4608756 4718257 4831490 4949994 5075225 5204893 5337432 5476415
55961E476415J49432J58887J66371J76301J89111J99668K06885K15837K28226
$$ 5476415 5625847 5784734 5951105 6127406 6316517 6516185 6723070 6938907 7167133
55952G167133K39792K49406K61492K77073K91560L03781L17980L34765L49864
$$ 7167133 7406925 7656331 7917823 8194896 8486456 8790237 9108217 9442982 9792846
55943I792846L64032L83831M09939M35286M57641M82985N13157N41598N65208
$$ 9792846 10156878 10540709 10950648 11385934 11843575 12326560 12839717 13381315 13946523
55934A3946523N89165O15940O41051O63861O91195P25823P62927Q01879Q49339
$$ 13946523 14535688 15151628 15792679 16456540 17147735 17873558 18636485 19438364 20287703
55925B0287703R06689R67278J030186J102996J186764J272955J360075J457789
$$ 20287703 21194392 22161670 23191856 24294852 25481616 26754571 28114646 29572435
55917B9572435J569471J687155J809733J948825K109767K284354K469241K672843
$$ 29572435 31141906 32829061 34638794 36587619 38697386 40981740 43450981 46123824
55909D6123824K897332L134613L388624L680303M021982M409696M848938N361948
$$ 46123824 49021156 52155769 55544393 59224696 63246678 67656374 72505312 77867260
55901G7867260N960730O643619P431485Q375574R515073J0860148J2428850J4257368
$$ 77867260 83827990 90471609 97903094 106278668 115793741 126653889 139082739 153340107
55893A53340107J6354616J8690784K1244688K4001333K6882052K9741329L2394586
$$ 153340107 169694723 188385507 209630195 233631528 260513580 290254909 322649495
55886C22649495L4402173L4656934L1448165K3489947J1232372k908977j5824589
$$ 322649495 357051668 391708602 423156767 446646714 457879086 454970109 439145520
55879D39145520k5358797l0968578l3237635l3102131l1435516k8939716k6103850
$$ 439145520 413786723 382818145 349580510 316478379 285042863 256103147 229999297
55872B29999297k3214957k0448758j7937159j5748889j3870756j2255060j0866653
$$ 229999297 206784340 186335582 168398423 152649534 138778778 126523718 115657065
55865A15657065r673448q631816p709730o902126o206139n602405n073281m616268
$$ 115657065 105983617 97351801 89642071 82739945 76533806 70931401 65858120 61241852
55857F1241852m225545l880548l565451l281446l029103k796813k577000k376065
$$ 61241852 57016307 53135759 49570308 46288862 43259759 40462946 37885946 35509881
55849C5509881k197736k032759j874772j730668j605498j491986j384447j288784
$$ 35509881 33312145 31279386 29404614 27673946 26068448 24576462 23192015 21903231
55841B1903231j208768j135634j061093r88757r23564q61318p97886p38158o86942
$$ 21903231 20694463 19558829 18497736 17508979 16585415 15724097 14926211 14188053 13501111
55832A3501111o40450n94913n54318n21833m92464m61775m33488m11359l91813
$$ 13501111 12860661 12265748 11711430 11189597 10697133 10235358 9801870 9390511 8998698
55823H998698l71495l53740l40526l26196l06450k86028k70390k57036k42235
$$ 8998698 8627203 8273463 7932937 7606741 7300291 7014263 6743873 6486837 6244602
55814F244602k29255k22266k18292k12655k07011k04741k03336j98414j91153
$$ 6244602 6015347 5793081 5574789 5362134 5155123 4950382 4747046 4548632 4357479
55805D357479j85242j80071j72679j63166j53142j42252j30774j21879j17021
$$ 4357479 4172237 3992166 3819487 3656321 3503179 3360927 3230153 3108274 2991253
55796B991253j12642j05483r7418r1296q6175q0473p5656p2791o9479o4117n9219
$$ 2991253 2878611 2773128 2675710 2584414 2498239 2417766 2342110 2269319 2199840 2135723 2076504
55785B076504n6734n4203m9388m4607m2460m1273l8783l6457l6063l5676l3287
$$ 2076504 2019770 1965567 1916179 1871572 1829112 1787839 1749056 1712599 1676536 1640860 1607573
55774A607573l0826l0560l0779k9102k6814k6029k5579k3685k1660k1264k1144
$$ 1607573 1576747 1546187 1515408 1486306 1459492 1433463 1407884 1384199 1362539 1341275 1320131
55763A320131j9639j8259j8775j9600j8600j6914j6566j6933j6722j6737j7406
$$ 1320131 1300492 1282233 1263458 1243858 1225258 1208344 1191778 1174845 1158123 1141386 1123980
55752A123980j6518j2899r548r481j1013j0758q858p636p242o361n344n193n123
$$ 1123980 1107462 1094563 1085015 1075534 1064521 1053763 1044905 1037269 1030027 1023666 1018322 1013129 1008006
55739A008006m273m054n826p966q136o722n375m103k468j654k523l537l234k633
$$ 1008006 1003733 999679 993853 985887 977751 971029 965654 961551 959083 957429 954906 951369 948135 945502
55725I45502k774k232j38P42k546q529j3420j6156j8047j8984j7616j4375j1114
$$ 945502 942728 940496 940358 941100 938554 930025 916605 900449 882402 863418 845802 831427 820313
55712H20313q303n212k139m0J230J954P90l659j0127j5671j8776j9778j9158j7236
$$ 820313 812010 806798 804659 804619 805849 807803 808593 804934 794807 779136 760360 740582 721424 704188
55698G04188j4866j2849j1193r874r291r216q781q201q670r855r833q423p934
$$ 704188 689322 676473 665280 655406 646115 636899 628118 619917 611247 601392 591559 583136 575202
55685E75202r245j0101q971p628p639p236m420p96O34m02k190m106o282p826p926
$$ 575202 565957 555856 546885 539257 531618 524382 519962 519166 519800 519398 517208 513102 506820 498994 491068
55670D91068p489p509p294o240n677o737q138q141p152o423n895n272n272n872
$$ 491068 483579 476070 468776 462536 456859 450122 441984 433843 426691 420268 414373 409101 403829 397957
55656C97957n263k563N13K626M907P942R487P968N621M922M313J095l522o028
$$ 397957 392694 390131 390644 393270 398177 406119 415606 423574 429195 434117 438430 439525 436003 429975
55642D29975n838n247n380n665o352q068r534q900o813n380m865m129l412l739
$$ 429975 424137 418890 413510 407845 401493 393425 383891 374991 368178 362798 357933 353804 350392 346653
55628C46653m277l259j051L67M93M39O20O60Q55J401J111o83k117j176R00J351
$$ 346653 342376 339117 338066 338433 338926 339365 339985 340645 341500 342901 344012 343329 341212 340036 340936 342287
55612C42287m1j381k059k777l069j953m77n73j819k203j605j592k202j962q03
$$ 342287 342246 340865 338806 336029 332960 331007 330530 329957 328138 325935 324330 322738 320536 318574 317771
55597C17771r1J24J021K328K501J552J063J378J328P99R52J833K159J538P84K16
$$ 317771 317680 317804 318825 321153 323654 325206 326269 327647 328975 329774 330726 332559 334718 336256 337040 337256
55581C37256k53J99K075L532K179j341m246n634o838q171q463p843p735p780n937
$$ 337256 337003 337202 339277 342809 344988 343647 339401 333767 326929 318758 310295 302452 294717 286937 281000
55566B81000k326M0o29k677l803l782l309k399j133l00m48j510l606o523q422
$$ 281000 278674 278714 278085 275408 271605 267823 264514 262115 260982 260682 260234 258724 255118 248595 240173
55551B40173p268l872j470j728l083l473k777j907j301j005q79l90N54P55p29
$$ 240173 232905 229033 227563 225835 222752 219279 216502 214595 213294 212289 211410 211020 211574 212329 211600
55536B11600k543k529r62n6m35n72J09K63p19j500j064j54L08L69P0p75j359l68
$$ 211600 209057 206528 205566 205510 205075 204503 204612 204875 204156 202656 201592 201438 201746 202115 202185 201410 200051 199683
55518A99683J877L650M566N871P598P815N715L223K334K709L024K973K696J823
$$ 199683 201560 205210 209776 215647 223245 231060 236775 239998 242332 245041 248065 251038 253734 255557
55504B55557L83n49k67M28K89j001l064n401p245p712o667m818k995j940k365
$$ 255557 255940 255391 255124 255552 255841 254840 251776 246375 239130 231418 224751 219933 216938 214998 212633
55489B12633m015n310n129m327l969l133o38K033K258L51p68M4J041J023Q75J096
$$ 212633 208618 203308 198179 193852 189883 186750 186112 188145 190403 190754 189986 190030 191071 192094 192969 194065
55473A94065P94N8N36K514L931L506K455J957J336J68k47R15K285K420J902J877
$$ 194065 194859 194917 195453 197967 201898 205404 207859 209816 211152 211320 211073 211988 214273 216693 218595 220472
55457B20472K064J602L75j569m451p572r321r348r122r549r841r513r307r131
$$ 220472 222536 224138 224513 222944 218493 210921 201600 192252 183130 173581 163740 154227 144920 135789
55443A35789p447m074j417j150j709r01Q30J668J376J030J005R71Q54M49q26k555
$$ 135789 128342 124268 122851 121701 119992 119091 119921 121589 122965 123995 125000 125971 126825 127274 126448 123893
55427A23893l014j411Q85K327K780K309N22j524j232J825M235L076n8j679j266
$$ 123893 120879 119468 120353 122680 125460 127769 128291 126767 125535 127360 131595 134671 134613 132934 131668
55412A31668p90q75m62M88Q03K72k47n53r48r02Q8R68M68n49k03J438K561K333
$$ 131668 130878 130003 129541 130029 130832 131104 130857 130304 129356 128454 128542 129510 129978 129429 129226 130664 133225 135558
55394A35558J347k50k712m895m761k042J296L441M044L289J530j51o84n72j171
$$ 135558 136905 136655 133943 129048 124287 122245 123541 126982 131026 134315 135845 135694 135010 134438 133267
55379A33267k507l306l076k388j161J220L813M305K119m54j154l05M70O15N21
$$ 133267 130760 127454 124378 121990 120829 122049 125862 130167 132286 131832 130678 130373 130843 131458 131979
55364A31979K13l71n38L56J521J486K63l39R93L182L920K414K08r04q60p18p88
$$ 131979 132192 131821 131283 131639 133160 134646 134909 134570 135563 138745 142665 145079 145287 144383 143523 142805 142017
55347A42017n05J38K89m01j279j760j844j407l27L83p31l008l553j025K017K312
$$ 142017 141512 141650 141939 141538 140259 138499 136655 135248 134921 135304 134573 131565 128012 126987 129004 131316
55331A31316K05j208l67J421K644L301L637L029J103j118k034j144L75P46o49
$$ 131316 131521 130313 129946 131367 134011 137312 140949 143978 145081 143963 141929 140785 141160 141906 141257
55316A41257k386k413n56J198J371P34N70M62p02k382k816j531J21Q62O40l1n52
$$ 141257 138871 136458 135902 137100 138471 139205 139775 140237 139535 137153 134337 132806 132927 133789 134429 134398 133846
55299A33846j98J279K842L016J581l67j829k516k412j773j245r95r2J988L841
$$ 133846 133648 134927 137769 140785 142366 141999 140170 137654 135242 133469 132224 131229 131137 133125 136966
55284A36966L605J730N49R49J241j80k492l584k639q00J60m87j695j569M63K660
$$ 136966 140571 142301 142850 143799 145040 144860 142368 138784 136145 135345 135505 135018 133323 131754 132217 134877
55268A34877K942J436p2p51j252j775j499m38n9j115k194j630J53J384J299N47
$$ 134877 137819 139255 139183 138432 137180 135405 133906 133468 133409 132294 130100 128470 128623 130007 131306 131853
55252A31853k33j040j693j556m35Q22J191O97M09J080K080K136J043P3L23J248
$$ 131853 131620 130580 128887 127331 126896 127718 128909 129606 130015 131095 133175 135311 136354 136427 136750 137998
55236A37998J416L42j153k138k297j538J59K169L201K435N39p91m43R79J760J011
$$ 137998 139414 139756 138603 136465 134168 132630 132789 134958 138159 140594 141133 140342 139899 140878 142638 143649
55220A43649k48m29M67R83N84M75J347J725M3k595l503j926K33J288J635K230
$$ 143649 143401 142972 143439 144422 145006 145481 146828 148553 148596 146001 142498 140572 140805 142093 143728 145958
55204A45958K642J692o79l059l936l046j436m69o17j257j513r91L33K165L450
$$ 145958 148600 150292 149613 146554 142618 139572 138136 137667 137050 135793 134280 133289 133622 135787 139237
55189A39237K796K48k056k098m13O40k35k189l661l768k442l71J197J519J281
$$ 139237 142033 142281 140225 138127 137714 138354 138119 135930 132269 128501 126059 125688 126885 128404 129685
55174A29685J574K207K041Q30l97q26n54R5Q51J148O39J08O25J739J853N32r00
$$ 129685 131259 133466 135507 136337 135940 135114 134560 134655 135506 136654 137293 137401 138026 139765 141618 142150 141250
55157A41250j308r18j86J063K576L088J748o70k681l467k899j151R82K215K009
$$ 141250 139942 139024 138838 139901 142477 145565 147313 146643 143962 140495 137596 136445 137427 139642 141651
55142A41651J127N04K22Lp1J08K98L62L96J14r83k352k417o44J260J316k33j323
$$ 141651 142778 143282 143504 143507 143436 143544 143842 144204 144600 144714 143731 141379 138962 138318 139578 140894 140661 139338
55124A39338n80J400L062L337K236O21n28r22r49r63r82j060j250j104q6J281
$$ 139338 138758 140158 143220 146557 148793 149414 148886 147964 147015 146052 145070 144010 142760 141656 141570 142851
55108A42851J585L61j123j494q31K6Q23J616J893J044n93j986k435j782j42J759
$$ 142851 144436 144797 143674 142180 141349 141375 142198 143814 145707 146751 146158 144172 141737 139955 139813 141572
55092A41572K522J405m94j275m02R08J444J253J126J480K028K149J408mj344j941
$$ 141572 144094 145499 145005 143730 143328 144236 145680 146933 148059 149539 151567 153716 155124 155120 153776 151835
55076A51835j759j215p44o48r42j164p39J69O97M69J27J96K09l33p71j69J045
$$ 151835 150076 148861 148117 147469 146527 145363 144624 144793 145490 145959 146086 146282 146491 146158 145387 145218 146263
55059A46263J487P93N9J30N80P88J013J666K156J475k34j493j083O19K127K363
$$ 146263 147750 148543 148602 148732 149312 150100 151113 152779 154935 156410 156176 154683 153600 154219 156346 158709
55043A58709J399l2j289k032k128j731j257r20l94P14K155L143L180K432J354
$$ 158709 160108 160076 158787 156755 154627 152896 151639 150719 150325 151039 153194 156337 159517 161949 163303
55028A63303L61k08k76j89k38j12M87Q56r9j993k789j159J720L596L601K523J247
$$ 163303 163664 163456 163180 162991 162753 162641 163128 163984 163885 161892 159103 157944 159664 163260 166861 169384 170631
55011A70631J01o11o62o09j324k544k845j576L7M19k86o20l3L63m84j916k349
$$ 170631 170732 170121 169459 168850 167526 164982 162137 160561 160598 161017 160731 160111 160078 160441 159957 158041 155692
54994A55692j299J69R05P80J22r77k221k684j777k89M27J01m92r64j530j787p99
$$ 155692 154393 154562 155467 156247 156369 155392 153171 150487 148710 148421 148848 148949 148457 147493 145963 144176 143377
54977A43377J179K387J829P51Q47J950K721K797K763K524J476J84J31J374K021
$$ 143377 144556 146943 148772 149523 150370 152320 155041 157838 160601 163125 164601 164785 164916 166290 168311
54962A68311R13n53m71P07Q53p33k469k805k004j196p51m90n62j035j068K16K063
$$ 168311 169224 168671 168200 168907 169760 169027 166558 163753 161749 160553 159802 159312 158750 157715 156647 156863 158926
54945A58926K523R57r54j376n54Rm7K96J578L023L746L669K959J611J21l36P68
$$ 158926 161449 162406 161452 160076 159522 159531 159484 159780 161358 164381 168127 171796 174755 176366 176487 176151 176919
54928A76919K362K860J763k74k396l736l248n90K764M394L331J039l54k85J94
$$ 176919 179281 182141 183904 183630 181234 177498 174250 173660 176424 180818 184149 185188 184834 184549 184743
54913A84743P1n13p92m02K61M76j88j543k790k996j831L5J433J677J026K59J5
$$ 184743 184814 184301 183509 183107 183368 183844 183656 182113 179323 176327 174496 174531 175964 177641 178667 178926 178941
54896A78941N17J448J963J257m94k105k658k371j860j092R4R26L39j252k007r13
$$ 178941 179458 180906 182869 184126 183632 181527 178869 176498 174638 173546 173640 174566 174905 173653 171646 170733
54880A70733Q24J353M52m96m75Q4L07K73Q06K033K804K092M98m50m71p48j558
$$ 170733 171557 172910 173362 172866 172391 172475 172782 173055 173861 175894 178698 180790 181288 180838 180367 179619 178061
54863A78061j204J394M298M714K929J922L037M406M309L857M922P062Q246P683
$$ 178061 176857 178251 182549 187263 190192 192114 195151 199557 203866 207723 212645 219707 227953 235636
54849B35636O336N173M246L199J640o75l277n039n471n331n309m966l950l247
$$ 235636 241972 247145 251391 254590 256230 255555 252278 247239 241768 236437 231128 226162 222212 218965
54835B18965l856m817m205j765P48J863J781J444J317J210N76r80k872l634k694
$$ 218965 215109 210292 206087 204322 205070 206933 208714 210158 211475 212685 213261 212281 209409 205775 203081
54820B03081j396j173j417n87J197K536L272M478N901N807M017K881L964N754
$$ 203081 201685 200512 199095 198508 199705 202241 205513 209991 215892 221699 225716 228597 232561 238315
54806B38315O071N138M390L647J668j156k915l047l168m594o533p400o878n903
$$ 238315 244386 249524 253914 257561 259229 258073 255158 252111 248943 244349 237816 230416 223538 217635
54792B17635n278n089n055m862m361l781l572l626k991r34J715K938J663p70j845
$$ 217635 212357 207268 202213 197351 192990 189209 185637 182011 179020 178086 179801 182739 184402 183632 181787
54777A81787n51J598K378J149r34k420k721k134j448j426k075k446j730l76N27
$$ 181787 181236 182834 185212 186361 185427 183007 180286 178152 176704 175278 173203 170757 169027 168651 169178
54762A69178P65J003J316R04m22j590j687j091n04J05P94Q36j83j077l84J437
$$ 169178 169943 170946 172262 173166 172744 171154 169467 168376 167872 167977 168771 169607 169424 168347 167963 169400
54746A69400K511K261K027K649K966J616o81j844r56Q60J926J616N47j23M32K035
$$ 169400 171911 174172 176199 178848 181814 183430 182749 180905 179949 180809 182735 184351 184898 184775 185207 187242
54730A87242L508L729K739J527Q11L90k38j078j643j455n11N89R08P6j005q71
$$ 187242 190750 194479 197218 198745 199556 199946 199708 198630 196987 195532 195021 195610 196518 196594 195589 194718
54714A94718P66K428K548J398P15J612L524N241O194O490O350N954N474M907M227
$$ 194718 195484 197912 200460 201858 202573 204185 207709 212950 219144 225634 231984 237938 243412 248319 252546
54699B52546L883M543N896O442N143K828J050J8j289l142m544m892m882n177n265
$$ 252546 256429 260972 266868 273310 278453 281281 282331 282349 281060 277918 273374 268482 263600 258423 253158
54684B53158m542l623l515m014m078l446k788k342j676r14r57k007k908k630j596
$$ 253158 248616 244993 241478 237464 233386 229940 227152 224810 223134 222220 221263 219256 216348 213718 212122
54669B12122p54j68N62J115R23M88Q72J882K128J245P47J884L742M566M170L825
$$ 212122 211368 211200 211762 212877 213800 214288 215160 217042 219170 220415 221162 223046 226788 231354 235524 239349
54653B39349M125M242L350J689J6j137j494j098o96j304k982m710n694o093o169
$$ 239349 243474 247716 251066 252755 252771 251634 250140 249042 248346 247042 244060 239350 233656 227563 221394
54638B21394n544m042k492j840j931j964j746j593j365o78M7j20j171k007j994
$$ 221394 215850 211808 209316 207476 205545 203581 201835 200242 198877 198199 198246 198126 196955 194948 192954
54623A92954j679j524r87L91J769J971J140M49K94j10j220k232k256j619j296
$$ 192954 191275 189751 188764 189155 190924 192895 194035 194484 194778 194668 193448 191216 188960 187341 186045
54608A86045j333p67Q61K544K806J343o37j618j048M40J735K074J408K66p15j161
$$ 186045 184712 183945 184806 187350 190156 191499 190862 189244 188196 188636 190371 192445 193853 194119 193404 192243
54592A92243r79k80N75R90O38o6l01J06L39l24j327j323O0J484J375j57j415j180
$$ 192243 191264 190984 191559 192549 193187 193121 192820 192926 193265 192941 191614 190291 190351 191835 193210 193053 191638 190458
54574A90458p4M86J97MM27O68j51j492j988j252l25j44l39P2J248K364K672K298
$$ 190458 190384 190870 191067 191071 191498 192166 192015 190523 188535 187283 186958 186814 186475 186547 187795 190159 192831 195129
54556A95129J835J534J087K55o19r90q77p63o99j85P37J034J19r75q78Q9M74M9
$$ 195129 196964 198498 199585 199840 199221 198231 197354 196591 195892 195707 196444 197478 197597 196622 195744 195833 196307 196356
54538A96356N3Q51J195M40j03O76J614R53q37j711j056k88m99j202j605j712j673
$$ 196356 196409 197260 198455 198895 198792 199468 201082 202035 201198 199487 198431 198143 197644 196442 194837 193125 191452
54521A91452j269n81j91j52L62J838L568M502M348L361J783Pj327j918j995j608
$$ 191452 190183 189602 189411 189259 189621 191459 195027 199529 203877 207238 209021 209028 207701 205783 203788 202180
54505B02180m07J323K259J439m21j876k454k661k636j921n02Q62J542J563J178
$$ 202180 201773 203096 205355 206794 206373 204497 202043 199382 196746 194825 194323 195185 196727 198290 199468
54490A99468O42M80J177K317K737J944Q06K65M2p56k045k678j851l9J655K543
$$ 199468 200110 200590 201767 204084 206821 208765 209571 209836 209878 209122 207077 204399 202548 202509 204164 206707
54474B06707K611K248J980K105K314J984J018O7m19r12j995l105k895r95J191
$$ 206707 209318 211566 213546 215651 217965 219949 220967 221034 220615 219703 217708 214603 211708 210713 211904
54459B11904J908R29m21r20p19p73j334j482l80J332K002R22q76k056k525k755
$$ 211904 213812 214741 214320 213400 212681 211908 210574 209092 208712 210044 212046 212968 212092 210036 207511 204756
54443B04756k420r58O94O18j411l134k613o99L32j75r00p69j51J85K59N79J400
$$ 204756 202336 201378 202072 202690 201279 198145 195532 194833 195165 194990 194090 193321 193170 193355 193614 194193 195593
54426A95593K550L548L765K818J075m77r22l3J501K414K010J164J528L263M513
$$ 195593 198143 201691 205456 208274 209349 208872 207950 207917 209418 211832 213842 215006 216534 219797 224310
54411B24310L861K380J973K524K408J485J418K755L650K558N71l18k28r62l031
$$ 224310 228171 230551 232524 235048 237456 238941 240359 243114 246764 249322 249893 249575 249347 248385 245354
54396B45354m679m113j648P24J324Q7j583k006o03J555K699K040N12k64K99J215
$$ 245354 240675 236562 234914 235638 236962 237049 235466 233460 232857 234412 237111 239151 239663 239399 239698 240913
54380B40913J154J6j042j039j96O79J201J425J229L73r63k171k751k579j886j191
$$ 240913 242067 242083 241041 240002 239806 240485 241686 243111 244340 244713 243750 241579 238828 236249 234363 233172
54364B33172q91n43P44K718L608K287P4q89m36n9l07m30m68j506l265l613j561
$$ 233172 232281 231738 232482 235200 238808 241095 241169 240280 239844 239785 239478 239048 238580 237074 233809 230196 228635
54347B28635R94J826J194P40Q88J036J265J996K508J707J85j94J091K447K331
$$ 228635 229629 231455 232649 233389 234277 235313 236578 238574 241082 242789 242974 242780 243871 246318 248649
54332B48649J114L41Q92K204K864J872k77j956k128j306n25j60k97j168k068j119
$$ 248649 249763 250104 250996 253200 256064 257936 257659 255703 253575 252269 251744 251584 251287 250119 248051 246932
54316B46932K215N194M646J363o66L66K050J809M50J09P38P57l9m39p7K69L74
$$ 246932 249147 254341 258987 260350 259684 260050 262100 263909 264359 264468 265206 265963 265924 265485 265408 265677 266051
54299B66051Q02J398J253M12J31R03J640J381O37K29j86j308k712l340l118k894
$$ 266051 266853 268251 269504 269916 270047 270950 272590 273971 274608 274837 274651 273343 270631 267291 264173 261279
54283B61279k902k524j748j656k749l678k715q9K131K446J347K57j62k89p60j860
$$ 261279 258377 255853 254105 252449 249700 246022 243307 243218 245349 247795 249142 249399 249237 248948 248188 246328
54267B46328l250l982l218j322K58O15M28P53J433J585J267J379J952J830M30
$$ 246328 243078 239096 235878 234556 234814 235429 235857 236610 238043 239628 240895 242274 244226 246056 246486
54252B46486j235j867j435p20j27K83K37l16p60n72k79o85j456j474n52K81K79
$$ 246486 245251 243384 241949 241229 241102 241385 241622 241306 240546 239974 239695 239010 237554 236080 235528 235809 236088
54235B36088j51l14j07K93P66R75N40j14J08J393K350J600n39k506l049j783Q51
$$ 236088 235937 235623 235516 235809 236575 237550 238090 237976 238084 239477 241827 243427 242888 240382 237333 235550 236401
54218B36401L311L555J202j454j988q78n31j619k337j544m82m53o49L09J878K380
$$ 236401 239712 243267 244469 243015 241027 240149 239618 237999 235662 234118 233636 233183 232534 232843 234721 237101
54202B37101J588J000J627K770L071K016K77q50n48O89J595J698J720K086K124
$$ 237101 238689 239689 241316 244086 247157 249173 249450 248600 248052 248741 250336 252034 253754 255840 257964
54187B57964J444R77J396J559N9k380l732l399k427j450l97L8j025k422j657J338
$$ 257964 259408 260385 261781 263340 263399 261019 257287 253888 251461 250011 249614 249652 248627 246205 244548 245886
54171B45886L442K483J40p44P2Q49P98L48m63j773k635j987o29m11j525k325j846
$$ 245886 249328 251811 251951 251207 251279 252128 252926 253274 252811 251038 248403 246416 245787 245376 243851 241526 239680
54154B39680q34j7R68K301L091K576J214j24j212k070k332j813r93k65O97K042
$$ 239680 238846 238829 239797 242098 245189 247765 248979 248855 247643 245573 243241 241428 240435 240170 240867 242909
54138B42909K728J585q06k315j663R5R69L07q21j266j111j081j171n07J301L188
$$ 242909 245637 247222 246416 244101 242438 242533 243502 243809 242988 241722 240611 239530 238359 237852 239153 242341
54122B42341L546K059J76n44j70M5l14j78J238K798K629O88j091j323o97l89k84
$$ 242341 245887 247946 248122 247578 247408 247453 247139 246961 248199 250997 253626 254314 253223 251900 251203 250814 250530
54105B50530K44Q04O60K22L51O07k03j804k543j845r33o95o10k86l25p45k01J905
$$ 250530 250774 251578 252238 252460 252811 253418 253215 251411 248868 247023 246090 245395 244785 244499 244174 243429 243228 245133
54087B45133L975M208K896J412N7j477k573k459j887k219l209l275j829J62J691
$$ 245133 249108 253316 256212 257624 257681 256204 253631 251172 249285 247066 243857 240582 238753 238915 240606
54072B40606K382K006Q63L39J382K663K114K04m66R09K070J145p41j594j505j792
$$ 240606 242988 244994 245857 246196 247578 250241 252355 252559 252093 253002 255072 256217 255476 253882 252377 250585
54056B50585k438k246r32N27J524K355L145L284K317P86k30k37K06K44p9L05J922
$$ 250585 248147 245901 244969 245496 247020 249375 252520 255804 258121 258907 258677 258440 258646 258890 258811 259116 261038
54039B61038L560L602K380J924L045M033L055P69o06o1J559L209M643N781O292
$$ 261038 264598 268200 270580 272504 275549 279582 282637 283406 282800 282739 284298 287507 292150 297931 304223
54024C04223O159N900N763N144L240J66k872m540m463l409k363j604q46j05J11
$$ 304223 310382 316282 322045 327189 330429 330595 327723 323183 318720 315311 312948 311344 310498 310393 310504
54009C10504m29j229j715j990k450k890k500q95J165K365K097R89J42JK04L75
$$ 310504 310075 308846 307131 305141 302691 299801 297301 296406 297571 299936 302033 303022 303164 303165 303369 303744
53993C03744N54Q70J275J883K881L826L771K750K320L706O024P391P309O694N996
$$ 303744 304298 305168 306443 308326 311207 315033 318804 321554 323874 327580 333604 340995 348304 354998 360994
53978C60994M889L805L974N438O473N846M386L529L282K703J607P57O68J009J025
$$ 360994 365883 369688 373662 379100 385573 391419 395805 399334 402616 405319 406926 407683 408351 409360 410385
53963D10385K17j071j600l83J918L530L562K548Q25k080n745q030p359m941l300
$$ 410385 410602 409531 407931 407548 409466 412996 416558 419106 419931 417851 412106 404076 396717 391776 388476
53948C88476l218l466l166k824l055l559l728l504l316l618m488n387n573n006
$$ 388476 385258 381792 378626 375802 372747 369188 365460 361956 358640 355022 350534 345147 339574 334568
53934C34568m441m246l843k864k034k005k151j603q67j025j784j816q81j25j46
$$ 334568 330127 325881 322038 319174 317140 315135 312984 311381 310514 309489 307705 305889 305008 304883 304737
53919C04737k27J55L95Ll16L29J599K288J814Q46N47J353K332K042L54q65K10
$$ 304737 304510 304665 305060 305063 304747 305076 306675 308963 310777 311623 312170 313523 315855 317897 318251 317386 317596
53902C17596K989N085N308M778M790M909M072K624K092L240N235O800P584Q198
$$ 317596 320585 325670 330978 335756 340546 345455 349527 352151 354243 357483 362718 369518 377102 385300
53888C85300R152R923R224O451K644m00j908k555l122l450k883j247Q96K610L131
$$ 385300 394452 404375 413599 420050 422694 422294 420386 417831 414709 411259 408376 407129 408025 410635 413766
53873D13766K588K129K727L773L690K117N90O87K261M049N235N779N938O209P190
$$ 413766 416354 418483 421210 424983 428673 430790 431380 432067 434328 438377 443612 449391 455329 461538 468728
53858D68728Q710R527Q691O902N661N442N534N463N550O031O535O627O133M791
$$ 468728 477438 486965 495656 502558 508219 513661 519195 524658 530208 536239 542774 549401 555534 560325
53844E60325K365n95k808l574l530l737m401m977n166n249n540o004o480o869
$$ 560325 562690 562095 559287 555713 552183 548446 544045 539068 533902 528653 523113 517109 510629 503760
53830E03760p066o930o488o049n953o224o593o877p186p635p889p322n887m543
$$ 503760 496694 489764 483276 477227 471274 465050 458457 451580 444394 436759 428870 421548 415661 411118
53816D11118m393n320n880m967l313k803m167n892n889l992k089j726k357k502
$$ 411118 406725 401405 395525 390558 387245 384442 380275 374383 368494 364502 362413 360687 358330 355828
53802C55828j907j563j878k044j523r97j248j927k291k510l235m215m451l587
$$ 355828 353921 352358 350480 348436 346913 345916 344668 342741 340450 337940 334705 330490 326039 322452
53788C22452k252j042j40J29n54j512j411q8R74O44k57k07R45K075K450K215J593
$$ 322452 320200 319158 319018 319147 318593 317081 315670 315582 316556 317200 316943 316736 317681 319756 322206 324421 326014
53771C26014O63j75m51k78j08J22P08J333J380R72P00M31l58j104m90J331K396
$$ 326014 326677 326502 326051 325773 325665 325787 326495 327828 329208 330180 330880 331311 330953 329849 329359 330690 333086
53754C33086J685P70J479L060L355K140J456K588M336M832L922L015L192M144
$$ 333086 334771 335541 337020 340080 343435 345575 347031 349619 353955 358787 362709 365724 368916 373060
53740C73060M711M088K622J628K199M129O113O989O612N669M984M882M872M077
$$ 373060 377771 381859 384481 386109 388308 392437 398550 405539 412151 417820 422804 427686 432558 436635
53726D36635K295N25mP30J444Q71j085l418m953n225m746m383m413m461m351m378
$$ 436635 438930 439455 439451 440181 441625 442496 441411 437993 433040 427815 423069 418686 414273 409812 405461 401083
53710D01083m532m252l556l564m944o415o064l846j617p91j050j400j290n32P37
$$ 401083 396551 392299 388743 385179 380235 373820 367756 363910 362293 361502 360452 359052 357762 357230 357967
53695C57967J715J558O36J75M10J26j460l410m324m030l367k908k597k130j260
$$ 357967 359682 361240 361876 362051 362461 362587 361127 357717 353393 349363 345996 343088 340491 338361 337101
53680C37101q7O13K5j463k331j585K93K201L443L693L017K328K631L328K544p2
$$ 337101 337014 337627 337652 336189 333858 332273 332566 334767 338210 341903 344920 347248 349879 353207 355751 355679
53664C55679k183j584R77L119L976M402M752M416L407K695K683K668K215J953
$$ 355679 353496 351912 352889 356008 359984 364386 369138 373554 376961 379656 382339 385007 387222 389175
53650C89175K552L790M992N695N541M264K376J291K151M483O351O104M071K348
$$ 389175 391727 395517 400509 406204 411745 416009 418385 419676 421827 426310 432661 438765 442836 445184
53636D45184K546L959M657M183L984M865N473M422K628J956K355K121P33m26l94
$$ 445184 447730 451689 456346 460529 464513 469378 474851 479273 481901 483857 486212 488333 489066 488640 488246
53621D88246m2n44j743k752l299l681l948l870l409k815k338j998j552q60l62
$$ 488246 488204 487660 485917 483165 479866 476185 472237 468367 464958 462143 459805 457807 456255 455395 455033
53606D55033p51j810k263j509p23j177k092j726k75K16r02j668l31K112L478L383
$$ 455033 454282 452472 450209 448700 447977 446800 444708 442982 442707 442923 442021 440353 440022 442134 445612 448995
53590D48995L243L878M484M100L002K331K662L250K718O74j483j837q9K151L329
$$ 448995 452238 456116 460600 464700 467702 470033 472695 475945 478663 479337 477854 476017 475928 478079 481408
53575D81408L572L964M916N852O191N913N300M655M258M286M637M995N088M885
$$ 481408 484980 488944 493860 499712 505903 511816 517116 521771 526029 530315 534952 539947 545035 549920
53561E49920M588M445M534M797N331O288P316P559O661N500N275O022O651O396
$$ 549920 554508 558953 563487 568284 573615 579903 587219 594778 601439 606939 612214 618236 624887 631283
53547F31283N593M993M857M823M260K757O37j034j402o67L55J107J291N35j008
$$ 631283 636876 641869 646726 651549 655809 658566 659203 658169 656767 656100 656455 657562 658853 659388 658380
53532F58380k098j551J12J156O98o68k177l556m365l993k762j869j764j684j158
$$ 658380 656282 654731 654843 655999 656697 656029 653852 650296 645931 641938 639176 637307 635543 633859 632701
53517F32701q64j278j621j113l32l68j152j571q48P97K447L000J881j60j563j727
$$ 632701 631837 630559 628938 627825 627493 627125 625973 624402 623554 624351 626798 629798 631679 631519 629956 628229
53501F28229j602j944j883k10K502M314M408M031M694O119O568N066K859K232
$$ 628229 626627 624683 622800 622590 625092 629406 633814 637845 642539 648658 655226 660292 663151 665383
53487F65383L925O246P165O672O185O250O265O414P973J1026J3422J3297J1642
$$ 665383 669308 675554 682719 689391 695576 701826 708091 714505 722478 733504 746926 760223 771865
53474G71865J1084J2759J5532J7898J9446K0533K1444K2136K2439K2489K2977
$$ 771865 782949 795708 811240 829138 848584 869117 890561 912697 935136 957625 980602
53463I80602K4426K6183K6891K6345K6031K7265K9613L1796L3327L4478L5396
$$ 980602 1005028 1031211 1058102 1084447 1110478 1137743 1167356 1199152 1232479 1266957 1302353
53452A302353L6156L7176L8743M0497M1913M2783M2817M1717M0177L9663M0347
$$ 1302353 1338509 1375685 1414428 1454925 1496838 1539621 1582438 1624155 1664332 1703995 1744342
53441A744342M0400L8475L5754L4191L3788L3243L2363L1881L1493L0191K8395
$$ 1744342 1784742 1823217 1858971 1893162 1926950 1960193 1992556 2024437 2055930 2086121 2114516
53430B114516K7763K8692K9801L0127L0088K9891K8782K6565K4329K2862K1516
$$ 2114516 2142279 2170971 2200772 2230899 2260987 2290878 2319660 2346225 2370554 2393416 2414932
53419B414932J9478J7022J4727J2417R671O613L428q8l762o666q410j0160j3399
$$ 2414932 2434410 2451432 2466159 2478576 2488247 2494860 2498288 2498200 2494438 2487772 2479362 2469202 2455803
53406B455803j7969k2231k5051k6803k8346k9621k9786k8627k7417k7891l0266
$$ 2455803 2437834 2415603 2390552 2363749 2335403 2305782 2275996 2247369 2219952 2192061 2161795
53395B161795l2811l3771l3182l2174l1080k9394k7342k6095k6059k6056k4760
$$ 2161795 2128984 2095213 2062031 2029857 1998777 1969383 1942041 1915946 1889887 1863831 1839071
53384A839071k2239j9523j7302j5516j3720j1437q526n442k687PL178O190P458
$$ 1839071 1816832 1797309 1780007 1764491 1750771 1739334 1730808 1725366 1722679 1722686 1725864 1732054 1739512
53371A739512O756O306Q519J3079J7381J9701K0859K2549K5057K7343K8989L0905
$$ 1739512 1746268 1752574 1761093 1774172 1791553 1811254 1832113 1854662 1879719 1907062 1936051 1966956
53359A966956L3835L7007L9236M0960M3887M8370N2558N4946N6529N9125O2493
$$ 1966956 2000791 2037798 2077034 2117994 2161881 2210251 2262809 2317755 2374284 2433409 2495902
53348B495902O4928O6137O7580O9933P2147P3538P5040P7682Q1132Q4522Q7406
$$ 2495902 2560830 2626967 2694547 2764480 2836627 2910165 2985205 3062887 3144019 3228541 3315947
53337C315947Q9221Q9245Q8090Q7757Q8907Q9392Q7127Q3323Q0975Q0719Q0214
$$ 3315947 3405168 3494413 3582503 3670260 3759167 3848559 3935686 4019009 4099984 4180703 4260917
53326D260917P7517P3118O8317O3392N8228N3235M8514M3028L5838K7694K0242
$$ 4260917 4338434 4411552 4479869 4543261 4601489 4654724 4703238 4746266 4782104 4809798 4830040
53315D830040J3735O694j926j1154j9387k6671l4586m3911n3595o2405p0436p7992
$$ 4830040 4843775 4850469 4848543 4837389 4818002 4791331 4756745 4712834 4659239 4596834 4526398 4448406
53303D448406q3952q6885q7577q8726r1642r4622r5339r3635r1073q8684q6364
$$ 4448406 4364454 4277569 4189992 4101266 4009624 3915002 3819663 3726028 3634955 3546271 3459907
53292C459907q3870q1265p8562p5748p3173p1297p0227o9767o9464o8312o5260
$$ 3459907 3376037 3294772 3216210 3140462 3067289 2995992 2925765 2855998 2786534 2718222 2652962
53281B652962o0608n6105n2813m9738m5563m0918l7469l5387l3291l0524k7796
$$ 2652962 2592354 2536249 2483436 2433698 2388135 2347217 2309748 2274361 2241070 2210546 2182750
53270B182750k5529k3146k0537j8642j7922j7408j6109j4442j3335j2691j1624
$$ 2182750 2157221 2134075 2113538 2094896 2076974 2059566 2043457 2029015 2015680 2002989 1991365
53259A991365r752p529n566m217l470k781j332J107L948O709R635J2951J6060
$$ 1991365 1981613 1974084 1968518 1964301 1960831 1958050 1956718 1957825 1961773 1968482 1978117 1991068 2007128
53246B007128J8158J9282K0187K1452K3309K5965K9390L2886L5503L6874L7344
$$ 2007128 2025286 2044568 2064755 2086207 2109516 2135481 2164871 2197757 2233260 2270134 2307478
53235B307478L7462L7784L8813M0376M1288M0369L7893L5430L4101L3474L2304
$$ 2307478 2344940 2382724 2421537 2461913 2503201 2543570 2581463 2616893 2650994 2684468 2716772
53224B716772K9849K6220K1899J7232J2173O417j52p086j3606j9129k3324k6038
$$ 2716772 2746621 2772841 2794740 2811972 2824145 2830562 2830410 2823324 2809718 2790589 2767265 2741227
53212B741227k7628k9120l1359l4145l6817l9504m2813m6244m8163m7834m6561
$$ 2741227 2713599 2684479 2653120 2618975 2582158 2542654 2499841 2453597 2405434 2357600 2311039
53201B311039m6137m7010m8575n0335n1822n2282n1619n1082n1746n2707n2184
$$ 2311039 2264902 2217892 2169317 2118982 2067160 2014878 1963259 1912177 1860431 1807724 1755540
53190A755540n0081m7994m6759m5683m4396m3657m3610m2859m0450l7511l5664
$$ 1755540 1705459 1657465 1610706 1565023 1520627 1476970 1433360 1390501 1350051 1312540 1276876
53179A276876l4771l3519l1459k9125k6659k3743k0696j8360j6915j5865j5147
$$ 1276876 1242105 1208586 1177127 1148002 1121343 1097600 1076904 1058544 1041629 1025764 1010617
53168A010617j5152j5692j5960j5743j5663j6034j6428j6565j6827j7425j7878
$$ 1010617 995465 979773 963813 948070 932407 916373 899945 883380 866553 849128 831250
53157H31250j7690j7020j6369j6045j6089j6217j5816j4570j3106j2253j1779
$$ 831250 813560 796540 780171 764126 748037 731820 716004 701434 688328 676075 664296
53146F64296j0799r402q738r145r460q739p535o805o677p081q446j0549j1717
$$ 664296 653497 644095 635357 626212 616752 608013 600478 593673 586996 579915 571469 560920 549203
53133E49203j0678q532p384p443p139n980n353o056o766n980m281l461m134n366
$$ 549203 538525 529993 522609 515166 508027 502047 496694 490638 483872 477892 473611 470150 466016 460650
53119D60650o268o781o921o315m855l133j845j124q81j313k504l584l146q82J632
$$ 460650 454382 447601 440680 434365 429510 426377 424532 423408 422527 421214 418710 415126 411980 411098 412730
53104D12730K379J036r00j980k172k230k401k327j751p34N46J695K003J097l82
$$ 412730 415109 416145 415245 413265 411093 408863 406462 404135 402384 401650 402196 403891 405894 406991 406609
53089D06609j266j100m52j9N0k1p3k3M6k51j179k155k029m51J456K236J606M81
$$ 406609 405343 404243 403791 403772 403822 403801 403728 403705 403751 403500 402321 400166 398137 397686 399142 401378 402984 403465
53071D03465j77n0N97J115P92l68j323j144m51p20k068k776j606M12J441J336
$$ 403465 403288 403238 403835 404950 405742 405374 404051 402907 402456 401736 399668 396892 395286 395698 397139 398475
53055C98475J433K303L123L241K869K013J59k263l554k956k136l108n338o330
$$ 398475 399908 402211 405334 408575 411444 413457 413616 411353 407799 404843 402707 399599 394261 387931
53041C87931m704j502J293K312J155j361l151k459J72K443K935K112P35j121l011
$$ 387931 383227 381725 383018 385330 386485 385124 381973 379514 379686 382129 385064 387176 387911 386790 383779
53026C83779l597k254m9J573K181J697k18l016m670l805j680n50o88o45Q2N09
$$ 383779 380182 377928 377879 379452 381633 383330 383112 380096 375426 371621 369941 369391 368703 368058 368140 368649
53010C68649K48K56J045J698J337L74m07j049j917k760l065k852k459j967j294
$$ 368649 368897 369153 370198 371896 373233 373607 373200 372151 370234 367474 364409 361557 359098 357131 355837
52995C55837n86l5L52M87P6q16j415q44R47L070M268L721J667n91j804k030k377
$$ 355837 355251 355216 355568 356055 356131 355315 353900 353056 354003 357073 361341 365062 366729 366138 364334 362304 359927
52978C59927l347m048l289r50K050M533N455M237J442j222k316k013j491j297
$$ 359927 356580 352532 349243 348293 350343 354876 360331 364568 366010 364788 362472 360459 358968 357671
52964C57671r60j50N66M18m97j244r83J26R79N55r00j903j138J120L225L761K772
$$ 357671 356711 356561 357127 357545 357048 355804 354821 354947 355926 356481 355581 353678 352540 353660 356885 360646 363418
52947C63418J529J232J909K458J947P96K96P76R05n60k755l421j667Q69J962J240
$$ 363418 364947 366179 368088 370546 372493 373289 373585 374361 375266 374706 371951 368530 366863 367732 369694 370934
52931C70934J95J62R77J513J104K83J38R59J706J266P9j28J408L262L476J976
$$ 370934 371129 371291 372268 373781 374885 375168 375306 376265 377971 379237 379316 379188 380596 383858 387334 389310
52915C89310M33M5M95J154K118L394L985K929R22j67L67J144N69j014j891j377
$$ 389310 389743 389788 390283 391437 393555 396949 400934 403863 404785 404618 404985 406129 406698 405684 403793 402416
52899D02416o51r34j747j789r91n39q91j093n41k23j193k729l302k864k558k411
$$ 402416 401765 400831 399084 397295 396304 395765 394874 393781 393240 393017 391824 389095 385793 382929 380371 377960
52883C77960j218R51J957M09k137l094k033n58J64L05K73K45O52J809K994L081
$$ 377960 376742 377693 379650 380059 377922 374828 372795 372237 372401 372706 372979 373224 373876 375685 378679 381760
52867C81760K072R58J31p80j530j237r9L62n93j851k225k127k462k908k538j612
$$ 381760 383832 384790 384921 384141 382611 381374 381275 381637 381044 379193 376968 374841 372379 369471 366933 365321
52851C65321j415k397l461l194j342R57K155J767J032J664L672N133M535K654
$$ 365321 363906 361509 358048 354854 353512 354469 356624 358391 359423 361087 364759 369892 374427 377081
52837C77081J364J255J362Q96J83j04J60O22R65J131J183R97K15j223k523k689
$$ 377081 378445 379700 381062 381958 382141 382037 382197 382819 383784 384915 386098 387095 387310 386087 383564 380875
52821C80875j883j344j596j624m78J125J793J496J483K352L266L179K093R34O46
$$ 380875 378992 377648 376052 374428 373950 375075 376868 378364 379847 382199 385465 388644 390737 391671 392317
52806C92317J377K214J863Jk176l150k549j094M71J803K646K764K172J058l08
$$ 392317 393694 395908 397771 397772 395596 392446 389897 388803 389274 391077 393723 396487 398659 399717 399409
52791C99409j482k133k604l580m826n175m237l158k937l010k494j842j878k116
$$ 399409 397927 395794 393190 389610 384784 379609 375372 372214 369277 366267 363773 361931 360053 357937
52777C57937j600q17j023k024k359j517l40P53K082L116K507L54j271r31K88M28
$$ 357937 356337 355520 354497 352473 350114 348597 348257 349010 351092 354208 356715 357069 355798 354867 355155 355583
52761C55583q48k314k881k415j455p57o85p74l87K47M93P10J836L465L857K508
$$ 355583 354735 352421 349540 347125 345670 344913 344228 343454 343067 343314 343807 344517 346353 349818 353675 356183
52745C56183J265J844L377L603J718j016l019l733l589l415l692m039l728k818
$$ 356183 357448 359292 362669 366272 367990 366974 363955 360222 356633 353218 349526 345487 341759 338941
52731C38941k109j848j403n04K55O15J165K064K320J244l70j323j418j022k45
$$ 338941 336832 334984 333581 333077 333332 333947 335112 337176 339496 340740 340370 339047 337629 336607 336362
52716C36362N60N35l53p48K13J388J342N59M36Q58N64n79j370j211o44j8Q62J688
$$ 336362 336922 337457 337104 336356 336569 337957 339299 339858 340294 341152 341716 341137 339767 338556 337912 337894 338756 340444
52698C40444J722J025M10J37p2J25J342K825K907J500M90J011J879J620O51K59
$$ 340444 342166 343191 343601 343738 343666 343791 345133 347958 350865 352365 352855 353866 355745 357365 358016 358275
52682C58275N68Q73J208K116L265L643L089K524K522K552J915P47k49o96q41j101
$$ 358275 358843 359716 360924 363040 366305 369948 373037 375561 378083 380635 382550 383297 383048 382352 381511 380410
52666C80410j449j335l64R17J284J66j594k713k931k916k897k186m36J370J817
$$ 380410 378961 377626 377262 378179 379463 379629 378035 375322 372391 369475 366578 364392 363956 365326 367143
52651C67143P57n74j098r22p17p17p74r25j239j344p51M16J524K211K545K400
$$ 367143 367900 367326 366228 365306 364589 363872 363098 362173 360934 359590 358839 359255 360779 362990 365535 367935
52635C67935J412k40j579j703o41Q16J755J659P97K21P14J646J573J70j303j735
$$ 367935 369347 369107 367528 365825 365184 366000 367755 369414 370211 370432 371146 372792 374365 374535 373232 371497
52619C71497j439j167q75l16p1q81k326l117k532p99J526L725M790M169K557J229
$$ 371497 370058 368891 368016 367700 367629 366748 364422 361305 358773 357974 359500 363225 368015 372184 374741 375970
52603C75970N92J19n00r09p68j89N22R93P94k6n46J94K002L707M413M045K930
$$ 375970 376562 376681 376181 375272 374504 374315 374837 375830 376624 376598 376052 376246 378248 381955 386368 390413 393343
52586C93343J581O77N03M55k75j564k492k428j445k9J029Q35o07j912j790o52
$$ 393343 394924 395601 396104 396559 396284 394720 392228 389800 388355 388326 389355 390190 389583 387671 385881 385229
52570C85229K18O38J520L108M565N247N103L931J700m37r62j40K65l98r10n85
$$ 385229 385447 386085 387605 390713 395278 400525 405628 409559 411259 410822 409860 409720 409985 409587 408677 408092
52554D08092n43j654k894k993k374k083j948j295n91p79j604k007j840j737j561
$$ 408092 407549 405895 403001 400008 397634 395551 393603 392308 391717 390938 389334 387327 385487 383750 382189
52539C82189m45J595L264L506K572J380O34O65J516K800L792L760K297j97k266
$$ 382189 381744 383339 386603 390109 392681 394061 394695 395360 396876 399676 403468 407228 409525 409328 407062
52524D07062k365o68R01J091Q94J634K387J079k133m484m042k008o96n28k85M55
$$ 407062 404697 404029 404930 406021 406915 408549 410936 412015 409882 405398 401356 399348 398652 398124 397839 398294
52508C98294N89o24k079j942M2K008J926j83k369k933k011r42o23r57j420j577
$$ 398294 398883 398259 396180 394238 394280 396288 398214 398031 395662 392729 390718 389776 389153 388196 386776 385199
52492C85199j153j77R10J558J543R98K65j27K65J106J340M67n73m30R31K160K077
$$ 385199 384046 383869 384779 386337 387880 388878 389143 389016 389281 390387 391727 392194 391621 391191 392122 394282 396359
52475C96359P28r64j959j654l30Q79J063O47Q44K019L094K726P19j785l087k094
$$ 396359 397087 396123 394164 392510 392180 393059 394122 394769 395613 397632 400726 403452 404171 402386 399299 397205
52459C97205O48L124L559K109L85m52m89j10O43J613K350K871L758N046N738N044
$$ 397205 397853 400977 404536 406645 407030 406578 406089 405979 406622 408235 410585 413456 417214 422260 427998 433042
52443D33042L483K063R40l65j764k621k763k737k946l136k958k419j608m51Q12
$$ 433042 436525 438588 439528 439163 437399 434778 432015 429278 426332 423196 420238 417819 416211 415760 416572
52428D16572J301J67k261m371m615k950p62O77J281J574J487N10j120k168j771
$$ 416572 417873 418040 415779 411408 406793 403843 403081 403758 405039 406613 408100 408610 407490 405322 403551
52413D03551m92M95Q82J296K083K714K505J536N77L60R68J885K497K654K721L082
$$ 403551 403059 403554 404436 405732 407815 410529 413034 414570 415147 415507 416475 418360 420857 423511 426232 429314
52397D29314L668M083M060L601K818J797O86m17j614l045m517n466n396m347k865
$$ 429314 432982 437065 441125 444726 447544 449341 450027 449610 447996 444951 440434 434968 429572 425225 422360
52382D22360j648j190j556k276k587k039r85l44p18j768k569k497j605k23J390
$$ 422360 420712 419522 417966 415690 413103 411064 410079 409735 409017 407249 404680 402183 400578 400355 401745
52367D01745K815L319K486R48oL20J482K675L658M574N185M793L104Q95m17KJ602
$$ 401745 404560 407879 410365 411313 411307 411627 413109 415784 419442 424016 429201 433994 437098 437993 437576 437578 439180
52350D39180L048L685M172N402P158Q402Q719Q714Q726Q032N860K648m30k806
$$ 439180 442228 445913 450085 455487 462645 471047 479766 488480 497206 505238 511098 513746 513316 510510
52336E10510m666o035o573o250n564m984m624m408l968k594p8K434L340K571J705
$$ 510510 505844 499809 493236 486986 481422 476438 471814 467406 463438 460844 460766 463200 466540 469111 470816
52321D70816J855K325J970Q36k56r34j043K7K598N603P412P681P293O715N560
$$ 470816 472671 474996 476966 477802 477546 476612 475569 475596 478194 483797 491209 498890 506183 512898 518458
52306E18458L927K837K912L614M202M506M345L253J520M59P40J345J231J076K029
$$ 518458 522385 525222 528134 531748 535950 540456 544801 548054 549574 550033 550773 552118 553349 554425 556454
52291E56454L348L127J369L65J471L102L148K104K222M100N922O236N919O599
$$ 556454 559802 562929 564298 564663 566134 569236 572384 574488 576710 580810 586732 592968 598887 605486
$$ [...]
##END NTUPLES=NMR SPECTRUM
##END=
